##TITLE=1H_AM_NV170.1
 200.13MHz, CDCl3,
 8 sc
 
 21.1.2025
##JCAMPDX= 6.0         $$ Bruker NMR JCAMP-DX V2.0
##DATA TYPE= NMR FID
##DATA CLASS= NTUPLES
##ORIGIN= UXNMR, Bruker Analytische Messtechnik GmbH
##OWNER= pz
$$ XWIN-NMR		Version 3.5
$$ Tue Jan 21 17:16:23 2025 Russian Standard Time (UT+4h)  she@DPX200
##.OBSERVE FREQUENCY= 200.1313
##.OBSERVE NUCLEUS= ^1H
##.DELAY= (6, 6)
##.ACQUISITION MODE= SIMULTANEOUS
##.ACQUISITION SCHEME= undefined
##.AVERAGES= 8
##.DIGITISER RES= 18
##SPECTROMETER/DATA SYSTEM= spect
##.PULSE SEQUENCE= zg30
##.SOLVENT NAME= D2O
##.SHIFT REFERENCE= (INTERNAL, D2O, 0, 14.3821)
##AUDIT TRAIL= $$ (NUMBER, WHEN, WHO, WHERE, WHAT)
$$ ##TITLE= Audit trail, XWIN-NMR		Version 3.5
$$ ##JCAMPDX= 5.01
$$ ##ORIGIN= Bruker BioSpin GmbH
$$ ##OWNER= she
$$ F:/spectra/data/she/nmr/H-C/1/audita.txt
$$ ##AUDIT TRAIL=  $$ (NUMBER, WHEN, WHO, WHERE, WHAT)
(   1,<2025-01-21 17:15:07.25 +0400>,<she>,<DPX200>,
      <created by zg, POWCHK disabled, PULCHK disabled
       configuration hash MD5:
       00 E9 B6 7A A2 85 ED C7 34 08 36 98 17 FE 4E 26
       data hash MD5: 16K
       96 B1 C2 3F 86 BF CE 55 EC 46 14 B3 E3 BB 6E FD>)
$$ ##END=
$$ 
$$ hash MD5
$$ BA 29 08 1A B6 6D C6 B4 F7 CF 62 2A A5 43 10 71
##$RELAX= 
##$RELAX= 
##$RELAX= 
##$RELAX= 
##$RELAX= 
##$RELAX= 
$$ Bruker specific parameters
$$ --------------------------
##$DU= <F:/spectra>
##$EXPNO= 1
##$NAME= <H-C>
##$PROCNO= 1
##$TYPE= <nmr>
##$USER= <she>
##$AMP= (0..31)
100 100 100 100 100 100 100 100 100 100 100 100 100 100 100 100 100 100 
100 100 100 100 100 100 100 100 100 100 100 100 100 100 
##$AQSEQ= 0
##$AQ_mod= 1
##$AUNM= <au_zg>
##$AUTOPOS= <>
##$BF1= 200.13
##$BF2= 200.13
##$BF3= 200.13
##$BF4= 200.13
##$BF5= 200.13
##$BF6= 200.13
##$BF7= 200.13
##$BF8= 200.13
##$BYTORDA= 1
##$CFDGTYP= 0
##$CFRGTYP= 5
##$CHEMSTR= <none>
##$CNST= (0..31)
1 1 145 1 1 1 1 1 1 1 1 1 1 1 1 1 1 1 1 1 1 1 1 1 1 1 1 1 1 1 1 1 
##$CPDPRG= <>
##$CPDPRG1= <>
##$CPDPRG2= <>
##$CPDPRG3= <>
##$CPDPRG4= <mlev>
##$CPDPRG5= <mlev>
##$CPDPRG6= <mlev>
##$CPDPRG7= <mlev>
##$CPDPRG8= <mlev>
##$CPDPRGB= <>
##$CPDPRGT= <>
##$D= (0..31)
0 0.7 0 0 0 0 0 0 0 0 0 0.03 0 0 0 0 0 0 0 0 0 0 0 0 0 0 0 0 0 0 0 0 
##$DATE= 1737465306
##$DBL= (0..7)
120 120 120 120 120 120 120 120 
##$DBP= (0..7)
150 150 150 150 150 150 150 150 
##$DBP07= 0
##$DBPNAM0= <>
##$DBPNAM1= <>
##$DBPNAM2= <>
##$DBPNAM3= <>
##$DBPNAM4= <>
##$DBPNAM5= <>
##$DBPNAM6= <>
##$DBPNAM7= <>
##$DBPOAL= (0..7)
0.5 0.5 0.5 0.5 0.5 0.5 0.5 0.5 
##$DBPOFFS= (0..7)
0 0 0 0 0 0 0 0 
##$DE= 6
##$DECBNUC= <off>
##$DECIM= 32
##$DECNUC= <off>
##$DECSTAT= 4
##$DIGMOD= 1
##$DIGTYP= 9
##$DL= (0..7)
0 120 120 120 120 120 120 120 
##$DP= (0..7)
150 150 150 150 150 150 150 150 
##$DP07= 0
##$DPNAME0= <>
##$DPNAME1= <>
##$DPNAME2= <>
##$DPNAME3= <>
##$DPNAME4= <>
##$DPNAME5= <>
##$DPNAME6= <>
##$DPNAME7= <>
##$DPOAL= (0..7)
0.5 0.5 0.5 0.5 0.5 0.5 0.5 0.5 
##$DPOFFS= (0..7)
0 0 0 0 0 0 0 0 
##$DQDMODE= 0
##$DR= 18
##$DS= 0
##$DSLIST= <SSSSSSSSSSSSSSS>
$$ [...]
##$SUBNAM0= <"">
##$SUBNAM1= <"">
##$SUBNAM2= <"">
##$SUBNAM3= <"">
##$SUBNAM4= <"">
##$SUBNAM5= <"">
##$SUBNAM6= <"">
##$SUBNAM7= <"">
##$SUBNAM8= <"">
##$SUBNAM9= <"">
##$SW= 18.0517328524113
##$SWIBOX= (0..15)
0 0 2 0 0 0 0 0 0 0 0 0 0 0 0 0 
##$SW_h= 3612.71676300578
##$TD= 16384
##$TD0= 1
##$TE= 0
##$TE2= 300
##$TE3= 300
##$TEG= 300
##$TL= (0..7)
0 120 120 120 120 120 120 120 
##$TP= (0..7)
150 150 150 150 150 150 150 150 
##$TP07= 0
##$TPNAME0= <>
##$TPNAME1= <>
##$TPNAME2= <>
##$TPNAME3= <>
##$TPNAME4= <>
##$TPNAME5= <>
##$TPNAME6= <>
##$TPNAME7= <>
##$TPOAL= (0..7)
0.5 0.5 0.5 0.5 0.5 0.5 0.5 0.5 
##$TPOFFS= (0..7)
0 0 0 0 0 0 0 0 
##$TUNHIN= 0
##$TUNHOUT= 0
##$TUNXOUT= 0
##$USERA1= <user>
##$USERA2= <user>
##$USERA3= <user>
##$USERA4= <user>
##$USERA5= <user>
##$V9= 5
##$VALIST= <valist>
##$VCLIST= <CCCCCCCCCCCCCCC>
##$VD= 0
##$VDLIST= <DDDDDDDDDDDDDDD>
##$VPLIST= <PPPPPPPPPPPPPPP>
##$VTLIST= <TTTTTTTTTTTTTTT>
##$WBST= 1024
##$WBSW= 4
##$XGAIN= (0..3)
0 0 0 0 
##$XL= 0
##$YL= 0
##$YMAX_a= 135301
##$YMIN_a= -87246
##$ZGOPTNS= <>
##$ZL1= 120
##$ZL2= 120
##$ZL3= 120
##$ZL4= 120
##$ABSF1= 10
##$ABSF2= 0
##$ABSG= 5
##$ABSL= 3
##$ALPHA= 0
##$AQORDER= 0
##$ASSFAC= 0
##$ASSFACI= 0
##$ASSFACX= 0
##$ASSWID= 0
##$AUNMP= <proc_1d>
##$AZFE= 0.1
##$AZFW= 0.1
##$BCFW= 1
##$BC_mod= 2
##$BYTORDP= 1
##$COROFFS= 0
##$CY= -3
##$DATMOD= 1
##$DC= 2
##$DFILT= <>
##$DTYPP= 0
##$F1P= 0
##$F2P= 0
##$FCOR= 0.5
##$FTSIZE= 0
##$FT_mod= 4
##$GAMMA= 1
##$GB= 0.15
##$INTBC= 1
##$INTSCL= 1
##$ISEN= 128
##$LB= 0.25
##$LEV0= 0
##$LPBIN= 0
##$MAXI= 10000
##$MC2= 0
##$MEAN= 0
##$ME_mod= 0
##$MI= 1.114404
##$NCOEF= 0
##$NC_proc= 0
##$NLEV= 6
##$NOISF1= 3.799351
##$NOISF2= 2.8
##$NSP= 1
##$NTH_PI= 0
##$NZP= 0
##$OFFSET= 14.38212
##$PC= 1
##$PHC0= 252.973
##$PHC1= 11.9922
##$PH_mod= 1
##$PKNL= yes
##$PPARMOD= 0
##$PSCAL= 0
##$PSIGN= 0
##$REVERSE= no
##$SF= 200.129724274929
##$SI= 16384
##$SIGF1= 3
##$SIGF2= 2
##$SINO= 400
##$SIOLD= 16384
##$SREGLST= <1H.CDCl3>
##$SSB= 0
##$STSI= 0
##$STSR= 0
##$SW_p= 3205.1282051282
##$SYMM= 0
##$S_DEV= 0
##$TDeff= 0
##$TDoff= 0
##$TI= <>
##$TILT= no
##$TM1= 0
##$TM2= 0
##$TOPLEV= 0
##$USERP1= <user>
##$USERP2= <user>
##$USERP3= <user>
##$USERP4= <user>
##$USERP5= <user>
##$WDW= 1
##$XDIM= 8192
##$YMAX_p= 0
##$YMIN_p= 0
$$ End of Bruker specific parameters
$$ ---------------------------------
##NTUPLES= NMR FID
##VAR_NAME=  TIME,          FID/REAL,        FID/IMAG
##SYMBOL=    X,             R,               I
##VAR_TYPE=  INDEPENDENT,   DEPENDENT,       DEPENDENT
##VAR_FORM=  AFFN,          ASDF,            ASDF
##VAR_DIM=   8192,          8192,            8192
##UNITS=     SECONDS,       ARBITRARY UNITS, ARBITRARY UNITS
##FACTOR=    0.0002768,     1,               1
##FIRST=     0,             0,               0
##LAST=      2.2672688,     0,               0
##MIN=       0,             -87246,          0
##MAX=       2.2672688,     135301,          0
$$ Real data points
##PAGE= N=1
##DATA TABLE= (X++(R..R)), XYDATA
$$ plain form
0 0 0 0 0 0 0 0 0 0 0 0 0 0 0 0 0 0 0 0 0 0 0 0 4 -6 8 -8 8 -8 8 -9 11 -14 16 -17 18 -20 24 -26 28 -31 37 -40 45 -48
44 -48 53 -59 63 -70 77 -85 94 -105 114 -129 141 -157 177 -199 223 -254 293 -345 410 -501 638
65 638 -850 1225 -2022 4329 -24121 -81117 46524 93389 4623 46652 135301 56264 -26690
78 -26690 5321 -6289 -69114 -57112 -22774 -30006 -35154 -37972 -39860 -10095 3407 -1485 47867
91 47867 83710 29766 6289 42510 5047 -48557 1375 29718 -26895 -27410 7574 -35844 -61326
104 -61326 -10298 179 -14306 26609 34330 -9304 2491 20900 -17797 -6420 49368 22148
116 22148 -17572 18013 10648 -52320 -33866 15739 -9208 -22085 15551 7645 -26984 -16259
128 -16259 -819 -509 16419 22292 12107 19888 7786 -27581 -10075 20191 -9082 -15471 28814
$$ packed form
0@%%%%%%%%%%%%%%%%%%%%%%Mj0J4j6J6j6J6j7K0k5L0l3L5l8M4n0N4n9O8p7Q5r3
44d8J01j12J22j33J47j62J79j99K19k43K70k98L34l76M22m77N47o38P55r11J139
65F38j488K075l247O351k8450n6996J27641M6865q8766M2029Q8649p9037q2954
78b6690L2011j1610o2825J2002L4338p232n148k818j888K9765J3502m892M9352
91D7867L5843n3944k3477L6221l7463n3604M9932K8343n6613n15L4984m3418k5482
104f1326N1028J0477j4485M0915P721m3634J1795J8409l8697J1377N5788k7220
116B2148l9720L5585p365o2968J8454M9605k4947j2877L7636p906l4629J0725
128a6259J5440L10J6928N873j0185P781j2102l5367J7506L0266k9273o389M4285
$$ plain form
141 28814 8199 -45367 -16615 12781 -27369 -21773 33996 17188 -22564 4528 17027 -15539
153 -15539 -4452 30848 20468 6872 14372 590 -17800 -14114 -16039 -16866 -662 -3866 -20156
166 -20156 -8211 -420 -16585 -822 32454 25198 15651 32158 20876 -8896 -3364 3192 -15564
179 -15564 -13232 -1879 -21353 -31142 -13958 -16904 -20475 10167 26097 12528 21898 34096 12357
192 12357 3183 20321 12891 -4250 2878 -1810 -26296 -28409 -19438 -25788 -18854 1968 4303 3388
206 3388 14974 15131 9862 21058 26520 17132 17696 16399 -4307 -15948 -11201 -18132 -24878 -11300
220 -11300 -4366 -11754 -6776 4105 2967 6657 19548 21913 18713 19453 11484 129 -622 -3147 -10380
235 -10380 -6057 -828 -8021 -9704 -1722 -2025 -3994 6220 12146 7475 8092 9520 2260 -1102 3291
$$ packed form
141B8814k0615n3566K8752K9396m0150N596N5769j6808l9752K7092J2499l2566
153a5539J1087L5300j0380j3596P500j3782j8390L686j925q27J6204l204j6290
166b0156J1945P791j6165J5763L3276p256r547J6507j1282k9772N532O556j8756
179a5564K332J1353j9474r789J7184k946l571L0642J5930j3569R370J2198k1739
192A2357r174J7138p430j7141P128m688k4486k113Q971o350O934K0822K335r15
206C388J1586J57n269J1196N462r388N64j297k0706j1641M747o931o746J3578
220a1300O934p388M978J0881j138L690J2891K365l200P40p969j1355p51k525p233
235a0380M323N229p193j683P982l03j969J0214N926m671O17J428p260l362M393
$$ plain form
250 3291 2971 1806 6364 6640 1542 1968 2551 -277 608 3462 360 -1674 -177 -3258 -5559 279
266 279 4647 4036 8366 13437 9941 5951 7813 6781 1529 209 956 -2249 -5790 -5783 -3921 -1896 886
283 886 4784 8505 10337 9843 8890 8452 6344 3579 2511 1224 -1542 -2913 -2446 -2187 -1473 1495 4019
300 4019 4794 5642 6575 6117 4482 4315 4902 4180 2545 3016 3954 2747 1143 1949 3272 1157 -347 869
318 869 984 -1346 -1557 1284 2706 2663 5096 8428 8856 8459 8844 8195 5438 2805 566 -1865 -4650
335 -4650 -5726 -5496 -4750 -3571 -659 3249 5551 7451 10612 11519 9582 8490 8206 4567 -217 -890
351 -890 -1606 -4964 -5641 -3225 -2465 -2407 356 2704 3973 4923 5151 5164 6129 4909 2633 3314 4001 398
369 398 -742 2136 843 -2134 570 2064 -1959 -1617 1260 -855 -2185 2434 3015 -176 2531 5041
$$ packed form
250C291l20j165M558K76n098M26N83k828Q85K854l102k034J497l081k301N838
266B79M368o11M330N071l496l990J862j032n252j320P47l205l541PJ862K025K782
283H86L898L721J832m94r53m38k108k765j068j287k766j371M67K59P14K968K524
300D019P75Q48R33m58j635j67N87p22j635M71R38j207j604Q06J323k115j504J216
318H69J15k330k11K841J422m3K433L332M28l97L85o49k757k633k239k431k785
335d650j076K30P46J179K912L908K302J900L161R07j937j092k84l639m784o73
351h90p16l358o77K416P60N8K763K348J269R50K28J3R65j220k276O81O87l603
369C98j140K878j293k977K704J494m023L42K877k115j330M619N81l191K707K510
$$ plain form
385 5041 1522 1279 4791 2635 492 2189 898 -2248 -1007 -743 -3091 -208 2143 -1667 -918 2977
401 2977 -659 -2963 2933 2996 -2286 390 3001 -2504 -3327 2084 -408 -1822 3417 2450 -2803 -27
417 -27 971 -4170 -1608 2780 -1591 -2530 1995 -2548 -6013 -3 -306 -5001 1460 4278 -5108 -3873
433 -3873 4045 -2380 -6086 5384 5657 -4364 -653 4104 -6329 -7980 614 -2441 -6275 -285 -2011
448 -2011 -7737 -3133 -803 -3734 2293 6647 -410 -526 4022 -5414 -9296 1408 -1123 -9737 -350
463 -350 3177 -11006 -8803 4453 -2668 -7121 7062 6435 -7783 -4055 273 -10223 -8672 1220
477 1220 -2684 -4029 2730 -2549 -7638 1719 1751 -4943 3872 6835 -7445 -9312 -1736 -10862 -14404
492 -14404 -12 1283 -6686 1245 3220 -7680 -3156 5337 -2664 -1452 8186 -3114 -13191 -2743
$$ packed form
385E041l519k43L512k156k143J697j291l146J241K64k348K883K351l810P49L895
401B977l636k304N896O3n282K676K611n505q23N411k492j414N239r67n253K776
417b7R98n141K562M388m371r39M525m543l465O010l03m695O461K818r386J235
433c873P918o425l706J1470K73j0021L711M757j0433j651Q594l055l834N990j726
448b011n726M604K330k931O027M354p057j16M548r436l882J0704k531q614R387
463c50L527j4183K203J3256p121m453J4183o27j4218L728M328j0496J551R892
477A220l904j345O759n279n089R357L2o694Q815K963j4280j867P576r126l542
492a4404J4392J295p969P931J975j0900M524Q493q001J212R638j1300j0077J0448
$$ plain form
506 -2743 -5574 -17669 -2493 9376 -6368 -5980 9237 -3482 -16325 1602 7368 -8850 -3610
519 -3610 7065 -7385 -16097 -4509 -2822 -5902 2268 5088 1065 1101 -4559 -9878 -348 743 -9315
534 -9315 -721 7420 -11641 -17105 1767 -2112 -14548 4600 14638 -6058 -7874 5750 -6567
547 -6567 -14980 2968 6056 -5791 595 3915 -10656 -9409 898 -4109 -3292 8030 -33 -10833
561 -10833 -3943 -5642 -14631 -2981 8111 -1012 -675 7116 -2966 -9143 1939 2458 -2541 5375
575 5375 3378 -10431 -7976 -4690 -15208 -8419 9018 333 -6834 7967 3817 -14485 -2856 12433
589 12433 -750 -3686 11214 1916 -14846 -6547 -568 -7774 -1892 6956 1166 -2499 -1421 -6934
603 -6934 -5698 2637 775 346 8276 1185 -10894 -2459 1915 -7607 -445 13244 2472 -7289 2297
$$ packed form
506b743k831j2095J5176J1869j5744L88J5217j2719j2843J7927N766j6218N240
519c610J0675j4450q712J1588J687l080Q170K820m023L6n660n319R530J091j0058
534i315Q594Q141j9061n464J8872l879j2436J9148J0038k0696j816J3624j2317
547f567q413J7948L088j1847O386L320j4571J247J0307n007Q17J1322q063j0800
561a0833O890j699q989J1650J1092r123L37P791j0082o177J1082N19m999P916
575E375j997j3809K455L286j0518O789J7437q685p167J4801m150j8302J1629J5289
589A2433j3183k936J4900r298j6762Q299N979p206N882Q848n790l665J078n513
603f934J236Q335j862m29P930p091j2079Q435M374r522P162J3689j0772r761R586
$$ plain form
618 2297 -852 -12287 -1883 8141 -490 -824 5270 -4012 -9542 -417 310 -2730 7443 7991 -3988
633 -3988 -1773 2463 -6712 -4930 8563 5468 -2173 3900 2133 -9151 -5458 2742 -369 1449 7172
648 7172 1070 -4051 -3 -1943 -3992 5509 7716 504 2406 3292 -6641 -6452 3482 2189 -144 7715
664 7715 6135 -4088 -1708 2607 -2480 125 8019 3609 -1756 525 -2336 -6975 -672 4212 1924
679 1924 5395 7769 -62 -2160 3546 976 -815 6564 6905 -1543 -1216 614 -4785 -3801 4047 4176
695 4176 2455 5224 2685 -3095 -887 2133 419 3738 7278 3171 -224 2144 156 -1003 4415
710 4415 6553 3211 3090 2190 -3794 -4208 -357 -959 -299 5065 4414 113 1816 4271 2410 4089 8623
727 8623 6641 2843 2266 -556 -4127 -2863 -550 -39 1937 3315 1453 1028 2321 2303 3699 6582
$$ packed form
618B297l149j1435J0404J0024q631l34O094r282n530R125P27l040J0173N48j1979
633c988K215M236r175J782J3493l095p641O073j767j1284L693Q200l111J818N723
648G172o102n121M048j940k049R501K207p212J902Q86r933J89R934j293k333P859
664G715j580j0223K380M315n087K605P894m410n365K281k861m639O303M884k288
679A924L471K374p831k098N706k570j791P379L41q448L27J830n399R84P848J29
695D176j721K769k539n780K208L020j714L319L540m107l395K368j988j159N418
710D415K138l342j21r00n984m14L851o02O60N364o51m301J703K455j861J679M534
727H623j982l798n77k822l571J264K313N11J976J378j862m25J293j8J396K883
$$ plain form
743 6582 5506 2723 2430 652 -3029 -1481 2014 1684 1836 4620 3494 44 862 2708 2239 2100 3565
760 3565 2460 12 -1207 -1539 -445 1536 2369 3582 4899 4042 1440 1510 2761 1491 1106 2815 2003
777 2003 -704 -1059 -316 -253 60 2437 3673 2724 2103 1874 540 348 675 1669 2133 1413 1199 1586 1006
796 1006 432 1738 3145 2296 1450 1709 473 -1418 -1541 46 457 -190 1002 1752 1321 798 1520 2558
814 2558 2921 1890 1865 1993 644 -996 -407 430 -192 -225 1130 953 -45 260 899 342 374 1373 913 57
834 57 515 742 -4 485 1002 1496 1265 1123 813 801 32 -640 -412 -30 -994 -1257 -374 -42 -1114 -389 1469
855 1469 772 553 1573 1636 339 641 566 69 26 101 -924 -766 -440 -1387 -1636 -79 -407 -1021 341 746
875 746 -321 439 1324 -61 -111 1486 152 -1706 -44 23 -2302 -1553 658 -683 -1148 977 742 -665
$$ packed form
743F582j076k783k93j778l681J548L495l30J52K784j126l450Q18J846m69j39J465
760C565j105k448j219l32J094J981Q33J213J317q57k602P0J251j270l85J709q12
777B003k707l55P43O3L13K377J236r49o21k29j334j92L27R94M64p20k14L87n80
796A006n74J306J407q49q46K59j236j891j23J587M11o47J192P50m31n23P22J038
814B558L63j031k5J28j349j640N89Q37o22l3J355j77r98L05O39n57L2R99m60q56
834E7M58K27p46M89N17M94k31j42l10j2p69o72K28L82r64k63Q83L32j072P25J858
855A469o97k19J020O3j297L02p5m97m3P5j025J58L26r47k49J557l28o14J362M05
875G46j067P60Q85j385n0J597j334j858J662O7k325P49K211j341m65K125k35j407
$$ plain form
893 -665 602 1001 -700 -199 103 -1918 -1753 -607 -2357 -2292 67 -311 -1254 1281 2155 -213 980 2393
911 2393 -324 -1279 557 -1685 -4052 -1431 -1266 -4167 -1678 984 -1252 -1146 2110 598 -968 1544
927 1544 1375 -1347 184 795 -2659 -1582 637 -1973 -2207 1090 -341 -2657 -332 197 -3439 -1972
943 -1972 450 -2510 -2064 1374 -700 -2062 2728 2336 -1087 2025 3734 -1384 -2045 968 -2868 -5567
959 -5567 -1334 -1672 -4893 -1315 326 -2722 -514 3421 813 1034 4192 1620 -1839 797 -367 -4000
975 -4000 -1596 53 -3622 -2443 1074 -2770 -3571 2234 956 -2463 2271 3224 -3102 -1831 2252 -2080
991 -2080 -2946 2805 1365 -2854 827 1348 -3930 -1329 2230 -1861 -2158 1838 -1397 -4535 -132 793
1007 793 -2241 1468 3938 -116 -370 1823 -1842 -2621 1890 -390 -2934 1173 -66 -5237 -1345 2366
$$ packed form
893f65J267L99j701N01L02k021J65J146j750O5K359l78r43K535Q74k368J193J413
911B393k717r55J836k242k367K621J65k901K489K662k236J06L256j512j566K512
927A544j69k722J531O11l454J077K219k610k34L297j431k316K325N29l636J467
943a972K422k960M46L438k074j362M790l92l423L112J709n118o61L013l836k699
959e567M233l38l221L578J641l048K208L935k608K21L158k572l459K636j164l633
975d000K404J649l675J179L517l844q01N805j278l419M734R53o326J271M083m332
991b080q66N751j440m219L681N21n278K601L559m091k97L996l235l138M403R25
1007G93l034L709K470m054k54K193l665p79M511k280k544M107j239n171L892L711
$$ plain form
1023 2366 -1825 -223 6012 1235 -3299 1800 865 -5154 -570 3617 -2187 -2798 1998 -1627 -5110
1038 -5110 588 2159 -726 2129 3256 -1069 -832 467 -2524 -606 3517 -17 -2071 2129 -884
1053 -884 -5945 -450 3035 -2613 -598 4513 -1416 -4973 904 1075 -2683 2588 5375 60 -4 2372
1069 2372 -2359 -3278 2171 773 -2205 1129 -166 -5751 -3359 362 -2318 -647 5351 2293 -1207
1084 -1207 2594 1559 -2124 1438 4247 702 -103 898 -3460 -5014 -1810 -2374 -2654 2316 1496 -2839
1100 -2839 205 2074 -2705 472 7029 3626 -89 3911 1274 -5299 -2462 867 -2876 -1912 1693
1115 1693 -1971 -4377 -1002 -833 -1849 3414 5194 1354 1719 2266 -2125 -2613 1379 355 -1548 1869
1131 1869 507 -4187 -2438 -69 -2098 -111 3887 1435 -938 680 -1268 -3341 75 1631 -36
$$ packed form
1023B366m191J602O235m777m534N099r35o019M584M187n804o11M796l625l483
1038e110N698J571k885K855J127m325K37J299k991J918M123l534k054M200l013
1053h84n061N495L485n648K015N111n929l557N877J71l758N271K787n315o4K376
1069B372m731r19N449j398k978L334j295n585K392L721k680J671N998l058l500
1084a207L801j035l683L562K809l545q05J001m358j554L204n64k80M970q20m335
1100b839L044J869m779L177O557l403l715M000k637o573K837L329l743R64L605
1115A693l664k406L375J69j016N263J780l840L65N47m391m88L992j024j903L417
1131A869j362m694J749K369k029J987L998k452k373J618j948k073L416J556j667
$$ plain form
1146 -36 1924 2621 -2099 -2550 872 -556 -1343 3213 2753 -2252 -1603 -669 -3790 -2891 2152 1833 340
1163 340 2024 574 -2311 -716 840 -683 847 2582 -823 -3003 -1532 -2642 -3159 891 2743
1178 2743 1107 1266 1236 -1360 -1309 575 -134 352 2161 -286 -3068 -2027 -1776 -3237 -501 2838 754
1195 754 -330 1367 -658 -2876 -336 1942 515 920 2240 -368 -2797 -1420 -541 -755 313 923
1211 923 -260 -1407 -2575 -3293 -1407 368 156 1623 3306 1071 -1179 567 1193 -137 915 2051
1227 2051 -436 -3069 -2998 -3543 -4055 -1430 203 563 1292 1147 -28 556 1424 1506 1815 2851 1037 -1569
1245 -1569 -1918 -2434 -3642 -2191 -14 -309 -956 18 -536 -1548 -557 1447 1616 1352 1372 317 -712 -1442
1263 -1442 -1452 -199 616 196 -309 247 -812 -2361 -1695 175 -247 -146 1125 438 -1148 -1105 119 262
$$ packed form
1146c6J960O97m720m51L422j428p87M556m60n005O49R34l121Q99N043l19j493
1163C40J684j450k885J595J556j523J530J735l405k180J471j110n17M050J852
1178B743j636J59l0k596N1J884p09M86J809k447k782J041K51j461K736L339k084
1195G54j084J697k025k218K540K278j427M05J320k608k429J377Q79k14J068O10
1211I23j183j147j168p18J886J775k12J467J683k235k250J746O26j330J052J136
1227B051k487k633P1n45n12K625J633L60P29j45j175N84Q68Q2L09J036j814k606
1245a569l49n16j208J451K177k95o47R74n54j012R91K004J69k64K0j055j029p30
1263a442j0J253Q15m20n05N56j059j549O66J870m22J01J271o87j586M3J224J43
$$ plain form
1281 262 561 1385 1124 325 -451 -1285 -1062 -584 -111 373 661 -231 -1007 -780 -475 -513 292 1447 763 -122
1301 -122 187 -187 -1073 -92 866 598 213 276 -182 -735 -908 -164 410 779 426 79 284 -35 -566 45
1321 45 1095 468 189 266 -34 -923 -830 -142 40 633 1014 523 454 591 544 360 870 1112 667 470 190
1342 190 -881 -857 -162 -293 24 660 453 -59 339 760 65 648 1357 1099 544 811 600 316 599 726
1362 726 289 398 336 -532 -691 -111 -853 -702 717 731 293 1260 1856 1083 1582 1881 1455 1065 1197 188
1382 188 -700 -542 -750 -1542 -604 471 -199 397 1674 1132 1105 2313 1970 1074 1378 1288 -53 -94 846 -385
1402 -385 -649 793 501 -358 833 1296 580 776 1523 731 420 1314 357 -207 917 796 -45 1257 1639
1421 1639 348 838 1901 447 -206 951 460 -555 575 670 -629 481 1265 234 331 1687 1274
$$ packed form
1281B62K99Q24k61p99p76q34K23M78M73M84K88q92p76K27L05l8Q05J155o84q85
1301a22L09l74q86R81R58k68l85O3m58n53j73P44N74L69l53l47K05l19n31O11
1321D5J050o27k79P7l00q89R3O88J82N93L81m91o9J37m7j84N10K42m45j97k80
1342A90j071K4O95j31L17O36k07n12L98M21o95N83P09k58n55K67k11k84K83J27
1362G26m37J09o2q68j59N80p42J51J419J4m38R67N96p73M99K99m26l90J32j009
1382A88q88J58k08p92R38J075o70N96J277n42k7J208l43q96L04r0j341m1R40j231
1402c85k64J442k92q59J191M63p16J96P47p92l11Q94r57n64J124j21q41J302L82
1421A639j291M90J063j454o53J157m91j015J130R5j299J110P84j031R7J356m13
$$ plain form
1438 1274 163 1295 1381 -269 588 1327 61 98 1523 541 -153 1510 1019 -133 1086 1236 -202
1455 -202 176 1026 -325 -446 1151 611 -170 1539 1570 -168 1163 1942 12 91 1601 9 -1054 723
1473 723 585 -1062 432 1417 -377 366 1689 495 28 1400 1074 -144 1155 965 -1002 72 871
1490 871 -261 0 1960 356 -360 1339 459 -1216 499 1042 -1224 -469 1229 -703 -1566 1221 990
1507 990 -559 1081 2061 76 226 1215 143 -454 1120 194 -1008 260 -290 -1799 -346 700 -896
1524 -896 223 1530 32 -432 1068 415 -731 1285 1654 -930 -190 817 -1300 -1662 1032 37 -1113
1541 -1113 385 395 -1393 -422 943 -751 -217 1712 -97 -1334 407 -221 -1891 -136 1344 -740
1557 -740 -279 1174 -562 -1360 437 276 -638 756 653 -1481 -1142 -248 -1923 -1039 1076 -59 -1050
$$ packed form
1438A274j111J132Q6j650Q57P39j266L7J425r82o94J663m91j152J219J50j438
1455b02L78Q50j351j21J597n40p81J709L1j738J331P79j930P9J510j592j063J777
1473G23j38j647J494R85j794P43J323j194m67J372l26j218J299j90j967J074P99
1490H71j132K61J960j604p16J699q80j675J715N43k266P55J698j932q63K787k31
1507I90j549J640R80j985J50R89j072n97J574r26j202J268n50j509J453J046j596
1524h96J119J307j498m64J500o53j146K016L69k584P40J007k117l62K694r95j150
1541a113J498J0j788R71J365j694N34J929j809j237J741o28j670J755J480k084
1557g40M61J453j736p98J797j61r14J394j03k134L39Q94j675Q84K115j135r91
$$ plain form
1574 -1050 947 29 -1579 225 1190 -278 175 1542 -985 -2048 -364 -953 -1937 -53 363 -1505
1590 -1505 -726 -62 -1339 -1595 551 101 -399 1196 253 -1748 -670 326 -1175 -419 1561 -680 -1664
1607 -1664 -562 -1371 -2815 -1032 186 -936 -665 495 -1019 -1366 67 27 -291 1415 870 -1206 -613
1624 -613 -705 -2244 -1630 294 -622 -1122 -120 -674 -2252 -465 352 -753 115 1380 -773 -1789 -676
1641 -676 -1286 -1786 -325 480 -322 -267 -77 -1472 -1174 84 -355 -231 759 -453 -1819 -1729 -1016 -1769 -514
1660 -514 956 223 -201 361 -838 -1804 -106 318 -802 -8 324 -1724 -2093 -761 -907 -1110 774 1094
1678 1094 -378 -629 -410 -1573 -1192 201 -87 -372 14 -808 -1845 -1197 -366 -376 376 1045 220 -457 -604
1697 -604 -1422 -1112 264 -22 -382 -13 -599 -1819 -1603 -486 -568 -178 888 488 -784 -685 -171 -792 -22
$$ packed form
1574a050J997r18j608J804R65j468M53J367k527j063J684n89r84J884M16j868
1590a505P79O64j277k56K146m50n00J595r43k001J078R96j501P56J980k241r84
1607a664J102q09j444J783J218j122K71J160j514l47J433m0l18J706n45k076N93
1624f13r2j539O14J924r16n00J002n54j578J787Q17j105Q68J265k153j016J113
1641f76o10n00J461Q05q02N5J90j395K98J258m39J24R90j212j366R0P13p53J255
1660e14J470p33m24N62j199r66J698M24j120P94L32k048l69J332j46k03J884L20
1678A094j472k51K19j163L81J393k88k85L86q22j037O48Q31j0P52O69q25o77j47
1697f04q18L10J376k86l60L69n86j220K16J117q2L90J066m00j272R9N14o21P70
$$ plain form
1716 -22 1207 555 -17 -106 -940 -1663 -744 -653 -369 157 62 -1018 -1483 -725 -684 145 1069 1129 545 659 108
1737 108 -1000 -626 371 221 -138 -185 -798 -1644 -1718 -803 -647 286 877 306 330 -76 -448 -192 958 879 575
1758 575 661 2 -969 -1223 -832 -470 -170 542 303 -383 -354 -355 -566 212 1039 1147 781 535 4 -415 -214
1779 -214 -96 236 639 464 -330 -306 -230 -425 -72 667 954 398 274 102 -572 -354 284 411 774 852 325
1800 325 -88 -214 -178 102 687 929 384 165 97 -571 -467 44 364 310 835 624 -1 191 260 223 476 1008
1822 1008 625 217 184 -205 -291 98 376 606 783 746 251 69 653 218 230 861 589 -8 86 85 -257 -326
1844 -326 815 448 706 937 525 214 260 505 296 691 714 302 -248 -29 -246 -270 456 487 304 545 539 25
1866 25 302 959 477 528 1237 803 78 245 474 15 154 418 169 68 -122 -165 -533 295 281 65 994
$$ packed form
1716b2J229o52n72q9q34p23R19R1K84N26r5j080m65P58M1Q29R24O0n84J14n51
1737A08j108L74R97j50l59m7o13q46p4R15J56R33N91n71K4m06l72K56J150p9l04
1758E75Q6o59r71k54L91L62L00P12k39o86K9jk11P78Q27J08l66k46n31m19K01
1779b14J18L32M03j75p94K4P6j95L53P39K87n56j24j72o74K18O38J27L63P8n27
1800C25m13j26L6K80N85K42n45k19o8o68J04N11L20n4N25k11o25J92O9l7K53N32
1822A008l83m08l3l89q6L89K78K30J77l7m95j82N84m35J2O31k72n97R4jl42o9
1844c26J141l67K58K31m12l11M6K45k09L95K3m12n50K19k17k4P26L1j83K41on14
1866B5K77O57m82N1P09m34p25J67K29m59J39K64k49j01j90m3l68Q28j4k16R29
$$ plain form
1887 994 881 541 732 1050 602 353 852 390 -245 -137 -282 -499 -112 116 -144 247 583 752 173 836
1907 836 728 104 757 547 84 17 339 -80 -99 331 339 62 580 426 -93 -54 326 32 -327 208 238 -101
1929 -101 242 318 45 173 554 197 451 979 346 -80 214 312 -309 141 189 -366 -242 89 -408 -381 468
1950 468 212 -140 789 693 -84 208 489 -59 39 419 305 -158 186 140 -632 85 368 -265 -29 706 -68
1971 -68 -360 511 176 -354 183 529 -256 152 480 -256 -267 634 213 -377 509 -44 -458 -96 163 -427 -114
1992 -114 72 -148 -361 262 -168 -509 360 241 -167 303 589 -117 -397 403 -9 -484 458 -46 -559 -161
2012 -161 290 -348 -351 464 -90 -179 248 -36 -405 383 273 -336 -229 245 -263 -478 225 -257 -421 275 98
2033 98 -381 -227 229 -557 -336 443 -180 -343 123 47 -421 -71 225 -469 -19 519 -115 -472 77 -11 -554
$$ packed form
1887I94j13l40J91L18m48k49M99m62o35J08j45k17L87K28k60L91L36J69n79O63
1907H36j08o24O53k10m63o7L22m19j9M30Qk77N18j54n19L9L80k94l59N35L0l39
1929a01L43P6k73J28L81l57K54N28o33m26K94R8o21M50M8n55J24L31m97K7Q49
1950D68k56l52R29r6p77K92K81n48R8L80j14m63L44m6p72P17K83o33K36P35p74
1971f8k92Q71l35n30N37L46p85M08L28p36j1R01m21n90Q86n53m14L62K59n90L13
1992a14J86k20k13O23m30l41Q69j19m08M70K86p06k80Q00m12m75R42n04n13L98
2012a61M51o38lQ15n54q9M27k84l69P88j10o09J07M74n08k15P03m82j64O96j77
2033I8m79J54M56p86K21P79o23j63M66p6m68L50K96o94M50N38o34l57N49q8n43
$$ plain form
2054 -554 40 415 -431 -428 223 -320 -699 65 -132 -488 -50 27 -398 -145 259 -289 231 674 118 -143 395
2075 395 111 -660 -230 -20 -671 -289 -89 -828 -846 86 -320 -214 551 483 -124 142 372 -177 -39 304 233
2096 233 -120 71 -344 -803 -403 -126 -475 -98 160 -349 -425 -100 -165 -422 399 595 -129 93 389 -142 117
2117 117 581 204 -206 121 -201 -846 -685 -265 -558 -585 311 147 -90 213 83 -228 437 843 219 243 354
2138 354 -522 -795 -412 -779 -561 297 -408 -494 -167 -132 -657 223 865 233 64 645 237 -596 -43 162 -234
2159 -234 -164 488 -71 -426 -132 -496 -102 389 354 225 347 227 -412 -428 14 -70 54 632 114 -735 -274
2180 -274 -209 -383 -231 351 300 -105 249 -143 -487 -80 441 115 389 320 -430 -531 -245 -451 -200 269 376
2201 376 -148 74 -41 -436 -270 642 359 264 409 239 -218 -380 -91 -198 100 176 -256 -228 -267 -503 -516 102
$$ packed form
2054e54N94L75q46LO51n43l79P64j97l56M38P7m25K53M04n48N20M43n56k61N38
2075C95k84p71M30K10o51L82K00p39j8R32m06J06P65o8o07K66K30n49J38L43p1
2096B33l53J91m15m59M00K77l49L77K58n09p6L25o5k57Q21J96p24K22K96n31K59
2117A17M64l77m10L27l22o45J61M20k93k7Q96j64k37L03j30l11O65M06o24K4J11
2138C54q76k73L83l67K18Q58p05q6L27L5n25Q80O42o32j69N81m08q33N53K05l96
2159b34P0O52n59l55K94l64L94M91l5j29J22j20o39j6M42q4J24N78n18q49M61
2180b74O5j74J52N82n1m05L54l92l44M07N21l26K74o9p50j01K86k06K51M69J07
2201C76n24K22j15l95J66R12k83r5J45j70m57j62K89j07K98P6m32K8l9k36j3O18
$$ plain form
2223 102 385 220 343 414 -138 -45 339 172 80 706 309 -464 -381 -521 -841 -670 95 -59 143 4 -279
2244 -279 -346 40 317 619 807 854 313 -219 -90 -242 -455 -67 -114 -333 -135 -617 -733 -740 -385 112 374 472
2266 472 176 110 -14 99 84 530 434 216 -34 -257 -632 -875 -445 -451 -128 96 -94 -398 -55 11 106 146 680
2289 680 769 -6 -61 -462 -610 -367 -50 46 168 -31 -334 -459 -54 -160 340 176 158 8 -128 -80 -478 -353
2311 -353 194 88 149 77 -159 -472 -524 -232 -176 189 317 -183 -489 -338 -449 -253 60 256 236 399 -76 -232
2333 -232 -223 -166 -67 -4 120 -133 -384 -313 -383 -216 -29 443 321 140 236 -67 -254 -168 -111 -137 165 89 -298 -530
2357 -530 -253 -391 -252 196 99 150 29 229 -396 -52 36 28 -288 176 106 -565 -623 -390 -309 -283 14 0 -161
2380 -161 -41 -203 -142 291 316 43 -31 195 -191 -237 -198 -145 -143 -189 -372 -458 -261 -354 -393 -141 330 109 436 473
$$ packed form
2223A02K83j65J23P1n52R3L84j67r2O26l97p73Q3j40l20J71P65j54K02j39k83
2244b79o7L86K77L02J88M7n41n32J29j52k13L88m7k19J98m82j16pL55M97K62R8
2266D72k96o6j24J13j5M46r6k18k50k23l75k43M30oL23K24j90l04L43O6R5M0N34
2289F80Q9p75n5m01j48K43L17R6J22j99l03j25M05j06N00j64j8j50j36M8l98J25
2311c53N47j06O1p2k36l13n2K92N6L65J28n00l06J51j11J96L13J96k0J63m75j56
2333b32RN7R9O3J24k53k51P1p0J67J87M72j22j81R6l03j87Q6N7k6L02p6l87k32
2357e30K77j38J39M48r7N1j21K00o25L44Q8ql16M64p0o71n8K33Q1K6K97j4j61
2380a61J20j62O1M33K5k73p4K26l86m6L9N3Km6j83q6J97r3l9K52M71k21L27L7
$$ plain form
2404 473 237 98 228 174 32 74 135 -502 -346 -455 -408 -389 6 84 -102 -52 -20 -90 -49 296 290 7 658 93
2428 93 -179 17 66 -343 99 28 -207 -176 -57 -55 -288 -74 98 -177 171 417 279 45 301 -28 86 134
2450 134 -40 -176 54 -100 -234 -105 -25 -26 -73 96 -20 -169 -63 -57 -70 298 366 25 341 428 -216 -63 319
2473 319 52 36 -157 -64 -396 -17 -59 70 195 286 237 41 405 296 -160 203 424 -127 -154 301 24 -11
2495 -11 -11 -13 -38 290 345 177 117 281 2 161 261 -112 17 141 72 -176 126 326 -98 92 305 120 306
2518 306 306 -30 241 350 344 283 123 193 -5 -13 219 10 -40 217 -14 -322 -12 238 -41 134 657 500 329
2541 329 529 249 112 234 267 23 -32 62 -85 -236 241 -41 79 275 328 313 354 356 186 61 257 205 382
2564 382 259 53 100 21 220 -109 -8 217 269 -192 157 100 127 71 208 441 164 175 258 134 499 165 97
$$ packed form
2404D73k36j39J30n4j42M2O1o37J56j09M7J9L95P8j86N0L2p0M1L45ok83O51n65
2428I3k72J96M9m09M42p1k35L1J19Kk33K14J72k75L48K46j38k34K56l29J14M8
2450A34j74j36K30j54j34J29Q0jm7J69j16j49J06Oj3L68O8l41L16Q7o44J53L82
2473C19k67j6j93R3l32L79m2J29J25R1m9j96L64j09m56L63K21n51k7M55k77l5
2495a1%kk5L28N5j68o0J64k79J59J00l73J29J24o9k48L02K00m24J90K13j85J86
2518C06%l36K71J09oo1j60P0j98qK32k09n0K57k31l08L10K50k79J75N23j57j71
2541C29K00k80j37J22L3k44n5R4j47j51M77k82J20J96N3j5M1Kj70j25J96n2J77
2564C82j23k06M7p9J99l29J01K25N2m61L49n7K7n6J37K33k77J1Q3j24L65l34o8
$$ plain form
2587 97 551 397 -122 191 45 -126 -16 306 117 -335 100 -126 38 284 245 160 367 348 277 -24 105 50
2609 50 177 73 -53 -28 59 -143 -1 -11 238 54 -61 296 -25 63 210 340 265 160 221 90 -323 78
2631 78 79 -158 121 -56 -29 -11 49 -106 119 362 147 23 76 -2 5 29 -220 -62 128 163 -84 -151 190 -125
2655 -125 -86 105 50 224 183 329 -66 -203 -83 -147 -171 214 110 -39 1 141 -206 -263 14 75 21 129 244
2678 244 -369 -99 -116 -247 55 -13 -260 -51 -59 -308 -287 65 174 -216 -194 178 -268 -160 -208 -75 132 79 164
2701 164 -57 -298 -221 -239 -83 -55 43 -216 -136 -278 -244 -117 -213 -74 37 141 -201 -72 -175 -161 155 200 351
2724 351 -40 -84 -109 -506 -410 -262 -171 -213 -122 -221 -193 -50 -89 -212 343 350 131 7 -109 -99 -336 4 -11 -203
2748 -203 -266 -265 -390 -321 -469 -47 26 217 178 -137 -75 -251 -285 -50 -45 -133 -62 -152 -198 -280 -93 -36 17 -197 -38 -197
$$ packed form
2587I7M54j54n19L13j46j71J10L22j89m52M35k26J64K46l9q5K07j9p1l01J29n5
2609E0J27j04j26K5Q7k02J42j0K49j84j15L57l21Q8J47J30p5j05O1j31m13M01
2631G8Jk37K79j77K7J8O0j55K25K43k15j24N3p8PK4k49J58J90L5k47o7L41l15
2655a25L9J91n5J74m1J46l95j37J20o4k4L85j04j49M0J40l47n7K77O1n4J08J15
2678B44o13K70j7j31L02o8k47K09qk49K1L52J09l90K2L72m46J08m8J33K07n3Q5
2701A64k21k41P7j8J56K8R8k59Q0j42L4J27r6J39J11J04l42J29j03J4L16M5J51
2724C51l91m4k5l97R6J48R1m2R1r9K8J43l9j23N55Pk19j24j16J0k37L40j5j92
2748b03o3Jj25O9j48M22P3J91l9l15O2j76l4K35Nq8P1r0m6q2J87N7N3k14J59j59
$$ plain form
2774 -197 -343 -333 81 -511 -102 139 302 -223 -367 -123 -171 -53 1 237 -140 -100 -382 -434 -294 -192 -78 28
2796 28 -115 18 -144 -208 -338 -131 99 -30 9 -85 -297 -149 -356 -148 -148 90 111 0 -102 -210 -139 -87 63
2819 63 23 -128 197 -176 -335 -175 -145 17 -86 -101 34 -126 60 -314 -218 172 216 307 85 -187 -282 -278 -139
2842 -139 -207 -168 244 -240 -3 40 -320 -251 36 -53 -15 195 120 23 -74 209 57 -182 230 -139 -267 -365 -99
2865 -99 -296 -135 -33 -71 159 -167 -145 -149 -60 125 184 224 303 198 151 -29 -35 -116 23 -163 -85 -111 -33 -125 -378 -27
2891 -27 215 -14 157 120 -176 -35 -63 -16 114 -3 192 61 -188 -249 -250 181 31 189 236 47 77 -201 25
2914 25 -95 85 156 110 -10 -43 124 -44 -90 122 221 130 -146 -221 -206 63 -32 105 79 78 -23 -57 -138 7 118
2939 118 87 182 207 201 152 25 3 74 168 26 -36 -51 47 -110 215 -29 112 51 -23 73 117 129 141 88 195 412
$$ packed form
2774a97j46J0M14n92M09K41J63n25j44K44m8J18N4K36l77M0k82n2J40J02J14J06
2796B8j43J33j62o4j30K07K30j29L9r4k12J48k07K08%K38K1j11j02j08P1N2J50
2819F3m0j51L25l73j59J60L0J62j03j5J35j60J86l74R6L90M4R1k22k72r5MJ39
2842a39o8L9M12m84K37M3l60O9K87q9L8K10p5r7r7K83j52k39M12l69j28r8K66
2865i9j97J61J02l8K30l26K2mQ9J85N9M0P9j05m7j80oq1J39j86P8k6P8r2k53L51
2891b7K42k29J71l7k96J41k8M7J30j17J95j31k49o1jM31j50J58M7j89L0k78K26
2914B5j20J80P1m6j20l3J67j68m6K12R9r1k76p5J5K69r5J37k6jj01l4q1J45J11
2939A18l1R5K5om9j27k2P1R4j42o2j5R8j57L25k44J41o1p4R6M4J2J2n3J07K17
$$ plain form
2965 412 234 177 -167 157 164 -161 53 140 141 2 70 151 -120 -25 -40 -53 -95 12 -89 112 89 32 295 -13 151
2990 151 296 4 127 80 -135 -46 -14 11 232 57 54 -27 154 -90 -58 326 122 -69 174 186 125 124 291 160
3014 160 -196 17 -16 41 130 185 -121 27 191 118 -13 149 -213 117 391 -195 166 -47 56 -1 112 51
3036 51 -115 88 173 -64 -4 147 -33 -33 -25 65 -76 237 129 -68 47 -99 77 69 122 267 -172 -125 86 -49
3060 -49 165 64 65 -17 120 120 -90 -4 272 -152 -30 226 86 -47 -6 114 117 -2 161 68 -39 -10 24 -7 174
3085 174 26 -37 176 -163 113 199 74 -247 46 153 77 -33 216 87 -112 227 170 39 71 -19 216 71
3107 71 -65 72 6 -8 102 95 1 -82 54 158 109 39 -27 177 80 -91 -21 111 10 48 114 -19 35 56 41 -149
3133 -149 229 -66 -158 58 172 116 -92 252 35 -41 88 129 -159 -268 -144 -23 28 -20 158 -35 -180 145
$$ packed form
2965D12j78n7l44L24Pl25K14Q7Jj39O8Q1k71R5j5j3m2J07j01K01k3n7K63l08J64
2990A51J45k92J23m7k15Q9L2K5K21j75lq1J81k44L2L84k04j91K43J2o1jJ67j31
3014A60l56K13l3N7Q9N5l06J48J64p3j31J62l62L30K74n86L61k13J03n7J13o1
3036E1j66K03Q5k37O0J51j80%QR0j41L13j08j97J15j46J76qN3J45m39M7K11j35
3060d9K14j01Jq2J37%k10Q6K76m24J22K56j40j33M1J20Lj19J63r3j07K9L4l1J81
3085A74j48o3K13l39K76Q6j25l21K93J07p6j10K49j29j99L39n7j31L2r0K35j45
3107G1j36J37o6j4J10pr4q3J36J04m9p0o6K04r7j71P0J32j01L8O6j33N4K1j5j90
3133a49L78k95r2K16J14n6k08L44k17p6J29M1k88j09J24J21N1m8J78j93j45L25
$$ plain form
3155 145 -44 80 61 -25 -62 -117 102 -172 33 -70 -351 187 -128 -78 126 163 -191 -99 70 66 -38 -53 -59 -48
3179 -48 20 -122 44 145 76 -62 142 188 97 -198 6 85 -37 177 -14 -160 -140 -1 172 174 95 -173 111
3202 111 -63 -57 -128 128 46 -37 -32 88 125 -88 -20 46 93 -105 71 -257 -397 -41 228 123 -12 -141 -39 -48
3226 -48 100 -168 3 182 37 52 69 56 -205 23 -120 47 56 -49 -83 -23 -94 157 -71 87 116 -211 -148 -123
3250 -123 109 192 -4 239 47 87 185 61 49 -183 -5 142 41 -24 -161 -141 10 -146 -136 223 -68 -109 -7
3273 -7 -8 -115 -121 174 271 55 163 -6 46 -42 -94 -74 49 28 -229 -225 -46 11 -74 -70 -147 161 232 142 215 -73 -107 18
3301 18 -43 26 -121 -79 -72 -70 -257 -147 39 100 241 79 29 86 -3 42 78 272 276 -158 152 -116 -14 142 -49
3326 -49 126 209 14 -207 28 -177 64 -199 195 -160 -135 -21 -30 -59 -189 -49 -47 -127 90 172 -213 -34 61 59
$$ packed form
3155A45j89J24j9q6l7n5K19k74K05j03k81N38l15N0K04L7l54R2J69mj04j5oJ1
3179d8O8j42J66J01o9j38K04M6r1k95K04P9j22K14j91j46K0J39J73Kp9k68K84
3202A11j74Op1K56q2q3NJ20L7k13O8O6M7j98J76l28j40L56K69j05j35j29J02r
3226d8J48k68J71J79j45J5J7j3k61K28j43J67Rj05l4O0p1K51k28J58K9l27O3K5
3250a23K32Q3j96K43j92M0R8j24j2k32J78J47j01o5j37K0J51j56J0L59k91m1J02
3273gjj07oK95R7k16J08j69N2q8n2K0J23k1k57MJ79N7q5Mp7L08P1r0P3k88l4J25
3301A8o1O9j47M2PKj87J10J86O1J41j62n0N7q9M5L6J94Mm34L10k68J02J56j91
3326d9J75Q3j95k21K35k05K41k63L94l55K5J14rk9j30J40Kq0K17Q2l85J79R5k
$$ plain form
3350 59 179 -23 -12 37 -147 89 43 -118 -127 -10 332 152 -8 -250 -115 101 231 32 -162 -62 252 109
3372 109 18 22 188 110 138 -227 -232 63 -89 41 -267 -113 -147 -75 -46 -18 89 -35 -15 -159 83 202 52 14
3396 14 -27 -100 106 -101 50 -97 -322 -37 -136 -89 -151 235 139 -31 -42 26 -28 -125 -101 222 123 231 89 -334
3420 -334 -273 -211 -197 8 -84 -131 132 -14 -199 227 -9 194 0 86 79 -232 106 20 26 -7 -84 -10 -179 -319 -200
3445 -200 -178 -40 -143 -9 -113 101 -135 246 65 202 -21 126 136 -25 -51 -58 -243 -158 63 -112 -3 -270
3467 -270 -231 -17 207 -29 226 168 73 279 26 -122 59 23 162 -177 -250 -47 -255 -188 -190 65 -196 -2 -63
3490 -63 88 -131 25 90 109 -18 -121 -228 -225 70 -267 -52 11 -25 -240 143 -113 -125 56 -21 8 124 168 -213
3514 -213 -11 -10 -18 -108 -91 -176 152 -144 22 -141 -59 142 -124 -22 -13 -319 163 318 50 85 99 12 -109 -197 19
$$ packed form
3350E9J20k02J1M9j84K36m6j61rJ17L42j80j60k42J35K16J30j99j94J00L14j43
3372A09r1MJ66p8K8l65nK95j52J30l08J54l4P2K9K8J07j24K0j44K42J19j50l8
3396A4m1p3K06k07J51j47k25K85r9M7o2L86r6j70j1O8n4r7K4L23r9J08j42m23
3420c34O1O2J4K05r2m7K63j46j85M26k36K03j94Q6pl11L38q6Ol3p7P4j69j40J19
3445b00K2J38j03J34j04K14k36L81j81J37k23J47J0j61k6pj85Q5K21j75J09k67
3467b70L9K14K24k36K55n8r5K06k53j48J81l6J39l39p3K03k08O7kK55k61J94o1
3490f3J51k19J56O5J9j27j03j07LK95l37K15O3l6k15L83k56j2J81p7K9J16M4l81
3514b13K02Jqr0J7q5L28k96J66j63Q2K01k66J02Rl06M82J55k68L5J4q7j21q8K16
$$ plain form
3539 19 -53 -213 -304 -38 4 68 31 62 20 1 146 37 128 391 68 224 129 -75 59 58 20 -274 -3 -288 4
3564 4 -255 -152 149 -84 119 115 32 150 249 -31 -74 167 58 -114 -183 -22 -45 -181 110 -20 -96 -33 -29 -9 -189
3589 -189 34 11 243 96 62 -17 6 -44 -101 90 76 3 -40 -150 -253 222 -217 -90 132 8 143 -190 1
3612 1 188 142 126 -66 47 150 -43 -86 -121 84 -15 -59 93 104 3 8 -181 182 -127 -122 -29 121 244 -148 -61
3637 -61 110 150 -95 175 115 17 217 -26 -37 102 120 208 -14 -215 -49 34 201 63 216 -9 -44 22 -40 -37
3661 -37 -56 146 -181 209 -68 -77 82 65 371 -114 97 144 -40 -138 60 17 77 -7 243 -28 -171 243 7
3684 7 -43 -58 317 309 48 25 81 207 -221 3 160 -116 -203 52 239 132 79 60 13 146 80 -110 74 119 104
3709 104 -50 -3 -115 -4 -36 12 -109 -164 -208 79 100 -123 77 -19 -220 -106 -109 147 -166 -133 153 16 25 6
$$ packed form
3539A9p2j60r1K66M2O4l7L1m2j9J45j09R1K63l23J56r5k04J34jl8k94K71k85K92
3564Dk59J03L01k33K03mq3J18R9k80m3K41j09j72o9J61k3j36K91j30p6O3MK0j80
3589a89K23k3K32j47l4p9K3n0n7J91j4p3m3j10j03M75m39J27K22j24J35l33J91
3612AJ87m6j6j92J13J03j93m3l5K05r9m4J52J1j01Nj89L63l09NR3J50J23l92Q7
3637f1J71M0k45K70o0r8K00k43j1J39J8Q8k22k01J66Q3J67j38J53k25l5O6o2L
3661c7j9K02l27L90k77rJ59j7L06m85K11M7j84r8J98m3O0q4K50k71j43M14k36
3684Gn0j5L75qk61k3N6J26m28K24J57k76q7K55J87j07n3j9m7J33o6j90J84M5j5
3709A04j54M7j12J11l2M8j21n5m4K87K1k23K00r6k01J14lK56l13L3K86j37Rj9
$$ plain form
3733 6 -30 -77 -97 -12 40 -24 -76 -138 -1 -156 81 41 -60 65 37 46 135 172 76 10 -191 14 -112 -18 -27 19 -43 -72
3761 -72 -35 57 109 36 -66 124 218 25 117 143 -68 -54 183 70 -59 -62 -12 213 160 27 121 31 82 47 -99 258
3787 258 19 -27 162 -57 -7 84 -210 142 23 -220 -67 -110 -57 157 151 56 -103 -131 -141 -67 -13 -246 71 47
3811 47 -81 -54 21 -17 -72 6 -48 242 52 -205 6 30 -146 -119 -139 -89 -45 -62 -1 -210 -170 -22 15 -193 -128 -237
3837 -237 -28 58 9 63 -228 -8 -30 67 54 -277 25 -176 41 190 -89 17 49 22 52 115 28 -231 -129 -32
3861 -32 -79 -29 -70 -84 -36 41 -193 -126 -137 69 -208 -129 -31 -46 14 -45 -1 -89 154 -17 -152 177 -22 -37 175 -3
3887 -3 -106 -98 -175 -400 146 33 -78 -74 -64 51 -25 -146 259 -61 -76 -49 203 98 -8 189 128 -143 -8 66
3911 66 -176 -76 -14 41 -52 -63 -138 -137 86 -37 -25 66 314 26 127 17 -384 -7 28 27 26 -143 -192 105 -221
$$ packed form
3733Fl6m7k0Q5N2o4n2o2J37j55K37m0j01J25k8RQ9L7r6o6k01K05j26R4rM6o2k9
3761g2L7R2N2p3j02J90R4j93R2K6k11J4K37j13j29lN0K25n3j33R4r0N1l5j46L57
3787B58k39m6J89k19N0R1k94L52j19k43J53m3N3K14or5j59k8j0P4N4k33L17k4
3811D7j28K7P5l8n5P8n4K90j90k57K11K4j76K7k0N0M4j7O1k09M0J48L7k08O5j09
3837b37K09Q6m9N4k91K20k2R7j3l31L02k01K17J49k79J06L2k7L0O3q7k59J02R7
3861c2m7N0m1j4M8P7k34O7j1K06k77P9R8j5O0n9M4q8K43j71j35L29j99j5K12j78
3887cj03Qp7k25N46j13j11MJ0J15p6j21M05l20j5K7K52j05j06J97o1k71J35P4
3911F6k42J00O2N5r3j1p5JK23j23J2R1K48k88J01j10m01L77L5jjj69m9K97l26
$$ plain form
3936 -221 -59 -138 122 -218 -107 60 -28 10 80 -125 229 140 20 -84 -21 3 -35 59 -149 -109 73 -184 -262 -9
3960 -9 -162 138 132 68 -80 -67 -45 118 34 190 184 136 -10 -74 -6 -149 107 -90 -132 -87 207 57 3 -96 107 199
3986 199 203 -67 -57 -148 -35 -136 140 237 155 41 117 -81 -209 106 -76 -19 -20 75 74 -276 -30 -21 10 -168 82
4011 82 154 180 -160 -18 67 -69 -50 -44 -182 -21 43 -150 -65 -130 108 -146 -88 23 59 101 4 121 -56 -114 201
4036 201 -86 -190 -59 224 -71 120 -72 -30 -21 106 -69 -144 -70 -157 160 0 -92 143 -160 -140 -198 -18 52
4059 52 9 104 103 -116 165 -77 59 200 -60 95 187 -8 -28 -65 -46 154 150 41 -14 68 127 143 -90 -92 -5 -52
4085 -52 20 -33 47 73 -129 224 12 -94 -140 -104 -2 -119 167 119 -120 -49 239 -93 58 231 -6 88 88 211
4109 211 70 3 -58 206 105 39 189 135 -212 148 51 276 51 -36 -133 -96 -40 57 173 -121 113 -83 150
$$ packed form
3936b21J62p9K60l40J11J67q8L8P0k05L54q9j20j04O3K4l8R4k08M0J82k57p8K53
3960ij53L00oo4j48J3K2J63q4J56om8j46o4O8j43K56j97m2M5K94j50n4r9K03R2
3986A99Mk70J0r1J13j01K76R7q2j14P6j98j28L15j82N7jR5jl50K46RL1j78K50
4011H2P2K6l40J42Q5j36J9Oj38J61O4j93Q5o5K38k54N8J11L6M2r7J17j77n8L15
4036B01k87j04J31K83k95J91j92M2RJ27j75p5P4q7L17j60r2K35l03K0n8J80P0
4059E2m3R5jk19K81k42J36J41k60J55R2j95k0l7J9K00mj09n5Q2N9J6k33kQ7m7
4085e2P2n3Q0K6k02L53k12j06m6L6J02j17K86m8k39P1K88l32J51J73k37R4%J23
4109B11j41o7o1K64j01o6J50n4l47L60r7K25k25q7r7L7N6R7J16k94K34j96K33
$$ plain form
4132 150 -42 173 39 15 -48 112 -30 -137 -117 76 -18 82 -86 -95 15 61 69 -4 -22 177 168 234 130 233 -185
4157 -185 21 -23 -23 193 65 35 77 -58 20 111 -96 -31 12 156 -13 -40 71 -13 21 -51 74 27 -37 -92 -98 55
4183 55 198 -108 148 -29 185 -99 94 111 19 89 -245 107 58 130 -105 -98 159 195 83 101 -60 -6 71 12
4207 12 -127 -216 -122 -115 -10 174 1 -127 -167 81 -7 -100 133 -19 -133 15 190 18 163 40 -62 -77 1
4230 1 94 -95 -332 -8 113 87 -54 -3 -45 -35 -10 -27 242 -77 -111 -24 36 123 98 31 -125 -130 -69 41 28 62 -150
4257 -150 -64 -65 -56 105 13 79 -144 -98 -2 -185 -132 -118 44 -41 -6 -6 -66 -239 108 40 -169 -84 43 -208 9 152
4283 152 8 -40 54 117 79 5 -65 -20 -68 -151 -106 29 -223 126 -94 114 52 81 -46 39 199 -2 84 171 4
4308 4 -272 -105 -143 -151 -72 67 136 -8 -368 -90 45 -172 69 21 23 85 -9 -15 140 -194 -47 -74 -18 9 138 83
$$ packed form
4132A50j92K15j34k4o3J60j42j07K0J93r4J00j68rJ10M6Qp3j8J99rO6j04J03m18
4157a85K06m4%K16j28l0M2j35P8R1k07O5M3J44j69k7J11q4L4p2J25m7o4n5oJ53
4183E5J43l06K56j77K14k84J93J7r2P0l34L52m9P2k35PK57L6j12J8j61N4P7n9
4207A2j39q9R4PJ05J84j73j28m0K48q8r3K33j52j14J48J75j72J45j23j02j5P8
4230AR3j89k37L24J21k6j41N1m2J0K5j7K69l19l4Q7O0Q7k5o7j56nO1J10j3L4k12
4257a50Q6jRJ61r2O6k23M6R6j83N3J4J62q5L5%o0j73L47o8k09Q5J27k51K17J43
4283A52j44m8R4O3l8p4p0M5m8q3M5J35k52L49k20K08o2K9j27Q5J60k01Q6Q7j67
4308Dk76J67l8qP9J39O9j44l60K78J35k17K41m8KO2r4oJ55l34J47k7N6K7J29n5
$$ plain form
4334 83 -9 -6 20 -24 -98 5 43 47 55 -81 -111 -112 -25 37 -20 80 62 -62 -34 -83 36 -49 -281 162 219 17 71 186
4362 186 -75 277 48 184 -5 -40 -104 123 109 -138 -3 70 94 -65 -210 -61 -38 95 -7 20 -36 -201 107
4385 107 -209 86 -79 5 -87 10 7 -169 160 -202 -167 -53 -85 -21 74 139 -19 83 42 -17 -46 92 -31 -14 -153
4410 -153 -286 -102 -33 21 105 8 -21 176 111 -137 34 96 146 -30 -136 72 18 69 -106 -64 -45 -6 23 77 12
4435 12 138 -46 18 92 49 126 36 161 -87 -24 -210 21 104 27 -53 -35 64 60 91 -118 71 94 -17 -36 48 205
4461 205 -101 -92 26 87 -110 -23 -264 -79 195 -46 -73 -15 -202 82 25 47 45 30 53 -34 6 80 48 120 -14 -18
4487 -18 138 128 -67 -91 48 -18 134 32 -180 140 -262 12 -94 234 54 -38 -171 305 121 -161 25 137
4509 137 91 -27 -63 166 -104 -103 37 160 -43 -142 -117 23 35 -59 129 25 14 -111 109 138 -132 -67 14 33
$$ packed form
4334H3r2LK6m4p4J03L8MQj36l0jQ7O2n7J00j8j24K8m9J19q5k32M43N7k02N4J15
4362A86k61L52k29J36j89l5o4K27j4k47J35P3K4j59j45J49K3J33j02K7n6j65L08
4385A07l16K95j65Q4r2R7lj76L29l62L5J14l2O4R5O5j58J02m1n9k9J38j23J7j39
4410a53j33J84O9N4Q4r7k9J97o5k48J71O2N0j76j06K08n4N1j75M2J9L9K9N4o5
4435A2J26j84O4P4m3P7r0J25k48O3j86K31Q3p7q0J8R9mL1k09J89K3j11j9Q4J57
4461B05l06RJ18O1j97Q7k41J85K74k41k7N8j87K84n7K2kj5K3q7M0P4l2P2j34m
4487a8J56j0j95k4J39o6J52j02k12L20m02K74j06L28j80r2j33M76j84k82J86J12
4509A37m6j18l6K29k70JJ40J23k03r9K5J40J2r4J88j04j1j25K20K9k70O5Q1J9
$$ plain form
4533 33 -67 -35 -22 -227 -150 72 -111 187 -107 -89 -31 175 58 -105 -305 -194 -68 102 -60 210 154 236 -183
4556 -183 64 24 -5 -135 -310 23 11 80 51 81 -42 124 -70 -237 -43 -40 50 77 -14 44 -126 124 72 107 5
4581 5 51 -56 81 -152 -48 210 220 -124 294 101 -85 -130 43 -91 -118 229 -157 -38 72 130 150 75 -61
4604 -61 38 -23 -90 -155 -112 184 134 5 140 149 90 -24 33 133 -42 -12 -41 -184 -87 250 115 82 -19 -126 -51
4629 -51 62 -60 -41 46 -84 -36 -19 -144 -93 307 -43 -50 -95 -2 -47 236 -27 -32 272 -59 26 -190 347 -45 113
4654 113 164 -95 263 -22 -21 44 -77 44 -129 -143 210 -45 17 94 15 162 -124 27 165 27 -9 0 -100 -60
4678 -60 79 -5 150 235 163 -4 -138 -154 -97 -151 6 -25 147 -207 -89 -176 20 108 -47 -25 -9 -46 -78 -13 224
4703 224 89 103 214 -92 -60 102 -111 -10 199 -89 24 -3 -3 26 -41 199 -172 -208 -152 -51 -133 48 -166
$$ packed form
4533C3j00L2J3k05P7K22j83K98k94J8N8K06j17j63k00J11J26J70j62K70n6Q2m19
4556a83K47m0k9j30j75L33j2O9k9L0j23J66j94j67J94LR0K7r1N8j70K50n2L5j02
4581EM6j07J37k33J04K58J0l44M18j93j86m5J73j34k7L47l86J19J10N8K0p5j36
4604f1R9o1o7o5M3K96n0j29J35Rn9j14N7J00j75L0k9j43R7L37j35l3j01j07P5
4629e1J13j22J9Q7j30M8J7j25N1M00l50pm5R3m5K83k63nL04l31Q5k16N37l92J58
4654A13N1k59L58k85JO5j21J21j73j4L53k55O2P7p9J47k86J51J38j38l6Rj00M0
4678f0J39q4J55Q5p2j67j34j6N7n4J57l1J72l54J18q7J96Q8j55K2J6l7l2O5K37
4703B24j35J4J11l06L2J62k13J01K09k88J13k7%K9o7K40l71l6N6J01q2J81k14
$$ plain form
4726 -166 -13 -177 67 30 280 83 90 -47 16 140 26 -37 268 164 -155 -38 -8 121 -112 -118 -85 -55 -150 152
4750 152 135 -120 -134 -105 -62 -115 -115 120 113 -15 -87 -60 191 -13 135 -116 -39 -195 -99 -194 -27 221 104 85 -135
4775 -135 -47 -85 105 -114 -31 37 143 -11 123 -123 -109 -31 79 -85 -118 53 103 48 242 -23 61 76 -46 -4
4799 -4 5 -95 164 170 49 39 120 18 -96 -103 19 93 55 -109 -41 -149 62 105 25 -115 100 47 39 -21 -30 -25 -2 -15
4827 -15 96 150 78 60 -19 107 109 52 105 -2 77 60 -18 61 -237 61 235 84 151 94 21 -138 2 110 1
4852 1 -84 182 27 -114 113 -4 9 15 215 139 195 39 46 163 47 125 -128 157 81 -4 137 82 84 104 42 -118
4878 -118 91 -139 58 -53 -232 -336 -54 -109 44 -9 172 -8 49 2 250 134 -58 -32 5 -6 -66 -43 54
4901 54 -5 26 -95 41 149 -192 -28 -72 37 73 -170 254 73 185 -77 84 -151 356 66 185 -108 -176
$$ packed form
4726a66J53j64K44l7K50j97Pj37O3J24j14o3L05j04l19J17L0J29k33oL3L0r5L02
4750A52j7k55j4K9M3n3%K35pj28p2K7K51k04J48k51P7j56R6r5J67K48j17j9k20
4775a35Q8l8J90k19Q3O8J06j54J34k46J4P8J10j64l3J71N0n5J94k65Q4J5j22M2
4799dRj00K59Oj21j0Q1j02j14pJ22P4l8j64O8j08K11M3q0j40K15n3qo0rNK3j3
4827a5J11N4p2j8p9J26Kn7N3j07P9j7p8P9k98K98J74j51O7n7p3j59J40J08j09
4852Aq5K66j55j41K27j17J3OK00p6N6j56PJ17j16P8k53K85p6q5J41n5KK0o2j60
4878a18K09k30J97j11j79j04K82n5J53n3J81j80N7m7K48j16j92K6L7j1o0K3R7
4901E4n9L1j21J36J08l41J64m4J09L6k43M24j81J12k62J61k35N07k90J19k93o8
$$ plain form
4923 -176 -86 -76 -12 47 -73 48 -196 -69 278 96 153 -55 98 9 136 -97 -8 -80 -99 -25 -22 -101 173 -95
4947 -95 -80 120 -102 2 13 145 151 -21 4 124 0 -55 40 -29 63 158 -103 129 -151 19 15 17 122 -190 147
4972 147 38 89 121 73 120 -7 101 30 57 -143 -34 -57 -179 -14 -10 -43 -99 33 60 48 -271 -165 43 -87
4996 -87 -151 363 -37 0 111 111 19 -107 124 215 16 39 -248 121 51 111 -109 139 -112 109 101 -146 -19 -70
5020 -70 -123 -133 -17 -73 154 -181 173 13 -130 12 49 151 15 -180 162 60 1 151 77 8 166 53 36
5043 36 -8 131 -132 -156 170 210 11 195 1 -210 0 14 -59 41 -294 18 106 -20 195 -85 -118 18 -6
5066 -6 -69 199 -27 -5 -58 -38 80 145 68 202 133 -91 8 -34 -117 -94 12 -120 -78 49 -14 -14 65 -48 146 91
5092 91 -38 -247 94 -19 19 -3 -20 18 -44 -48 -49 20 188 -195 -50 -28 -288 -328 -92 -53 56 4 81 -144 -79 163
$$ packed form
4923a76R0J0O4N9j20J21k44J27L47j82N7k08J53q9J27k33Q9p2j9P4Lp9K74k68
4947i5J5K00k22J04J1J32Oj72K5J20j24n5R5o9R2R5k61K32k80J70mKJ05l12L37
4972A47j09N1L2m8M7j27J08p1K7k00J09k3j22J65Ml3n6J32K7j2l19J06K08j30
4996h7o4N14m00L7J11%r2j26K31R1j99K3k87L69p0O0k20K48k51K21qk47J27n1
5020g0n3j0J16n6K27l35L54j60j43J42L7J02j36j95L42j02n9J50p4o9J58j13j7
5043C6m4J39k63k4L26M0j99J84j94k11K10J4p3J00l35L12Q8j26K15k80l3J36k4
5066fo3K68k26K2n3K0J18O5p7J34o9k24R9m2q3K3J06j32M2J27o3%P9j13J94n5
5092I1j29k09L41j13L8k2j7L8o2mjO9J68l83J45K2k60m0K36L9J09n2P7k25O5K42
$$ plain form
5118 163 -42 106 -20 -205 -17 142 -78 -76 -70 19 159 70 56 3 -7 19 -97 191 -41 32 -13 -63 -90 30 55
5143 55 98 -75 -17 -64 -276 77 -92 -154 28 -97 133 -87 -60 -113 -145 49 -106 -53 86 44 100 163 -43 70
5167 70 -88 -20 145 -174 -71 8 246 -131 -4 -17 27 -43 -68 192 -98 -70 35 14 146 -8 -55 -47 -64 -41 -60
5192 -60 -143 -40 -207 -53 -26 180 227 -63 149 -177 191 86 -72 74 110 60 -10 15 -21 -66 89 65 -67 83
5216 83 18 142 -82 152 179 -60 -185 -119 13 49 -28 143 289 85 154 201 38 125 -138 148 81 -110 -14 59
5240 59 -172 39 -115 -134 152 211 105 -17 -30 229 -164 -40 109 -20 -241 0 7 86 66 48 160 -187 92
5263 92 56 12 -31 101 41 213 106 -83 336 80 140 12 13 -63 -11 -221 -278 -68 -2 60 -75 149 -176 3
5287 3 -212 -12 3 -161 -100 34 -30 171 -2 -48 1 -64 164 -38 -190 33 168 -35 51 24 -52 61 53 53 118
$$ packed form
5118A63k05J48j26j85J88J59k20KOQ9J40q9j4n3j0K6j16K88k32P3m5n0k7J20K5
5143E5M3j73N8m7k12L53j69o2J82j25K30k20K7n3l2J94j55N3J39m2N6O3k06J13
5167G0j58O8J65l19J03P9K38l77J27j3M4p0k5K60k90K8J05k1J32j54m7Qj7K3j9
5192f0q3J03j67J54K7K06M7k90K12l26L68j05j58J46L6n0p0K5l6m5J55k4j32J50
5216H3o5J24k24K34K7k39j25O6J32L6p7J71J46k04O9M7j63Q7k63K86o7j91R6P3
5240E9k31K11j54j9K86N9j06j22j3K59l93J24J49j29k21K41PP9k0j8J12l47K79
5263I2l6m4m3J32o0J72j07j89M19k56O0j28Jp6N2k10n7K10O6O2j35K24l25J79
5287Ck15K00J5j64O1J34o4K01j73m6M9o5K28k02j52K23J35k03Q6k7p6J13q%O5
$$ plain form
5312 118 -18 -224 -160 -197 12 -78 -102 144 -22 199 77 79 217 104 58 -147 -46 47 211 -205 142 -202 -140
5335 -140 -14 -132 8 -3 98 6 -149 343 -115 94 -18 34 -113 6 116 -187 157 -97 215 45 -2
5356 -2 -81 -131 48 56 -188 -45 -110 58 -8 -38 -133 123 -39 -63 -154 -69 -40 -32 -104 -59 104 -20 -55 -14 100 -129 -135
5383 -135 -178 170 -6 -84 107 -29 -215 147 -128 70 37 -4 6 -2 -165 -150 89 42 -389 103 -146 144 56
5406 56 -60 193 40 202 -193 -23 -125 -18 16 -58 -81 43 10 -14 212 -47 -20 173 39 -3 106 4 -72
5429 -72 50 -112 -173 109 21 3 107 145 -109 -16 27 -96 152 -166 -41 96 -57 30 123 -82 -132 35 -95
5452 -95 92 -150 -79 47 -19 114 -146 -83 3 103 105 -30 -224 7 125 -87 -69 -65 -69 -5 49 99 88 180 89 160
5478 160 358 153 -313 -55 -83 123 16 -191 -154 -116 -35 -1 99 -124 -33 39 146 165 -156 85 106 45 105 135
$$ packed form
5312A18j36k06O4l7K09r0k4K46j66K21j22KJ38j13m6k05J01R3J64m16L47l44O2
5335a40J26j18J40j1J01r2j55M92m58K09j12N2j47J19J10l03L44k54L12j70m7
5356bp9n0J79Qk44J43o5J68o6l0r5K56j62k4r1Q5K9Qp2M5J63j24l5M1J14k29o
5383a35m3L48j76p8J91j36j86L62k75J98l3m1J0qj63J5K39m7m31M92k49K90q8
5406E6j16K53j53J62l95J70j02J07L4p4k3J24l3k4K26k59K7J93j34m2J09j02p6
5429g2J22j62o1K82q8j8J04L8k54R3M3j23K48l18J25J37j53Q7R3k05n0J67j30
5452i5J87k42P1J26o6J33k60O3Q6J00Kj35j94K31J18k12J8MmO4N4N0j1R2r1P1
5478A60J98k05m66K58k8K06j07k07L7L8Q1L4J00k23R1P2J07J9l21K41K1o1O0L0
$$ plain form
5502 135 -158 -179 10 -70 14 74 151 -9 147 72 149 17 -65 -128 63 -127 47 -28 -43 119 -52 183 -98 67
5526 67 -39 -46 -5 -13 -160 86 -73 -97 125 -260 65 -135 -169 14 78 205 101 52 55 -158 -96 -72 -16 225 195
5551 195 -185 -42 144 66 74 -4 150 55 31 67 -81 100 -1 306 38 24 -41 -71 -97 -24 7 -82 -149 78 159
5576 159 105 -79 -136 -207 44 -15 -165 219 -44 -173 52 -74 36 -155 123 -71 55 -1 116 96 -145 -5
5598 -5 -69 13 -15 -2 27 38 -233 7 -75 -22 83 99 -177 25 -28 8 138 9 -333 35 177 -245 -5 53 99
5623 99 26 50 129 54 5 -66 67 -39 120 -23 -38 -84 79 -50 0 105 -59 153 -136 -33 -2 -39 -73 84
5647 84 62 -26 -94 -58 -177 125 -50 70 193 44 30 39 -83 108 21 -74 48 112 -22 20 -2 -22 4 -12 89
5672 89 77 42 -12 -22 -188 -208 139 35 -90 55 160 -34 -23 36 55 -22 101 195 38 32 133 -6 -55 -166 -19
$$ packed form
5502A35k93k1J89q0Q4O0P7j60J56p5P7j32q2o3J91j90J74p5j5J62j71K35k81J65
5526F7j06pM1qj47K46j59k4K22l85L25k00l4J83O4J27j04m9Lk13O2K4N6K41l0
5551A95l80J43J86p8Qp8J54r5k4L6j48J81j01L07k68j4o5l0k6P3L1q9o7K27Q1
5576A59n4j84n7p1K51n9j50L84k63j29K25j26J10j91K78j94J26n6J17k0k41J40
5598eo4Q2k8J3K9J1k71K40q2N3J05J6k76K02n3L6J30j29l42L68J42m22K40N8M6
5623I9p3K4P9p5m9p1J33j06J59j43j5m6J63j29N0J05j64K12k89J03L1l7l4J57
5647H4k2q8o8L6j19L02j75J20J23j49j4Rj22J91q7r5J22O4j34M2k2k0K6j6J01
5672H9j2l5n4j0j66k0L47j04j25J45J05j94J1N9J9p7J23R4j57oJ01j39m9j11J47
$$ plain form
5697 -19 -33 -68 -127 -85 -49 44 -9 -8 16 -114 148 1 209 192 72 146 -66 86 -315 -87 28 -254 -68 -28 -135
5722 -135 12 44 -101 29 105 29 -45 220 -26 -133 84 -137 -46 30 163 19 -62 -13 -49 -132 -49 229 -82 120
5746 120 -143 -72 -92 -46 166 -48 -106 24 -73 136 29 10 -171 -65 81 -53 51 -104 64 93 -108 231
5768 231 164 -165 44 -103 123 -136 -57 200 -158 -74 -40 -48 -226 -30 -59 99 -10 -122 -17 73 115 79 37 139
5792 139 186 5 -242 74 208 185 128 9 69 14 53 -58 13 -17 140 -64 96 -191 119 85 -187 -44 -45 -151
5816 -151 276 -34 -160 -168 98 69 71 -3 -16 -126 -194 118 -95 157 93 61 28 63 50 -55 -28 -76 -139 198 125 -27
5842 -27 -59 132 154 -69 -13 -29 156 -33 -81 -101 -76 209 -5 -48 233 156 218 76 143 14 136 262 -206 -115
5866 -115 94 142 -121 47 -44 26 19 -72 137 -200 -40 -7 -84 146 14 -120 38 185 -182 -98 -64 51 159
$$ packed form
5697a9j4l5n9M2L6R3n3JK4j30K62j47K08j7j20P4k12J52m01K28J15k82J86M0j07
5722a35J47L2j45J30P6p6p4K65k46j07K17k21R1P6J33j44q1M9l6q3Q3K78l11K02
5746A20k63P1k0M6K12k14n8J30r7K09j07j9j81J06J46j34J04j55J68K9k01L39
5768B31o7l29K09j47K26k59P9K57l58Q4L4qj78J96k9J58j09j12J05R0M2l6m2J02
5792A39M7j81k47L16J34k3n7j19O0n5L9j11P1l0J57k04J60k87L10l4k72J43jj06
5816a51M27l10j26qK66k9Kp4j3j10o8L12k13K52o4l2l3L5j3j05K7m8o3L37p3j52
5842b7l2J91K2k23N6j6J85j89m8k0K5K85k14m3K81p7O2j42O7j29J22J26m68R1
5866a15K09M8k63J68r1P0pr1K09l37J60L3p7K30j32j34J58J47l67Q4L4J15J08
$$ plain form
5889 159 -113 -164 -93 94 -59 245 -128 -14 217 301 135 -38 43 -35 -111 -49 176 -219 -1 22 -206 76 -129
5912 -129 -137 92 -25 -5 59 -68 66 -77 -81 -88 -271 -48 4 48 -86 -115 -139 -269 -31 21 -44 -165 -198 154 156 42
5938 42 36 -5 -217 41 -68 220 196 90 -24 197 185 142 -158 56 80 115 -14 6 -113 -156 38 -101 111 -272
5962 -272 -29 157 68 -115 130 50 -304 -202 13 -75 -60 8 4 -24 230 -30 166 44 40 104 278 226 20 -210
5986 -210 -128 152 -269 -24 -39 28 -247 -75 -36 69 76 -46 167 -63 -94 53 -57 37 -85 149 -146 34 49
6009 49 122 -132 29 -117 174 -50 183 62 160 63 -1 253 -169 -50 -35 115 -35 70 270 -176 41 -10
6031 -10 -38 25 20 24 -141 -18 -61 -46 -54 -1 99 75 -64 84 214 -103 198 -19 -253 -45 103 -25 -102 84 12
6056 12 98 -9 30 124 -98 -48 -167 104 123 -91 -2 -25 29 -60 -79 -42 67 139 -95 234 -16 124 -73 16 29
$$ packed form
5889A59k72n1P1J87j53L04l73J14K31Q4j66j73Q1p8p6O2K25l95K18K3k28K82k05
5912a29qK29j17K0O4j27J34j43mpj83K23N2M4j34k9k4j30K38N2o5j21l3L52Kj14
5938D2om1k12K58j09K88k4j06j14K21j2m3l00K14K4L5j29K0j19m3J94j39K12l83
5962b72K43J86q9j83K45q0l54J02K15q8J5O8mk8K54k60J96j22mO4J74n2k06k30
5986b10Q2K80m21K45j5O7k75J72L9J05Pj22K13k30l1J47j10R4j22K34k95J80J5
6009D9P3k54J61j46K91k24K33j21R8r7o4K54m22J19J5J50j50J05K00m46K17n1
6031a0k8O3nMj65J23m3J5qN3J00k4j39J48J30l17L01k17k34K08J48j28p7J86p2
6056A2Q6j07L9R4k22N0j19K71J9k14Q9k3N4q9j9L7J09P2k34L29k50J40j97Q9J3
$$ plain form
6081 29 -49 152 -194 -219 -263 98 8 242 -33 199 -148 -26 273 191 -175 -115 -25 -158 53 -18 -76 -14 118 63
6105 63 -65 -95 77 -102 -135 -94 -30 -9 192 -25 6 79 -37 -187 -3 205 -64 -46 -192 105 -103 167 151
6128 151 -37 -137 -88 146 81 35 -157 256 167 40 -91 -35 -90 -26 -7 12 -173 -137 31 21 -99 -23 -64 111
6152 111 -14 -214 -112 38 250 -119 -89 18 -70 130 -4 -118 -51 -21 -78 -65 -19 -77 31 74 -83 -185 -137
6175 -137 203 -47 122 -24 -11 -27 79 105 81 -21 140 -98 120 -235 154 -17 124 -14 -134 -54 -141 -38
6197 -38 -97 31 209 66 -76 -26 69 188 32 11 -49 12 66 101 -5 55 -28 -84 9 150 -40 -15 103 46 -113
6222 -113 117 30 89 21 152 14 114 285 -44 -142 -11 32 -137 70 -155 -43 -266 46 189 38 -105 -69
6244 -69 34 -84 119 -22 119 -61 -46 -177 -124 143 140 20 -157 -63 -17 90 -63 -203 165 -38 95 -169
$$ packed form
6081B9p8K01l46k5m4L61r0K34k75K32l47J22K99q2l66O0R0j33K11p1n8O2J32n5
6105F3j28l0J72j79l3M1O4K1K01k17L1P3j16j50J84K08k69J8j46K97k08K70j6
6128A51j88j00M9K34o5m6j92M13q9j27j31N6n5O4J9J9j85L6J68j0j20P6m1J75
6152A11j25k00J02J50K12l69L0J07q8K00j34j14O7L0n7J3M6n8J08M3j57j02M8
6175a37L40k50J69j46J3j6J06K6k4j02J61k38K18l55L89j71J41j38j20Q0q7J03
6197c8n9J28J78j43j42N0R5J19j56k1o0O1N4L5j06O0q3n6R3J41j90K5J18n7j59
6222a13K30q7N9o8J31j38J00J71l29r8J31M3j69K07k25J12k23L12J43j51j43L6
6244f9J03j18K03j41J41j80J5j31N3K67lj20j77R4M6J07j53j40L68k03J33k64
$$ plain form
6266 -169 -70 3 104 116 38 25 127 -410 75 -162 88 -46 -26 -26 25 3 -79 41 -69 208 -63 -18 -13 -130 -44
6291 -44 -3 45 -87 105 -192 -126 110 103 -175 29 -153 57 -196 -70 -62 174 -33 117 136 -45 12 255 -25
6314 -25 -47 -37 11 -18 -46 28 135 -15 -48 -55 53 23 112 21 24 6 31 191 -82 -104 40 -147 300 250 142 -34
6340 -34 -16 45 36 -202 -147 131 -136 -107 -55 341 -121 115 -48 -62 1 109 -92 -125 -87 -45 85 81 -47 -151 13
6365 13 -108 -81 -203 83 -52 -71 43 38 25 13 98 100 -118 -50 -74 -170 -13 164 28 -173 -170 -255 50 -15 -47 -8
6391 -8 76 -51 141 227 106 -47 147 84 -100 6 81 -66 32 -86 -59 -79 179 15 -120 -1 -198 2 64
6414 64 16 -21 -170 -29 9 -164 -3 -47 -206 -81 88 125 -319 -196 24 -57 -30 165 113 -2 -137 -1 -180
6437 -180 -124 60 -227 -51 40 -97 8 -130 229 -58 -85 -73 224 123 164 139 145 106 -113 49 -183 -56 88
$$ packed form
6266a69R9P3J01J2p8j3J02n37M85k37K50j34K0%N1k2q2J20j10K77k71M5Nj17Q6
6291d4M1M8j32J92k97O6K36pk78K04j82K10k53J26QK36k07J50J9j81N7K43k80
6314b5k2J0M8k9k8P4J07j50l3pJ08l0Q9r1Lj8K5J60k73k2J44j87M47n0j08j76
6340c4J8O1rk38N5K78k67K9N2L96m62K36j63j4O3J08k01l3L8M2J30mj28j04J64
6365A3j21K7j22K86j35j9J14nj3j2Q5Kk18O8k4r6J57J77j36k01Lq5L05o5l2L9
6391hQ4j27J92Q6j21j53J94o3j84J06P5j47R8j18K7k0K58j64j35J19j97K00O2
6414F4m8l7j49J41L8j73J61m4j59J25J69L7m44J23K20q1K7J95n2j15j35J36j79
6437a80N6J84k87J76R1j37J05j38L59k87k7J2K97j01M1k5Ol9k19J62k32J27J44
$$ plain form
6460 88 39 42 34 15 -10 61 80 -251 -124 -83 -22 -56 -22 55 16 -55 57 -158 -204 192 126 88 -193 -160 -129 129 78 -2
6488 -2 155 -41 -70 159 142 -63 -115 -91 14 -32 32 41 190 84 148 175 29 94 -17 56 -128 210 -69 15 -106
6513 -106 -76 -18 42 -28 78 144 10 105 275 -23 -114 -85 170 -122 -141 -98 -50 114 -167 206 66 102 65 137 -25
6538 -25 -87 -45 118 -155 80 -51 -128 137 115 198 -38 4 -225 -79 249 64 -38 35 116 -245 225 113 -79
6561 -79 138 -203 8 240 82 -110 -27 191 -91 -18 -82 36 -135 -84 -57 -158 -18 -19 -43 -211 84 -24 -145
6584 -145 -49 -6 -26 -48 96 289 241 169 -186 96 -74 -47 -259 142 84 2 221 245 -53 -165 -203 4 -96 -156
6608 -156 -103 -132 -10 49 226 209 -119 -68 -8 -92 92 -232 -11 -8 -151 63 46 -309 45 22 39 -28 -56 194 20
6633 20 132 262 -162 56 34 -150 -77 -33 108 -39 -5 -122 300 -132 166 33 31 41 -68 81 41 102 55 208
$$ packed form
6460H8m9Lqj9k5P1J9l31J27M1O1l4L4P7l9p1J12k15m6L96o6l8k81L3L1K58n1q0
6488bJ57j96k9K29j7k05n2K4J05m6O4RJ49j06O4K7j46O5j11P3j84L38k79Q4j21
6513a06L0N8O0p0J06O6j34R5J70k98r1K9K55k92j9M3M8J64k81L73j40L6l7P2j62
6538b5o2M2J63k73K35j31p7K65k2Q3k36M2k29J46L28j85j02P3Q1l61M70j12j92
6561g9K17l41K11K32j58j92Q3K18k82P3o4J18j71N1K7j01J40jk4j68K95j08j21
6584a45R6M3k0k2J44J93m8p2l55K82j70K7k12M01n8q2K19K4k98j12l8K07j00o0
6608a56N3k9J22N9J77j7l28N1O0q4J84l24K21Lj43K14j7l55L54k3J7o7k8K50j74
6633B0J12J30m24K18k2j84P3M4J41j47L4j17M22m32K98j33kJ0j09J49m0O1m7J53
$$ plain form
6657 208 -62 148 62 56 41 199 28 -13 -7 -45 -168 -191 -139 106 -3 8 -26 -8 60 117 -53 -117 23 168 -86
6682 -86 -52 -101 -109 -29 -4 -161 -47 105 -49 -207 158 30 86 40 5 49 -15 0 220 -31 4 -169 136 -137 -89
6707 -89 -125 27 -12 107 10 59 102 -90 120 -101 -110 74 -41 31 -80 -77 -12 24 -64 74 -1 151 68 -197 95
6732 95 -209 -72 -122 93 58 129 75 -52 44 -82 36 84 -143 -42 -14 -4 323 49 24 125 78 188 250 -80
6756 -80 -10 -77 -121 68 -32 -20 206 -88 92 -152 225 -95 -288 -11 -174 57 -126 -41 50 -86 124 -128
6778 -128 -109 -48 93 -79 -143 -154 36 65 -122 60 31 -59 -104 36 -94 -26 -94 80 69 -1 -229 22 83 -42
6802 -42 -44 -42 -213 191 87 3 -115 -97 71 -82 38 103 -65 44 13 -227 -108 -78 -125 -64 172 -111 26 -239
6826 -239 138 -105 -59 85 -69 77 -30 154 10 117 -51 -70 232 -89 -184 -76 -66 -47 -218 66 57 -327
$$ packed form
6657B08k70K10q6oj5J58j71m1Ol8j23k3N2K45j09J1l4J8O8N7j70o4J40J45k54
6682h6L4m9qQ0K5j57J14J52j54j58L65j28N6m6l5M4o4J5K20k51L5j73L05k73M8
6707h9l6J52l9J19r7M9M3j92K10k21rJ84j15P2j11LO5L6q8J38p5J52q3k65K92
6732I5l04J37n0K15l5P1n4j27R6j26J18M8k27J01K8J0L27k74k5J01m7J10O2l30
6756h0P0o7m4J89j00J2K26k94J80k44L77l20j93K77j63K31j83Q5R1j36K10k52
6778a28J9O1J41j72o4j1J90K9j87J82k9r0m5J40j30O8o8J74j1p0k28K51O1j25
6802d2kKj71M04j04q4j18J8J68j53J20O5j68J09l1k40J19L0m7O1K36k83J37k65
6826b39L77k43M6J44j54J46j07J84j44J07j68j9L02l21r5J08J0J9j71K84rl84
$$ plain form
6848 -327 45 82 85 199 -77 -56 -94 172 67 -60 -64 31 175 -62 132 59 73 62 148 117 39 -58 -44 -145 115
6873 115 -121 -180 -42 81 105 -112 -159 320 -73 -48 9 128 -166 -29 36 -141 52 104 52 105 252 225 129 7
6897 7 94 -158 28 25 -49 -3 152 -108 187 169 151 20 -58 109 -125 -29 287 183 -49 -237 97 14 78 40 19
6922 19 -63 60 13 -101 -19 56 -128 178 183 158 23 134 64 -38 -152 133 -250 159 171 58 12 71 39 -104
6946 -104 -170 85 -48 9 140 -78 152 -76 159 -99 52 -44 89 11 251 -38 -75 -135 106 30 -29 -126 14
6969 14 221 33 -9 21 -30 -81 -9 243 126 -14 77 -190 -82 -66 -171 47 51 -19 -114 -90 -88 -23 196 41 -83
6994 -83 -95 202 -77 21 -195 -123 -22 223 73 -31 -145 -143 -8 -167 -229 66 8 60 -1 -4 104 -148 -61 165
7018 165 57 -162 26 20 84 348 81 149 -10 -78 -135 11 206 163 27 59 -37 -55 158 -187 48 94 -190 255
$$ packed form
6848c27L72L7LJ14k76K1l8K66j05j27mR5J44k37J94p3J4j1Q6l1p8r7J4j01K60
6873A15k36n9J38J23K4k17m7M79l93K5N7J19k94J37O5j77J93N2n2N3J47k7r6j22
6897GQ7k52J86lp4M6J55k60K95j8j8j31p8J67k34R6L16j04k32j88L34q3O4l8k1
6922A9q2J23m7j14Q2P5j84L06Nk5j35J11p0j02j14K85l83M09J2j13m6N9l2j43
6946a04o6K55j33N7J31k18K30k28K35k58J51r6J33p8K40k89l7o0K41p6n9r7J40
6969A4K07j88m2L0n1n1P2K52j17j40R1k67J08J6j05K18Mp0r5K4KO5K19j55j24
6994h3j2K97k79R8k16P2J01K45j50j04j14KJ35j59o2K95n8N2o1lJ08k52Q7K26
7018A65j08k19J88oO4K64k67O8j59o8n7J46J95m3j36L2r6j8K13l45K35M6k84M45
$$ plain form
7042 255 -196 110 141 -74 27 73 -159 41 223 82 -192 52 128 -85 11 -65 -14 -2 -23 32 -25 89 85 71
7066 71 -82 93 117 149 14 6 50 -115 -3 99 98 178 -128 -19 -19 246 -9 -49 8 -70 145 -6 214 127 -91
7091 -91 -118 135 -52 35 65 -31 -146 25 -47 -133 101 156 -100 75 -72 153 -3 82 55 92 77 22 -49 -191 131
7116 131 -134 42 -65 92 19 149 253 173 23 -64 21 -167 78 -86 110 13 120 -86 20 60 42 -35 130
7139 130 -82 131 34 -13 171 63 50 -2 136 55 -86 -46 37 -21 -2 -111 -91 121 -95 32 184 76 81 -2
7163 -2 -64 -58 -37 5 116 -142 -3 -102 -5 -128 135 -46 -70 41 -50 -116 127 -35 21 32 -71 6 -47 -25 -25 136
7189 136 190 76 -99 164 -9 60 -88 9 -228 -9 -8 107 165 -39 279 114 142 -276 -186 -8 -70 164 143
7212 143 -32 94 -84 -244 42 251 -182 6 127 9 -31 38 -7 182 -131 196 82 113 174 113 -111 20
$$ packed form
7042B55m51L06L1k15J01M6k32K00J82j41k74K44P6k13R6p6N1J2k1N5n7J14mj4
7066G1j53J75K4L2j35qM4j65J12J02jQ0l06J09%K65k55m0N7p8K15j51K20q7k18
7091i1k7K53j87Q7L0r6j15J71p2q6K34N5k56J75j47K25j56Q5k7L7j5n5p1j42L22
7116A31k65J76j07J57p3J30J04q0j50q7Q5j88K45j64J96r7J07k06J06M0j8p7J65
7139A30k12K13r7m7J84j08j3n2J38q1j41M0Q3n8J9j09K0K12k16J27J52j08Nq3
7163bo2OK1M2J11k58J39r9R7j23K63j81k4J11r1o6K43j62N6J1j03P7n3K2%J61
7189A36N4j14j75K63j73O9j48R7k37K19JJ15N8k04L18j65K8m18R0J78o2K34k1
7212A43j75J26j78j60K86K09m33J88J21j18m0O9m5J89l13L27j14L1O1o1k24J31
$$ plain form
7234 20 50 295 75 -8 94 46 -207 -2 56 184 41 -45 65 -130 -10 -15 -88 100 -302 -88 -231 -72 -5
7257 -5 -53 55 62 251 -59 -38 -66 77 54 37 66 -72 -202 76 56 24 -110 -58 38 -68 47 -111 25 30 43 15
7283 15 -68 -84 131 -49 51 -239 239 -38 -133 162 54 -79 -54 188 -2 3 151 57 -101 40 37 178 -117
7306 -117 62 -130 -30 -61 209 58 228 -165 -16 -209 -131 61 -240 100 210 -62 103 -103 -185 -117 -110 5
7328 5 -20 -34 -62 77 -59 -182 -83 89 10 124 53 263 117 19 -90 -216 38 5 294 -65 -68 -213 -22 6
7352 6 -80 198 -23 -144 28 -325 -73 185 158 -145 -19 98 50 -86 107 -37 113 159 2 38 142 239 53
7375 53 139 27 32 55 25 62 -156 251 84 -176 153 -62 174 -9 -88 -25 16 119 48 -105 79 -3 96 -19
7399 -19 44 99 -199 35 -61 -165 127 28 -149 7 42 218 75 190 -102 130 84 -74 38 -2 -47 71 121
$$ packed form
7234B0L0K45k20q3J02m8k53K05N8J28j43q6J10j95J20np3J88m02K14j43J59O7
7257em8J08PJ89l10K1k8J43k3j7K9j38j30K78k0l2j34N2R6j06J15j58J36NJ3k8
7283A5q3j6K15j80J00k90M78k77r5K95j08j33K5K42j90NJ48r4j58J41lJ41k95
7306a17J79j92J00l1K70j51J70l93J49j93P8J92l01L40J10k72J65k06q2O8PJ15
7328Ek5j4k8J39j36j23R9J72p9J14p1K10j46r8j09j26K54l3K89l59lj45J91K8
7352Fq6K78k21j21J72l53K52K58k7l03J26J17m8j36J93j44J50M6j57L6J04R7j86
7375E3Q6j12NK3l0L7k18M07j67k60L29k15K36j83p9O3M1J03p1j53J84q2R9j15
7399a9O3N5k98K34r6j04K92r9j77J56L5J76j43J15k92K32m6j58J12m0m5J18N0
$$ plain form
7422 121 62 44 104 108 -170 91 29 86 24 61 -27 -83 1 -138 -71 -59 -155 263 -118 -18 96 -70 -120 115 -92
7447 -92 254 -51 -13 39 -3 156 98 148 -18 -148 -137 -41 -59 239 -103 -5 -5 -89 103 10 104 14 -3 -126 -99 -101 38
7474 38 -35 44 108 -59 -152 -92 26 60 -28 128 123 -170 33 226 -181 -126 -40 122 -8 61 388 149 -90 239
7498 239 108 171 12 -11 101 74 -12 -263 -12 62 4 174 -113 -25 -121 -19 -2 -138 179 190 -88 -144 125 74
7522 74 34 83 -62 -131 58 -150 -44 -29 -81 -46 134 115 38 -17 -40 -61 124 112 -124 59 107 53 79 108 -30 116
7548 116 -147 5 -7 -24 65 114 -28 -4 35 121 86 -52 -133 -4 -56 -88 -101 -89 -81 -106 113 118 191 -147 117 31 28
7575 28 193 134 59 -128 -209 -219 50 8 3 62 115 51 241 30 -72 38 -117 -124 -24 140 161 23 235 30 106
7600 106 -22 154 66 176 46 113 -103 209 9 296 -209 -311 70 87 -9 -158 63 73 7 -160 37 -35
$$ packed form
7422A21n9j8O0Mk78K61o2N7o2L7q8n6Q4j39O7J2r6M18l81J00J14j66n0K35k07
7447i2L46l05L8N2m2J59n8N0j66j30J1R6j8K98l42R8%q4J92r3R4r0j7j23K7kJ39
7474C8p3P9O4j67r3O0J18L4q8J56nk93K03J93m07N5Q6J62j30O9L27k39k39L29
7498B39j31O3j59k3J12k7q6k51K51P4n8J70k87Q8r6J02J7j36L17J1k78n6K69n1
7522G4m0M9j45o9J89k08J06J5n2L5J80j9p7n5k3k1J85j2k36J83M8n4K6K9j38J46
7548A16k63J52j2j7Q9M9j42K4L9Q6l5j38q1J29n2l2j3J2Qk5K19NP3l38K64q6l
7575B8J65n9p5j87q1j0K69m2nN9N3o4J90k11j02J10j55pJ00J64K1j38K12k05P6
7600A06j28J76q8J10j30O7k16L12k00K87n05j02L81J7r6j49K21J0o6j67J97p2
$$ plain form
7622 -35 -118 -138 74 212 153 116 -80 42 186 22 266 186 -69 -10 79 -15 119 79 -75 -18 111 45 243 103
7646 103 -170 53 298 -89 57 -126 0 255 -110 85 -79 -261 -30 55 -110 16 31 152 -152 24 68
7667 68 -286 187 -212 137 -165 3 112 -87 -191 -82 68 54 124 -27 -50 151 -71 50 65 -76 -88 -27
7689 -27 -43 13 24 -57 11 -38 -270 290 106 -201 40 91 179 -136 -164 102 78 78 188 -114 -22 -24 -122 143 159 -295
7715 -295 279 -7 94 -171 -73 93 161 11 143 59 134 -5 85 -253 -167 48 -17 -279 -181 139 -81 256 14
7738 14 89 60 -232 -36 -17 112 31 -92 -75 193 -104 216 150 -67 -88 155 -71 -12 68 42 6 35 0 10 241
7763 241 4 45 46 -225 25 25 -82 58 117 213 51 90 177 56 -156 -167 133 19 -97 -151 -7 180 72 -106
7787 -106 -151 -18 12 15 -111 -81 -206 -62 118 39 86 44 -88 -37 102 36 -71 0 -99 138 233 45 -25 -11 -65
$$ packed form
7622c5q3k0K12J38n9l7j96J22J44j64K44q0k55N9Q9r4J34m0j54N7J29o6J98j40
7646A03k73K23K45l87J46j83J26K55l65J95j64j82K31Q5j65J26J5J21l04J76M4
7667F8l54M73l99L49l02J68J09j99j04J09J50j4P0j51k3K01k22J21J5j41j2O1
7689b7j6N6J1q1O8m9k32N60j84l07K41N1Q8l15k8K66k4%J10l02R2kr8K65J6m54
7715b95N74k86J01k65R8J66O8j50J32q4P5j39R0l38Q6K15o5k62R8L20k20L37k42
7738A4P5k9k92J96J9J29q1j23J7K68k97L20o6k17k1K43k26N9Q0k6l6K9l5J0K31
7763B41k37M1Jk71K50%j07J40N9R6j62L9Q7j21k12j1L00j14j16n4J44J87j08j78
7787a06m5J33L0Lj26L0j25J44J80p9M7m2j32N1J39o6j07P1r9K37R5j88p0J4n4
$$ plain form
7812 -65 -109 -169 -32 -111 -76 16 -128 -42 96 -98 -79 -56 120 -210 -99 95 -198 -48 -84 -31 -10 -101 -39 -72 -107
7837 -107 -88 -60 -17 -54 102 76 -13 -191 13 -80 -52 -42 15 330 -221 -170 -57 178 -80 -74 -28 153 39 47 -17 -76
7863 -76 32 40 46 -80 28 35 202 23 131 -22 72 -93 -15 -37 53 73 -218 -93 103 -136 -51 -30 221 16 105
7888 105 54 -71 -94 72 58 84 30 44 -98 -48 -49 -148 217 -7 163 -41 106 -167 132 158 153 -49 159 -135
7912 -135 85 -85 17 151 128 -62 456 -31 -98 152 -5 -71 17 6 28 -151 251 116 75 86 -61 107 -142
7935 -142 27 -310 60 32 -72 -176 72 124 261 87 192 117 205 152 -6 -4 -50 98 -7 214 -121 -48 47
7958 47 -7 76 26 -116 77 -272 -98 217 -10 -132 -12 9 51 48 -130 56 37 81 -13 3 -92 242 -142 241
7982 241 -164 -168 6 -40 39 90 -21 -50 -21 -102 95 116 80 -69 -143 35 -157 -4 179 -110 -159 -32 -128 -38 153
$$ packed form
7812f5m4o0J37p9L5R2j44Q6J38j94J9K3J76l30J11J94k93J50l6N3K1r1O2l3l5
7837a07J9K8M3l7J56k6q9j78K04r3K8J0N7L15n51N1J13K35k58OM6J81j14Qo4n9
7863g6J08QOj26J08PJ67j79J08j53R4j65P8k2R0K0k91J25J96k39Q5K1K51k05Q9
7888A05n1j25k3J66j4K6n4J4j42N0jr9L65k24J70k04J47k73K99K6nk02K08k94
7912a35K20j70J02J34k3j90N18m87o7K50j57o6Q8j1K2j79M02j35m1J1j47J68k49
7935a42J69l37L70k8j04j04K48N2J37j74J05p5Q8n3j58Km6J48j05K21l35P3R5
7958D7n4Q3n0j42J93l49J74L15k27j22J20K1M2lj78J86j9M4r4J6r5L34l84L83
7982B41m05mJ74m6P9N1j11k9K9q1J97K1l6j49p4J78j92J53J83k89m9J27r6R0J91
$$ plain form
8007 153 -74 2 75 -119 91 182 -237 -41 -81 -41 97 72 81 -86 -59 -56 12 -37 167 24 87 49 46 132 -176 122
8033 122 46 -28 119 -195 35 161 42 206 -47 157 103 72 -180 -142 143 125 -142 108 -2 37 -14 -138 -251
8056 -251 -21 34 95 -167 -175 -63 124 88 -117 202 -126 -152 197 70 -145 -32 140 -45 -49 -117 -60 -59 11 -62 13
8081 13 34 254 94 -24 8 161 147 -33 -56 24 68 151 -62 -15 -204 78 -83 18 119 -45 82 -12 -32 85
8105 85 117 -94 -5 65 48 48 102 -44 -43 162 27 -131 10 -59 -14 48 24 19 -42 115 -43 95 87 18 -19 -5 -134
8132 -134 9 64 -167 15 -78 115 105 -110 93 7 206 -122 -4 71 63 -71 51 -24 113 171 -135 -101 6
8155 6 -96 -119 -18 -53 -56 -101 -122 51 -174 23 91 22 38 -70 37 102 -94 115 49 -11 278 56 -77 -69 110
8180 110 38 35 -20 196 -77 4 -13 -136 -158 6 -85
$$ packed form
8007A53k27P6P3j94K10R1m19J96m0M0J38k5Rj67K7LO8m9K04j43O3l8lQ6l08K98
8033A22p6p4J47l14K30J26j19J64k53K04n4l1k52L8K85j8k67K50j10L9n1j24j13
8056b51K30N5O1k62qJ12J87l6k05L19l28k6L49j27k15J13J72j85mo8N7JP0p3P5
8081A3K1K20j60j18L2J53j4j80k3Q0M4Q3k13M7j89K82j61J01J01j64J27r4k0J17
8105H5L2k11Q9P0j7%N4j46JK05j35j58J41o9M5O2k4no1J57j58J38qo9l7J4j29
8132a34J43N5k31J82r3J93j0k15K03q6J99l28J18P5qj34J22p5J37N8l06L4J07
8155Fj02k3J01l5lm5k1J73k25J97O8o9J6j08J07O5j96K09o6o0K89k22j33QJ79
8180A10p2ln5K16k73Q1j7j23k2J64r1
8191h5
$$ Imaginary data points
##PAGE= N=2
##DATA TABLE= (X++(I..I)), XYDATA
$$ plain form
0 0 0 0 0 0 0 0 0 0 0 0 0 0 0 -8 8 -8 8 -8 16 -16 18 -24 28 -32 40 -47 52 -62 71 -80 91 -105 119 -135 152
35 152 -171 192 -215 240 -268 299 -331 369 -407 450 -497 550 -605 667 -735 809 -893 984
53 984 -1087 1199 -1329 1474 -1643 1839 -2069 2344 -2682 3111 -3667 4428 -5534 7297 -10565
68 -10565 18682 -87246 -86897 18657 -85797 -44887 63817 32024 -42831 35073 72386 26835
80 26835 28060 62127 21491 -22873 -47800 -64104 -57940 -44655 -56465 -24853 10103 -27859 -47427
93 -47427 14078 18908 -17055 32616 74728 10986 -15354 18254 -15653 -55379 -9433 6684
105 6684 -28266 -13442 -2483 -47653 -42732 -2965 -20994 -16946 39848 23536 -26209 5340 21019
118 21019 -30395 -16273 41279 15377 -22145 3499 -2088 -44693 -35102 -6947 -9394 -3443 3618
$$ packed form
0@%%%%%%%%%%%%%qJ6j6J6j6K4l2L4m2N2o0P2q7R9j14J33j51J71j96K24k54K87
35A52l23L63m07M55n08N67o30P00p76Q57r47J047j155J272j402J544j702J877
53I84k071K286k528K803l117L482l908M413n026N793o778Q095r962J2831j7862
68a0565K9247j05928L49J05554j04454M0910J08704l1793p4855P7904L7313m5551
80B6835J225L4067m0636m4364k4927j6304O164J3285j1810L1612L4956l7962j9568
93d7427O1505M830l5963M9671M2112o3742k6340L3608l3907l9726M5946J6117
105F684l4950J4824J0959m5170M921L9767j8029M048N6794j6312m9745L1549J5679
118B1019n1414J4122N7552k5902l7522K5644n587m2605R591K8155k447N951P061
$$ plain form
131 3618 -9865 -7470 -4941 -24139 -6173 32602 11049 -9905 24304 13007 -41577 -18634 24141
144 24141 -11112 -24132 23669 8428 -44528 -23216 4078 -23932 -19036 21960 14391 -7224
156 -7224 5167 6712 -4436 7663 17044 11618 15694 6649 -20209 -21238 -13975 -30959 -25816 3880
170 3880 -2472 -18252 1894 8844 -7038 10013 34698 23629 19089 27905 5867 -16663 -7470
183 -7470 -11806 -28725 -13399 -3421 -24720 -23793 -2846 -9688 -9603 21356 30713 18292 26912 30214
197 30214 7441 1387 10398 -491 -9727 -3318 -12079 -27100 -22782 -18841 -20690 -5511 10849 9553
211 9553 14796 24971 16880 11265 22736 20516 7609 10151 7836 -12149 -20136 -14322 -17911 -18402
225 -18402 -4884 1020 -32 6302 9515 7453 14071 19531 14622 14341 15407 3140 -6429 -2677 -4509
$$ packed form
131C618j3483K395K529j9198J7966L8775k1553k0954L4209j1297n4584K2943M2775
144B4141l5253j3020M7801j5241n2956K1312K7294k8010M896M0996p569k1615
156g224J2391J545j1148J2099R381n426M076r045k6858j029P263j6984N143K9696
170C880o352j5780K0146O950j5882J7051K4685j1069m540Q816k2038k2530R193
183g470m336j6919J5326R978k1299R27K0947o842Q5L0959R357j2421Q620L302
197C0214k2773o054R011j0889r236O409q761j5021M318L941j849J5179J6360j296
211I553N243J0175q091n615J1471k220j2907K542k315j9985p987N814l589m91
225a8402J3518N904j052O334L213k062O618N460m909k81J066j2267r569L752j832
$$ plain form
240 -4509 -9600 -2194 3657 -1105 -1431 3929 1527 325 7188 8400 5089 6550 6117 363 1006 4938
256 4938 4797 6592 10609 8139 4397 4585 1542 -3063 -468 1027 -2982 -2609 1585 257 -1212 5567
272 5567 10645 10027 11132 13817 10990 5379 3364 1521 -983 -2972 -3030 -2388 -1963 -1316 704 4554 7529
289 7529 8811 10573 11406 8975 6090 4641 2251 349 23 165 -757 -708 853 1465 1851 3636 5597
306 5597 5758 4407 4721 5519 4594 2745 4051 5846 4636 3370 5003 4986 1920 164 971 183 -2344
323 -2344 -2577 -662 -408 -234 2962 6202 7418 8953 10276 10503 8769 6546 4216 1324 -2328 -4512
339 -4512 -5177 -6426 -6344 -3712 -902 386 3804 7751 9354 8423 9775 9928 6331 3197 3056 1031 -2662
356 -2662 -3348 -2737 -3113 -3130 -2005 -744 1495 2752 1939 3373 5183 3232 1983 4756 4406 937 2279
$$ packed form
240d509n091P406N851m762l26N360k402j202O863J212l311J461m33n754O43L932
256D938j41J795M017k470l742J88l043m605K595J495m009L73M194j328j469O779
272E567N078o18J105K685k827n611k015j843k504j989n8O42M25O47K020L850K975
289G529J282J762Q33k431k885j449k390j902l26J42r22M9J561O12L86J785J961
306E597J61j351L14P98r25j849J306J795j210j266J633j7l066j756Q07p88k527
323b344k33J915K54J74L196L240J216J535J323K27j734k223k330k892l652k184
339d512o65j249Q2K632K810J288L418L947J603r31J352J53l597l134j41k025l693
356b662o86O11l76j7J125J261K239J257q13J434J810j951j249K773l50l469J342
$$ plain form
373 2279 4318 826 -882 2441 404 -2417 608 1060 -3220 -2146 1156 -1520 -1886 2926 3130 752
389 752 3213 3948 732 1889 2813 231 684 2333 -1527 -3056 1024 -612 -3771 1885 3720 -1786
405 -1786 -955 3353 -1690 -3374 2297 1415 -1949 1948 2066 -3291 -894 2391 -1404 -180 5106 1189
421 1189 -2469 1590 -174 -4721 870 3107 -3344 -47 3830 -5139 -6397 2822 -863 -6465 3484
436 3484 6039 -4599 -2287 5674 -1116 -3422 6750 5352 -2344 1062 478 -7571 -5125 -1000 -5006
451 -5006 -2192 3075 -2888 -3975 3360 -353 -3838 7249 7917 -3612 772 5263 -8725 -10161 4017
466 4017 -211 -8276 4079 6805 -7333 -4166 5831 -1679 -3211 6891 2164 -5766 -1371 -4448
480 -4448 -10551 -1609 3328 -2606 3302 10128 -1996 -4922 6325 1099 -6265 4602 5031 -8619
$$ packed form
373B279K039l492j708L323k037k821L025M52m280J074L302k676l66M812K04k378
389G52K461P35l216J157R24k582M53J649l860j529M080j636l159N656J835n506
405a786Q31M308n043j684N671q82l364L897J18n357K397L285l795J224N286l917
421A189l658M059j764m547N591K237o451L297L877q969j258R219l685n602R949
436C484K555j0638K312P961o790k306J0172j398p696L406n84q049K446M125m006
451e006K814N267n963j087P335l713l485J1087O68j1529M384M491j3988j436J4178
466D017m228q065J2355K726j4138L167R997p510j532J0102m727p930M395l077
480d448o103Q942M937n934N908O826j2124k926J1247n226p364J0867M29j3650
$$ plain form
494 -8619 -6179 -1689 -10716 -7469 5836 1730 -95 10079 3259 -7879 2244 5183 -7692 244
508 244 11433 -5680 -12923 3247 -2196 -14669 3417 14986 -2057 -2255 10175 -2047 -13191
521 -13191 -611 3946 -4289 -297 2675 -3880 -4381 -3557 -4806 5054 9909 183 2535 10045 -6448
536 -6448 -15528 3357 4593 -11098 1040 13138 -7747 -13603 4959 539 -9752 7042 13111
549 13111 -3791 -3239 3617 -8044 -8564 6138 4215 -317 8646 3499 -9382 -2483 2036 -6866
563 -6866 -293 9545 -2293 -9154 -391 -5521 -11053 2653 9402 2527 7272 8522 -4513 -3680 4276
578 4276 -3464 -3017 10504 1051 -13607 -2503 -95 -15661 -5067 15006 4042 -4612 9745
591 9745 5324 -11662 -3030 8720 350 -112 7732 -242 -7792 -4077 -4539 -3458 5410 4706 -490
$$ packed form
494h619K440M490r027L247J3305m106j825J0174o820j1138J0123K939j2875P936
508B44J1189j7113p243J6170n443j2473J8086J1569j7043j98J2430j2222j1144
521a3191J2580M557q235L992K972o555n01Q24j249R860M855r726K352P510j6493
536f448r080J8885J236j5691J2138J2098k0885n856J8562m420j0291J6794O069
549A3111j6902N52O856j1661n20J4702j923m532Q963n147j2881O899M519q902
563f866O573R838j1838o861Q763n130n532J3706O749o875M745J250j3035Q33P956
578D276p740M47J3521r453j4658J1104K408j5566J0594K0073j0964q654J4357
591I745m421j6986Q632J1750q370m62P844p974p550L715m62J081Q868p04n196
$$ plain form
606 -490 3977 -137 -11301 -3603 6172 -2094 -426 11677 1744 -11083 -600 2839 -6889 1078
620 1078 12552 2259 -4412 2243 -3623 -9866 678 4584 -1211 3764 5047 -7406 -6676 2314
634 2314 -2895 -3043 9759 6961 -4556 -594 1944 -7485 -3692 6966 3274 -491 3504 -1778 -8749
649 -8749 -2753 -658 -2416 4323 7054 -1647 -2888 1008 -5241 -5521 5508 4651 -2150 1989 1633 -8547
665 -8547 -5817 2748 352 390 7477 3990 -4366 -1740 -1163 -5158 -295 4070 -521 -1933 -87 -5646
681 -5646 -7428 911 2535 -133 5828 6322 -2621 -3928 669 -2798 -3254 3855 2891 -2869 -1829 -2173
697 -2173 -6442 -3199 2309 663 907 3285 -1449 -5823 -2778 -1542 -2391 2287 4961 731 -237 809
713 809 -2656 -2456 2785 1644 -1429 230 -1968 -8116 -7102 -2547 -3022 -1304 3835 3452 -58 731
$$ packed form
606d90M467m114j1164P698R775q266J668J2103r933j2827J0483L439r728P967
620A078J1474j0293o671O655n866o243J0544L906n795M975J283j2453P30Q990
634B314n209j48J2802k798j1517L962K538r429L793J0658l692l765L995n282o971
649h749N996K095j758O739K731q701j241L896o249k80J1029q57o801M139l56j0180
665h547K730Q565k396L8P087l487q356K626N77l995M863M365m591j412J846n559
681e646j782Q339J624k668N961M94q943j307M597l467m56P109r64n760J040l44
697b173m269L243N508j646K44K378m734m374L045J236q49M678K674m230r68J046
713H09l465K00N241j141l073J659k198o148J014M555m75J718N139l83l510P89
$$ plain form
729 731 1488 -369 1121 2850 1029 -1135 -2453 -5683 -6921 -4483 -2825 -1128 1935 1827 -355 -144
745 -144 -111 -1993 -548 2393 552 -2305 -1164 -2267 -5194 -3655 475 964 778 1975 1274 -1215 -2581
762 -2581 -2312 -1905 -798 -1214 -2113 -1655 -2442 -3812 -2310 1036 1417 925 2396 1681 -1723 -2504 -1361 -1805
780 -1805 -1798 -737 -498 -1711 -2218 -1832 -1548 -1012 -96 697 372 -1054 -2101 -2183 -1990 -2264 -651 883 554
799 554 -399 192 580 -968 -676 703 193 -1447 -1850 -1999 -2715 -3196 -2146 -577 117 -30 293 637 242
818 242 -644 67 924 -55 -357 -131 -575 -2169 -1457 -606 -765 -681 392 -178 -953 -884 -645 -1148 -931 -229
838 -229 -132 -253 -256 62 425 635 362 1033 1366 486 -722 -212 -213 -1818 -1609 -290 -712 -1847 -244 112
858 112 -418 153 1123 851 964 1668 870 649 820 354 -535 279 186 -1192 -273 205 -1004 -797 886 76
$$ packed form
729G31P57j857J490J729j821k164j318l230j238K438J658J697L063j08k182K11
745a44L3j882J445K941j841k857J141j103k927J539M130M89j86J197p01k489j366
762b581K69M07J107m16q99M58p87j370J502L346L81m92J471p15l404p81J143m44
780a805PJ061K39j213n07L86K84N36R16P93l25j426j047q2J93k74J613J534l29
799E54r53N91L88j548K92J379n10j640m03j49p16m81J050J569O94j47L23L44l95
818B42q86P11Q57r79l02K26m44j594P12Q51j59Q4J073n70p75O9K39n03K17P02
838b29R7j21lL18L63K10k73O71L33q80j208N10jj605K09J319m22j135J603L56
858A12n30N71R70k72J13P04p98k21J71m66q89Q14r3j378R19M78j209K07J683q10
$$ plain form
878 76 -298 1815 1513 12 1407 2567 -96 -113 1730 80 -1362 335 836 -698 310 1658 728
895 728 1313 2581 1276 995 2268 654 -868 683 467 -1986 -431 974 -1030 -136 2886 2169 1078
912 1078 4062 3600 788 2509 3011 -471 -367 1795 -987 -2219 739 570 -1279 1446 2977 664
928 664 1937 3584 866 730 3341 1181 -327 2983 2353 -868 1396 3219 -91 737 3485 721
944 721 -1153 1926 -124 -2432 878 1908 -1118 1301 5102 1670 1254 5558 4173 985 4122 3692
960 3692 -1079 -584 942 -2840 -2827 1460 -156 -1023 3082 2920 255 3482 5084 1586 3254 5387
976 5387 990 -279 2397 -461 -2782 2325 2306 -1844 1473 3979 -1391 -962 4535 1686 -1229 4000
992 4000 3508 -2114 835 3379 -907 770 5572 1894 -224 3681 1471 -2909 689 2879 -1156
$$ packed form
878G6l74K113l02j501J395J160k663j7J843j650j442J697N01j534J008J348r30
895G28N85J268j305k81J273j614j522J551k16k453J555J405k004Q94L022p17j091
912A078K984m62k812J721N02l482J04K162k782j232K958j69j849K725J531k313
928F64J273J647k718j36K611k160j508L310o30l221K264J823l310Q28K748k764
944G21j874L079k050k308L310J030l026K419L801l432m16M304j385l188L137m30
960C692m771M95J526l782J3M287j616q67M105j62k665L227J602l498J668K133
976E387m397j269K676k858k321N107j9m150L317K506n370M29N497k849k915N229
992D000m92n622K949K544m286J677M802l678k118L905k210m380L598K190m035
$$ plain form
1007 -1156 589 3609 -630 -1302 2543 1288 561 4766 3884 -242 2253 2139 -3725 -1137 3517 -446
1023 -446 -1453 4409 1279 -3750 1823 4159 -1169 1747 7090 959 -2278 2509 310 -4326 517
1038 517 3388 -825 158 2559 -1487 -1351 2193 674 1092 5117 2015 -1985 1638 846 -3797 721
1054 721 5533 -380 -1294 3820 -641 -5690 391 2311 -2211 690 4219 -1515 -2622 2029 -55
1069 -55 -1198 4815 4633 -178 1760 1928 -3852 -2535 2210 -1042 -2491 2064 -795 -5628 -1842 798
1085 798 -2098 1230 5678 2321 179 2472 -32 -1654 1934 1706 -613 1310 -225 -6058 -4357
1100 -4357 -911 -4252 -2701 3921 1606 -2907 1163 2337 -2538 601 6187 2046 -246 2159 -1509
1115 -1509 -5935 -2499 -1377 -3494 -444 1507 -2615 -2789 -43 -1842 -1601 3527 3328 -337 1551 562
$$ packed form
1007a156J745L020m239o72L845j255p27M205q82m126K495j14n864K588M654l963
1023d46j007N862l130n029N573K336n328K916N343o131l237M787k199m636M843
1038E17K871m213R83K401m046J36L544j519M18M025l102m000L623p92m643M518
1054G21M812n913r14N114m461n049O081J920m522K901L529n734j107M651k084
1069e5j143O013j82m811J938J68n780J317M745l252j449M555k859m833L786K640
1085G98k896L328M448l357k142K293k504j622L588k28k319J923j535n833J701
1100d357L446l341J551O622k315m513M070J174m875L139N586m141k292K405l668
1115a509m426L436J122k117L050J951m122j74K746j799K41N128j99l665J888r89
$$ plain form
1131 562 -4533 -3355 413 -1568 -1323 2025 -353 -3574 -1571 -1430 -2690 424 2616 -480 -974 79
1147 79 -3734 -4067 523 425 -1210 2122 2203 -3206 -3144 -204 -2278 -2301 1739 669 -2822 -2085 -2055 -4329
1165 -4329 -1684 1697 460 819 2424 -840 -3319 -1701 -1208 -2538 -551 911 -2129 -2920 -2002 -3324
1181 -3324 -2465 902 1308 800 1774 -255 -3362 -2169 -673 -2347 -994 1445 -1435 -3881 -1973 -2227
1197 -2227 -4024 -635 2352 235 -1105 299 -1493 -3666 -1160 672 369 749 811 -865 -2125 -2648
1213 -2648 -2723 -1202 -59 -1782 -1975 -1179 -3069 -4585 -1388 1211 518 1240 3306 1298 -1058 -715 -690
1230 -690 -1544 -822 -302 -2110 -3221 -3857 -4312 -3073 -880 307 1045 2232 1422 -731 34 560 -365 288
1248 288 1451 -353 -2577 -2541 -2411 -3164 -1987 -12 128 -215 -404 -944 -1308 -783 -241 782 1504 398
$$ packed form
1131E62n095J178L768j981K45L348k378l221K003J41j260L114K192l096m94J053
1147G9l813l33M590r8j635L332Q1n409O2K940k074k3M040j070l491P37L0k274
1165d329K645L381j237L59J605l264k479J618M93j330J987J462l040p91R18j322
1181c324Q59L367M06n08R74k029l107J193J496j674J353K439k880k446J908k54
1197b227j797L389K987k117j340J404j792k173K506J832l03L80O2j676j260n23
1213b648p5J521J143j723j93P96j890j516L197K599o93P22K066k008k356L43K5
1230f90q54P22N20j808j111o36m55J239K193J187P38J187q10k153P65N26r25O53
1248B88J163j804k224L6J30p53J177J975J40l43j89n40l64N25N42J023P22j106
$$ plain form
1266 398 -586 -568 -777 -1949 -887 996 320 -879 -440 -939 -2583 -1861 -384 166 126 661 188 -716 -708
1285 -708 -614 102 753 861 332 119 -677 -1612 -999 -348 -382 -33 943 23 -1305 -861 -268 -672 260 1284
1305 1284 846 -68 -323 -311 -483 -202 425 667 793 -374 -808 -560 -388 -482 202 1270 1047 12 263
1324 263 275 -454 -226 512 288 215 181 -455 -752 -556 -27 190 961 1088 561 565 888 311 59 938 639 268
1346 268 493 53 -675 -370 271 -303 -58 754 337 73 315 642 246 943 1131 836 1351 1298 499 236
1366 236 902 212 -286 113 26 -1236 -813 70 -610 -254 1067 1228 1284 1942 1928 1249 1925 1563 492 369
1386 369 656 -964 -1416 -361 -922 -1159 425 782 -152 1024 1994 862 1115 1960 897 100 978 807
1404 807 -580 -46 590 -372 -153 984 356 256 1174 568 -285 910 762 -746 133 886 -111 -125 1501
$$ packed form
1266C98r84J8k09j172J062J883o76j199M39m99j644P22J477N50m0N35m73r04Q
1285g08R4P16O51J08n29k13p96r35O13O51l4L49R76r20j328M44N93m04R32J024
1305A284m38r14k55J2j72K81O27K42J26j167m34K48J72r4O84J068k23j035K51
1324B63J2p29K28P38k24p3l4o36k97J96N29K17P71J27n27ML23n77k52Q79k99l71
1346B68K25m40p28L05O41n74K45Q12m17k64K42L27l96O97J88k95N15n3p99k63
1366B36O66o90m98L99q7j262M23Q83o80L56J321J61N6O58j4o79O76l62j071j23
1386C69K87j620m52J055n61k37J584L57r34J176R70j132K53Q45j063p97Q78j71
1404H07j387N34O36r62K19J137o28j00R18o06q53J195j48j508Q79P53r97j4J626
$$ plain form
1423 1501 700 -56 1581 1308 271 714 1010 -513 -233 797 -104 -697 788 608 -706 589 1449
1440 1449 43 340 1598 400 -79 1024 278 -476 886 991 -496 614 1318 288 212 1346 107
1457 107 -821 815 271 -892 102 529 -963 -16 1653 272 -75 2266 1102 -585 1387 1283 -745
1474 -745 -192 1252 -626 -1116 480 -245 -960 920 1091 -336 673 1060 -506 -53 1232 -187 -542
1491 -542 1030 316 -1165 876 845 -498 715 1826 -380 -472 1548 -287 -1755 439 869 -1540 -340
1508 -340 1103 -942 -684 1245 462 -253 1618 1223 -249 472 703 -942 -127 999 -743 -587 708
1525 708 -909 -1851 383 375 -1129 787 1667 -726 -441 1509 -455 -807 1520 890 -920 196 682
1542 682 -1722 -927 1048 -254 -448 1479 102 -1518 421 733 -1186 127 1890 -436 -1075 487
$$ packed form
1423A501q01p56J637k73j037M43K96j523K80J030r01n93J485j80j314J295Q60
1440A449j406K97J258j198m79J103p46p54J362J05j487J110P04j030p6J134j239
1457A07r28J636n44j163R94M27j492R47J669j381l47K341j164j687J972j04k028
1474g45N53J444j878m90J596p25p15J880J71j427J009L87j566M53J285j419l55
1491e42J572p14j481K041l1j343J213J111k206r2K020j835j468K194M30k409J200
1508c40J443k045K58J929p83p15J871l95j472P21K31j645Q15J126j742J56J295
1525G08j617r42K234qj504J916Q80k393K85J950j964l52K327o30j810J116M86
1542F82k404P95J975j302j94J927j377j620J939L12j919J313J763k326o39J562
$$ plain form
1558 487 -559 -1660 750 1353 -136 907 1243 -799 -348 1073 -138 -603 1276 -116 -1903 -253
1574 -253 -423 -1899 -462 1295 4 22 1586 256 -1185 1000 1087 -309 522 1273 -634 -1150 -61
1591 -61 -917 -1196 906 608 -646 282 58 -1550 -411 1301 187 237 2081 524 -1254 420 543
1608 543 -718 122 1519 -30 -932 -119 -1498 -1956 -73 505 -66 1034 1034 -614 -266 1070 -260 289
1626 289 1808 725 -1027 -168 -511 -2091 -694 842 -163 -29 1447 -288 -1349 182 770 -252
1642 -252 890 1460 -380 -917 -64 -887 -838 897 735 325 721 403 -1294 -588 257 -494 170 1087 -262
1661 -262 -1081 -358 -634 -987 1007 1623 518 561 794 -994 -1557 161 410 -368 909 715 -1173 -1176 96
1680 96 -264 -18 1763 1312 29 48 -410 -1243 -830 351 391 333 205 -322 -962 -322 102 414 1581 1306
$$ packed form
1558D87j046j101K410O03j489J043L36k042M51J421j211m65J879j392j787J650
1574b53j70j476J437J757j291J8J564j330j441K185Q7j396Q31P51j907n16J089
1591f1q56k79K102k98j254R28k24j608J139J712j114N0J844j557j778J674J23
1608E43j261Q40J397j549r02Q13j379m58J883N78n71J100%j648L48J336j330N49
1626B89J519j083j752Q59l43j580J397J536j005J34J476j735j061J531N88j022
1642b52J142N70j840n37Q53q23M9J735j62m10L96l18j697P06Q45p51O64R17j349
1661b62q19P23k76l53J994O16j105M3K33j788n63J718K49p78J277j94j888lJ272
1680I6l60K46J781m51j283J9m58q33M13J181M0n8j28n27o40O40M24L12J167k75
$$ plain form
1700 1306 236 90 -80 -1210 -845 654 361 21 469 -82 -1599 -1102 -83 -146 405 1637 715 -200
1718 -200 -149 -228 -258 494 1643 808 369 -58 -945 -1392 -772 -411 -215 435 107 -668 -381 -160 -378 379 1713
1739 1713 1427 708 518 -82 -1026 -503 105 -36 -1 -246 -761 -1206 -864 -861 -146 904 1114 785 583 325
1759 325 -275 -208 770 489 402 378 -260 -1065 -1244 -828 -678 -286 577 178 -46 -300 -517 -356 151 780 705
1780 705 723 370 -666 -1034 -401 -433 -194 667 164 -506 -536 -256 -610 -229 601 452 109 -136 -421 -585 -707
1801 -707 -302 120 662 593 -69 -309 -320 -590 -263 217 178 12 -21 -556 -926 -827 -106 -160 201 484 189 -337
1823 -337 -358 -489 -608 -85 -2 -100 -433 -497 -866 -681 -162 165 254 391 320 -414 -568 -400 -520 -706 28 -169
1845 -169 -511 -606 -774 -672 -415 214 252 329 460 -16 -574 -156 -226 -454 28 -224 -845 -458 -281 -838 -603
$$ packed form
1700A306j070j46j70j130L65J499k93l40M48n51j517M97J019o3N51J232r22r15
1718b00N1p9l0P52J149q35m39m27q87m47O20L61J96O50l28p75K87K21k18P57J334
1739A713k86p19j90o00r44N23O08j41L5k45n15m45L42LP15J050K10l29k02k58
1759C25o00O7R78k81q7k4o38q05j79M16J50L92Q63l99k24k54k17J61N07O29p5
1780G05J8l53j036l68O33l2K39Q61n03o70l0K80l54L81Q30j49l43k45k85j64j22
1801g07M05M22N42o9o62k40j1k70L27M80l9j66l3n35l70R9P21n4L61K83k95n26
1823c37k1j31j19N23Q3r8l33o4l69J85N19L27Q9J37p1p34j54J68j20j86P34j97
1845a69l42r5j68J02K57O29L8P7J31m76n58M18p0k28M82k52o21L87J77n57K35
$$ plain form
1866 -603 -225 -129 -451 54 -22 -650 -345 11 -186 -2 367 383 -154 -128 -436 -692 -525 -275 -765 -749 -396 -814
1888 -814 -986 -183 3 -150 501 529 108 7 36 -344 -405 -189 -524 -775 -305 -666 -901 -385 -115 -381 -156
1909 -156 487 -301 -333 6 -350 -589 185 -9 -683 -173 60 -321 -513 343 17 -450 251 32 -745 -311
1929 -311 -366 -799 -737 -220 -250 -336 109 -85 -226 350 349 -17 119 547 -259 -473 44 -611 -681 -203 -201 -530 -162
1952 -162 152 -556 -316 251 -228 -297 521 206 -298 302 265 -552 -148 335 -214 -181 105 -250 -604 85 175
1973 175 -690 19 490 -341 -227 315 11 -211 231 160 -315 166 476 -244 -329 566 -103 -319 324 87 -155
1994 -155 -15 37 -501 -150 217 -430 -58 380 -32 -237 734 773 -172 513 450 2 -131 427 -81 -348 429
2015 429 88 -395 354 260 -235 91 621 274 32 549 63 -158 355 398 -175 414 493 -83 -26 651 50
$$ packed form
1866f03L78R6l22N05p6o28L05L56j97J84L69J6n37K6l08k56J67K50m90J6L53m18
1888h14j72Q03J86j53O51K8m21j01K9l80o1K16l35k51M70l61k35N16K70k66K25
1909a56O43p88l2L39l56k39P74j94o74N10K33l81j92Q56l26m67P01k19p77M34
1929c11n5m33O2N17l0q6M45j94j41N76jl66J36M28q06k14N17o55p0M78Kl29L68
1952a62L14p08K40N67m79o9Q18l15n04O00l7q17M04M83n49L3K86l55l54O89R0
1973A75q65P09M71q31J14N42l04k22M42p1m75M81L10p20q5Q95o69k16O43k37k42
1994a55J40N2n38L51L67o47L72M38m12k05R71L9r45O85o3m48j33N58n08k67P77
2015D29l41m83P49r4m95L26N30l47k42N17m86k21N13M3n73N89P9n76N7O77o01
$$ plain form
2036 50 -21 703 466 -83 111 431 -353 -82 740 -67 76 716 199 -301 486 304 109 203 640 -32 43
2057 43 706 283 -172 676 595 127 402 355 -77 -131 274 26 148 552 42 -147 409 609 88 694 1225
2078 1225 357 236 671 48 -398 119 190 -144 26 421 -313 -308 604 131 353 941 635 390 767 358 -181
2099 -181 358 741 461 153 759 63 -433 294 450 -62 221 735 -81 -291 280 112 63 899 984 115 986
2120 986 737 -157 313 583 308 -34 347 105 -500 -330 -129 -141 105 606 449 554 704 474 41 690
2140 690 770 470 532 363 -452 -271 -77 -537 82 703 348 -134 499 389 -431 275 850 439 400 542 272
2161 272 -276 -150 183 22 365 507 326 22 -245 -263 -108 537 269 365 543 384 -389 -169 243 -8 252
2182 252 704 126 -366 -80 -19 -559 21 635 479 365 207 -136 15 58 216 210 513 184 -583 -218 -222 -573
$$ packed form
2036E0p1P24k37n49J94L20p84K71Q22q07J43O40n17n00P87j82j95R4M37o72P5
2057D3O63m23m55Q48q1m68K75m7m32n4M05k48J22M04n10j89N56K00n21O06N31
2078A225q68j21M35o23m46N17P1l34J70L95p34NR12m73K22N88l06k45L77m09n39
2099a81N39L83k80l08O06o96m96P27J56n12K83N14q16k10N71j68m9Q36Q5q69Q71
2120I86k49q94M70K70k75l42L81k42o05J70K01j2K46N01j57J05J50k30m33O49
2140F90Q0l00O2j69q15J81J94m60O19O21l55m82O33j10q20P06N75m11l9J42k70
2161B72n48J26L33j61L43J42j81l04k67j8J55O45k68R6J78j59p73K20M12k51K60
2182B52M52n78m92K86O1n40N80O14j56j14j58l43J51M3J58oL03l29p67L65ml51
$$ plain form
2204 -573 -151 565 497 4 304 83 -482 -296 297 424 567 373 -90 -196 -256 -392 -551 282 166 -140 -198
2225 -198 -294 -637 -589 262 195 264 546 273 -179 64 177 -72 53 406 111 -620 -671 -695 -728 -483 -175 -12
2247 -12 -106 170 -466 -151 37 46 186 783 700 89 -380 -317 -645 -736 -143 -183 -487 -280 -502 -874 -547 -187 165
2270 165 476 414 465 38 -149 -103 -217 237 26 -190 -421 -758 -986 -731 -525 -309 105 40 92 -326 -416 -216
2292 -216 -98 141 150 -18 -404 -465 -711 -652 -294 -184 -109 274 -146 -574 -516 -410 -333 -257 420 28 -343 -348 -381 -464
2316 -464 -319 115 28 -4 -220 -430 -617 -460 -313 -208 -329 124 -245 -372 -266 -311 -350 285 93 -155 117
2337 117 -199 -791 -522 -272 -410 -296 -106 -99 -390 -553 -283 -238 -9 208 29 69 -295 -436 -492 -326 -84 -229
2359 -229 -143 -1 -361 -207 -307 -197 12 141 -66 96 157 -134 -372 -217 64 -84 161 18 -458 -564 -261
$$ packed form
2204e73M22P16o8m93L00k21n65J86N93J27J43j94m63j06o0j36j59Q33j16l06n8
2225a98r6l43M8Q51o7O9K82k73m52K43J13k49J25L53k95p31n1k4l3K45L08J63
2247a2r4K76o36L15J88RJ40N97q3o11m69O3l28r1N93m0l04K07k22l72L27L60L52
2270A65L11o2N1m27j87M6j14M54k11k16k31l37k28K55K06K16M14o5N2m18r0K00
2292b16J18K39Rj68l86o1k46N9L58J10P5L83m20m28N8J06P7P6O77l92l71nl3q3
2316d64J45M34q7l2k16k10j87J57J47J05j21M53l69j27J06m5l9O35j92k48K72
2337A17l16n92K69K50j38J14J90Pk91j63K70M5K29K17j79M0l64j41n6J66K42j45
2359b29Q6J42l60J54j00J10K09J29k07J62O1k91k38J55K81j48K45j43m76j06L03
$$ plain form
2380 -261 -465 -404 -172 -104 -226 -216 164 -47 -217 390 110 277 316 155 -287 -341 -305 -408 -442 3 -486 -501 -346
2403 -346 -370 -309 -138 222 260 88 183 44 14 -131 152 -106 -99 14 -412 -144 -138 -232 -170 -47 -142 111 81 75 -281
2428 -281 231 202 25 308 308 -246 -151 133 27 -151 -130 35 -241 -226 -10 -213 -210 -49 136 97 222 104 -120
2451 -120 83 201 -147 -3 132 -96 -218 60 306 -250 -30 88 -124 66 63 -213 -13 178 150 -35 369
2472 369 398 167 -135 303 74 91 116 -54 12 104 117 -27 224 346 120 96 175 270 137 241 101 10 131
2495 131 244 -245 54 224 -18 -35 137 144 -77 429 237 157 442 79 -136 38 179 22 -15 216 -107 -48
2517 -48 -38 142 -133 177 303 -93 60 392 168 -20 169 220 -162 398 235 -41 -140 65 -147 -69 21 -66
2539 -66 -149 141 288 287 249 504 386 223 334 168 -106 -120 213 -307 -32 -199 -283 45 151 81 -112 -30 296
$$ packed form
2380b61k04O1K32O8j22J0L80k11j70O07k80J67L9j61m42n4L6j03l4M45m89j5J55
2403c46k4O1J71L60L8j72R5j39l0j45K83k58PJ13m26K68Or4O2J23r5K53l0ol56
2428b81N12k9j77K83%n54R5K84j06j78K1J65k76J5K16k03LJ61J85l9J25j18k24
2451a20K03J18l48J44J35k28j22K78K46n56K20J18k12J90lk76K00J91k8j85M04
2472C69K9k31l02M38k29J7K5j70O6R2J3j44K51J22k26k4P9R5j33J04j40r1J21
2495A31J13m89K99J70k42j7J72Pk21N06j92q0K85l63k15J74J41j57l7K31l23N9
2517d8J0J80k75L10J26l96J53L32k24j88J89N1l82N60j63k76r9K05k12P8R0q7
2539f6q3K90J47jl8K55j18j63J11j66k74j4L33n20K75j67q4L28J06p0j93Q2L26
$$ plain form
2562 296 54 145 205 -33 305 442 117 -38 446 90 -142 221 95 -92 -54 171 -244 -173 275 -24 -31 224
2584 224 176 -89 137 451 -20 -63 523 90 42 382 126 -48 -194 28 -176 8 90 -155 -382 -7 62 -136
2606 -136 12 120 -63 53 388 85 86 -12 15 87 -5 -28 -151 88 32 -275 144 153 116 8 153 2 -43 91
2630 91 -6 169 181 31 -36 -90 0 -148 -196 126 -15 -187 -8 -44 -239 137 -45 -18 -66 134 107 30 25 60 -251
2655 -251 -89 236 70 -27 167 -76 -85 165 155 195 302 288 -182 -81 80 -219 -146 31 210 -51 30 165 -107
2678 -107 22 268 263 -64 78 -210 -83 -72 -167 -10 147 229 -31 -157 -138 -455 -202 69 34 21 147 191 -193
2701 -193 34 -36 -18 140 15 30 32 160 -151 79 138 254 -141 87 18 -366 -296 -74 -69 -95 -9 158 38 -78
2725 -78 -86 104 -238 410 197 385 -10 -71 -191 -326 -135 -183 182 71 -67 -290 34 62 185 282 279 286 -2 47
$$ packed form
2562B96k42R1O0k38L38J37l25j55M84l56k32L63j26j87L8K25m15P1M48k99pK55
2584B24m8k65K26L14m71m3N86m33m8L40k56j74j46K22k04J84Q2k45k27L75O9j98
2606a36J48J08j83J16L35l03Jr8K7P2r2k3j23K39n6l07M19Rl7j08J45j51m5J34
2630I1r7J75J2j50o7n4R0j48m8L22j41j72J79l6j95L76j82K7m8K00k7p7nL5l11
2655b51J62L25j66r7J94k43rK50j0M0J07j4m70J01J61k99P3J77J79k61Q1J35k72
2678a07J29K46nl27J42k88J27J1r5J57J57Q2k60j26J9l17K53K71l5j3J26M4l84
2701a93K27p0J8J58j25J5KJ28l11K30N9J16l95K28o9l84P0K22Nk6Q6J67j20j16
2725g8qJ90l42O48k13J88l95o1j20j35J91m8L65j11j38k23L24K8J23R7lPk88M9
$$ plain form
2749 47 -119 -59 66 -6 15 150 -41 -84 -268 -199 -145 117 183 291 -142 68 71 -158 11 306 -136 216 52
2772 52 -101 -322 -219 -16 49 222 275 -98 -23 -56 -184 -118 68 25 262 280 -13 -326 -74 189 -35 86 192
2795 192 272 -181 -50 -149 -75 -96 220 51 179 -60 -208 -52 46 136 184 214 56 -220 -104 -70 24 50 353 34
2819 34 133 72 93 -161 128 126 62 -212 -104 29 -243 -3 58 -140 160 105 160 82 -182 -150 11 -93 -30 169
2843 169 -35 265 -115 -84 -24 -187 -159 28 140 68 -261 -372 -138 -40 176 103 290 151 -140 94 -79 97
2865 97 264 -1 153 -168 -68 -373 -278 -202 116 -203 -139 147 -223 -124 -34 196 325 300 94 -59 -42 -21 -96
2888 -96 -45 97 -123 -163 83 -127 -6 -79 -83 -54 113 25 217 75 -9 159 55 108 165 -80 -94 -45 -83 -18 -126
2913 -126 -360 -148 -33 -222 -219 -49 5 88 124 273 47 226 83 -144 -156 -39 50 -129 -73 -10 -2 -11 -58 -158 -70
$$ packed form
2749D7j66O0J25p2K1J35j91m3j84O9N4K62O6J08m33K10Lk29J69K95m42L52j64
2772E2j53k21J03K03O5J73N3l73P5l3j28O6J86m3K37J8k93l13K52K63k24J21J06
2795A92Q0m53J31r9P4k1L16j69J28k39j48J56R8R0M8L0j58k76J16L4R4K6L03l19
2819C4R9o1K1k54K89ko4k74J08J33k72K40O1j98L00n5N5p8k64L2J61j04O3J99
2843A69k04L00l80L1O0j63K8J87J12p2l29j11K34R8K16p3J87j39k91K34j73J76
2865I7J67k65J54l21J00l05R5P6L18l19O4K86l70R9R0K30J29k5k06j53J7K1p5
2888i6N1J42k20m0K46k10J21p3mK9J67q8J92j42q4J68j04N3N7k45j4M9l8O5j08
2913a26k34K12J15j89LJ70N4Q3L6J49k26J79j43k27j2J17Q9j79N6O3Qrm7j00Q8
$$ plain form
2938 -70 58 181 -161 53 207 -54 -18 17 204 47 -93 46 -146 -44 -144 164 -85 -143 -241 -274 -116 -137
2960 -137 -59 -3 -49 178 -84 26 48 -324 -150 -97 -107 31 -8 -98 -35 -45 -189 -201 -89 93 -390 -237 -230 -145 -129
2985 -129 -52 -126 -3 -72 13 -40 69 -150 -39 214 115 12 97 -136 -288 -55 -64 44 -120 43 -48 142 143 -66
3009 -66 -157 -45 -44 -116 69 -221 -35 -124 101 -75 -287 -85 -22 -199 -213 -109 -86 -214 -23 -161 -162 -402 -78 -55
3033 -55 -7 20 20 -129 213 97 -175 -95 -2 -213 63 63 38 -27 61 17 -200 -25 88 -178 -56 -20 -9 -150 30
3058 30 -74 -86 -250 -47 79 -14 17 -53 -70 -131 -38 -3 22 -85 -94 -41 -20 -319 -170 125 80 98 -228 -137 -118 51
3084 51 -6 -351 -1 138 -43 -19 241 -178 -230 -82 -101 -67 -89 8 -316 -83 -54 -59 -138 101 -164 170 105 213
3108 213 126 236 64 42 -125 -99 -86 -261 -65 -82 -74 -54 -195 -11 113 253 121 105 198 -182 74 149 23 -3
$$ packed form
2938g0J28J23l42K14J54k61L6L5J87j57j40J39j92J02j00L08k49n8r8l3J58k1
2960a37P8N6m6K27k62J10K2l72J74N3j0J38l9r0O3j0j44j2J12J82m83J53PQ5J6
2985a29P7p4J23o9Q5n3J09k19J11K53r9j03Q5k33j52K33rJ08j64J63r1J90Jk09
3009f6r1J12Jp2J85k90J86q9K25j76k12K02O3j77j4J04K3j28J91j38jk40L24K3
3033e5M8K7%j49L42j16k72Q0R3k11K76%k5o5Q8m4k17J75J13k66J22L6J1j41J80
3058C0j04j2j64K03J26r3L1p0j7o1R3L5K5j07rN3K1k99J49K95m5J8l26R1J9J69
3084E1n7l45L50J39j81K4K60m19n2J48j9L4k2R7l24K33K9np9K39k65L34o5J08
3108B13q7J10j72k2j67K6J3j75J96j7QK0j41J84J24J40j32j6R3l80K56P5j26k6
$$ plain form
3132 -3 102 -34 -124 -4 107 -263 -217 -72 147 22 367 65 -173 -31 346 -38 104 142 -157 29 -174 -45
3154 -45 -62 79 126 -7 17 130 -265 -70 267 146 124 188 203 -10 194 203 166 229 253 190 -9 86 72 -66 -72 64
3180 64 141 -2 -30 17 14 134 95 192 347 375 -56 36 232 -90 44 48 -204 166 52 -178 138 -236 15 58
3204 58 -148 89 124 5 -1 73 -130 85 111 8 160 184 -6 -106 199 334 15 222 208 64 -123 14 69
3227 69 285 130 -98 68 24 -124 41 141 60 104 259 375 -117 68 93 336 -136 301 126 10 -100 65
3249 65 -69 41 -113 -31 113 -83 -65 2 130 -75 192 240 237 326 314 32 29 105 115 78 81 127 -20 26 27 100 41
3276 41 -119 122 107 129 85 122 -61 202 161 45 288 94 144 -298 14 -114 160 -91 153 -37 -230 -145 113
3299 113 258 -49 -66 -89 227 170 -144 -31 148 171 148 196 -188 -128 5 -106 191 27 -87 159 80 -263 71
$$ packed form
3132cJ05j36r0J20J11l70M6J45K19j25L45l02k38J42L77l84J42L8k99J86k03J29
3154d5j7J41M7j33K4J13l95J95L37j21k2O4J5k13K04Rl7O3K4o3j99R5j4j38oJ36
3180F4P7j43k8M7lJ20l9R7J55K8m31R2J96l22J34Mk52L70j14k30L16l74K51M3
3204E8k06K37L5j19oP4k03K15K6j03J52K4j90j00L05J35l19K07j4j44j87J37N5
3227F9K16j55k28J66m4j48J65J00q1M4J55J16m92J85K5K43m72M37j75j16j10J65
3249F5j34J10j54Q2J44j96J8O7J28k05K67M8lQ9j2k82lP6J0l7LM6j47M6JP3n9
3276D1j60K41j5K2m4L7j83K63m1j16K43j94N0m42L12j28K74k51K44j90j93Q5K58
3299A13J45l07j7k3L16n7l14J13J79K3k3M8l84O0J33j11K97j64j14K46p9l43L34
$$ plain form
3322 71 6 240 225 143 82 -33 -266 -74 -218 43 -1 -76 -30 -14 63 -114 -90 -135 66 236 191 -20 -107 -87 -136
3347 -136 2 -54 3 207 -182 186 -75 -154 -131 1 40 241 155 -32 -42 -14 -191 -17 119 -317 -313 -182 -87 225
3371 225 -310 -18 -83 134 -85 -145 325 150 -23 45 185 297 -105 -202 -100 -256 -244 107 -142 -4 195 69
3393 69 -17 -42 101 -81 82 146 232 170 -179 -33 -111 -79 -21 -168 -168 -304 -214 -78 33 -100 115 -77 -50 205
3417 205 -64 -54 134 143 -21 56 0 -234 -254 -193 -107 -19 -61 35 5 -108 -69 -157 100 57 -9 -22 83 44 44 -211 -49
3444 -49 2 47 -122 -233 -75 -158 -112 -149 -267 54 75 -13 -44 -30 54 -18 161 -102 211 -51 -149 -36 -250 42
3468 42 163 37 59 3 200 -174 -72 -36 -116 64 46 -23 -125 26 58 -24 -41 -144 90 -126 -112 -128 -114 118
3492 118 33 26 -73 -208 -239 -42 184 -10 -23 41 202 -77 41 153 -59 -167 -65 -107 147 -293 98 -2 -48
$$ packed form
3322G1o5K34j5q2o1j15k33J92j44K61m4p5M6J6P7j77K4m5K01J70m5k11q7K0m9
3347a36J38n6N7K04l89L68k61p9K3J32L9K01q6j87j0K8j77J74J36m36MJ31R5L12
3371B25n35K92o5K17k19o0M70j75j73O8J40J12m02r7J02j56J2L51k49J38J99j26
3393F9q6k5J43j82J63O4Q6o2l49J46p8L2N8j47%j36R0J36J11j33K15j92K7K55
3417B05k69J0J88Rj64P7n6k34k0O1Q6Q8m2R6l0j13L9q8K57m3o6j3J05l9%k55J62
3444d9N1M5j69j11J58q3M6l7j18L21K1q8l1J4Q4p2J79k63L13k62r8J13k14K92
3468D2J21j26K2n6J97l74J02L6q0J80j8o9j02J51L2q2j7j03K34k16J4j6J4K32
3492A18q5pr9j35l1J97K26j94j3O4J61k79J18J12k12j08J02m2K54m40L91j00m6
$$ plain form
3515 -48 31 12 145 15 78 -104 -47 -17 17 -18 -51 -41 34 -42 -202 -118 34 -84 -72 64 12 -184 -118 10 -79 44
3541 44 -36 -49 -62 -198 101 -182 27 153 -62 -300 48 29 28 17 45 64 -52 -90 -66 29 -68 19 -82 -120 19
3566 19 122 99 -31 -31 20 40 -121 181 -15 -41 228 -18 58 50 34 -8 90 -131 87 -64 76 19 149 122 -64
$$ packed form
3515d8P9j9J33j30O3j82N7L0L4l5l3J0P5p6j60Q4J52j18J2J36n2j96O6J28q9J23
3541D4q0j3j3j36K99k83K09J26k15k38L48j9jj1K8J9j16l8K4R5r7Q7j01l8J39
3566A9J03k3j30%N1K0j61L02j96k6K69k46P6qj6m2R8k21K18j51J40n7J30k7j86
$$ [...]
8191A26
##END NTUPLES=NMR FID
##END=
