##TITLE=1H_AM_NV169_7_12
 CDCl3
 8 sc, 
 2.10.2024
##JCAMPDX= 6.0         $$ Bruker NMR JCAMP-DX V2.0
##DATA TYPE= NMR FID
##DATA CLASS= NTUPLES
##ORIGIN= UXNMR, Bruker Analytische Messtechnik GmbH
##OWNER= root
$$ XWIN-NMR		Version 3.5
$$ Wed Oct  2 14:42:00 2024 Russian Standard Time (UT+4h)  she@DPX200
##.OBSERVE FREQUENCY= 200.1318
##.OBSERVE NUCLEUS= ^1H
##.DELAY= (6, 6)
##.ACQUISITION MODE= SIMULTANEOUS
##.ACQUISITION SCHEME= undefined
##.AVERAGES= 8
##.DIGITISER RES= 18
##SPECTROMETER/DATA SYSTEM= spect
##.PULSE SEQUENCE= zg30
##.SOLVENT NAME= DMSO
##.SHIFT REFERENCE= (INTERNAL, DMSO, 0, 15.7039)
##AUDIT TRAIL= $$ (NUMBER, WHEN, WHO, WHERE, WHAT)
$$ ##TITLE= Audit trail, XWIN-NMR		Version 3.5
$$ ##JCAMPDX= 5.01
$$ ##ORIGIN= Bruker BioSpin GmbH
$$ ##OWNER= she
$$ F:/spectra/data/she/nmr/H-F/1/audita.txt
$$ ##AUDIT TRAIL=  $$ (NUMBER, WHEN, WHO, WHERE, WHAT)
(   1,<2024-10-02 14:40:57.07 +0400>,<she>,<DPX200>,
      <created by zg, POWCHK disabled, PULCHK disabled
       configuration hash MD5:
       00 E9 B6 7A A2 85 ED C7 34 08 36 98 17 FE 4E 26
       data hash MD5: 16K
       27 D8 5A 01 73 6D CE E5 BB 5D 23 F6 DA CC 05 9D>)
$$ ##END=
$$ 
$$ hash MD5
$$ E5 E6 50 CE 79 8E 9C C6 F9 34 18 16 EC C7 80 9E
##$RELAX= 
##$RELAX= 
##$RELAX= 
##$RELAX= 
##$RELAX= 
##$RELAX= 
$$ Bruker specific parameters
$$ --------------------------
##$DU= <F:/spectra>
##$EXPNO= 1
##$NAME= <H-F>
##$PROCNO= 1
##$TYPE= <nmr>
##$USER= <she>
##$AMP= (0..31)
100 100 100 100 100 100 100 100 100 100 100 100 100 100 100 100 100 100 
100 100 100 100 100 100 100 100 100 100 100 100 100 100 
##$AQSEQ= 0
##$AQ_mod= 1
##$AUNM= <au_zg>
##$AUTOPOS= <>
##$BF1= 200.13
##$BF2= 200.13
##$BF3= 200.13
##$BF4= 200.13
##$BF5= 200.13
##$BF6= 200.13
##$BF7= 200.13
##$BF8= 200.13
##$BYTORDA= 1
##$CFDGTYP= 0
##$CFRGTYP= 5
##$CHEMSTR= <none>
##$CNST= (0..31)
1 1 145 1 1 1 1 1 1 1 1 1 1 1 1 1 1 1 1 1 1 1 1 1 1 1 1 1 1 1 1 1 
##$CPDPRG= <>
##$CPDPRG1= <>
##$CPDPRG2= <>
##$CPDPRG3= <>
##$CPDPRG4= <mlev>
##$CPDPRG5= <mlev>
##$CPDPRG6= <mlev>
##$CPDPRG7= <mlev>
##$CPDPRG8= <mlev>
##$CPDPRGB= <>
##$CPDPRGT= <>
##$D= (0..31)
0 1.2 0 0 0 0 0 0 0 0.06 0 0.03 0 0 0 0 0.0002 0 0 0 0 0 0 0 0 0 0 0 0 
0 0 0 
##$DATE= 1727865656
##$DBL= (0..7)
120 120 120 120 120 120 120 120 
##$DBP= (0..7)
150 150 150 150 150 150 150 150 
##$DBP07= 0
##$DBPNAM0= <>
##$DBPNAM1= <>
##$DBPNAM2= <>
##$DBPNAM3= <>
##$DBPNAM4= <>
##$DBPNAM5= <>
##$DBPNAM6= <>
##$DBPNAM7= <>
##$DBPOAL= (0..7)
0.5 0.5 0.5 0.5 0.5 0.5 0.5 0.5 
##$DBPOFFS= (0..7)
0 0 0 0 0 0 0 0 
##$DE= 6
##$DECBNUC= <off>
##$DECIM= 24
##$DECNUC= <off>
##$DECSTAT= 4
##$DIGMOD= 1
##$DIGTYP= 9
##$DL= (0..7)
0 120 120 120 120 120 120 120 
##$DP= (0..7)
150 150 150 150 150 150 150 150 
##$DP07= 0
##$DPNAME0= <>
##$DPNAME1= <>
##$DPNAME2= <>
##$DPNAME3= <>
##$DPNAME4= <>
##$DPNAME5= <>
##$DPNAME6= <>
##$DPNAME7= <>
##$DPOAL= (0..7)
0.5 0.5 0.5 0.5 0.5 0.5 0.5 0.5 
##$DPOFFS= (0..7)
0 0 0 0 0 0 0 0 
##$DQDMODE= 0
##$DR= 18
##$DS= 0
##$DSLIST= <SSSSSSSSSSSSSSS>
$$ [...]
##$SUBNAM2= <"">
##$SUBNAM3= <"">
##$SUBNAM4= <"">
##$SUBNAM5= <"">
##$SUBNAM6= <"">
##$SUBNAM7= <"">
##$SUBNAM8= <"">
##$SUBNAM9= <"">
##$SW= 24.0689170037331
##$SWIBOX= (0..15)
0 0 2 0 0 0 0 0 0 0 0 0 0 0 0 0 
##$SW_h= 4816.95568400771
##$TD= 16384
##$TD0= 1
##$TE= 0
##$TE2= 300
##$TE3= 300
##$TEG= 300
##$TL= (0..7)
0 120 120 120 120 120 120 120 
##$TP= (0..7)
150 150 150 150 150 150 150 150 
##$TP07= 0
##$TPNAME0= <>
##$TPNAME1= <>
##$TPNAME2= <>
##$TPNAME3= <>
##$TPNAME4= <>
##$TPNAME5= <>
##$TPNAME6= <>
##$TPNAME7= <>
##$TPOAL= (0..7)
0.5 0.5 0.5 0.5 0.5 0.5 0.5 0.5 
##$TPOFFS= (0..7)
0 0 0 0 0 0 0 0 
##$TUNHIN= 0
##$TUNHOUT= 0
##$TUNXOUT= 0
##$USERA1= <user>
##$USERA2= <user>
##$USERA3= <user>
##$USERA4= <user>
##$USERA5= <user>
##$V9= 5
##$VALIST= <valist>
##$VCLIST= <CCCCCCCCCCCCCCC>
##$VD= 0
##$VDLIST= <DDDDDDDDDDDDDDD>
##$VPLIST= <PPPPPPPPPPPPPPP>
##$VTLIST= <TTTTTTTTTTTTTTT>
##$WBST= 1024
##$WBSW= 4
##$XGAIN= (0..3)
0 0 0 0 
##$XL= 0
##$YL= 0
##$YMAX_a= 46814
##$YMIN_a= -46567
##$ZGOPTNS= <>
##$ZL1= 120
##$ZL2= 120
##$ZL3= 120
##$ZL4= 120
##$ABSF1= 10
##$ABSF2= 0
##$ABSG= 5
##$ABSL= 3
##$ALPHA= 0
##$AQORDER= 0
##$ASSFAC= 0
##$ASSFACI= 0
##$ASSFACX= 0
##$ASSWID= 0
##$AUNMP= <proc_1d>
##$AZFE= 0.1
##$AZFW= 0.1
##$BCFW= 1
##$BC_mod= 2
##$BYTORDP= 1
##$COROFFS= 0
##$CY= 11.3945322036743
##$DATMOD= 1
##$DC= 2
##$DFILT= <>
##$DTYPP= 0
##$F1P= 15.6554695791079
##$F2P= 12.8336369535428
##$FCOR= 0.5
##$FTSIZE= 0
##$FT_mod= 4
##$GAMMA= 1
##$GB= 0.15
##$INTBC= 1
##$INTSCL= 1
##$ISEN= 128
##$LB= 0.24
##$LEV0= 0
##$LPBIN= 0
##$MAXI= 10000
##$MC2= 0
##$MEAN= 0
##$ME_mod= 0
##$MI= 1.114404
##$NCOEF= 0
##$NC_proc= 0
##$NLEV= 6
##$NOISF1= 3.799351
##$NOISF2= 2.8
##$NSP= 1
##$NTH_PI= 0
##$NZP= 0
##$OFFSET= 15.70392
##$PC= 1
##$PHC0= -26008.27
##$PHC1= 24.58747
##$PH_mod= 1
##$PKNL= yes
##$PPARMOD= 0
##$PSCAL= 0
##$PSIGN= 0
##$REVERSE= no
##$SF= 200.130013532006
##$SI= 16384
##$SIGF1= 3
##$SIGF2= 2
##$SINO= 400
##$SIOLD= 16384
##$SREGLST= <1H.CDCl3>
##$SSB= 0
##$STSI= 0
##$STSR= 0
##$SW_p= 3612.71676300578
##$SYMM= 0
##$S_DEV= 0
##$TDeff= 0
##$TDoff= 0
##$TI= <>
##$TILT= no
##$TM1= 0
##$TM2= 0
##$TOPLEV= 0
##$USERP1= <user>
##$USERP2= <user>
##$USERP3= <user>
##$USERP4= <user>
##$USERP5= <user>
##$WDW= 1
##$XDIM= 8192
##$YMAX_p= 0
##$YMIN_p= 0
$$ End of Bruker specific parameters
$$ ---------------------------------
##NTUPLES= NMR FID
##VAR_NAME=  TIME,          FID/REAL,        FID/IMAG
##SYMBOL=    X,             R,               I
##VAR_TYPE=  INDEPENDENT,   DEPENDENT,       DEPENDENT
##VAR_FORM=  AFFN,          ASDF,            ASDF
##VAR_DIM=   8192,          8192,            8192
##UNITS=     SECONDS,       ARBITRARY UNITS, ARBITRARY UNITS
##FACTOR=    0.0002076,     1,               1
##FIRST=     0,             0,               0
##LAST=      1.7004516,     0,               0
##MIN=       0,             -46567,          0
##MAX=       1.7004516,     46814,           0
$$ Real data points
##PAGE= N=1
##DATA TABLE= (X++(R..R)), XYDATA
$$ [...]
1923d81O17k7n7j30K92J76J76j120M31M48k61l45Q0m6K89p2j47l05P34L17l64
1944B05K3n48Q89l86o44LM05J43m79K1L96N34l1m32j97J90kJ10m86m89Q40K04
1966B69m95k12N49J86m17O77l90k38L24j68p04M27M21l5m73r3P14K94p28K29K54
1987C91j24J99p26m13O02K38o04J89L28j01O03j54q06P57kp39J66J65l23l4l4
2008d22k19M70N25k38r0J38J18R9q7o34L47J00k35j61L11j50K13j39r6M83j27
2029B06P3P7p42L21N80n38q93P74K39k17O4J43k10N67k83n29J34K13P5l52N6m28
2051f70J091o55j64K28N82k01j31q1K3L49k93m69K07K85m21J00j89j98J015J59
2071E67p72N72k93jj39j32k63N44Q4p48M93J67N1J17o38J12L27M19p51K18p2K18
$$ y = [-481, 136, 109, 52, -78, 214, 390, 566, -554, -123, 325, 64, -281, -201, -247, 42, -30, -177, -482, 252, 569, 205, 228, -320, 569, 183, -461, -458, -53, 90, -389, -368, 28, 562, 531, 99, -98, 92, 90, 200, -286, -775, 65, 269, -226, -438, 111, 297, -120, 557, 167, -71, 253, 85, -619, -192, 229, 194, -279, -372, 342, 636, -92, 137, 391, 267, 466, -260, -673, -71, 167, -437, -248, 80, -21, 582, 428, -378, 379, 377, -362, -196, -31, -354, -388, -422, -641, -171, 354, 116, 26, 164, 282, 381, 294, -340, 7, 107, -128, -289, 22, -128, 85, -54, -150, 333, 206, 279, 356, -386, -65, 515, -23, -916, -142, 97, -120, -56, 87, -123, 444, 161, -368, -234, -21, 54, -298, -242, -670, 421, -234, -398, -170, 412, 211, 80, -1, 22, 371, 78, -391, -184, 101, -320, -220, -409, -607, 408, 567, -205, 367, 74, 73, -66, -198, -461, 83, 167, -581, -88, 79, 130, 247, -391, -279, 48, 467, -284, -66, -138, 80]
2093H0P3n50M03Q4O6K03j89N2k42M86p85k87Q50k10m78o8M68n9J24M1j12K88Q9
2116C27m20j79N5n0J21p4k56M92L41j96j59j61M69J17n71k49O71k35l39M96m53
2137b53j99P41m38k39L27M71k85J23j37l52M09J5q70J46P68n44L44l0J67j74N03
2158D93m78j08K79l06k12j98M56M5j54J37q8L28L22n02k33K78K69j19l06J44J16
2179A63k81%K9r6O39j69n70N10j19j01R0m30O6j3L97o03J37O26k41M65n62K31
2201A68K61l38j38l04L43J17m0m12K44K30J40m35Q8L46k51r1k40j96P56j42n97
2222d91M70J19N7r1k14K35L01M5k77m37L36k10P5l16L04J57N5k4m3J71L10k75
2244B57k40l66M03k77K9j62J84L87j85l61M52J6M20j85n30J25N74k36m45j32K10
$$ y = [80, 153, -397, 6, 90, 156, 359, 170, 222, -20, 466, -319, -606, 244, 34, -444, -512, -44, -103, 21, 62, -50, 238, 327, -93, -272, -217, -267, -146, -220, -476, 16, 357, 161, 2, -159, 310, 427, -144, -393, 278, 43, -296, 200, -253, -452, 289, -149, -388, -61, 410, 125, 248, 111, -241, 168, 183, -687, -541, 227, -317, 27, -3, 164, -10, 493, 15, -93, 186, -120, -332, -530, -74, -29, -183, -46, -134, 194, 516, 14, -219, 59, 328, 209, -97, 47, 163, -118, -118, -89, -185, 454, 285, -285, 225, 106, 5, 95, -335, -269, -282, 115, -488, -351, 275, 34, 499, -63, 168, 429, 91, -47, -351, -8, 109, 69, -343, -99, 131, 271, -164, -76, 270, 19, -72, -312, -508, 248, 106, -491, -21, 98, 155, 64, -150, 85, 386, 431, 154, -283, 53, -157, -82, -398, -94, 63, 118, 94, 51, 222, 532, 257, 17, -349, 54, -223, -194, -356, -172, 215, 30, -331, 121, 137, 557, 372, -158, -33, 541, 305, -140, -272, -62]
2265f2J1L13m18R3O73o69k91K60K47%j84j86j06N23m16l1O9L06m3RqR3j57K38
2289B64o05k42K13N40k68n9J23k8M04l76j71L2M52J56p32P9O6l7k5J54j03M16
2311B53O4k61k4r9K53l69K00q5K3j77p0j39N07j1M18p20M84k88O14m53k56j61
2333b97J29O4q3j02L64J83k09j55J1N18l27k23N7n3L15m49Q4M5K12j09k35N34
2355B74m04M94k84l3j08J42k40n1k41Q2N62J71l27ML02m8r3q1o5J22k50k59N0
2378b81M14j67L06l81L18J49j05k15J15k24L5J68l43l03M52l8J32k3q2K30K3j8
2400A62j45J95r6k36m01K08l6M48j81l74N55K19O2k20m16J75k3K21k86P6J10l14
2422b97J36M48j74K75m46j32J88J84k74rj2n1M19l09L5R7n1n8o6P0K89j34k57
$$ y = [-62, -51, 262, -156, -63, 610, -59, -350, -90, 157, 157, -27, -213, -319, 204, -212, -243, -174, 132, 89, 98, 90, 183, 26, 264, -341, -583, -370, 170, -98, -157, -34, -62, 342, -34, -205, -173, 279, 435, -297, -218, -152, -189, -214, -60, -163, 253, 317, 56, 32, -67, 186, -183, 17, -68, -45, -222, -292, -431, 76, 65, 483, -237, 247, -41, 573, 120, -136, -297, -168, -104, -187, -289, 75, 258, 49, -106, -95, 423, 96, -127, -70, -123, 192, -257, -173, -128, 84, -25, -260, 274, -130, 364, 80, 47, -61, 81, -159, -210, -451, -369, 193, 364, 37, 41, 343, 295, 202, 121, 56, 178, -72, -331, -281, 133, -34, 272, -109, 209, 358, 253, 38, 153, -71, -36, 132, -211, -514, -62, -100, 32, 9, -73, 157, 180, 162, 17, 212, 116, -120, -521, -313, -349, 99, -82, -456, 99, 318, 380, 160, -256, -81, -104, 117, -169, -93, 17, -297, -161, 287, 113, 388, -58, -190, -2, 182, -92, -101, -113, -164, 255, -54, -19, 78, 27, -31, -97, -27, 262, 128, -129]
2445a29l3l50L73J71r7k26M71J57k28k17L61l1k80l80P1J83N04k56l33L08j73
2466a34L58k66J18K2J57jk63J50N9k05l04Q0J52Q2J14kk39O09k58k69O0P5J11
2489B06m3m53l4K17L37j53j40O8K78k56k9J6K76m14K43j52r2J83l47K80L7J96
2511B24j57O1k70L8M4j49J32j81M47k75j1L21j15j58J20l8J46%j8N2o99K17N49
2534B80l67m9L40l44M09M8m30K25p0K07l64Nk55M26j47J46k64J23K40o1L42m60
2556b0m7M40l44o5J17j80K0l1J01J28J44n04J05K44K97l37J01k28J82o1k2l98
2578c58J19K03J27j52P7J91m1N7n44K19P8m0R8k86K59L18k45K5l02N39K4n1o03
2601b88r2L64l68K56J44p1k5K86l41K93P9l45K15k13K96j54M3k36j12L95q8l62
$$ y = [-129, -162, -512, -139, 32, -65, -291, 180, 337, 109, -108, 253, 222, -58, -438, -367, -184, 320, 64, -269, 39, -134, 224, -42, 76, 98, 255, 254, -9, 141, 200, -5, -309, -229, -77, 5, 119, 117, -122, 487, 229, -40, 20, 95, 206, 163, -290, -324, -107, 230, 77, -63, 5, 283, 27, -2, 14, 290, -124, 119, -33, -125, 58, -289, -9, 28, 224, 67, 128, -142, -104, -60, -209, -77, -258, 189, -86, -97, 224, 109, -49, 71, 33, 179, 179, 161, 213, -486, -269, 280, -87, -136, 204, -140, 269, 317, -113, 112, 42, 249, -115, -110, -365, 61, -86, 60, -204, -81, 159, 98, 440, -20, -67, 373, 29, -36, 81, -99, -79, -110, -9, 119, 263, -241, -136, 108, 405, 68, 169, -59, 123, 62, 40, -358, -239, -36, 91, -61, 16, 207, 166, 223, -321, -102, -24, -64, 34, -252, 7, 325, 80, 105, -197, 342, 366, 315, -288, -380, -16, -384, -128, 16, -55, -80, 206, -135, 158, 237, -108, 107, -106, 190, 36, 79, -157, -269, 126, 38, -324]
2623c24M48K06j29j13Q4l64K89K26n60K57j53L00j97j42K41N1Q0k64J41k29K89
2644A37K1k97k5J84K96o59K80K98n5q6m09J07M78j5n71OL94j78NOO0R4M6J02m35
2669b16K75j16M35m45Q4K1qK56m15j89L14R4o3k47K23J56j47O6k80P8J1L2r2P4
2693i9J64j46K26l77L26k27P3P1r1J28Q5l72O1K49K21N1l60J02L8M31n77m4j96
2716b63M36l49j44K48j26Q3M53m88L21L09k98l27j43M23j82L01p21M06o3J34L9
2737D9k16K70ll85K58J08p9M6p4K23l47L04k13j46O20k25K75o74K63p0L69k63
2759I0k79J61Jm81N01k83O80l41kr0j19J63L00P2n03J97r0J20R0k74J6J02J08
2782A39J45j66K59j61m01j91L73k91L43K50l19J46j00j29O7K07l81N5K09j12J44
$$ y = [-324, 124, 330, 201, 88, 172, -192, 97, 323, -237, 20, -133, 167, -30, -172, 69, 120, 200, -64, 77, -152, 137, 158, -139, -164, 20, 316, -343, -63, 235, 180, 94, -315, -208, 270, 255, -316, -310, 84, -94, -89, -83, -23, 71, 117, 219, -216, 59, -57, 378, -67, 17, 38, 30, 286, -129, -318, -4, 90, 27, -220, 3, 159, 12, 78, -202, -124, -113, -81, -173, -99, 65, -81, 145, -232, 94, -133, -60, 11, -80, 48, 133, -239, -178, 71, 292, 343, -17, 85, 123, 554, -23, -67, -263, 173, -176, -320, -72, -198, -115, 338, -150, 171, 480, 182, -145, -288, 135, -47, 254, -467, -61, -124, 10, 49, -167, 103, 100, -285, -27, 81, 2, 48, -26, 197, -150, 154, -59, -205, 415, 190, 465, -209, 54, -16, 353, 90, -189, -28, -27, -508, -7, -290, 390, 49, 47, -43, -162, 1, 301, 373, -130, 67, -23, 97, 187, -87, -71, 31, 139, 284, 118, 377, 216, -185, -376, -3, -294, 49, 299, -20, 126, 26, -103, -36, 171, -210, -155, 54, -58, 86]
2803H6m9N5k64K6J30K17J45j58J07l33N6l58L14l3k10Q3J44J63j35l2j1L27N6
2826C26r8n01M11m3n5r7Q8j66J50L70m20J45l33L74n1k45L65l09K48k67m0J35
2848a3l57M91j66J98j97M95o08K54j87J31o6j01j5Q6M17p4l91jK7Mn1K52j29m4
2872d5J80k78M7J9r5L2R5K22L50n59k48L16M75l53k02J9o7n1L8M30k67l9N3J20
2896A92l88J86j13k8K82j84K2J29j26j7j16mM68k11l4L98n82K4O2j07J50j6J1
2919br0K95J36l23n34N78J06R8n17n0r8O47j63j45R6N1N5j16j46L01k5m7k2l21
2943b36oM15l94J16L04j79k6k69L23j7K32j25l28N1L15l87l5k55M12j29N34l02
2965A4P3j58j0K63MJ3o8J7j53O6j11K22N0k05l66L85J17k7J19o4k12M4M1j33N7
$$ y = [86, 37, 92, -172, -146, -16, 201, 346, 188, 295, -38, 18, -340, -26, -59, -269, -186, -42, 121, -14, -46, -57, 270, 326, 228, -273, 138, 95, 40, -57, 31, -135, 15, 385, -35, 110, -223, 151, 100, -145, 220, -89, 159, -108, -148, -13, -370, 121, -45, 153, -44, 451, -157, 97, -90, 41, -25, -126, -141, -55, 362, 288, -103, -104, -77, -73, -124, 128, -1, -45, 135, -143, -96, -77, -172, -140, -45, 177, 527, -32, -280, 36, 511, 158, -44, -25, -92, -143, -105, 325, 58, 19, 72, 192, -196, -10, -123, -151, 131, -53, -31, 98, -28, -45, -161, -165, 303, 92, 58, 456, -126, -102, -40, -147, 3, -13, -2, -92, 203, 339, 16, -518, 60, 166, 264, -253, -303, -401, 246, 83, -62, 34, 85, 140, 24, -122, 179, 154, 107, 85, -236, -242, 173, -221, -105, 199, 20, -6, -275, 48, 31, 263, 138, -190, -139, 176, -211, -246, -501, -89, -218, 316, 14, 87, -71, -81, 182, 186, 199, 131, 148, -5, 61, -50, 172, 222, 17, -349, 36, 153, 126, 245, 181, -31, 13, 54, -79, -22]
2990b2M7m0L33j63k29J34j10L82m14L25j83M2m4j21M3k00K95O8k37J84k9n2n3
3013d4o2NP0l7j89L39k46L32k23M5k44O87o02J60k3o7j53K43l48M76j17n0J54
3036A06k64k10L93R5M1j43j57K73k30R3o1M1j95L03Oq0O1j28J70k43j2K55j68
3059e4J2K04k34j48J58l43M19p6R2k36L41k2j59r6r3L5k13L26k7L7L19k29K44
3082B57o85M31K33n49J64K5j63J11L45k27J67k26K47j57R2J60L9k86o1J52M0j03
3104FJ42l63OL93J79n62N02j21O7J02k41k83J7J47l62L56J84l39K53l8K9m4K34
3127B64m8n77M13l63L70k08K35L0QlP2j59pj83m0J02J3j05j39L57J37k49r7L7
3151a40j64O18j72K29n04L0L42m68L67l01J47K9J97j97L1q5L51m57J29P5j95J08
$$ y = [-22, 25, -15, 318, 155, -74, 60, -50, 332, -82, 243, 60, 102, 58, -63, -20, -220, 75, 143, -94, 90, 61, 9, -44, -106, -101, -31, -68, -257, 82, -164, 168, -55, -10, -254, 433, -169, -9, -32, -99, -252, -9, -357, 119, 2, -48, 106, -158, -368, 25, 120, 161, 18, -139, 134, -96, -3, -64, -23, -218, 85, 91, 11, 72, -56, 114, -129, -141, 114, -54, -42, 162, -72, -220, -62, -405, 14, -62, 30, -206, 135, 113, -46, -142, -235, -200, -413, -87, -114, -77, 242, 13, 257, -428, 3, 236, -313, -149, -124, -287, -176, 169, -58, 109, -117, 130, -27, 65, 225, 264, -22, -83, 69, 109, 6, 148, -215, -209, 184, 363, -199, 303, 182, 249, 351, 110, -173, -156, -9, -371, -15, 169, -170, 83, 45, 74, 30, 264, 216, -361, 52, -311, 59, -149, 86, 116, 124, 121, 193, 34, 27, -156, -196, -94, -81, -186, -325, 32, 169, -80, -177, -140, -304, 314, 142, 371, -133, -103, 239, -229, 138, -163, -16, 13, 210, 13, 44, -41, 310, -147, -18, 57, -138, -30]
3173c0m20J64J9K51K60j21k75Q7k5K2J52M4j23j28l28N39j72J4Q1j78P7K8K47
3196A85J5Nj27n0K8j80J3p0L05l00J60R0k64K21J04q3O1J91k05J7O2p4o3l58L34
3221A7R7J23l25J38J61j02l10K55j30J91l08L6L02o6PP4j22k99N69j82q9j12K26
3244A51n3j43M2k38K96j93J89J2pJ57j96j17K15j78O9J44L1n13M52J06m05K43
3266F4l9M35m65P6O4m33N95p6k33mJ32k80L79n5l34J09r6K64l24J3n0J21m0J09
3290f8K9k63L21Q8N1N1q3M1O8k30KK6k18j34K42J59j86K9L9J30k3l50N40l31o3
3315a33l0J19k0n6J48J4J12k23L8J58k91N05l78J54k47J69k47J18R1j46K44k41
3337a42j46J77R0l2K22n01K39R3J98j32k97J16J33J87j54K3%j25J59j79P4k6j28
$$ y = [-30, -450, -286, -267, -16, 244, 123, -152, -65, -90, -68, 84, 128, 5, -123, -451, 88, -84, -70, 11, -167, -90, -62, 185, 200, 205, 78, 28, 56, -124, -111, -181, 124, -176, -16, 74, -190, 31, 135, 52, 113, 304, 99, 116, 178, 104, 41, -317, 17, 114, 237, -88, 50, 211, 109, -201, 54, -76, 115, -193, -157, 145, 79, 86, 160, 38, -261, 308, 126, 37, -75, 151, 98, -45, -3, -241, 55, -138, 51, 63, 56, 213, 17, -100, 115, -63, 6, 150, 181, -332, 120, 226, -179, 64, 25, 460, -5, 71, 135, -298, 297, 221, -12, -16, 116, -164, 215, 160, -174, -65, -161, 103, -221, -208, -258, -137, -177, -68, -39, -302, 19, 107, 158, 209, 126, 167, 235, 5, 7, 33, -185, -319, -77, 82, -104, -75, -36, 94, 71, -279, 261, -70, -133, -163, -44, -64, -120, 28, 42, 154, -69, -31, 127, -164, 341, -37, 117, -130, 39, -208, -90, 1, -145, 99, -142, -288, -111, -21, -53, 169, -332, -93, 0, 198, 66, -231, -115, 18, 205, 51, 74, 74, -51, 108, -71, 3, -23, -151]
3360a51K8k37q8L65J19p9J83k45PJ23j66J35mq0j7q9J40J52j40k58K12J65kl46
3384b73K71r2J57m6o3j28j47K98K4j6J59k65K07k33L53n18J11J01J74k17m3J49
3406c7R1K60l34J15P7m64L35M20j76m37J67j71M18m02K77j2l58J42K74k04J16
3427I7j0j39j07l8J58L13r2kJ34m20l07K49L4k67K20K50Ql42K72m9n5l9k7L9J93
3452G3K09l40M47m59J73J2l5k20M79l43R7L0K81k61K14l87j98M62k34k12J56K03
3474A47k93L16pqk99j94J21J55K28m07N20n05R4K04J15l50N6K22k90K76m30L05
3496b4m7j31J93Qp8mr7K11j97k8J8N12j03m54K80J18K97m99J45M6o1m51L83K57
3520B94j87j58K93m79L07j17o5j45L24j91P9J43r4p5M1J40M01m64N9j32j28K42
$$ y = [-151, -123, -360, -448, -83, 36, -43, 140, -105, -98, 25, -141, -6, -10, -90, -107, -196, -56, 96, -44, -302, -90, 75, 73, -273, -2, -94, 63, 17, -46, -174, -321, -23, 1, -15, 144, -121, 86, -147, 206, -312, -201, -100, 74, -143, -186, -37, 54, 314, -20, 95, 172, -292, 43, 463, 287, -150, 17, -154, 264, -138, 139, 127, -231, -89, 185, -19, 97, 87, -52, -159, -197, -39, 274, 182, 180, 314, -106, -413, -164, -130, -397, -177, 73, 81, -261, 11, -38, -93, -132, -159, -120, 73, 282, -58, 389, -70, 103, 115, 80, -140, 339, -4, 93, 123, 404, 143, 357, -30, -228, 234, 0, -212, -56, 147, -146, 170, 163, 155, -144, -338, -217, -62, 166, -241, 279, -226, -132, 72, 187, -163, -107, 115, -175, 101, -329, -24, -71, -202, -9, -1, -79, -83, -180, 31, -166, -194, -176, 336, 233, -221, 59, 177, 474, -25, 120, 166, 105, -346, 37, 294, 107, -51, 242, -237, 70, -47, -112, -257, 67, -124, -45, 98, 4, -71, -30, 110, 511, 47, 106, -26, -154, 88]
3542H8Q0k25K41j74j97r4L05j06K67k05J09j93J88j57L22m51o7L58j62O6J3L10
3564C16j34j92k44J12K14J42j59j37K72k57k41k5L3J04J62j5J16M85p53M03j67
3585C5k00J75j11J4j93N40l54l21N16j94J90k92J85l21N33k22m2l44M62j47o7
3606a58J17J78MQk02J1M0r1J46Q7j25j14M00l91J82j56L56j79J3N0l66M74k18
3629F6j29L5K6j12K11K35n60K30J60J88l21j13J43N7k14j1K21j00L13k14r6J05
3651A20J33k35J23j33k65L00J08j64J05J90n05J42L58j74k40J49k53L70j64M01
3671C66k27l68L96j86r5K64N6j97l28K78J19pj26j10J03j5M4j16J92l16K12J26
3693F5K27j24j51P9l95L49k66K11O6J52j85k49Q0R9J92R5j26M4l22J02J55j06
$$ y = [88, 168, -57, 184, 10, -187, -281, 24, -82, 185, -20, 89, -104, 84, -73, 249, -202, -269, 89, -73, -7, 6, 316, 182, -10, -254, -142, 72, 214, 55, -82, 190, -67, -308, -333, -300, -196, -34, -49, 67, 552, -201, 202, 35, -165, 10, -101, -87, -280, 260, -94, -415, 101, -93, 97, -195, -10, -331, 202, -20, -62, -406, 56, -91, -158, -41, 137, 141, 149, -53, -42, -2, -93, 53, 140, 15, -99, 301, -90, 92, -64, 292, 113, 126, 176, -190, 284, 66, -63, -28, -2, -114, 97, 332, -228, 2, 162, 350, 29, -84, 59, 116, -98, -109, 112, 12, 325, 111, 15, 120, 253, 18, 141, 8, -257, 43, 151, -13, 92, 282, -223, -81, 277, 103, -137, 12, -241, 129, -35, 366, 139, -229, 167, -19, -114, 150, 206, 9, -319, -41, 78, 71, -55, -165, -62, -77, -33, -149, 43, -273, -61, 65, 292, 168, 17, 96, -299, 50, -216, -5, 61, 213, 28, -221, -141, -42, 150, 245, 119, 163, -159, -57, 98, -8]
3715hK47n54K48J96j8l98L94q4J39l16j62J18M52k59j71N4K95l35K94o9q0J86
3737A69k09L50n70L16J12jq1J43l21j30K89n8m6JJ8Q0l08J97l7J44l84M13k3l9
3761B5K17m31J1J30q8Mr3M27M3l81K06k44J0J37R1k01J99J94l14K10j74lJ30N7
3785A62k55r2J14M9j86j9K09j47NJ61k53L85q4K32k7k71J84K28o54L82k54J15
3807a6k74K77k4j5J66j62j44j52N01k87r3K26k43M24M9j58O8J05k83k7J71m64
3829c55K34J53m2j44R6J03r8J13k02J9k32N92k31j5l31P0J84K71k73Q4J72k02
3851c4J38N4K22m08r7K17j68J76k21K39P8k26j56J80N9k9O6J68l46n7J85j85J13
3874c2l4K98j89k6J18L0r4Q1r1M1P6j06j25L23l13j66K87m4P7k90l8K7N35m08
$$ y = [-8, 239, -315, -67, 129, 111, -287, 107, 23, 162, -154, -316, -198, 254, -5, -176, -122, 173, -162, 132, 63, -17, 169, -40, 310, -260, 56, 168, 167, 86, 229, -92, -222, 67, 9, -37, -36, -18, 62, -246, -49, -86, 58, -326, 87, 64, 25, 242, -189, -178, -48, -136, -132, -225, 202, 245, -136, 70, -174, -164, -27, 64, -137, 62, 256, -58, 152, -22, -25, 105, 162, -93, -185, -71, -22, -208, -227, -18, -165, -160, 1, -252, 133, 49, 281, 254, -17, 167, 395, -259, 123, -131, -16, -290, -13, -37, -52, 114, -48, -192, -344, 157, -130, -223, 3, -240, 184, 233, 75, 143, 248, -35, -62, 109, -355, -121, 32, -10, -154, -58, 45, -53, 60, -142, -123, -355, 237, 6, -9, -340, -270, -86, 185, -88, -4, 168, -34, 104, 158, 380, -28, -125, 92, -76, 100, -121, 118, 196, -30, -186, -6, 53, 24, 90, 258, -88, -145, 40, -145, -32, -66, 232, 43, 17, 135, 165, 71, 152, 61, 102, 178, 72, -53, 270, -43, -209, 78, 34, 111, -179, -217, -190, 345, -63]
3898f3K42k23k55L66N2j27k63L45k76L55P8J26o2o6k81K74R2l36o8J37K29j77
3920I9J73j39k9M3k19J63N7l20J33j05J88n4r6M3J50K48m71J46j16m4o4J93o3
3943h4Q8jJ45k9l63J99L40k43m81N08j6j51J04Nm1N5J01j63O4j01K10j22j6l80
3967c72K84K3j5K50k05j72M51j65J77k17j52m3L15M0k24R0j91Q2J28j92J44j17
3989h1Q0J24oO1n8K5j37r7q3l5L3M02m23j8K79j17J10R5M7l8J43j25M2m08L28
4014A43j53j05J59J28l38nL68m13L10J66n73L62J96m48N4J50km1L4k8j30J00L4
4037c2N8j99rJ84j53R4K65o24J87j99L94L9j42K69j15J5L0n1j78J18K30K6n9m81
4061c33L15J21k43K97J51j14mj4k63J20m76K37J23Q9mj04R5k88L83k97L2L0P8
$$ y = [-63, 179, -44, -299, 67, 119, -8, -271, 74, -202, 153, 231, 357, 295, 229, -52, 222, 314, -22, -90, 47, 276, 99, 272, 133, 104, 147, -72, 91, 148, -172, -39, -144, 44, -10, -106, -63, 87, 335, -136, 10, -106, -150, -214, -21, -84, 4, 3, 148, 119, -244, -45, 295, 52, -429, 79, 63, -88, 16, 21, -20, 35, 136, -27, 37, -64, 146, 24, 8, -372, -88, -65, -80, 170, -35, -207, 244, 79, 256, 39, -113, -156, 159, 199, -25, 65, -126, -44, 84, -108, 36, -81, -1, 123, 117, 178, 120, 145, 8, -89, -172, -207, -174, 228, -195, -213, 66, -51, 59, 154, 201, 163, 306, 181, 223, -185, 143, -10, -115, 44, 172, -166, -171, 197, -216, 94, 260, -313, 49, 245, -203, -149, 1, -1, -42, -8, -36, -166, -66, -32, 26, -173, -182, 2, -151, -57, 208, -416, -229, -428, -34, 5, -137, 132, 17, 32, 62, 11, -167, -49, 181, 207, 148, -333, -18, 103, -140, 157, 308, 194, 190, 176, -87, 33, -443, -206, -83, 6, 2, -102, -7, -295, 88, -209, -177, -147, -69]
4084f9N5q7R4L5J96j33k73L15J6L3j85J8rK2Q9l58M28k68J3k68K08J3J42K38k94
4109b9L22Nn01j59K88J95k48J78k19P0J57J04j64Q5Q6n33M95l57J31K80r5L3l29
4132b05J63K1k7J77j25j07R4k3j3K17j85J44k67K56p0J02l16j35N08m91J24M99
4154C41m92P1J69j2l07L79j56k18%K79KK33l64P0K57l04J70L66m00J7N2n51M96
4177I8l9L9J1q6k84K07J00j63k19J27J90k09K90l34N10j7j77j07j77J74K55L96
4199E85m27q3J85p9k64j51K96J35l48L70n38M67k37J69Q1l73J59r0P9K43n15L55
4221A9J47J19l06J41k99J36K42j00L95p38L44k72L27j21j07L94j6j8k21L8j68
4242f4j10M12l50l0N6o9J84j0k48j12L90q4M6J04m00M59k53j92L39j35k4Q6k41
$$ y = [-69, -14, -101, -7, 28, 224, 91, -182, 133, 149, 182, -3, 15, 6, 28, 117, -241, 187, -81, -68, -336, -128, -115, 27, 265, -29, 293, 298, -203, -362, -74, 121, -127, 51, -168, -98, 59, 163, -1, 84, 170, -363, 132, -225, -94, 186, 91, 124, -205, -42, -21, -48, 129, 4, -103, -9, -32, -45, 172, -13, 131, -136, 120, 50, 152, -164, -299, 209, -282, -158, 341, -151, -80, 89, 77, -230, 149, -7, -225, -225, 54, 56, 289, -75, -5, 252, -52, 118, 484, 84, 101, 153, -398, 98, 59, 98, 109, 23, -261, -54, 46, -117, -336, -209, -19, -228, 62, -272, 238, 221, 44, -63, -240, -66, 189, 585, 158, 75, 260, 181, -83, -234, 62, 197, -151, 219, -319, 148, -89, 80, 161, -212, -53, -143, -64, 179, -336, 19, 166, 285, -21, 120, -179, -43, 199, 99, 494, -244, 100, -172, 155, 34, -73, 321, 305, 287, 66, 104, -64, -174, 238, -112, -142, -86, -155, 29, 19, -229, -341, 49, -35, 11, 115, -285, 174, -79, -271, 68, -67, -91, -5, -246]
4265b46L70p7j2J76k66l4j1K18k54j41K84l44J5N57q0l18J25j34K66k5m91K98
4287a24j44L29j53l1L79o6k97J04k36N82k63l35N77j11l42K07k66L03R0o52L65
4308h4J4N8j45L97l68K26J09j75J22l75J69J32j96M18l45J84L7j54k40J11q1q9
4330b75K75M1Q9K4k23k46P9K9K0M05q4r5rK5j06O5O4j44l0K46m01L60l53nJ1M1
4356a97J98J21k33j99M15k3p1J43l6j92J95m84K59R0j20Q7j48J28K00j63J06N2
4378A28L1j87k01P3J19J33j5l45J50L73J6n13L24j61k13M2L05p0km2K06l04j75
4401c28K86ol4j32L01p6R8j09j48j99N01q9p9Q7O8j3q2r9M76j29l10K05kL3P7
4426B97l94p3R8j40K85j45KM6J72p4j41Q1K01l51P1J36q3o9J57l69K94J60l85
$$ y = [-246, 124, 47, 35, 211, -55, -89, -100, 118, -136, -277, 7, -337, -322, 235, 155, -163, -38, -172, 94, 69, -422, -124, -268, 61, -92, -123, 256, 190, -107, -3, -239, 343, 80, -255, 322, 211, -131, 76, -190, 113, 203, -449, -84, -70, -12, -157, 240, -128, 98, 207, 32, 154, -221, -52, 80, -116, 302, -43, 141, 178, 24, -216, -105, -186, -275, 0, 41, 130, 154, -69, -315, -236, -207, -187, 218, 134, 39, 30, 55, -51, 14, 78, -66, -96, 150, -251, 109, -244, -249, -238, -197, 1, 122, -111, -310, 105, 82, 11, 154, 118, -74, 121, -363, -104, -14, -134, -47, -195, -67, 133, -30, 76, 128, 159, -28, -229, -156, -37, 96, 81, -264, -114, 259, 275, -238, 86, -75, -288, -246, 59, -11, -13, -55, 151, -153, -328, -42, -48, -82, -214, 87, 11, 109, 0, -148, -347, 154, 65, -14, 73, 141, 128, 46, -53, 423, 294, -16, 189, 187, 220, 297, -97, -170, -72, -212, 73, -72, -70, -24, 148, 74, -67, 14, 215, -136, -65, 71, -12, -81, 76, -293, 1, 161, -224]
4449b24L92k90k2L68k61j37K12RJ38m46K24o5o3N8j11J58L86j56N8j39p4P9K14
4472C08k66j78M0J32j19M8R2J73n09K35J02L0k48N37k91k75L48k8j59k01L67r7
4494D1Q6j62J47j22K5L4l63K05K45l9j15r9K41k21K03O9l26M13k46p8K5K18k37
4517e6j51O8Ok2J75L1Mn5L56l64l55L11J45k10N6m0K53j74J71j62j09QK62k10
4541f2l00M41K22j08m53J26M5K25K16p7k95J95P3n12J64n9k4N28l61J59L2q5q0
4564A0k86r2L96n2j00K35k19K04j84j31K83j48l36N73k89L45L9j70J48j82j25
4585h1M8J14j99K77O5l22j01L02p5q6J89j89K27N3j33k80Q8P7j27J43K66p2j50
4608C4J18%j93M1K47n11m4K42q4J61K91n77L48p3J21j46r2J18J70rj17K87n11
$$ y = [-224, 168, -122, -144, 224, -37, -174, 38, 47, 185, -261, -37, -102, -165, -107, -218, -60, 326, 170, 228, 89, 15, 94, 308, 42, -136, -96, 36, -83, -35, 57, 230, -279, -44, 58, 88, -160, 377, 86, -189, 159, 131, -28, -229, 138, 41, 127, -35, 112, -10, 15, 49, -314, -109, 136, 97, -18, -117, 124, -97, 106, 175, -151, 262, 16, -62, -37, 181, -56, -207, -139, -133, -155, 20, 51, 55, 0, 356, -8, -363, -52, 93, -117, -61, -101, 152, -22, 149, -13, -122, -114, 148, -62, -362, 79, 301, 193, -260, -134, -89, 136, 352, 275, -20, 175, 248, -264, -100, -159, -183, 345, -16, 143, 175, 90, 10, -276, -368, 28, -24, -124, 111, -108, 96, -88, -219, 64, -84, -420, 153, -136, 209, 248, 78, 226, 44, -81, -33, 81, -118, 159, 224, -98, -199, 103, 28, -58, 131, -58, 169, 222, 89, -191, -103, -26, -153, -10, 256, 184, 34, 152, 152, -41, 0, 247, -264, -308, -66, -150, 11, 302, -275, 73, 0, 121, -25, -117, 1, 171, 162, 45, 332, -179]
4631a79M1r0L52k0m2J04lk12J95j30J06l7Nl69L67OJ84j62j62k70P37k48K6j68
4655C1o23P90r1j73K41l97J68K34p1l55K89J4K7L3M5k74m5L36j63K06q9j3o2L6
4679I4P0K75l60k25O6j20J15k10k1K49L85o13J02L44R5k69J86l08L16j68j28O7
4701e8j27j22K35m6j01K72K5k22K82J07j03J51l35kR4j42j23J43o9L40j20j14
4723c5j38L02L5q0j30j81L29J60p14J24K42J09j36J65Q9r2J77j73J83n47K42l5
4745a04k0K82l35N13k21j82L28k99j33J94k47K86j43k67K49L53M4j40k14j61K53
4766C6j30j35K93m2j50Q3K53l34R1j6j10J51J68rm4j19k88L03J0l9j8j47L86m72
4790b79L05l16K06N94n86L9j23J80L2l3r4K30j47m7k3m97N54j73L81j82k03M81
$$ y = [-179, -138, -228, 124, 104, 62, 166, 163, -49, 146, 16, 122, 85, 90, -279, 88, 94, 278, 116, -46, -316, 421, 173, 199, 31, -592, 198, 107, -66, 175, -222, -54, 180, 109, -246, 43, 57, 84, 117, 162, -112, -157, 179, 16, 222, 133, 120, 58, 94, 164, 439, 79, -146, -80, -200, -85, -295, -316, -67, 318, -295, -193, 151, 246, -23, 163, -145, 171, 3, -125, -58, -185, -307, -72, -118, -219, 53, 78, -144, 138, 245, 142, 293, -42, -44, 50, -92, -215, -72, -141, 199, 79, -35, -173, 129, 164, 84, -46, -227, 102, 262, -452, -328, -86, 23, -113, 52, 141, 49, 226, 53, 236, -311, -69, -104, -124, 158, -177, 336, 115, -67, 261, -38, -171, 23, -224, 62, -81, -348, -99, 254, 298, 158, -56, -217, 36, -94, -229, 64, 22, -128, -45, 208, -126, -35, -51, -161, -10, 158, 149, 105, -14, -302, 1, 11, -28, -46, -193, 193, -279, 26, -290, -84, 510, -76, -37, -160, 20, 52, 19, -75, 155, 8, -39, -62, -559, -5, -178, 203, 21, -182, 299]
4812B99m60L5J7j48K2N49l23L26m88K96r0k82K63j27j17K46k69K06L04k19l80
4833c40L76k0L4j42m8L11j04Q8j27%J74k91r9O6K03j13K40j04j23%j1r6Qj06M35
4858B11j77j70R1j55J64J89%j50J16Q1jk35j44M66J1k37n44L54K99Q9j79J96l39
4881f4J64n30N48j98j74J53j80P8J14L9L4K2j35K74k80J7J52Q9k97N10r5m39M03
4904B05k62J85k22L48k64K00k77P9j16J21j16J89o5j28k3m8k3J71J13J52m15K31
4926C5Lj59L80l39k41M85j95O0k7o4j1P3J5p4m1L07l56J58j16P5p1p1K80l53L14
4951F7j41J01j70L00l30o2J20q8J21M0R4P4k20j09L99l12J76m22R0J42K69J7j28
4974B8J2K80j30m8j56p9J17l7j55J87k7n7j07L6L45j54j57O2J43R1j82K36n19
$$ y = [299, -161, -126, -109, -257, -235, 314, -9, 317, -171, 125, 35, -247, 16, -111, -228, 18, -251, -45, 259, 40, -340, 36, 16, 50, -92, -140, 171, 67, 155, 28, 28, 202, -89, -188, -122, 81, -32, 208, 104, -19, -19, -30, -126, -118, -224, 211, 34, -136, -45, -200, -36, 153, 153, 3, 119, 200, 199, -36, -180, 286, 297, 60, -484, -130, 169, 258, 79, 275, -64, 100, -430, 118, -80, -254, -101, -281, -203, -89, -50, -16, 6, -129, 145, -135, -118, 34, 123, -174, 336, 241, -198, 205, -57, 128, -94, 254, -10, 190, -87, -8, -124, -3, -119, 70, 5, -123, -146, -194, -217, -46, 67, 219, -196, 35, 38, -121, 259, -80, -321, 164, -31, 29, 2, -62, -73, 0, 15, -59, -100, 207, -149, 9, -107, -32, -103, -174, 106, -247, 67, -74, 27, -143, 157, -173, -235, -115, -203, -82, -42, 52, 126, -94, -203, 196, -116, 60, -362, -272, -130, 139, 156, 28, 40, 320, 190, 142, -14, -93, 24, -13, -168, 19, -8, -65, -172, -136, 209, 55, -102, -40, 103, 194, 12, 248, -271]
4997b71M72l24J31j00N9L01j32j73J25M55l43P8l49K56l24K37j33J87k68J22L23
5018C29m58n5L34qj72J08k6pm1j55M2J08P3K0K1k85J21J1K67j66k80L1J77M5j84
5043a50L43j94L3j01O6m8n5j02q9N9M47l78M37j26k97Po6N3J65j11K14q0M8j10
5067c5P3J57j70j6Q8k6m4K26k52J93p4k75P0L2r4J3jq8M17l42J41k9KQ4J88l74
5093a36K88r2J65l13j14K01J46J95n74J15L55j23m0k7K4k44K36K2k74j4J57j09
5115a56O1K49k62L60m63k2J96m9j4j61J63j02N18k33J01R2l43L90j63j89P7jJ55
5138B04pk13Rj4l6m6J74J78l41J0K65m19N12K6m75L3P9Q4j44n2K30l31J82M42
5162C50m8l78k79L28M3l2p3K73j88j9P1o2nK52P3J8l55L68j29L6k76J09j63K90
$$ y = [-271, 201, -123, 8, -92, -33, 268, 136, -37, 88, 543, 200, 278, -71, 185, -139, 98, -35, 152, -116, 6, 329, -129, -184, 150, 142, -30, 78, 52, 45, 4, -151, -109, -1, 72, 92, 113, -172, -51, -40, 227, 61, -219, -188, -11, 34, -150, 193, -1, 32, -69, -3, -51, -106, -208, -297, -238, 209, -169, 268, 142, -155, -148, -214, -161, 4, -107, 107, 27, 75, -35, 38, 195, 25, 9, 97, 71, 27, 253, 1, 194, 120, -155, -85, -53, -147, -134, -135, -223, 194, -148, -7, -36, -34, 50, 238, -136, 152, 60, 225, -88, -202, -1, 145, 340, -234, -119, 236, 113, 73, 46, 70, -174, 62, 84, -190, -204, -47, -156, -95, 154, -108, 252, -211, -233, -37, -86, -100, -261, -98, -200, 318, 85, 186, 278, -65, 325, 162, -27, 50, 49, 204, 197, -16, -7, -21, -57, -103, 71, 249, -92, -82, 183, -236, 276, 302, -173, -140, -61, 23, -121, -173, 57, -274, -92, 350, 302, -76, -355, -27, 16, -16, -89, 184, -4, -23, 48, -14, -19, 233, 306, 324, -31, 337, 208, 244, -32, 77, -86, 204]
5186B04l09K44k9k12K13k13L82m42pM8J21j23R7J28k39L6L09j44Rr9M4J77j0j20
5210F5j62J39j76Q0J25j66J22j1pj88K80K29l05k53L77j94O8jo0J62k2K25k66
5233F1N7J26j65l21L27Qj48L64j62m92K88L42k1j83J8j92P9R3l12%M16j00o2l85
5257c64K87K09k46J52P7j11K68j28l83N7J19J64j89J30j83L10J73k15r0j84N5
5278i2J18r6K64j53n0J34P4j27K2P9j09r6Q6m26L85m9j64M52o05M59j54k80L19
5301il8P5K37m8j35j25j35J7K60j54m6nJ23j95K84j59O6L54o46N45j64L08o45
5324b35K93M1k19j49K23K03j07J74k61k00K44M4r2L88l69J09j91J8L28k44j35
5345a37M21l45J51K19k16Q6j35j60N02m75K93l99J10K1N2J11k20J22R4j0l29K03
$$ y = [204, -105, 139, 110, -102, 111, -102, 280, -162, -169, -121, 0, -123, -26, 102, -137, -101, 208, 64, 73, -26, 18, 195, 185, 65, -97, 42, -134, -54, 71, -95, 27, 16, 9, -179, 101, 330, 25, -228, 149, -45, 23, 22, -38, 124, 102, 327, 61, 118, 244, 79, -242, 85, 93, -55, 309, 147, -345, -57, 285, 264, 81, 99, -93, -14, 79, -233, -233, 183, 83, 21, -364, -77, 132, -114, 38, 115, 4, 272, 144, -239, -182, -63, 101, -88, 42, -141, 169, 342, 127, 37, -147, -92, 26, -70, 194, 41, -9, 125, 199, 72, 94, 173, 64, -32, 54, -372, 13, -36, -200, 252, -353, 106, -48, -328, -9, -47, 28, 265, 217, 82, -43, -178, -161, 99, -55, -101, -106, 17, -178, 106, -53, 13, 367, -279, 266, 102, 410, -235, 58, 99, -120, -269, -46, 157, 50, 224, -37, -237, 7, 51, -41, 347, -22, 87, -104, -86, 242, -2, -137, 284, -61, 90, 309, 93, 179, 44, -116, 386, -89, 204, -195, -85, -64, -12, 99, -121, 1, 95, 85, -244, -41]
5367d1q2Q7K02k70J93k92K48j07K90r7j33q2L58j22J07j30j65K41k65K3M4J89
5389A96l42K94l36R6K80k50L36k04q3p3J02Q4j66p2J81m51L80Jk44N88l73L24
5411B68m72N41k37j7l14L21L9P3k17l5L57k39l4n2o1L04K1k49Q0j05L26j07l68
5434a77L16l57L74l06K36j28J02j90M19n85N41k90p2J82j51M4J6J72k11Q9n7j45
5456a78O9O55m40Qk39K96k28J7J4j2p0P7K35j46J0j96K11N7j41j7J50j49P0k6
5480B7l54K95M0J87j14l28L0J5J13P4j98N22l21P8m0J09j73j0O2P8l57N92k84
5503D3J4J02k51M8L2O3J76o6j43K50l64n8L51L7j94J78j55o4P8K4r4k10K16r9
5527h6j82K45K2J34r1n0k6m8M23k42J29j94o6l0o1K41l70L01p4k3jl2M3J35j81
$$ y = [-41, -123, -36, 166, -104, 89, -203, 45, -62, 228, 131, -2, -84, 274, 152, 259, 129, -36, 205, -60, -37, 7, 196, -146, 148, -188, -92, 188, -62, 274, 70, -13, -86, 16, 100, -66, -138, 43, -408, -28, -27, -271, 317, -56, 268, -204, 337, 100, 83, -231, 90, 129, 202, -15, -50, 307, 68, 34, -18, -79, 225, 246, -3, 77, -28, 298, 191, -177, 139, -218, 156, -150, 86, -42, 60, -130, 289, -296, 245, -45, -117, 65, -86, -42, -26, 146, -65, 24, -33, -178, -109, 546, 106, 114, -125, 171, -57, -40, -26, -38, -108, -31, 204, 58, 68, -128, 83, 140, -1, -18, 132, -17, 53, 27, -327, -32, 8, 195, 81, -247, -217, -202, -89, -15, -213, 309, -12, 66, 26, 135, -38, -48, 14, 92, -265, 327, 43, 57, 159, -92, -44, -12, 51, 227, 161, 18, 268, -96, -154, 197, 234, 40, 218, 63, -1, 77, 101, 7, -203, 13, -86, -268, -23, -1, 133, 42, -8, -34, -82, 341, 99, 228, 34, -32, -62, -123, 118, -252, 49, -25, -48, -49, -81, -38, 97, -84]
5552h4K24k10M20m13pJ18k4L4o4m1K26k87L01m96M93j37m34K58J95j15j36R8K8
5575e3j13M59k74l12M91j90N5j61K06q2J33r9J03J29n8J00l46p4K61j00K2k89
5597a92j63L20J21n2k32K22j01K48O1j59K6J68j72l27K74k34L26l0j11J58K38
5618C89k47K1j5K4j40k92N4J43j11J17k61M97l24L91j66J40Om0j52k54J41k52
5640c31N24k82j50K28J46j29P8l32L56k71K22J45k94J94k9J38m73J07M51l12j18
5661a32K15j91PK9K47k87P9J44j77J8n1L6j74K16j30K38Mj74j00o5K31j49Q0R7
5685A1J1q7L22m34L43k37K2L92l51J58j13l5P4N3l48K83Jl0m0p7K79j17n5k35
5709b10K35J45%m11L42m2j79R4M0N6j93K98o26K49L52j81J19m8l9k23J92L7K0
$$ y = [-84, 140, -70, 350, -63, -70, 48, 24, 58, -6, -47, 179, -108, 193, -303, 190, 53, -381, -123, 72, -43, -179, -81, -53, -166, 293, 19, -293, 198, 8, 63, -98, 108, 26, 159, 60, 163, 292, 234, 334, -12, -86, 175, 75, 97, -192, -355, -35, 86, 34, -198, 24, -77, 171, 232, 73, 99, 267, 95, -232, 42, -192, 134, 104, -7, 151, 389, 142, 163, 148, 172, 32, -260, -206, -63, -174, -57, -318, 179, -145, 246, 80, 220, 226, 186, 34, -220, -79, -331, 193, -89, -239, -11, 135, 6, 84, -248, 108, -163, 59, 204, -90, 104, 75, 213, -260, -153, 298, -14, -132, 83, -108, -101, -72, 175, -112, -33, 111, -66, -48, -99, -63, -237, -21, -151, 87, 91, -83, -183, -248, -17, -166, -86, 11, 22, -65, 257, -177, 166, -71, -49, 343, -8, 150, 37, 2, 76, 129, -219, 64, 65, 35, -5, -82, 197, 80, 25, -210, 25, 170, 170, -241, 101, 59, -120, -26, 14, 70, -123, 175, -451, -202, 150, -31, 88, 40, 1, -222, -30, 7, 27]
5732B7n3J12k72J01p7J36p6LM9L32l28l00M04K90m1l08p4q7p5M6N21j92k63J1
5756a14J19J34K72l96J19R0j28j87O8l65RN00j51n6K32l38M04k85K54j96J09N
5778I9K99j18l82M2O2l4L2J7o5M9O8R4J84l75O9l54M36K55l78j56L89m14J44m6
5802h3R1K57q8n1m18O34l41r5k7J74j23k30K23j49L69j43m7j2J06P2p0m4K94J13
5826D12o34K00J23l60L17k5R9M7k40J51m19K27R%M01l14j84K31o5m5P9n3M0K77
5850B74l13j77K2J75j77O6J45L9o2K62p1k57M7K34k69J85Oj79j3j50R3n6K58j34
5874e2n9L45m16K52p6k32P8LL31k84Q4L83k96J70r1l05L64pj00P6q7k92K11q6
5898h6Q3k5J37k36K85j2m4q9L7M7j19j92K20QL9r7J31j44L40Lk65O1k46L31l37
$$ y = [27, -26, 86, -186, -85, -162, -26, -102, -99, -50, 282, -46, -346, 58, 348, 307, -1, -75, -162, -237, -191, 330, 138, -125, -114, 5, 139, 411, 15, 134, 224, 96, -91, -23, -388, -379, 121, -30, -86, 146, -192, 212, -73, 181, -15, 94, 99, 398, 280, -102, -60, 2, -32, 0, 17, -48, 1, 69, 163, 347, -28, 41, -313, 123, 378, 0, -156, 233, -181, -37, -83, 8, 265, 177, 126, -292, 342, 1, -94, -121, 53, -70, -300, -77, -226, 143, 0, -47, -59, 47, 119, 49, 5, 299, 412, -222, -22, 101, -259, 58, 33, 132, 179, -61, 90, -329, -102, -93, -93, 308, -6, -190, 41, -24, -69, 10, -43, -3, 274, -39, -216, -194, -19, -196, -130, 15, 54, -8, 254, 183, -74, -27, 207, -62, 123, 129, -50, -63, -213, -120, -176, 82, -52, -111, 234, -182, 70, -6, -238, -160, -157, 174, -110, -26, 357, 61, 231, 140, -165, 199, 192, 92, 168, 81, -211, 0, -86, -3, -28, 109, -127, 158, 146, 102, 13, 50, 97, -22, -214, 6, 14, 53, -44, 87, -57, 283, 286, 21, 82, -164, 167, -170]
5923a70J93J19l72K69J08K2k40J70K20j34q8m42O14k17L74l94j04j79K69P6R0
5944A84m44K95j18L0j18J71O7L8j45l38L34k14J33K61K77m55L24l05O2J43p5o8
5966C9p7N6K03j05l87L91l31M29K9l34N5k40M02m6k23M56k95o2L78k28J17p4J8
5989A71J4L5k65o0R6q4R2Q4J15l5j52k76K81M1j80K61K28k38k91J28oJ30k03r9
6013b13L15K35l06q4K18l7m4j05J7p2p1L15k11O2p9o7J68J94j23n4k87K82j79
6036a26OO8l97K62oM12l15r9K55q1j33K13k28L6m3k07K85K20K88r0n08L91k43
6059d0L4P1m6O7q5%p7O6k1o9k7J48l40L73p0l38K36J28L77l96j20L72R4m70M52
6084C19k81k03J45J29l96L85K1j16l8j0k10L71Q5M9l37K00j66J66k88L33J91j48
$$ y = [-170, 23, 142, -230, 39, 147, 169, -71, 99, 319, 185, 97, -345, 269, 52, 426, 32, -72, -251, 18, 94, 184, -260, 35, -83, -53, -171, 0, 67, 105, -40, -378, -44, -258, -125, 136, 413, -42, 282, -23, 39, 182, 107, 39, -38, 18, 221, 116, -271, 120, -211, 218, 247, -87, -32, -272, 130, 84, -139, 317, 22, -40, 338, 110, 227, 153, 171, 185, 220, -45, -105, -9, -93, -1, 83, 198, 163, 11, -265, 16, 57, -123, 138, 366, 128, -163, -35, -41, 89, -114, -213, 102, 337, 31, -53, 165, 128, 84, -21, -4, -76, -147, 168, -43, 19, -60, -127, 41, 235, 112, 58, -229, 53, -126, -120, -52, -449, -187, -193, 219, -96, -195, 60, -21, -154, 59, -169, -133, -176, -383, -98, 122, 410, 320, -188, 203, -40, -6, 65, 19, 86, 1, 1, -76, -10, -31, -100, -127, 21, -319, 54, -16, -354, -118, 10, 387, -9, -129, 243, 337, -133, 319, 38, -165, -20, 109, -287, 98, 119, 3, -35, -45, -255, 116, 201, 250, -87, 113, -53, 113, -175, 158, 349, 201]
6106B01m37j2K05O2K49m75L04j55J98j46k85M07k0O9R1j72L9l5j12K44j54J21
6128A87k0o6k50L57k5r7l9l0J22p5Mj33j41O13l62k36P9r9K33j45n1J9oJ40J84
6153A63k61J73n9l28L29J34j42J70j49m13O65l42K03l8l90L63r8r7Q2J19m6K42
6175B80n6m08J66j74KK44k17K72qP3m16M69pj27j51L2k46L0M95j04j99J02L2M0
6199A24O3k96p8J19J98j9N8r2j06J83l0p6l03L66p6K11j45nm4N4j93M56n71K16
6223A4N0K68l35k3L63l95L44k27L1j76L4R1MN9K37n62L57l49k20K00j90N18J09
6246B02k98k00L55NO4Q1n17M72k79J61J5K81m47q8K08j68M04k21k08l5K61N5j52
6269d9J17p6k32M34j81J94j92mL59n12J03J5n7j45Q1K63j37k4L50n76M64k53K76
$$ y = [201, -236, -248, -43, 19, 268, -207, 97, -58, 140, -6, -291, 116, 96, 165, 256, 84, 123, 88, -24, 220, 66, 187, 167, 101, -149, 208, 183, 86, 47, 17, 139, 64, 68, -65, -206, 407, 45, -191, -112, -211, 22, -123, -174, -155, -161, -21, 163, -98, 75, 16, -312, 17, 151, 9, 179, 30, -383, 282, -60, 143, 105, -285, 78, -20, -117, -35, 84, 38, 280, 224, -184, -18, -192, -190, 54, -163, 109, 101, 174, -242, 227, 220, 93, -58, -26, -272, -242, 253, 149, -50, 52, 84, 124, 187, -109, -187, -68, 130, 111, 169, 77, -29, 154, 124, 48, -255, 111, 35, 246, 101, 96, 52, 106, -87, 369, -202, 14, 64, 332, -3, -26, 337, -58, 286, 59, 90, -86, -52, 39, 43, 102, 339, -223, 134, -215, -435, -235, -425, 93, 202, -96, -296, 59, 64, 128, 209, -308, 164, -115, 46, 61, 342, -105, -193, 15, -153, 251, 30, -178, -213, 48, 103, -49, 68, -8, -240, 194, 13, 207, 15, 11, 370, -142, -39, -24, -81, -226, -145, 118, -19, -43, 307, -269, 195, -58, 218]
6292B18l00M7j24L43o6m90O26k88J79k07k19Q2N54k13k64q2R6J44k68L99j82J23
6314A08p2K12k66N8p4J39l40Q0K31J12q5k35J8q5J99K35r9n83M58j11j45j10L74
6337A9P0j10k13J35K66k55K21j21J61k92M9K20r6K30m89R4k2j32J8N12m4k97l9
6360a15K42p6m6J62j80o7p1J42l26L59J51m00J12L49J06l81K18l06K93k80Q8J21
6382I5l71L38j13R2P5j98rK18k04K71j57k40J7J29m6J51ol15O85l28j05J99M1
6405B19k90k2J9mR1j54J71J92j85K37j20j04k18J09Q7p7j06m0J92j38K02L1p3
6428A9J15j97k46N02J5k21j07K73m7M5NL43n38q0K2J80k4M4M8l46P3J91O3P7l00
6453i1k9nJ38P9J22n74O45n53M57j58R1p4k17N8K74l78K12M5L8j43k63K34K19
$$ y = [218, -82, -35, -159, 184, 118, -372, 254, -34, 145, -62, -281, -199, 355, 142, -122, -204, -108, 36, -232, 167, -15, 108, 36, 248, -18, 40, -34, 105, -235, -155, 76, 188, 103, -132, -114, -199, 0, 235, 136, -447, 11, -100, -245, -355, 19, 89, -21, -234, -99, 167, -88, 133, 12, 173, -119, -70, 150, 54, 284, -205, -111, -133, -265, -247, 265, 221, -76, -115, 127, 51, 5, 167, -13, -80, -151, -9, -335, 24, 175, -225, -113, 236, 342, -39, 179, -127, 166, -114, -26, 95, -276, 62, -51, 41, 116, -82, -91, 127, -77, 194, 37, -203, -186, -57, -103, 48, 42, -273, 412, 84, -21, 178, 219, -71, -93, -74, -78, 13, -141, 30, 222, 37, 274, 154, 50, -168, -59, 28, -49, -155, -195, -3, -141, 61, 92, 19, 134, -63, -309, 193, 208, -13, -120, 153, 106, 151, 156, 499, -39, -119, -97, 83, 59, 103, 151, -195, -122, 69, 132, 209, -91, -120, -125, 13, 92, 214, -360, 285, -268, 189, 31, 122, 48, -169, -111, 163, -215, -3, 42, 80, -63, -326, -92, 127]
6476A27m5p1j30J11R8n7j25J12j59M81m25J43j93j47M03j85O8j25p3J14L85j30
6498A77j02j69J04M8m2J10l52J29k5p0M60j88q2p6J37o0n4l2K10J97k07k20K85
6521A78l12K20k25K46m23K37n3Q3K38j85L4k52K01M24l32l46K86j56K17k32l5
6542a87r0N18m15N52j90o2j30l03M33j49r7J14L0K13l27l39O62p22M04k6L45k56
6564b2J8J52l94O7J26K82j80N5l34L03l93K58l6Q5k1O8J94j60K3k2k2Lp8k43K05
6589f6J05j97J56j33J9K35j39l8k7K04P4K2j31k43PL14l23J4L72k00k77L90Q6
6612B24o5j87K61J35k65m46L47K40n25R6K93j20k02J74J18oK5or7l61K34K11K0
6635I8k91K7l35K45L99Mm7k13j71K53J28j73o0J01J70m29K70K26l35J88k66R6
$$ y = [127, 82, 11, -119, -8, 90, 33, -92, 20, -139, 342, -83, 60, -133, -280, 123, -62, 6, -119, -192, -78, 307, 177, 75, -94, 10, 58, 16, 126, -226, -97, -122, -192, 268, 80, -2, -78, 59, -1, -55, -87, 123, 320, 113, -107, 178, -134, 86, -139, 107, -316, -79, -132, -49, 189, 4, 38, -214, -13, 411, 79, -267, 19, -137, 80, -152, -187, -277, 241, -174, 378, 188, 126, -4, -307, 126, -23, -120, -6, 24, 237, -90, -429, 233, -489, -85, -111, 234, -22, -4, 148, -246, -179, -53, 229, 49, 104, -230, 73, -320, -62, -98, -13, -34, 34, 228, 68, 91, 69, 47, 50, -28, -271, -66, 39, -158, -2, -135, -116, 119, -20, -58, -85, 119, 193, 215, 84, -159, -152, 162, -161, -147, 225, 25, -252, 138, 224, 159, -28, 233, 368, 103, -343, 4, 244, -281, -185, 108, -12, -214, -40, 78, 72, 97, 91, -6, -367, -133, 78, 98, -193, -166, -501, -256, 143, 147, 100, -113, -284, -31, 97, -76, -136, -35, 135, -294, -24, 202, -133, 55, -211, -115]
6657a15L18j83J02l29Q2J58j8k5k0K97l73Lo8J62l9L5K59L5q0l33j60J04j68M37
6681H1J77j73J71l51j3K91k60J43%J25j17q6J8K9j31L38l90J1K58l07K72m7q4
6704d5J07q2k5K48j03j16j37K72NJ58J10p27M12K20K2k6m07j03K26K02m28M4L83
6727B10l25N2K6J47k08N1Q6q3n5L12k60j3J53l4J43j19J28l99K38K06l47l8q4
6750b13J50J59m50L46J98P6q3n9N8o8k29J09q7K81j81K0Q1j55J40o8M5j22q1J0
6774a23K9K3K87k56K2j49J62O6L6k03M3L0K1j3K94jj82k79O5J68j22rk1J65l0
6799B3J66l06n2L66m96K26o1J22J51J33l26O0m0J96l20K2j75J65Q5N5k3J52k69
6822a46J34k29K03J04K16k41J54l36kK51l37L22p4J52k09J42j32KR0J8j08k80
$$ y = [-115, 203, 20, 122, -207, -125, 33, 15, -10, -30, 267, -106, -103, -171, -9, -48, -13, 246, 281, 201, -132, -292, -188, -356, 81, 258, 85, 256, -95, -108, 183, -77, 66, 66, 191, 74, -12, 6, 35, -96, 242, -148, -137, 121, -186, 86, 39, -45, 62, -20, -45, 203, 100, -16, -153, 119, 124, 282, 392, -335, 77, 297, 319, 293, -114, -217, 9, 211, -217, -173, 210, -115, -63, -37, 110, -98, -47, 39, -44, -99, 213, -47, -60, 93, 59, 202, 83, 211, -188, 50, 256, -91, -129, -213, -63, 96, -354, -8, 190, 266, 183, 124, 182, 114, -115, -6, -93, 188, 7, 27, 108, -47, 93, 25, 70, -52, -133, -123, -94, -71, 216, -40, -18, -167, -5, 61, 97, -106, -63, -33, -12, -25, 269, 268, 86, -193, -128, 40, -82, -91, -112, 53, 23, 189, -117, -169, 197, -299, -73, -134, -12, 139, 272, -54, 6, -34, 162, -158, -136, -311, -146, -61, -6, -29, 123, -146, -12, -241, -38, 66, 282, 41, 195, -141, -143, 108, -229, 93, 19, 171, -38, 104, -28, -26, 64, 82, -26, -306]
6844c06N31k24P6j55jK3q7j31K99J47k21J14q5L23o14J30Q3K46k66K0j75K24j20
6867a69j24P9L70l10K6J66m8J86L39n58K9m7n4L20Rk20n9L50k04j25j10L45k09
6890a8J43k13L49k1l92K54J06n27L20L7l07K53k0J95ko94O72k09Q2Q2N7k41L56
6913B62j96j27K10j78p1l9R3KL13k92K68m08L68k31R1j59K36J95k76j15Q1Q6l8
6936G5J23k89K92o06K88M09k17K46j60o7r1K0k4k4M95m92K2j72P8p6L38j02Q0
6959A46k58K2M7J00L6l73L25qN0O4k97L0J31n5O4j81P4Q5L22o47J76K01j14N3
6983gk00L54O3j65k36J07M47m42p1o6K05j31k31K8N08k08MJ16n6R0J1l73O7L95
7007B09n08N87j85l18L02Pm5j31J93j1Q3j33q6N6l22K71J68k81K9m2K90l28L11
$$ y = [-306, 225, 1, 77, -78, -79, -56, -143, -274, 25, 172, -49, 65, -20, 303, -311, -181, -98, 148, -118, -98, -273, -49, -169, -293, -214, 156, -154, -128, 38, -10, 176, 515, -43, -14, -61, -115, 205, 214, -6, -65, 285, 81, -44, -154, 191, -18, 125, -88, 261, 240, -152, 102, 208, -319, 1, 38, -269, -16, -36, 159, 157, -537, 135, -74, 8, 90, 147, -94, 262, 66, -61, 149, -29, -100, -139, -46, -44, 269, -23, 245, -163, 205, -26, 65, -94, 142, 337, 61, -54, 27, 113, 75, 198, -91, 201, -405, -117, 292, 75, 321, 161, 94, 3, 23, -1, -25, 470, -22, 0, -172, -94, -170, 168, 66, 146, -112, -90, -43, 57, 93, -280, 45, 37, 87, 151, -146, -116, 15, -40, 24, -157, -83, 2, 324, -323, -147, 54, -60, -7, -207, 147, 210, 45, -191, -84, 363, -79, -150, -216, -11, -142, -373, -345, 163, -45, -41, 75, 19, 109, 120, -253, -186, 209, -299, 288, 103, -215, 87, 94, 49, -82, 111, 100, 183, 50, -36, 20, -302, -31, 137, -144, -115, -157, 133, -195, 116]
7030A16j43J29p0J41l6k18n3J38k6k03MK22J86PRj6l37L8r5K31K84l75j6RK77
7055B03J11n22J14J05j79K09J2J35l1p9j35j05L19n7j08K01l67J88M1k18o6K76
7077D7k68J91K92l54J7R3J18r5r2J76r4j60K19Q1k32kj96M19r7r0ML71l48L4r6
7102f2jk0L71m64J7L14n07L84k18K51o5NK66M9j60J41k48R6m93J82j6O4R9m9L6
7127b8l0p9M39k75L60m72r5K1J59Q6j19l0J61j83R6q7q0K57j51L82k35j94J32
7150C5j78K96j39j05q9j26L69m8k2jk65K54J49r7M3Q2k64L02k33K32j26k37Q2
7173h6M48l09k57K58k29P9L1M07k31mk35L71n82P05n14J38J15l9K5j01k52M43
7195A81k25J08J98l17L48j76q3L27k87j53J74j71K82l99N94k19l71L06R0j43J40
$$ y = [116, -27, 102, 32, 173, 137, -81, -134, 4, -22, -225, -221, 1, 187, 194, 203, 187, -150, -112, -207, 24, 308, -67, -83, -74, 203, 314, -208, -94, 11, -168, 41, 53, 188, 157, 78, -57, -162, 157, 100, -8, 193, -174, 14, 55, -163, -229, 47, -221, -30, 262, -92, -75, 18, 136, 41, -51, 125, 31, -129, 90, 171, -61, -63, -259, 160, 63, -27, -23, 348, 0, 34, -62, -63, -83, 288, -176, -159, 155, -352, 32, -186, 65, 0, 5, 271, 320, 160, 301, 53, 149, -344, -162, -178, -114, -15, -64, -28, -58, -137, 302, 27, 387, -85, -180, -159, 0, 86, -33, -63, 98, -85, 11, -76, -156, 101, -50, 332, 97, -97, 35, -143, 153, 14, -91, -180, -306, 63, 15, -7, -8, -273, -19, 130, 33, 76, 158, -106, 196, -37, 195, 69, -168, -86, 362, 53, -204, 54, -175, -96, -65, 342, 111, 107, -128, 243, -339, 366, -148, -10, 105, 66, 91, -10, -262, 181, -44, 64, 262, -55, 293, 117, 34, 361, 74, -79, 95, -76, 206, -193, 401, 182, -189, 117, 207, 64, 204]
7216B04m38J79Ko5j07L05Q9j05K07k73r8R6L1o8L40k16J17l15J89j40o7K87m25
7239b71J51K8K00l31M78k90k00k1K20J85m33K64J55k35J83j4P8k62J58m2P4P4
7261A49l36l1K08K17k38k0j6P2K75k83k4k67J03J13M7j82L92j52j76L37k80j04
7283a96M3JM16m2l4p7n2k36K8K47J36m15R3j66j75K22K35L5R0J71l53K49j67K5
7307G8k6k4Q8K65m75k3K13J62m44M79k07l50M12l27j13L14K83k62L3J35j21l09
7329b19M81l68J15O4j37k72K95l06K64j79J30K85k68L86k65q7J99M9o2k00L23
7350B28j17k10J08K49m97L81j21k31M17k21m9N8j08k67J15j86O62jN6p1j64j55
7372a24L5K0j60J57K25j65K22j39J13j31M1j18L65n0m22J10l04N27j13K94n90
$$ y = [204, -234, -55, -53, -118, -225, 80, 169, 64, 271, -2, -100, -4, 27, -41, 299, 83, 200, -115, 74, -66, -133, 154, -271, -120, -92, 108, -223, 255, -35, -235, -256, -36, 149, -284, -20, 135, -100, 83, 69, 147, -115, 43, 1, 75, 149, -187, -218, -10, 207, -31, -51, -67, 5, 280, -3, -27, -294, -191, -78, -31, -213, 179, 27, -149, 188, -92, -196, -153, -152, 264, 222, 188, 111, 59, -177, -149, 98, 234, -181, -88, -254, -429, -207, 28, 63, 153, 324, -29, 220, 53, 78, 52, 28, 116, 381, -94, -117, 96, 258, -186, 293, 86, -264, 148, -179, -292, 22, 305, 43, 76, 211, 90, -219, 262, -106, 9, 73, -64, -336, -41, -347, -83, -262, -132, 153, -115, 271, 6, -81, 118, 167, 105, -95, 228, 111, -99, 9, 258, -239, 142, 21, -210, 207, -14, -63, -5, -113, -380, -265, -451, 211, 210, 266, 195, 31, -124, -89, -69, -229, -72, 153, -12, 210, 71, 184, 53, 94, -24, 341, 291, -131, -21, -325, 202, 89, 383, -207]
7393b07J79n4L06j95L43k36l34J14K67l02J23J2N5l39K01p3L68j43k0n2j96K65
7415H2r1J08j72l7J90j02P9j05J53K70j66l08j15N25l63J51j09Rj41m6L80l35
7437a43q9K09j33l8K55P2j23j64M7J56q9N0P8oR9k64p0J03K37m04L68l02K85J32
7461B66k66L1K19J24m33L07j76o3K88l01L18k83k57K37J00L02k21j96l05K38n0
7482a21J41Q8k13rQ6Q6J7l27L12J57M1j82J27N5k26Q3J78l94K35L3j73L01j40
7505A55k40L9K49J28k75n0L4m9K06l02N8L66n40L66J31N9m54rJ83j38N47n72r5
7528b03M07l42L69p3k77O3O1l91L92j53J71J08k98j9J5o7O45l29l01J18L5o3K25
7551I3J70l89J53J42o8n19L57J17J02q5r0j91R2J26m4j16K31L5K54l29l5j73K10
$$ y = [-207, -28, -82, 224, 29, 372, 136, -198, -84, 183, -119, 4, 16, 71, -268, -67, -140, 228, 85, 65, 13, -183, 82, -9, 99, -73, -110, 80, -22, 57, -48, 105, 375, 209, -99, -214, 311, -52, 99, -10, -1, -142, -188, 192, -143, -232, -23, -156, -194, 61, 133, 10, -154, -107, 49, -40, 10, 88, 82, 181, -83, -153, -50, 187, -217, 151, -151, 134, 266, 0, 31, 250, 374, -59, 248, 72, 9, 297, -4, 314, 31, -226, 11, 111, 413, 192, -4, -309, -71, -121, 20, 108, -105, -114, -28, 58, 75, -252, 60, 217, 258, 76, 203, 258, 32, 115, 293, -101, 134, 167, -6, 295, 155, -85, -46, 203, 331, 56, 6, 40, -9, 197, -105, -47, 319, -221, 145, 276, 335, -119, -128, 55, -83, 464, -108, -203, 204, -138, 231, 158, -119, -56, 5, -386, 6, -147, 24, 132, -166, -185, -170, -237, 408, 79, -222, -104, -69, -132, 93, 263, -126, 27, 169, 101, -418, -61, 56, 158, 73, -17, -208, -116, 10, -34, -150, 81, 116, 370, 41, 6, -167, 43]
7574D3j03r3L63k42M13m57j50P1KP2K44l61J68j91K58J25m71M05L4k26L29L7l96
7597a26M06l47O8J32J9K95m29j29K71J13k55k09J07R5Q4Q7m10J79l0L44k29o2
7619b6J9n7K45J21j22l30j33L57L6m7j95J06r2J50K16j30k37J27K38l77K28J02
7641A99j60K6J65j73m6j00L06k30o4l51L73j48L00J05k06m6k68O0j15N64k82K11
7663A20O6k05k69K69K75j34J06k68N0kJ40k27m1K40J67k62J14K16m24K11R9l05
7685f4J99Lj62Q5J82m28K14k64M95j74k76L16n5k73M40o53M16n3N2j49J1q4J4
7708b08J83K85k00j21K46k21J93j48l06O94j24k76L32l23K81k99k79M27l8K0Q2
7729B00k38qk7m9L42l72p1N62n63j5M50k78j43K53k06L0k1O8J13q7Lk6J57j55
$$ y = [43, -60, -153, 210, -32, 381, -76, -226, -155, -153, -81, 163, -198, -30, -221, 37, 162, -309, 96, 130, -96, 233, 270, -126, 280, -67, 1, 133, 152, 447, 18, -111, 160, 273, 18, -191, -84, 11, 95, 182, -228, -49, -79, 265, 36, -26, -7, -64, 181, 302, 180, -150, -283, 74, 110, 63, -132, -26, -118, 32, 248, 118, -119, 8, 246, -131, 97, 199, 39, 65, 230, 57, 11, -89, 217, -13, -77, -428, -55, -203, 97, 202, -4, -50, -318, -258, -373, 191, -91, 120, 186, -19, -288, -19, 256, 122, 228, -40, 10, 8, 148, -79, -120, 120, 287, 25, 139, 355, -69, 142, 241, -64, 135, 138, -24, 61, 243, -185, 29, -235, 260, 86, -190, 126, 71, -202, 238, -415, 1, -52, 0, -149, -138, -222, -208, -25, 260, 60, -61, 185, -36, 157, 9, -297, 397, 273, -3, 329, 6, 287, -12, -291, 136, 98, 118, 200, -38, -46, -73, -122, 220, -152, -223, 339, -224, -239, 211, -67, -210, 43, -163, -133, -154, -86, 27, -60, -57, -83, 74, -81]
7753h1O0k39M79k67M09j48j56j21r5J98k95J74L17o25M05l0M0j43L4j34K09K11
7775B02l71j2K31J81l42R7j44J50j54R2J69L18l58k05J46J74m0q7O8k09J88k02
7797a08Q0p6L60m26j58J15o2J99n7J90k02j62R0L57r3J7j08j06N56n44l7K78j29
7820b6r9K27N4J64n08p1K27j81j22K6N4K12o2J06n5k1m5O9P9l07jN84p80M38J60
7845A22k2j67L08J01k84k64J93j52K49l29K8L58j71j37K14r0j29K95l99N23k92
7866d5r2J61N5R8p2J05k9J29l71oJ70k77M45k87Rj44k34N14j49L14m76K53k3j38
7890i0K20j88K44j54o8J03k85L77o1p2r2J96J46l85K90o7J45m04n3L32r2K63j9
7913B86l86J0J67P7k35j12J65l18rL76j49J59j34K47l7J36j2k06KQ8m94M37J45
$$ y = [-81, -21, -260, 219, -48, 361, 213, 57, -64, -159, 39, -256, -82, 235, -390, 15, -15, 25, -118, -84, -218, -9, 202, -169, -181, 50, 231, -111, -14, -158, -8, -162, -70, 99, 417, 59, -146, 0, 174, 134, 47, 115, -94, 94, -108, -28, -104, 256, -170, -328, -213, -275, -76, -133, 57, -145, -307, -217, 140, 47, 64, -44, -150, 406, -138, -175, 103, -26, -125, 102, 156, 320, -188, -259, -32, -213, -335, -309, -255, -43, -105, 1, -54, -75, -120, -51, 28, -279, -280, 304, -476, -38, 122, 100, -67, 241, 342, 58, -206, -13, -165, 84, -245, -217, 141, -30, -167, 47, -43, -172, 123, -276, 247, -45, -137, 24, 79, 177, 105, 210, 181, 310, -61, -67, 103, -174, 271, -16, -7, -151, -385, 129, -20, 294, -182, 71, 48, -90, 130, -58, 186, 32, -36, 67, -218, 159, 98, 26, -66, 130, 276, -109, 181, 114, 259, -145, -198, 134, 42, 305, 286, -100, -90, 77, 154, -81, -193, -28, -346, -355, 21, -128, 31, -103, 144, 107, 243, 231, 25, 27, 115, -379, 58, 203]
7936B03j32q5L27j02k71m9L8k04J01K23k20K15M3L1j25J31r4r3J98j22L0o7K16
7959A92m6j85J28O3j9j67L73k51k08K0J35j38o4K44oM0K2L6q0r8N2m7J17j41K82
7984B54j27k18j50K93L0j01J6k28J69K32j05j58j89J72Q6j97JK63q3P7k99K47
8006a5L11l41J7Q2q4%r3Q5P8q7J90J24m05J70j86K8j15N1J47qK03k82j08j16K93
8031f1J42J76m49R5K8o3R1J31j18j33J64m49L02M74k92l8p3RR0K5j18K5j30K33
8055F1J64k96L41l77R1j74J83K24k66n1J45K03l27p3P6P5m9Q3k2N8r6k70K17M39
8079C59k20j85L79k06j07Q6Q8k38J42K06l66J84l5j32J96l22K68K24j25r2p1L1
8101F4J25n7l31K27o3o6J49o8J62m99K10K67l72N6Q9p6J01P7K7L2k21J97oO6M4
$$ y = [203, 71, -14, 313, 211, -60, -109, -71, -275, -174, 49, -171, 44, 87, 118, -7, 124, 30, -63, 135, 13, 43, -24, 192, 146, -39, 89, 152, 133, -34, 339, 88, -120, -100, 35, -103, -167, 77, 71, 111, 133, 169, 89, -9, 43, -4, 113, -28, 254, 127, -91, -241, 52, 82, -19, -3, -231, -62, 170, 65, -93, -282, -110, -24, -221, -220, 43, -40, 37, -262, -15, 296, -45, -28, 54, -30, -30, -123, -38, 40, -47, 143, 267, -138, 32, -154, -126, -241, -190, -43, -51, 152, -130, -238, -354, -61, 81, 257, -192, -97, -69, -132, -41, 90, -28, -161, 3, -446, -144, 330, 38, 0, -73, -64, 26, 51, -67, -42, -172, 61, 225, -71, 270, -107, -16, -190, -7, 217, -49, -100, 45, 248, -79, -152, -76, -1, -50, 33, 11, 69, -27, -297, -80, 359, 139, -46, 333, 127, 20, 106, 194, -44, 98, 304, -62, 122, 87, -45, 151, -171, 97, 321, 196, 104, 33, 64, 189, 132, -199, 28, -35, -101, 48, -20, 142, -357, -147, 120, -252, -196, -107, -183, -82, -5, 22, 54, -167, 30, 24, 90, 134]
8126A34l80K68M7K4r4J57j13k25J46L8j51p4K61J18k67j43M3M7J72Q0r7Mj6K1
8150@K5l59K82J89n37L14k6P5l7k5j90J23J93o2R9O2mk04M7j11m0O5J7J71J49
8175B16n37L84l02J52l14L97r2Q2J23j38J87m97N74j22o2N1
$$ y = [134, -246, 22, 69, 93, -1, 156, 43, -182, -36, 2, -149, -223, 38, 156, -111, -254, -211, -164, 8, 88, -9, -5, -21, 0, 25, -334, -52, 137, -400, -86, -112, -37, -74, -99, -289, -166, 27, -35, 64, 126, 122, -82, -35, -146, -186, -121, -104, 67, 216, -321, 63, -239, -87, -401, -4, -96, -14, 109, -29, 158, -339, 235, 113, 51, 102]
8191A02
$$ Imaginary data points
##PAGE= N=2
##DATA TABLE= (X++(I..I)), XYDATA
0@%%%%%%%%%%Qj6J6j6J6k4L2l2M0m8N6o5P3q8J01j13J29j49J69j89K13k41K70
33A42l02L38l76M19m66N16n72O34p01P75q58R52j056J173j306J456j632J836k079
52a107K378k749L226l867M776o174Q628j4153M9620j3762p3383O9497o193l8817
66b2080L1699p368l7661M9517L197m4715K2566K4708k1027Q065k756j4347K1685
79A1483L454l2046M897J8400l715r468m389J2159J2218j3600N31P869j0643Q995
93F145O365k9452N568K7532k0185j3585J9527J318j890M985r783M500J1399j2508
107f4l495N324q285O001M011j7153Q889J4473j3859M225Q712j2768J0590M643
121A1244k4202J3060J2043k8380Q889K1119k6961L138K8760k1001q731K7378j0900
$$ y = [0, 0, 0, 0, 0, 0, 0, 0, 0, 0, 0, 8, -8, 8, -8, 8, -16, 16, -16, 24, -24, 32, -33, 40, -48, 53, -60, 69, -80, 89, -100, 113, -128, 142, -160, 178, -198, 221, -245, 271, -301, 333, -368, 407, -451, 501, -555, 618, -688, 768, -864, 972, -1107, 1271, -1478, 1748, -2119, 2657, -3517, 5111, -9042, 40578, 26816, -46567, 22930, 16737, -22080, 9619, 2251, -35410, 14107, 17304, -27411, -4845, 19863, -1164, 6901, 4145, -10202, 11483, 14937, -17109, -12212, 6188, 2473, -6995, -11384, 775, 12993, -607, -76, 7793, -2850, 6145, 12510, -16942, -11374, 16158, -4027, -17612, 1915, 3233, 1343, 6328, -3455, 1045, 12444, -64, -3559, 1765, -6520, -519, 3492, -13661, -4772, 9701, -4158, 67, 8779, -3989, 6601, 11244, -12958, 102, 12145, -16235, -7346, 13773, -13188, -10050, 18710, -2291, -11022, 16356, 5456]
134E456j4804J8125n205j5548J3517J154j2657P447M200l269N317r08m499P182
148E508K837r453n588P625L196j0446k332R402j178j413P428o150m200J6244j559
163I921j9757N602J3580r778p984M791J458L533J984p712J178J1627n25q416k903
178c401L690N257m975r421K014Q748K160p112m980J0514R986j0441q563Q980L850
193F306o230j922l667j568J1544K54j6173N658J7909o287j0618N644K506K28L70
208C954j1101r79J2558j477j1833M484Q434j227O21k250m333Q424M066j4275l653
223h587J1291K39q237r53M624M207N91k710j066K970M264l272p837J038N594k190
239c4n737J232L798K236Q2k641J353N455o09o179N75J673k605m35m75k695L071
$$ y = [5456, -9348, 8777, 3572, -11976, 1541, 2695, -9962, -2515, 1685, -1584, 3733, 2825, -1674, 5508, 8345, -1108, -6696, 929, 4125, -6321, -8653, 749, -429, -1842, 5586, -564, -4764, 11480, 9921, -9836, -4234, 9346, -432, -8416, -3625, -2167, 1366, 3350, -4362, -3184, 8443, 7918, -498, -3401, 289, 5546, 571, -8850, -6836, 1912, 4072, -3040, -8020, 2494, 12480, 2039, -6524, 2456, 6306, 76, -1846, -5513, -7081, 4463, 4717, -11456, -5798, 12111, 5824, -4794, 850, 3356, 3584, 3954, -7147, -8126, 4432, 2955, -8878, -4394, 4040, 2813, 3434, 1184, -3149, 5275, 9341, -4934, -8587, 2704, 2943, -5294, -6247, -1623, 2584, 3175, 465, -601, 2369, 6633, 3361, -4476, -3438, 2156, -34, -5771, -4539, -741, 1495, 1577, -1064, 289, 5744, 5135, -1044, -469, 1204, -1401, -1836, -2311, -5006, -1935]
256a935M244k254j773M249L032l957j585K542k537k889L170j666m897M993L225
271A962m257J810M349l152J572L095o970r81O689n240n012N756r39j806O290k988
287A78l542Q863J137q357M00M137k477j862j174j827L552L730l828k816N756L957
303E827l246l944P89L403r42m173k853K305M895j438n597K239P817o02m866o34
319a020K685K182j969n958j206N965K050o312k636P537M484m399k875K173K547
334C248R01l842o199L408O649n026o357N545N236k049l55j582J77O335k030r562
350e503K369O756l579m774K255J155K649J854m709r55Q014J44q159m3M052j193
366C33j453j741j415M044L730l895k556N444L013m402j859P67j39N60j367l527
$$ y = [-1935, 2309, 55, -1718, 2531, 5563, 1606, 21, 2563, 26, -2863, 307, -1359, -6256, -1263, 1962, -2295, -485, 3864, 712, 2284, 5379, -1591, -2572, 4117, -1123, -6135, -379, -1318, -3124, 3166, 178, -3364, 5499, 6636, -1721, -1321, 2816, 339, -1523, -2697, -4524, -972, 2758, -1070, -3886, 1870, 5827, 2581, -1363, -574, 2829, 1887, -2286, -5139, -2834, 2061, 623, -4974, -2735, 5082, 4480, -386, -1020, 1665, 3847, 1878, -4080, -5286, 679, 2729, -3583, -6219, 1318, 5802, 1403, -1472, 701, 3248, 4149, 307, -5892, -2484, 4165, -861, -7218, -1673, 3563, 1514, 1159, -423, -246, 6089, 4059, -5503, -3134, 3622, 43, -4731, -2476, -1321, 1328, 3182, -1527, -2482, 5532, 5676, -2483, -2526, 1526, 333, -1120, -2861, -4276, -232, 3498, -397, -2953, 2491, 5504, 1102, -757, 10, -129, 431, -936, -4463]
382d463J868M350j296k200J601L019L49k080j362M44O47k99k433j903K261K072
398E75j323n98J974J568n83M57j000k086K322o0m907O40L013j387L91J762j655
415h97J414L831k401l834L279J256m037p12P06j804K910J498m219J350O029j391
431B978l686J114J447o72o89k718j652L634K230m808r61N503J427k129l83l66
447B69J572J473l810m156L115L721l097l371K461L597O99j101k250J358L730k190
463B020m727k60L800K97l994j516L813L292j202k288J73L362J614m307l810L536
479a97K537m083k017J820J215K663j22m493K546O496l678n598K964J552k192k44
495h31k297n8N259k4m636J341M401P2k490q92n19J810K89m361j172M337P33k469
$$ y = [-4463, -2595, 1755, 459, -1741, -140, 2879, 3228, 1148, -214, 230, 877, 578, -1855, -3758, -1497, 575, -748, -1346, 628, 2196, 1613, 2070, 1070, -1016, 1306, 1246, -3661, -3021, -8, -1395, -1004, 758, -897, 517, 4348, 1947, -1887, 1392, 2648, -1389, -2101, -1395, -3199, -289, 1209, -3010, -1660, 4369, 2978, -708, 406, 1853, 1181, 492, -2226, -3878, -244, 1986, -2822, -3783, 1720, 3147, 1018, 635, 269, 1841, 3314, -496, -4652, -1537, 2184, -913, -4284, -1823, 1774, 2473, 1372, -878, 480, 4210, 2020, -2707, -2967, 833, 1130, -2864, -4380, -567, 2725, 1523, -765, -592, 2770, 4384, 77, -3733, -197, 2340, -1743, -3760, -1940, -725, 1938, 1816, -2677, -131, 6365, 2687, -2911, 53, 1605, -587, -831, -3128, -3186, 2073, 2049, -2587, -1246, 3155, 3227, 737, -155, -674, 1136, 1425, -2936, -4108, 229, 962, -1507]
513a507m00L093J489j144J49j430r00K572j079n220J791M102k056j922K338J098
529I74P40O57j967q21K151n98k359o61K1Q17J121j825j26L215J390j708o58K6
547C89J136j08k975J66R16r02J346l85k808L813L785m865n02L764q69k015M86
564C72k807K21L655k478k496L656R36k00J048k668P84M292l042m747K165K144
580H35j627j839J37K272J418l08o18L8J332K021k327m759K424L728m041k560K963
597i11J240O32K7k349J796L897l116k115O80m76Q19L44m422J147N509j894l422
614b614K363L191p2k462j335J469M76j586r69p29J52M261j123m803M052M409l834
631H46r82J284j568K132r27n086K527L538l373P7K691j950K210L233n676j442
$$ y = [-1507, -1907, 1186, 2675, 1531, 1680, 250, -650, 1922, 843, -4377, -2586, 1516, -540, -2462, -124, 974, 1714, 2371, 404, -417, 1734, 1136, -1223, -1884, -1863, -1046, 75, -1750, -1876, 1339, 2729, 1021, 363, 389, 1525, 1417, -1558, -1392, -476, -1378, -32, -417, -3225, 588, 4373, -492, -994, 2770, 1901, -114, 372, -2435, -2214, 1441, -1037, -3533, 123, 1059, 859, 1907, -761, 23, 4315, 1273, -3474, -1309, 835, -792, -2631, -2494, -222, 1196, 888, 270, 308, 1640, 3661, 1334, -3425, -1001, 2727, -1314, -3874, -911, 329, 961, 988, -1361, 435, 4332, 1216, -899, -219, -695, 124, 468, -3954, -2807, 2702, 808, -2614, -251, 2940, 2868, 406, -929, 540, 1016, -570, -1539, -2268, -2116, 2145, 1022, -3781, 271, 4680, 846, -136, 1148, -420, 1712, 785, -4301, -1774, 1764, -1609, -1532, 1159, -791, 1419, 4652, -1024, -2466]
647b466O790k631n601K561J396j127R80j251j59L343J13j334J31n81J206K34l778
664b174o63K869J89j720n73J523K699m20k465J742J135j916M09m03l291K293K539
681A773m165j073M729M39j053k97j44K285n18k728P24l97j581K434j119l403M585
698D91K638m212Q19K404j062P90r22m078K839K603n838J112M080l703K426L326
714C713n934J241O861m769m718M542O63l046K35m67j91K633J57k078Q50K001Q28
731B521j571k172J092J335q09k405r18K625K061k410k211N001O54l225J765m38
747H95k745L622m82n948K430M709l307j226K051N25K007r91l100K087J936k970
763e07n87K00j080K515J12l599J740L761j532k98n19p64L512j491n412L087K339
$$ y = [-2466, 4324, 1693, -3908, -1347, 49, -1078, -98, -1349, -1508, 1835, 1948, 614, 745, 164, 1370, 1604, -2174, -2837, 32, 221, -1499, -2072, -549, 2150, 1730, -735, 1007, 2142, 226, 635, 232, -3059, -766, 1773, -2392, -3465, 1264, 1703, 650, 353, 209, 2494, 1976, -752, -28, -425, -2006, 428, -691, -4094, 491, 3129, -1083, -264, 2140, 1078, 1868, 946, -3132, -293, 2310, -3528, -2416, 1664, -2039, 387, 3713, -2221, -980, 5881, 1112, -3606, 936, 1599, -1447, -1212, -1679, -1870, 763, 920, -1158, -308, 1693, 2521, 950, -1222, -130, 1205, 396, -2009, -2927, -302, 1759, -651, -2862, 2139, 2793, -432, 1333, 895, -1850, 1772, 1290, -4658, -2228, 2481, -826, -2052, -1, 524, 2531, 1540, -1560, 527, 2463, -507, -1094, -894, -1974, 541, 653, -2946, -1206, 2555, 1023, 725, 206, -558, 2954, 1463, -3949, -862, 1477]
780A477l458J171R95k181K934K549m259m20M146j662k265J97k90Q18J44j935J060
797i79J641r9J66l98n66K278o45k550j77M95O97L83k692o5M472p32l047K767P39
816A688j609J771j070l568K842J661m094N4K616M2K15l67q14K521N26k301l33
833b20p6j24Q10j787j262K884P98j391N30k87J511J600k956k013L613n64l349
850b283J223L01r00K558j58k848K766K515l002n68Q54n0K98j184k050J765J787
867A024j375k97L40J049Q13n79j367P79N65m00j547j099J552J927k347q63K703
884H78O56q62L76q99o2J722j701k384J157J235n76n24l47J437K159j535j228J444
902I46N20n64r16j181K33J558j210j181R04R04J068l05j382M22K421j537k100
$$ y = [1477, -1981, -810, 185, -1996, 938, 3487, -772, -1192, 2954, 1292, -973, -776, -1066, -248, -104, -2039, -979, 662, 563, 729, 331, -235, 2043, 1398, -1152, -1329, -834, -137, 246, -2446, -2511, 1961, 1229, -1818, 949, 1688, 79, 1850, 780, -2788, 54, 1715, -2379, -2325, 291, 333, 548, 181, -633, 1888, 2414, 113, -220, -296, -420, 390, -1397, -2659, 225, 1023, -368, 162, -125, 1386, 2986, 30, -1983, 1630, 1066, -2283, -1060, -759, -1659, 899, 741, -2107, 659, 3174, 172, -396, 458, 408, 706, -478, -2528, -763, 1024, -351, -648, -308, 741, 1554, 975, -392, 387, 952, 552, -995, -2094, -542, 1385, -962, -1825, 878, 1534, 672, 1048, 149, 87, 1809, 108, -2276, -1119, 116, -460, -984, -1331, 106, 2265, 730, -498, 946, 1466, 902, -14, -1195, -962, 596, -614, -1795, -891, 13, 1081, 776, -606, -184, 2237, 700, -1400]
919a400J286k57o04N86j173OK914o3k033Q95J712n11r18j014l23Q78O91k279o27
938b234K287J121j423r2P32J102M9j064j117j20J567r34k150J023J680n06J86
955A07j79J52J462k84j476o54J756n28j699k05O20Q81N62r99l17J686J207j384
973G08j072N05Q79q84j609J17O28R25P8j481O38K011K90j710m1P85k14o56r03
992a006o55J295J192j293j518K679J164j445l68N18l33R03q13j574P6J717p81
1009b42j133R38J055J28K7m46o74J769m37j650n62J267p6q21l40N47Q34R08o84
1028D08o76J284N93j600j172M65P30j72o24k55R8J972K38j581N3J806J56j674
1046D9p53O19J22l29n28n84J319Q27n61o85O70J377m88r27l94l95J081p97j431
$$ y = [-1400, -114, -371, -975, -389, -1562, -1556, 1358, 1295, -738, 157, 1869, 1358, 440, -574, -897, -19, 672, -1607, -2234, 53, 1174, -249, -341, 391, 1493, 1542, 478, -639, -759, 808, -126, -2276, -1253, 427, -79, 107, -72, 80, 1542, 1258, -218, -872, 884, 356, -1343, -1548, -928, -47, 515, -484, -801, 885, 2092, 708, -364, 141, 1020, 136, -1473, -1356, -728, 197, 275, -1206, -568, 1443, 1733, 23, -18, 767, 553, -103, -1006, -1661, -366, 826, -467, -1985, 694, 1858, 413, 45, 563, 230, 1133, 320, -1254, -1178, 539, -242, -1375, -437, 618, 746, 773, 327, -347, 1422, 985, -665, -1227, 40, -36, -857, -1197, -650, 184, 1092, 408, -268, 1016, 1609, 9, -1163, -698, 32, -140, -764, -1019, -921, 1051, 1289, -292, -239, 1567, 1723, 49, -704, -85, 37, -292, -820, -1404, -85, 742, 181, -504, 166, 1543, 1055, 128, -266, -661, 420, -377, -1808]
1065a808N84J714J99q84K62N15M97j28j172o68J383q3j564n38Q65J092m09M6j88
1084b85O10J596j332j314J048Q64j212j067K68L97L09M54j078J18K172q5j627
1101a64o5J009L7j126m04l48M35J016j207n64J806J388j217o18M70M80k92j117
1119d81r01N74Q84j44p22O3J679K27r08m2K13L29J32j802m60J396K60j583K64
1138a022P28L79P68%j071P33J108j084j780P63O16m60q23l2R81O53N7n43J13J138
1158A222k15r81p44Q74k63k75o21l15J396Q16r77k17J132L16r55j4p11o5J143
1177E46o81j245Q93J335l44j088M91J373r5o86o33J3L09k27p59m42N37J340o86
1196d9n99N88J083J72q05o36L24P08j042j567R29J025o97M08j44k95J797K22j536
$$ y = [-1808, -1224, 490, 689, -195, 67, 582, 1079, 951, -221, -889, 494, 411, -1153, -1691, -826, 266, -143, -97, -285, 325, 1921, 589, -725, 323, 1187, -25, -1092, -824, -427, -118, 336, -742, -624, 1548, 1463, -164, -229, 780, 817, -309, -713, -1061, -626, 390, -817, -1381, 425, 1813, 596, -22, 448, 928, 636, -481, -1382, -808, 76, -68, -790, -727, 952, 1179, 271, 229, 442, 771, 903, -899, -1359, 37, 297, -1286, -1022, -294, 85, 853, 853, -218, 515, 1623, 539, -1241, -478, 138, -322, -1145, -1177, -196, 457, 514, -29, 84, 1222, 1007, 26, -718, 156, -107, -382, -1003, -1318, 78, 894, -83, -300, 832, 1148, 193, 179, -532, -597, 546, -135, -1380, -487, 848, 504, -584, -93, 1280, 1185, 499, -134, -121, 188, -39, -798, -1240, -703, 637, -49, -648, -60, 1023, 1195, 390, -246, 78, 786, -256, -1823, -894, 131, -566, -158, -302, -597, 1200, 1422, -114]
1215a14l10J407k81j435m39K79O93np43N03R53N51k95l46o15Q86K70j649m02R23
1235a69K54m17q72O33J663m63o79K59M17n26K37q55j088J451N88j570M7J505J71
1254E86L12p04j01R14k5j183j86K98j59L91n84q93J636Q35j041l65O18Q61k41
1273I69j474l14J299l49j410P35L7j34J521r29q58J759P25j324m57K2N4O16j347
1292h59m43J335O01r58J36N13j51J135o16j050m3R97r07m96K6N21P97r03o49J985
1312I71Op49Q9k29k87J024r27j327O92Q05k39n2m41O83J460r39j196J243q7q03
1332c03j59r6k73P42K44j120P79L99P13n1j154N77J217j914n16O19k90j08J310
1351F16j190m03J889m7j462J032L44o0J0j539m19J997q17j338J005Q69m18N58
$$ y = [-114, -424, 983, 702, -733, -1172, -893, -200, -205, -948, -445, 508, 1059, 764, 418, -197, 689, 959, -690, -1092, -169, 85, -332, -1204, -571, 1092, 629, -50, 209, 626, 100, 337, -518, -1606, -155, 433, -1137, -1090, 415, 586, 898, 194, 93, 1007, 982, -201, -387, -89, -248, 143, -441, -1334, 302, 1137, 96, -269, 349, 1210, 969, -505, -819, 480, 131, -1279, -544, -507, -641, 880, -49, -907, 852, 1577, 253, -204, -182, -128, 488, -859, -1302, 33, 634, -324, -188, 325, 174, 1309, 693, -357, -400, 597, -310, -806, -780, -259, 538, -365, -1014, 971, 977, 228, 317, 88, -199, 825, -102, -1429, -737, 68, -171, -223, -664, 19, 1479, 540, -656, 587, 500, -303, -462, -558, -831, -89, 155, -965, -186, 213, 926, 875, -279, 298, 1515, -399, -915, -296, -586, -694, 616, -574, -977, 912, 865, -597, 435, 779, 719, 729, -810, -1229, 768, -49, -1387, -382, 487, 69, 627]
1369F27n45m38J238J42j335l93P24P1R3j643N61J615n34n17N87J85J09M22j379
1388d10n70R92m7p57J66o3Q95O04j249k49J970n14p44jk08k1P41j232l51J023
1408b5L00Q6o19j3J093J87j270j88J114m58j113O15m20J82J288j222j55J039O45
1427A066p78L52j179N04J535k107q29J365L14r05P09L4J2P53o3j299L81Q08p32
1446e9o84m71J056M74p78k91J040M00k73M22j172L46J114j105q21O66k35oM90
1465A13r71N04J520o08q97R03L14o37l5q85Q0Q16o12n55K56R27Q79p74o81O11
1485B68P95p00p15M89m78L37K0j041O73J076l60m35O49n04L55O54j862m7J464
1504F38n53j019M93M91j63N03m51k20J038J87o46q39L04O01j36r87L04N68Q4p7
$$ y = [627, 82, -356, 882, 1024, -311, -704, 20, 91, 184, -1459, -898, 717, 183, -334, 253, 438, 547, 969, -410, -980, 12, -35, -792, -626, -689, 206, 810, -439, -688, 1282, 768, 24, 23, -185, -206, 535, -697, -1048, -25, 275, 361, -258, -271, 822, 1009, -261, -449, 665, 207, -906, -291, -711, -529, 759, -463, -618, 421, 1066, 288, 640, -539, -35, 1500, -607, -1436, -71, 243, -662, 47, 81, 93, 846, 783, -516, -135, 673, -59, -743, -1214, -158, 316, -462, -753, 287, 687, 414, 836, -336, 10, 1124, 19, -802, -136, -371, -377, 113, -858, -354, 1166, 558, -339, 564, 878, 241, 206, -679, -599, 217, -395, -950, -694, 233, 1112, 338, -343, 268, 1063, 363, -352, 137, -341, -4, 16, -1025, -352, 724, 364, -71, 578, 74, 429, 1083, -779, -826, 638, 85, -934, -441, 50, -113, 390, -61, -281, 757, 944, 298, -541, -237, 364, 228, -759, -455, 113, 197, 120]
1524A20j5K9R54m38q67r1O67k91k14l67p17J372O18j309j57J404N7n52O1n00L52
1545A16M17p59o92O03L09P8n54K06L73L49l90j02L13J6j87p07j34O79P68j400
1565f98K8J150p3J61j25m05R6Q96q71j110P87N27m68j08j68K69P77l93n08L39
1585A03M82k54l59m21K6M45k58n29MQ37L72mq66J019L1k25q66P5n7K68o7q66R15
1608a95N34l47L9J85L25K64o07n01k05O29mn98l29O99O12m41m19L16O67k52l13
1629E9n05K89L52k96r17N96L71M5N5j71L24O66p32l54n6P69l65n43l36J91Q43
1650B85Q7p17j5J034K10q30O5k7J86j63q20J01L34M08j30p38P17Q09k90m02j25
1671b1R2L25l89p08K14O47k46m56L42N00L62n36J37n7J46M17j156n91N72L02Q7
$$ y = [120, 105, 134, 1088, 650, -217, -308, 359, 68, -146, -513, -1230, 142, 760, -549, -706, 698, 755, 203, 264, -236, 116, 533, -226, -918, -315, -6, 72, -482, -276, 97, 446, 56, -46, 267, 283, 96, -611, -745, -66, 702, -698, -670, 480, 407, 568, 443, 38, 134, 1030, 159, -951, -164, 363, -105, -213, -381, -112, 665, 272, -236, 103, 585, 331, -28, -449, -423, 22, -236, -765, -761, 76, 448, 444, -422, 597, 628, 403, -463, -388, -445, -177, -244, -1110, -195, 339, -8, 31, 216, 541, 805, 198, -303, -508, 121, 117, -481, -810, -111, 501, 60, -359, -43, 624, 372, 59, -446, -157, 195, -101, -1018, -422, -51, -6, 49, -122, 202, 868, 136, -218, -274, 495, 130, -413, -749, -558, 285, 372, -345, -360, 674, 884, 54, 119, 92, 278, 115, -705, -604, -270, 138, 8, -730, -13, 796, 506, 104, -21, 71, 396, 7, -701, -487, 160, -86, -542, -200, 300, 662, 126, 263, 206, 352, 769, -387, -978, -406, -104, -17]
1692a7k50j39M08M42r5p39N84K11j8n03o54P87J55l79j51J83J40M15k76o1N10
1713E53M8q47j03j47M98J75l46p34P88O96k20p68K97Q36l90n6n63l19L10N98j111
1734h05J42O14Q85p44j05L09K93k53l73k24J28M29o65l50N43N96o14K38k56N84
1754C72N60n12o60K51J60m26M5n14P03J81K2m12L80K26K80k44q17N83K13n85k22
1775d16p2M34j29q1K40M4O34j19o16j49P33n15J01m55k66O75l9n51RQ99j72J79
1797C68p5n18M75om62n38M62N50n91l27O18L82O8j89j14J75n3L11r35M1L76J82
1819B00n30K59j71L92L40n14j35P93k75m48k1k36M05L4m83m55P77M41j97n03M51
1840A24O26p3p90j22K18N0m69Q3N7M07K49m80j88P42M86o33k78k57J75M57q31
$$ y = [-17, -267, -406, 2, 444, 349, -390, 194, 405, 387, -116, -770, 17, 172, -207, -358, -175, -35, 380, 104, 43, 553, 601, -246, -349, -496, 2, 177, -169, -903, -115, 581, 361, -407, -110, 726, 336, 280, -283, -602, -292, 306, -805, -663, -49, 836, 92, -13, 296, 589, 336, -37, -261, -133, 296, -369, -719, -176, 420, -194, 44, -212, 372, 932, 420, -240, 11, 171, -255, -210, -724, -21, 160, 182, -230, 150, 376, 656, 412, -405, 178, 391, -194, -416, -488, -54, -183, -264, -24, 20, 654, 535, -81, -230, 503, -12, 89, -366, -632, 43, 4, -547, -538, 361, 189, 368, 293, -225, 250, 244, -218, -756, -294, 256, -335, -662, -44, 338, 406, 217, 103, 278, 225, 536, -399, -358, 18, 200, -330, -71, -242, 150, 490, -24, -159, 634, 359, -89, -110, -346, 59, 93, -390, -845, -68, 373, 176, -327, 124, 750, 677, -113, -235, -17, 33, -436, -353, -296, 111, 360, -120, -308, 434, 920, 287, 9, -248, -73, 384, -447]
1861d47j92M60M12l12K36j12K65J93k44k82r1M36j56n14k09Q2R84n76l34L98N88
1882E85p2k82k87RN01k24p11M0L84k67N25p11N14M68no42M17P7l30Q0n88q8Q66
1905B59k44m41J82M41M61j48n23L36L34q27j16N5pJ80K2o51M68O65m11j45L50
1926B40k55N28k24q59j16Q23l09j2m8O23k47J20kj77K85L9l41n9n17P88k15o94
1948f29K77M29m0o4J5K81J36k24l33n6j47M85k1o29j25Q48K76q50K01O85J0o25
1970a00j10L16j42k45J35k64L00M71l6m59K40J93M32o41j94J42q6Lj54o66M02
1991d63P45p78K00O41j33L16o37k83M30L11p71j43N44p8k09M29J02l23M99k66
2011A33m0p1K40l8k71n15M06L76k84k79J30J81L81nm77L59J54l97l30J92j49N07
$$ y = [-447, -639, -179, 233, -79, 157, 45, 310, 503, 259, -23, -114, 322, 166, -348, -557, -475, 509, -67, -401, -3, 585, 513, 231, -56, -47, 454, 230, -481, -441, -57, -324, 201, -510, 4, 472, 467, -175, 242, 319, -11, 69, -519, -607, 259, 15, -426, -244, 197, 658, 510, -13, 323, 657, -170, -286, -231, -238, -58, -36, -687, -219, 446, 35, -110, 240, -15, 513, 289, -570, -686, 137, -172, -184, -232, 391, 144, 264, 262, 85, 370, 409, 68, 9, -508, 280, 65, -629, -352, 77, 37, -27, -12, 269, 405, 181, -152, -208, -355, 130, 109, -520, -645, 203, 479, -371, -170, 515, 525, -100, -210, 106, -36, -281, -146, -410, -110, 361, 325, -134, 106, 299, 731, 90, -104, 38, -48, -45, -199, -865, -463, 282, -496, -296, 345, 212, 528, -109, -392, 38, 349, -422, -565, -21, -99, -308, 121, 223, -100, 399, 133, 93, 22, 262, 224, -47, -562, -156, 220, -64, -343, -213, -32, 349, 344, -133, 226, 380, -17, -347, -155, -304, 203]
2033B03k66n86P72L78n30O6K19K84n10N41r62L36M10k50N5m70L14L97l9m77L87
2054B72K08k53m47j92M24Nk58k01J58L23M3K43l09%K06M91j162M74J09o9j80p4
2076a89J71j79M25n03j63J086k09m43l8J8K43o1q45L35L60L06m89n2J47L60J9
2097B99lk55m5L02l67l13q7K98L08l45r1M79O3p0k23k28P01j01p52J35R6J09J78
2120H8j52j53L87K89l34O6q7K20l50r3k73K70j63J59j01L6L63J87k53m05Q13n6
2142D58p19J12j10J37M12n82p7M49L32l24p9L47j90k6J35o77L80J0J26r18M18
2163c86R38l54l5m34L84J57L5j95l30L56j48J29m32L26K7j6K9j02j46N93j71p14
2185d89K54K87k40m7O4k6N10j90m55K30K65J27n3l45R9P6k84K1j81L99J19j23
$$ y = [203, -63, -649, 123, 501, -29, 37, 256, 540, 30, 571, -391, -55, 355, 105, 160, -310, 4, 401, 362, -115, 272, 480, 227, -220, -412, 12, 17, -241, -442, -284, 39, 82, 325, 16, 16, 222, 713, -449, 25, 134, 65, -115, -189, -18, -197, 228, -275, -438, 648, 439, -4, -42, -24, 219, 158, -687, -352, 8, 314, -175, -227, -80, 280, 299, 296, 41, -4, 298, -69, -382, -469, -171, 137, -208, -299, 180, 243, 173, -50, -278, 423, 322, -430, -295, -199, -90, 88, -64, -217, 170, 459, 125, 191, 104, 324, -26, -119, -392, -122, -285, -126, -227, -191, 172, 359, 106, -299, 514, 458, -261, -149, -259, -122, 290, -292, -369, 80, 412, 88, 9, 356, 166, 140, 275, -402, -22, -12, 114, -804, -386, 552, 198, 163, -271, 113, 270, 305, 110, -220, 136, -12, 117, -315, 11, 38, 22, 51, -51, -197, 396, 225, -489, -235, 52, -188, -235, -171, -197, 313, 123, -332, -102, 163, 290, 237, -108, -9, 67, -217, -196, -377, 22, 141, 18]
2207A8M7P9J76q7m34L08k61J84Q3l97j85L75K6LK83K9L39j83k55j42J35L63m77
2230B7j43L33j14l85J77K60M5j7n2l76J02K82k50l03J69L64l5k07J5LK88j83L
2253CJ44J85k95R5m65J95O3L5q6l32O88p3p2J84m10N52l97q4J07k78M01k67j08
2276b15J99L50j42j29p2J90K14k07n2n33K78L7J87o39M52M40k03j00k51J66O08
2297E78o41j96m1K90j04j30O4J8M47l06m7J54Q6j09m2k18L70o1n2j15j88K30j50
2320a63K44l22K74L45p8k91J43N1k55l46K16R8oK74m44J61O14l65Ml85Q7L23k07
2343b8o8l17N05r0R8m40L96k44M99P7l20%K70k56j11k63N9O31p22L58j58K17L13
2366D06o62J71K83j40Lk71J58J08j33k20oL72J5M9j92K08J39m92N2n8j13M21%
$$ y = [18, 65, 144, 320, 233, -201, 107, -154, 30, 113, -284, -469, -94, -68, -65, 218, 247, 586, 403, 148, 6, 141, 504, 27, -116, 217, 103, -282, -105, 155, 200, 183, 131, -245, -143, 139, -111, -414, -245, 119, 84, -123, -108, -105, 183, 0, 3, 147, 332, 37, 132, -333, -138, -75, -40, -126, -458, 230, 157, 85, 269, -141, 411, 14, -70, 37, -241, 160, -107, -215, -16, 334, 192, 63, -9, 181, 395, 188, 136, -397, -119, -82, 105, -534, -82, 358, 155, 55, -196, -30, 578, -63, -259, -300, -10, -114, -244, -180, -162, 285, -21, -68, 86, 172, 63, 21, -197, 173, 112, 60, -55, -243, -13, -163, 81, -241, 33, 378, 300, 9, 152, 203, -52, -398, -182, -84, -90, 184, -260, -99, 515, 150, 154, -231, -144, 179, -28, -96, -413, 92, 2, 100, -340, 56, -188, 311, 388, 68, 68, 338, 82, -29, -292, -233, 398, -324, 34, -124, 93, 406, -256, -85, 198, 58, 61, -210, -52, 56, -77, -297, -303, 69, 84, 133, -59, 149, 288, -204, -152, -210, -323, 98, 98]
2389I8j98J06K25J18n62K0O6N34qo97J29Pl9j56m0L74QN0j15L06j06J41l18L8
2413a9k74L07j46K02k46R1L2L63l28j54O79j92k33n89N37K14n11k39N14l29L82
2434F1k27K41j49L64k35j81J02O6O4k57K4j20L8K81j69p3J58o1J84r2j16L81k33
2457E1j96k37N32J32l25r7J9L77j23j12K1l58L59p7k23O7L37k52L58m65K77J1
2479G6P4j75q1O94l35k50k13N5m0L37m83K59J9K55K91m74K02K9m70J0L08M0k82
2502a54k17p1L72K04r6j87K60j49J58j30q8Q8m1K0k30j33K81L99j16k80j6N38
2524D12l04l8j01m4M8L4j63k44K74J27J35j86n1N44j81m18k8J22k35K34o9j16
2546b48J79l8J26k6K32K03j94k27K15l13K16k10J28r6M50l76m96M38K17j37r0
$$ y = [98, -100, 6, 231, 349, -213, -193, -127, 407, 399, -298, -169, -162, -201, -357, -397, -23, -15, 35, -80, 226, 120, 261, -57, -19, -293, 14, -132, 70, -176, -85, -53, 310, -18, -172, 507, 315, 82, -507, 30, 244, -267, -506, 8, -321, 61, -166, 75, -74, 290, 55, -126, -24, 42, 106, -151, -127, -247, -209, 72, -97, -170, -12, -73, 111, 19, -97, 284, 51, -145, -382, 150, 282, -43, -140, -121, 256, 133, 21, 42, -316, 43, -34, -257, -190, 147, -105, 253, -212, 65, 76, 150, -25, -106, 588, 253, 3, -210, -155, -195, 142, -341, -82, -63, 192, 483, 9, 211, 240, -230, -220, 88, 128, -154, -371, -442, -70, 134, 38, -149, 111, -38, 120, -10, -98, -10, -51, -31, -261, -394, -113, 286, 170, -110, -126, 412, 108, 70, -31, -75, -27, 7, -156, -400, -126, 1, 136, -50, -101, 443, 262, -156, -184, -62, -297, -63, -132, -248, -69, -107, 19, -7, 225, 428, 234, 7, 222, -91, 125, -85, 43, -53, 397, 21, -475, -37, 180, 43, -47]
2567d7p4M2J94k53k36O25j91r9o3l4K67J78j74l05N4J74l8l44K15k92P42l98l80
2590d37O21j50k5J86k54j46K09l9J44m63M15J04n39K37M20J41j04k94L4J34l69
2611a75M8q1N5R9k0j47J20L8L78l50l87O31K43k64j33p6J38j29J2j07k46P5L82
2634A04J61j93R9n3J23j20J03m45K60J4l16L2L93p9qJ76k59nL23k62k35J46O0
2657A9m1n51M87R0K2k74K10P0R3O2k08O5o2j74N5q4J91J40r3m7J53P4J71m69o1
2682a62M84l40l8j82J3J94j25j19J16L63k72P3J95l31K52j21p4J93k82M06m68
2703b25L25k21k9N62j08l30L59m9m32k3K08K1K15l27j00R1L72k11l10M56k68M57
2725D33k22k77q0L50j76l30L76l17M97k88J52j33j73J77om78J72J99j94n0J60
$$ y = [-47, -121, -79, 115, -138, -374, 251, 60, -39, -102, -136, 131, 309, 135, -170, -116, 58, 20, -324, -109, -401, 341, -57, -437, 184, 34, 9, 195, -59, -205, 4, -35, 109, -354, 61, 165, -374, -137, 283, 424, 320, 26, 60, 194, -175, -127, -208, -153, -54, -74, -221, -101, -63, 315, -35, -422, 209, 452, 188, 55, -21, 117, -12, 0, -107, -353, -278, 104, 265, 72, 171, 118, 241, 121, 224, -221, 39, 53, -263, -231, 162, 83, 75, 251, -8, -13, 310, 48, -187, -41, 19, -22, -573, -86, 4, 26, -248, -38, 32, 125, 187, -21, 44, -18, -192, -137, -221, -30, 110, 17, -30, 123, 197, 368, -101, -162, 322, -18, -56, -238, -225, -31, -156, -275, -159, 204, -68, 5, 200, -131, 121, 0, -74, 119, -163, 243, -225, 100, -121, -150, 412, 304, -26, 333, 284, -148, -171, 37, 58, 273, -54, -154, -63, 309, 98, -212, 244, -24, 433, 211, -66, -146, 204, 28, -302, 74, -243, 254, -34, 118, -15, -188, -11, -17, -495, -323, -124, -318, -368, -208]
2746b08M17j82N2RQ4Q4k91p7K58k23j02K86o04L66O08o29J06L48k11O5K5k02l68
2769c89L30j36NQ9n3j39M79j06k85L17j8N2k95J77k34K19r9l09M45J30k20K33
2791A93m01K05L2M36m45M7p9l00J64l6L45m4j82j08M10k57KQ8o8j39Q0K8l0K79
2815B20k72l7R0q4J89o7J85k93J74o3P5m03k07M05J04K07k90J22k19K96M1q0k72
2838a79K28j70J7K08J3m3j65J45r5Q0k17K17r3J78L35m16Oj47M18m05j93K12N1
2861a5M37k78l19K69J65j91J06m35M31k74K09j86J24M9l27Q1J94L02l41J79j24
2882E6k16K59m2l2k52k50N53p4j56J84K27r2M6k94p2L78l78l3K40Jp4J59j88O4
2906A4M2J98M1k79k6lJ93p2k97K65k90K00o1L1L02K8j91l40L86j7L5m22J15L55
$$ y = [-208, 209, 27, 79, 88, 172, 256, -35, -112, 146, -77, -179, 107, -497, -131, 477, -152, -46, 302, 91, 156, 181, -21, -389, -59, -195, -190, -101, -154, -293, 186, 80, -205, 112, 94, 146, -149, 28, -206, 13, -86, -395, 50, 180, -40, 193, -208, -3, 29, 465, 20, 67, -12, -312, -148, -184, 161, 117, -65, -173, 237, -20, -18, 70, 2, -137, -57, -29, -59, 220, -52, -89, 1, -83, 106, 39, 224, -69, 105, 42, 117, -286, -493, -88, 16, 223, -67, 55, -164, 132, 173, 93, -179, 49, -121, -104, 104, 117, 74, -91, 54, -41, 39, -178, 39, -54, 124, 459, 43, 49, -98, 320, -85, -278, -66, -15, 422, 144, -175, 94, 259, 68, 174, -261, 170, -104, 105, -81, 43, 92, -235, -154, 40, 342, 1, 180, 56, -160, 99, 57, 25, -227, -477, 76, 2, -154, 30, 257, 165, 211, -83, -155, 223, -155, -188, 52, 53, -21, 138, -50, 14, 56, 254, 295, 16, -10, -13, 180, 108, -189, 76, -214, -14, -75, -44, 258, 286, 95, -245, 141, 124, 159, -263, -148, 207]
2930B07Mn19nL28J73k46K64K0P5Nk11k59K79J07j78L8l51K47J69l91L38m9J62
2953B07l10j97K34K30k71o4J58K7J19Q4k20j4N6K85l37p1K05l12j86L04J84j5
2975I6mr9p0nP7L44q52L55J45l8J9j64J74L72j54j73RQ8J3L3m98K22L69k67n1
3000e9J1j02J41M1j36J11kJ56m4p5j95J85qP3j14J88k2n02L30j74J21J33m86N83
3024A54l01R0l0l1L5j04P1J17J18k32L39l53O1j52J33j95L34m14J60L66k32M5
3046b1k91K19M1L03j86J46j55j54R3J84m7K54k91l5M75m36k2j97K69O7Q1l98j12
3069b13L15l70L4J73k7J32qk90M25r3k67J52J75j60k1j78K73k35M91J7l12o5j51
3092b03M70l10J03j47K77l40L11k91L0L08j09k48R7j68K20J18j44J45k50M7%J77
$$ y = [207, 211, -308, -313, 15, 188, -58, 206, 226, 301, 306, 95, -164, 115, 222, 44, 82, -269, -22, 147, -244, 94, 45, 207, -103, -300, -66, 164, -107, -171, -13, 14, 133, 217, -3, -17, 39, 324, -13, -84, 121, -191, -377, -73, 111, 96, 92, -7, -77, -82, -5, 339, -513, -158, -13, -51, -32, -196, -22, 350, 196, 23, 32, 120, 133, 166, -332, -110, 259, -8, -59, -48, -150, -9, 32, -104, 7, 5, 161, 117, 42, -153, 32, 24, 97, -17, 171, 149, -353, -23, -197, -76, 57, -429, 154, -147, -57, -87, -118, -83, -187, -116, 1, 119, -113, 226, -127, -66, -218, -85, -280, 54, -360, -200, 166, -66, -21, -312, -93, -52, 251, 65, 211, 56, -98, -5, 179, 132, 386, 95, 60, 535, 99, 77, -120, 149, 216, 297, -101, -213, 102, -268, -234, -61, -88, 44, 36, -254, 171, 78, -189, -37, 138, -22, -43, -221, 52, -183, 308, 325, 13, -52, -203, 267, -43, 60, -87, 190, -150, 161, -130, -100, 208, 99, -149, -52, -220, 0, 118, -26, 119, -131, -84, -84, 93]
3114I3j36j48L4K01Q1Nr9m1Kn5j17J57k44J70jO1K10r2m5O5n8o2p9J3K45j98j29
3141a67l6J90L23m66M5O4R4J6o3j1j59J25J13p4l64K94j13N7J14Q2j74P9L3j41
3165a39o2K11J78k16j55K14K69kn21k31N20o3q1K8L25l08L0J42j20Q9j26j93K45
3188C4J06n1J09j38k38K54K63p0k60P3j42p5n8L39k9j22J51j54J65j07k10N0J42
3211C2r8J26j46q5J56l9r0K21K15l57n1m9J67R1r8k92L5L45J9k05J71n7Q0l01
3235b10N04j35O7p4j6k86k99L18K34l07j0M35o2j6j89r1J73l05J47J75n8nk41
3258b51O1k4M94l12P0L4l93M72q2R4r3j44j23J32RJ52j06M52l46m44K77J79n3
3281E5O5j72k00K78k56J96K60k10J4O3K36j26k09j68M59l69KJ3J18k26O7O0nL71
$$ y = [93, -43, -191, -157, 44, 125, 130, 31, -10, -8, -63, -180, -23, -267, -97, -98, -37, 173, 81, 36, 101, 43, -19, -98, -85, 160, -38, -167, -203, -13, 310, -156, -111, -47, 47, 63, 0, -11, -170, -45, 68, -6, -370, -76, -189, -132, -18, 64, -110, -31, 2, -139, -201, 10, 188, -28, -183, 31, 300, 298, -223, -454, 66, 3, -78, -50, 275, -33, -3, 139, 19, 108, -18, -211, 34, 140, 89, 198, 60, -178, 76, 339, 269, 9, 82, -60, -135, -193, 146, 117, -5, 146, -8, 157, 50, -160, -110, 32, -66, 60, -86, -171, -15, -54, -144, 77, 292, -65, -116, -165, 2, 93, -5, -297, -262, 83, 102, -103, 68, 11, 91, -210, 294, 159, 226, 152, 136, -150, -449, -131, 103, -204, -214, 221, 159, 143, -46, -137, 36, -269, -122, 53, -5, -10, -251, -190, -214, 280, -32, 38, 72, -321, 151, 69, 163, 70, -74, -197, -65, -56, 96, -10, 442, 96, -348, -71, 108, 55, 120, -52, -252, 26, -230, -34, 226, 16, 30, 93, 329, 203, -6, -174, 285, -84, -82, -69, 49, -177, -110, -50, -55, 316]
3305C16j49m06K74J50l72L1L8J91k5l58L15n8J45k7N1j17J37o0j99o0L89k33P5
3328D8k73K49Qk4K25l89K1K86l58J05Q0J6q6j42K32J21l14M33n21J5K85J16j90
3351e7O6k37L03R0k25j42K37j29k14J56j01J77l22K11K69J15r2q7j72j1j5l7M29
3374B12p3j89K04k8l46j8M85j13j64j89R9kJ39l46K87K50j32K6J13m19L35L2k73
3397a10O8O8k18L2J8O2R4J3k2m4L29o7j46J66L7n77J35K32J89o55M74M8k01m2
3421a17P4L1M2k9J05j05J94k83m6J58l31M57j5j41J9K15l15j12o5M32p3j02J1
3444Dj00N5j03K22R1j77q0mRJ9J20o0j23K76L89n06J09Mj74j8J46R6n2k86J59
3469A6o7L0K09m25L80J40k71j80K37k32K69l52K88k10p5L5K73j08L10l62M2J6
$$ y = [316, 167, -239, 35, 185, -187, -156, -118, 73, 48, -310, 5, -53, 92, 65, 116, -1, 136, 76, -123, -183, 206, -27, 48, -225, 24, 32, 8, 233, -156, -135, 151, -207, -102, -22, -6, -92, -234, -2, 119, -195, 238, -283, -268, 17, 133, -57, 9, -228, 75, 165, -60, -202, 35, -94, -308, -152, -253, -76, -398, -187, 82, 197, 105, 18, -154, -165, -180, -217, 212, 139, -50, 154, 126, -220, -238, 247, 134, -30, -219, -120, -122, 17, -329, -42, 208, 76, 102, 215, -204, 131, 163, -110, -42, 26, -192, -160, -142, -80, 14, 27, 5, -39, 290, 223, 77, 243, 280, -297, -162, 70, 259, -396, 78, 126, -75, -117, -43, -12, 30, 1, 106, 1, 195, -88, -134, 24, -307, 150, 135, -6, 13, 228, -87, -199, -264, 168, 95, -7, 4, -96, -41, -144, 78, 169, -8, -88, -92, -83, -64, 56, -4, -127, 149, 538, 32, 141, 145, -29, -47, 99, 195, 143, -143, 16, -51, -21, 188, -237, 143, 283, 12, -168, 69, -163, 106, -246, 42, -168, -243, -208, 65, -43, 267, -95, -53, -37]
3491c7K60k90J17j7k33L92L8m41K81J43j73j37K64j74J15J3q5J32n2k07J45j7
3513C7j80Q6k68L36O6n6k13O04l05n8k30p1M6M62j85k1Q8m38K47j4L0K14n3j05
3537A9k56L51k66K25j3j80J30m6K81m09K51j49L06j72j5jk52J14K93l71O22k88
3559A74l56L16K71k52k10J14o7k32L75j92R3J18r9j33R0RJ83m9o1k32R2J88j93
3582e3J87l10L56k48K6j1k9J29K40k47k01J93j33K54Mj89L67l53%l98J13L91L9
3605A27j53K58l0pl0l27L07r5o8M26pn33J00n7K57N3k32J54l12l1K90K58q7k00
3629F1J51k34L07m86L14o6l78L61N5pk5J70j77O2j71J71L2j87N04m57qr0J43m05
3653c60K85p6K93l69K16N9Q2k67N0k9K24J27j42n89O01rM9r0J57k15k35K90k42
$$ y = [-37, 223, -67, 50, 33, -200, 192, 230, -211, 70, 213, 40, -97, 167, -7, 108, 121, 36, 168, 116, -91, 54, 37, -143, -57, -325, 11, 77, 21, -192, 412, 107, 49, -181, -252, -206, 256, 71, 50, 138, -300, -53, -67, -37, 177, 124, 19, -237, 114, -152, 73, 60, -120, 10, -36, 245, -164, 87, -62, 244, 72, 57, 56, -196, -82, 211, -160, 462, 174, -182, 134, 405, 153, -57, 57, -10, -242, 133, -59, 34, 152, 53, -80, 10, 19, 202, 153, 92, -140, -48, 140, -53, 134, -176, 180, -68, -42, -53, -82, 47, 287, 40, -161, 32, -101, 153, 157, -32, 335, -18, -18, -416, -303, 88, 127, -26, 232, 202, 195, 165, -162, 145, 50, -18, 408, 401, -132, -32, -89, 168, 221, -11, 143, -169, -200, 90, 348, 261, 61, 212, -22, 285, -201, 113, 47, -331, 30, 85, 78, 53, 223, 46, 108, -63, 108, 140, -47, 457, 0, -8, -98, 45, -360, -75, -151, 142, -227, -11, 48, 130, -137, -87, -116, 108, 235, 93, -496, 105, 96, 145, 55, 212, -3, -238, 52, -190]
3676a90j1J32J59k5j53N31n15M2J06j26M9k89K10J68r6p0J43j16J39j8K98n78
3698b10J01K26k28L4q4L70k06K21k89K31j68O5j30k65M27m22M43NLk01L2k9j87
3721b61L57j78K13j0k96K13r0k91M7Q5j41N28Jq4l78PJ49J94j12j37K97j31k2
3744d0L4J27l64K71J0O7k6L1K01n41J24K87j05J1nl9L7Q2m52M41k41J28J50l93
3768b05M69m24L17J10j47m41J61l5M2Pk19O25l63J86M9k67j19J92m0j9K35j81
3790f7k2K63rj3k01L1j27K74n8l32N02o7m55J24J41J34L3k74P7r0N18k53k29J45
3814D5j46j03J73K40l82K95j43kL44n38Q8J27J48k20l9m9J13J13j41p1K50l65
3836b63J72L65m73j64O20k21J04r8o3kp8J6K42L29l08j64N1m15L88j45J25j65
$$ y = [-190, -201, -69, 90, 65, -88, 443, -72, -30, 76, -50, -1, -290, -80, 88, -8, -78, 65, -51, 88, 70, 368, -210, -109, 117, -111, -77, -161, 209, 3, 224, -65, 166, -2, 63, -67, -332, 95, -327, 116, 121, 124, -77, -45, -74, -261, 96, -82, 131, 121, -175, 38, -52, -343, -296, -211, -352, 176, 177, 93, -285, -278, -129, 65, -47, -184, 113, -18, -40, -6, 121, -243, 28, 38, 105, 79, 110, 311, -230, -106, 181, 76, 87, 82, 43, 80, 162, -290, 151, -90, 38, 188, -205, 264, -160, 157, 267, 120, -321, -160, -195, -153, -146, -365, 260, -103, 83, 132, -135, -254, -62, -102, -121, 114, -67, -89, 174, 165, 152, -49, -18, -145, 129, 71, -261, 241, 174, -281, -157, -16, 118, 151, -123, -46, -136, 382, 129, -100, 45, -101, -204, -31, 209, -173, 122, -21, -23, 321, -217, -129, -2, 146, -74, -113, -162, -49, 64, -77, -148, 102, -263, -91, 274, -199, -363, 257, 36, 140, 42, -21, -23, -101, -85, 157, 486, 178, 14, 65, -350, 38, -107, 18, -147]
3858a47J78j55M7K09J12l67%N9l5Nm6J31Kl9j2K31l49L78l0j97J91m34K9K84N8
3883A03Q1nm18J15J40J90n54J93L37j97m4j25M66k83P5j8J53j51R5J88n40L57
3905A58N2j81j04j59L09J14j83j55L6M18l25O3q9K22l17J97k12L86Q2n26N28n64
3927b50q5J38k28K64Q8n0M6J66J68l11k07L88p1m35M33K64m45L72n27L72j95K23
3949A18j59K31k79K17j26q9K09l58M97J73l86j58K9K88l13K27j21j36J02o3N3
3970d4K25l10M83l35J90k63q8J10k58M61J30k35J88k06N8n9J2M1J6M7l8j48p7
3993a00P0m8K70p1q0k22J29L6Q1J41k20j08n8M47k28k33J7J33m0n6N81m59R3j64
4017h9j42M73Q3m50N69m15P7k7l2j37J24J19K6j30J11J9j25R6k44J89L39j87m22
$$ y = [-147, 31, -124, -77, 132, 244, -123, -123, -64, -99, -94, -140, -9, -7, -46, -58, 173, -176, 202, 172, -25, 166, -268, -239, 45, 103, 184, 179, -239, -124, 16, 206, -348, -155, 182, -15, -59, -184, 282, -1, 74, 56, 209, 58, 153, 341, -199, 158, 210, 29, -75, -234, 75, 189, 6, -149, -113, 305, -20, 43, -46, 176, -141, 56, -156, 230, 312, -214, 314, -250, -335, -197, -425, -161, -73, -123, -77, 89, 257, -54, -261, 127, 56, -379, 54, 318, -127, 245, -282, 90, -105, 118, -41, 190, -89, 128, 2, -87, 122, -236, 261, 434, 48, -110, -81, 207, -106, 121, 0, -136, -34, -97, -44, 181, -129, 354, 19, 209, -54, -142, -32, -290, 171, 301, 66, 254, 48, 106, 47, 59, 100, 116, 163, 125, -23, -100, -30, -78, 192, 121, 41, -181, -52, -16, 65, 206, -14, -122, -180, 267, 39, -194, -177, -44, -84, -140, 441, -18, 75, -89, -231, 242, 325, -125, 444, 29, 106, 79, 47, -90, 34, 153, 179, 49, 160, 179, 54, 150, -94, 95, 434, 247, -175]
4040a75J52N6K5J08j55r4J40J23j31O5j48k44N4K99j72l8J3q5J41j36L74m10M98
4063B60l01L30k81p0K12j10l06K90n0K13l13K08o0R8J69k91J36j83J27j20J62
4084A20j76J29rK48l21J60j92J61Q6j25j14L39n7j32r2k52L71l6l8K06j47k61
4106a32jL8m0k12M22J22l1m02K18J43j89J07j34jJ99K82l27k53L28l08K52rl22
4129b50L55m81L04L16M6j75R4J60l14M9M9l41L06l85o5J30J28K82j44oK01k26
4151C3n1LJ15Lj60J80j55K60k89L82k40k23J79r7N2l33L5J5J55J9J18m2N19p08
4175b30K32R9k38K64n7J08m3j70k39M48j38J37k06O1r1J02L9k27KJ50MM9R9j37
4199A8j42N3j11R6m4K22M8J20m75K26j63J71j11k06L56k3k2j84J08O9j73L38k39
$$ y = [-175, -23, 33, 58, 166, 11, -83, 57, 180, 49, 114, -34, -278, -224, 75, -97, -135, -122, -207, -66, -202, 172, -238, 260, -41, 289, 8, -62, 150, 40, -266, 24, -26, 187, -126, 82, 22, 120, 289, -2, 134, -49, 78, -42, 120, -56, 73, 64, 312, -9, 151, -41, 120, 206, 81, -33, 306, 249, 117, 25, -227, 144, 108, 70, 276, 129, -132, -133, -95, -135, -347, 75, 197, 166, -236, -18, 125, -64, 43, -91, -92, 107, 389, 62, -191, 137, -171, 81, 72, -250, 105, -376, -72, 244, 290, 115, 209, 369, 55, 104, 153, -188, 118, -267, -332, -202, -74, 208, 64, 58, 259, 33, -18, -15, 100, 103, -57, 123, -32, 228, -61, 321, 81, -142, 37, -60, -8, -341, -306, -291, -136, -117, 1, -41, 478, -230, 2, 101, -137, 127, 70, 178, 135, -35, -274, 174, 36, 173, -33, 28, -63, 39, 78, -149, -147, 3, 7, 56, 155, 18, -124, -71, -182, -86, -130, 92, 140, 260, -215, 11, -152, 19, -92, -298, 58, 35, 13, -171, -63, 6, -167, 171, -68]
4222f8n4K29k1L0l78K58l7J95op5N1j16J63p1k32M64n86L08K22l99l3J95j91M07
4246B55k68K7j49k08K77j11K41k51K26P3J53l08R5%J76k45N7R1k54k01M87j62
4268Aj35l0L03j8k88mK42j76J50P0l8j76j13J66J69l00K20L9j84K21k23J00j05
4291a09K70k41J48J05k62J99q5m6qR7k95M18j51J1m1qK7k32K81j09N7r3p8O7N8
4316b0K4n0q8L95k22M2J32l35K67j17J25j17q4j1J2k35L53r8k0J94l18K49j6k7
4340C5l82K78P9j79Q7k5J41Q5q1n6J17l9K31k80K69j84k7m51N27k07K72J05m78
4363a63K07L2j1j21K43j75k7r5k11L73P7j30R9J60r3J19k76k7O4m09m3K35Q7q0
4387a65K72P7j66L15m57L81k29J10j31r6K90l14K2m6k52N63l18K06j07j33o9p
$$ y = [-68, -122, 107, 86, 116, -262, -4, -41, 154, 148, 73, 124, 8, 171, 100, -132, 332, -254, 54, 276, -123, -156, 39, -152, 255, -13, 14, -135, -343, -66, -177, 64, -187, 39, 112, 265, -43, 52, 52, 228, -17, 40, 131, -123, -324, 163, 1, -134, -164, 139, 121, -167, -171, 71, -105, 45, 115, 77, -99, -212, -46, 123, -177, 43, 82, -102, 119, -104, -4, -109, 161, -80, 68, 173, -89, 110, 25, -21, -29, 68, -227, 191, 40, 51, 10, 2, 29, -203, 78, -31, 26, -67, -145, -78, -20, 4, -46, -134, 261, 39, 81, 213, -122, 145, 28, 153, 36, -48, -59, -47, -282, 71, -27, -47, 147, -171, 78, 62, 35, -347, -69, 10, -169, -82, -107, 34, 119, 38, -18, 99, 60, 291, 11, 280, 96, 69, -382, 145, -62, 210, 315, -163, 44, 76, 65, -56, 187, 12, -15, -110, -321, 52, 129, -1, 98, 258, 165, 284, 8, -19, 45, -364, -407, -172, -85, -165, 107, 184, 18, 333, -124, 257, 28, 138, 7, -89, 201, -113, -91, -137, -389, 174, -144, 62, -45, -178, -247, -254]
4409b54K64K18l10q1J35l36N60j23m6k9K4n20M66K56K21m08j40n6K71j53j13R5
4431e9j26L19m23K85k95M23k07k27M27m4k95J79k58J03L18m7p1j76L02l47J79
4452d0J04J79l29J38j88J78l17J94p7L73n12L32k65k2M30k78j02K77P4n93M16
4473b8J18j35j9M8n9J32J09j32J54J01l71m5M9M1j88M35l23N9j20j2m8M00l54
4496a88J31L22r9m04R4j5R2M7J41J07j52M2k94J59P4j98J44n5J87j78j51K66K65
4519C37m4m4m46L51J78q15M72q8J39p1J74k89J98n3mL49k10j96L29l64L14J9j72
4542F4j08K12L8m60K63J89l03L59l15K62r6l14L13k6k74J70K60k29J41j30lRj21
4565i9K21Q1m31n4L31l63J70J17QK38l34N22j17l74J63j12oK61Kj78j71J23p5
$$ y = [-254, 10, 228, -82, -163, -28, -364, 196, 73, 27, -2, 22, -498, -32, 224, 445, 37, -103, -159, 112, -41, -154, -59, -185, 134, -289, -4, -299, 124, -83, -310, 117, 73, -222, -43, -301, -198, 120, 73, 2, -174, 128, -219, -40, 64, 243, -86, 52, -136, 42, -275, -81, -158, 215, -297, 35, -230, -252, 178, -100, -202, 75, 149, -444, -28, 90, -45, -64, -16, -75, 57, 166, 34, 188, 289, -82, -127, -78, -37, -225, 210, -113, -54, -174, -186, -234, 166, -188, -57, 265, 166, -238, -144, -159, -67, -20, 121, 228, 76, 118, -176, -17, 57, -141, 3, -52, 135, -43, -194, 72, 337, 293, 249, -197, 154, 332, -483, -11, -99, 40, -31, 143, -146, 52, -1, -5, 344, 134, -62, 267, -97, 217, 236, 64, -44, 168, 206, -254, 9, 198, -105, 254, -61, 201, 105, -209, 104, 78, -196, -26, 234, 5, 146, 16, 13, 22, -99, 122, 203, -228, -282, 49, -314, -144, -27, -19, 219, -115, 407, 290, -84, 79, -33, -39, 222, 224, 46, -125, -2, -77]
4588g7M38k50K37l50koo2j01L26j60l7L16o6k42J78q3j39M9J65L74m98O3j75k5
4612a27J90J18j14p0j27L3J73J28q6m07k45M64k5J59N3j29k26M10j18R7k25qL47
4635B65k58L50j95j42m05M40j17j86J31J21k53R9J15k40L20j0j78K88l89K53k0
4656a1J14J31p2j37J48O4k92k7K53m6Lj22j27K11k03N6k78K64L12l38R4J95l55
4679a63Q9Q0k18J65J32p9J49k46K23j90K17m61J45L60j91j06k46K85J37o6k52
4700b36M77j17q5L5K1j16K14j34j15K7k11J40k44M08l9o6j01R0K11N0j48l17o9
4723c25K71j11J61J58k15n9L36n73L38O6k86K07J57L6m24K94J0m0L11m19n1Jj
4746a58K03p8m5J13K2J06q1r7J54j64n3J07j47K17j28J04j41K49l07M02l38J74
$$ y = [-77, 361, 111, 348, -2, -4, -10, -72, -173, 153, -7, -44, 272, 206, -36, 142, 59, -80, -31, 134, 508, 10, 73, -102, -127, 63, 181, 67, -3, -130, -97, 76, 204, 118, -289, -534, -70, -95, 64, 117, -12, -238, 172, 54, 151, -74, -82, 265, 7, 357, 162, 20, -385, 55, -62, -248, -117, 4, -249, -150, -35, -275, 45, 35, -143, 145, -244, 9, -11, 103, 234, 162, 25, 173, 237, -55, -82, 171, 125, 128, 6, -121, 90, -113, -57, -335, -71, 241, -97, -3, 192, -163, -74, 6, -212, -47, 85, 6, 155, -91, 132, -58, 159, -302, -157, 203, 12, -94, -340, -55, 82, 16, -236, 241, 124, 39, 74, 95, -21, 193, 59, -56, -29, -240, -100, -344, 64, 25, -41, -142, -52, 159, 209, 61, -256, -325, -54, -165, -4, 154, -61, -120, 216, -357, -19, 47, -239, -32, 125, 161, -263, 31, 41, 1, 312, -107, -158, -157, -158, 45, -33, -78, 35, 57, 163, 82, -15, 139, -25, -78, 29, -118, 99, -29, 75, -66, 183, -124, 278, -60, 114]
4768A14l1R9k41K0o6R4K24j05P7j03r0J59J93n34M41j66m43Q5K27q3K06k26K10
4791F1j64L06j70r8K7M3j35L13j93j55J98j79m3J78K86j02k31J6p6J93r3J28k45
4814a35r1L26j88j13K97j26j18J51K09l27K45J1j23O8J5j80J13k76J47K07j43
4835c1j89o7K53J67p6j03J62k13J00K01L07m95M14n87R6k2m5J98m87M42Q7j55
4857d3k5o1J6K44K73k37l32M7J95l7j43l08L73j5M6j30m5Q7O06p22J28R1l08M03
4881A03n1j65j68K30P9k36L14k26j56M72k99J38L7Kk07L89j74J11k04q6O8n7M2
4904d4rJ61k0k4r6q4lj51L51R6l32J75J34k24j03J87J3N3P3j98J11l4L71n72L56
4929A87o2j20k30K84j08Q4j45O0j66j61L55k50K70L9J44J8J00m40Q9R2MP3Jn7
$$ y = [114, 83, 182, -59, -39, -105, -11, 213, 108, 185, 82, -8, 151, 344, -190, 251, 85, -358, -273, -46, -129, 77, -149, 61, -103, 203, 33, -65, -38, 5, -130, 183, -10, -165, 33, -146, -189, -11, 275, 173, -58, -42, -118, 75, -18, 110, -135, -226, 100, -88, -201, 96, -30, -148, 3, 212, -115, 130, 141, 18, 86, 101, -79, 34, -242, -95, 112, -31, -220, -287, -34, 133, 57, -46, 116, -97, 3, 204, 511, 16, 430, -157, -61, -83, -128, 70, -417, 25, 112, -43, -68, -129, -113, 131, 404, 167, -165, -118, 77, 40, -103, -411, -38, -53, -7, -137, -182, -95, 511, -211, -83, 8, -300, 103, 52, -113, -281, -51, 28, -208, 106, -120, -276, 196, -103, 35, 72, 74, -133, 256, 82, 193, -11, -97, -29, -86, -44, -53, 108, 88, 64, -32, -116, -119, -270, 81, 177, -155, 20, 154, -70, -173, 14, 27, 80, 153, -45, 66, 32, 403, -169, 187, 125, 5, -225, 59, -49, 35, -110, -50, -216, -377, -22, -272, -2, 37, 181, 199, 299, -141, -52, 40, 44, 117, 118, 61]
4953F1o6J87j65K28j58k09K7K75j15k26j9KM2K85M4j67M8k35J12K60k36J6LK38
4977B32k63K54m2j04J76l90J96J3k48P2k4K47J98k77K36m80J77J60m73K61J8J44
4999H3l54J29K95n7k01k4J96K51k03j77L22k14p5j05L5J52nj81N0N2k18K03j26
5022a72j75L00L50l55k06L70J80k37O6k1p5O3j16K45k75J8oM8j17J62l78N09l21
5045a43j24L57P6q3K7l70J75J14J52j64j71J68O3k91K63J96l11K45j76J69j15
5066E7j31m9l09k6O63m61R6K06j17J86L4n14M09M2P0k39j25J75L53k56n0Q6K70
5089C70Q4m24o2n3j08Q8J36k25J63J70r9J59k82j82N46k90O1O2J33k00qL7j86
5112a10m7L48j39k3r6k72J02L42k53N6L53l50L32m78K87N0K74o58L34j0j37j05
$$ y = [61, -5, 182, 17, 245, 87, -122, -95, 180, 65, -161, -180, -178, -136, 149, 193, 26, 74, -161, -49, 211, -25, -9, -6, 232, -31, 223, 181, 77, 253, -137, 59, 72, -176, -104, -128, 119, 317, 40, 276, -204, -27, 133, -340, -79, -61, 83, -271, -142, 153, 96, -105, -129, 67, 318, 115, -62, 260, 46, -29, -134, -99, 53, 48, -133, -83, -31, -249, -46, -172, -347, -47, 303, -52, -258, 112, 292, 55, 121, 100, 25, 88, -28, 217, -58, -40, -46, 2, -115, 47, -331, 178, -143, -267, 90, 166, 83, 110, -260, -85, 29, 181, 17, -154, 14, 77, -214, 49, 245, -66, 179, 3, 172, 57, -74, -123, -432, -458, 205, -256, -160, 46, -71, 115, 149, -365, 44, 86, 156, -83, -208, -33, 320, 64, 14, 100, 370, 454, 30, -32, -85, -193, -105, 31, -194, -31, 139, 40, 199, -83, -265, 281, -9, 52, 114, 247, 47, 39, 76, -110, -157, 191, 52, 29, -67, -339, -237, 105, -148, -92, 261, -89, 243, -235, 52, 102, 376, -282, 52, 42, -95, -200]
5134b00J44j36K19qM1p8j42K18Nj91K42j1j7k97J25NQ9K49j73j05L3K1J54k15
5158b8O7k60L14p2K78j76l46J29L7Q0l3m3M8J69j06J08k45k08L19j3N8K9J19N8
5182B83k38Jq1q0j76N48L7j35k79L41j19j4p7L1J55k54J64J98l72M86m12Q7J43
5205B37n10L33r6j13l04K03L63k1j09k46N79l00k64K89k96M30K4l99m7M18j83
5226a2N0K16m11kK62k0j91L00n8k66K77n11M47m50N31K62k74J0J18n28L31J27
5248B08j18k3k21J41k41K79l61M73M0j3R0k67j89O74m63j84R2J40kk16J8K79m33
5271b97K44L82k71l32M22j41J5M5k29J21K5r2r4J94m2OK28j6j4N3m19J75P5j27
5295h9j70k01N57k1j99J29J46j18J18j43o4o9R7j27J04K08k40O4n4K62j04L51
$$ y = [-200, -56, -192, 27, 19, 60, -18, -160, 58, 63, -128, 114, 103, 86, -211, -86, -81, 8, 257, 84, -21, 12, 33, 187, -28, 39, -221, 93, 21, 299, 123, -223, -94, -57, 23, -10, -53, -5, 164, 58, 166, -79, -287, 32, 19, 77, 106, 225, 283, 45, 46, -35, -115, -291, 257, 294, 159, -120, 221, 102, 88, 11, 42, 197, -57, 107, 305, -67, 419, 7, 94, 237, -273, 60, -36, -149, -453, -250, 113, 92, -17, -263, 316, 16, -248, 41, -255, 175, 199, -200, -247, 171, -12, 38, 254, -157, -159, 103, 83, -108, 192, 134, -132, 145, -366, 81, -369, 162, 424, 150, 160, 278, -250, 81, 208, 90, 67, -154, -13, -254, 25, -336, 137, 177, 164, 254, -13, -202, 472, 9, -175, -83, 57, 55, -161, -143, 136, -297, -53, 329, 58, -274, 148, 7, 22, 67, -162, -41, -16, -108, -202, -8, -50, -44, 184, 168, 154, 207, -212, -37, 38, -89, -259, -460, 97, 76, -123, 6, 152, 34, 152, 9, -55, -124, -27, -154, -50, 158, -82, -18, -72, 190, 86, 437]
5317D37m18j6O1P1j2n7k67M04m25J89p3K7P1PK41k40o2Lo4j72K89j38R1k0o9L4
5343a08J99j98J92j6q2K27l04J37J9l92K67%j70J13l5J58R0J13j82J02j05J45
5365A70k08l02L20J00n1O4j75J57r0k71L91j75K7J33p1n2k1j11K26q3L4Pk63K66
5389B2K69l10j47M15m65K98k9m0j64k24M46j33L12k39P6K97m29R8J46K04n22%
5411a19J68l4Q5l9k73J33J92k30K58j3k87q3J2O2L09L12l45n1O8p6l5K40k90l16
5435c52L92j26L4k8J16j11K37l46Q5L05N1L5m8j77l7j18K43n65jL29l7J93P2K25
5459C71m79M9M0R8j32k1k3k05K12j1J05K47j02n1k08J09O3m3K5l28R2R2K20k81
5483a61J82j94M13l76n9K86k29K64Q3j90K2K95l71m1O4J33k15nP2J74j11J12j60
$$ y = [437, 19, 3, 64, 135, 123, 66, -201, 203, -222, -33, -106, -79, -8, -1, 240, 0, -62, -59, -123, -295, -6, -144, -53, -73, -142, -108, 91, -107, 85, 69, -13, 214, -90, 47, 66, -326, -59, -59, -229, -116, -151, 7, 97, 210, 28, 130, 25, 170, -38, -340, -20, 80, 29, 93, -82, 75, -15, -286, 105, -70, -43, 90, 19, -33, -54, -165, 61, -22, 12, 19, -244, 22, 291, -19, -166, 249, -216, 82, 53, 13, -151, -375, 71, -62, 250, 11, 87, 384, -45, 53, 199, 403, -119, -119, 49, 15, 100, 61, -212, -79, 113, -117, 141, 128, -159, -242, -230, -168, 141, 453, 108, 57, 125, 49, 14, 254, -36, -352, 40, -86, -52, -80, 36, -75, 162, -184, -99, 206, 257, 292, 244, 67, 30, -88, 155, -410, -411, -82, -119, 74, 146, 371, -108, -59, -19, 79, -53, -74, -97, -302, -90, -101, 4, 251, 149, 98, -110, -1, 62, 19, 44, -284, -192, -100, 120, -161, 21, -173, 240, -136, -195, 91, -138, 126, 209, 19, 41, 336, -35, -76, -12, 121, -94, -99, -27, 147, 36, 148, -12]
5506a2K00l12K00k03O4Q5l50K68M9j79N48l46l07K32N4k87J71P6J07j7j64J38
5528A5k33J29J99r6o4J92k16j1k25L07l38K43r8rJ94q3L16K8p95Q28k40l12N58
5551B89l64o5N0L95n89K11L84l39K60l58M29q2l74q7k03L06J87j5j83J03k8k4
5573i7l2K67j23j62J75k18r3j7J70J84j28k1O5K52r9l3k2q4j36J36J32nj55j53
5597a97J72J61k4j5j86j33K70k1L8j33J57m40N01j81O3J12k77J92j3q7J21k17
5619a37M3J29k27K84J17l63K46k34J59J90q9l79K77L46m05l7K69n8j69J29P9l21
5641a51K12p2n4J33l11O4n8M4J88j53O3J90J59j36R3m30M73j32Rk26j21N1K05
5664D0j61K13l1j71l36M61k51K46J25k33J09l98O29j61J47j53j5K49k03l44P21
$$ y = [-12, 188, -124, 76, -127, -63, 22, -328, -60, -11, -190, 358, 12, -295, -63, -9, -296, -125, -49, 58, 41, -123, 15, -218, -89, 110, 14, -50, 142, -74, -85, -310, -3, -341, -98, -196, -205, -11, -94, 222, 250, -545, 283, 43, -269, 289, -75, -140, -90, 305, -284, -73, 311, -28, 232, -126, 303, 221, -153, -240, -443, -137, 50, 35, -148, -45, -73, -97, -129, 138, 15, -147, 28, -190, -283, -300, -130, 54, -74, -95, -30, 222, 123, 90, 68, -16, -152, -16, 116, 111, -44, -197, -25, 136, 112, 97, -89, -222, 48, 27, 65, -68, 89, -351, 150, -31, 32, 144, -133, 59, 46, -41, 80, -137, -94, 35, -192, 92, 209, -154, 92, -142, 17, 207, 118, -261, 16, 362, -43, -80, 189, 131, -38, 91, 170, -151, 61, -11, -65, 68, -243, -179, -237, -193, -5, -158, -95, 95, 254, 118, 211, -219, 254, 122, 131, -95, -216, -165, 40, -121, 92, 61, -110, -446, 15, -236, 10, 135, -98, 11, -387, 242, 81, 228, 75, 60, 309, 106, -238, 483]
5685D83o67L6J62R2o6l6j21K60j40k02R0j1r8j76N84k47K32j81n0N3r4J05k57
5708b49N7K79o7K51l25K65l85R1J97k27J75j5L1Lk6nj32L69j95N6k77L2K09k58
5732a46L10N9j72O7Ol37L55ln2j08L2m9o4o5L93k73K45n61L28J43k88Q4j55P7
5756a74K13j56K46k4m1pj49J19J20l10M01m58MM77m4n4J30m24L86j52j18j2o1
5779h8n8L29p3m13M47k97K55l40K82K7j86L06L8k21n8K45l80j66K43J18J6M22
5801D48m95J9N4J6k1J66j9k36J27k87L4O1M23l54o4J2J86j12J11k56PL53l12K29
5825I0j34m4J75j6j38O2J16R3l92K05Nm43Q08k40jm95K29K48m8j56K24k5k80J25
5849c2J0K05l53J87L4L89o15R3N8K91n22K37j18j8K07j63K75Q7l42k0J45K16j75
$$ y = [483, -184, -148, 14, 106, 40, 4, -117, 143, 3, -199, -109, -120, -218, -394, 190, -57, 175, -6, -56, -3, -97, 8, -249, -192, 87, 20, 271, -54, 211, -174, -83, 114, -113, 62, 47, 78, 81, 55, 50, -82, 287, 92, 148, -129, -97, 112, -146, 164, 223, 51, 118, 124, -213, 142, 139, 87, -21, 11, -38, -102, -167, 226, -47, 198, -363, -35, 108, -180, -96, -251, -174, 39, -117, 129, 105, 64, 57, -92, 27, 147, -163, 238, -220, -216, 261, 217, 163, 293, -131, 255, 103, -15, -27, -88, -146, 183, 110, -303, 144, -153, 102, -238, 44, 71, -115, 191, 229, 8, -50, 195, -185, -351, -108, 10, 26, 448, -47, -28, 26, 42, 21, 187, 168, -68, 59, -228, -194, -133, 290, -64, -128, -116, 70, -42, 69, -187, -180, 173, -139, 90, -44, -88, 87, 71, -67, -5, 111, 204, -188, 17, 22, -421, 387, 147, 146, -349, -120, 128, 80, -76, 148, 123, -157, -32, -22, 183, -170, 17, 51, 440, -175, -82, -24, 267, -255, -18, -136, -154, 53, -110, 165, 252, -90, -110, 35, 251, 76]
5872G6J09j16r6q2J6q8P2pJ01J70l30q2K18K44L6k01o3N1K6p0ol2n8L20k84J50
5898G4k9J4P9m8j16Jj01K59l81L20J16J96m93j64N53l29j8O3M5j62K03J1m53N46
5922A86m41L14kJ84j63L7o1J60J23k75Q7p2l6R0k6j52k64L48M1k17k5K21L71n19
5946i1P8j71j37L99j25N4K75j13K48l55k61Q6K5J19n2J19K33l77J21j07jK88k18
5969C7J43j06o1o4J51l44L02J28l21K73j24Q3O1j98q4K52J52j62pk97L74j37L6
5992H7j75J24J81k01k81O12l92L54M7k30j10K74L0j13l09J15j36L39J2l25J7R8
$$ y = [76, 185, 69, -27, -109, -93, -181, -109, -116, -15, 155, -175, -257, -39, 205, 241, 40, -23, 28, 54, -16, -22, -54, -112, 208, -76, 74, 45, 59, 138, 90, -26, -25, -126, 133, -248, 72, 188, 384, -109, -273, 280, -49, -67, -4, 41, -121, 82, 93, -360, 186, -255, 59, 57, 241, 78, 115, 54, 214, 337, 62, 149, 77, 41, 131, 105, -47, -311, 37, 78, -139, -164, 57, 428, -91, -13, -184, -321, 78, -47, 7, 282, 169, 417, 62, -199, -113, -88, 31, -21, 98, 331, -46, 75, -32, -33, 255, 37, 180, 74, 13, -51, 100, -244, 58, 186, -135, 138, 14, 97, 158, -40, -124, 128, 280, 118, 111, -186, 188, 51, 87, -88, 36, 217, 16, -265, 347, -45, 309, 356, 126, 16, 290, 320, 207, -102, 13, -123, 216, 228, -97, -80, 18]
$$ [...]
8191F2
##END NTUPLES=NMR FID
##END=
