##TITLE=1H_AM_NV169_5
 CDCl3
 8 sc, 
 2.10.2024
##JCAMPDX= 6.0         $$ Bruker NMR JCAMP-DX V2.0
##DATA TYPE= NMR FID
##DATA CLASS= NTUPLES
##ORIGIN= UXNMR, Bruker Analytische Messtechnik GmbH
##OWNER= root
$$ XWIN-NMR		Version 3.5
$$ Wed Oct  2 13:55:09 2024 Russian Standard Time (UT+4h)  she@DPX200
##.OBSERVE FREQUENCY= 200.1318
##.OBSERVE NUCLEUS= ^1H
##.DELAY= (6, 6)
##.ACQUISITION MODE= SIMULTANEOUS
##.ACQUISITION SCHEME= undefined
##.AVERAGES= 8
##.DIGITISER RES= 18
##SPECTROMETER/DATA SYSTEM= spect
##.PULSE SEQUENCE= zg30
##.SOLVENT NAME= DMSO
##.SHIFT REFERENCE= (INTERNAL, DMSO, 0, 15.7039)
##AUDIT TRAIL= $$ (NUMBER, WHEN, WHO, WHERE, WHAT)
$$ ##TITLE= Audit trail, XWIN-NMR		Version 3.5
$$ ##JCAMPDX= 5.01
$$ ##ORIGIN= Bruker BioSpin GmbH
$$ ##OWNER= she
$$ F:/spectra/data/she/nmr/H-F/1/audita.txt
$$ ##AUDIT TRAIL=  $$ (NUMBER, WHEN, WHO, WHERE, WHAT)
(   1,<2024-10-02 13:53:55.98 +0400>,<she>,<DPX200>,
      <created by zg, POWCHK disabled, PULCHK disabled
       configuration hash MD5:
       00 E9 B6 7A A2 85 ED C7 34 08 36 98 17 FE 4E 26
       data hash MD5: 16K
       73 ED CF 1B D3 CB FE 34 D9 1D C5 56 B1 E6 F0 9E>)
$$ ##END=
$$ 
$$ hash MD5
$$ B8 EF 72 94 01 4E 68 8B D4 C9 02 A2 97 CF 2E 53
##$RELAX= 
##$RELAX= 
##$RELAX= 
##$RELAX= 
##$RELAX= 
##$RELAX= 
$$ Bruker specific parameters
$$ --------------------------
##$DU= <F:/spectra>
##$EXPNO= 1
##$NAME= <H-F>
##$PROCNO= 1
##$TYPE= <nmr>
##$USER= <she>
##$AMP= (0..31)
100 100 100 100 100 100 100 100 100 100 100 100 100 100 100 100 100 100 
100 100 100 100 100 100 100 100 100 100 100 100 100 100 
##$AQSEQ= 0
##$AQ_mod= 1
##$AUNM= <au_zg>
##$AUTOPOS= <>
##$BF1= 200.13
##$BF2= 200.13
##$BF3= 200.13
##$BF4= 200.13
##$BF5= 200.13
##$BF6= 200.13
##$BF7= 200.13
##$BF8= 200.13
##$BYTORDA= 1
##$CFDGTYP= 0
##$CFRGTYP= 5
##$CHEMSTR= <none>
##$CNST= (0..31)
1 1 145 1 1 1 1 1 1 1 1 1 1 1 1 1 1 1 1 1 1 1 1 1 1 1 1 1 1 1 1 1 
##$CPDPRG= <>
##$CPDPRG1= <>
##$CPDPRG2= <>
##$CPDPRG3= <>
##$CPDPRG4= <mlev>
##$CPDPRG5= <mlev>
##$CPDPRG6= <mlev>
##$CPDPRG7= <mlev>
##$CPDPRG8= <mlev>
##$CPDPRGB= <>
##$CPDPRGT= <>
##$D= (0..31)
0 1.2 0 0 0 0 0 0 0 0.06 0 0.03 0 0 0 0 0.0002 0 0 0 0 0 0 0 0 0 0 0 0 
0 0 0 
##$DATE= 1727862835
##$DBL= (0..7)
120 120 120 120 120 120 120 120 
##$DBP= (0..7)
150 150 150 150 150 150 150 150 
##$DBP07= 0
##$DBPNAM0= <>
##$DBPNAM1= <>
##$DBPNAM2= <>
##$DBPNAM3= <>
##$DBPNAM4= <>
##$DBPNAM5= <>
##$DBPNAM6= <>
##$DBPNAM7= <>
##$DBPOAL= (0..7)
0.5 0.5 0.5 0.5 0.5 0.5 0.5 0.5 
##$DBPOFFS= (0..7)
0 0 0 0 0 0 0 0 
##$DE= 6
##$DECBNUC= <off>
##$DECIM= 24
##$DECNUC= <off>
##$DECSTAT= 4
##$DIGMOD= 1
##$DIGTYP= 9
##$DL= (0..7)
0 120 120 120 120 120 120 120 
##$DP= (0..7)
150 150 150 150 150 150 150 150 
##$DP07= 0
##$DPNAME0= <>
##$DPNAME1= <>
##$DPNAME2= <>
##$DPNAME3= <>
##$DPNAME4= <>
##$DPNAME5= <>
##$DPNAME6= <>
##$DPNAME7= <>
##$DPOAL= (0..7)
0.5 0.5 0.5 0.5 0.5 0.5 0.5 0.5 
##$DPOFFS= (0..7)
0 0 0 0 0 0 0 0 
##$DQDMODE= 0
##$DR= 18
##$DS= 0
##$DSLIST= <SSSSSSSSSSSSSSS>
$$ [...]
##$SUBNAM2= <"">
##$SUBNAM3= <"">
##$SUBNAM4= <"">
##$SUBNAM5= <"">
##$SUBNAM6= <"">
##$SUBNAM7= <"">
##$SUBNAM8= <"">
##$SUBNAM9= <"">
##$SW= 24.0689170037331
##$SWIBOX= (0..15)
0 0 2 0 0 0 0 0 0 0 0 0 0 0 0 0 
##$SW_h= 4816.95568400771
##$TD= 16384
##$TD0= 1
##$TE= 0
##$TE2= 300
##$TE3= 300
##$TEG= 300
##$TL= (0..7)
0 120 120 120 120 120 120 120 
##$TP= (0..7)
150 150 150 150 150 150 150 150 
##$TP07= 0
##$TPNAME0= <>
##$TPNAME1= <>
##$TPNAME2= <>
##$TPNAME3= <>
##$TPNAME4= <>
##$TPNAME5= <>
##$TPNAME6= <>
##$TPNAME7= <>
##$TPOAL= (0..7)
0.5 0.5 0.5 0.5 0.5 0.5 0.5 0.5 
##$TPOFFS= (0..7)
0 0 0 0 0 0 0 0 
##$TUNHIN= 0
##$TUNHOUT= 0
##$TUNXOUT= 0
##$USERA1= <user>
##$USERA2= <user>
##$USERA3= <user>
##$USERA4= <user>
##$USERA5= <user>
##$V9= 5
##$VALIST= <valist>
##$VCLIST= <CCCCCCCCCCCCCCC>
##$VD= 0
##$VDLIST= <DDDDDDDDDDDDDDD>
##$VPLIST= <PPPPPPPPPPPPPPP>
##$VTLIST= <TTTTTTTTTTTTTTT>
##$WBST= 1024
##$WBSW= 4
##$XGAIN= (0..3)
0 0 0 0 
##$XL= 0
##$YL= 0
##$YMAX_a= 39614
##$YMIN_a= -39212
##$ZGOPTNS= <>
##$ZL1= 120
##$ZL2= 120
##$ZL3= 120
##$ZL4= 120
##$ABSF1= 10
##$ABSF2= 0
##$ABSG= 5
##$ABSL= 3
##$ALPHA= 0
##$AQORDER= 0
##$ASSFAC= 0
##$ASSFACI= 0
##$ASSFACX= 0
##$ASSWID= 0
##$AUNMP= <proc_1d>
##$AZFE= 0.1
##$AZFW= 0.1
##$BCFW= 1
##$BC_mod= 2
##$BYTORDP= 1
##$COROFFS= 0
##$CY= 11.3945322036743
##$DATMOD= 1
##$DC= 2
##$DFILT= <>
##$DTYPP= 0
##$F1P= 15.6554695791079
##$F2P= 12.8336369535428
##$FCOR= 0.5
##$FTSIZE= 0
##$FT_mod= 4
##$GAMMA= 1
##$GB= 0.15
##$INTBC= 1
##$INTSCL= 1
##$ISEN= 128
##$LB= 0.24
##$LEV0= 0
##$LPBIN= 0
##$MAXI= 10000
##$MC2= 0
##$MEAN= 0
##$ME_mod= 0
##$MI= 1.114404
##$NCOEF= 0
##$NC_proc= 0
##$NLEV= 6
##$NOISF1= 3.799351
##$NOISF2= 2.8
##$NSP= 1
##$NTH_PI= 0
##$NZP= 0
##$OFFSET= 15.70392
##$PC= 1
##$PHC0= -26004.56
##$PHC1= 22.98747
##$PH_mod= 1
##$PKNL= yes
##$PPARMOD= 0
##$PSCAL= 0
##$PSIGN= 0
##$REVERSE= no
##$SF= 200.130013532006
##$SI= 16384
##$SIGF1= 3
##$SIGF2= 2
##$SINO= 400
##$SIOLD= 16384
##$SREGLST= <1H.CDCl3>
##$SSB= 0
##$STSI= 0
##$STSR= 0
##$SW_p= 3612.71676300578
##$SYMM= 0
##$S_DEV= 0
##$TDeff= 0
##$TDoff= 0
##$TI= <>
##$TILT= no
##$TM1= 0
##$TM2= 0
##$TOPLEV= 0
##$USERP1= <user>
##$USERP2= <user>
##$USERP3= <user>
##$USERP4= <user>
##$USERP5= <user>
##$WDW= 1
##$XDIM= 8192
##$YMAX_p= 0
##$YMIN_p= 0
$$ End of Bruker specific parameters
$$ ---------------------------------
##NTUPLES= NMR FID
##VAR_NAME=  TIME,          FID/REAL,        FID/IMAG
##SYMBOL=    X,             R,               I
##VAR_TYPE=  INDEPENDENT,   DEPENDENT,       DEPENDENT
##VAR_FORM=  AFFN,          ASDF,            ASDF
##VAR_DIM=   8192,          8192,            8192
##UNITS=     SECONDS,       ARBITRARY UNITS, ARBITRARY UNITS
##FACTOR=    0.0002076,     1,               1
##FIRST=     0,             0,               0
##LAST=      1.7004516,     0,               0
##MIN=       0,             -39212,          0
##MAX=       1.7004516,     39614,           0
$$ Real data points
##PAGE= N=1
##DATA TABLE= (X++(R..R)), XYDATA
$$ plain form
0 0 0 0 0 0 0 0 0 0 0 0 0 0 0 0 -3 8 -8 8 -8 8 -11 15 -16 16 -21 24 -27 31 -35 40 -45 51 -58 65 -73 81 -89
37 -89 101 -110 124 -136 150 -167 184 -206 227 -251 280 -313 349 -391 441 -500 573 -667 787 -954
57 -954 1192 -1575 2323 -9730 37686 10975 -20613 30922 17525 -2582 26081 5978 -29784
70 -29784 4878 9083 -26941 -18143 1012 -7961 -3181 4485 1927 8297 17041 9345 526 4989
84 4989 10755 -8621 -21917 -218 2471 -19172 -3414 8839 -6656 10780 21577 -13012 -5528
97 -5528 25835 -2045 -19317 4326 -909 -10117 5827 -2863 -12051 8554 9956 -2810 3480 5256
111 5256 1381 2615 -2423 -6135 -4433 -6299 -2087 561 -3954 4959 7585 -3164 8018 10965 -11823
126 -11823 -3840 11851 -9745 -10860 9936 -6289 -10768 13507 2353 -10606 10327 8335 -6567
$$ packed form
0@%%%%%%%%%%%%%%lJ1j6J6j6J6j9K6l1L2l7M5n1N8o6P5q5R6j09J23j38J54j70
37h9J90k11K34k60K86l17L51l90M33m78N31n93O62p40Q32r41J073j240J454j741
57i54K146k767L898j2053M7416k6711l1588N1535j3397k0107K8663k0103l5762
70b9784L4662M205l6024Q798J9155q973M780P666k558O370Q744p696q819M463
84D989N766j9376j3296K1699K689k1643J5758J2253j5495J7436J0797l4589P484
97e528L1363k7880j7272K3643n235r208J5944q690r188K0605J402j2766O290J776
111E256l875J234n038l712J702j866M212K648m515Q913K626j0749J1182K947k2788
126a1823P983J5691k1596j115K0796j6225m479K4275j1154j2959K0933j992j4902
$$ plain form
139 -6567 4949 5219 -9347 -2932 1460 -5861 -2978 -693 -3241 3942 9284 2290 -2385 2990 6840
154 6840 -487 -8374 -3051 -908 -4260 1427 -753 -8701 5615 13941 -5689 -5377 12536 2392
168 2392 -6197 3760 -3207 -7733 3828 -1816 -10599 4219 7895 -4404 170 7078 2118 637
182 637 -851 -6065 -444 4834 -4606 -9154 2747 9043 827 -4234 2234 5392 1711 902 -4751
197 -4751 -8487 2982 4576 -11378 -7239 9021 3417 -2028 5610 3230 1949 7811 -1308 -9671
211 -9671 1578 1040 -11795 -6433 2264 -1991 384 5117 1214 5721 11849 1435 -5455 3286 3744
226 3744 -8984 -10245 -2873 -3126 -3117 1113 -129 646 10535 9800 -1409 1236 7416 -443 -6473 -3368
242 -3368 -6326 -7270 -925 -2829 -4992 5142 8185 1784 6228 8792 673 -415 1950 -5451 -7917
$$ packed form
139f567J1516K70j4566O415M392p321K883K285k548P183N342o994m675N375L850
154F840p327p887N323K143l352N687k180p948J4316Q326j9630L12J7913j0144
168B392q589R957o967m526J1561n644q783J4818L676j2299M574O908m960j481
182F37j488n214N621N278r440m548J1901O296q216n061O468L158l681q09n653
197d751l736J1469J594j5954M139J6260n604n445P638k380j281N862r119q363
211i671J1249n38j2835N362Q697m255K375M733l903M507O128j0414o890Q741M58
226C744j2728j261P372k53RM230j242P75R889p35j1209K645O180p859o030L105
242c368k958r44O345j904k163J0134L043o401M444K564q119j088K365p401k466
$$ plain form
257 -7917 -1944 -4827 -7988 891 3917 -1932 2810 9111 3001 1281 5961 531 -5105 -167 -1562
272 -1562 -8326 -4190 -84 -3528 -388 6322 1461 194 7348 4252 -3063 -874 -105 -4925 -1932
287 -1932 -581 -5429 -1035 6612 948 -3154 4340 4503 -1079 350 -142 -4120 -249 583 -6238 -4081
303 -4081 4865 1794 -2456 3369 5920 2130 2033 598 -4140 -1023 569 -7242 -6916 2997 2756 -2825
319 -2825 1060 4627 2887 3554 2086 -2995 306 5186 -3013 -8567 -339 1947 -3903 -2319 1030
334 1030 684 4691 5331 -2497 -753 5805 -150 -7108 -2285 1013 -2028 -362 398 -963 3728 5539
350 5539 -2639 -3144 4240 1834 -4737 -2184 153 -1624 -469 -294 -3518 1594 6807 565 -1883 4433
366 4433 3723 -2676 -2422 -2017 -4316 -1569 215 -4209 -741 6100 2983 -638 3272 3342 -717 -66 -534
$$ packed form
257g917N973k883l161Q879L026n849M742O301o110j720M680n430n636M938j395
272a562o764M136M106l444L140O710m861j267P154l096p315K189P69m820K993
287a932J351m848M394P647n664m102P494J63n582J429m92l978L871Q32o821K157
303d081Q946l071m250N825K551l790r7j435m738L117J592p811L26R913k41n581
319b825L885L567j740O67j468n081L301M880q199n554Q228K286n850J584L349
334A030l46M007O40p828J744O558n955o958M823L298l041J666P60j361M691J811
350E539q178n05P384k406o571K553K337j777J155J75l224N112N213o242k448O316
366D433p10o399K54M05k299K747J784m424L468O841l117l621L910P0m059O51m68
$$ plain form
383 -534 -4043 -1362 1246 -3653 -3720 2423 2080 -1237 2593 3832 337 2022 1993 -2902 -3125 567 -3055
400 -3055 -4595 480 1509 -382 3547 4088 -331 2027 3423 -2070 -3404 49 -2389 -4092 -541
415 -541 -1163 -2329 2434 3943 -82 2023 5558 1748 -857 548 -1763 -4304 -1737 -3163 -6288 -90
431 -90 4050 -140 589 5706 3864 993 1874 -758 -2732 577 -1167 -6426 -2784 2203 -1400 -2185
447 -2185 2476 2821 2450 3427 245 -1658 2399 1029 -5455 -4409 592 -748 -2447 241 1453 2422
463 2422 4294 1657 -2117 1482 3121 -3266 -5142 -553 -520 -2394 -384 -326 -428 4572 3498 -1693
479 -1693 1213 5328 -864 -3487 -750 -2247 -2389 -123 -2566 -2573 3854 3889 -1306 1022 4421 1617 -1306
496 -1306 -921 -1349 -1874 -430 -1748 -3625 193 3987 516 -1266 3208 3064 20 499 -1057 -2953
$$ packed form
383e34l509K681K608m899o7O143l43l317L830J239l495J685k9m895k23L692l622
400c055j540N075J029j891L929N41m419K358J396n493j334L453k438j703L551
415e41o22j166M763J509m025K105L535l810k605J405k311k541K567j426l125O198
431i0M140m190P29N117j842k871Q81k632j974L309j744n259L642M987l603p85
447b185M661L45l71R77l182j903M057j370o484J046N001j340j699K688J212R69
463B422J872k637l774L599J639o387j876M589L3j874K010N8j02N000j074n191
479a693K906M115o192k623K737j497j42K266k443pO427L5n195K328L399k804k923
496a306L85m28n25J444j318j877L818L794l471j782M474j44l044M79j556j896
$$ plain form
512 -2953 -65 -511 -4876 -1265 2672 -589 13 3449 922 1141 3603 -457 -2692 865 -631 -4424
528 -4424 -2200 226 -960 13 2176 1483 1441 2961 2051 -870 -1441 737 -1423 -4374 -958 -269 -1790
545 -1790 1276 1797 -945 2669 4847 -928 -369 1694 -2226 -2029 306 -4398 -3544 2749 649 -2059
561 -2059 3019 3819 1120 1987 1795 -1697 -625 -313 -2651 -3306 -879 967 -848 -924 2317 2982 871
578 871 1692 1693 127 1557 -85 -5506 -1428 1356 -2962 -2344 1682 76 2003 4662 -1315 -1453 4811
595 4811 257 -5337 -1169 176 -2185 -142 -7 -1039 1534 2736 557 -800 1109 2173 27
610 27 -2720 -1441 153 -2160 -1872 -380 -290 2442 2798 -24 2282 4410 -819 -1754 -369 -2920 -1968
627 -1968 270 -4019 -2753 4034 1938 -1337 1893 3286 1618 1883 -6 -1599 -103 25 -2251 -3336
$$ packed form
512b953K888m46m365L611L937l261O02L436k527K19K462m060k235L557j496l793
528d424K224K426j186R73K163o93m2J520r10k921n71K178k160k951L416O89j521
545a790L066N21k742L614K178n775N59K063l920J97K335m704Q54O293k100k708
561b059N078Q00k699Q67j92l492J072L12k338o55K427J846j815p6L241O65k111
578H71Q21Jj566J430j642n421M078K784m318O18M026j606J927K659n977j38O264
595D811m554n594M168J345k361K043J35j032K573J202k179j357J909J064k146
610B7k747J279J594k313K88J492R0K732L56k822K306K128n229r35J385k551R52
627a968K238m289J266O787k096l275L230J393j668K65j889j593J496J28k276j085
$$ plain form
643 -3336 -2327 39 1508 -454 670 2925 1610 514 463 -1282 -740 -525 -3103 -1173 878 -921
659 -921 -125 2280 371 801 2933 -431 -1959 2165 872 -3313 -1989 -460 -1086 -175 166 -297 1884
676 1884 3599 2494 674 -843 247 279 -2171 -3504 -2080 -185 922 -224 -222 1941 2615 1468 1095
693 1095 748 -926 144 552 -3319 -2746 635 -1315 -2236 1258 2108 448 1887 2168 528 717 -115
710 -115 -2468 -1879 -727 -1057 -1455 -835 1032 2800 1790 -53 57 1798 1698 -1204 -3009 -944 -79
727 -79 -1477 -1341 -1176 -612 2446 3638 -247 232 3270 1728 -1942 -1325 -1018 -2645 -1686 -802 -1845 -4
745 -4 2353 803 499 2514 1932 -638 388 269 -1477 -868 -1474 -4093 -112 2300 -1284 -1418 3174
762 3174 2505 643 2111 -405 -2072 598 447 -4279 -2779 1276 525 -467 759 1154 1167 2251 1298
$$ packed form
643c336J009K366J469j962J124K255j315j096n1j745N42K15k578J930K051j799
659i21P96K405j909M30K132l364j528M124j293m185J324J529o26R11L41m63K181
676A884J715j105j820j517J090L2k450j333J424J895J107j146KK163O74j147l73
693A095l47j674J070M08l871N73L381j950r21L494Q50j660J439K81j640J89q32
710a15k353N89J152l30l98O20J867J768j010j843J10J741j00k902j805K065Q65
727g9j398J36J65N64L058J192l885M79L038j542l670O17L07j627R59Q84j043J841
745dK357j550l04K015n82k570J026j19j746O09o06k619L981K412l584j34M592
762C174o69j862J468k516j667K670j51m726J500M055p51r92J226L95J3J084r53
$$ plain form
779 1298 -1157 -253 652 -1493 -2394 -977 -1178 -736 1215 413 -234 2741 1763 -1001 805 1613 -2051
796 -2051 -2583 61 -1664 -1467 660 -547 -257 2930 2477 -243 81 1678 992 -1010 -2381 -1557 -798
813 -798 -393 -281 -1248 -149 2744 2354 150 647 866 -137 508 -912 -3307 -870 954 -2222 -969
830 -969 1910 146 652 2725 896 -135 1752 -697 -2259 -311 -187 -1958 -1268 -301 732 1063 922
847 922 371 1540 1536 936 -1274 -1634 463 -188 -2319 -1025 -315 192 1885 852 -1282 1891 3036 -857
865 -857 -1084 351 -1485 -1477 203 -2071 -1661 1636 1061 -121 1798 1962 454 250 -589 -1042 -485 -1258
883 -1258 -1564 -1094 -69 145 -214 152 2156 2296 610 829 129 -336 283 -1437 -3835 -994 1252 -1060
901 -1060 -367 1733 640 1469 2614 -791 -1122 1612 -521 -2321 -1179 -382 -939 198 461 -341 1094
$$ packed form
779A298k455R04R05k145r01J417k01M42J951q02o47K975r78k764J806Q08l664
796b051n32K644j725J97K127j207K90L187m53k720L24J597o86k002j371Q24P59
813g98M05J12r67J099K893l90k204M97K19j003O45j420k395K437J824l176J253
830i69K879j764N06K073j829j031J887k449j562J948J24j771O90R67J033L31j41
847I22n51J169mo00k210l60K097o51k131J294P10N07J693j033k134L173J145l893
865h57k27J435j836QJ680k274M10L297n75j182J919J64j508k04q39m53N57p73
883a258l06M70J025K14l59L66K004J40j686K19p00m65O19j720k398K841K246k312
901a060O93K100j093Q29J145l405l31K734k133j800J142P97n57J137K63q02J435
$$ plain form
918 1094 2111 661 176 732 487 -1190 -1775 -730 -989 -1277 -455 -146 463 2984 2138 -380 1050 1804
936 1804 -705 -1787 -779 -1943 -1117 232 -1532 -1141 2119 1700 73 1093 1067 970 1201 69 -1879
953 -1879 -1136 -351 -1207 -2013 -382 809 887 1160 1365 609 753 713 -892 -1793 -1 -281 -1960 -636 910
972 910 -185 31 832 183 949 2053 -582 -1235 317 280 -1517 -1316 -869 -377 998 1313 307 876
990 876 2142 1072 -694 -919 -535 -1068 -1161 -1291 -1303 -228 1078 83 -2 1692 1750 236 419 146 -423
1009 -423 -363 -580 -2332 -1193 465 -334 -829 1338 1950 909 1060 513 -732 52 37 -1872 -1925 124
1027 124 482 -825 -110 803 1230 1336 561 -279 387 1085 -561 -2222 -954 -368 -933 -364 30 110 1764
1046 1764 1660 71 761 1371 -383 -1421 -866 -837 -1232 -268 -474 -830 1001 1865 213 303 1433 835
$$ packed form
918A094J017j450m85N56k45j677n85J045k59k88Q22L09O09K521q46k518J430P54
936A804k509j082J008j164Q26J349j764L91L260m19j627J020k6r7K31j132j948
953a879P43P85q56q06J631J191P8K73K05p56J44m0j605r01J792k80j679J324J546
972I10j095K16Q01o49P66J104k635o53J552l7j797K01M47M92J375L15j006N69
990H76J266j070j766k25L84n33r3j30j2J075J306r95q5J694N8j514J83k73n69
1009d23O0k17j752J139J658p99m95K167O12j041J51n47j245P84j5j909n3K049
1027A24L58j307P15R13M27J06p75q40O66O98j646j661J268N86n65N69L94Q0J654
1046A764j04j589O90O10j754j038N55K9l95R64k06l56J831Q64j652R0J130n98
$$ plain form
1064 835 -325 -570 -755 -908 -152 -836 -1244 -308 1308 760 -25 1135 1311 627 150 -647 -1588 -290 -161
1083 -161 -1659 -1324 624 520 194 1095 821 548 1337 144 -1274 -325 149 -1247 -1758 -312 -23 509
1101 509 665 672 975 1407 892 -907 -632 123 -438 -1700 -1222 -828 -74 832 271 -186 1635 2366 -90
1120 -90 -419 391 -237 -830 -788 -1603 -1205 497 344 -663 973 2000 748 94 562 169 -244 -415 -1275
1139 -1275 -1422 -381 158 -768 -619 919 1213 526 888 368 203 486 -450 -1970 -936 284 -846 -781
1157 -781 453 586 848 1282 202 -264 1301 172 -1471 -1046 -123 -719 -972 -261 7 410 1403 649
1175 649 -126 975 1012 -730 -1019 -652 -608 -762 -365 -661 189 1393 1099 180 1033 1374 29 -370 -633
1194 -633 -1084 -1064 10 -912 -1573 643 1097 480 547 1627 1158 844 185 -527 -1249 -501 -1037 -1738 -158
$$ packed form
1064H35j160k45j85j53P56o84m08R36J616n48p85J160J76o84m77p97r41J298J29
1083a61j498L35J948j04l26R01k74k73P89j193j418R49M74j396n11J446K89N32
1101E09J56PL03M32n15j799K75P55n61j262M78L94P54R06n61m57J821P31k456
1120i0l29Q10o28n93M2q15L98J702j53j007J636J027j252o54M68l93m13j71q60
1139a275j47J041N39r26J49J538K94o87L62n20j65K83r36j520J034J220j130O5
1157g81J234J33K62M34j080m66J565j129j643M25R23n96k53P11K68M03R93p54
1175F49p75J101L7j742k89L67M4j54L97k96Q50J204k94r19Q53L41j345l99k63
1194f33m51K0J074r22o61K216M54o17O7J080m69l14o59p12p22P48n36p01J580
$$ plain form
1213 -158 680 465 280 622 1146 990 665 -783 -695 364 -535 -1291 -762 -9 -501 281 533 200 940 1649
1233 1649 429 -890 338 294 -1598 -1661 -1110 -376 -194 708 165 293 1925 1566 -490 -242 266 -819
1251 -819 -737 -978 -1652 -432 197 -799 -170 1444 1107 920 1340 616 42 371 -866 -1595 -1577 -170 -577
1270 -577 -865 -109 1607 415 252 1284 634 38 304 -640 -1470 392 174 -1231 -333 549 308 606
1288 606 843 -362 1000 1450 -1018 -1150 -37 -941 -1139 -320 -755 -111 1422 1244 46 332 1214 538
1306 538 -615 -863 -434 -402 -867 -700 -214 -242 819 543 -463 868 1179 556 143 38 -783 -289 -606
1325 -606 -1799 -149 966 -529 40 1320 378 997 620 -794 -524 578 -306 -1242 -750 -224 1027
1342 1027 -43 -711 836 1227 106 247 65 -1065 -148 -70 -1666 -985 126 -167 350 399 2 1330
$$ packed form
1213a58Q38k15j85L42N24j56l25j448Q8J059q99p56N29P53m92P82K52l33P40P09
1233A649j220j319J228m4j892o3N51P34J82R02n43J28J632l59k056K48N08j085
1251h19Q2k41o74J220O29r96O29J614l37j87M20p24n74L29j237p29J8J407m07
1270e77k88P56J716j192j63J032o50n96K66r44q30J862k18j405Q98Q82k41K98
1288F06K37j205J362M50k468j32J113r04j98Q19m35O44J533j78j198K86Q82o76
1306E38j153k48M29L2m65J67M86k8J061k76j006J331L11o23m13j05q21M94l17
1325f06j193J650J115j495N69J280r42O19l77j414K70J102q84r36M92N26J251
1342A027j070o68J547L91j121J41j82j130R17P8j596O81J111k93N17M9l97J328
$$ plain form
1360 1330 1304 -646 -316 725 -1329 -1338 -95 -808 -813 520 -333 -83 1567 580 113 221 240 668 -224 -1696
1380 -1696 -997 47 -555 -564 -128 23 1159 1567 -115 347 928 -445 -194 -733 -1781 -118 940 -1433
1398 -1433 -424 1741 198 500 1611 -337 -214 641 -627 -1602 -306 -320 -583 -225 -96 301 1158 284
1416 284 537 1270 528 -97 -451 -1194 -750 -557 -1689 -995 -110 57 762 848 -411 1473 1825 -567 -542
1435 -542 203 -1210 -770 -82 -1370 -824 947 427 -147 1031 720 659 945 -307 -555 -14 -891 -775 -363
1454 -363 -490 145 604 98 1022 1382 362 477 392 -645 -467 -583 -1815 -791 1072 -848 -764 704
1472 704 572 679 1440 -121 -414 1184 344 -824 -922 -505 -458 285 -185 -259 1040 901 530 303 58 328
1492 328 -624 -1219 -741 -237 -539 -56 380 71 761 1243 -154 196 1158 -552 -1043 -58 -935 -771 -466
$$ packed form
1360A330k6j950L30J041k054rJ243p13nJ333q53K50J650r87m67J08J9M28q92j472
1380a696O99J044o02rM36J51J136M08j682M62N81j373K51n39j048J663J058k373
1398a433J009K165j543L02J111j948J23Q55j268r75J296j4k63L58J29L97Q57q74
1416B84K53P33p42o25l54p43M44J93j132O94Q85J67P05Q6j259J884L52k392K5
1435e42P45j413M40O88j288N46J771n20n74J178l11o1K86j252k48N41q77J16M12
1454c63j27O35M59n06R24L60j020J15q5j037J78j16j232J024J863j920Q4J468
1472G04j32J07P61j561k93J598q40j168r8M17M7P43m70p4J299j39l71k27k45K70
1492C28r52n95M78N04l02M83M36l09O90M82j397L50R62j710m91R85q77J64L05
$$ plain form
1511 -466 -1091 -981 939 966 114 626 893 774 492 -450 -1220 -390 -400 -580 -484 -522 455 810 291 -31 515
1532 515 270 187 -32 -938 -17 85 -1311 -540 60 -444 81 707 215 561 1086 -306 -693 59 -314 -1040
1552 -1040 -978 -100 -18 729 456 -283 637 1121 340 -788 -410 -90 -59 -489 -845 -722 -242 473 386 -320 705
1573 705 913 710 217 -179 -478 -222 -823 -1125 -772 130 17 -45 562 599 487 565 90 -379 -273 -696 -1004
1594 -1004 -634 115 6 -170 25 388 1063 802 709 305 268 347 -604 -1535 -888 173 -556 -354 98 152 1361
1615 1361 1285 -14 -18 526 -164 -572 -745 -753 -608 -378 -419 -356 471 1253 680 423 989 517 -341 -296 -514 -605
1637 -605 -634 -698 -706 -95 883 353 154 711 966 200 -86 -526 -749 214 -439 -1161 -817 165 300 -158 405
1658 405 454 828 1070 559 -496 -578 254 -538 -1311 -377 -246 27 532 336 654 515 555 -219 -452 95 -338
$$ packed form
1511d66o25J10J920K7q52N12K67j19k82r42p70Q30j0j80R6l8R77L55n19l22N46
1532E15k45q3k19r06R21J02j396P71O00n04N25O26m92L46N25j392l87P52l73p26
1552a040O2Q78Q2P47k73p39R20M84p81j128L78L20L1m30l56J23M80P15q7p06J025
1573G05K08k03m93l96k99K56o01l02L53R02j13o2O07L7j12P8m75m69J06m23l08
1594a004L70P49j09j76J95L63O75k61r3m04l7P9r51r31O47J061p29K02M52N4J209
1615A361p6j299mN44o90m08j73qJ45K30m1O3Q27P82n73k57N66m72q58M5k18r1
1637f05k9o4qO11R78n30j99N57K55p66k86m40k23R63o53p22L44R82J35m58N63
1658D05M9L74K42n11j055q2Q32p92p73R34J31K73N05j96L18j39M0p74k33N47m33
$$ plain form
1679 -338 -914 -827 -299 -95 495 -92 145 549 931 177 -256 110 572 -196 -868 -805 -580 -43 -103 -5 3 1102
1701 1102 795 -80 222 232 -203 -96 -741 -1039 -272 118 -22 -64 445 818 675 570 431 -15 54 -407 -802
1722 -802 -463 234 -391 -573 293 548 671 640 407 -112 259 321 -795 -1071 -338 -122 -602 -344 157 520
1742 520 958 513 -43 258 658 -167 -726 -267 -371 -192 -377 -493 52 689 612 71 312 743 93 -110
1762 -110 -492 -159 -257 -263 -391 -544 277 1142 264 4 762 917 102 -193 -160 -572 -188 -328 -1082 -392 494
1783 494 11 154 232 633 844 385 -121 -406 108 4 -634 -496 -206 216 371 59 633 817 487 95
1803 95 -416 -273 246 -732 -859 -520 -130 22 377 273 468 936 960 -131 141 225 -236 -350 -840 -897 -415
1824 -415 -71 -397 -10 825 939 701 517 479 372 -359 -609 -1023 -1166 3 3 -161 -93 740 553 133 267
$$ packed form
1679c38n76Q7N28K04N90n87K37M04L82p54m33L66M62p68o72O3K25N37o0R8QJ099
1701A102l07q75L02J0m35J07o45k98P67L90j40m2N09L73j43j05j39m46O9m61l95
1722h02L39O97o25j82Q66K55J23l1k33n19L71O2j116k76P33K16m80K58N01L63
1742E20M38m45n56L01M00q25n59M59j04J79j85j16N45O37p7n41K41M31o50k03
1762a10l82L33r8oj28j53Q21Q65q78k60P58J55q15k95L3m12L84j40p54O90Q86
1783D94m83J43P8M01K11m59n06k85N14j04o38J38K90M22J55l12N74J84l30l92
1803I5n11J43N19r78j27L39L90J52L55j04J95M68K4j091K72Q4m61j14m90n7M82
1824d15L44l26L87Q35J14k38j84l8j07p31k50m14j43J169%j64O8Q33j87m20J34
$$ plain form
1845 267 784 161 423 -145 -1248 155 -49 -771 -572 187 283 155 678 12 504 529 -750 -590 -112 -683
1865 -683 -373 -99 -62 241 803 605 27 -70 758 545 -465 -539 141 -1 -740 -467 -296 -189 453 661 189
1886 189 774 970 -349 -235 -227 -979 -369 -543 -910 -2 758 158 -38 659 258 270 538 -328 -383 124 -171
1907 -171 -908 -741 -407 123 33 -89 306 956 404 448 -41 -459 235 -451 -1331 -611 339 -311 116 264 152
1928 152 602 668 -231 210 508 -288 -1055 -568 -157 -499 181 -47 -79 619 656 235 46 395 627 -38 -862
1949 -862 -576 -331 -270 -14 -96 -222 600 749 160 -18 733 68 -219 -134 -1009 -451 -26 -681 -279 539 304
1970 304 9 621 276 -62 389 -104 -692 -409 -32 -546 -327 -48 462 759 155 410 824 335 290 -255
1990 -255 -963 -296 -244 -861 -436 54 37 443 330 45 723 1010 101 -503 -49 -110 -507 -326 -805 -457 488
$$ packed form
1845B67N17o23K62n68j103J403k04p22J99P59R6j28N23o66M92K5j279J60M78n71
1865f83L10K74L7L03N62j98n78r7Q28k13j010p4O80j42p39K73J71J07O42K08m72
1886A89N85J96j319J14Qp52O10j74l67R08P60o00j96O97m01J2K68q66n5N07k95
1907a71p37J67L34N30r0j22L95O50n52M4m89m18O94o86q80P20R50o50M27J48j12
1928A52M50O6q99M41K98p96p67M87M11l42O80k28l2O98L7m21j89L49K32o65q24
1949h62K86K45O1K56q2j26Q22J49n89j78P51o65k87Q5q75N58M25o55M02Q18k35
1970C04k95O12l45l38M51m93n88K83L77n14K19K79N10K97o04K55M14m89m5n45
1990b55p08O67N2o17M25M90j7M06j13k85O78K87r09o04M54o1l97J81m79L48R45
$$ plain form
2011 488 274 -104 686 677 734 142 -507 -84 -175 -720 -795 -326 -439 10 35 231 546 610 520 132 63 -249 -85
2034 -85 -248 -707 -551 242 -309 -357 142 470 262 233 -144 -22 210 -39 -578 -548 -5 15 -163 -394 60 728
2056 728 450 182 28 -216 124 -303 -663 -701 55 -319 1 104 96 488 852 192 -53 478 -82 -298 -496
2077 -496 -501 -470 -168 -227 -228 126 814 384 -117 266 289 -395 -382 -779 -366 -227 -494 -386 -171 287 443 227 122
2100 122 402 254 -114 -80 -407 -360 -351 -265 -672 -314 377 106 260 470 136 292 233 -285 -470 -140 -178 -549
2122 -549 -186 425 146 192 166 419 657 352 -104 -101 106 -309 -1170 -657 -334 -126 366 78 -314 779 1207
2143 1207 205 -56 -210 -62 -77 -254 -692 -497 -134 -93 -70 -128 508 626 186 66 93 64 -76 -271 -1021
2164 -1021 -341 -291 -500 -118 352 355 261 131 156 273 329 -279 -486 -574 53 -91 -1 -46 412 493 468 58 242
$$ packed form
2011D88k14l78P90rN7n92o49M23r1n45p5M69j13M49K5J96L15O4r0l88o9l12J64
2034h5j63m59J56P93n51m8M99L28k08k9l77J22K32k49n39L0N43K0j78k31M54O68
2056G28k78k68j54k44L40m27l60l8P56l74L20J03qL92L64o60k45N31n60k16j98
2077d96nL1L02n9jL54O88m30n01L83K3o84J3l97M13J39k67J08K15M58J56k16j05
2100A22K80j48l68L4l27M7RQ6m07L58O91k71J54K10l34J56n9n18j85L30l8l71
2122e49L63O11k79M6k6K53K38l05m56LK07m15q61N13L23K08M92k88l92J093M28
2143A207j002k61j54J48j5j77m38J95L63M1K3n8O36J18m40j20K7k9j40j95p50
2164a021O80N0k09L82M70Lr4j30K5J17N6o08k07q8O27j44R0m5M58Q1k5m10J84
$$ plain form
2187 242 428 161 -185 -775 -310 -46 -437 -589 209 -109 394 116 27 383 261 -90 -167 -10 -328 -471 -158
2208 -158 -160 -52 283 -127 166 213 274 474 166 -510 -337 163 -259 -814 -427 -32 385 472 291 504 602 301
2230 301 189 -684 -277 74 -39 -641 -405 585 236 325 440 -23 463 476 -159 -52 129 -325 -614 -204 -194
2251 -194 -12 101 105 442 982 303 78 -192 -103 -305 -283 -385 -219 -205 194 134 -13 -11 715 826 -146 -95 387
2274 387 395 -168 -429 -872 -551 103 -193 -42 130 290 579 272 37 69 -61 -174 -851 -457 -185 -301 -431
2295 -431 167 368 389 81 354 379 171 178 -356 -223 -104 -353 -490 -329 319 189 397 436 244 336 677 -350
2317 -350 -480 -212 22 -276 -544 -496 -123 578 291 57 216 623 290 181 -729 -174 0 -33 -253 -303 -82
2338 -82 283 309 185 474 643 23 28 9 -242 -222 -470 -474 -196 196 384 76 221 360 339 218 -73 -309 205
$$ packed form
2187B42J86k67l46n90M65K64l91j52P98l18N03k78q9L56j22l51p7J57l18j43L13
2208a58kJ08L35m10K93M7O1K00l08o76J73N00m22n55L87L95M17Q7j81K13R8l01
2230C01j12q73M07L51j13o02K36R90l49Q9J15m63M86J3o35J07J81m54k89M10J0
2251a94J82J13ML37N40o79k25k70Q9k02K2j02J66J4L99o0j47KP26J11r72N1M82
2274C87Qn63k61m43L21O54k96J51J72J60K89l07k35L2j30j13o77L94K72j16j30
2295d31N98K01K1l08K73K5k08Pn34J33J19k49j37J61O48j30K08L9j92R2L41j027
2317c50j30K68K34k98k68M8L73P01k87k34J59M07l33j09r10N55J74l3k20n0K21
2338h2L65K6j24K89J69o20Nj9k51K0k48mK78L92J88l08J45J39k1j21k91k36N14
$$ plain form
2361 205 97 -375 -248 -29 372 80 97 273 424 558 113 -120 -143 33 -307 -713 -514 196 -136 198 -81
2382 -81 225 325 482 216 -20 300 -109 -448 -111 -231 -263 202 -238 -167 387 454 100 -51 431 -15 -132
2403 -132 -257 -255 -151 -348 -24 -248 -54 486 613 369 538 334 425 -182 -168 -236 -257 138 -138 -18 106 328
2425 328 383 130 199 -100 -24 -81 -97 125 64 -143 -281 -245 294 107 222 202 -140 279 333 -128 -556 -96 -329
2448 -329 -690 -379 -56 542 415 537 123 436 464 -119 -427 -181 -625 -225 -376 -371 -145 -26 14 -116 166
2469 166 314 485 37 -6 -129 -262 -104 -797 -622 6 -59 238 350 367 89 431 -70 -3 279 212 36 -438
2491 -438 -280 85 238 -286 -95 131 489 229 178 74 95 79 -455 -414 -474 -205 28 -144 92 314 357 308
2513 308 -9 -58 191 182 -524 -327 -251 -245 -345 8 82 385 480 203 217 448 99 173 -426 -389 -156 245 -293 -358
$$ packed form
2361B05j08m72J27K19M01k92J7J76J51J34m45k33k3J76l40m06J99P10l32L34k79
2382h1L06J00J57k66k36L20m09l39L37j20l2M65m40P1N54O7l54j51M82m46j17
2403a32j25KJ04j97L24k24J94N40J27k44J69k04R1o07J4o8k1L95k76J20J24K22
2425C28N5k53O9k99P6n7j6K22o1k07j38L6N39j87J15k0l42M19N4m61m28M60k33
2448c29l61L11L23N98j27J22m14L13K8n83l08K46m44M00j51NK26J19M0j30K82
2469A66J48J71m48m3j23j33J58o93J75O28o5K97J12J7k78L42n01O7K82o7j76m74
2491d38J58L65J53n24J91K26L58k60n1j04K1j6n34M1o0K69K33j72K36K22M3m9
2513C08l17m9K49rp06J97P6Oj00L53P4L03R5k77J4K31l49P4n99L7K33M01n38o5
$$ plain form
2537 -358 -56 599 559 89 17 255 127 -36 -252 -461 -238 -106 -319 -28 459 60 256 -45 264 178 270
2558 270 65 -299 113 -1 -252 -559 -393 69 158 348 98 475 761 -223 -107 -241 -53 -363 -666 -166
2578 -166 -189 195 404 38 136 255 633 -251 -205 -16 123 -406 -492 -106 -57 78 114 259 245 188 433 179 -153
2601 -153 -14 -92 -340 -471 -351 235 -46 10 108 244 642 109 214 44 99 273 -130 -591 -372 125 -190
2622 -190 -1 316 172 352 303 -167 -194 179 -286 -548 -552 -338 -631 -55 267 149 -73 377 363 138 71 -82
2644 -82 -157 -741 -445 -399 -107 141 30 48 516 133 -224 255 307 159 -120 -656 -177 113 71 -533 -21 107
2666 107 -32 146 274 483 514 455 -245 -393 -306 -138 -208 -324 -242 183 52 -217 159 252 -149 418 -349 -94
2688 -94 66 36 -756 -14 115 149 124 110 -16 475 284 -347 -386 -249 -160 -210 -271 -386 321 420 143 -301 561
$$ packed form
2537c58L02O55m0m70p2K38j28j63k16k09K23J32k13K91M87l99J96l01L09q6R2
2558B70k05l64M12j14k51l07J66M62Q9J90k50L77K86r84J16j34J88l10l03N00
2578a66k3L84K09l66R8J19L78q84M6J89J39n29q6L86M9J35L6J45j4n7K45k54l32
2601a53J39p8k48j31J20N86k81N6R8J36L98n33J05j70N5J74m03m61K19M97l15
2622a90J89L17j44J80m9m70k7L73m65k62mK14k93N76L22j18k22M50j4k25o7j53
2644h2p5n84K96M6K92K48j11J8M68l83l57M79N2j48k79n36M79K90m2o04N12J28
2666A07j39J78J28K09L1n9p00j48Q7J68p0j16Q2M25j31k69L76R3m01N67p67K55
2688i4J60l0p92P42J29L4k5j4j26M91j91o31l9J37Q9n0o1j15P07R9k77m44Q62
$$ plain form
2711 561 496 93 -98 -328 -140 -22 -330 -258 -127 439 -10 71 39 440 212 -204 175 83 -199 20 -475 -290
2733 -290 104 372 -138 240 378 227 101 286 191 -24 -225 -338 -547 -302 -38 -152 -159 -172 207 131 182 -71
2755 -71 333 383 196 -453 -472 -349 -310 -152 -95 -121 397 479 516 161 167 224 158 -39 133 -72 -141 -257 -175 -162 425
2780 425 247 146 278 -36 -42 -138 -250 -376 -172 -309 -179 -484 232 235 9 57 130 326 -24 213 -122 -220 194
2803 194 -293 -143 -374 4 182 -32 -49 375 195 332 -11 -171 -214 -374 -157 -210 133 -185 235 239 150 199
2825 199 152 312 -150 136 45 -63 -652 -23 -88 -67 -223 -84 42 315 405 -219 -168 271 -131 -482 -217 -492
2847 -492 -139 -61 -180 -69 -122 476 44 147 216 252 -123 25 -98 -494 -338 31 0 -171 68 -44 305 72
2869 72 -81 332 -17 -253 -314 -215 -71 -386 -247 -204 230 -185 404 -323 53 555 -101 -266 -33 -22 -239 -240
$$ packed form
2711E61o5m03j91k30J88J18l08P2J31N66m49Q1l2M01k28m16L79r2k82K19m95J85
2733b90L94K68n10L78J38j51j26J85r5k15k01j13k09K45K64j14pj3L79p6N1k53
2755g1M04N0j87o49j9J23L9J58N7k6N18Q2L7l55ON7o6j97J72k05o9j16Q2J3N87
2780D25j78j01J32l14or6j12j26K04j37J30l05P16Lk26M8P3J96l50K37l35r8M14
2803A94m87J50k31L78J78k14j7M24j80J37l43j60m3j60K17n3L43l18M20Mq9M9
2825A99m7J60m62K86r1j08n89O29o5K1j56J39J26K73R0o24N1M39m02l51K65k75
2847d92L53P8j19J11n3N98m32J03O9L6l75J48j23l96J56L69l1j71K39j12L49k33
2869G2j53M13l49k36o1R9J44l15J39M3M34m15N89p27L76N02o56j65K33J1k17j
$$ plain form
2891 -240 -283 4 220 295 238 169 360 432 7 -91 -145 -396 68 -256 -235 -49 115 360 -9 326 459 156 -9
2914 -9 4 -205 -84 -314 -20 -42 335 280 257 299 435 528 -76 -370 27 164 -314 -326 -2 100 -70 142 64
2937 64 -40 576 71 329 -197 -174 94 -350 -111 -160 108 197 -76 -130 227 244 178 118 166 88 -152 -142 -282 -382
2961 -382 -93 -278 141 1 213 130 155 235 203 -141 -342 -402 -159 -213 -237 -31 -306 -53 238 506 267 -14
2983 -14 6 153 7 -393 -522 -306 -218 -203 3 89 11 381 136 216 320 502 -43 -156 -496 6 -285 -411
3005 -411 -28 41 135 302 270 360 -8 263 -290 -281 -240 -82 -231 84 125 248 107 48 20 193 310 32 178
3028 178 -333 191 -185 -413 -353 178 -77 21 172 -190 228 198 77 22 -206 47 12 -110 -257 -166 284 -66
3050 -66 211 199 239 193 60 -70 56 333 -337 -382 -38 -237 113 -159 -15 156 132 283 285 32 208 -296 -257
$$ packed form
2891b40m3K87K16P5n7o9J91P2m25r8n4k51M64l24K1J86J64K45l69L35J33l03j65
2914iJ3k09J21k30K94k2L77n5k3M2J36R3o04k94L97J37m78j2L24J02j70K12p8
2937F4j04O16n05K58n26K3K68m44K39m9K68Q9k73n4L57J7o6o0M8p8k40J0j40j00
2961c82K89j85M19j40K12q3K5Q0l2l44k01o0K43n4k4K06k75K53K91K68k39k81
2983a4K0J47j46m00j29K16Q8J5K06Q6p8L70k45Q0J04J82n45j13l40N02k91j26
3005d11L83O9R4J67l2R0l68K71n53RM1J58j49L15M1J23j41n9k8J73J17k78J46
3028A78n11N24l76k28O0N31k55R8J51l62M18l0j21n5k28K53l5j22j47R1M50l50
3050f6K77j2M0m6j33j30J26K77o70m5L44j99L50k72J44J71k4J51Kk53J76n04L9
$$ plain form
3073 -257 -350 -277 -75 240 121 -88 347 140 398 -240 85 159 -510 -106 -159 -225 -83 -332 -113 46 83 580
3095 580 79 -164 75 63 101 -116 -306 45 -96 121 -345 98 134 240 3 200 217 40 42 208 -117 -436
3117 -436 -308 -292 39 124 -58 299 -51 -51 266 -56 -28 -16 17 158 -115 -300 140 405 318 145 -8 36 -152
3140 -152 264 -271 -107 203 -216 -170 46 -85 -27 568 241 36 231 42 110 -316 -149 -79 -179 95 -390
3161 -390 -101 -308 -9 192 82 -5 229 163 -59 -112 -149 -257 -498 -288 40 325 -53 -284 94 284 -51
3182 -51 67 1 -234 75 -170 -525 -275 -6 -153 42 228 76 352 230 -165 182 -1 -79 -151 -252 -564
3203 -564 -92 51 -570 97 452 23 -224 23 291 187 -235 78 -106 -57 -295 -9 -103 65 7 28 240
3224 240 -74 98 -91 -94 -55 4 -49 -198 -336 12 356 195 -127 127 110 59 117 108 -264 -115 -73 -208 -61 325
$$ packed form
3073b57r3P3K02L15j19k09M35k07K58o38L25P4o69M04n3o6J42k49K19J59L7M97
3095E80n01k43K39j2L8k17j90L51j41K17m66M43L6J06k37J97J7j77KJ66l25l19
3117d36J28J6L31Q5j82L57l50%L17l22K8J2L3J41k73j85M40K65q7j73j53M4j88
3140a52M16n35J64L10m19M6K16j31N8N95l27k05J95j89O8m26J67P0j00K74m85
3161c90K89k07K99K01j10q7K34o6k22n3l7j08k41K10L28K85l78k31L78J90l35
3182e1J18o6k35L09k45l55K50K69j47J95J86j52K76j22l95L47j83p8p2j01l12
3203e64M72J43o21O67L55m29k47K47K68j04m22L13j84M9k38K86r4J68n8K1K12
3224B40l14J72j89lL9N9n3j49j38L48L44j61l22K54j7n1N8rl72J49M2j35J47L86
$$ plain form
3248 325 225 128 -54 417 286 48 66 -329 -313 -154 -163 -236 -159 145 209 81 -167 -49 -18 192 -137 108 30
3271 30 -354 4 -74 -246 393 154 104 479 214 285 255 330 57 180 -633 -318 -229 -149 -86 50 171 298 108
3294 108 252 154 156 -20 -53 -64 -391 -290 -366 31 -83 -310 28 270 -133 -59 -6 128 -2 -31 -54 -159 -165 155
3318 155 -30 33 391 399 -67 270 -10 124 -129 -323 -496 -241 97 -43 -162 -44 254 249 191 225 64 -75
3340 -75 49 24 8 -210 -177 33 118 -133 55 154 52 214 232 202 76 92 141 181 -325 -48 -235 182 53 -40
3364 -40 450 88 -13 298 145 -83 -55 89 -153 -376 -454 -8 122 8 42 -127 75 205 68 -128 3
3385 3 -40 -26 69 133 151 293 135 371 280 -31 -125 149 -177 -329 -231 -98 -124 -58 116 101 88 -1 -7 388 -59 114
3411 114 21 -361 -108 -145 21 -344 21 -128 353 73 258 -15 23 -86 217 149 -3 -65 -130 -381 95 -84
$$ packed form
3248C25j00r7j82M71j31k38J8l95J6J59rp3P7L04O4j28k48J18L1K10l29K45p8
3271C0l84L58p8j72O39k39n0L75k65P1l0P5k73J23q13L15Q9Q0O3J36J21J27j90
3294A08J44r8Kj76l3j1l27J01p6L97j14k27L38K42m03P4N3J34j30k9k3j05oL20
3318A55j85O3L58Qm66L37k80J34k53j94j73K55L38j40j19J18K98nn8L4j61j39
3340g5J24k5j6k18L3K10Q5k51J88R9j02J62J8l0j26J6M9M0n06K77j87M17j29r3
3364d0M90l62j01L11j53k28K8J44k42k23p8M46J30j14L4j69K02J30j37j96J31
3385Cm3J4R5O4J8J42j58K36r1l11r4K74l26j52R8J33k6O6J74j5j3q9oL95m47J73
3411A14r3l82K53l7J66l65L65j49M81k80J85k73L8j09L03o8j52o2o5k51M76j79
$$ plain form
3433 -84 99 54 296 376 -164 46 -382 -382 98 -159 164 -165 -277 86 247 388 -310 245 240 139 -125 48
3455 48 -227 -131 -101 -221 75 -118 -88 371 -107 -57 277 115 174 -21 -295 -25 -302 -100 -43 -484 -52 247
3477 247 286 92 254 120 229 134 177 -83 -47 -238 -50 -286 -213 19 269 35 -140 339 23 -12 -58 -26 -190
3500 -190 -395 14 -60 -31 25 72 -29 103 217 69 191 -170 36 -56 -185 -203 -112 -212 348 -201 -187 441 67
3523 67 263 -313 -127 94 -79 -129 -185 182 -41 15 21 293 152 106 113 153 -31 -250 -197 14 -189 -8 27 22 36
3548 36 354 145 -46 69 -47 130 20 -292 -445 -290 -174 25 -203 -205 275 301 -53 373 141 -129 -88 -100
3570 -100 -252 -151 -166 -275 -123 -8 -56 293 192 -147 292 175 -311 166 -224 79 -165 -32 114 -51 127
3591 127 -50 -131 61 192 165 -24 -392 -332 -297 -55 -175 -181 366 461 224 235 -95 208 -105 -201 -170 -174 -116 -458
$$ packed form
3433h4J83m5K42Q0n40K10m28%M80k57L23l29j12L63J61J41o98N55nj01k64J73
3455D8k75R6L0j20K96j93L0M59m78N0L34j62N9j95k74K70k77K02N7m41M32K99
3477B47L9j94J62j34J09r5M3k60L6j91J88k36P3K32K50k34j75M79l16l5m6L2j64
3500a90k05M09p4K9N6M7j01J32J14j48J22l61K06r2j29j8R1j00N60n49J4O28l74
3523F7J96n76J86K21j73n0n6L67k23N6OK72j41m6PM0j84k19N3K11k03J81L5nJ4
3548C6L18k09j91J15j16J77j10l12j53J55J16J99k28kM80K6l54M26k32k70M1j2
3570a00j52J01j5j09J52J15m8L49j01l39M39j17m86M77l90L03k44J33J46j65J78
3591A27j77q1J92J31k7j89l68O0L5K42j20oN47R5k37J1l30L03l13r6L1mN8l42
$$ plain form
3615 -458 -167 -14 403 102 274 -117 246 111 191 -41 -234 -133 -129 -390 -279 -76 24 -203 -220 269 422
3636 422 -63 -95 -198 12 25 -441 -91 -212 -73 -8 -211 -226 94 350 45 84 -99 191 -32 -148 -289 187
3658 187 44 297 -114 88 -81 152 -202 28 -47 104 317 -200 -77 28 32 -217 108 -42 159 89 108 61
3680 61 157 -171 -315 -104 -247 -22 70 -314 -148 263 85 133 159 65 196 -51 -115 118 -259 -125 72 -22 38
3703 38 26 14 92 278 176 142 262 -56 -206 13 -66 -217 -76 -229 -201 140 -24 3 162 250 -143 128 21
3726 21 -144 75 116 -224 97 -98 192 -247 -82 36 -230 44 -256 28 -481 -149 -275 -301 -14 152 186
3747 186 42 466 14 107 5 -344 -24 -42 -271 -89 -290 114 -130 163 -54 215 96 153 -46 114 123 -66
3769 -66 73 -350 -107 -164 21 78 -117 99 245 -29 61 68 101 -25 -245 -92 206 -280 -6 177 97 308 216
$$ packed form
3615d58K91J53M17l01J72l91L63j35Q0k32j93J01Mk61J11K03J00k27j7M89J53
3636D22m85l2j03K10J3m66L50j21J39O5k03j5L20K56l05L9j83K90k23j16j41M76
3658A87j43K53m11K02j69K33l54K30p5J51K13n17J23J05Mk49L25j50K01p0J9m7
3680F1R6l28j44K11j43K25R2l84J66M11j78M8K6r4J31k47o4K33l77J34J97r4O0
3703C8j2j2P8J86j02l4J20l18j50K19p9j51J41j53K8L41j64K7J59Q8l93K71j07
3726B1j65K19M1l40L21j95K90m39J65J18k66K74l00K84n09L32j26k6K87J66L4
3747A86j44M24m52R3j02l49L20j8k29J82k01M04k44K93k17K69j19N7j99J60Rj89
3769f6J39m23K43n7J85N7j95K16J46k74R0PL3j26k20J53K98m86K74J83q0K11r2
$$ plain form
3792 216 -90 56 390 -39 -126 -386 -11 -220 -22 -95 -35 -68 260 40 219 163 271 -11 -188 -379 13 -42
3814 -42 -168 -25 7 230 -138 72 268 265 133 -133 -40 -72 -130 189 -401 -85 34 231 11 85 304 51 -109
3837 -109 204 -47 -390 -21 259 -50 14 -216 197 228 -48 -233 -22 212 -121 153 -36 64 112 -404 66
3858 66 0 -179 198 4 223 282 334 205 -23 -140 -245 -232 125 -283 171 -245 -53 124 100 341 323 -105
3880 -105 -188 234 -20 -214 -42 -14 -179 66 224 57 149 182 92 -102 -40 155 -15 -139 -186 -76 297 -164
3902 -164 -284 -17 98 -44 163 62 218 58 -98 -121 257 -93 -53 137 96 2 210 30 86 131 -92 -20
3924 -20 -178 -370 -65 -46 -48 -171 -113 75 208 157 241 178 362 -40 -95 -51 -29 16 -1 111 90 118 -198 1 526
3949 526 94 -119 104 95 168 -244 73 36 -48 -74 80 -77 -231 199 249 81 414 52 -304 4 17 -51 -93
$$ packed form
3792B16l06J46L34m29q7k60L75k09J98p3O0l3L28k20J79n6J08k82j77j91L92n5
3814d2j26J43L2K23l68K10J96lj32k66R3l2n8L19n90L16J19J97k20P4K19k53j60
3837a09L13k51l43L69K80l09O4k30M13L1k76j85K11K34l33K74j89J00M8n16M70
3858F6o6j79L77j94K19N9N2j29k28j17j05J3L57m08M54m16J92J77k4K41j8m28
3880a05q3M22k54j94J72K8j65K45J58j67R2L3r0j94O2J95j70j24m7J10L73m61
3902a64j20K67J15j42K07j01J56j60j56k3L78l50M0J90m1r4K08j80N6M5k23P2
3924b0j58j92L05J9kj23N8J88J33n1Q4o3J84m02n5M4K2M5j7J12k1K8l16J99N25
3949E26m32k13K23rP3m12L17l7q4k6J54j57j54M30N0j68L33l62l56L08J3o8m2
$$ plain form
3972 -93 -47 -192 -261 258 -105 434 41 191 -196 44 -139 -68 -191 159 -133 -345 -153 278 113 -71 -129 -114
3994 -114 130 284 273 -302 -205 -59 -12 -154 2 -25 107 -155 82 115 -124 177 -300 -389 66 67 169 -123 -48
4017 -48 32 279 154 100 -109 71 -186 -12 -82 145 -302 -88 6 164 97 370 90 -233 -90 58 20 -76 -125
4040 -125 6 -124 -122 -106 -35 203 142 214 36 -12 -37 65 -269 94 80 -85 -172 291 -101 176 3 277 -181
4063 -181 140 -124 -199 -99 -63 199 90 76 -37 -178 235 -82 -161 -89 240 187 17 191 14 -238 -469 20
4085 20 -375 328 65 -4 159 90 -292 98 142 -209 139 113 7 -157 88 202 -17 125 -76 91 145 78
4107 78 322 178 265 -24 -110 1 243 -253 330 -87 112 -13 226 268 30 216 -48 -46 -190 -14 149 -192
4129 -192 116 4 196 124 321 165 74 -121 19 -103 36 30 12 -214 -99 -226 248 -163 -147 -12 63 34 -231
$$ packed form
3972i3M6j45o9N19l63N39l93J50l87K40j83P1j23L50k92k12J92M31j65j84n8J5
3994a14K44J54j1n75R7J46M7j42J56k7J32k62K37L3k39L01m77q9M55JJ02k92P5
4017d8Q0K47j25n4k09J80k57J74p0K27m47K14R4J58o7K73k80l23J43J48l8r6m9
4040a25J31j30KJ6P1K38o1P2j78m8k5J02l34L63j4j65q7M63l92K77j73K74m58
4063a81L21k64p5J00L6K62j09j4j13j41M13l17p9P2L29n3j70J74j77k52k31M89
4085B0l95P03k63o9J63o9l82L90M4l51L48k6j06j64K45J14k19J42k01J67N4o7
4107G8K44j44Q7k89q6J11K42m96N83m17J99j25K39M2k38J86k64Kj44J76J63l41
4129a92L08j12J92p2J97j56r1j95J40j22J39oj8k26J15j27M74m11J6J35P5k9k65
$$ plain form
4152 -231 166 -191 33 175 50 174 27 -150 19 32 233 153 175 0 -128 -108 24 -147 -248 -16 107
4173 107 178 299 193 -72 138 258 252 -105 -137 -126 -32 -140 -205 -293 51 225 79 59 -21 63 -147 -111 83 94
4197 94 -145 -71 -31 134 -91 -106 -231 215 150 38 -54 24 122 -105 131 -12 -19 159 196 61 18 509 -67 128
4221 128 165 97 -177 5 -64 -75 412 -111 -56 165 -49 460 -32 -130 38 -26 -161 78 1 24 -121 140 -394
4244 -394 -71 21 141 60 29 88 -43 -152 -247 -242 48 133 -102 51 -97 -53 -18 -22 -36 -63 30 176 -154 -103 -165 83
4270 83 386 50 185 -61 42 11 -37 58 -5 -66 -124 311 -26 -4 -188 -289 214 -28 60 93 160 -16 244 -25
4294 -25 19 121 -260 -235 -65 114 -50 10 22 -25 132 72 120 -25 72 167 -111 -204 -104 -158 -161 -114 -361 -129 -52
4319 -52 95 207 20 38 100 -397 -534 -79 -136 13 42 255 54 166 27 111 9 67 -246 -83 -59 -121 267
$$ packed form
4152b31L97l57K24J42j25J24j47j77J69J3K01q0K2j75j28K0J32j71j01K32J23
4173A07P1J21j06k65K10J20ol57l2J1R4j08o5q8L44J74j46k0q0Q4k10L6J94J1
4197I4k39P4M0J65k25j5j25M46o5j12r2P8R8k27K36j43pJ78L7j35m3M91n76J95
4221A28L7o8k74J82o9j1M87n23N5K21k14N09m92r8J68o4j35K39p7K3j45K61n34
4244c94L23R2J20q1l1N9j31j09r5NK90Q5k35J53j48M4L5mj4k7R3J46l30N1o2K48
4270H3L03l36J35k46J03l1m8R5o3o1n8M35l37K2j84j01N03k42Q8L3O7j76K60k69
4294b5M4J02l81K5J70J79j64O0J2m7J57o0M8j45R7R5k78r3J00n4lM7k47K32P7
4319e2J47J12j87J8O2m97j37M55n7J49K9K13k01J12j39Q4j02N8l13J63K4o2L88
$$ plain form
4342 267 11 -22 206 -129 -16 107 127 47 -100 45 -384 -172 -271 -24 -313 -104 -284 169 -177 79 -177
4363 -177 -60 -112 -155 -231 -2 -119 -254 256 1 -93 90 475 219 -24 281 268 243 201 -146 -211 -2 -100 133
4386 133 343 -265 287 323 311 138 -84 -7 -184 -268 -159 -167 123 90 -10 214 -63 -34 -138 107 412 -103 -217
4409 -217 13 -170 -136 65 104 -117 43 -142 178 77 -61 168 -6 95 286 -249 -137 -109 5 -46 57
4430 57 366 139 -46 127 88 -160 42 -147 117 -326 -202 -224 89 -50 122 351 256 14 -87 30 -81
4451 -81 -1 -158 27 -4 -358 -58 -162 270 170 330 6 111 44 124 -231 24 95 -143 224 -231 147 38
4473 38 183 53 248 78 4 217 203 -207 -224 47 147 -204 -85 -60 325 -99 107 -54 58 89 161 60
4495 60 72 -210 -127 -40 -60 150 -173 148 40 -1 -5 -118 -125 14 122 -84 178 -73 73 -86 43 -11 323 395
$$ packed form
4342B67k56l3K28l35J13J23K0q0j47J45m29K12r9K47k89K09j80M53l46K56k56
4363a77J17n2m3p6K29j17j35N10k55r4J83L85k56k43L05j3k5m2l47o5K09r8K33
4386A33K10o08N52L6j2j73k22P7j77q4J09qK90l3j00K24k77K9j04K45L05n15j14
4409b17K30j83L4K01L9k21J60j85L20j01j38K29j74J01J91n35J12K8J14n1J03
4430E7L09k27j85J73l9k48K02j89K64m43J24k2L13j39J72K29r5k42j01J17j11
4451h1Q0j57J85l1l54L00j04M32j00J60l24J05o7Q0l55K55P1k38L67m55L78j09
4473C8J45j30J95j70p4K13j4m10j7K71J00l51J19K5L85m24K06j61J12L1P2j01
4495F0J2k82Q3Q7k0K10l23L21j08m1mj13pJ39J08k06K62k51J46j59J29n4L34P2
$$ plain form
4519 395 236 16 166 -192 -126 -386 -299 36 100 39 57 -287 38 -89 208 -139 99 358 -59 47 -247 -19
4541 -19 -53 -25 205 60 245 351 -39 47 -291 -252 -87 -190 -66 -46 -23 115 45 -296 19 -31 -126 -37 -385 -114
4565 -114 54 66 149 -122 -41 -56 -20 209 -11 18 -33 36 -154 -32 122 -247 145 48 -83 -180 -216 81 52 -4
4589 -4 77 288 154 157 -136 250 16 -20 162 -40 -119 -14 -132 -28 -102 57 -40 111 -28 -251 77 -153 -82
4612 -82 -241 -26 -86 -99 22 51 -60 229 36 167 38 286 -239 -14 -132 -134 -254 184 158 242 418 -23 154
4635 154 127 -34 367 -122 108 -161 118 66 -290 260 150 -6 -52 -98 -41 86 3 82 -196 -95 -337 397
4657 397 328 248 -279 28 -7 32 -15 233 -214 -194 283 -54 173 -78 -3 -86 5 276 25 -62 9 -193 -129 -150
4681 -150 -216 -155 259 -105 -212 109 153 -294 363 81 28 -198 -165 -364 89 16 -171 62 -36 36 154 -137 130
$$ packed form
4519C95j59k20J50l58O6k60Q7L35O4o1J8l44L25j27K97l47K38K59m17J06k94K28
4541a9l4K8K30j45J85J06l90Q6l38L9J65j03J24K0K3J38p0l41L15n0r5Q9l48K71
4565a14J68J2Q3k71Q1j5L6K29k20K9n1O9j90J22J54l69L92r7j31r7l6K97k9n6
4589dQ1K11j34Lk93L86k34l6J82k02p9J05j18J04p4J59r7J51j39k23L28k30P1
4612h2j59K15o0j3J21K9j11K89j93J31j29K48n25K25j18kj20M38k6Q4J76m41J77
4635A54k7j61M01m89K30k69K79n2l56N50j10j56m6m6N7J27q3P9k78J01k42P34
4657C97o9q0n27L07l5L9m7K48m47K0M77l37K27k51P5q3R1K71k51q7P1k02O4k1
4681a50o6O1M14l64j07L21M4m47O57k82n3k26L3j99M53p3j87K33r8P2J18k91K67
$$ plain form
4704 130 187 -72 -43 -63 106 -338 -207 195 -7 4 133 79 392 283 -114 368 340 -99 -132 -196 -373 52 185
4727 185 -96 60 -24 -21 -48 82 -12 53 43 -179 73 -26 -206 207 -12 232 54 93 210 245 -43 -193 -172 -133
4751 -133 -125 -172 71 -3 -72 134 -113 226 -351 171 -67 -176 44 183 133 227 -205 -31 -236 43 58 -304 81
4774 81 129 -21 -152 -423 -60 -9 125 213 -54 23 -361 -179 63 -75 -204 510 -15 -224 28 -105 -176 -25
4796 -25 -21 -89 -223 -12 71 226 89 -1 84 61 24 266 -93 -193 38 -97 312 -56 -197 -208 53 -52 -2 -54
4820 -54 297 -101 18 -204 66 -210 -381 -23 7 -164 -29 228 52 186 -99 -101 -178 40 -206 -51 -432 45
4842 45 254 54 22 151 -237 209 -46 -30 165 -84 14 -51 24 -190 15 17 -306 518 54 -68 -113 291 48
4865 48 308 -248 -175 -10 6 114 136 125 -303 110 76 44 169 128 245 70 -193 44 -240 183 281 -155 77
$$ packed form
4704A30N7k59K9k0J69m44J31M02k02J1J29n4L13j09l97M82k8m39l3o4j77M25J33
4727A85k81J56q4Lk7J30r4O5j0k22K52r9j80M13k19K44j78L9J17L5k88j50K1L9
4751a33Qm7K43p4o9K06k47L39n77N22k38j09K20J39n0R4m32J74k05K79J5l62L85
4774H1M8j50j31k71L63N1J34Q8k67P7l84J82K42j38j29P14n25k09K52j33p1J51
4796b5Mo8j34K11Q3J55j37r0Q5k3l7K42l59j00K31j35M09l68j41j1K61j05N0n2
4820e4L51l98J19k22K70k76j71L58L0j71J35K57j76J34k85kp7K18k46J55l81M77
4842D5K09k00l2J29l88M46k55J6J95k49R8o5P5k14K05Kl23Q24m64j22m5M04k43
4865D8K60n56P3J65J6J08K2j1m28M13l4l2J25m1J17j75k63K37k84M23R8m36K32
$$ plain form
4888 77 4 -105 115 -334 -253 -156 -7 100 49 12 46 162 -63 5 -142 117 149 253 -77 -45 -167 -41 58 33
4912 33 -251 -117 -238 103 268 -155 3 -269 -325 -374 -3 175 -43 -170 -101 6 95 -141 -134 206 -98 -20 -274
4935 -274 90 -86 140 -315 -166 257 -205 -198 246 183 120 -167 79 69 103 -165 120 -114 47 25 -139 -253
4957 -253 -3 130 200 157 99 11 85 28 -38 14 -350 49 -195 -46 26 -142 300 63 64 -59 15 -174 -24 98
4981 98 269 431 -27 50 -285 60 118 -127 31 105 19 -47 -120 92 51 -161 63 -88 75 -48 -136 -159 -234 -77
5005 -77 103 123 136 -102 -212 -45 -229 105 -9 239 -100 236 117 149 30 -249 188 -135 -158 -139 313 310 -43
5028 -43 258 127 -181 60 -125 -1 130 -253 157 117 260 -80 227 35 117 -208 -131 232 -53 -26 -174 66
5050 66 377 -224 -164 -122 -83 162 93 573 126 -46 -124 -56 165 -124 -170 48 -228 -222 88 77 -38 295 -111 270
$$ packed form
4888G7p3j09K20m49Q1R7J49J07n1l7L4J16k25O8j47K59L2J04l30L2j22J26R9k5
4912C3k84J34j21L41J65m23J58k72n6m9L71J78k18j27O9J07Q9k36PL40l04P8k54
4935b74L64j76K26m55J49M23m62PM44o3o3k87K46j0L4k68K85k34J61k2j64j14
4957b53K50J33P0m3n8q8P4n7o6N2l64L99k44J49P2j68M42k37Jj23P4j89J50J22
4981I8J71J62m58P7l35L45N8k45J58P4q6o6p3K12m1k12K24j51J63j23q8k3p5J57
5005g7J80K0J3k38j10J67j84L34j14K48l39L36j19L2j19k79M37l23k3J9M52ll53
5028d3L01j31l08K41j85J24J31l83M10m0J43l40L07j92Q2l25P7L63k85K7j48K40
5050F6L11o01O0M2L9K45o9M80m47j72p8O8K21k89m6K18k76OL10j1j15L33m06L81
$$ plain form
5074 270 181 81 -147 -112 -42 -137 -49 -12 -117 149 4 78 -93 209 83 -244 53 121 -260 24 -215 -156 103
5097 103 -87 280 -349 -79 -144 35 102 208 34 -37 125 126 194 66 10 31 -227 243 -53 -40 -94 50 120 78
5121 78 55 -422 19 -316 -283 -130 -108 -391 -202 230 112 136 -233 -140 215 -7 -101 -51 -11 123 221 250 29 110
5145 110 -82 191 -43 -358 -38 -196 -318 265 6 332 -271 -35 34 28 -230 -119 -59 -116 -131 52 -195 -157
5167 -157 42 -228 -75 -94 329 -139 252 -61 160 -7 -118 20 275 -116 -293 35 -115 253 -72 363
5187 363 47 172 -232 59 -17 -114 -30 -294 258 383 81 -21 -199 125 2 96 -178 -93 240 111 -282 -246
5209 -246 365 -37 236 166 50 279 -221 220 -8 22 -130 110 75 -45 -300 24 -380 -58 -78 91 164 -86
5231 -86 232 -196 165 -17 -173 73 -169 33 265 -162 37 12 -43 50 -157 2 68 -194 -108 -147 -288 -157
$$ packed form
5074B70q9j00k28L5P0r5Q8L7j05K66j45P4j71L02j26l27K97O8l81K84k39N9K59
5097A03j90L67o29K70o5J79O7J06j74p1J62JO8j28n6K1k58M70k96J3n4J44P0m2
5121G8k3m77M41l35L3J53K2k83J89M32j18K4l69R3L55k22r4N0M0J34R8K9k21Q1
5145A10j92K73k34l15L20j58j22N83k59L26o03K36O9ok58J11O0n7j5J83k47L8
5167a57J99k70J53j9M23m68L91l13K21j67j11J38K55l91j77L28j50L68l25M35
5187C63l16J25m04K91p6r7Q4k64N52J25l02j02j78L24j23R4k74Q5L33j29l93L6
5209b46O11m02K73p0j16K29n00M41k28L0j52K40l5j20k55L24m04L22k0J69P3k50
5231h6L18m28L61j82j56K46k42K02K32m27J99k5n5R3k07J59O6k62Q6l9j41J31
$$ plain form
5253 -157 -236 277 -242 15 -28 213 54 186 105 -157 -393 -340 -230 -88 30 -157 285 -59 -146 95 87 303
5275 303 -13 8 -422 282 474 202 -35 207 88 59 212 -47 -20 167 -49 81 95 -97 43 -193 -62
5296 -62 15 224 225 -110 109 -108 30 19 139 26 -35 23 -53 147 -26 219 -24 312 -50 26 -120 39 -60
5319 -60 195 -138 -204 -69 -298 -123 8 288 -24 232 -44 163 100 212 -222 20 -169 -74 -133 -263 -24 -59
5341 -59 -55 -118 -159 100 13 -207 408 -90 -266 -49 -165 -84 224 -567 -210 133 -59 184 166 -73 -84 -19 -52 -95
5365 -95 -195 -73 43 4 253 -28 -19 -271 -12 72 -59 182 133 -47 -156 54 214 176 -154 211 -65 159
5387 159 97 8 62 13 122 71 -77 -141 -116 363 71 -11 384 233 -125 -89 269 106 -219 -158 -108 73 33 -4
5411 -4 -83 50 -8 6 117 223 333 -98 -156 249 60 223 -182 -55 169 -77 -119 69 177 282 347 -139 48
$$ packed form
5253a57p9N13n19K57m3K41j59J32q1k62k36N3J10J42J18j87M42l44q7K41qK16
5275C03l16K1m30P04J92k72k37K42j19k9J53k59K7J87k16J30J4j92J40k36J31
5296f2P7K09Jl35K19k17J38j1J20j13o1N8p6K00j73K45k43L36l62P6j46J59r9
5319f0K55l33o6J35k29J75J31K80l12K56k76K07o3J12m34K42j89R5n9j30K39l5
5341e9Mo3m1K59q7k20O15m98j76K17j16Q1L08p91L57L43j92K43j8k39j1O5l3m3
5365i5j00J22J16l9K49k81Rk52K59Q4j31K41m9j80j09K10J60l8l30L65k76K24
5387A59o2q9N4m9J09n1j48o4K5M79k92q2L95j51l58L6L58j63l25O1N0J81m0l7
5411dp9J33n8J4J11J06J10m31n8M05j89J63m05J27K24k46m2J88J08J05O5m86J87
$$ plain form
5434 48 -47 -182 -25 34 5 150 -32 193 -34 225 -86 124 -73 185 -184 98 -5 34 11 -146 57 110
5456 110 37 23 405 94 69 59 17 -179 29 219 -92 52 -104 -76 -243 -53 57 -24 38 16 9 35 -82 115
5480 115 172 -310 -53 -221 160 49 31 98 187 -131 107 -26 6 146 72 17 -232 -15 233 111 -94 75
5502 75 200 13 -194 -59 -247 135 85 302 -51 40 -108 47 -15 -326 224 358 60 13 -36 49 -167 53
5524 53 -102 203 -47 246 -204 72 323 57 53 -41 93 -195 -178 -15 73 -327 178 21 28 110 -57 77 -132
5547 -132 81 -293 0 -34 -1 -38 -128 99 119 47 -242 109 241 177 291 24 63 52 -85 -74 109 -51 -288
5570 -288 156 51 -196 63 12 -234 118 85 79 -205 -2 -92 -127 39 -82 138 59 -40 99 9 -225 290 -166
5593 -166 -228 -2 112 238 -273 -7 37 83 -392 -56 -51 -89 161 -148 30 -50 145 20 -112 80 245 -88
$$ packed form
5434D8r5j35J57N9k9J45j82K25k27K59l11K10j97K58l69K82j03L9k3j57K03N3
5456A10p3j4L82l11k5j0m2j96K08J90l11J44j56K8j67J90J10q1O2k2pK6j17J97
5480A15N7m82K57j68L81j11j8O7Q9l18K38j33L2J40p4n5k49K17K48j22k05J69
5502G5J25j87k07J35j88L82n0K17l53R1j48J55o2l11N50J34k98m7m9Q5k16K20
5524E3j55L05k50K93m50K76K51k66mr4J34k88J7J63Q8m00N05j57PQ2j67J34k09
5547a32K13l74K93l4L3l7r0K27K0p2k89L51J32o4J14k67L9j1j37J1J83j60k37
5570b88M44j05k47K59n1k46L52l3ok84K03r0l5J66j21K20p9r9J39r0k34N15m56
5593a66o2K26J14J26n11K66M4M6m75L36Nl8K50l09J78q0J95j25j32J92J65l33
$$ plain form
5615 -88 -188 134 127 134 133 -288 -45 -23 -130 -35 26 5 -43 117 -44 -46 -9 -9 -223 51 67 62 -226 134 -70 -254 -160
5642 -160 -187 -70 122 267 230 -40 -2 -120 -247 -217 -283 4 265 39 -96 38 41 -20 20 -53 -65 232 10 -161
5666 -161 139 -60 375 399 -87 38 -286 48 4 72 -96 63 -9 443 -159 -152 -209 231 309 338 13 -91 225
5689 225 278 -138 97 103 0 143 -326 13 109 -213 100 -93 118 273 -69 25 12 -203 -94 -192 63 -432
5711 -432 86 78 -31 -70 4 -54 -120 21 83 41 -224 28 -117 -3 26 190 109 335 47 -183 -171 -356 103 46
5735 46 67 35 308 -2 -132 71 137 85 259 -64 103 -182 211 44 175 270 -227 200 131 -241 57 41 -55
5758 -55 -64 108 54 -205 -107 -149 168 148 101 73 144 -201 81 21 34 -121 -89 -187 203 -179 274 27 96 -291 80
5783 80 147 -27 -330 -333 -122 -130 123 -201 0 4 59 -168 207 592 -384 191 -243 184 -3 114 86 -194 -149 115
$$ packed form
5615h8j00L22pPjm21K43K2j07R5O1k1m8J60j61kL7%k14K74J6nk88L60k04j84R4
5642a60k7J17J92J45l7k70L8j18j27L0o6K87K61k26j35J34Lo1M0p3j2K97k22j71
5666a61L00j99M35K4m86J25l24L34m4O8j68J59p2M52o02Pn7M40P8K9l25j04L16
5689B25N3m16K35Oj03J43m69L39R6l22L13j93K11J55l42R4j3k15J09r8K55m95
5711d32N18qj09l9P4n8o6J41O2m2k65K52j45J14K9J64q1K26k88k30J2j85M59n7
5735D6K1l2K73l10j30K03O6n2J74l23J67k85L93j67J31R5m97M27o9l72K98j6r6
5758e5rJ72n4k59R8m2L17k0m7k8P1l45K82o0J3j55L2r8L90l82M53k47O9l87L71
5783H0O7j74l03lK11qK53l24K01MN5k27L75L85r76N75m34M27j87J17k8k80M5K64
$$ plain form
5807 115 253 49 189 82 115 205 109 20 -55 -104 46 22 -321 -171 71 155 -90 -179 -37 -81 224 74 -289
5830 -289 74 27 -108 117 -131 -362 -195 46 -167 172 79 199 -31 348 -167 20 164 -182 -66 -4 -145
5851 -145 -174 280 34 8 51 206 -82 -29 238 -203 30 -283 -95 -313 129 435 -180 -72 -20 155 -320 60
5873 60 377 -203 -37 -98 7 217 -123 -113 571 -14 106 -50 -104 -125 -160 165 515 -127 149 -281 -48 -7
5895 -7 -202 22 -320 105 95 -110 -69 205 55 -88 -140 -118 53 -41 19 -70 -63 -27 44 -151 -245 -200 356 -49 -230
5920 -230 -332 -76 -312 -15 -115 140 -376 -139 9 148 206 -39 346 -89 -31 91 -248 -14 131 -279 -173
5941 -173 38 -51 -35 -140 160 -33 -269 -243 229 -91 -159 -56 -111 192 110 -46 168 155 -23 -151 93 -66
5963 -66 -102 86 182 -81 -13 16 -171 82 201 -202 192 -25 -463 -105 -75 84 -76 354 95 -234 -99 15
$$ packed form
5807A15J38k04J40j07L3R0r6q9p5m9J50k4l43J50K42Q4k45q9J42m4L05j50l63
5830b89L63m7j35K25k48k31J67K41k13L39r3J20k30L79n15J87J44l46J16O2j41
5851a45k9M54k46k6M3J55k88N3K67m41K33l13J88k18M42L06o15J08N2J75m75L80
5873F0L17n80J66o1J05K10l40J0O84n85J20j56n4k1l5L25L50o42K76m30K33M1
5895gj95K24l42M25j0k05M1K74j50j43n2K2J71r4O0q9PL6P1j95r4M5N56m05j81
5920b30j02K56k36K97j00K55n16K37J48J39N8k45L85m35N8J22l39K34J45m10J06
5941a73K11q9J6j05L00j93k36K6M72l20o8J03n5L03q2j56K14j3j78j28K44j59
5963f6l6J88R6k63O8K9j87K53J19m03L94k17m38L58L0J59j60M30k59l29J35J14
$$ plain form
5985 15 -102 190 344 174 -94 -60 -63 90 -157 -326 -125 -174 83 9 -36 10 69 68 204 -131 52 -19 -16 89 93
6010 93 110 141 -20 135 -110 -74 37 440 -87 24 139 -66 -49 -195 -69 -203 245 175 338 -192 50 177
6032 177 72 139 -161 -156 -6 25 -159 -165 -62 9 -147 -85 -17 80 -363 33 138 15 -111 61 14 -47 -209 120
6056 120 116 -68 60 328 27 189 75 -167 126 -173 -12 -132 270 365 -137 2 -29 -93 68 -73 171 -104
6078 -104 -308 62 -81 175 129 -42 208 22 -1 61 72 77 -394 268 -194 170 324 143 -152 15 -111 96
6100 96 190 -145 -102 85 265 -117 -205 -37 42 330 -109 -28 198 -165 -247 -82 -129 155 -219 110 70 -233 22
6123 22 -90 -97 95 -90 91 114 261 -125 -385 -26 175 -75 -155 222 -59 -174 -92 -322 -195 -55 155 131
6145 131 162 110 -51 -176 -117 -413 -20 294 -235 -39 -140 12 196 40 114 -287 -259 145 -230 154 -197 36
$$ packed form
5985A5j17K92J54j70k68L4lJ53k47j69K01m9K57p4m5M6N9jJ36l35J83p1LJ05M
6010I3J7L1j61J55k45L6J11M03n27J11J15k05J7j46J26j34M48p0J63n30K42J27
6032A77j05O7l00NJ50L1j84oJ03P1j56O2O8R7m43L96J05j23j26J72m7o1j62L29
6056A20mj84J28K68l01J62j14k42K93k99J61j20M02R5n02J39l1o4J61j41K44k75
6078a04k04L70j43K56m6j71K50j86k3O2J1Nm71O62m62L64J54j81k95J67j26K07
6100I6R4l35M3J87J80l82q8J68P9K88m39Q1K26l63q2J65m7K84l74L29m0l03K55
6123B2j12pJ92j85J81K3J47l86k60L59K01k50q0L77k81j15Q2k30J27J40K10k4
6145A31L1n2j61j25N9k96L93L14n29J96j01J52J84j56P4m01K8M04l75L84l51K33
$$ plain form
6167 36 65 -16 -208 314 -191 -195 -5 89 29 32 -110 -279 53 62 1 150 236 -120 -210 -269 12 -14 -58 372 175 -42
6193 -42 -273 -79 -125 -31 -128 26 -76 35 276 -159 -38 -75 0 -127 -54 114 151 207 276 -311 0 242 -213
6216 -213 -39 28 -63 119 -116 -110 -106 -333 142 322 33 -91 313 -361 115 -262 -133 -134 -143 -103 21 -202 281 35
6240 35 -65 152 98 239 -155 -77 71 -302 -20 81 -48 9 85 155 -18 28 424 87 -42 -3 223 -117 -89
6263 -89 -469 -126 -189 93 -122 -45 38 -227 94 -180 205 19 -189 -87 103 41 -143 93 -63 -283 -152 117
6285 117 192 -111 -112 367 4 -27 -9 -96 -420 -177 203 -281 130 146 161 49 -224 -86 -115 -343 370 6 101
6308 101 202 100 -55 206 92 -33 -420 -192 -207 -11 79 -258 70 -213 275 21 322 110 -46 -34 -182
6329 -182 -119 208 218 -18 -215 -15 59 94 -139 348 -16 -399 8 -156 -130 -265 59 -272 5 -227 -442 126
$$ packed form
6167C6K9q1j92N22n05mJ90R4o0Lj42j69L32Ro1J49Q6l56r0n9K81k6m4M30j97k17
6193d2k31J94m6R4r7J54j02J11K41m35J21l7P5j27P3J68L7N6O9n87L11K42m55
6216b13J74O7r1J82k35OMk27M75J80k89j24M04o74M76l77J29jrM0J24k23M83k46
6240C5j00K17n4J41l94P8J48l73K82J01j29N7P6P0j73M6L96l37j29L9K26l40K8
6263h9l80L43o3K82k15P7Q3k65L21k74L85j86k08J02J90o2j84K36j56k20J31K69
6285A17P5l03jM79l63l1J8q7l24K43L80m84M11J6J5j12k73J38k9k28P13l64R5
6308A01J01j02j55K61j14j25l87K28j5J96R0l37L28k83M88k54L01k12j56J2j48
6329a82O3L27J0k36j97K00P4L5k33M87l64l83M07j64K6j35L24l31K77k32k15N68
$$ plain form
6351 126 220 99 -7 333 24 236 239 -8 31 51 -41 -224 -265 87 -142 -1 243 324 -166 83 110 220 -148
6374 -148 -38 83 -197 -203 91 296 -97 174 -170 27 226 309 16 -135 -57 -57 -116 -236 207 266 21 -25 210
6397 210 -29 -155 56 267 53 19 -105 91 1 -106 113 260 42 255 5 262 -151 -3 188 74 12
6418 12 300 -198 167 -178 6 -66 -14 210 -113 367 174 -146 51 168 -17 -52 19 39 100 -195 103 81 -149
6441 -149 159 68 94 -274 -157 -213 -44 -347 12 449 -104 173 -121 74 160 -36 -151 339 136 -93 195
6462 195 -128 131 474 149 -117 -82 -13 140 -82 48 55 -162 111 -253 -245 -4 149 43 296 -164 -104 -175 88
6485 88 190 124 90 -7 -72 -184 -174 -138 5 42 185 -88 -175 -13 25 210 18 -5 224 -203 -13 236 -51 -102
6509 -102 39 227 -7 -84 32 234 -20 12 -81 208 -232 167 193 75 84 -7 -348 198 107 12 -37 -96 53 -180
$$ packed form
6351A26R4j21j06L40l09K12Lk47L9K0r2j83m1L52k29J41K44Q1m90K49K7J10l68
6374a48J10J21k80oK94K05l93K71l44J97J99Q3k93j51P8%n9j20M43N9k45m6K35
6397B10k39j26K11K11k14l4j24J96r0j07K19J47k18K13k50K57m13J48J91j14o2
6418A2K88m98L65l45J84p2N2K24l23M80j93l20J97J17j85l5P1K0O1k95K98k2k30
6441a49L08r1K6l68J17n6J69l03L59M37n53K77k94J95Q6j96j15M90k03k29K88
6462A95l23K59L43l25k66L5O9J53k22J30Pk17K73l64QK41J53j06K53m60O0p1K63
6485H8J02o6l4r7o5j12J0L6J43L7J43k73q7J62L8J85j92k3K29m27J90K49k87n1
6509a02J41J88k34p7J16K02k54L2r3K89m40L99K6j18Rr1l41N46r1r5m9n9J49k33
$$ plain form
6533 -180 -121 -88 46 -186 241 -94 -116 -168 34 -147 -100 82 -123 152 -41 74 84 29 261 38 127 -168 89
6556 89 70 233 -116 170 -22 -41 -103 -89 161 -158 -136 133 -46 177 55 325 -4 102 -278 104 38 -93
6578 -93 -63 4 -251 34 196 -492 -6 -148 -34 -56 -314 43 8 -262 -113 -133 -194 148 49 124 -13 153 -367
6601 -367 86 -161 47 413 -64 -169 -227 -33 -1 212 2 276 157 225 -149 -33 -306 11 26 -221 144
6622 144 -4 96 254 -30 -64 40 -124 -257 191 -80 57 -55 200 -166 106 -35 261 -54 95 9 -78
6643 -78 247 -216 213 -18 295 306 42 219 -169 51 192 81 -35 -219 24 50 -123 -218 113 332 -241
6664 -241 -147 -98 289 181 65 -185 0 224 -134 -101 191 -299 -52 -290 59 -99 -118 42 115 92 321 227
6686 227 263 87 -195 -212 -25 -88 217 286 85 26 17 -164 -273 95 192 -66 -8 3 -233 -69 -165 322 -49 77
$$ packed form
6533a80N9L3J34k32M27l35k2n2K02j81M7J82k05K75j93J15J0n5K32k23Q9k95K57
6556H9j9J63l49K86j92j9o2J4K50l19K2K69j79K23j22K70l29J06l80L82o6j31
6578i3L0O7k55K85J62o88M86j42J14k2k58L57l5k70J49k0o1L42r9P5j37J66n20
6601c67M53k47K08L66m77j05n8J94L2K13k10K74j19O8l74J16k73L17J5k47L65
6622A44j48J00J58k84l4J04j64j33M48k71J37j12K55l66K72j41K96l15J49q6q7
6643g8L25m63M29k31L13J1k64J77l88K20J41j11j16j84K43K6j73r5L31K19n73
6664b41R4M9L87j08j16k50J85K24l58L3K92m90K47k38L49j58j9J60P3k3K29r4
6686B27L6j76k82j7J87o3L05O9k01n9rj81j09L68R7k58N8J1k36J64r6M87l71J26
$$ plain form
6710 77 207 -269 -37 105 -149 -96 119 -51 -34 -63 -186 120 17 -165 -72 180 -101 -34 28 56 118 154 -39
6733 -39 -171 132 26 41 -301 -212 322 102 33 -104 -103 54 -85 30 -128 -283 -292 -212 223 270 131 -26 -65 -283
6757 -283 83 79 295 143 -94 234 -61 -173 159 -20 121 -134 -16 -216 -14 238 -129 104 158 -40 138
6778 138 -230 301 -116 0 8 -242 -52 -113 -360 -134 -108 -140 -120 -177 69 -339 -95 41 194 233 31 -99 -126
6801 -126 -19 -183 29 -375 101 179 -68 305 319 -229 -166 10 -307 -74 -249 67 -268 -65 58 -129 72
6822 72 -134 -110 219 -84 105 -183 248 83 -23 197 -10 -450 -300 -70 -150 107 -11 -59 -17 1 -74 -114 -347
6845 -347 -74 40 -38 242 237 181 -126 225 120 192 -74 -141 10 -60 202 -7 -155 24 76 106 -87 -24 -61 -100
6869 -100 180 74 251 -41 27 -222 147 180 -541 -318 -13 -55 -43 57 375 -32 136 -139 -203 -102 96 212
$$ packed form
6710G7J30m76K32J42k54N3K15j70J7k9j23L06j03j82R3K52k81O7O2K8O2L6j93
6733c9j32L03j06J5l42Q9N34k20o9j37JJ57j39J15j58j55rQ0M35M7j39j57l9k18
6757b83L66mK16j52k37L28k95j12L32j79J41k55J18k00K02K52l67K33N4j98J78
6778A38l68N31m17J16Qk50J90o1k47K26K6l2K0n7K46m08K44J36J53L9k02j30k7
6801a26J07j64K12m04M76P8k47L73J4n48O3J76l17K33j75L16l35K03J23j87K01
6822G2k06K4L29l03J89k88M31j65j06K20k07m40J50K30q0K57j18m8M2J8p5m0k33
6845c47K73J14p8K80nn6l07L51j05P2k66o7J51p0K62k09j48J79N2L0j93O3l7l9
6869a00K80j06J77k92O8k49L69L3p21K23L05m2J2J00L18m07J68k75o4J01J98J16
$$ plain form
6891 212 -13 18 3 203 112 -141 118 164 39 -98 -368 -188 74 -357 27 -163 -261 -112 58 -120 276 66
6913 66 -176 17 -64 -28 -46 -20 -302 48 -153 -83 -95 -336 -56 -55 -13 59 45 -113 -220 -26 -95 -132 27 10 340
6938 340 189 234 22 7 -95 -201 -71 -76 3 51 9 109 -5 -45 17 -108 109 -84 296 -382 -349 65 -211
6961 -211 -18 -207 -43 377 72 -53 85 -230 226 -235 -117 -96 -378 67 -198 -208 -99 -65 -44 -180 -140 244
6983 244 231 114 -118 -194 215 -19 -27 -459 116 177 130 20 -4 -138 15 252 0 -40 -22 82 -11 -160 58
7006 58 109 -101 -42 -336 -129 -94 115 65 -13 -149 -130 5 -103 191 35 -184 -93 -5 162 48 80 -33 97
7029 97 -46 38 -65 0 -202 143 54 -83 182 -208 41 -79 -132 52 -144 77 136 181 58 -113 -30 136 -196
7052 -196 12 53 -144 -23 15 83 59 -3 -445 -76 -46 93 73 245 -85 39 146 -134 71 40 147 -69 -32
$$ packed form
6891B12k25L1j5K00r1k53K59M6j25j37k70J80K62m31L84j90r8J49J70j78L96k10
6913F6k42J93q1L6j8K6k82L50k01P0j2k41K80JM2P2j4j58j07J94o9l7J59j7L30
6938C40j51M5k12j5j02j06J30nP9M8m2J00j14m0O2j25K17j93L80o78L3M14k76
6961b11J93j89J64M20l05j25J38l15M56m61J18K1k82M45k65j0J09L4K1j36M0L84
6983B44j3j17k32p6M09k34qm32N75O1m7j10k4j34J53K37k52m0J8J04r3j49K18
7006E8N1k10N9k94K07L5K09n0p8j36J9J35j08K94j56k19R1Q8J67j14L2j13J30
7029I7j43Q4j03O5k02L45q9j37K65l90K49j20n3J84j96K21N9M5j23j71Q3J66l32
7052a96K08M1j97J21L8O8k4o2m42L69L0J39k0J72l30J24J07k80K05l1J07k16L7
$$ plain form
7075 -32 71 -24 -47 -320 154 122 -13 132 100 -184 92 -229 25 -248 -507 -9 -8 45 252 350 -97 -3 -128
7098 -128 153 -108 -202 -118 -236 -103 67 39 -201 89 205 50 63 190 186 -134 -74 103 -257 -161 -70 419 -256
7121 -256 -149 255 -69 -43 101 -130 -78 -179 145 21 77 17 -88 -125 298 255 216 -5 -66 256 -27 -108 20
7144 20 64 -213 89 38 -22 -231 10 -78 -191 98 -201 99 -271 106 77 39 43 -70 -156 232 -129 37 -9 -263
7168 -263 351 -37 -14 -98 34 -256 112 -375 19 180 -217 -119 117 101 7 -33 22 112 234 -61 204 -180 -6
7191 -6 46 -64 18 -247 -438 104 125 -166 -46 -301 101 -166 -22 14 -159 236 -86 174 65 -110 44 190
7213 190 -136 159 -56 -87 -169 153 -82 99 -114 179 226 144 -57 -18 22 -33 -7 -284 -229 -249 -70 -234 -371
7236 -371 231 211 -102 -114 36 -126 110 -248 138 94 213 286 -217 -202 -289 -66 64 67 28 62 -255 -106 -155 255
$$ packed form
7075c2J03r5k3k73M74l2j35J45l2k84K76l21K54k73k59M98JN3K07R8m47R4j25
7098a28K81k61r4Q4j18J33J70k8k40K90J16j55J3J27ml20O0J77l60R6R1M89o75
7121b56J07M04l24K6J44k31N2j01L24j24N6o0j05l7M23m3l9k21o1L22k83q1J28
7144B0M4k77L02n1o0k09K41q8j13K89k99L00l70L77k9l8Mj13q6L88l61J66m6k54
7168b63O14l88K3q4J32k90L68m87L94J61l97R8K36j6r4m0N5R0J22k95K65l84J74
7191fN2j10Q2k65j91N42K1k91J20k55M02k67J44L6j73L95l22K60j09j75J54J46
7213A90l26K95k15l1q2L22k35J81k13K93M7q2k01L9M0n5K6k77N5k0J79j64j37
7236c71O02k0l13j2J50j62K36l58L86m4J19P3n03J5q7K23J30Ll9L4l17J49m9M10
$$ plain form
7260 255 295 -303 90 -67 -254 85 272 100 65 -285 -80 28 -233 142 -132 34 -117 -245 267 246 -78
7281 -78 314 -115 -16 271 171 -279 9 -100 86 245 -247 -49 -26 -31 -130 141 -16 -238 48 71 281 41
7303 41 196 -73 -330 64 226 -91 -6 -136 -10 260 -72 -125 112 -165 192 -150 -111 25 80 131 29 -177
7325 -177 -116 -218 84 -9 -97 -143 94 -129 93 -55 31 3 383 184 312 20 -237 96 -282 431 44 -37
7347 -37 -206 269 173 55 -126 208 -202 -215 259 -63 -161 -18 127 308 43 -247 217 -16 -28 183 -28 143
7369 143 229 208 -110 -94 -37 170 -358 231 -122 -193 -57 -213 -24 25 -227 14 80 -295 66 350 8 84 468
7392 468 128 -106 17 18 193 113 -58 242 -48 14 -70 -165 263 136 -39 42 232 146 56 149 54 105 -16 -127
7416 -127 -273 47 298 -191 -77 -54 209 212 -202 -113 138 7 87 21 91 -108 81 -174 -64 41 38 135 178 -62
$$ packed form
7260B55M0n98L93j57j87L39J87j72l5l50K05J08k61L75k74J66j51j28N12k1l24
7281g8L92m29R9K87j00m50K88j09J86J59m92J98K3nr9K71j57k22K86K3K10k40
7303D1J55k69k57L94J62l17Q5j30J26K70l32n3K37k77L57l42L9J36N5N1j02k06
7325a77O1j02L02r3q8m6K37k23K22j48Q6k8L80j99J28k92k57L33l78P13l87q1
7347c7j69M75r6j18j81L34m10j3M74l22r8J43J45J81k65k90M64k33j2K11k11J71
7369A43Q6k1l18J6N7K07n28N89l53p1J36j56J89M9k52K41O6l75L61K84l42P6L84
7392D68l40k34J23JJ75q0j71L00k90O2q4r5M28j27j75Q1J90q6r0R3r5N1j21j11
7416a27j46L20K51m89J14K3K63Lm14Q9K51j31Q0o6P0j99J89k55J10J05lR7M3k40
$$ plain form
7440 -62 55 -365 -100 -136 321 -3 -187 210 378 162 -73 -117 202 44 -315 -298 -153 -52 -177 -19 194
7461 194 -310 -14 224 34 221 -119 102 -125 214 -136 6 -21 1 -224 151 -110 255 316 -101 140 -108
7482 -108 -1 -188 47 -43 113 223 69 48 -102 47 165 7 -255 -9 92 -30 132 -75 160 -111 -250
7503 -250 33 233 -29 87 76 -212 63 125 429 -147 111 -229 -96 -166 151 -93 -91 184 77 201 -6 64
7525 64 -214 -45 189 144 -83 -218 1 120 -346 68 -341 147 -168 -37 -207 -246 228 -332 -208 -51 -152
7546 -152 120 -94 -354 -71 192 184 97 -230 95 38 -372 6 -345 -111 128 -119 -42 26 160 305 -123 -147
7568 -147 109 323 -113 -174 195 257 -77 -90 105 25 34 -243 138 328 314 179 73 -227 -115 -32 120 -132 -183
7591 -183 -250 -28 414 150 -118 -59 -171 163 17 -79 -248 -387 195 -134 -79 174 -109 255 4 -140 -132 -392
$$ packed form
7440f2J17m20K65l6M57l24j84L97J68k16k35m4L19j58l59J7J45J01j25J58K13
7461A94n04K96K38j90J87l40K21k27L39l50J42k7K2k25L75k61L65O1m17K41k48
7482a08J07j87K35r0J56J10j54k1j50J49J18j58k62K46J01j22J62k07K35k71j39
7503b50K83K00k62J16j1k88K75O2L04n76K58l40J33p0L17k44KK75j07J24k07P0
7525F4k78J69K34m5k27j35K19J19m66M14m09M88l15J31j70l9M74n60J24J57j01
7546a52K72k14k60K83K63qq7l27L25n7m10L78l51K34K39k47P7O8J34J45m28k4
7568a47K56K14m36o1L69O2l34j3J95q0Rk77L81J90j4j35j06l00J12Q3J52k52n1
7591a83o7K22M42k64k68N9j12L34j46r6j69j39N82l29N5K53k83L64k51j44Qk60
$$ plain form
7613 -392 -257 22 123 -53 83 -36 -178 158 -88 89 -42 212 -84 205 249 55 43 105 30 -50 -18 17
7635 17 49 -216 -207 130 198 33 130 69 6 -74 -222 -50 -23 -18 449 261 77 -33 -180 -40 50 -234 135 4
7659 4 36 29 -4 145 56 19 -37 -36 55 -92 89 -59 142 77 28 79 -231 70 -36 330 130 85 46 -94 -167 -177
7685 -177 -177 -142 39 -46 -25 -93 190 74 129 308 216 4 192 133 -101 135 -27 -97 -22 58 -220 -180 40 -97
7709 -97 -58 78 -176 -80 348 -265 -17 -109 -37 239 93 17 -102 83 38 -229 70 203 -190 63 -222 72
7731 72 40 96 -80 -191 -169 -18 -22 320 -12 -139 -6 -54 -82 -285 -121 101 181 -29 -6 8 21 186 310 -52
7755 -52 -198 -139 278 -50 17 117 39 36 223 145 -54 -79 -53 -127 -222 -220 -7 -118 -12 -86 224 -110 -3 145 109
7780 109 232 235 -93 -315 -33 -30 329 172 167 -110 -105 -229 12 287 347 -96 178 397 248 144 13 -88 152
$$ packed form
7613c92J35K79J01j76J36j19j42L36k46J77j31K54k96K89M4j94j2O2p5q0L2L5
7635A7L2k65RL37O8j65R7o1o3q0j48J72K7NM67j88j84j10j47J40R0k84L69j31
7659DL2pl3J49q9l7n6JR1j47J81j48K01o5m9N1l10L01j06L66k00m5l9j40p3j0
7685a77%L5J81q5K1o8K83j16N5J79r2k12J88n9k34K36j62p0P5Q0k78M0K20j37
7709i7L9J36k54R6M28o13K48r2P2K76j46p6j19J85m5k67K99J33l93K53k85K94
7731G2l2N6j76j11K2J51mL42l32j27J33m8k8k03J64K22Q0k10K3J4J3J65J24l62
7755e2j46N9M17l28O7J00p8lJ87p8j99k5K6p4r5KK13j11J06p4L10l34J07J48l6
7780A09J23Ll28k22K82LL59j57nk77Nj24K41K75O0m43K74K19j49j04j31j01K40
$$ plain form
7803 152 -354 -156 41 -169 -82 217 -61 -322 -152 249 126 294 -42 89 -123 -39 154 161 10 -8 -32 -20
7825 -20 329 103 -203 19 2 -333 87 4 -45 -251 2 -8 4 27 -5 -34 64 102 -250 -72 41 -48 90 71
7849 71 -290 -117 59 -34 263 83 -58 55 92 -152 106 -256 -22 -24 39 167 -133 -170 -68 216 -39 -20 -60
7872 -60 18 -28 -102 462 -115 -76 223 -73 232 32 204 -2 -17 -194 -260 -280 -73 -170 -128 47 51 8 9 98 158 0
7898 0 -107 176 65 105 38 -196 72 -15 -21 88 -11 -176 268 -125 -284 -290 321 166 -238 -68 -250 -3 -296
7921 -296 -25 -562 -325 47 -349 -13 -89 102 138 91 67 -138 174 -38 -373 -128 150 194 39 100 107 -42 -105
7944 -105 -216 -86 0 -188 -1 18 13 224 139 -60 255 -143 41 300 -94 -194 -127 -182 -91 -200 -217 -79 -13
7967 -13 -25 -94 -100 0 -22 38 -72 -62 -236 184 -124 213 175 204 -143 -305 -95 -163 110 358 -162 -98 -52 -16 7
$$ packed form
7803A52n06J98J97k10Q7K99k78k61J70M01j23J68l36J31k12Q4J93Pj51j8k4J2
7825b0L49k26l06K22j7l35M20q3m9k06K53j0J2K3l2k9R8L8l52J78J13q9J38j9
7849G1l61J73J76r3K97j80j41J13L7k44K58l62K34kO3J28l00l7J02K84k55J9m0
7872f0P8m6p4N64n77L9K99k96L05k00J72k06j5j77o6k0K07r7M2J75Mm3JQ9O0j58
7898@j07K83j11M0o7k34K68q7oJ09r9j65M44l93j59oO11j55m04J70j82K47k93
7921b96K71n37K37L72l96L36p6J91L6m7k4k05L12k12l35K45K78M4j55O1Pj49o3
7944a05j11J30Q6j88J87J9nK11q5j99L15l98J84K59l94j00O7n5R1j09j7J38O6
7967a3j2o9oJ00k2O0j10J0j74M20l08L37l8K9l47j62K10o8K73K48n20O4M6L6K3
$$ plain form
7992 7 28 -100 90 83 247 -170 59 64 66 13 78 -101 65 -217 175 31 -70 224 52 -2 22 3 -96 110 55
8017 55 -55 -48 86 61 172 -256 20 362 -180 -221 187 -348 189 59 -34 230 81 366 -297 -282 185 125 -9
8040 -9 -29 130 185 98 -63 -50 -18 101 -1 311 -145 141 190 168 -279 -128 -258 -301 -107 -391 175 7 218
8063 218 324 216 78 29 -46 10 -351 63 -24 111 4 -99 -208 156 158 119 202 307 42 -127 -182 8 -28
8086 -28 -18 80 -20 47 171 387 -106 56 241 84 19 -133 -148 38 76 197 -111 155 64 95 117 9 116
8109 116 183 -143 140 -230 -255 95 205 29 44 -43 266 352 -8 14 2 -247 -363 95 -222 -180 -219 182 380
8132 380 -76 288 68 -148 215 -196 35 37 -23 -67 15 -99 99 -115 163 66 267 -70 7 -259 -56 184
8154 184 -158 -37 -113 -215 107 34 37 169 17 193 -163 66 163 -18 73 42 28 -297 -326 181 -17 282 190
$$ packed form
7992GK1j28J90pJ64m17K29NKn3O5j79J66k82L92j44j01K94j72n4K4j9r9K06n5
8017E5j10PJ34k5J11m28K76L42n42m1M08n35N37j30r3K64j49K85o63J5M67o0j34
8040ik0J59N5q7j61J3L2J19j02L12m56K86M9k2m47J51j30m3J94k84N66j68K11
8063B18J06j08j38m9p5N6l61M14q7J35j07j03j09L64Kl9Q3J05k65j69n5J90l6
8086b8J0R8j00O7J24K16m93J62J85j57o5j52j5J86L8J21l08K66r1L1K2j08J07
8109A16O7l26K83l70k5L50J10j76J5q7L09Q6l60K2j2k49j16M58l17M2l9M01J98
8132C80m56L64k20k16L63m11K31Ko0m4Q2j14J98k14K78r7K01l37P7k66K03K40
8154A84l42J21p6j02L22p3LJ32j52J76l56K29R7j81R1l1j4l25k9N07j98K99r2
$$ plain form
8177 190 386 -162 -256 48 16 95 -167 -124 35 146 -261 -187 -287 13
$$ packed form
8177A90J96n48r4L04l2P9k62M3J59J11m07P4j00L00
8191A3
$$ Imaginary data points
##PAGE= N=2
##DATA TABLE= (X++(I..I)), XYDATA
$$ plain form
0 0 0 0 0 0 0 0 0 0 0 0 8 -8 8 -8 8 -13 16 -16 21 -24 27 -32 39 -43 49 -57 65 -74 83 -95 106 -120 134 -150
34 -150 167 -186 207 -230 254 -283 312 -345 385 -424 471 -521 581 -645 722 -809 914 -1040 1194
53 1194 -1390 1645 -1995 2505 -3325 4854 -8674 39614 39005 -29599 21757 19860 -17439 -167
67 -167 182 -39212 -6390 13823 -20667 -15666 17288 6915 3753 12976 9111 6430 11383 874
81 874 -9472 -6339 111 -12209 -21742 326 12090 -9167 -289 19218 2253 3702 17838 -11557
95 -11557 -15550 18801 -1186 -26964 1774 8269 -9077 4474 5049 -8136 8350 14061 -5090
108 -5090 -2196 4027 -3105 -2774 -4311 -7651 -2205 -668 1835 6095 1512 4357 8636 -3260 -644
123 -644 7042 -12182 -10358 10703 -4411 -13063 10641 3649 -9644 12289 9001 -11646 5151
$$ packed form
0@%%%%%%%%%%Qj6J6j6J6k1K9l2L7m5N1n9P1q2R2j06J22j39J57j78K01k26K54k84
34a50L17l53L93m37M84n37N95o57P30q09Q95r92J102j226J367j531J723j954K234
53A194k584L035l640M500n830Q179j3528M8288o09o8604N1356j897l7299J7272
67a67L49l9394L2822K0213l4490N001L2954j0373l162R223l865k681M953j0509
81H74j0346L133O450j2320r533K2068J1764k1257Q878J9507j6965J449J4136k9395
95a1557l993L4351j9987k5778K8738O495j7346J3551N75j3185J6486N711j9151
108e090K894O223p132L31j537l340N446J537K503M260m583K845M279j1896K616
123f44P686j9224J824K1061j5114q652K3704o992j3293K1933l288k0647J6797
$$ plain form
136 5151 10388 -9978 -2591 4946 -9688 -5719 4636 -2710 -1708 4491 1874 4669 8255 -640
150 -640 -5510 -719 2672 -3448 -9850 -3209 3082 -451 1461 3423 -3702 4493 13873 -4311 -9664
165 -9664 9212 3054 -11297 -626 388 -7677 3395 3681 -7165 4888 11172 -3440 -2645 6591
179 6591 -16 -3901 -2462 -5070 -1214 5113 -2266 -6360 4886 10608 303 -6334 1031 4553 -1372
194 -1372 -4027 -4741 -6183 2906 7072 -6721 -4825 12887 7616 -4311 2510 3061 -2912 660 -4033
209 -4033 -11820 -770 3811 -7831 -3258 8924 4386 2110 6851 2828 1488 5747 -3518 -11494
223 -11494 -1871 1522 -9265 -9106 2779 4671 2007 5160 5077 3016 7542 6113 -6574 -5759 2091
238 2091 -4433 -10525 -4198 -2030 -2425 4244 4504 851 7412 10410 562 -123 3388 -4603 -7906 -2430
$$ packed form
136E151N237k0366P387P537j4634L969J0355p346J002O199k617K795L586q895
150f40m870M791L391o120o402O641O291l533J912J962p125Q195R380j8184n353
165i664J8876o158j4351J0671J014q065J1072K86j0846J2053O284j4612P95R236
179F591o607l885J439k608L856O327p379m094J1246N722j0305o637P365L522n925
194a372k655p14j442R089M166j3793J896J7712n271j1927O821N51n973L572m693
209d033p787J1050M581j1642M573J2182m538k276M741m023j340M259r265p976
223a1494R623L393j0787J59J1885J892k664L153q3k061M526j429j2687Q15P850
238B091o524o092O327K168l95O669K60l653O561K998r848o85L511p991l303N476
$$ plain form
254 -2430 -5792 -7831 391 1828 -1860 5197 9160 1315 2218 7492 684 -4722 -38 -2966 -8257
269 -8257 -2853 13 -5509 -1479 5264 1877 2496 7398 3054 -2123 3114 1168 -7309 -4564 -214
284 -214 -3392 -1402 2130 -1414 834 7698 2057 -4220 1934 3848 -3570 -3321 -618 -3491 -1278 2103
300 2103 -2893 -2018 7243 4772 -1892 2180 4426 -1277 -3340 -2715 -5263 -2798 996 -3326 -2994 5961
316 5961 6300 -1043 569 5066 1867 -533 -945 -4556 -2372 3210 -2950 -7912 1091 5509 -919 -761
332 -761 3846 2930 3249 3020 -3823 -4226 3115 -966 -8025 -1514 4052 544 91 2151 686 2254 3517
349 3517 -3283 -4928 2687 1406 -5468 -2986 2462 379 515 1574 -502 1760 5962 -156 -4650
364 -4650 1179 1669 -5262 -4805 -1020 -1916 295 3052 -39 1203 7223 3289 -3150 348 1511 -3295
$$ packed form
254b430l362k039Q222J437l688P057L963p845R03N274o808n406M684k928n291
269h257N404K866n522M030O743l387O19M902m344n177N237j946q477K745M350
284b14l178J990L532l544K248O864n641o277O154J914p418K49K703k873K213L381
300B103m996Q75R261k471o664M072K246n703k063O25k548K465L794m322L32Q955
316E961L39p343J612M497l199k400m12l611K184N582o160m962R003M418o428J58
332g61M607r16L19k29o843m03P341m081p059O511N566l508m53K060j465J568J263
349C517o800j645P615j281o874K482N448k083J36J059k076K262M202o118m494
364d650N829M90o931M57L785q96K211K757l091J242O020l934o439L498J163m806
$$ plain form
380 -3295 -3454 -981 -3374 -1659 2323 -820 -2015 4122 4513 -999 1373 3146 -973 -1656 300 -4267
396 -4267 -3921 944 -284 -2282 2812 4220 962 2424 3364 -1842 -1579 811 -3373 -5137 112 3
412 3 -2396 1498 2674 -110 3684 5275 -411 -273 3353 -543 -5191 -2526 -2896 -4321 -976 531
428 531 -1545 3025 7214 2095 27 4315 2254 -3022 -1932 -2297 -4511 -1318 -87 -4487 -574 5242
444 5242 2009 -677 3509 3557 640 483 -1444 -4045 -538 -40 -5505 -3913 2792 2620 -310 1931
460 1931 3371 2103 2142 -94 -3585 -1406 1292 -3978 -5871 546 2488 -780 1028 1971 1004 3687
476 3687 2651 -3694 -1309 2827 -2331 -6010 -913 0 -1416 1907 869 -67 4639 4431 -2086 -895
492 -895 2628 -732 -4375 -2471 -1340 -1139 578 613 -931 1836 5317 1270 -1772 1823 1847 -2375 -2261
$$ packed form
380c295j59K473k393J715L982l143j195O137L91n512K372J773m119o83J956m567
396d267L46M865j228j998N094J408l258J462R40n206K63K390m184j764N249j09
412Ck399L894J176k784L794J591n686J38L626l896m648K665l70j425L345J507
428E31k076M570M189n119k068M288k061n276J090l65k214L193J231m400L913N816
444E242l233k686M186M8k917j57j927k601L507M98n465J592O705j72k930K241
460A931J440j268L9k236l491K179K698n270j893O417J942l268J808R43r67K683
476C687j036o345K385M136n158l679N097R13j416L323j038r36M706k08o517J191
492h95L523l360l643J904J131K01J717L5j544K767L481m047l042L595K4m222J14
$$ plain form
509 -2261 -1490 -3049 -428 1053 -2375 236 4991 1725 -204 2774 1053 -1403 820 -1838 -4979
524 -4979 -184 469 -3408 -721 3276 1504 1149 2492 1722 277 827 -130 -2768 -2997 2 -803 -3499
541 -3499 616 2310 397 1947 2881 -864 844 3041 -2187 -3615 611 -1776 -3128 738 -1160
556 -1160 -1473 4471 3380 -1244 2457 4044 -1103 -1717 -462 -3129 -2315 -625 -1941 -1790 1295 3109
572 3109 1362 319 3074 2710 -342 -633 244 -1917 -1061 -1310 -4716 -1367 3159 -375 -1119 3888 2431
589 2431 705 3540 -1498 -3507 2425 -18 -6116 -1357 2332 -509 478 1831 352 1439 3150
604 3150 -369 -1736 -80 799 -1364 -3296 -1420 952 -632 -494 1862 2009 2748 2598 -916 -114 2018
621 2018 -2276 -4252 -1120 -1706 -1661 1779 -624 -616 5272 3549 -1949 730 2722 -151 -1045 -1486 -3101
$$ packed form
509b261P71j559K621J481l428K611M755l266j929K978j721k456K223k658l141
524d979M795O53l877K687L997j772l55J343p70j445N50r57k638k29K999q05k696
541c499M115J694j913J550R34l745J708K197n228j428M226k387j352L866j898
556a160l13N944j091m624L701J587n147o14J255k667Q14J690j316J51L085J814
572C109j747j043K755l64l052k91Q77k161Q56k49l406L349M526l534p44N007j457
589B431j726K835n038k009N932k443o098M759L689k841R87J353j479J087J711
604C150l519j367J656Q79k163j932J876K372j584J38K356J47P39j50l514Q02K132
621B018m294j976L132n86M5L440k403QN888j723n498K679J992k873q94m41j615
$$ plain form
638 -3101 -917 -127 -1789 -1493 273 1980 2850 701 865 2694 636 -1439 -947 -2255 -1725 -396 -1335
655 -1335 -704 2340 608 -168 2420 847 -668 1104 -562 -3069 702 549 -3208 -1585 1709 417
671 417 759 1527 700 1745 2230 43 -1651 -2379 -1099 -570 -2227 -2437 50 2224 1925 1699 675 1622
689 1622 1927 -350 -1122 -1193 -2233 -1267 -44 -2602 -2190 1908 1195 -607 2324 3025 332 966 1014 -1351
707 -1351 -1520 -1576 -2477 -1505 755 618 111 909 1901 2835 679 -1314 -1048 294 185 -2402 -3309 -201
725 -201 1072 -58 -94 964 1183 2603 2865 -516 -1747 1421 -13 -4002 -2880 -381 -1285 -550 1498
742 1498 561 1451 3070 1406 38 1338 552 -2397 -1542 -856 -2046 -1071 -230 -1697 1136 3784 85
759 85 -1523 3335 2502 -1287 -563 -1036 -3068 28 692 -3173 -1828 3567 2804 -94 967 1698 563
$$ packed form
638c101K184P90j662K96J766J707Q70k149J64J829k058k075M92j308N30J329r39
655a335O31L044j732p76K588j573j515J772j666k507L771j53l757J623L294j292
671D17L42P68q27J045M85k187j694p28J280N29j657k10K487K174k99k26j024R47
689A622L05k277p72p1j040R66J223k558M12M098p13j802K931P01k693O34M8k365
707a351j69n6r01R72K260j37n07P98R92R34k156j993K66J342j09k587r07L108
725b01J273j130l6J058K19J420K62l381j231L168j434l989J122K499r04P35K048
742A498r37Q90J619j664j368J300p86k949Q55O86j190R75Q41j467K833K648l699
759H5j608M858q33l789P24m73k032L096O64l865J345N395p63k898J061P31j135
$$ plain form
776 563 557 -558 -2559 -1297 133 -1493 -1956 739 1069 392 2036 1683 108 1803 1246 -2328 -1149
793 -1149 799 -2411 -3109 926 -83 -641 1777 1311 99 2688 2182 -1476 -1537 144 -433 -1876 -2276
810 -2276 -1038 669 950 1127 588 727 2460 1920 -1183 -1045 144 -1224 -1126 -962 -2443 -245 2125
827 2125 -200 -160 2867 1228 -203 1559 36 -1848 -364 -1019 -2621 -653 428 -723 -255 1548
843 1548 2172 998 582 -35 343 289 -797 -1942 -1874 383 661 -1707 -436 1451 1183 1765 1214 -1780
861 -1780 374 2183 -1866 -2964 142 -914 -1252 860 -313 -210 2870 2412 -400 496 1096 -1214
877 -1214 -1526 -1293 -1458 -868 -497 -740 504 1460 1443 554 537 1926 1422 -901 -1049 -735 -1506 -888 -1123 -2628
897 -2628 -111 3169 366 -415 2360 1388 414 874 -2011 -2839 512 37 -2493 -615 1110 334 1045
$$ packed form
776E63oj115k001J262J430j626m63K695L30o77J644l53j575J695n57l574J179
793a149J948l210o98M035j009n58K418m66j212K589n06l658o1J681n77j443m00
810b276J238J707K81J77n39J39J733n40l103J38J189j368R8J64j481K198K370
827B125k325M0L027j639j431J762j523j884J484o55j602J968J081j151M68J803
843A548O24j174m16o17L78n4j086j145O8K257K78k368J271J887k68N82n51k994
861a780K154J809m049j098L106j056l38K112j173J03L080m58k812Q96O00k310
877a214l12K33j65N90L71k43J244R56j7q89j7J389n04k323j48L14p71O18k35j505
897b628K517L280k803p81K775r72r74M60k885q28L351m75k530J878J725p76P11
$$ plain form
914 1045 1215 294 1031 1126 -192 -1197 -576 -608 -1773 -1643 -228 145 342 1170 1504 1194 2100 998 -1760
933 -1760 -771 430 -2173 -3037 -685 -365 -195 1447 301 -233 2428 2010 -330 355 767 -368 -735
950 -735 -1235 -2624 -1232 298 -260 -533 1177 2696 1432 989 860 -73 -742 -199 -1418 -2094 -32 821
968 821 -1231 -7 2085 803 43 1017 99 15 783 -1022 -2351 -52 115 -1481 -659 1061 1160 1503
986 1503 1385 -90 157 1344 -241 -2382 -1347 -520 -942 -540 -139 124 1418 1943 881 165 1166
1003 1166 1033 -666 -1011 -560 -1165 -902 -701 -1572 -352 1687 1002 114 1585 1782 -99 -449 -601 -981
1021 -981 -846 -524 -1855 -1235 1294 1298 -98 561 1303 977 205 -118 -1117 -595 -40 -1148 -1845 -384 662
1040 662 298 664 1231 1013 1564 1174 -684 -1092 231 -893 -2286 -1218 -315 12 922 970 477 1477
$$ packed form
914A045J70r21P37R5j318j005O21l2j165J30J415L73J97Q28L34l10R06j102k758
933a760R89J201k603q64K352L20J70J642j146n34K661m18k340O85M12j135l67
950g35n00j389J392J530n58k73J710J519j264m43j29r33o69N43j219o76K062Q53
968H21k052J224K092j282p60R74r18q4P68j805j329K299J67j596Q22J720R9L43
986A503j18j475K47J187j585k141J035Q27m22M02M01K63J294N25j062p16J001
1003A166j33j699l45M51o05K63K01q71J220K039o85q88J471J97j881l50j52l80
1021i81J35L22j331O20K529Mj396O59P42l26p72l23r99N22N55j108o97J461J046
1040F62l64L66N67k18N51l90j858m08J323j124j393J068R03L27R10M8m93J000
$$ plain form
1058 1477 1930 299 -526 456 59 -1319 -1468 -743 -860 66 173 -276 652 2234 998 -166 513 728
1076 728 -789 -1083 -1320 -1545 25 507 -621 -265 1893 1520 330 638 388 -265 -172 -627 -1604 -971 412
1095 412 -761 -741 775 1634 895 685 709 337 616 173 -1350 -1600 -102 -568 -1315 -53 829 900 1426
1114 1426 770 68 1203 1294 -1133 -1403 -382 -541 -1224 -595 -255 38 1424 1324 -52 815 2053 334
1132 334 -1124 -375 -493 -1100 -937 -858 -621 270 1053 231 -28 1652 1422 56 -255 -185 -926 -672 -849 -1737
1152 -1737 -265 1043 364 -94 1167 1060 598 794 -219 -1181 232 -242 -1573 -868 731 191 -173
1169 -173 602 584 853 1180 727 -780 -183 367 -1153 -1362 -278 27 -224 761 450 781 1630 1101 -598
1188 -598 -684 517 -768 -1454 -616 -527 -359 363 -129 -27 1305 1886 207 46 881 288 -1083 -848 -1454
$$ packed form
1058A477M53j631q25R82l97j378j49P25j17R26J07m49R28J582j236j164O79K15
1076G28j517k94k37k25J570M82j128L56K158l73j190L08k50o53R3m55r77O33J383
1095D12j173K0J516Q59p39k10K4l72K79m43j523k50J498m66p47J262Q82P1N26
1114A426o56p02J135R1k427k70J021j59o83O29L40K93J386j00j376Q67J238j719
1132C34j458P49j18o07J63P9K37Q91P83q22k59J680k30j366l11P0p41K54j77q88
1152a737J472J308o79m58J261j07m62J96j013r62J413m74j331P05J599n40l64
1169a73P75j8K69L27m53j507N97N50j520k09J084L05k51R85l11L31Q49n29j699
1188e98q6J201j285o86Q38Q9J68P22m92J02J332N81j679j61Q35n93j371K35o06
$$ plain form
1207 -1454 -1470 -384 -288 -699 491 1657 774 452 774 330 -119 -111 -1360 -1096 -245 -72 -1065 -325 946
1226 946 870 631 968 369 382 674 -670 -1734 -898 -117 -1267 -1435 680 845 506 1109 1096 248 1044 354
1246 354 -1458 -1254 -99 -776 -1490 -396 -305 679 1112 350 607 1670 978 -545 -305 -193 -845 -960 -1031
1265 -1031 -1642 -699 747 703 102 1160 2027 820 -32 358 -10 -743 -422 -886 -1242 73 660 -797
1283 -797 -15 1484 489 749 790 -627 59 583 -1432 -1889 238 282 -775 303 773 636 1886 874
1301 874 -228 41 435 -622 -1163 -1134 -142 38 -327 -314 730 863 967 1242 -74 532 902 -911 -1011
1320 -1011 -528 -1078 -482 -19 -590 566 1852 301 236 1513 343 -161 52 -1014 -1146 197 -270 -628
1338 -628 -278 717 943 358 -477 656 1072 -493 -567 -278 -938 -519 262 -1426 -558 1158 659 278 1179
$$ packed form
1207a454j6J086R6m11J190J166q83l22L22m44m49Qj249K64Q51J73r93P40J271
1226I46p6k39L37n99J3K92j344j064Q36P81j150j68K115J65l39O03j3q48P96o90
1246C54j812K04J155o77p14J094R1R84M33p62K57J063o92j523K40J12o52j15p1
1265a031o11R43J446m4o01J058Q67j207q52L90l68p33L21m64l56J315N87j457
1283g97P82J499r95K60M1j417O86N24k015m57K127M4j057J078M70j37J250j012
1301H74j102K69L94j057n41K9R92J80l65J3J044J33J04K75j316O06L70j813j00
1320a011M83n50N96M63n71J156J286j551o5J277j170n04K13j066j32J343m67l58
1338f28L50R95K26n85q35J133M16j565p4K89o60M19P81j688Q68J716m99l81R01
$$ plain form
1357 1179 186 443 467 -992 -1342 520 -611 -1571 638 217 144 1272 512 200 1391 693 -523 -359
1375 -359 -336 -471 -590 -1753 -717 785 280 92 787 412 1387 1109 -938 -821 328 -891 -841 -330 -1109
1394 -1109 -74 1812 -302 216 2233 594 -311 1052 -482 -1202 489 -693 -1798 -85 44 -382
1410 -382 660 989 764 1135 341 -10 666 -142 -848 -942 -1430 -321 816 -252 -199 1468 610 692 589
1429 589 -552 416 850 -1433 -2109 61 -588 -909 562 65 -121 1994 1588 -377 664 514 -114 -278
1447 -278 -905 -1287 -485 -440 -967 226 506 675 1014 659 581 1040 -253 -822 -210 -864 -985 -409 -1282 -31
1467 -31 1392 233 -569 1648 935 109 727 -670 -1211 181 191 -1462 -597 314 280 701 133 127 1140
1486 1140 547 -150 -39 -762 -427 -157 -960 -486 580 -2 337 716 253 495 839 -467 -640 683 -527
$$ packed form
1357A179r93K57K4j459l50J862j131r60K209m21p3J128p60l12J191o98j216J64
1375c59K3j35j19j163J036J502n05j88O95l75R75k78k047J17J149j219N0N11p79
1394a109J035J886k114N18K017j639r05J363j534p20J691j182j105J713J29m26
1410c82J042L29k25L71p94l51O76q08p06r4m88J109J137j068N3J667q58Q2j03
1429E89j141R68M34k283o76K170o49l21J471m97j86K115m06j965J041j50o28j64
1447b78o27l82Q02M5n27J193K80J69L39l55p8M59j293n69O12o54j21N76q73J251
1467c1J423j159q02K217p13q26O18j397n41J392J0j653Q65R11l4M21n68oJ013
1486A140n93o97J11p23L35K70q03M74J066n82L39L79m63K42L44j306j73J323j210
$$ plain form
1505 -527 -1630 15 117 -432 539 399 -298 1265 1642 -252 -165 524 44 -686 -1571 -883 -192 546 77
1524 77 -74 232 834 935 129 -236 -48 -181 -212 -370 -962 -260 389 -290 -611 887 389 165 899 260
1544 260 65 256 -673 -1356 -216 -195 -1082 162 647 777 838 566 -770 43 306 -514 -783 -560 -120 168
1564 168 -584 -754 86 906 646 321 217 541 949 -305 -990 -571 -507 -557 -224 -219 65 825 912 283 562
1585 562 532 -184 -409 -544 -726 -272 -467 -533 -297 635 299 -8 375 992 872 -49 -246 -651 -629 -374 -935
1606 -935 -1195 -143 733 586 138 841 802 813 476 -939 -773 237 -182 -1013 -1000 -29 173 579 502 282
1626 282 1016 1127 583 99 -178 -385 -1006 -1246 -632 -301 -56 152 31 862 1696 688 -259 123 570 119
1646 119 -532 -950 -863 -19 -16 -531 -362 854 1114 361 284 507 267 145 -399 -895 -462 -6 -85 -557 418
$$ packed form
1505e27j103J645J02n49R71j40o97J563L77j894Q7O89m80p30q85O88O91P38m69
1524G7j51L06O02J01q06l65J88j33l1j58n92P02O49o79l21J498m98k24P34o39
1544B60j95J91r29o83J140K1q87J244M85J30O1k72j336Q13K63q20k69K23M40K88
1564A68p52j70Q40Q20k60l25j04L24M08j254o85M19O4n0L33NK84P60Q7o29K79
1585E62l0p16k25j35j82M54j95o6K36R32l36l07L83O17j20r21j97m05K2K55n61
1606i35k60J052Q76j47m48P03l9J1l37j415J66J010m19q31J3R71K02M06p7k20
1626B82P34J11n44m84k77k07o21k40O14L31K45K08j21Q31Q34j008r47L82M47m51
1646A19o51m18Q7Q44Ln15J69J216K60p53p7K23k40j22n44m96M33M56p9m72R75
$$ plain form
1667 418 928 739 399 411 381 86 19 -905 -865 -352 -286 -593 -375 435 344 347 363 -36 555 523 -310 -628 -242
1690 -242 -153 -671 -903 -22 224 600 685 -233 336 952 523 -673 -392 -107 -137 -722 -519 -108 137 778 519
1711 519 -74 778 608 39 -198 -257 -470 -91 -344 -570 -102 722 319 11 395 697 350 -104 -181 -464 -446
1732 -446 -264 -1117 -643 474 377 -44 695 680 799 857 -126 -605 1 97 -476 -948 -568 174 -184 518 88
1753 88 521 1008 744 20 -153 120 -238 -780 -395 -438 -448 -141 113 158 830 946 315 -45 421 99 -811
1774 -811 -884 -728 -468 -260 45 -75 276 1074 664 331 111 245 354 -159 -865 -496 -119 -517 -899 -193
1794 -193 581 777 587 516 312 277 163 -410 -866 -668 40 -379 -394 240 692 485 489 244 338 543 222 -636
1816 -636 -185 57 -529 -746 -616 -327 366 461 550 577 1009 852 -156 -416 -339 -584 -452 -757 -547 -43 193
$$ packed form
1667D18N10j89l40J2l0k95o7r24M0N13O6l07K18Q10r1LJ6l99N91l2q33l18L86
1690b42Q9n18k32Q81K46L76Q5r18N69O16m29j196K81K85l0n85K03M11K45O41k59
1711E19n93Q52j70n69k37n9k13L79k53k26M68Q24m03l08L84L02l47m54p7k83J8
1732d46J82q53M74J117r7m21P39j5J19N8r83m79O06R6n73m72L80P42l58P02m30
1753H8M33M87k64p24j73K73l58n42L85m3j0L07K54M5O72J16o31l60M66l22r10
1774h11p3J56K60K08L05j20L51P98m10l33k20J34J09n13p06L69L77l98l82P06
1794a93P74J96j90p1k04l5j14n73m56J98P08m19j5O34M52k07Mk45R4K05l21q58
1816f36M51K42n86k17J30K89O93R5Q9K7M32j57j008k60P7k45J32l05K10N04K36
$$ plain form
1837 193 383 -15 211 946 675 -74 -216 262 -134 -680 -520 -944 -209 449 -117 -76 868 475 318 -93
1857 -93 -229 -33 -257 -870 -966 -27 241 188 342 352 237 788 258 180 -103 235 -96 -653 -580 -39 -120 -394
1879 -394 -72 461 329 675 567 -101 233 115 -366 -970 -323 -265 -276 -221 -81 -20 1172 207 -321 503 407
1900 407 -65 -254 -467 -431 -253 -338 -336 -357 439 392 472 -201 259 682 -296 -509 -510 -519 -388 -183 -636 -280 910
1923 910 494 291 404 242 233 107 -665 -1016 -115 -330 -632 -204 33 35 651 611 188 662 747 305 -294 -865
1945 -865 40 -403 -843 -304 111 -54 193 522 405 210 695 -207 -520 -160 -303 -367 -458 -438 -44 436 -39
1966 -39 -103 876 698 -643 384 34 -575 -368 -651 -928 -497 145 -45 88 52 1022 634 -101 -91 185 -136
1987 -136 -275 -526 -562 226 268 -37 183 673 574 728 313 -188 186 651 -677 -960 -112 -337 -360 -96 -193
$$ packed form
1837A93J90l98K26P35k71p49j42M78l96n46J60m24P35O58n66M1R44l93j57m11
1857i3j36J96k24o13r6R39K68n3J54J0j15N51n30p8k83L38l31n57P3N41q1k74
1879c94L22N33j32L46j08o68L34j18m81o04O47N8j1N5J40O1J192r65n28Q24r6
1900D07m72j89k13L6J78q5Kk1P96m7Q0o73M60M23r78k13jrJ31K05m53L56J190
1923I10m16k03J13j62rj26p72l51R01k15l02M28K37KO16m0m23M74Q5m42n99n71
1945h65R05m43m40N39M15j65K47L29j17j95M85r02l13L60j43o4r1K0L94M80m75
1966c9o4R79j78j341J027l50o09K07k83k77M31O42j90J33l6R70l88p35J0K76l21
1987a36j39k51l6P88M2l05K20M90r9J54m15n01L74M65j328k83Q48k25k3K64r7
$$ plain form
2008 -193 179 1108 887 67 329 392 -91 -510 -628 -460 103 -410 -491 -186 372 194 419 281 421 226 88
2029 88 -315 -315 -361 -393 -163 -574 -15 381 526 56 541 539 164 -198 -192 -524 -409 -434 -695 -235 278 561 369
2052 369 88 431 746 474 -73 -626 -3 -53 -376 -425 109 -11 202 322 320 336 567 383 -366 -404 285 -79
2074 -79 -688 -466 -258 -98 212 315 263 900 598 47 -222 210 -137 -691 -692 -275 -215 69 158 388 532 543
2096 543 599 178 -192 122 -94 -391 -669 -874 -337 -155 -151 -187 424 767 305 140 216 -75 -98 -570 -406 -604
2118 -604 -20 131 -306 152 588 442 415 325 395 508 282 -912 -453 -318 -218 -831 -314 -160 630 580 139
2139 139 302 566 550 -242 -337 -484 -162 -211 -605 -249 -61 261 367 348 343 252 351 37 19 -134 -442 -177 -476
2162 -476 -444 -44 359 63 520 575 205 323 -278 -541 -234 -289 -357 -415 -94 175 -76 191 -188 320 346 111
$$ packed form
2008a93L72R29k21q20K62O3m83m19j18J68N63n13q1L05N58j78K25j38J40j95j38
2029H8m03%m6l2K30m11N59L96J45m70M85kl75l62Ol32J15k5k61M60N13K83j92
2052C69k81L43L15k72n47n53O23n0l23m9N34j20K13J20kJ6K31j84p49l8O89l64
2074g9o09K22K08J60L10J03n2O37l02n51k69M32l47n54jM17O0K84Q9K30J44J1
2096E43N6m21l70L14k16k97k78k05N37J82Ml6O11L43m62j65P6k91k3m72J64j98
2118f04N84J51m37M58M36j46k7r0P0J13k26j194M59J35J00o13N17J54P90n0m41
2139A39J63K64j6p92r5j47L22m9l94L56J88L22J06j9nr1R9l14j8j53l08K65k99
2162d76L2M00M03k96M57N5l70J18o01k63L07n5o8n8L21K69k51K67l79N08K6k35
$$ plain form
2184 111 -500 -253 -48 -440 -412 -482 -287 45 227 -138 215 718 542 417 -162 9 -193 -486 -665 -405 -575
2205 -575 -165 -139 224 248 1147 551 -177 -40 5 128 -178 -402 -619 44 -150 -180 247 383 614 -31 -209
2226 -209 -114 179 -182 -624 -707 -563 -61 94 -221 -178 451 325 283 14 -58 294 35 -340 -621 -163 -280 -250
2248 -250 -6 182 444 318 229 118 207 259 -310 -509 -237 -320 -322 -390 -7 387 214 459 65 335 704 268
2270 268 -586 -784 10 5 -233 -598 -236 -30 521 41 55 240 258 -198 -269 -333 -244 29 -608 -687 -311 317 160
2293 160 180 218 471 271 224 -152 243 -418 -266 -394 -382 -185 249 85 237 836 395 406 30 -114 -166 94
2315 94 -401 -760 -243 76 66 384 -83 331 662 884 120 -163 218 34 -369 -457 -476 -116 2 -5 278 215
2337 215 667 288 39 212 146 -238 -442 -164 -227 -156 -165 14 -92 529 240 119 24 121 271 74 -518 -456 7
$$ packed form
2184A11o11K47K05l92K8p0J95L32J82l65L53N03j76j25n79J71k02k93j79K60j70
2205e75M10K6L63K4Q99n96p28J37M5J23l06k24k17O63j94l0M27J36K31o45j78
2226b09R5K93l61m42q3J44N02J55l15M3O29j26m2k69p2L52k59l75k81M58j17L0
2248b50K44J88K62j26q9j11Q9N2n69j99K72q3ko8L83L94j73K45l94K70L69m36
2270B68q54j98P94nk38l65L62K06N51m80J4J85J8m56p1o4Q9K73o37p9L76O28j57
2293A60K0L8K53k00m7l76L95o61J52j28J2J97M34j64J52N99m41J1l76j44n2K60
2315I4m95l59N17L19j0L18m67M14L31K22p64k83L81j84m03q8j9L60J18pK83o3
2337B15M52l79k49J73o6l84k04K78o3P1rJ79j06O21k89j21r5R7J50j97n92O2M63
$$ plain form
2360 7 -137 -190 -315 172 424 243 -256 -40 -116 167 204 -169 -171 -324 188 -212 226 431 15 404 435 284 366
2383 366 257 -576 -469 -59 -370 -498 -212 87 137 63 294 214 139 252 97 -526 -56 -207 -407 -488 -241 -450
2405 -450 227 403 79 -56 369 540 223 -218 -95 -117 -185 -361 -464 -95 370 97 -175 -135 210 89 -243
2426 -243 -156 -205 -11 -104 -413 -196 5 -50 114 -54 445 426 270 123 -44 109 -376 -841 -702 -298 -67 -249
2448 -249 -187 383 529 648 -25 -45 -210 150 -14 -412 -120 -194 -72 -229 -128 -57 513 695 353 92 478
2469 478 16 -440 -438 -360 -107 -60 -279 144 223 467 328 -82 55 544 -221 -338 -274 -594 -271 -336 -173 348
2491 348 508 -46 14 -62 456 264 258 -282 -199 -240 -487 -646 -583 289 480 307 88 -86 400 237 435 -45
2513 -45 -381 135 -379 -343 -265 35 266 54 157 156 141 355 -15 -363 96 -247 -151 -460 -226 182 250 43 276
$$ packed form
2360Gj44n3j25M87K52j81m99K16p6K83L7l73kj53N12m00M38K05m16L89L1j51Q2
2383C66j09q33J07M10l11j28K86K99N0p4K31q0p5J13j55o23M70j51k00q1K47k09
2405d50O77J76l24j35M25J71l17m41J23k2o8j76j03L69M65k73k72M0L45j21l32
2426b43Q7m9J94r3l09K17K01n5J64j68M99j9j56j47j67J53m85m65J39M04K31j82
2448b49O2N70J46J19o73k0j65L60j64l98K92p4J22j57J01P1N70J82l42k61L86
2469D78m62m56KP8K53M7k19M23P9K44j39m10J37M89p65j17O4l20L23o5J63N21
2491C48J60n54O0p6N18j92on40Q3m1k47j59O3Q72J91j73k19j74M86j63J98m80
2513d5l36N16n14L6P8L00K31k12J03jj5K14l70l48M59l43R6l09K34M08O8k07K33
$$ plain form
2536 276 606 535 -32 64 30 -390 -374 -482 -273 -175 189 -17 -69 95 509 332 -67 -247 -107 -200 -595 -306
2558 -306 -458 -189 -18 -379 88 223 341 500 253 224 -174 256 -277 -799 -222 -165 -8 -461 301 259 382
2579 382 378 142 -148 87 143 -217 -319 -153 -139 -329 -215 -192 238 390 -189 187 163 142 -61 -380 -486 6
2601 6 -206 -383 -559 -194 612 267 136 370 471 -127 4 -117 -377 -206 -290 -154 -410 38 258 30 117
2622 117 653 213 187 152 -418 -83 -31 -429 -232 -180 -150 276 0 289 536 568 300 10 -100 -172 -200 -535 -158
2645 -158 -152 277 199 -163 222 299 692 490 -152 -22 174 -105 -294 -406 -325 26 12 66 65 493 355 -59 354
2668 354 -235 140 76 -604 -509 -372 -20 -112 -131 59 -63 134 -267 157 92 -386 -100 -495 -159 98 -218 -208
2690 -208 -76 161 405 372 46 94 200 -174 -579 -342 -2 55 -318 498 196 375 181 160 -177 365 530
$$ packed form
2536B76L30p1n67R6l4m20J6j08K09R8L64k06n2J64M14j77l99j80J40r3l95K89
2558c06j52K69J71l61M67J35J18J59k47k9l98M30n33n22N77N7J57m53P62m2J23
2579C82mk36k90K35N6l60j02J66J4j90J14K3M30J52n79L76k4k1k03l19j06M92
2601Fk12j77j76L65Q06l45j31K34J01n98J31j21k60J71q4J36k56M48K20k28Q7
2622A17N36m40k6l5n70L35N2l98J97N2L0M26k76K89K47L2k68k90j10p2k8l35L77
2645a58OM29p8l62L85P7L93k02o42J30J96k79j89j12Q1L51j4N4jM28j38m14M13
2668C54n89L75o4o80R5J37L52r2j9J90j22J97m01M24o5m78K86l95L36K57l16J0
2690b08J32K37K44l3l26M8J06l74m05K37L40N7l73Q16l02J79j94k1l37N42J65
$$ plain form
2711 530 -384 -394 -77 -178 -391 -238 -284 139 -111 203 316 315 485 -45 -446 -432 -261 -109 51 -201 -19 317
2733 317 347 -135 175 284 246 176 11 -172 -402 -82 -124 -512 89 103 412 120 176 532 449 236 -134 55
2755 55 -300 -496 -235 -174 -85 103 128 240 -17 152 361 151 -346 -116 -163 -287 -358 -404 -470 -41 65 298 96
2778 96 321 378 209 171 267 -210 -121 -456 -189 -100 197 -54 228 418 26 485 -90 163 315 -450 -694 -289
2800 -289 -407 42 227 -226 -47 421 126 104 278 538 -82 -21 -193 -234 -374 -430 -265 -584 97 81 219 221
2822 221 415 313 369 -179 -127 73 -5 142 -534 -226 20 321 240 -198 -4 40 84 3 -90 -46 -47 -269 43 -147
2846 -147 -36 98 295 273 291 325 -294 -109 -371 -84 -385 -450 -534 -33 55 -89 145 -24 183 -50 117 -35
2868 -35 -121 218 -23 -257 -438 -215 435 -9 215 290 501 222 129 -168 -52 -234 -380 -588 -30 396 151
$$ packed form
2711E30r14j0L17j01k13J53m6M23k50L14J13jJ70n30m01J4J71J52J60k52J82L36
2733C17L0m82L10J09l8p0j65j83k30L20m2l88O01J4L09k92N6L56q3k13l70J89
2755E5l55j96K61O1Q9J88K5J12k57J69K09k10m97K30m7j24p1m6o6M29J06K33k02
2778I6K25N7j69l8R6m77Q9l35K67Q9K97k51K82J90l92M59n75K53J52p65k44M05
2800b89j18M49J85m53J79M68k95k2J74K60o20O1j72m1j40n6J65l19O81j6J38K
2822B21J94j02N6n48N2K00p8J47o76L08K46L01q1m38J94M4M4q1r3M4jk22L12j90
2846a47J11J34J97k2J8L4o19J85k62K87l01o5q4N01Q8j44K34j69K07k33J67j52
2868c5q6L39k41k34j81K23O50m44K24P5K11k79r3k97J16j82j46k08N58M26k45
$$ plain form
2889 151 -99 -106 142 591 103 -171 7 -173 374 -421 -322 -104 -181 38 -100 -30 42 171 -143 9 -85 139
2911 139 -508 -389 -27 84 -81 -73 -25 67 386 -110 -373 23 82 -360 -221 -165 -38 222 -119 -75 131 349
2933 349 492 20 292 53 203 15 -68 -320 -334 -450 2 156 -87 224 35 379 186 46 199 -42 -175
2954 -175 -176 -367 -339 -353 -387 -81 207 299 458 116 145 139 380 -75 58 79 -531 -361 -299 9 11 102 153 228 403
2979 403 226 215 -171 -60 -185 3 -545 -147 206 131 179 414 201 356 6 15 -55 101 26 -275 -392 -247
3001 -247 -22 -222 -289 232 417 234 148 55 86 -58 -355 -334 -362 145 -159 -119 -1 -299 231 230 140 -171 -59
3024 -59 107 -52 -305 -344 -370 -46 -38 -215 138 201 403 109 161 334 271 75 -10 -592 -380 -151 -201 33 41 142
3048 142 263 214 389 -64 77 51 -146 114 -139 -52 -351 34 124 59 -48 293 241 355 -224 -353 -531 301
$$ packed form
2889A51k50pK48M49m88k74J78j80N47p95R9K18p7K19j38P0P2J29l14J52r4K24
2911A39o47J19L62J11j65QM8R2L19m96k63L96N9m42J39N6J27K60l41M4K06K18
2933C49J43m72K72k39J50j88q3k52j4j16M52J54k43L11j89L44j93j40J53k41j33
2954a75jj91K8j4l4L06K88R2J59l42K9oK41m55J33K1o10J70O2L08KR1N1P5J75
2979D03j77j1l86J11j25J88n48L98L53p5M8K35k13J55l50Rp0J56p5l01j17J45
3001b47K25k00o7N21J85j83q6r3L1j44k97K1k8N07l04M0J18k98N30jr0l11J12
3024e9J66j59k53l9k6L24Qj77L53O3K02k94N2J73o3j96q5n82K12K29n0K34QJ01
3048A42J21m9J75m53J41k6j97K60k53Q7k99L85R0o5j07L41n2J14n79j29j78Q32
$$ plain form
3070 301 80 -283 -212 185 209 113 -30 84 187 374 106 -274 -136 -235 -156 -365 33 14 67 202 108 199 204 96
3094 96 42 125 -62 231 -443 -583 33 57 -97 77 288 255 420 222 -492 13 112 -58 2 -205 92 49 85
3117 85 122 127 464 472 131 116 95 -101 -119 -147 -135 -171 32 126 16 485 298 215 113 287 29 178 -87 -271 -98
3142 -98 -69 -57 126 234 238 2 217 361 246 62 -75 -320 -67 -104 -69 59 -110 -159 315 367 -116 -88 39
3165 39 -76 119 -168 -134 -262 -131 -226 -190 228 21 428 258 312 122 81 0 -272 42 -472 -190 209 136 106
3188 106 69 138 170 106 226 103 356 -171 104 -115 -276 -257 -240 260 236 -315 83 225 289 297 -180 -223 94 -75
3212 -75 -257 -38 -87 56 -179 79 -53 -45 448 205 200 205 -344 142 -413 -363 -103 189 31 -222 72 116 109 47
3236 47 262 -21 -136 -167 -554 -428 -196 148 28 -301 395 288 276 57 148 187 86 -413 19 -124 -202 -27
$$ packed form
3070C01k21l63P1L97K4r6j43J14J03J87k68l80J38r9P9k09L98j9N3J35r4R1Nj08
3094I6n4Q3j87K93o74j40O16K4j54J74K11l3J65j98p14N05R9j70O0k07K97m3L6
3117H5L7NL37Ql41j5k1j96j8k8J2l6K03R4j10M69j87q3j02J74k58J49k65j84J73
3142i8K9J2J83J08Mk36K15J44j15j84j37k45K53l7L5J28j69m9M74N2m83K8J27
3165C9j15J95k87L4j28J31r5L6M18k07M07j70N4j90m1q1k72L14n14K82L99p3l0
3188A06l7O9L2o4J20j23K53n27K75k19j61J9J7N00k4n51L98J42O4Qm77m3L17j69
3212g5j82K19m9J43k35K58j32QM93k43nNn49M86n55N0K60K92j58k53K94M4po2
3236D7K15k83j15l1l87J26K32L44j20l29O96j07j2k19R1L9j01m99M32j43p8J75
$$ plain form
3258 -27 -246 -52 239 149 -86 97 72 246 92 -337 -208 -280 58 -270 -17 -26 61 482 69 70 84 245 -15
3281 -15 -8 -138 -108 -82 -223 57 327 104 -11 161 147 290 450 -341 -301 -112 76 188 -169 -290 215 71
3303 71 148 198 211 171 35 74 -173 -103 41 -255 -261 10 98 308 224 84 273 -75 -251 29 129 -16 -425 -179
3327 -179 90 162 28 -22 -40 74 349 204 235 -182 3 211 -249 -75 -396 144 -105 -45 349 204 380 36
3349 36 189 -22 -37 37 -248 -292 1 -291 -69 266 161 -36 151 -16 82 9 -251 -447 -38 -454 -16 -104
3371 -104 -319 -158 -223 213 211 407 201 -411 -22 -191 96 36 -83 91 -307 -397 52 234 166 209 143 -71 70
3394 70 -74 -98 -221 1 -242 -180 138 120 493 292 126 -315 -45 59 -203 -147 76 -77 -343 -87 84 207
3416 207 157 153 -108 165 134 -167 -140 -133 -55 -222 -17 -4 -60 -74 358 68 -113 122 278 -126 -35 -322 86 156
$$ packed form
3258b7k19J94K91r0k35J83k5J74j54m29J29p2L38l28K53rQ7M21m13JJ4J61k60
3281a5Pj30L0K6j41K80K70k23j15J72j4J43J60p91M0J89J88J12l57j21N05j44
3303G1P7N0J3m0j36L9k47P0J44k96oK71Q8K10q4j40J89l48j76K80J00j45m09K46
3327a79K69P2j34n0j8J14K75j45L1m17J85K08m60J74l21N40k49O0L94j45J76l44
3349C6J53k11j5P4k85m4K93k92K22L35j05j97J87j67R8p3k60j96M09m16M38q8
3371a04k15J61o5M36kJ96k06o12L89j69K87o0j19J74l98r0M49J82o8M3o6k14J41
3394G0j44k4j23K22k43O2L18j8L73k01j66m41K70J04k62N6K23j53k66K56J71J23
3416B07n0mk61K73l1l01K7PP8j67K05J3n6j4M32k90j81K35J56m04R1k87M08P0
$$ plain form
3440 156 -303 51 -220 46 321 -59 250 326 214 165 -126 -235 -288 113 -291 -74 102 -284 -9 -74 422
3461 422 224 224 45 -310 48 -165 94 -325 -62 -35 137 -23 240 186 274 436 -303 201 149 -123 -458 112
$$ packed form
3440A56m59L54k71K66K75l80L09P6j12m9k91j09n3M01m04K17J76l86K75o5M96
3461D22j98%j79l55L58k13K59m19K63K7J72j60K63n4Q8J62p39N04n2k72l35N70
$$ [...]
8191F3
##END NTUPLES=NMR FID
##END=
