##TITLE=1H_AM_NV169_4
 CDCl3
 8 sc, 
 2.10.2024
##JCAMPDX= 6.0         $$ Bruker NMR JCAMP-DX V2.0
##DATA TYPE= NMR FID
##DATA CLASS= NTUPLES
##ORIGIN= UXNMR, Bruker Analytische Messtechnik GmbH
##OWNER= root
$$ XWIN-NMR		Version 3.5
$$ Wed Oct  2 14:06:16 2024 Russian Standard Time (UT+4h)  she@DPX200
##.OBSERVE FREQUENCY= 200.1318
##.OBSERVE NUCLEUS= ^1H
##.DELAY= (6, 6)
##.ACQUISITION MODE= SIMULTANEOUS
##.ACQUISITION SCHEME= undefined
##.AVERAGES= 8
##.DIGITISER RES= 18
##SPECTROMETER/DATA SYSTEM= spect
##.PULSE SEQUENCE= zg30
##.SOLVENT NAME= DMSO
##.SHIFT REFERENCE= (INTERNAL, DMSO, 0, 15.7039)
##AUDIT TRAIL= $$ (NUMBER, WHEN, WHO, WHERE, WHAT)
$$ ##TITLE= Audit trail, XWIN-NMR		Version 3.5
$$ ##JCAMPDX= 5.01
$$ ##ORIGIN= Bruker BioSpin GmbH
$$ ##OWNER= she
$$ F:/spectra/data/she/nmr/H-F/1/audita.txt
$$ ##AUDIT TRAIL=  $$ (NUMBER, WHEN, WHO, WHERE, WHAT)
(   1,<2024-10-02 14:05:14.10 +0400>,<she>,<DPX200>,
      <created by zg, POWCHK disabled, PULCHK disabled
       configuration hash MD5:
       00 E9 B6 7A A2 85 ED C7 34 08 36 98 17 FE 4E 26
       data hash MD5: 16K
       5E 9D 31 F7 AB 2E FC 00 B4 52 0E F6 B7 47 D2 74>)
$$ ##END=
$$ 
$$ hash MD5
$$ 87 20 75 33 C4 ED EF 6C F1 44 40 54 3C D9 8B CA
##$RELAX= 
##$RELAX= 
##$RELAX= 
##$RELAX= 
##$RELAX= 
##$RELAX= 
$$ Bruker specific parameters
$$ --------------------------
##$DU= <F:/spectra>
##$EXPNO= 1
##$NAME= <H-F>
##$PROCNO= 1
##$TYPE= <nmr>
##$USER= <she>
##$AMP= (0..31)
100 100 100 100 100 100 100 100 100 100 100 100 100 100 100 100 100 100 
100 100 100 100 100 100 100 100 100 100 100 100 100 100 
##$AQSEQ= 0
##$AQ_mod= 1
##$AUNM= <au_zg>
##$AUTOPOS= <>
##$BF1= 200.13
##$BF2= 200.13
##$BF3= 200.13
##$BF4= 200.13
##$BF5= 200.13
##$BF6= 200.13
##$BF7= 200.13
##$BF8= 200.13
##$BYTORDA= 1
##$CFDGTYP= 0
##$CFRGTYP= 5
##$CHEMSTR= <none>
##$CNST= (0..31)
1 1 145 1 1 1 1 1 1 1 1 1 1 1 1 1 1 1 1 1 1 1 1 1 1 1 1 1 1 1 1 1 
##$CPDPRG= <>
##$CPDPRG1= <>
##$CPDPRG2= <>
##$CPDPRG3= <>
##$CPDPRG4= <mlev>
##$CPDPRG5= <mlev>
##$CPDPRG6= <mlev>
##$CPDPRG7= <mlev>
##$CPDPRG8= <mlev>
##$CPDPRGB= <>
##$CPDPRGT= <>
##$D= (0..31)
0 1.2 0 0 0 0 0 0 0 0.06 0 0.03 0 0 0 0 0.0002 0 0 0 0 0 0 0 0 0 0 0 0 
0 0 0 
##$DATE= 1727863513
##$DBL= (0..7)
120 120 120 120 120 120 120 120 
##$DBP= (0..7)
150 150 150 150 150 150 150 150 
##$DBP07= 0
##$DBPNAM0= <>
##$DBPNAM1= <>
##$DBPNAM2= <>
##$DBPNAM3= <>
##$DBPNAM4= <>
##$DBPNAM5= <>
##$DBPNAM6= <>
##$DBPNAM7= <>
##$DBPOAL= (0..7)
0.5 0.5 0.5 0.5 0.5 0.5 0.5 0.5 
##$DBPOFFS= (0..7)
0 0 0 0 0 0 0 0 
##$DE= 6
##$DECBNUC= <off>
##$DECIM= 24
##$DECNUC= <off>
##$DECSTAT= 4
##$DIGMOD= 1
##$DIGTYP= 9
##$DL= (0..7)
0 120 120 120 120 120 120 120 
##$DP= (0..7)
150 150 150 150 150 150 150 150 
##$DP07= 0
##$DPNAME0= <>
##$DPNAME1= <>
##$DPNAME2= <>
##$DPNAME3= <>
##$DPNAME4= <>
##$DPNAME5= <>
##$DPNAME6= <>
##$DPNAME7= <>
##$DPOAL= (0..7)
0.5 0.5 0.5 0.5 0.5 0.5 0.5 0.5 
##$DPOFFS= (0..7)
0 0 0 0 0 0 0 0 
##$DQDMODE= 0
##$DR= 18
##$DS= 0
##$DSLIST= <SSSSSSSSSSSSSSS>
$$ [...]
##$SUBNAM2= <"">
##$SUBNAM3= <"">
##$SUBNAM4= <"">
##$SUBNAM5= <"">
##$SUBNAM6= <"">
##$SUBNAM7= <"">
##$SUBNAM8= <"">
##$SUBNAM9= <"">
##$SW= 24.0689170037331
##$SWIBOX= (0..15)
0 0 2 0 0 0 0 0 0 0 0 0 0 0 0 0 
##$SW_h= 4816.95568400771
##$TD= 16384
##$TD0= 1
##$TE= 0
##$TE2= 300
##$TE3= 300
##$TEG= 300
##$TL= (0..7)
0 120 120 120 120 120 120 120 
##$TP= (0..7)
150 150 150 150 150 150 150 150 
##$TP07= 0
##$TPNAME0= <>
##$TPNAME1= <>
##$TPNAME2= <>
##$TPNAME3= <>
##$TPNAME4= <>
##$TPNAME5= <>
##$TPNAME6= <>
##$TPNAME7= <>
##$TPOAL= (0..7)
0.5 0.5 0.5 0.5 0.5 0.5 0.5 0.5 
##$TPOFFS= (0..7)
0 0 0 0 0 0 0 0 
##$TUNHIN= 0
##$TUNHOUT= 0
##$TUNXOUT= 0
##$USERA1= <user>
##$USERA2= <user>
##$USERA3= <user>
##$USERA4= <user>
##$USERA5= <user>
##$V9= 5
##$VALIST= <valist>
##$VCLIST= <CCCCCCCCCCCCCCC>
##$VD= 0
##$VDLIST= <DDDDDDDDDDDDDDD>
##$VPLIST= <PPPPPPPPPPPPPPP>
##$VTLIST= <TTTTTTTTTTTTTTT>
##$WBST= 1024
##$WBSW= 4
##$XGAIN= (0..3)
0 0 0 0 
##$XL= 0
##$YL= 0
##$YMAX_a= 59874
##$YMIN_a= -69295
##$ZGOPTNS= <>
##$ZL1= 120
##$ZL2= 120
##$ZL3= 120
##$ZL4= 120
##$ABSF1= 10
##$ABSF2= 0
##$ABSG= 5
##$ABSL= 3
##$ALPHA= 0
##$AQORDER= 0
##$ASSFAC= 0
##$ASSFACI= 0
##$ASSFACX= 0
##$ASSWID= 0
##$AUNMP= <proc_1d>
##$AZFE= 0.1
##$AZFW= 0.1
##$BCFW= 1
##$BC_mod= 2
##$BYTORDP= 1
##$COROFFS= 0
##$CY= 11.3945322036743
##$DATMOD= 1
##$DC= 2
##$DFILT= <>
##$DTYPP= 0
##$F1P= 15.6554695791079
##$F2P= 12.8336369535428
##$FCOR= 0.5
##$FTSIZE= 0
##$FT_mod= 4
##$GAMMA= 1
##$GB= 0.15
##$INTBC= 1
##$INTSCL= 1
##$ISEN= 128
##$LB= 0.24
##$LEV0= 0
##$LPBIN= 0
##$MAXI= 10000
##$MC2= 0
##$MEAN= 0
##$ME_mod= 0
##$MI= 1.114404
##$NCOEF= 0
##$NC_proc= 0
##$NLEV= 6
##$NOISF1= 3.799351
##$NOISF2= 2.8
##$NSP= 1
##$NTH_PI= 0
##$NZP= 0
##$OFFSET= 15.70392
##$PC= 1
##$PHC0= -26004.92
##$PHC1= 21.78747
##$PH_mod= 1
##$PKNL= yes
##$PPARMOD= 0
##$PSCAL= 0
##$PSIGN= 0
##$REVERSE= no
##$SF= 200.130013532006
##$SI= 16384
##$SIGF1= 3
##$SIGF2= 2
##$SINO= 400
##$SIOLD= 16384
##$SREGLST= <1H.CDCl3>
##$SSB= 0
##$STSI= 0
##$STSR= 0
##$SW_p= 3612.71676300578
##$SYMM= 0
##$S_DEV= 0
##$TDeff= 0
##$TDoff= 0
##$TI= <>
##$TILT= no
##$TM1= 0
##$TM2= 0
##$TOPLEV= 0
##$USERP1= <user>
##$USERP2= <user>
##$USERP3= <user>
##$USERP4= <user>
##$USERP5= <user>
##$WDW= 1
##$XDIM= 8192
##$YMAX_p= 0
##$YMIN_p= 0
$$ End of Bruker specific parameters
$$ ---------------------------------
##NTUPLES= NMR FID
##VAR_NAME=  TIME,          FID/REAL,        FID/IMAG
##SYMBOL=    X,             R,               I
##VAR_TYPE=  INDEPENDENT,   DEPENDENT,       DEPENDENT
##VAR_FORM=  AFFN,          ASDF,            ASDF
##VAR_DIM=   8192,          8192,            8192
##UNITS=     SECONDS,       ARBITRARY UNITS, ARBITRARY UNITS
##FACTOR=    0.0002076,     1,               1
##FIRST=     0,             0,               0
##LAST=      1.7004516,     0,               0
##MIN=       0,             -69295,          0
##MAX=       1.7004516,     59874,           0
$$ Real data points
##PAGE= N=1
##DATA TABLE= (X++(R..R)), XYDATA
$$ [...]
2032B42k03n46N91k68p65Q99J05q84R76O31m67L0k22l55L63K40j077K37J72L95
2052I4l30J39j28J163l44k72m90J97n04M53k78m08P26L89o23L46L06l27N28k22
2072D15n56O61r0j049K12K42n33J13L88Q0O67N37n99l85N70k04l98l40q96J076
2092h9R5q59L2O35L49L07m6n69K26R29m59p16j63l12k19P45o78L69Q34K04l17
2113B98L35k46n10J30n07o4J64L7j63N95M80o93m6M24J74Q40l70m50o33J38o0
2134a27m83o17O3J375K6j35N9K22M75Q8j244k71Q09n25J98m1l22OO39k94l42O56
2156B15K29l47M41j81m25K36k07o68O91l73%O29J45K42l03m25j50M57m63o49M21
2177d85p4P87J44n02l36R08Q6j14j59j63L17K14l81j043P0K29J67R3J72J30L41
$$ y = [242, 39, -507, 84, -184, -949, -50, 55, -829, 147, 778, 311, 341, 119, -236, 127, 367, -710, -473, -301, 94, -236, -97, -225, 938, 594, 322, -168, 29, -475, -22, -300, -708, 18, 407, -216, 130, 436, 109, 637, 415, -141, 520, 430, -619, -407, -165, -698, -585, -197, -117, 550, 1087, 488, 103, 673, 469, 71, -269, -1165, -89, 6, -853, -821, -186, 163, 470, 424, -145, 81, 1010, 551, -165, -328, -640, -859, -114, -792, -423, 411, 615, 298, 633, 387, -123, 7, -500, -564, -400, -363, -526, 69, 549, -144, -190, 234, 408, 1248, 878, 428, -205, -67, -127, -610, -1227, -1164, 211, 237, 102, 161, 383, 858, 946, -298, -569, 240, -285, -87, -128, -450, -444, 195, -99, -441, 215, 444, 97, 538, 357, -68, 168, -39, -707, -16, -389, -389, 240, 385, 627, 324, -101, -251, 206, -257, -906, -485, -559, 228, 372, -130, -466, 442, 528, 414, 255, 92, 409, 623, 242, -801, -731, -502, -335, -242, -70, 60, 401]
2198D01N80l69j76p6o08J00M0l25J17%J65N54J65q68K46M93r8K68n67o34P82L42
2220E32n56n81M4M74N92j97m96L64L63O5q32l28l76J181k07l46P0K05K37J44l41
2241A1l35K70K97l07k47Q9j95j51N19Q9j05K35m64Q72P84j038l94L94j64l00m53
2262e93m65P21O63l56K29n0m5N97N8q19m06O60j93J17n80j24j34J127k58j79J53
2283A23L42L35o6q19l4J14n92o3K5o0L77N39K56K73l35m63O00Q6o19l08k04l04
2305g97P84l27j49p1O60N91Rm80k26L70J58l96m37l62M41K6q1k61N37N09L77n76
2327B99om6M7K00p81Jl02J46R7K27j9J78J85J99r5K35o19j33N23k9o81O3l46N38
2351a19Q2j49j81L33N68P0R3m50m29k16Q7k63j13K88N32J62k25J11J03m2Q5m18
$$ y = [401, 981, 612, 436, 360, -248, -148, -108, -433, -316, -316, -151, 403, 568, -300, -54, 439, 341, 609, 42, -592, 190, 532, -24, -605, -561, -87, 505, 308, -188, 176, 539, 604, -228, -556, -932, 249, 42, -304, -234, -29, 208, 352, 11, -324, -54, 243, -64, -311, -222, -417, -568, -49, 40, -65, 170, -294, 578, 1362, 324, -70, 324, 160, -140, -593, -1058, -337, 326, -30, 199, 149, 104, 701, 759, -60, -466, 194, 1, 118, -462, -586, -720, 407, 149, -30, 123, 465, 800, 734, -85, -119, -5, -597, -660, -635, -695, -318, 221, 477, 750, 415, -48, 552, 638, 19, -289, -493, -797, -13, -340, -489, -560, 100, 691, 700, 220, -6, 364, 522, 126, -311, -673, -232, -206, -287, -548, -11, 498, 875, 299, 293, 247, 294, 494, -287, -286, -588, -442, -345, -118, -137, 41, 226, 425, 330, 565, -54, -187, 336, 307, -374, -311, -657, -119, -37, -186, -367, -34, 534, 604, 697, 247, -182, -398, -311, -574, -687, -399, 133, 295, 70, 181, 284, 242, 327, -91]
2373i1k19j24M77l91K54p5L05k87N27n8j46L31m44l2J95j42q54L2M32L84R9m98
2395c25O3O45K74n00k82Q1M07k76j78o0l42N63j89k51q3N07N14k60r6M3m22K74
2417A07k08l67J10K60J11j01K26LM87n88K05k24J54k49k32O8L85k40l55R7P11
2438C60l24Q7q2M87k41n8k70n43K70J72o6j71K53K74L55P1o89r9M75p5k75n34
2460f23N52k30L69l55k04M02O39m29j32O90m86L5j18k00j60j77k42O6N18J89k4
2481H0L3L58o7p2n59L12j86J89k59m46J49K80O11p74L78L46J51M8j46n98K07O7
2503A02n57l86M18J96J33J1J56M53K4k01o5o57M53p7o9l50L66P0l31K49N5NM48
2526D46k03j96M52j75l64m14J38L5J18j3J18K74j7J09n0o0k95m08J94k97K07K24
$$ y = [-91, -310, -434, 43, -348, -94, -169, 136, -151, 376, 318, 172, 503, 59, 27, 222, 80, -774, -742, -310, 74, 173, -325, -262, 383, 657, 157, -125, -44, 363, 87, -91, -151, -493, 70, -119, -370, -453, 54, 568, 308, 212, 255, -167, 107, -101, -468, -358, -98, 13, -88, 138, 141, 628, 40, 245, 21, 175, -74, -306, -238, 147, -93, -448, -351, 360, 36, 123, 41, 528, 287, 229, -41, -584, -314, -142, -208, -379, -126, 148, 503, 574, -115, -214, 261, 186, -89, -623, -71, -301, 68, -287, -491, -89, 550, 121, -11, 679, 193, 228, 110, -90, -250, -427, -669, -603, -85, 104, 80, 113, 471, 404, 332, -227, 85, -101, 88, -171, -617, -468, -188, 423, -351, 27, 373, 524, 572, 426, -172, 35, 102, -455, -841, -423, -227, -94, -83, 73, 526, 550, 349, 284, -373, 80, 3, -66, -416, -50, 20, -311, -62, -7, -2, 446, 243, 47, 499, 324, -40, -454, -316, -281, -163, -176, -58, 216, 199, 308, 258, 198, -97, -505, -311, -608, -401, -177]
2548a77J0K32j76L97j47J25k75L82J30l24l08K8m86N31l63O3L79J10J64n4J36
2569C77j21L40l92l57j94N36o20k80M70j8L60J02Qj43PK48k13J4o29J36J64j52
2591c57K6M30j89J98M7J75J63J12n10k01M17o32p2N1j86L36N02m20J25O74p11
2612b2J13O5m39J56l6j58M6j73O56j60P9L14j5j27k16j69K41P9p66N2p4J48M40
2635C4Q7k79L43j20K09q0p3m3L72p91n97Q70q9j08K44j8K0K11L83m30J30M5l13
2658Gp8k34k82M11M3l06M82J70j38L38j88j48J48n6l88J04j1j0K07j64r0M90J24
2681D31m60J55mm3M4Ll91M69m4o92O41j09p6K13nK60N1O3o83L08k97r6R1K9p4
2706b16M42J3n29O88K81l93Q9l82l17N08j02l89J00r8J12K43K89j55K38J49n55
$$ y = [-177, -167, 65, -111, 286, 139, 264, -11, 371, 501, 177, -131, -103, -589, -58, -421, -358, 21, 131, 295, 241, 377, 256, 596, 204, -153, -347, 189, -431, -711, -241, -259, 101, 203, 211, 68, 75, 323, 110, 124, -505, -369, -205, -357, -331, 99, -90, 108, 155, 330, 493, 605, 95, -106, 311, -321, -393, -342, -528, -192, 310, -110, 15, 689, -22, 91, 156, -283, -127, -163, -321, -275, -448, 208, 48, 127, 441, 426, 299, 83, -86, 155, 234, -532, -480, -554, -406, 34, 121, -158, 185, 65, 274, 194, 121, 78, 450, -341, -938, -68, -157, -265, -21, -39, -19, 192, 575, 145, 275, 320, 7, -71, -305, -587, -176, -133, -439, 43, 213, 75, 413, 225, 77, 225, 169, -219, -115, -126, -136, 71, -93, -183, 307, 431, -29, 126, 122, 79, 123, 126, -265, 204, 160, -532, 109, 0, -76, 137, 132, 392, 443, 506, -177, 131, -166, -262, -171, -142, -216, 226, 239, -290, 398, 679, 286, 375, -7, -324, 184, 82, -307, -207, -305, -193, 50, 339, 184, 422, 571, 16]
2727A6N3j86p3l4j34n8N28J17l86O82m80K68j59K12p50J45L72p37L02N35l53J27
2749Gj29j88P31K24n07M5L17n48K57l69j82k92P14l74K61K28j39M88j68l21q6
2770c1K92m14m25O99o08M02l96j27J44O82k5j91K90j48j73j18j87L22J9k88j80
2791d61O70j93M8M89o12J78O58p59l99J9RP1M59n76j26O68k99J98K62r1Q8L32
2813F33n69l25L76o52r6J20J76K00L33j75j5P24n86L46j13n32L92J02p19L1K79
2834g0K85n90L24MM68L70p88n13J220m63o27K22l57O65l0j4l90L56J69J22J2k33
2856A42q4o1r7j5J61l86N13k31j73K18M44l38R6K31o76K78j45J5L2J31m63K0N57
2879A69j10J69p9k91L36K48o16l01M12J10L6O7K27o65O48J9o24L29P0NQ3l79j50
$$ y = [16, 69, -117, -190, -224, -358, -416, 112, 229, -157, 525, 45, 313, 154, 366, -384, -239, 133, -604, -302, 233, -120, 7, -122, -310, 421, 645, 138, 183, 500, -48, 209, -160, -342, -634, 80, -294, -33, 195, 56, 544, 376, 55, -31, 261, -153, -578, 121, -487, -85, -481, -608, -464, 218, 193, 2, 292, 144, -29, -147, -334, -12, 7, -281, -461, 209, 16, 64, 553, -59, 119, 777, 18, -381, -362, -353, -282, 177, -399, -525, 143, -156, 42, 304, 213, 301, 633, 64, -261, 115, -537, -633, -513, -337, -137, 196, 21, 6, 730, 144, 490, 377, -155, 237, 339, -380, -349, -70, 215, -375, -51, -47, 421, 791, 3, -510, 710, 247, -380, -158, -515, 150, 120, 106, -284, 72, 241, 363, 375, 142, 58, -3, -100, -115, 46, -340, 173, -58, -231, -13, 431, 93, 189, 420, -256, 22, -123, -108, -76, 55, -408, -388, 169, 59, 228, 149, -142, 194, 442, -174, -475, -63, 47, 83, 150, 377, -288, 360, 379, -245, 84, 154, 159, 242, -137, -287]
2902b87K44rl00M41k38J42L50J63p00K04j42j44R9O1j49J97K46j22P2j82M09M6
2924D01R2j97m21n7J03K16k29j39K3J66L73n7k10q8M92j39j49j12m62M07j53k18
2946c58j42L95N03J09k21j96k40L37J42k58l20k67L61k97M20k95K58R9R3K76j00
2967B99j02j0j76K92k66m28k91L01K45P2l18L67M09J17J2p36Q0K38M0m63q5l65
2989g68O00L27k21l31L07N35o5J86m99R8k98l1k75K42l32O3J91L51J54N01m51
3010B84K17O5o46j43k99L46J78j03n39J99M56J73m01J48L08K96Jm19q3j5j2k67
3032b56P8m63O62J42jO4K58k95j16l0J85o26M6M2L63K19k50J43j38J31R3J9l23
3055e3L6K9J07j43l48J57K1M00l21j14M95J32l15k94K57k68L65l89j72J27K30
$$ y = [-287, -43, -52, -352, 89, -149, -7, 343, 506, -194, 10, -132, -276, -177, -116, -265, -68, 178, 56, 128, -54, 355, 401, 493, 296, -125, -182, -79, 137, -92, -231, -208, -42, 331, 274, 64, -24, 468, 329, 180, 68, -394, 13, -140, -358, -500, -105, 398, 507, 286, 90, -150, 187, 329, 71, -249, -516, -155, -452, -32, -327, -69, 30, 123, 399, 299, 197, 187, 11, 303, 37, -391, -682, -381, -136, -64, -382, -15, 394, 511, 523, -213, -133, 105, 145, -318, -403, -768, -168, 159, -62, -393, -86, 449, 384, 570, 71, 169, -129, -160, -435, -193, -525, -462, -271, 80, 234, 735, 284, 501, 566, -80, -223, -522, -176, 2, -101, -640, -441, 15, 188, -213, -65, 243, 539, 540, 121, 38, 23, 11, -256, -178, -641, 21, 163, 162, 226, 484, 189, 73, 43, 228, -398, -352, -310, 53, 272, 22, 165, 27, 158, 251, 270, -53, -17, 12, 119, -24, -372, -215, -194, 206, -115, -229, 266, 398, 83, -211, 46, -222, 143, -246, -418, -291, -61]
3076f1L64N7l06q1%L28k76j2J65j4k70K71m32Q8m5R6j39P14m39N3k64L14K9k4
3100A16l62J39L2K28j78R7K0N1K35m52j2R3L80m02J90n12M53p3m04L01L00k15
3122B5L6k60K25K42l64O3K06l64j59M45k65N0J98J79j13j89J16j39N1o2n7J21
3144a5mj99K00J64j66L4K0K36N9L2l80l01o5l0J05o1K70K62k73K07k97K13L38
3167C49J1m76l9J60j8l39J16j2l8L90p0K91J58K83n48j26M7k70M6k79j01M7N67
3190A49J0j33J37J88r3j3j56k69L97m32j59J34k29L82P3P0k28L77J33R4l42l5
3212E5p0j44j97J79L14k6p3m63N99k2J3l20N26j43p5l21J29R0J53k01m58P70j90
3235A25J21o4N9j76P4L7m17J31j8K00j80K23k26nK79n3K13K3k33J15j17l47K33
$$ y = [-61, 303, 360, 54, -27, -27, 301, 25, 13, 178, 164, -106, 165, -267, -179, -224, -128, -267, 447, 8, 61, -203, 111, 140, 116, -246, -107, -75, 153, -25, 72, 92, 143, 378, -74, -86, 7, 387, -15, 175, -337, 116, 43, -361, -60, 240, 25, 61, -199, 26, 268, -96, -33, 173, -191, -350, 95, -170, -120, 78, 257, 144, -45, 71, -68, -17, -79, -136, -15, -19, -218, -18, 146, -20, 14, 34, 270, 329, 361, -19, -320, -385, -415, -310, -371, -101, 161, -112, 95, -202, 11, 349, 360, -116, -155, 5, -13, -352, -236, -248, -286, 104, 34, 325, 483, 766, 218, 92, 139, -131, -85, -364, -465, -418, 149, 159, 26, 163, 351, 258, 245, 89, -180, 217, -215, -374, -240, -469, -87, -14, 56, -172, 205, 338, 432, 90, 55, -15, -159, -356, -177, 137, 111, 38, -425, 174, 152, 165, -155, 371, 228, 153, -168, -39, 51, 204, 3, -455, 315, 125, 246, 182, 241, 65, 139, 176, -241, -110, -128, 72, -108, 115, -111, -116, 163, 110, 323, 346, 113, 228, 111, -236, -3]
3258cj88k16K06K32K5R2k30j13L15K8k60J3J97m38J27j38l30L75M85j80M65Ol55
3281A15J6J98k10o9k56k32L16K90k50J00J30M3l8k53K75k47kJ3M7j91J73j19K49
3304I8l02K53R2K27j0k65k30L13k50r2J55j35P4K3J58J13J96k85J76m16J17n9
3326d9n3J76n2k65L54k69O5K0%l8M77j38k75l1j1k75L27j67J28J70l36J39J59
3349E6k43M44K43m38K8j03k44L66j11m1j91M87j96j62J11J96l24N34m67o0r3J64
3371d4k70o5K22j20O9M40J67m9n5j82K12n36M4n2M5O6o8j45N06k6m6l32N27N2
3395C60k92J69j38k16N5Ll1j90N57m63K85K43N3l01P5k52L76m57j3r1K42M0K27
3418B41k45j35K16J18j54n3m4K24J45k51k04K09k05j7J22L08l66K01M73m02j21
$$ y = [-3, -191, -407, -201, 31, 56, 148, -82, -195, 120, 148, -112, -99, 98, -340, -213, -351, -681, -306, 179, -1, 464, 470, 115, 131, 329, 119, 50, -206, -438, -122, 168, -82, 18, 148, 191, 153, -100, 175, -72, -74, -61, -14, -205, -32, -151, 98, -204, 49, 141, 368, 358, 93, -137, 176, -74, -166, -11, -146, -72, -49, 109, 222, 418, 133, 309, -107, 10, -49, -102, 74, 22, -243, 111, -158, -93, -73, -73, -111, 366, 228, -47, -78, -89, -364, -37, -204, -76, 94, -242, -103, 56, -187, 257, 500, 62, 90, -13, -257, 109, -2, -43, -234, 253, 57, -105, 6, 202, -122, 412, -55, -115, -208, -44, -314, -379, -157, -277, -208, 232, 399, 350, 295, 113, 325, -211, -167, -219, -174, -108, -176, -321, 185, 159, 113, -219, 308, 360, 68, 237, 99, -117, -62, -59, -90, -280, 277, -186, 99, 342, 395, 94, 169, -83, 293, -164, -177, -268, -26, 14, 241, -4, -139, 77, 195, 41, -12, -56, 168, 313, 62, -142, 67, -138, -155, -33, 275, -91, 110, 583, 181, 60]
3439F0j62l7l74L42j85K96N41m96RK05k76J58J29n2l26L16m48j74P7J25O2k00
3461d10J75L62L7J4j83M8L93o57K60j50J26J22m99K09Q0L14j46j10Q4R4o9J15
3483B09l74K37k44o2J58oj86K90N1k0L34J27n01k17K86m6q7k52J14J87j20L00
3505A78o5O6j67p9K95j91j97M5K84k00l62M91M43q46N16J21r0j61L8n1j34j37
3527b03j96K45O0L26P4k60J06K16k65J93n51K68K33m11O3J64M2j96M6o3N5L2K26
3550B04J01l27j21M68k96o5j41q4J68J46k97m0M90k29j8J86j60L0Q6l29K5J7n2
3573b38R2J58P7n5O5o24M73O9K15k26J1n7K6k76p2K10K81m6j22l8L64m2j80L93
3597D58p40L68j30k54K61j16L4M42r8o5R5J10l76P5n3n11M49J94l73j3lJ28L58
$$ y = [60, -102, -139, -513, -171, -356, -60, 481, -15, -6, 199, -77, 81, 210, 158, -168, 148, -300, -474, -397, -272, -210, -410, -235, 127, 164, 178, -5, 43, 436, -221, 39, -111, 15, 137, -362, -153, -73, 241, 95, -15, 69, 163, 94, 209, -165, 72, -172, -234, -76, -82, -268, 22, 73, 53, 387, 514, 13, -204, 82, 36, -51, -303, -189, -2, -122, 178, 113, 179, 12, -67, 228, 37, -160, -115, 169, -31, -393, 98, 541, -305, 211, 332, 242, 81, 119, 68, -66, -203, -399, -154, -94, 232, 306, 46, 152, 368, 103, 296, -255, 13, 246, -165, -102, 62, 104, -92, -46, -109, -54, -22, 204, 305, -22, -143, 325, 29, -36, -177, -261, -93, 53, -244, -284, 206, -23, -41, 145, -15, 15, 101, -228, -203, -186, -238, -146, 12, 89, 34, 99, -525, -52, 17, 232, 6, 17, -40, -14, -290, -362, -152, 129, 83, -39, -77, 287, 245, 65, 458, -282, 86, -44, -298, -37, -153, -119, 323, 225, 160, 255, 365, -11, 64, 11, -500, -51, 143, -230, -243, -246, -118, 240]
3620B40P1q9J64m40J94j22j79j29L84M3m37O43k70j11M65j84m81K25lK15j72n
3642B2k66j62N92j42j17k5R5J33J22l54J38m3j67J1j29J13L3M11o1J36l82j61
3664b03O06k60j2lk12k2K35k44N2k30J88m9M00k22j99J07K16l3l83K0j51K1K02
3687a76J55k21K96j7J10k92M22j62q6r9m5q2J88l58J98j30L42P7n5L24k63j49
3709b3P8p9J45q3k81m2p0L13J08j02M11l72R5r0J29jk06J19j68j58L26QJ32m27
3733b38J87M5l5J50J9j84J94o2q4j12l47M51O3K05k88L06Q2m07J38k57L12l04
3755a66K8R9M8k15j9M1K28q6j25L25j74K07Jm28K4K4j79N75j29j57J91L7j35j96
3779a81K61Nn4k9P8n03O02l3j94J81K8j61k2j9O6P4n42O11j54k30J21l77P5M80
$$ y = [240, 311, 222, 386, -54, 140, 18, -161, -290, 94, 137, -300, 343, 73, -38, 427, 243, -238, -13, -16, 199, 27, 22, -244, -406, 186, 44, -73, -98, -3, 130, 252, -102, 36, -7, -174, -163, -292, -179, -146, 265, 204, 340, -42, -203, 403, 143, 131, 128, -84, -106, 129, -115, -63, -293, -105, -154, 246, 24, -175, -68, 148, 115, -268, -248, -399, -378, -176, -21, -242, 54, 37, 147, -145, 277, 115, 29, -70, -115, -197, -9, -367, -169, -299, 43, 120, 65, 389, 126, -23, 55, -24, 121, 38, -243, -285, -355, -42, 66, -36, 375, 3, 98, 8, 137, 136, -70, 49, -119, -277, 49, 57, 189, -238, -51, -6, -41, 109, 128, -56, 138, 76, -8, -120, -467, -16, 47, 252, -36, 270, 352, -55, 83, -174, 138, -166, -138, -39, 9, -206, -225, -184, 44, -42, -167, 158, -16, 191, 192, -236, -212, -188, -367, 208, 79, -78, 113, 150, 15, -181, 80, 85, 31, 2, 80, -423, 179, 146, -48, 133, 161, 0, -22, -41, 25, 99, -443, 168, 14, -216, -95, -472, -397, 83]
3803H3j42L97l50k0J23K94k98k16J59k06K52j55q1R4N08k65m8J56l03L81l99J43
3825A07k99O5M22l44J45J59l73J49j21L61l98J77j68j05K50l5j94O8K1l16M17
3846a2J07k43N75l85l26K50O5O3k7n09J43l1J95k64P00o2m00L16k16J44J53p6
3868A60l27L8J7q2kM53j31O0R9j29k73K71j75J98j32j62j75K81j77K4L14k83M97
3891C64k03K5P9k85RK51o23K85K62n31P6J18M60k03On0K44O3l58m9j79M3J58p3
3915a11q4K43K1k14J17j43L30J8r2l50P2K36o2N0J07k80K74o9J2Rj65L49n63K08
3939h7N0j44L64l72K16l20L78p4J14q4J92m20N03k33j11J17j10l51j02N30M5J72
3961B73l96L58m31K88l47J75o6r7K39k57K47L8j01oJ69J0r9r5n2K32j35k00rJ1
$$ y = [83, -59, 338, -12, -32, 91, 385, 87, -129, 30, -176, 76, -79, -160, -66, 442, 177, 129, 285, -18, 363, -36, 107, -192, -127, 295, -49, 96, 255, -118, 31, -90, 271, -127, 50, -118, -223, 27, -8, -202, -134, -113, -429, -12, 95, -148, 427, 42, -284, -34, 31, 94, 67, -442, -299, -330, -135, -399, 301, 239, -161, 155, -61, 83, 236, 160, -167, -129, -112, -194, -196, 257, 126, 186, 285, 156, -117, 154, -21, 177, 45, -117, -292, -11, -188, -164, 150, -133, 364, 161, 186, 265, -20, -11, 240, -383, -98, 164, -367, -291, -173, 287, 84, 90, 40, 284, 347, -11, -60, -239, -196, -38, -111, -195, 48, 69, -145, -28, -171, 159, 177, 85, -265, -193, 43, -19, 31, 138, -142, 132, 63, 75, 84, -81, 268, -295, -87, -37, -181, 183, -189, 27, -293, 85, 11, 125, 41, 233, -187, 316, 83, -28, 89, -21, -372, -474, 56, 101, 273, -123, 235, -196, 92, -255, -80, -146, -243, -4, -261, -14, 24, -77, -83, 86, 96, -3, -98, -150, 82, -53, -253, -262, -251]
3985b51J76k58K26P2l1K18n8L4k87K14k95R4J34m79J96M28k01K76k83j07K37j30
4007g5n5J25q8q3L66l24K98n32KK70K82k50K66J8j66K15m44K76k19k3J36o6K3
4030d8p4q1J51n7N9L95n00J65k04M67l79J75k62L78j80ml0K32o7j96j87L04m35
4053c78K70j22J2O0K59q4L51k78P6l1j45M15o01L04J01l22k3R4O9mK50l46J71
4076I8j13K47m8Q1l41q1K38K17l47k91L09J96n0k49K94j09j30J00j43M7l9O4r4
4099a44p3Q8n2K31N9l6p6J88kj33Q8l2k11R1N8l05p5L08Qk6p3qL13k84k79K14
4125a63Nm3Q4j39K96j67J16J34q0J10R7j41O0k22R6k74L10n6q4J78N7K43j34m07
4149a24J55Qq1R9j34j27K56k55L76o9j29J22j59J87J00j63l79K66K18q7j95k4
$$ y = [-251, -75, -333, -107, -35, -66, 152, 94, 128, -159, 55, -240, -146, -12, -491, -295, 133, -68, 208, -75, -182, 55, -75, -130, -5, -93, -176, 190, -134, 164, -368, -366, -96, 186, -64, 202, 220, 54, 269, -175, 101, -118, -141, -5, -71, -48, -122, -203, -52, -109, -50, 345, -155, 10, -194, 273, -106, 69, -193, 185, 5, 1, -29, 203, 136, -60, -247, 57, -378, -108, -230, -218, -158, 101, 17, 368, 90, 166, 135, -10, 405, -196, 108, 209, -113, -136, -42, 27, 23, 273, -73, 98, -15, 232, 184, 265, -76, -157, 81, 298, -49, -340, -31, 165, 115, -134, 160, 51, -79, 21, -122, -75, -114, -50, -144, -217, -129, -181, 50, 109, 73, -3, 185, 183, 50, 138, 106, -105, -14, 44, -261, -336, -28, -20, -46, -119, -127, 186, -98, -377, -163, -158, -201, -117, -256, 40, -127, -11, 123, 43, 153, 250, 109, 169, -53, 43, -231, 79, 23, -61, 117, 174, 417, 283, -124, 31, 39, -42, 57, -77, -204, 52, -203, 173, 104, -25, 97, -62, 125, 225, 62, -317, -51, 167, 80, -115, -139]
4171a39M3K66j42L9R1j1k05J49k25L40m01Q0P3j6J95p5K23k46J13q8O7r9J02j55
4195b1l62M73l05K24p5R7K1l42K51j25J68Q5p9m34L71m3p4nl02L16K84p4j54M40
4219C35m84L37j46j41j5j05J18j64K51k8J55J2n7q6j5M1l50Q29n16mo6koJ79k29
4244a57K48j21J35l23k3L70k11l2K40j79k7L05L2j34m4J67l10L5J09j85L76l04
4266c3k05K92k09L76j94K13l79K14K17l34MJ00M3k73j26K09m0N0J8J72n6l21N86
4289C24m05M26o3m70j33K65j06J68P2k41Q9J99j01j52M7K49j65o7k8J51j63j35
4311b39M2J15K0P1o8O9j57K19k4J27m93J61K30k61j47J98J07jK48j94J26M4k23
4334c0j62K48J37K1l88J88K5J22o7j69J79o4K69m73K81k49L9J7q1j76M11p4P5
$$ y = [-139, -96, 170, 28, 67, 158, 147, -58, 91, -134, 206, -195, -115, -42, -58, 137, 62, 285, 39, 152, 64, 131, 32, 134, -21, -383, 90, -215, 9, -66, 31, 52, -290, -39, -164, 4, 89, 10, -424, -53, -96, -170, -175, -477, -161, 123, 49, -105, 335, -149, 188, 42, -99, -114, -219, -101, -265, -14, -42, 113, 125, 68, -18, -33, 8, -342, 487, -29, -33, -99, -101, -107, 72, -157, 91, -30, 105, -218, -241, 129, -82, -114, 126, -53, -80, 225, 257, 123, 79, 246, -64, -29, 80, -105, 271, -33, -238, 54, -155, 221, 27, 240, -139, 75, 292, -42, -38, 62, 105, -168, -294, -85, -125, -75, -57, 115, 59, -262, 324, -81, 345, 282, -188, -321, -56, -162, 6, 78, -163, -74, 125, 24, -128, -81, 168, 3, -64, -92, 59, -104, -239, -197, -82, -62, 9, -59, 10, -147, 72, 48, 175, -318, -157, 73, -188, -335, -137, -30, -31, 217, 23, 149, 193, -30, -192, 56, 193, 214, -174, 14, 39, 161, 94, -75, 104, 40, 309, -164, 117, -132, -93, -76, -157, -333, 78, 4, 79]
4357G9j05J9jK48Kl30K67l85K65l04k8J32j30L81K0k84K84O8r3J02k29j27k74
4380d23J7K94R9k0k85L54p3J0oK54j9j47o3J95l14J35j25k6J92n3J86K23k73k69
4404a37P0K35J01k83j43J79K8m17L51L8K49k73j08J63K7k50K68l34J54k58K24
4425a16j9j71K92J93l05R4K97k37n1j43N5J45j28P1j00J19J06j0l11JM11j69K07
4448B31q4l24K39k06J52l6o4o9R7K12k79N75m15n8L79m11j09R7l49L95j76k8J68
4471f3J13k8k3j7N9L1O8m8j22J57j09L5j64K1K01k28L78l50M54l07j96J01J81
4494A44K36m17J43n8l84K05M02l90L20k79j22k01M02m6J76ol34K88M6J92o05O27
4516C39k14j46j45J24J61m08M93n70K54J25K69k46J76q6m06N14P7j92j17j77K70
$$ y = [79, -26, -7, -8, 240, 242, -88, 179, -206, 59, -245, -273, -141, -271, 110, 130, -154, 130, 198, 105, 207, -22, -149, -423, -406, -112, -13, -33, -318, 36, -37, -27, -33, 221, 202, 55, -8, 187, -127, 8, -117, -143, 49, -4, 182, 405, 132, -137, -67, 168, 269, -14, -157, 22, 50, -367, -16, 22, 271, -2, -110, 53, 80, -170, 98, -236, -82, -340, -116, -135, -306, -14, 179, -126, -32, 265, 28, -23, -166, -111, 34, -94, -23, -123, -4, 102, 92, -219, -218, 193, 24, 231, 147, -177, 62, -144, 8, -28, -92, -161, -64, 148, -131, 444, 29, -29, 350, -61, -170, -73, -422, -27, -203, -231, -63, 50, 22, -1, -18, 41, 72, 140, 92, -30, 127, 18, 53, -111, -90, 111, -117, 261, -89, 365, 58, -138, -37, 144, 380, -37, 106, 48, -336, -131, 271, -119, 201, -78, -200, -401, 1, -45, 131, 125, -209, 79, 125, 317, -288, 339, 125, -21, -166, -42, 119, -289, 204, -366, -112, 13, 282, 36, 212, 126, -280, 234, 311, 119, 2, -175, 95]
4537I5l4j17j01J71j29K11K04k33M1j45r5L23j30K49o42K05l6n2n0N53k01Q7l0
4560A44p8k54J49J70l05J41m4M7K0M3J27k11J07n4K46j92J29r1j56R2o2j31Q1
4583h2j63J33n2j3J79J25k49M18k08p9O3q8j56K90Mnk36K19j60o5L34j34Q1oq0
4608G0k35J52j27m09J89L15J52l27R1J98K28l38r2P0J40j53J17j6L5l6j5O5m7
4631B7j18j9N56m71Qo4q9n8L86m5Pk85K87o0l72L57K37l86K32M9j68k25O2L52
4655B00n64M21k02J86K65j08k81j5J84o9p7r9P7J68n6R4j43oL60m65M34m65J57
4678dK21j99J99k72N5O1K00n1j08k98L30j91L00l61L65l24J12R5k90R0K01n6j59
4701h4L4K06m0k1l85L37K47j78l65r4mN88k69j98O79o43K68N3k42J40K15Q1l28
$$ y = [95, 61, -56, -157, 14, -115, 96, 300, 67, 108, -37, -132, 191, 61, 310, -332, -127, -163, -215, -265, 288, 87, 174, 144, 66, -188, -39, 131, -174, -33, -77, -30, -10, 33, 160, -51, 56, 2, 248, 56, 185, 94, -62, 30, -32, -163, -82, -245, -112, -164, -177, 2, 127, -122, 296, 88, 9, 72, -16, -172, 118, 122, 117, -119, 100, -60, -125, 209, 75, 156, 150, 70, -165, -13, -140, -549, -360, -45, 107, -220, -129, 69, 297, -41, -133, -63, 77, -76, 41, 25, 60, 24, 9, 74, 27, -91, -110, 446, -25, -17, -81, -170, -228, 158, 113, 120, -165, 122, 62, -310, 47, 284, -102, 130, 179, 11, -214, -152, 200, -364, 57, -145, 41, 306, 198, -83, -98, 86, 17, -60, -159, -82, 86, 30, 124, -19, -25, 335, -130, 304, -161, -4, 217, 18, 217, -55, 0, 61, 261, 210, 102, -196, 134, -57, 243, -118, 247, -77, 35, 130, -160, -70, 131, 75, -84, -50, 156, 116, 95, -290, 47, 294, 116, -249, -343, -347, 241, -28, -226, 453, -190, 78, 131, -111, 29, 244, 325, -3]
4724cP0j67j88L62J36m82K35M28l57L96l98J08j86PJ50j43N5j5J37J05l20K31
4746A61kl94M70l77l4M34m27j34K19K1q4M66l50K90l04J87j70r4j00N6J00l82
4768d48M39j7q9j8J01N9k73J50J18K26l50K41l10K47l1o7K41m51L28q0L8k23L15
4791A46O1p2j51J42j84J24rM0m0L09N4m92L13k3o61M00k4p0J67j26J53M8q3j16
4815i4Rj43K20P3K75n70L32k51J11K42j32j93K91o8N0Ok62K47j62j99J31r8K76
4838I1j08q2M5K38J54k08k33j46O76l35K8k10K92k15j76L65k67K07p5j84L54l80
4860a69K53K18k80Jk02O6n04O63k27J62k30K32J7N1j28Q7j7l14K36J29k62J18
4882a00J66j04j51o6M37J2r1j73K38K37n54K35q4Q0J71l81J80qj29l4j04J37J09
$$ y = [-3, 67, -100, -288, 74, 210, -272, -37, 391, 34, 430, 32, 140, -46, -39, 111, -32, 23, 8, 145, 250, -70, 161, 159, -235, 235, -142, -176, 258, -169, -303, -84, -63, -147, 319, -31, 259, -45, 142, -28, -122, -222, -166, -66, -448, -9, -26, -115, -133, -32, 27, -246, -96, 22, 248, -102, 139, -171, 76, 45, -22, 219, -232, 96, 16, 54, -169, 146, 207, 135, -16, 126, -58, 66, 57, 97, 57, 366, 420, -72, 241, 218, -443, -43, -67, -137, 30, -96, 57, 105, 22, -94, -85, -228, -8, 65, 340, -230, 102, -149, -38, 204, 72, -121, 170, 102, 152, 158, -104, 143, -19, -218, -87, -185, 91, -17, -99, -54, 184, 338, 130, -103, -249, 427, 92, 120, -90, 202, -13, -189, 176, -91, 116, 41, -143, 211, -169, 84, 302, 22, 23, -179, -113, -617, 46, -181, -19, -249, -17, 0, 51, -77, 10, -7, -321, -85, 44, -218, -100, 66, -38, -189, -255, 182, 194, 103, -70, 168, 405, -149, 86, 2, 82, 253, -128, 52, 44, -85, -119, -223, -86, 23]
4905B3l84M87o0q1J92J01k05j3P3j12K5J6K3p7j78J60K37m27N6k12M01J76l34
4928a13K41J77M2j57j78J10r0l71J61L99j06k98K90L83m06Q4j36N2p2J04j91r5
4950a70k3q4K98k21q3J97K42j61j01J75pQ7J0n8K46m76K6j2K72K2n14L25k62J75
4974i7K51k21o1L78o32L01j50N5L63k89K5K2K71k65J92J25j99j0o5K2j30K52j48
4997a0l4l86O64j57n3j25j81J23N0rk9o2J82R4k46K93l47M53r6k31N18n61j01
5020b51K31j4r6l3Q8J82J17j93j75J70K61k14o4pk3K97n00J96M9R1j60K57l3l08
5044a32K13l69K32N7R1k95J13j10J32j4L15k70J3p5N5O4N3k13J53j20p4J85L22
5067C26l95K8j93L04p0j14L95j57j0J83k65k8J49k49P4j28K15j52J99k22K4j42
$$ y = [23, -361, 126, 66, -15, 177, 278, 73, 60, 133, 21, 46, 62, 85, 8, -170, -10, 227, -200, -144, -356, 45, 221, -113, 128, 305, 347, 190, 12, 122, 32, -339, -178, 221, 115, -183, 107, 490, 84, 168, 32, 84, 12, 116, -75, -170, -193, -277, 21, -200, -283, -86, 156, -5, -106, 69, 62, 149, 159, 101, 347, -129, -103, -115, 157, 179, -335, -10, -272, -97, 154, -67, -128, 250, -382, -81, -231, -176, 187, -102, -77, -55, 216, -49, 143, 268, 69, 59, -6, 16, -114, 138, -10, -44, -430, 234, 77, 24, -101, -282, -159, -109, -118, -147, -209, -27, 67, -179, 114, -233, 220, 124, -107, 411, -150, -251, -20, -34, -130, -163, -75, 107, 224, 31, -144, 26, 287, 73, 9, 2, -21, 276, -224, -28, 21, 112, -48, 209, 176, -132, 81, -288, -56, 1, 92, -203, -90, -200, -68, -82, 233, -37, -24, -99, -44, 20, 73, -140, 13, -107, -181, 4, 326, -69, -41, -234, 70, 0, -114, 281, 124, 114, 297, 32, 4, 153, -96, -22, -150, 65, -87, 112, -110, -86, -228]
5089b28K23j83M31j44K0l08n8K05q2L21j36P1j69j93L69o6j82J90r9K2J45k37
5111h8N8L02j37j59P9Jk89K10K5j12J7L2K3k6K15m3QKj74k73K93O5o5j89L01J8
5137I4N0k15l03O61l66j11M92j93J21l19J02k29M12M6j29j3k75M37j42k25L67
5158B62l91K41j87J54J53j23k41Q3j19j5K15kr1L02n0n8j78r2j10J80o3l09O20
5181A81k05Q4m6k61M22k14J32j57K60m89j5L17k6L0M1j38K49NL8k86K77j97pJ32
5205A27j52J56j41l26L21J11k50l1K96m12J43K11k38L32P9m04K09l63J28K96K3
5226A15j14K06o63P07k18J93j59J08j88j31Q3J73J67k73K64j46J4k20p4N5J25
5247B4J64j23l4j99L67j65p3j57j6J94L7j10J16N23p14k3Q2M6K45k90o1j15K15
$$ y = [-228, -5, -188, 243, 99, 119, -189, -247, -42, -124, 197, 61, 132, -37, -230, 139, 73, -109, 81, -18, 4, 149, -88, -30, 272, 135, -24, 55, 56, -233, -23, 2, -110, -93, -61, -38, -64, 151, 108, 116, 118, -56, -329, -36, 29, -36, -225, 76, 94, 144, -71, -374, 287, -79, -190, 302, 109, 230, -89, 13, -216, 196, 242, 113, 100, -175, 262, 120, -105, 262, -129, 112, -75, 79, 232, 109, -132, -49, -168, -183, 32, 30, -61, 241, 191, 133, -45, -137, -247, -67, -130, -439, 181, -24, 60, 14, -247, 175, -39, 93, -64, 196, -293, -308, 9, -17, 13, 54, -84, 165, 170, 208, -78, 199, 2, -5, 127, -25, 131, -10, -336, -15, 96, -154, -185, 111, -301, -158, 53, -185, 147, 226, -178, 31, -332, -204, 92, 115, 1, 207, -456, 251, 33, 226, 67, 175, -13, -144, -61, 112, 279, 6, 270, 124, 138, -82, -156, -101, 24, 188, 65, 31, -168, 199, 34, -39, -196, -212, -18, 19, -91, 25, 548, -166, -189, -107, -61, 184, -106, -167, -282, -67]
5270f7q1p8K49j13k7L15k48j30P3j8K30K58m20L0k11N19k7l11J24J26k47K30m58
5293b82N09j08m02N92j13J47m03N6M4K09m87J87K29l09L19n50J86K04K04j63P6
5314A45o0Jj02O1j22J39j20J09k17K43Q2J41j18p6j17M5J07k80K64o00N61j78
5336i2p5J06l35M07P2k26P1J01k08K77P8lR8m16L75k8o8K33o73N15J48k81l17
5359b41M48l14k71K22J67O3l66J05M27k85J87OK3j37K01j33l08J2J60L13m32L8
5381a15k74N74j76K10r0j3m4L8j01pPj38L62m55J39q9K65J84j48l19J6J03J07
5404C6M8m0K15l04k6j5K35m14L83k61k31N32k3j41K01j44lj39r4K46J4k5L3k08
5428a25j27O45m29J39k80L93j4k43N0J94l44j15M1M14m77J04K25p7N3n35P29m7
$$ y = [-67, -148, -226, 23, -90, -117, 198, -50, -180, -107, -125, 105, 363, -57, -27, -238, 281, 254, -57, 67, 193, -54, 176, -282, 227, 119, -283, 309, 196, 343, -60, -4, 40, 249, -238, -51, 178, -131, 188, -362, -176, 28, 232, 69, 145, 85, 86, -16, 45, -77, 62, -58, 51, -166, 77, 159, 300, 182, 106, -11, 34, 141, -139, 125, -475, 86, -92, -167, -61, -396, 11, 83, -143, -72, 29, -179, 98, 176, 173, 271, -145, 230, 202, 134, 367, -306, 209, 357, 76, -241, 207, -107, -378, -156, 11, 74, -292, -187, 240, -45, 142, 148, 171, 34, 235, 102, -206, -194, -34, 279, -153, -115, -389, 185, 9, 219, 129, 116, 72, 110, 9, 2, 9, -129, 233, -222, -83, -172, 93, 277, 129, -190, -174, -71, 36, 84, 44, 259, -45, -71, -86, 149, -265, 118, -143, -374, 158, 135, -6, 195, 51, 48, -91, -185, 61, 75, 50, 83, -125, -252, 393, -36, 103, -177, 216, 202, -41, 9, 203, -141, -256, -215, 199, -278, -174, 51, -26, 27, -508, 221, 174]
5450A74j85Q3l26K14k6j5N02l91j87J15Q4J2k85L27q5J51j41n9J49l06K57k46
5472a84PK62J03l66K23K92q08Q80l95J44n2j47J60k3N4j20O5n10L49J0o1P7j25
5495a65j84M44p7M4j37j79K13J29l0r7K07k27o7LL9N5J47K25m01Q6o1j04J66j29
5519a00L90m10J76J69m21R3j07J93j80L04j40K44k99K15j91J85O8jn47N00k35
5540i4J05P5l44K69L3l42J88L16k78J85m92K12L14m44LK85j65K65l28j59N54l63
5562b05J32J93Q9m81K85j14K5J73L0k08l1J01Q0j82o5J96K0m5j90jP40o24L2L14
5586B64l57J08r2K90l15J17j24lR1j3N2m1P1j97Q1J37J94j0k95M8K65k32k02K57
5610I4k56J25L5J4Q5j05J22k8k76J1L95n15K77j28o7L99k85l97P27r3k09J9O2
$$ y = [174, -11, 72, -254, -40, -66, -81, 421, 30, -157, -42, 42, 54, -231, 96, 11, 162, 21, -38, 111, -195, 62, -184, -177, 85, 188, -178, 45, 337, -471, 409, 14, 158, 106, -41, 119, 96, 150, 30, 95, -415, -66, -56, -117, -40, -165, -349, 95, 18, 62, -75, -254, -41, 88, 58, -39, 168, -59, -126, -123, -84, -29, 118, 343, -58, 28, -33, -137, 29, -100, 290, -120, 56, 225, -196, -103, -210, -17, -197, 107, -33, 211, -88, 127, -64, 121, 189, 188, -359, 141, -94, 11, 86, -258, 11, 44, -298, -110, 206, -72, 113, -379, -167, 147, -297, -294, -9, -174, 91, -237, -396, 158, -205, -73, 120, 209, -272, 13, -101, -76, 97, 127, -81, -112, -11, 69, -113, -178, 18, 38, -7, -197, -198, 542, -82, -50, 264, -93, 15, -77, 213, -102, 15, -109, -112, -21, -34, 18, -23, 48, -149, -68, 69, 263, 253, -42, 6, 271, 39, -163, 94, -162, -37, -2, 12, 97, -8, 114, 86, -190, -179, 216, -299, -22, -150, -217, 182, -103, -500, 227, 134, -75, -56, 6]
5633Fk6j58J26J85m13p5L02j00L65p8j79K0j76L27m20K04J76k30K66j34j74O0
5655a26K42l94M21Ok56OO0j30O7j04L10j31q7l8J32J29j31J79p2J3j49K23j68
5678Bk75K61JK17p0k01p5O5%O9J00j27k21J46J7J71k52J93K9q1J7J18j44kP0j34
5704a06PK27l11M10J31l54l3j21L75J78m45L13m39L28j87j29R1J94l16R4K19L6
5726A62m82L53K61k05j6j70K7K38l27L5j21K88k95K07L44m54N03m01K41j25j36
5747g3J27Kl39n3L48p3QJ79l64M81k54j85M0L04j05J10k61J45j45J25Kl9O8k22
5771a74L31n91L13r2J61j04R2J17k10K47k7j87K11n9M8K56m33J82J3k54K68K3
5793A31k07L79l37k7J61j0j16l0J61j89K26j2m12K89j11K05j82L9K37j46Mo7N8
$$ y = [6, -20, -178, -52, 133, -280, -355, -53, -153, 212, 134, -45, -25, -201, 126, -294, -90, 86, -144, 122, -12, -186, -126, 116, -278, 143, 149, -107, -101, -41, -171, -104, -208, 102, -29, -116, -154, -22, 107, -24, 155, 83, 96, -53, 170, 2, -273, -12, -11, 206, 136, -65, -140, -75, -75, -6, 94, -33, -254, -108, -91, 80, -172, 21, 50, -31, -14, 104, -40, -42, 28, -106, -99, 128, -183, 227, 358, 4, -29, -150, 225, 403, -42, 271, -168, 160, -27, -156, -65, 129, -187, -93, 126, 162, -320, 33, 294, 89, 73, -97, -70, 168, -159, -124, -245, 43, -252, -45, 299, -155, 348, -53, 188, 63, -73, 54, 56, -283, -336, 12, -61, -53, 126, -238, 243, -11, -196, -156, 148, 43, 153, -108, 37, -108, 17, 19, -20, 48, -174, 157, -434, -121, -213, -52, -156, -64, 53, -157, 90, 63, -124, 87, 28, 76, 332, -101, 81, 94, -160, 108, 131, -76, 303, -34, -61, 100, 90, -26, -56, 105, -84, 142, 130, -282, 7, -104, 101, -81, -42, 195, 49, 53, -14, 44]
5816D4M8m9o1J77k0k06K0L43l76RR6m0K83m21J16M8p4k67RM59r1kj00K48l17N9
5842f5N8p2J78j63J05P0o0l2m0L4R2J16m51N3K86q7N4K25l17l2OJ17l66J34m9
5867b06J38K16M4k64m6K09m6K3k00R7p0J90K43m29K61k73j24N47l95k7R4J06j82
5890i4r6K53j82m7K55j64K62r1J6M9m59L01r1O2j86L07m57L90mJ85m51J21J16
5913eP7k28L25j36j82R8r9J14j57n7P9L29M6l00j35K66m8j13J96k44K3j95M34
5936H8L35l95k89L56k08J01j19l1L69j07qj8j70PL12r7l21K71k24K28M4o6j88
5959a30L41j76j11J63j11j09L8J46J1j00J34j52j06J63j53J1k56M92j22K10J2
5980A95j43J25j75M0j91M1m1j20L54n6l45L28L09l67J40j33P0l34M26J74m58L24
$$ y = [44, 92, 43, -18, 159, 139, -67, -47, 296, -80, -71, 25, -15, 268, -153, -37, 11, -63, -330, -321, 138, 47, 45, -55, 193, -124, -65, -7, -79, 99, -64, 41, 111, 51, 19, -21, 13, 105, 221, -230, -177, 109, 22, 76, 301, -16, -48, -42, 75, -291, -157, -206, -68, 148, 192, -72, -118, 91, 45, 68, -132, -35, -105, 85, 328, -101, 160, -113, -237, 310, -85, -112, -18, 88, -94, -190, 63, -119, -166, 89, -75, 187, 96, 112, 161, -298, 3, -88, -26, -212, 95, -362, 28, 24, 209, -242, -121, -5, 72, -156, 169, 33, -149, -51, -150, -36, -193, -250, -171, 158, 204, -96, -231, 35, -13, -126, 70, -174, -151, -346, 88, 423, 28, -261, 95, -113, -12, -131, -162, 207, 100, 92, 74, -96, -89, 223, 126, -195, 76, -148, 80, 124, 58, -130, 211, 35, -76, 87, -24, -133, -95, 51, 62, -38, 96, -56, -162, 1, -152, -141, -397, 95, -27, 183, 195, 52, 177, 2, 42, -149, -108, -149, -269, 85, 29, -316, 12, 321, -46, 94, -39, 31, -303, 123, 297, -161, 163]
6002A63k82L18J0k80q4K96L4Q3l88K98rl41K77k3L0j06J81j54K74k08l4M3M5p8
6026F5m8j39K35k76j7O5n3J18R8j12J47j0l05M79k49J28k26J74J62l66j12R5K5
6049a22L05j93l0k04j77L65M2J72r1k40j6K58J38l26J47n3j29J55m62P41j43j75
6071c8K89m07L76j55J37m56M25n02M73l73K62kkK07k38M7k03Q8R0K30j59j26K12
6094A75m44L76J19j42j1J96j74l4Q6k36K40k65M1K68j39o3L08n42J06K51j34k65
6116b83L30j57j12L93m39K58k02R4L11K77m80k88K67k5j38R9j96K05K41l02K26
6137G9r0k8j58M76m47K61r5j3J54j20N3L19m04K13j03p0j99j19L17pr5L3Q2l55
6161c16N60m53L69j38j02J80l31N26m70K01j33J77r4l0q1J40j49q5O6L92l38K91
$$ y = [163, -119, 199, 209, -71, -155, 141, 175, 258, -130, 168, 159, -182, 95, 72, 102, -4, 177, 23, 297, 89, 55, 98, 143, 65, 17, -122, 113, -163, -180, -115, -168, -50, 48, -64, 83, 73, -232, 247, -2, 126, -100, 74, 236, -130, -242, -147, -122, 183, -10, -40, -244, -421, -56, -14, 158, 67, -173, -189, 69, 207, -119, 28, -25, -154, 1, -461, 280, 137, -38, 251, -156, 220, 65, 202, -254, 171, -331, 142, -231, 31, 29, 27, 234, -4, 43, -160, -72, 18, 248, 89, -37, 175, -269, 107, 226, 84, 73, 269, 95, 61, 147, -89, 151, -114, -73, 195, 56, -7, 301, -241, -135, 116, -18, -283, 47, -110, -222, 171, -268, -10, -212, -118, 193, 470, -10, -298, -31, -56, -194, -95, -291, -86, 155, -147, 79, -11, -39, -197, 279, -168, 93, -2, -15, 139, 19, 72, 391, -13, 200, 97, 27, -172, -291, 26, 19, -76, -43, 39, -316, 244, -209, 160, 22, -80, 100, -231, 295, -175, 26, -107, 70, -24, -54, -135, 5, -144, -229, -163, 229, -109, 182]
6183A82q7J43l9o3k31k95O55Oj59l47r6K81L31j88OL2j9k89L33k06m51N61J07
6206A67q7k66K75j73J92j49K09j01r0r0L23l51k0J51K07j12j99L37m30L02J45
6227B40k7m59M70Km69j6LK04L27l58L9K4M5J55J38j18k10J12j38j4o1J69l49L36
6251D5J93j68q9J94k58m1k9L0K27l8j67m1K06P9j54J19O5l28K61n1l85K16j63
6274b77L89k50N7k7PL77m81M85l81j3M7K26j21k51P9J24R9j76J73k84K28L30l05
6297E5L26l62K7J49l63J79j8R9M7k07J34J8k7J94j41P4j64J8k82K3J79J07o2k4
6321b1j20K09J46j29J4j21J71j1k30J58Q8k87J43o6j73L17p6N9l76K89m4K9K6
6344eJ49k24J82l84P9K82l30K66J03k9j3J61j49L2j85j57K25k50O93m07J25k34
$$ y = [182, 95, 238, 199, 136, -95, -390, 265, 271, 112, -235, -331, -50, 281, 93, 99, 131, 112, -177, 156, -50, -501, 60, 167, 80, -186, 89, -84, 108, -41, 168, 67, -23, -113, 210, -141, -161, -10, 197, 85, -114, 223, -207, 95, 240, 213, -246, 224, 226, -243, -259, -256, -52, 275, -83, -44, -20, 25, 180, 318, 200, -10, 102, -36, -50, -111, 58, -291, 45, 238, 70, -19, 175, -83, -124, -153, -123, 104, 66, -101, -142, 64, 143, -11, 108, 173, -155, 106, 55, -330, -114, -277, 112, -138, -81, -108, -101, 276, -205, 280, -101, -114, -67, 159, 38, -213, -134, -10, 89, -87, 86, -198, 30, 360, 55, 381, 19, 46, 195, -168, 11, -7, 92, 139, -68, 66, 84, 57, 251, 110, 184, 20, 38, -244, -221, -42, 65, 3, -21, -141, 68, 214, 85, 99, -22, 149, 138, -92, 66, 154, -133, 10, -56, -229, 88, 12, 71, -305, -16, -60, -31, -5, 144, -80, 102, -282, -203, 79, -251, 15, 118, 89, 76, 237, 88, 120, -65, -222, 3, -247, 446, 39, 164, -70]
6366g0j23N97n28J18k32L13N2k20j90K64RL55m39o0J38K07nL8l77J19O8JJ73l13
6390a05J0K90k30J30j51n6K55N1l7q1k20L14k04J19k74L36j32k31J0R4K78lk95
6413a32J19n4K73nl9n26M07j88J92l19L79N8jp6l83L40j95K95j88p9K41k73m5
6436a99K72j57j9q5L91l87m1L35j88J45J0j04k74J31o8M07L6l07J78J11P8l04
6458c9J46k90j05L66J90j19o4k43P0kJ98j58J21j84J76k88K98m4p2K01J29k83
6480Dj69J36O0n4n7K30m47J22j24L83l66O88l22k14m5L75m58k84P32q9L9j53j
6503a4K46j08K11k93l08J37L9k53J81J10k25K81J7N8q1R8l02K62K5J00l6j33j43
6526a31K24j19j34L7Q9n4r7K56l10L55j96K78j42k51O1K10p7k1p4J3K23k8k36
$$ y = [-70, -193, 404, -124, -6, -238, 75, 127, -93, -283, -19, -10, 345, -94, -154, -16, 191, 186, 224, -153, -34, 34, 35, 208, -105, -95, 195, -35, 95, -56, -112, 143, 194, 157, 76, -144, 170, -34, 85, -189, 147, 15, -216, -206, -112, 166, 163, -132, -13, -67, 206, 201, 162, -364, 43, -145, 47, -272, 107, 165, 164, 88, -295, 45, -150, 145, -43, -122, 119, -154, -199, 73, -84, -103, -188, 203, -184, -225, 110, -78, 67, 77, -27, -301, -170, -238, 169, 205, -102, 76, 187, 265, -39, 107, -183, -288, 78, 268, 149, 85, -158, -88, -90, 108, -50, 71, -113, 63, -225, 73, 29, -43, 158, 287, 4, -165, -29, 31, -23, -80, 150, -297, -175, -299, 84, -282, 406, 84, -130, -175, 200, -258, -542, 190, 101, 140, -13, -14, 232, 124, 335, 42, -266, -129, -90, -343, -162, -52, -277, 4, 21, 79, -2, 96, -206, 56, 81, 181, 145, 12, -131, 93, -26, -160, -123, -34, -88, -185, 71, -239, 116, -80, 198, 56, -195, -134, 76, -1, -22, -96, -83, 140, 112, -124]
6549a24k50K11J01j12J55P0j00O8j57M0j13K76m2l87K21N4J91J2l77K67o1K20
6571A63l46K19J38k60L91l43L29l51L66j86l2m2N3k80J69k40L85JP6J40m06j82
6593b38L70k82Q7J39q4jo5N4M30l22k82k38M06J85n2M4k07J15l02J64o3J94N2
6616A04j04J25k67P9P2J07j88L64l84n0L38Nj94M5K07l29M48j81n2k44K31l00
6638a68J64J26k30j3J58j89L6n8l4R6J14p0J90O1r1m9Ok39J85l53M26p8j15K00
6662G5k47K42j74m1K52k36k29L81l1r1RP1j52l9K49L8K11l88L89j84k14Q1Q9p7
6686a6q6J42l02J39l4N15l56J34j95J72j31o2J39r1j45J49kj13%R0K08M5j67l54
6710c21L38J45l86K87K4k11J11J57m02M41N5l09J00l9O0R7P0m27K5K70K11l65
$$ y = [-124, -374, -163, -62, -174, -19, 51, -49, 19, -138, -98, -211, 65, 23, -364, -143, -89, 102, 114, -263, 4, -57, 163, -183, 36, 174, -86, 305, -38, 291, -60, 306, 120, 88, 46, 99, -181, -12, -252, 133, 134, 210, 350, -56, -238, 132, -150, -63, 76, -8, -9, -74, -20, 410, 88, -194, -432, -26, 159, 107, 151, -56, 59, -243, -79, -142, 52, 104, 0, 125, -142, -63, 9, 116, -72, 292, -92, -142, 196, 201, 7, 52, 259, -70, 378, 197, 145, -99, 132, -168, -4, 122, -108, -121, 37, -152, -116, -174, -208, -112, 2, -68, 122, 183, 92, 43, 49, -190, -5, -358, 68, -10, -125, 75, -172, 70, -104, -145, 107, -129, -358, 23, -8, -99, -90, -19, -171, -210, 39, 77, 288, -100, 289, 105, -109, -28, 61, -16, -102, 40, -262, -123, -157, 358, 2, 136, -59, 113, -18, -80, 59, -32, -177, -28, -30, -143, -143, -53, 155, 200, 33, -321, 17, 162, -224, 63, 87, -124, -13, 144, -258, 183, 238, -71, 29, -10, 50, 147, 217, -210, -185, 85, 296, -69]
6732f9K07m5j48L15l90o8j02L87M6j93rK6j24M55l85P3k59J44P6qO9rJ3kJ17k46
6758a29j48L5K87M5J86k31J1m13J81K11J05k19J48l10R5J5L57K28o66J59Q2j36
6780a07K60J72l58N1O2O4k10J89q6J27k28J36m19J51O69m09j29j38L44J55k61
6801C5k53L18m4J4j81K69k16k02L06k0k81j19N23j62q2K31j24k56M95j09j59K37
6823B20j01j76K23k67n9K17k29K1K45K91l08j0J05j03q0K68p6l54L74L7l22K24
6845A40j52K1P8k13K78l27L08p0q3K52o9O8l07P3k72K28r4K74k22q6J04n0R4j18
6869a45N49l94N3j69L2L76l42J55j80J3q1K60M2J07j07p2J37j25k4j10J42m4k61
6892a88j74M29j8j85OO4r4k0J92j92K08J19m63M14j35M00l43K75k70P0K7r4r0
$$ y = [-69, 138, 93, -55, 260, -130, -198, -300, 87, 133, -60, -69, -43, -167, 288, -97, -24, -283, -139, -63, -71, -2, -11, 2, 0, 117, -129, -277, -242, 45, 90, 276, 45, 56, -357, -176, 35, 140, -79, 69, -241, -146, -131, 226, 454, -212, -53, 29, -107, 153, 325, -33, 18, 80, 144, -66, 123, 37, 164, -64, 72, -347, -196, 473, 64, -65, -203, 141, 296, 35, -218, 100, 56, 70, -111, 158, -58, -260, 46, 26, -255, -374, 149, -13, -95, 136, 12, -244, 251, 142, -17, 220, 119, -57, 166, -101, -160, 57, -172, -151, 94, 385, 77, 67, 172, 69, -11, 257, 181, -173, 201, 238, -84, 140, -12, 9, 87, -126, 152, -175, 133, 63, -20, 232, 163, 231, -76, -3, -275, -47, -141, 133, -89, -175, -71, -121, -27, -145, 404, 10, 63, -106, -74, 302, -40, 115, -65, -52, -133, 127, 169, 276, 169, 97, 234, 109, 85, -25, 117, 73, -188, -362, 67, 49, -136, -130, -66, -160, -180, 12, -180, 28, 147, -316, 98, -37, 363, 20, 295, 25, 95, 122, 28, -62]
6915f2j2M03k43jk3Kk00j92M68J99k05k93L31k27M8M8j16K40j95o3k7J81K06l36
6939f9R8j17J95j48K67m10o6M7K75j41Q2k30J75K12l15K09R1k1j59J27j70k4q4
6962a76k3L0J27O2j02M6L27k84M40o32J13P1q3qJ59Q9Km55L11J35J27l04l9J36
6986F9k67K48k86J18L10k06L82j99j88K32l35O4R5k13O5l2M3K55j92pL9K9Ok03
7010a73M23l70M4K66j95K20j91n1j15K71n13J40N38j28j33N9o6J14o5p7m2l5K0
7033e9j13J79j1M06l85j7l6J4O4k72m1L19j04RJ04J4j33J37K37l34K53Rm88N41
7057B93k60j75K82j64J55R7m99K96k43J79Q7K44q7k41j0m0K33l62J63j8j59Q3
7079a46P3Lj5n7j71L39q2L07m74L42J36m12j3K53k59L90j93J19p3N4J76k65K04
$$ y = [-62, -74, 329, 86, 85, 62, 64, -136, -328, 140, 339, 134, -159, 172, -55, -7, 41, -75, 165, -30, -93, -120, 61, 267, -69, 29, -88, 107, -41, 226, -184, -250, -203, 72, -69, 13, -217, -42, 170, -145, 64, 155, 134, -25, 102, -68, -92, -176, -199, -169, -42, 20, -82, -36, 291, 7, 447, -185, -72, -1, -84, -92, 67, 156, 158, -297, 14, 149, 276, -28, -67, 69, -198, 50, -236, -118, 192, -14, 368, 169, -19, 213, -122, -58, 37, -176, -111, -143, -100, 155, -37, -44, -5, 24, 30, -173, 250, -120, -76, 190, -5, 215, 24, -27, -142, 129, -384, -244, 294, 166, 33, 92, 26, 140, 75, -2, -44, -79, -59, -172, 7, -4, 402, 17, 0, -36, -22, 42, -230, -271, 48, -56, -47, 57, 71, -62, 75, 312, -22, 231, 240, -248, 293, 33, -142, 140, -24, 131, 228, -271, 25, -218, -39, 48, 292, 205, -36, -46, -86, 147, -215, -52, -70, -229, -146, -73, -70, -85, -142, -313, 26, -56, 251, -223, 119, 255, -157, -170, 83, -176, 214, 21, 140, 67, 121, 297, 32, 236]
7102B36m09q8J00J03J12k1K44k59k36K12J19l7Ol65L07K10j72j82P9q5p6K18l55
7125c39K51rnJ55J1k62L24o5L6Lk5NJ64o22L30N6p6l8L8j16J58L20k63N1P7k31
7151g2j0N5j06J8N31j04k40n3K71j97Q6P8l40K50k93N60o43L12Jj31M6j5K51j67
7175H8ol83L3L75k9o5M6l16L02l34K04N3k20N66j26k72K70p0k06J00N1j50o2J04
7199d7K31m2q5j05oQ1R1j4o1k71M1j01K36J35M1%j58K90m21L59j72RL52m42k5
7224h4K82j50k50k23J90M56o7m24R2j52K69J6J17k77J09Q9j29J57n0j9R7j70J15
7247fN3n6J38j72O0J1J32l25L7j17L60j56L48j26j30q9j17L75j62m1K07L0l49
7270i5j20J63L36j52J0K72lk68l02K4J41l25K25M50k80j41M0j8kJ6J76N8o3K3
$$ y = [236, -173, -261, -161, -58, 54, 33, 277, 18, -218, -6, 113, 76, 82, -283, 24, 234, 62, -120, -41, -126, -202, 16, -339, -88, -97, -102, 53, 64, -198, 126, 61, 97, 100, 75, 80, 244, -378, -48, 8, -68, -106, -68, -184, -26, 294, 31, 82, 159, -72, -82, -27, -133, -115, 416, 312, 72, 19, 290, 93, 179, 257, -83, 167, -126, 434, -209, 103, 104, -27, 19, 4, 255, 88, 82, -301, -268, 107, 78, 13, 59, -257, 45, -289, -85, -32, -252, 314, 188, -84, 186, 116, -90, 10, 61, -89, -151, -47, 184, 142, 57, -48, -54, 27, 118, 104, 43, -228, -187, -288, -52, 83, 124, 124, -34, 256, -165, 194, 22, 31, 383, -59, -84, 198, 48, -202, -425, -235, 221, 154, -270, -178, -330, -61, -45, 72, -205, -96, -7, -136, 21, -29, -48, 49, -121, -6, 47, -9, 129, -43, 17, 28, 160, -165, -128, -245, 115, -41, 307, 181, 51, -38, -155, 220, 58, 17, 224, 254, -95, -215, -52, 284, 132, 142, 414, 411, 143, -159, -135, 6, -319, -94, 356, 76, -65, -25, -43, -45, -29, 147, 205, 142, 165]
7294A65l83j33M33M3P2M1j63J33k09j72M22l40r0K14l51K94r6J48O0k21M7kn1
7317a39J51J24K47j08N6l39J43o3k79K65Q1j28K5J35M4j22j10K1j76j45K81k6
7339f2n0K74j23J73j40j48j1J06K1n6nJ97m51K09j22M40j79P7k55J04r6j7K40
7362A26k63K30N9q6jm1R9o2j71L15j10o9L8J04k27K38k70P8J34o2N8k44k4M28
7386B77M0m04K07j22j86J56J00k3N6l40L43m2o0J4k08K49j05N2N1j88M4M5M4m2
7410d2K13j40L0j79N4Q3l04K43J60l09m5K57J5j4j03L13j88J91k54j45L35J60
7432C31m62N7J96m37M00j77R3J09J6Q8l39J62p9P5j04r6k7M67j89p1J14l0j2o07
7456e22M69K16l1k5l7j6l19K61L05l66K05j60k6J60l2q2l75J78L84j12j62R9l96
$$ y = [165, -218, -351, 82, 125, 197, 238, 75, 208, -1, -173, 249, -91, -181, 33, -318, -24, -120, 28, 88, -133, -86, -88, -139, 12, 136, 383, 275, 331, -8, 135, 72, -207, 58, 139, 11, 36, 171, 215, 93, -17, 4, -172, -317, -36, -62, -112, 162, 39, 212, 72, -76, -87, 19, 40, -16, -21, 176, -275, -66, -188, 252, 73, 150, -105, -1, -97, -114, 126, -137, 93, 152, 66, 65, 24, 123, 61, -110, 205, 95, 26, 64, 168, -59, 179, -91, -13, 121, 59, 117, -127, -151, 277, 317, -87, 120, -2, -188, -32, 68, 45, 101, -239, 104, 62, 2, 16, -192, 57, -48, 4, 55, -133, -89, -44, 0, -42, 171, 31, 61, -118, -64, 19, -285, -42, 118, -191, -236, 21, 36, 22, -81, 232, 44, 235, -19, -164, 171, 331, -131, -74, 122, -315, 85, -92, 1, 110, 126, 214, -125, 37, -42, 33, -71, -167, -194, 273, 84, 13, 127, 97, 85, -522, -53, 163, 132, 107, 70, 54, -265, -4, 301, -65, 140, -20, -46, 114, 82, 0, -375, -197, 187, 75, -87, 12, -384]
7479c84L30K93k03o6m1j36J81l34J05K31J0j03L3J93k29O2r0K87J07k32j92J62
7501a6o1j09j1k6L98k65R0j04O06o75J23n9K65j5l00L85l34j0K94M3J1k33l3P7
7525D1J17j33j99M09r9P4j38M8r4J70J03k17l39K61J48l34J53NKJ6m65K53K47
7548B9K09m30L84k31K32m73L7J85j66K83Nj89K65j46N7K06j15o37K43L96m19K84
7570Ij49L49j58K9j05k1j66N01j00l28J59k49J27L79l18J9K00j57k13M07l61Q0
7592f6K71p1M2k90k6kn1K96j49qn6L23q9k77K10j79j04K42J43N7r1q7K43l30K20
7617A71k04n7j71K04m8J37Q0j78J96n3q2K1J50j75j22M23k41j54L15m4j39P6l84
7640b79N07k89K80j77j85K57l96N16j94L1l18J99j12K53k83J38M17l99J10ok36
$$ y = [-384, -54, 239, 36, -30, -71, -207, -26, -360, -255, -24, -14, -117, -84, 109, -120, -58, -148, 139, 246, 14, -178, -16, -77, -186, -197, -223, 175, -90, 0, -104, 502, -173, -50, -109, 156, 141, -159, 226, -108, -118, 176, 219, 230, -3, -36, 41, 158, 25, -174, 235, 136, 210, 72, 120, 26, 196, 299, 82, -257, 4, 152, -182, -29, -24, -22, -6, -471, -218, 29, 238, -192, 192, -39, 193, -280, -243, -58, -224, 59, 64, -125, 140, -6, 51, 257, 142, -495, -252, 144, -275, 9, -140, 209, 51, 80, -25, -46, -212, 289, 189, -139, 20, -229, -102, 277, -41, -22, 178, 21, -192, 215, -146, -66, 205, 134, 176, -114, -140, -142, -193, 103, -46, -54, -110, 213, 124, -153, 57, -122, -226, 16, 159, 216, 125, 38, 281, -49, 171, -33, -90, -261, -57, -105, 32, 112, -66, 130, 77, -5, 16, 166, -9, -131, 292, 51, -103, 212, 168, 29, 105, -279, 228, -61, 219, 42, -143, 114, -282, 234, 40, 71, -247, -48, -160, 93, -190, -52, 365, -34, 76, 70, -166]
7661a66M06m33L09j82J43m5O3j05PK0j51O5J94j12j64r1L10k90K64K43j18k22
7683e5R4r9J82q7N2k10KJ68j2o8J82l9p9K25j69j14l04j2M32J8j25o8J9J8q6J9
7709a16J43lN5L8k69K80K4j24k62L95k23J45k65J45K20k28m0o3P6J43k37p1L29
7732I2j47J69k69L24k9KJ71k32l5O7n44N01j58m1L35N7k24M1q6m1J29j4lk71L40
7757A34m23K46K05l33O6J59k1j15N0k80M22k53R5J5K01k48L33m61k0J47K05l08
7779a84K66j58K03o6k1l25M37l19JM3L9P2o8K38m11M30j47j09J54l90M01j29K26
7802A83k65N02m39J75j85j3K74l17L13k97J66n9q1q3P2K9J26l8O3l86J94j39M11
7825B06k51l3K59k09J21o4j49J12l0N8K47K9j92N0k37L7K70k82J47m37N10j92
$$ y = [-166, 240, -193, 116, -66, 77, 32, 95, -10, -3, 17, -134, -69, 125, 13, -151, -242, 68, -222, 42, 285, 167, -55, 39, -60, 122, 35, 87, -123, -121, 47, 35, -33, 149, 110, 31, 256, 87, -27, -331, -343, 89, 107, -18, -86, -67, -49, -135, -116, 27, 24, 79, 117, -152, 128, 152, 28, -234, 161, -62, 83, -182, -37, 183, -45, -85, -148, -72, 71, -166, -237, 92, -55, 114, -155, 169, 140, 142, 313, 81, 46, 113, -431, 70, -88, -129, 206, 263, 39, 80, -6, -47, 82, 68, 65, -206, 134, -289, -43, 162, -171, -105, 54, 33, -82, -32, -312, 110, -143, -48, -33, 168, -80, 253, -208, -228, -81, 124, -184, 82, -76, 127, 61, 40, -285, 152, -167, -166, -123, -84, -12, -80, 158, -253, 177, 30, -79, 75, -315, 86, -43, 183, -82, 420, -19, 156, -29, -42, 232, -85, 228, -69, 97, 38, -43, -126, -54, -25, 101, 63, 126, -260, -66, -205, 206, -45, -78, 181, -28, 93, 29, -120, -8, -38, 20, 267, 296, 104, 154, -83, -46, 224, -58, 89, -348, 162, -30]
7847c0rj58N35l85r3K70J5k37K80k11l28J05K02J91k48K38p4j80k7L6R0j27j19
7870b64j10K19K89o7k35j19M1L22k20j10L44K1l49L58l04L79j99J05l80K81K75
7891B77M7j99J67j67m21M79K9j83r4j3J08k69M09j24K04j45j87K86j62j32L8%
7913e2N4N7r5p6M3k6N6N6QJ93k49j38K08j13L9J13P0o9K52m61q9M03k87j16J20
7938i9j31L59k1l1J8r3l4r4Q4P6J00j47J52j09L9R3k01J04j97K8K40j79j84K55
7962B8p8j9K50j41k62J79j35L73k52j2j52N04j57j33K0j73J43j1Q1j07K03k23
7984g4l0N9K05j17Rk3j70K56K35l65j0K13l92J4R2M30j00k99l0N09l68m6J86o9
8008A15J22P5m50j92N18m43L21l82N99k8l38nj32M16L4j66M9K50m67K68l99K51
$$ y = [-30, -39, -197, 338, -47, -140, 130, 145, -92, 188, -23, -351, -246, -44, 147, -101, 137, 63, -117, -144, -108, -18, -145, -264, -374, -155, 134, 67, -168, -287, -246, 76, -144, -254, 90, 111, -238, 120, -184, 195, -4, 101, -279, 2, 277, 324, 125, 292, 125, -296, 183, 212, 29, -65, -78, 30, -239, 170, 46, 250, 105, -82, 204, 42, -90, -52, -52, 2, 59, -36, -112, -69, -95, -39, 17, 25, 218, -31, -169, 39, -74, -35, 78, 148, 79, 331, -130, -219, 184, -103, -219, -99, -230, 129, 108, 77, 95, 2, -32, -126, -42, 34, 134, -13, 139, 30, 69, 162, -39, 65, -132, -104, 136, -43, -227, 28, -50, -69, 181, 40, -222, -43, -178, 195, -57, -69, -221, 283, 126, -7, 13, -160, -17, -28, 53, -54, 149, -74, -104, -45, 160, 43, 52, 29, -141, 115, 350, -15, -25, 188, -204, -190, -98, 332, 232, -67, -97, 412, 44, -2, 184, 115, 237, 312, -138, -330, 188, -255, 66, -316, 283, 255, -83, -88, -220, 196, 230, 64, 113, 363, -104, 164, -235, 16]
8030A6Q0k18J2J84k69K71k1l30J00M3j47J30M8J02l01L73m30K70L30m43L4L12
8052A46l3j73J48K5j49Q4r0M5J89k89K54n8l07L70m71K03J07mR4j11j87J25j64
8075b46N71mm10J4j09J09K27J21n48K18J00J75j02j81L50l75J53j9j30K3lK27
8097A61q9k38J76K9K94m41j25L90k60J19O7K44k31k63L50k38N6m0l67L97j10J69
8119E0k0j63R5J34j95M5J89k10rN6k10M45k79J44L9k62J56j28K94RK0q2o9q4P0
8144C5j02k96M40O6j18LJ76j00j81R8O3m6K0k01M58l16p4J78R3j67J3l2J30J27
8168B67n33J49m9K29J06M1l20J10m16J87K44p3m6O7j6L5j20k3K83k3J00l03J01
$$ y = [16, 96, -122, -110, 74, -195, 76, 55, -275, -175, -132, -279, -149, -101, 1, -300, 73, -357, -87, 243, -200, -166, 146, 113, -60, 88, 113, -36, 48, -42, 3, 192, -97, 157, 99, -208, 162, -309, -106, 1, -3, 91, -20, -207, -82, -246, 325, 321, -89, -75, -184, -75, 152, 273, -275, -57, 43, 218, 116, -65, 285, -90, 63, 44, -86, -63, -66, 161, 72, -166, 10, 39, 333, -108, -233, 157, -103, 16, 83, 327, 96, -167, 183, -55, 1, -39, -406, -9, -119, 50, 30, -133, -38, 96, -99, -54, 135, -75, -84, -28, -238, 207, -72, 72, 111, -151, 5, -123, 171, 180, 200, 118, 49, -35, 35, -67, -363, 77, 143, 25, 28, 204, 104, -77, 21, 84, 38, 58, -143, 315, -1, -75, 103, 196, 29, 42, 10, 140, 267, -266, -117, -166, 63, 169, 210, -110, 0, -416, -229, 15, -58, -104, -37, -53, -18, -138, -161, 122, 99, 199, -104, -3]
8191c
$$ Imaginary data points
##PAGE= N=2
##DATA TABLE= (X++(I..I)), XYDATA
0@%%%%%%%%%qJ6j6J6j7K5l2L6m4N2o1P3q7R9j12J31j52J72j95K21k50K82l20L60
33A89m00M47n00N56o17O85p61Q42r33J033j142J266j403J558j735J937k168K440
51A294k767L163l657M294n149O367q247J1565j9129O8577L563q9655P2544j7407
65B5356n6949L4476m794o7384M9082L3899m4884R333L9109j6424J0568K2752j4968
78A9172r977J1588n201j6319j3415P40q186j1407K4961J5774k8849J7935L7390
91C4206k5989m183K5633l7912q959M8289k8724l9255L8797M199k4586K3954n014
104D56k3975L4026J3294k6385N816L959r918J1147q535j9729J2641N952j272J1719
118I196r590n527K1004q712j2167J4348j5013q460L0214j0475k4017K4377m7k0463
$$ y = [0, 0, 0, 0, 0, 0, 0, 0, 0, 0, -8, 8, -8, 8, -9, 16, -16, 20, -24, 28, -33, 40, -47, 52, -60, 71, -81, 91, -104, 117, -133, 149, -171, 189, -211, 236, -264, 292, -325, 360, -401, 441, -492, 541, -601, 665, -738, 820, -915, 1022, -1146, 1294, -1473, 1690, -1967, 2327, -2822, 3545, -4702, 6863, -12266, 56311, 59874, -29781, 42763, 25356, -31593, 2883, -1911, -69295, -20213, 13686, -31198, -21865, 17244, 820, 11388, 34140, 19172, 9195, 20783, 15582, -737, -14152, -13412, -21598, -33005, -8044, 7730, -21119, -3184, 34206, 8217, 4034, 29667, -8245, -17204, 31085, 2361, -36894, 1903, 6102, -18484, 5470, 456, -23519, 10507, 23801, -2584, 3232, 7191, -2727, 8420, -115, -19844, -7203, -1251, -2523, 9196, -394, -5921, 15083, 6371, -5796, 8552, -6461, -14921, 15293, 4818, -19199, 5178, 5131, -15332]
132a5332K3966J923k8879J8872J7610j9899J866M784j4832Q195R518j3173j597
145f978N992L011R262o954j3096P698M235l444J895j0010p05J9927m079j3902
159g148R188k417m735J6868r102j8488K1418O385k1097J0479M964j8467J1017
172a135J0957j7180M284R929j2176L861J0272j2041l121R140j625K800K769j0402
186c668J002J1195l400j0270l848K657P614j835p291L433M790M749O655r089o570
201c876J5359K96j5824K542j59j0133P780J540j2931R415J1392q416O300J1988
215A5273j0338j93R199j0174o284M922j2031o784J2467j209q496P581J0264K871
229G068K304m5k259M89K332m770j2678l422O808j881o980L960M463J769J0073
$$ y = [-15332, 8634, 10557, -18322, 550, 18160, -1739, 127, 4911, -9921, -1726, 7792, -5381, -6978, -986, 2025, 11287, 4333, -8763, -1065, 3170, -274, 1621, -8389, -9094, 10833, 6754, -7148, 2040, -377, -5112, 11756, 2654, -15834, 5584, 11969, -9128, 1351, 6315, -12152, -1135, 9822, -7358, -3074, 6855, -5321, -1460, 8812, -3229, -6350, 2790, 1165, 3965, 6734, -3668, -2666, 8529, 5129, -5141, -8989, -6332, 1282, -553, -7844, -4411, 379, 5128, 11783, 2694, -3876, 11483, 11779, -4045, -1503, -1662, -11795, -4015, -2475, -15406, -5991, 5401, -3015, 3285, 15273, 4935, 4742, 13941, 3767, -2517, 2405, -9626, -16410, -3943, -5152, -13648, -6067, 4197, 7068, 9372, 9327, 7068, 7557, 9889, 5119, -7559, -10981, -4173, -6054, -13034, -9074, -4611, -2842, 7231]
244G231L303p364O272O983j1015m221J568j1589l286P296n943k706J2351K662
258A542k284R459K885p866K564L890p704m413J250m873m054M472N61m825L778
273e618Q964J777j161L572q59l750L139l054j1395K294O685m476r28N520k297
288a587R88P368n628o496Q356K306p576J561K520m385J526K911n266O32P532j340
304C422l657L909J117o005k248J219k919O0L643q23M51P636O51p042J903M657
320E974m363l103K014k729O8M981n793o062P275M286n960J382O152r01J217J426
336E864o281k342N264k805o331M613M778l531N80K115k896QK008l851j632O904
352B465Q98n220K413L456l118j429J461k419J140M722m121m380M410R53o220K23
$$ y = [7231, 10534, 3170, 9442, 16425, 5410, 1189, 2757, -8832, -12118, -4822, -10765, -13471, -1120, 1542, -742, 8717, 11602, 3736, 6300, 10190, 2486, -1927, -677, -5550, -9604, -5132, -4571, -9396, -5618, 3346, 5123, 3962, 7534, 6675, 2925, 6064, 3010, -8385, -6091, 594, -3882, -4810, 710, -1587, -599, 6769, 1141, -5355, 3001, 5307, -2269, -708, 1812, -2573, -1047, 1864, -3402, -2770, 4762, 3422, -235, 3674, 4791, -1214, -3462, -2243, -5162, -5102, -1459, -2282, -1831, 5805, 6456, -586, 1317, 5974, 1611, -1492, 522, -2207, -2139, 2842, -2951, -9013, -1738, 2548, -3412, -2030, 4122, 3221, 4438, 5864, -417, -2759, 2505, -300, -6631, -2018, 2760, -771, -191, 1924, -972, -964, 1044, -2807, -4439, 2465, 3363, -1857, 556, 4012, 894, -535, 926, -1493, -353, 4369, 248, -4132, 278, 1231, -4989, -4766]
368d766L367l64K452M477l044l86M852k991p217J727J883l814J224K270j622J443
384e09L959l393l017N094J311m516J644K442l467n91J246m245j30N760n15l001
400a928N268K182l707n20K08n297m04L132l719p04O097J414k368K672J883k532
416A677J647J212m600n06K742l919n090K686J004k239L021L140l38L858M160m257
432D198k760L521k940o115P69Q16k623K463J777l050L045N313k993k016M825N14
448D744l208L5j773k696J433r8l966J339O079J02k183K727J766j933j069p85l641
465c127K87L285k548k928N794J856l994K554J720k551K339Q70n663Q17L818m899
481b370l229M830k24j134L831q13p26M624n60n301M21K709k685k263r4J474K37
$$ y = [-4766, -1399, -1763, 689, 5166, 2122, 1736, 6588, 3597, -3620, -1893, -10, -3824, -2600, -330, -1952, -509, 3450, 57, -2960, 2134, 3445, -1071, 573, 3015, -452, -1043, 203, -4042, -4172, 1588, 1073, -1928, 3340, 5522, 1815, 1295, 1503, -3794, -4198, -1066, -4785, -5489, 608, 2022, -346, 2326, 4209, 1677, 3324, 4536, -64, -570, 2172, -1747, -6837, -4151, -3147, -5386, -2365, 775, 437, 4295, 8455, 4198, 1438, 4959, 2019, -4096, -3327, -2511, -5134, -2671, -894, -3944, -899, 4414, 1421, -595, 4230, 4744, 1536, 1571, -202, -2898, -1465, -1563, -5529, -4190, 1889, 1991, -192, 2535, 4301, 2368, 1299, 514, -3127, -2840, 445, -2103, -5031, 763, 2619, -1375, 1179, 2899, 348, 2687, 3557, -2106, -1289, 2529, -2370, -5599, -769, -993, -2127, 1704, 891, 165, 4789, 4229, -1072, -651, 2058, -627, -2890, -2984, -1510, -1273]
498a273J099O35r61J015L655j635m668K555K172m541n13J848k815K185L975m499
514a766M63O349l191k724M096k586l136L627k563l607M868L48l702L319K985j428
530A352J15J032j097l50q55j173j244r10L053J133m472K559N134l341o29K953
546C260m313N82M823o123l540O744k621l196N384j653k159P406K4o173M185J538
562D168n699J36O55l508J141K253p17J167J092J064N87j749J564J624m942k9M406
579C213m647j992L032m217J150P033m767k995R059l77n001M283l619n316P877
594B716r30q899N524N540m748J947J450m511J844K752m017r13J578J32P68j445
610a212l61K470j245r69M663o49k015K897k221k755K371l956m456O063J606l178
$$ y = [-1273, -174, 461, -500, 515, 4170, 2535, -2133, 422, 2594, -1947, -2460, -612, -3427, -1242, 2733, -1766, -1303, 5046, 1855, -869, 3227, 641, -2495, 1132, -1431, -5038, -170, 178, -3524, -205, 2780, 1352, 1467, 2499, 1402, 1052, 197, -976, -2220, -3130, -77, 1056, -3416, -857, 4277, 936, 307, 3260, -1053, -471, 4352, -1771, -5311, 1433, -1188, -4384, 1000, -653, -2812, 4594, 4618, -1555, 2630, 4168, -1531, -1395, -740, -4248, -3107, -854, -1571, -404, 688, 1752, 2339, 590, 2154, 3778, -1164, -1193, 3213, -1434, -3426, -394, -4611, -3461, 3572, -1195, -4190, 4869, 4492, -509, 3774, 155, -5161, 2716, 1786, -7113, -1589, 3951, -797, 1150, 2600, -1911, -67, 2685, -1332, -2245, -667, -535, 233, -1212, -1573, 897, -348, -1317, 3346, 2697, 682, 3579, 1358, -1397, 974, -2982, -7438, -1375, 231, -2947]
626b947M422L00k595O723o07q336L203L646m221O47q56m150L701J698m315R68
642b719K121P21M212j344m026L976L56n657J488L71m207M254K873m016K381J703
658B487m056K198K042n296J180K515k823K400J682n490J063M941j747r90P46n68
674B84K376J070n237j267J14k54L095j142m188O020M742m095J44N03l278K663
690A550J333n592j50L277k073J024J137m048K321M040k825P03L660m246n80M228
706C759m222l351K492j544J644M151k687r44L328K71j198r31m208P77M661j899
722I9l749J328K042J123J157k649PL339L35j41k101l963L043K087o556m8L983
739f64k668K286N916m397r00O208l522l162L970l932m275O279p04n155L736L59
$$ y = [-2947, 1475, 1775, -820, 5903, 5296, -3040, 163, 3809, -412, 235, -621, -4771, -1070, 628, -3687, -2719, -598, 123, 4335, 2991, -1035, 2941, 3297, -2360, -872, -501, -4708, -454, 2419, -1597, 784, 2487, -1569, 629, 2671, -2625, -1445, 1070, -1753, 647, 2329, -3161, -2098, 2843, 1096, 106, 852, 284, 2660, 3730, -1507, -2774, -2660, -2914, 181, -961, -5149, 871, 5613, 1518, 1662, 2165, -1113, 1550, 2883, -2709, -2859, 418, -1655, -631, 506, -3542, -1221, 2819, -6, 697, 4357, 111, -469, 3759, -463, -3814, -1322, -2866, -1222, 2929, 242, -702, 2626, 2897, 1699, 768, -3440, -2663, 1998, 99, -3650, -2322, -280, 843, 2000, -649, -642, 2697, 3032, 2891, 790, -3173, -130, 1957, -4599, -4647, -664, -3332, -1046, 4870, 473, -427, 5781, 2259, -903, 3067, -865, -5140, 1139, 435, -4720, -984, -625]
755f25k753N714K036o896J872N770k407k546k56k502N88K906j416k931O10N476
771B640J434l920j216K610j211J62J020m729m55O007k008l257M079j033j416M944
787C651r36n225L637R42m815K539P24n146K305M923k669o12J880q45J536J538
803C427k684k531O07J257J709l754k571L715K797j636J377j260j597M835K39o445
819b515P04K478k634J524P83m441K759M687l374m03K893j906j36K602l201k117
835b297J845q74j0R67j080L41J625J342J038j733k678K362J272k518n86n09j016
852b509L626J213m977J283L354j455M64L80m058J996M545m918k294K888m02o9
868i33K664j735p27L632l1k463P8j552l70M53p73K61N40l49J576J846j223Jk27
$$ y = [-625, -3378, 2336, 4372, -2524, -652, 5118, 2711, 165, -91, -2593, -2005, 901, -515, -3446, -2836, 2640, 4074, 154, -1062, 1548, 337, 499, 1519, -3210, -3665, 2342, 334, -2923, 1156, 123, -1293, 3651, 2715, -2510, 1127, 2069, -2746, -207, 517, -4629, -2324, 2599, -70, -682, 1198, 353, 1889, 3427, 743, -1788, -1181, 76, 1785, -1969, -4540, -825, 1972, 336, 1713, 453, -1144, 3691, 3930, -2515, -1811, 667, -1967, -443, 340, -4101, -1342, 3345, -29, -432, 2461, 555, 419, 3021, -180, -2297, -452, -1326, -1336, -369, -1449, -1108, 517, 1859, 2897, 1164, -1514, 848, 2120, -398, -984, -1493, -2509, 1117, 2330, -2647, -1364, 1990, 535, 999, 1379, -2679, -683, 3862, -1056, -3350, -462, -864, -933, 1731, -4, -731, 2901, 2870, 407, 485, -1067, -1437, -984, -1757, -1496, -956, -1305, 271, 2117, 894, 895, 668]
887F68m47J832J47m173K51K533j918m98J42j974L026M621l172j860L096m80j582
904B12Q21l361j274M044M67k527J221J272m11J058q75j376Q96P78o45p44j087
921a531M87k31j85J143J171j270J573K564j615o72J65l333n49K550k771j711L327
938h88R51j32J680r98r38K954Q06l392j56J260n60r00j242j178L58J856J69j186
956a536J553K328L11j317j58r20j135L11L48j640R76J976j455j75K243j938j126
973a354J742M9p88R69o03j606K118M89k462r5K576O85j76Q6r74l92R24j085k937
992b834r1J949N96K5O77M78N88N99l92j798M50J211j443j027J128j132o99J156
1010e59l99k20J415J017q52J445O86k056j194L00q22RL54k50N62J864L34j546
$$ y = [668, 221, 2053, 2200, -1973, -1722, 811, -1107, -1605, -1463, -3437, -411, 4210, 1038, -822, 2274, 1794, 212, 1033, -2328, -3602, 442, 909, -1618, -397, 875, 464, 1522, 647, -729, 167, 945, 300, -444, -1531, -1044, -1275, -1460, -317, 854, -416, 1157, 3721, 2106, 1434, 1599, -1734, -2283, 267, -2504, -4215, -888, 63, -69, 1611, 613, -325, 2629, 3435, 43, -113, 1147, 587, -313, -1555, -2733, -2375, -519, -350, -1536, 17, 2345, 2656, 1339, 1181, 261, -874, -563, -215, -1855, -879, 1097, -358, -533, 1710, -228, -1354, 388, 437, -351, 618, 15, -1591, 527, 1016, -1446, -1541, 1035, 1720, 1544, 1630, 656, 264, 1188, 103, -2834, -2925, -976, -380, -355, 322, 800, 1388, 1987, 1595, -203, 247, 1458, 15, -1012, 116, -1016, -1715, -559, -958, -1178, 237, 1254, 402, 1847, 2533, 477, -717, -417, -1239, -1230, -876, -1126, -564, 1300, 1634, 88]
1028H8k71J113k46j093J15n47J32J342p25j745J327J572m85o65J053J17L65L8
1046A485j755j063M81j74j200O98J591J63L36R24n61M39J80j291o82N94j31j355
1064a321l50J178M0L5K44J48M81J778r53j349M58O16j638r74O60J98J98J061m75
1083C5n04K199L6j586l55M68m59k59l98o64L94J025j91m64J370J074o15j07m1
1102I58k04p78j97j204j18J138p1r82R05J514K82m81M78o30k28R53j694j126P55
1121g30L39p95J50R30N4J097K46j328N96J144j526j202N03K01m78R6l09M02P68
1140A58O33k92l15J210J93j392p85L49j66m50K28l83L75J646o15r89J137Q46j221
1159A67J34n96o32Q86N96j704O21J201m64q12Q99L00m5K80o71j205Q67L07j079
$$ y = [88, -183, 930, 684, -409, -294, -841, -709, 633, -92, -1837, -510, 1062, 577, -88, 965, 1082, 1447, 1485, -270, -1333, -852, -1026, -2226, -1528, 63, 226, 562, 1486, 925, 1364, 1544, 253, -429, 165, 34, -1321, -1671, -493, -453, -418, -174, -26, 455, 2233, 1280, -69, 389, 1005, -633, -1607, -947, -749, -551, 510, 35, -469, 1730, 1766, 180, -175, 293, -166, -425, -823, -1487, -1093, -68, -259, -723, 647, 1721, 1106, 999, 958, 754, -24, -221, -1425, -1543, -405, -476, -1458, -553, 961, 1243, 762, 1240, 610, 382, 1335, -359, -1485, -730, -391, -1186, -1036, -106, -52, 1045, 1291, -37, 559, 1703, 177, -1025, -522, -321, -799, -703, -1012, -610, 158, 791, 499, 184, 1394, 1587, 195, -590, -241, -407, -857, -629, -1012, -637, 1009, 394, -595, 542, 1388, 167, 301, -295, -927, -41, 555, -1149, -528, 673, 209, -603, 296, 596, 551, 831, 160, -1045, -178, 129, -950]
1178i50l18O57J087K52j01O25N87j021M3r51j053L02K33j432Q39J208m31N38K82
1197C96p03J153J286j630p86J882r89j542j01r5q17J080O45p54J254K156j131
1214A304l23j035K45j63m91k29j7L87K64r0m68Q10M28n49j12P75n86L0Q9j697
1234a428j37J859j304r55L163O08j260J566l59j712J023r27k606Q27J266r56j87
1251a519J029j02J301O34j510P73J402n86n45m98p73j81o04q63q1P96O96K048
1269A417p44N5J677r88j972J602j089j792J742J76j638J913M31k314J397J524
1285A397j823N28R44j325Q71Q20k867j69J982r53J4J199m03R50J301j687r99m0
1303b60m88P04j018j175J973J275j528M25J238j408Q44J046k257J047J075k541
$$ y = [-950, -1268, -611, 476, 728, 627, 1252, 1839, 818, 861, -90, -1143, -841, -608, -2040, -1201, 7, -424, 114, 396, -307, 846, 2132, 502, -284, 1598, 609, -933, -1034, -1129, -1946, -866, -221, -975, 279, 2435, 1304, 981, -54, 191, 28, -463, -692, -709, -322, -58, -148, -616, 194, 622, 73, -39, 736, 150, 180, 269, -1428, -1565, 294, -1010, -1965, 1198, 1806, 546, 2112, 1753, 41, 1064, 137, -2469, -1642, -376, -1332, -1519, -490, -592, 709, 1343, -167, 606, 2008, 1422, 877, 379, -394, -575, -1179, -2042, -2123, -1327, -631, 1417, 673, 728, 2405, 1417, -555, 1047, -42, -1834, -92, 84, -1554, 359, 790, -1524, -127, 1397, -426, 102, 1046, -279, 592, 1412, -1455, -1624, 358, -595, -581, 618, 215, 1165, 2466, 779, -220, -260, -748, -44, -1062, -2237, -264, 1011, -517, -92, 1146, -262, 582, 1628, -629, 418, 1493, -1048]
1319a048Q55L90j743M73J026j212J869J161j984L45J366j431l92M58j986J587
1335b66J555j956J2J347o50P20Nk661J744K050k826j07J702j926N88K201k766
1352a234j64L303r98o68J219j442l48J463k243m35J563j234K62K015q37j65J370
1369A427j015l7J241k007o56J378j138Q40J32k355J784K415k091n28J682r28O21
1386G65J285l365k45K497j421p03J740k132J518K636k418p60K790j350j369J907
1402A375k372j144K292q64q85J904l97j64K100q10o21J067j533l53J813k114j480
1419b186J520o95R26J480j868N1L107q47q45O08j790K02K096l455j545K886m29
1436g84l46K396j448l69L149n15k178J221q33r70R94j310j501J767l65k20K206
$$ y = [-1048, -193, 197, -1546, -1073, -47, -1259, 610, 1771, -213, 132, 1498, 67, -325, 133, -1853, -266, 1289, -667, -655, 692, 42, 762, 767, -1894, -150, 1900, -926, -1033, 669, -1257, -669, 1532, -1234, -1398, 1905, 907, 239, 1458, 16, -332, 1131, -1112, -1547, 16, -1218, -956, 1059, 222, 57, 1427, 412, 375, 1616, -391, -1047, 331, -807, 33, 165, -2190, -406, 2009, -82, -610, 1072, 144, 765, 2050, -1315, -1560, 937, -484, -1187, 553, -1579, -61, 2575, 157, -603, 2187, 837, -532, 1375, -997, -2141, 151, -713, -1598, 306, -91, -255, 1845, 1035, 414, 1481, -52, -405, 1408, -706, -2186, -666, -1361, -435, 1045, -823, -772, 2335, 1488, 643, 1251, -539, -337, 1759, -1696, -3241, -355, -784, -1130, 1266, -182, -551, 2598, 2083, -95, 1126, 293, -677, 317, -993, -2494, -727, -1092, -1312, 894]
1453H94o44j63J707p4j144J166j991j241K100j208j462J222l31M91K213j328j655
1470a448K815J53j578Q71p17j333K601o75k616P59N21P47O40q05m09J337K17j188
1488a08N1j093J82J481j031n37J777o48j0K009j540j546J558l69j298K209j419
1505c32k138K472P71j827O53Q37o98J872M43k283P9P91l85q88o68p53J504J386
1523H36q21k87O9N19R17p28j349P32K37j77O36q32o80J343j55j077R64l09l00
1542d62J132L34j491L96k59n13O10J54o83P64J125mj83r13r07R34K20j125n47
1561a418Q96O56R57p82j295R80J004m18l87J83n29R06R5k074k9M97QN20N11l40
1581e9M16J192p53m96j94p47j51L65N5r7J69J06O10L62m66k99K71J22N94q88r57
$$ y = [894, 250, 87, 1794, 1720, 576, 1742, -249, -1490, 610, -598, -2060, -838, -1169, -678, 1535, 207, -1448, 1367, 1520, -58, 813, 96, -1237, 1364, 689, -1927, -1168, -647, 100, 740, -65, -474, 863, 1080, -108, -57, -1150, -968, 513, -518, -1055, 722, 74, 64, 2073, 533, -1013, 545, 176, -1122, 1087, -332, -2470, 2, 773, -1054, -401, 436, -262, 1610, 2053, -230, -151, 640, 255, -633, -1301, -2054, -550, 836, 15, -272, -203, 316, 1233, 505, -844, -112, 125, -52, 584, -248, -928, 415, 260, -817, 147, -162, -462, 670, 1004, -487, -91, -350, -863, -253, -99, -782, -18, 1107, 1103, 920, 7, -900, 34, 254, -871, -1418, -522, 134, 1091, 309, -986, -6, 998, 580, 193, 376, -153, 753, 848, -1226, -1255, -758, -750, -230, 281, -59, 357, 1549, 796, 300, 106, -641, -792, -427, -372, -469, -300, -194, 416, 778, 312, 13, 284, 406, 1000, 112, -845]
1602h45K04N50n17o46J15N59J864L57j016J43O85m58m27j130q84M65M93p22K70
1621i40N27K91N62O93k59l43P85m89n34j04n43j139K56M74l47K26N76N20Q06N04
1641A522p48p24M21L24p82q73l06Q00K63K17p62k40J595N80r80m89P48j03m27
1660C6J96r40n03J394q7q06P84O82n0K39J30j051n13O09l52l22J58l8o24P67J006
1681G15l21m91M98N5L02k91q01l92L89K82q58j96J055K99L63j93k35r6J049l18
1701H15j132o04P75j13k30j14p5N60J134l96q16N29K26m77j54m4l68p9J23J43
1721b97k01M77K28l02L92J107j135n25L64J02N2k46m78o41J213L77p07J99P12
1740F91K5j10q39q8O4N14l74o46K66J023k71j90Q5N72J04k87n86l15K75J9o26
$$ y = [-845, -641, -91, -608, -1254, -1139, -580, 1284, 1641, 625, 768, 1453, 995, 568, -562, -1446, -981, -488, -1210, -940, -413, -122, 440, 1133, 874, 531, 1316, 827, 293, 189, -354, -1493, -1237, -763, -1110, -884, -308, 212, 1018, 1522, 774, 50, 471, 795, 13, -860, -1166, -366, -103, 114, -648, -888, 707, 1287, 307, -182, 566, 463, 36, 232, -708, -1211, 183, 96, -710, 74, 756, 706, 945, 1075, 24, -489, 120, -232, -554, -396, -434, -1058, -291, 715, 394, -97, 401, 456, 758, 467, -334, -726, -337, -55, -913, -1109, -54, 245, 608, 415, 180, 84, 1133, 815, -317, -921, -146, -259, -489, -603, -678, -118, 1016, 620, -196, 333, 559, 82, -72, -116, -484, -563, -440, -297, -498, -21, 207, -95, 297, 1404, 269, -256, 108, 210, 262, 16, -462, -1103, 110, 487, -220, -21, 691, 716, 606, -233, -321, -257, 257, -117, -763, -497, 526, 255, 65, 150, 722, 826, 539, -47, -362, -87, -68, -694]
1761f94j86O65J43k93P40J57J10N92p75l39L80m68o72o24Q88J08K16J30q6K71
1781B63Q07k03p58j51K64L91j092r0j86M32M46k43K07j49J145n49p2k5J43o58
1801g8n22m99r2J178k8l69Q57Q41q27K45p3l61k70L98j094k07O92m59n14K36N29
1822d17O71N02l12M21N29k69p54o07o83K72q9k14K56P31K6J87J98n95Q13J54r70
1843a50M75L64q16j87L04p84K94O17k35k58J011p6r2r1n88k87L98o96j10J074
1863A67n3P3J28lN22Pj153J9K41k11j80K39o73K47R54q00k38J332P8M5M21q90
1885B72m05P37j362n11L70M46j88Q43j10J29Q14o14n15K93M9k91q4l52p4P36o46
1906d63Q8L04K81L08j73p66L54J071j116r27O28o38L51R95n56j19J581q38k09
$$ y = [-694, -880, -215, -72, -365, 375, 532, 642, 1234, 459, 120, 500, 32, -640, -1264, -376, -268, -52, 78, -8, 263, 1070, 867, 109, -42, 222, 613, -479, -569, -755, -323, 123, -120, 87, -62, 1083, 534, 462, 437, 580, -78, -600, -1099, -1191, -13, -41, -410, 447, 1288, 461, 706, 633, 272, 2, 400, -694, -901, -209, -668, -1182, -946, -417, 254, 756, 444, 865, 1394, 1125, 371, -236, -919, -647, -736, -950, -694, 37, 63, 250, 448, -147, 666, 820, -150, 325, 689, -127, -314, -10, -794, -500, 117, -118, -376, 635, 559, 467, 376, -212, -499, -101, -797, -907, 167, 114, 187, 315, 312, 834, 841, -312, -293, -52, -263, -443, -204, -877, -630, 324, -476, -714, 618, 696, 741, 1162, 272, -133, 604, -758, -1269, -899, -453, -641, 202, 92, 221, 1035, 421, -94, 199, 248, -43, -127, -479, -553, 183, -463, -375, -71, 210, 518, 345, -421, -67, 1004, -112, -1039, -411, -1049, -698, 297, -259, -378, 1203, 365, 156]
1925A56N77m86m70O02r13l24P86l44o31Q71O5K21l1J82r3Q17j76n05k86l22j23
1946d27M6o93N26R69O0o83Q01J60o73N71r42p48J539o77m45P81m42k0Q49l21r07
1967f76J224L82j040K94k2o35K16M4p95N23O74n69O62M07l72K51m52k94K79k73
1987a72p67M66n2L8N31l07j34J406l90l29P24o19p61Q86p13j394J278N68q74M78
2007a37M68n80Q49L89r66J9L59k66j04o53k59M19O37o12M16L67k87P07j50q93
2027b77O06l26q16M47L25q43N45J14N7K98L68j004R06N41j176L0J83l94K47J36
2047c3q15Q3R38M58k93l79J72J68Nm98n31K48M11J68k61l3J93M26j55k46O71p05
2069hJ37J13k61k45K1r14P10O88j70m17J005K55k53o0o13m79L80j92m13PJ1P32
$$ y = [156, 733, 247, -223, 379, -534, -858, -72, -416, -1047, -176, -111, 110, 79, 261, 168, 985, 809, 304, 18, -304, -427, -381, -1074, -548, 421, 481, -202, 599, 759, 86, 657, -285, -1033, 506, -171, -616, 165, -277, -297, 552, 231, -676, 548, 930, -110, 184, 162, -473, -257, -213, -1008, -485, 189, -380, 282, 689, 317, 568, 116, -178, 101, -172, -939, -473, -525, -487, 44, -263, -397, 1009, 619, 290, 1014, 395, -366, 520, -193, -1587, -309, 259, -615, -137, 331, -249, 600, 989, 23, 42, 401, 135, 31, -622, -881, -462, 175, -437, -21, 346, 59, 766, 616, -277, 329, 3, -813, -366, -41, -884, -339, -225, -168, 130, 498, -506, 400, 941, -235, -205, -22, -416, -169, -33, -848, -765, 173, 631, 338, -41, 131, 299, 304, -194, -725, -477, -66, 102, -159, -192, 1, 427, 272, 26, 697, -8, 129, 242, -19, -264, -243, -1157, -447, 241, 71, -346, 659, 914, 661, 601, -12, -491, -111, -303, -716, -709, -698, 34]
2091C4O53p63k57Q16M2j0O4n13j86N47q20m52K95j19M01L20J88o5P66k92n77L46
2113D18n39n89O21m23%N59k29k44P83J86l75r0K06K7M15q76n36K03J72J40m10
2134e81k52N78R79J16m53m7J0k26J66r13p89J385lo60M75K8J46O26l6m99J58L95
2156F03n10J99k23o09M9L31k71K69Q5j4K40O49l09m34k69l58N40j06o02J49J088
2177D97J99J45r20k89J121P5q46J28k42K1R0l32q15O45R20l40L74l0mL11L73j002
2199G9l46Q3m73K91L04m56N49J07K2j34L30m75J89K86N7l13k24m85P75L42q66
2220c58q7M40M83M40l55p89P8N53m64l85J49j55P15L56o52J69K15J20k29k8k74
2241e8k79N36n58N3L7j73L13L39K18J68k8l28Q6K21p08k11l06L74J58j79j83M34
$$ y = [34, 687, -76, -333, 483, 525, 515, 579, 66, -120, 427, -393, -845, -550, -669, -268, 52, 240, 175, 941, 649, 72, 418, -121, -710, -89, -512, -512, 47, -182, -426, 357, 543, 168, 78, 284, 311, 726, -150, -686, -483, -311, -171, -581, -833, -255, 724, 840, 387, 340, 350, 124, 290, -623, -1412, -27, -30, -690, -215, -187, -41, 585, 549, 50, 208, 603, 93, 292, 69, -540, -491, -160, -431, -162, -77, -91, 149, 798, 489, 55, -214, -572, -32, -138, -740, -591, 497, 696, 841, -79, -368, 753, 828, -18, 110, -132, -111, -21, -353, -1168, -523, 397, 57, 431, 401, 397, 708, 1081, 79, -267, -184, -657, -366, -62, -518, 31, 138, 160, 26, 356, -119, 70, 356, 413, 100, -124, -609, 166, 508, -358, -445, -5, 478, 918, 563, -226, -148, 405, -59, -444, -295, -450, 265, 621, -31, 138, 353, 473, 244, 216, -58, -337, 199, -359, -306, -269, -442, -129, 210, 428, 596, 568, 240, 326, 547, -161, -372, -678, -304, -146, -325, -508, -74]
2263g4Q85k57k95R1r8O3L31r81k96M50l0l14L1J2N91N52k97N2m5k26kO9q83j52
2287h23N58j51P8j1M86K62L34o8p6j77n92M49Q7o04n49J16J97M61N84o59J60R14
2309I76J24p00k52j1j66N4j08r59M94L08K03M95n70J51P71l99l3l68Rj2l4k85
2331c12p5L31j54L10q9K21K45N6k17k52L0k58k28K10Pj64K77l1q5O50j00m10K75
2354B37J90l04l46l02j66N97P3n82K42M80N73kn56j92j39L26k7j56n78M54M21
2375B43m54L4J80K42l3Q7K47n25L34l92m02K29l84r5J56Q17q2K29j42o0K78k39
2397B68m53j60R5L70j5l61l80L41O71l85j96R4L41O41o11n01J62K91l08l4j44
2418b74K35L28R5m32K72j80j13l5m3J53k06L0n5M74k28q3k31Q8N36r5k42J6O3
$$ y = [-74, 811, 554, 259, 350, 252, 315, 646, -335, -631, -181, -211, -525, -494, -482, 109, 661, 364, 416, 371, 145, 143, 212, -671, -823, -265, -416, -338, -349, 137, 399, 733, 665, 589, 412, -180, 269, 356, -248, -797, -681, -484, -23, 561, -98, 62, 976, 1100, 400, 148, 137, -29, 25, -83, -1042, -548, -240, -37, 458, -112, 39, 810, 411, 378, 10, 19, 7, -27, -312, -387, -56, -210, 100, 11, 232, 477, 533, 316, 64, 94, -164, -392, -182, -175, -339, -62, -93, -178, 472, 372, -38, 237, 427, 123, -223, -525, -691, -94, -21, -603, -361, 119, 692, 690, 134, -58, -197, 129, 102, -54, -632, -178, 243, -211, -177, 3, 245, 212, 299, 546, 21, 355, -37, -439, -210, -594, -689, -533, 284, 202, 431, 289, 229, 507, 268, -185, -345, -250, 120, 105, -256, -636, -295, 376, -9, -205, -111, 230, 871, 260, -241, -79, 212, -96, -130, -274, -39, 289, 384, -48, 224, 44, -69, -104, -147, 6, -200, -170, -225, 249, 21, -62, -293, -205, 331, 236, -6, 10, 73]
2441G3L73q40J30l22L95K26j59m9N61M26m57k60l26k39L52p6o56O29J69j51L02
2462A01P5j84L14K1k29j5J76k90p0j70l23N02J68l60M40K97J10r4l82mk0k9q90
2485h56N51L61m75L16L3j88N25K41j27m52M52J46l49k8p79M31k6j9k7q5M24K98
2507C67K77l20K84m0o03j99J00Lk42K13j94O57k28m04M73K61k38J07j23m07L87
2528A31m7m18l07L17M20J05j08J68lL52o09j07o3o5l4k44Q5K24L90k45K2j26N62
2551D00N1l89l48K55K01l96k6m3j76m5O02j4m43P30k75J00l4k09l8o7m65M55J94
2574B0j71O8K24Q3P8l5Q1n06M10k86l42K73k05J48J40l18J99O35l93J32N8M2l97
2597f2J67n66K30J05K23m55K75K80l9j02L04n48Q15n83k12K62j05k59J97l73m8
$$ y = [73, 446, -394, -264, -586, -191, 35, -124, -173, 388, 814, 357, 97, -229, -468, -116, -192, -848, -219, -50, -201, 101, 176, -8, 306, 327, 98, 83, 259, -31, -101, -271, -594, -92, 76, -284, 156, 453, 563, 469, 87, 83, 63, 34, -856, -305, 56, -419, -103, -70, -258, 267, 508, 381, -71, 381, 527, 178, 150, -629, -198, -224, -243, -270, -355, 69, 367, 644, 324, 608, 568, -35, -234, -134, -131, -373, -160, -354, 303, 75, -329, 144, 405, 167, 274, 151, -256, 131, 84, -334, -641, -324, 96, 201, 93, 261, 258, 610, 1, -106, -169, -234, -268, -512, -427, -203, 187, -58, -36, -162, 400, 451, 62, -286, -31, 170, -226, -252, -295, -471, -516, 86, 72, -371, 359, 84, 184, 150, -59, -97, -164, -629, -174, 20, -151, -83, 141, 224, 302, 267, 348, -158, 252, -34, -376, -103, -308, -160, -20, -338, -139, 496, 103, 235, 293, 335, -62, 105, -461, -231, -126, 97, -358, -83, 197, 158, 56, 360, -188, 627, 44, -168, 94, -11, -270, -73, -446, -494]
2618d94P39mm3q9K41R9k80p1k37j46J58l41L04O3kM50j97J27M02k79l54k7m05
2641c86JK96k37l58M83K05j65L81K19m60O57k47q28N08n3j77k34K09J28j15L03
2662A30k38M05L64q12J51K67k42J40n50k3k97M72K86j79L79k74K66l5j16k02J47
2683C9j89L27M3l55M5M08n28J25M57n8l0J61m87Q6O3m7l90J85m17K46M97o7o6
2706D8P73q19N2O3J86n77J27k00K61J53l59J1L94k74K99K41j95J28l5N8j138O28
2728a75k29K16K6O2K62L97m01J61L0n9l86K00k34J51K46l51m57O97j9J61k24J52
2750B26M77k54m2q08J84m1j10k50j41O65O28k59m76Q03m46L01q2q29K67M30p62
2771e19K52K61l23J30N93l23J22M87j49l74L50m88k12Q5m7k62M98j89K2N56K3
$$ y = [-494, 245, 241, 198, 109, 350, 449, 169, 98, -139, -285, -127, -468, -164, -101, -103, 347, 150, 277, 679, 400, 46, 19, -386, -385, -89, -326, -684, -201, 4, -161, 220, 439, -21, 636, 389, -439, 69, 16, -161, -395, -186, -58, -173, 130, -108, 297, 661, -151, 0, 267, 25, 165, -385, -408, -705, -233, 53, -126, 253, -21, 245, 210, 94, -108, 39, -150, 177, 220, -135, -90, 318, -210, -85, 372, 314, 284, 445, -42, 44, 107, 60, -330, -145, -562, -316, 181, 114, 48, 821, 2, 54, 117, 303, -274, -147, -347, -86, 67, -292, -281, 113, -161, 138, 379, 184, 312, 277, 335, -803, -175, -404, -188, -162, -100, 162, 559, 158, 319, 349, 290, -96, 104, -130, 21, 267, -84, -541, 156, 137, 298, 74, 226, 703, 449, 407, -401, -217, -258, -368, -618, -759, -94, 534, 275, -201, 602, 156, 457, 375, -454, -187, 243, -519, -267, -6, -329, -199, 394, 71, 193, 680, 531, 157, 507, 19, -193, -108, -155, -417, 81, -108, -86, 470, 493]
2792D93m1j46n8m64M59n00k15K22J32O9J70k13l60R67k98K18m62K93l43K20k36
2813i3o83M20L05m9M9k23K38M61K49k53k06k0l13J58j8k71K48j67j11N93m17M4
2835e9K93k9J17J54l64o32P84j55n45M34k02J49M32J37n24J99J57l18J13l71L90
2856A60k18J60l50m7j37N03p7L5J59R8j14K32pl39n93M32J3p2M37j94j02K88K54
2879E21l89j52k29K49n7j02n12N05M53m82L86P6L0N8K9l57N6J62l31k9m27J42
2901d00K99L41k37R5k8m1K4K60m35P7l4j88R5J52q2J6J20K35N05m48l82L96J13
2924D53n37k16l17K14O24j50l29J36M42R0o4l95J4J78k19j42l43P4J88L61j01
2945c9K4N4M00l27J80J86l52k01P1k81J33j6L2L30K00o9k10k6J43N4Q9l45l95
$$ y = [493, 452, 306, 248, -216, 243, -257, -472, -250, -118, -49, 121, -92, -452, 515, 217, 435, -27, 266, -77, 143, -93, -776, -356, -51, -100, -51, -274, -36, 425, 674, 421, 215, 195, -118, 40, 22, -249, -1, -168, -279, 314, -103, -59, 234, 205, 322, 476, 112, -520, 264, 109, -436, -2, -204, -55, 377, 514, -10, 189, 346, 28, 141, -230, 160, -58, 102, -248, -295, -432, 71, -6, 29, 188, 286, 172, 404, 397, 58, -535, -103, -90, -162, 275, 81, -21, 267, 521, 132, -20, -249, 0, -57, -159, -671, -166, 287, -195, 191, 267, 297, 355, 384, 27, 83, 245, -86, -115, -542, -400, -101, 240, 3, 98, 70, 29, 53, 313, -122, -45, -79, -267, -172, -20, -102, -86, 34, 269, 774, 326, -56, 340, 453, -84, -300, -617, -403, 221, 71, -258, -122, 320, 410, 346, -49, -35, 143, -76, -218, -561, -487, -299, 62, -39, -15, 39, 439, 112, 292, 478, 126, -75, -4, -285, -152, -168, -136, 194, 394, 325, 115, 89, 232, 286, 375, 30, -365]
2968c65J18J26k48k39J58O24P1j3J9Q5r8R0m81Q8l52L51j14l44M36J95J94q9q4
2991A28M3L8N2k42K61k50j49%k78P1j1K25K54L30K11j71l94L0j24k35j79k22P8
3014e34N04L21k80j11K01K42R6j32n90N38J16k66n9k13j20J65J22l57M10o1L25
3035C17O8m19K46l28j22K97m09M3K72J18Q0j76M19n99J01K34O5j52p9J21J8m01
3057b86k17J46K48J41L04k30k21K24K84n47j77Qk86O93l45J84K8K95J43k67J33
3078B55r0j74J00J2m23L50kl7j41K07k19j2K04M64l75j05J76q9J55p24J38J65
3100a65K86j48PQ0J38j69L71o59J17J36q5M4j28K92l59M04k45QJ09r0J26Rk22
3123a43r3M3%k71J27K63K23n0J36l4J45j37m8j02J16j87m35K74L5K22K5m02L76
$$ y = [-365, -247, -121, -369, -608, -450, 174, 245, 232, 251, 336, 238, 328, -153, -65, -417, -66, -180, -524, -88, 107, 301, 212, 128, 171, 209, 261, 19, 280, 30, -119, -119, -397, -326, -337, -112, 142, 472, 683, 512, 118, 148, 24, -211, -390, -612, -534, -30, 291, 11, -100, 101, 343, 439, 307, -283, 255, 371, 105, 46, -167, -287, -122, 0, -357, 53, -8, 317, 385, -34, 212, -116, -238, 59, -350, -307, -35, 83, 163, -13, 406, -193, -92, 142, 207, 55, -24, 97, 115, -286, -503, -357, -109, 32, 336, 106, -115, 109, 393, -154, -331, -323, -609, 84, -261, -77, -49, 246, 389, 122, 255, 165, -9, 91, 103, -320, 30, 28, -9, -150, 57, -162, -174, 30, 494, 119, 14, 190, 101, 256, -468, -330, -165, 121, -27, -20, 60, 198, 29, 400, -259, -142, -6, -91, -47, -175, 117, -242, 162, -83, -75, 34, -56, 70, 79, -143, -236, -193, -193, -464, -337, -74, 149, 99, 235, 201, 346, 209, 161, 59, 175, -12, -447, -173, -138, 84, 109, -293, 83]
3146H3K09j81K51p8l85L9J83l60q5M75m4k48N1K05J03L5J19o07N28m00J7j71j92
3169d53K95j40L9K41p5J73%K53k8J79k60m12J15j68R9j36R6l41M12O31m19j0K91
3192C82R4l01l34J64j70k3J06r8O0Q4K59j45j72L10l9J98k98l9m42O5J18k57J41
3215c37j6J11J75N06m96m0L75k54k74J51O5m95L32J78r3P0RL65K50o66K77o6k94
3238a67K13j84J1k62L28J29qJ8mn3J43j07J74q5j3k60k27j69N86m4n5N6q5K56
3262A91l1O3j25J19k20p1l19O98k83q6n3K83j81J53l11j1M90k49JN3j75Jk8k43
3286c34J70J43J11Q9R2j88j9K01l72k34K72P5O5J25pMj87L0J28J74n6m32J36P5
3310F1l98N91l91l08K94K62R5q9q3J9j80M1j30K38k25%K69j81k58M37R8o3J79
$$ y = [83, 292, 111, 362, 284, -101, -62, 121, -239, -324, 151, 107, -141, -90, 115, 218, 253, 372, -235, 293, -107, -90, -261, -453, -158, -298, -259, -18, -93, 80, 80, 333, 305, 484, 224, -188, -73, -241, -142, -278, -182, -523, -111, 520, 101, 91, 382, 476, 175, -159, 5, -165, -188, -82, -180, -120, -36, 223, 78, -94, 216, 177, 375, 77, 38, -404, -339, -221, -478, -337, -353, -242, -67, 439, -57, -97, 278, 24, -250, -99, -34, -529, -197, -19, -112, -42, -33, 332, 582, -84, 193, 127, -167, 46, -138, -127, -389, -61, 68, 60, 78, 74, 21, 164, 57, 231, 146, 133, -127, -354, -523, 63, 19, -36, 20, -65, 191, 160, 223, 98, 217, -3, -74, -393, 305, 22, -64, -117, 166, -15, 138, -173, -184, 306, 57, 58, 111, -64, -63, -91, -334, -164, -21, 90, 179, 271, 83, 64, 265, -107, -341, -69, 6, 71, 196, 189, 193, 6, 36, 164, 338, 282, -150, -14, 61, -337, 254, -137, -445, -151, 111, 206, 117, 34, 53, -127, -86, -216, 22, -203, -203, 66, -115, -373, 64, 162, 99, 278]
3333B78k2m9N3k89j26L8r3n2J69k6o3N7O31k12J60j45n36kj00L58l36J67J8R6
3357b6n6J18N2K0J97l30M14o35J71J89k84J24j23j28M50j30l7M9O23m78J56l92
3379e6k19l6mL30k94L22j62j23N5J04N50l81j67Q6j12j73K82q9P4k41Q9J94j3
3402A6J36K17l76M91m52O8l21Ok8j16O0O3L88pJ02l98K25j0K05o8l14k09J61j6
3426a77J07J35P1k14LK21p2L25m15J46l47K49j20J38m45M13j0pr5l0K33p6J32
3449A65%j78m9k63J19j71p8L33lP8q6L50J90p9k32j74K49m08j75K85J13p1J54
3472F9K0q1M4J41j07J11Q0l12K16k38q1J52k73J2L12RJ49k58mJ06j80Q7l1L1j65
3497a91o3Q0N9J24O2m9p5l0J09j18J97m43k9L86o3J40Rl03L35K05l51k0Q7N0j82
$$ y = [278, 256, 207, 260, -29, -155, -117, -210, -262, -93, -119, -182, -125, 506, 294, 454, 309, -227, -229, -329, 29, -307, -140, -122, -26, -82, 36, 88, 108, 305, -25, 389, -246, -75, 114, -170, -46, -169, -297, 153, 23, -14, 35, 658, 180, 336, -56, -275, -311, -315, 15, -279, 43, -119, -242, -187, -83, 467, 86, -81, 5, -107, -280, 2, -87, -13, -254, -165, 29, 16, 152, 369, -7, 484, 32, 100, -221, -215, -243, -359, -299, -236, 152, 145, 247, -151, 74, 64, 269, 201, -113, -322, -161, -177, -70, 65, 136, -78, -75, 146, 74, 399, -16, 130, -217, 32, -88, 50, -395, 18, 8, 1, -94, -124, 109, 33, 165, 165, -13, -62, -325, -206, -377, -455, -122, -125, -47, -133, 217, 407, 328, 96, -78, 171, -237, -412, -127, -14, -85, 69, 89, 8, 52, 193, 86, 197, 277, -35, 181, -57, -138, 14, -259, -247, 65, 74, 223, -35, -39, 67, -113, -26, -57, -26, -191, -254, -174, -115, 9, 71, 22, -53, -83, 26, -92, 105, -338, -367, 19, -44, 96, 105, -198, 137, 342, -9, -29, 58, 108, -74]
3522g4j3J20q4J22l40N8Q0L5O23o22L18J1q4k69K98j25k6j33qJ69J55j24r0n3
3546e6J23j59J01J84m01m4M08N8l11jN6L1J51k10K6J57K53l84m05M47j41M41n42
3569b18mN34N3n9n9J9o9j11J39l77J41j20j1J81J28j31j60J18M2J20k9k12j9j32
3593b36K91m7k62k8P2K42j79J67L0J98r6Q7o33M21J75m86J54L9J98k48p4N06l30
3616c9K29M5K25l78p6Q9k77q1Q7N2k04M39j63K75J82k24r2O5k94J03n5j70K54
3639hk1J12l94M43Qj22K8K46k30K14m2j73l12O9Q8l4l8o6O9M89j72M31m97J72
3663B60l41k1L35n50J89j32Q1K00R0k85L23j36K72l82N5j93N3K01j24q9j51J87
3685a58N58l94K15K05k48j70M4lj12kN2k63K91j7K43l66O4J24J01j14R4K4l45
$$ y = [-74, -87, 33, -51, 71, -269, -211, -131, -96, 527, -95, 223, 234, 150, -119, 179, 54, 28, -105, -113, 56, 211, 87, -3, -56, 67, -92, 9, 193, -208, -252, 156, 214, -97, -98, -42, -11, 140, -70, -44, 113, 366, -18, -423, 24, -117, 324, -218, -222, 312, 365, 306, 247, 266, 197, 86, 225, -152, -11, -131, -142, 39, 167, 36, -124, -6, 36, 156, 127, -85, -104, -236, 55, 8, -254, -282, -210, 32, -147, 20, 50, 248, 152, 239, -394, 27, 202, -284, -130, -91, 107, -141, -215, 291, -39, 190, 235, 460, 82, 6, 95, -182, -263, -176, -124, -328, 111, -52, 223, 405, 181, 89, 154, -140, -37, -92, -262, -8, -29, 83, -311, 132, 140, 18, 46, 292, 62, 276, 234, 61, -251, -182, -94, -128, -166, -232, -163, 326, 154, 585, 88, 260, -81, -102, 233, -317, -128, -260, -179, 21, 111, -174, 149, 13, 285, -97, -42, -235, -182, 19, -105, -194, -345, -158, 400, 6, 221, 426, 178, 8, 52, 49, -63, -65, -13, -276, 15, -2, 241, -125, -61, 63, 164, 50, 144, 168, -177]
3708a77K19j12k0K4K77m28K51n6J29J15J1l05p8K23j24l0j38L4L50n77K18Q3j68
3731b79M74j02l8J53J54n72M9j44J87K5K45l73Q9M4J49J11k81L1j87j45L11J87
3753H8J22J44n73L16P3j28k08K29J06j53k02J62j8J74k68nJ3k02P56k96j85K10
3775A55k10L58m05k14K11L72k11j28J40j68J14N98q65J90J65l62L59M3j34j78
3795a70j66L2K67j75K2J2M03K9j68n8j24R8k4n73K70N62m60L12j79k64M04o9J99
3818A80l76K12J47p26Q31m37j36j1M27j07J16j33L87m79J32L8j80J52m8k13K3
3839b01K67M4k11R8L5K82k52k8J16J94m96o6K5M25m26K05k05O1K27j91K90L8P0
3862C01l92L0m0K96j49L9j43j65K72k44L45j82o7k1J50k0j90J36J65j24j27J31
$$ y = [-177, 42, -70, -90, -66, 211, -217, 34, -22, 107, 222, 233, -72, -150, 73, -51, -81, -219, -185, 165, -412, -194, -111, -279, 195, 93, 55, 208, 362, -210, -161, -305, -118, -93, 152, -221, -132, -88, 61, 172, -109, -78, -265, -410, -99, 88, 210, 354, -219, 97, 170, 42, -166, 63, 169, 16, -186, -24, -42, 132, -136, -141, -128, -330, 426, 130, -55, 155, -55, 303, -102, -316, -105, 267, 56, -72, 68, -100, 14, 612, -253, -63, 102, -260, 99, 142, 8, -170, -336, -304, -37, -212, -190, -178, 225, 254, 86, 28, -96, 2, -22, -595, -325, 237, -223, 89, -90, -354, 50, -19, 180, -196, 16, 163, -563, 268, -169, -305, -316, 111, 4, 120, -13, 374, -105, 27, 65, -115, 37, -11, -224, -201, 66, 110, -101, -3, 32, 314, 62, 34, 150, 344, -152, -218, -193, 232, -194, 11, -194, -133, 94, -97, 193, 231, 301, -91, -61, -101, 195, 46, 85, -58, -223, 49, -195, 150, -32, -99, -120, 30, 10, -180, -44, 121, -3, -130, 1]
3884Am4J97O6n5J63n42L46m04J84M88m33R2k16J63P7J10q2O4LJ77j49q6j08k55
3908b43K16j72q8J64L08J85k49l65N06l71J18j95R9m8J14J14j10MR8r3K85j54
3930A23k1j74K17m0nj96q7l72N86O4k80J35O3N0M0k98O01k78l76L93k75pK63J19
3954B45Ln58J91Q8J93l79Q2M30P9n92k0Rj14O9J05j48K53K78r6J58Q1m01J05l41
3978b80pK78P6k25%L02l13M81k56N0J0L12k87j30K13l19k39J92j43L09qP1J14
4001B01j67L68n66J48k59N9J8Q3J41J43k31l9M17l02k6K39k08J03j56k52K58k57
4023b85L65J05l05J14j17J54O1J83o1j62j71l8J39k29j12J74J25J24j39J44L13
4044C82m50K28o7j83m4L01k02k77K2N29k80J08j40O4K97l30j52K88J52mk28J3
$$ y = [1, -43, 154, 220, 165, 328, -214, 132, -272, -88, 400, -33, 59, -157, 6, 83, 193, 111, 175, 178, 355, 206, 120, 12, -243, -27, -199, -287, -123, 185, 370, 121, -244, 262, -109, 9, -186, -87, -135, -21, 93, -17, -13, 85, -8, 277, 123, 102, -72, 145, 105, 100, -96, -183, -555, 31, 95, -185, -50, 13, 63, 103, -195, 406, 128, -248, 145, -130, -137, 126, 245, 248, -310, -119, -31, 162, -217, -135, 295, 374, -218, -238, -229, -343, -274, -169, -317, -64, 214, 118, 276, 357, -44, 61, -280, -287, -9, 67, -158, -158, 144, -169, 312, 56, 106, 116, 428, 141, 11, 224, -95, -334, -142, -285, 24, 16, 87, 201, 34, 402, -164, -16, -275, -216, -198, -115, 26, 169, -62, -101, 316, 14, -12, 227, 19, 122, -34, -286, -28, -285, 80, 185, -120, -6, -123, 31, 92, 275, 214, 52, -119, -157, -18, -247, -359, -185, -60, 64, -75, 69, 382, -68, 160, 93, -90, -134, 167, -35, -312, -290, 239, -41, 67, -73, -9, 288, -42, -194, 94, 246, 242, 14, 27]
4066B7KOj41J21P9j17K69j52o8j59l4L13l95K32l0j05K89n53M11k30Q4Q4N1M3
4090B7o5k84K17J86j9k31R7J99K27k42k24K06p2J38o5j34j91K3K76K80n11R9K15
4113A52J7q4l20J69K44L1k96j8k8J20K13r2P1J06m6k77R7J51N1N0m13m6n6L04
4137A00j25J03r9k1lJ33K35m04J48J88k20o2j81J2L12l44P6M5M28o2r1R3p5pj16
4162F3J94k71j35pR2K3m6j20J83K35o5j6k04J2J95l58O0K6K5m81N06j54j09N10
4186A58j81j50L77j65j97K11k4l3k33L57l93L44k5Lo2J59j82j44K73j74lj82N5
4209b11M77k96L3j6R3K56m39J43L23j39m30L81n04K77Rk02L21J8l35M95p5k47
4231f8K00k4J41j43L3l93P3J53Q6j62pN8J62Q0N5m84R2K97n6o6L6k20N4J42j32
$$ y = [27, 29, 35, -106, 15, 94, -23, 246, 94, 26, -133, -167, 146, -249, -17, -47, -152, 137, -416, -5, -235, -151, -67, -16, 27, -38, -322, -105, 81, 62, -169, -72, 127, 354, 112, -112, 94, 22, 160, 95, -39, -230, -207, 69, 349, -162, -63, 152, 169, 85, -235, -66, 178, 209, -87, -105, -133, -13, 200, 108, 179, 285, 239, -38, 59, 210, 261, 311, -102, -148, -204, 100, -25, 78, -21, -42, -45, 88, 323, -81, 67, 255, 35, -27, -208, -196, 116, -228, -152, -107, 321, 259, 168, 261, 186, 179, 63, 257, -14, -149, -156, -64, -41, -87, -207, -24, 211, 146, 130, -74, -62, 133, -225, -165, -139, -114, -595, -89, -243, -352, 158, -23, -173, 204, 39, -158, 53, 29, -4, -237, 120, -273, 71, 46, 49, -13, 146, -36, -180, 93, -81, -84, -266, -211, 266, -30, 3, -13, 80, 336, -103, 40, 363, 224, -206, 175, -329, -52, -43, -245, 76, 94, -241, 254, 179, -68, 132, 108, 249, 106, 139, -254, -181, -28, 58, -104, -111, -53, 109, 189, 244, -240, -148, 149, 93, 27, 63, -157, -103, 39, -93]
4256i3K48k39m4L48J48j81l56K70l61K39l24K20K5J13O7L25k33k47l08L96n1J33
4278I5q6J88l74J56J05MM5K89p68M23m8l60K67o0q9J62K67o22L55K02k9j58K63
4301B27k28N0j27J12q0N6l54K76J53l77m0L01K96m7m94O00l75N1k7N1j69K05J01
4324A61m28M57k70J9K72l17J06Jj89j60O8K08k1j77M31k97r3K97O0k26P9P1k68
4347b16J77K0k55K80k07K19M8j28J8J13K77l89J00j31J2j40l5M28k46p1N4k21
4369b93N57j14L2j01K55n82M11k08Lk84n7L08J58k24K12L55o04J23j23L52j90
4390a4O4l24J42J54j31j86J59M91j37k2k76K04j25L68o70O35l23k77l1J53M9J38
4412D1j69Q5K98k92o4J18P7q6j1N0j61l2J70J31QK5l13L01j54J40L02p81M02n7
$$ y = [-93, 155, -84, -128, 220, 368, 187, -169, 101, -260, -21, -345, -125, -100, 13, 80, 405, 172, -75, -383, 13, -38, 95, 9, 197, -177, -21, 84, 88, 133, 422, -346, 77, 29, -331, -64, -124, -213, -51, 216, -406, -51, 151, 122, -36, 227, -1, 49, -78, 34, -46, 10, -344, -68, 85, -292, -332, -31, 265, 218, -276, 324, -51, 0, -27, 24, -145, 60, 161, -267, 190, -80, -61, 211, -106, 0, 1, -188, -348, -280, -72, -93, -270, 161, -136, -229, 68, 128, -98, -19, 52, -216, -39, -19, -274, 6, -201, 18, 66, -62, -44, 69, 346, -43, 57, -74, -62, -202, -237, 191, -55, -126, -72, -293, 264, 150, 182, 81, 336, -246, 165, -43, -40, -324, -381, -73, 85, -139, 73, 428, -176, -53, -176, 176, -14, 50, -274, -132, 22, -109, -295, -136, 355, 218, 196, -80, 124, -1, 367, -303, 332, 9, -268, -299, -146, -97, 41, -128, -43, 255, -37, -101, 17, 94, 8, -3, 47, -114, -146, 24, 155, 163, 188, -125, 176, 22, 162, 464, -317, 85, 28]
4436B8k85J43QL6J58p1L1R5k47K06j93K57j41k3j86K17r1l2J28L5K54j9k22j14
4460b8j50K39p4pj82J62Q7j25L64k54Q0p6n2J34k26K31k29K02k90L3m7K34L7p9
4484a6j20PJ47J00J09m17K91j40k12L15l04K16M16m53lL60k41n0j50R9K34l59
4506a71PJ75J64j84o1n4J90j47O9L3Mll02J90No6k64L57Ol5K51r5r8R6J68l40
4532a05K56k98Kk19J96n9L2k3M6K61R8rJ8J1k88N07n33J47m3k18P7M66k91j74
4556a43K82p8l18K54J99o1j0O1l01N1k5K53Lk34J11l3K44l98PL45l97K20L3k61
4580a96M8P7j4J35k03J46N0j98l0L23k88O9O5P4j50K58k53r8N21j02m46J89j58
4603a81K96J36k59k12L16k0j51j37J28PL3k98J54nK06l41J1K78J77j08n2j83o9
$$ y = [28, -257, -114, -106, -70, 88, 17, 48, 143, -104, 102, -91, 166, 25, 2, -184, 33, -58, -90, 38, 73, 327, 308, 86, -28, -178, 61, -13, -20, -202, -40, 47, -78, 286, 32, 112, 36, -16, 118, -108, 123, -106, 96, -194, -161, -208, 26, 63, -16, -136, -129, 18, 118, 227, -190, 101, -39, -251, 64, -240, -24, 392, -61, -64, 296, 55, 5, -145, -46, 188, -171, -164, 11, 175, -9, -70, -124, 66, -81, -12, 21, 25, 22, -280, -90, -85, -151, -415, -58, -52, -87, 164, 69, -29, 67, 235, -105, 151, -147, -145, -364, -168, -227, -195, -218, -172, 89, 187, 178, 196, 207, -81, 426, -107, 40, -3, -221, -144, 322, 31, -143, 139, 61, -257, -3, 196, 135, 125, 186, -115, -64, -89, 164, 167, -67, 44, 11, 255, -143, -136, 209, -188, 32, 65, -196, -148, -71, -85, 50, -153, -7, 43, -155, -185, 138, -150, -81, -16, 58, -92, 166, -87, -185, 336, 234, -212, -23, -181, 115, 251, -8, -220, 96, 76, -75, -212, -84, -77, -44, -342, -188, -193, 13, -328, -317, -39, 138, 30, -22, -205, -274]
4626b74Q7L92m02L30o4J05o2l9k74J65K19j42n4L5j41k3L09j40K01l74K84J08
4648B46m75J35K43k31K43j47J22k94O5J42K08k06o6r0J49j96J6J95k71J96j8K30
4670A96k51K7J04r1M4j99L01J1k65l6m5L47l79J53N25n47K88k77K12J43n61J02
4692a98J51J92j54k57K04m77M71m4L26j35n06L71j88Q3J82J62m27L14J02l20L78
4713B30m87J18M10k78rj40r0j35L14J96n0J55k21Q9nk5o1j15q4J94n9j23J93o9
4737e2K94k88L81l24J14N4j23O3j02l17L37j7j14M0l7J80ON1m40M38j75L30l24
4760b5j03q6q6K41O8N8m29J08K99J09j02J28k44Q9k6L05l41Qm7k20N25j67K02
4783B64o7J29k80J66j11l9J11r3J79l47J3j08ll4K88N41k78l60LL8M2Q9r2j45
$$ y = [-274, -187, 205, -197, 133, 69, 174, 112, 73, -201, -36, 183, 41, -13, 22, -119, -142, 167, 27, 228, -146, 138, 246, -229, -94, 149, -82, 161, 14, 136, -158, -93, 49, 257, 51, -15, -105, 44, -152, -136, 59, -212, -16, -34, 196, -55, -28, 76, -15, 29, -170, 131, 142, -123, -159, -204, 143, -236, -83, 442, -105, 183, -94, 118, 261, -300, -198, -47, 145, -9, -266, -62, -539, -68, -112, 214, 79, -427, -56, -244, -161, 21, 183, -244, 70, 172, -148, 230, -257, -139, 271, -7, -16, -156, -246, -381, -67, 129, 79, 234, 13, 102, 97, 72, 11, -104, -188, 6, -53, -176, 17, -52, 242, -46, 335, 11, 125, 179, 56, 119, 17, -300, 37, 20, -94, -54, -91, 89, 95, 146, -294, 144, -31, 299, -25, -128, -214, -300, -59, 9, 67, -362, -254, 45, 154, 52, 180, -64, 25, -1, 304, -37, -29, -76, -296, 229, 62, 264, 197, 326, 46, 212, 101, 62, 173, 80, 259, -88, -75, -183, -186, -220, 68, 609, 331, -29, -26, 12, 54, 143, 51, -94]
4807i4r2k4J80L8J72M2k85k6J6j82K00K24j27p4J64k10P4j49L76j74L57m18M0
4830B8M1r9K4k30L18j46j83j3K80K35m81j28M96j25O7l37J73J32j0j68J77J01
4852A52j3m06M45n8r8p0k23K42k67J32l9J88J62k34p5N17l81K6j98j46P09n02
4874a37o4R9Q4M03l91J68l8J17m14M52M3j11n91K69O6k23N06k61K2j37K69n06
4896c75M71o6J13j83L2l23L64l52J45P9N2K67o7P3O1j20j52j8K6r5Nk7J71j3j62
4921i4R4k6J14J8M0jk23M21k70k01p0n4K69P9k37L92j89j70r9P5L42j50J36m89
4945b93L55j55j49L82j76r7J96l49M49m1j41M9l68O32o6k52L7j3j94L39l17p2
4967b44K04K22j85J23j19K28l68R8J0p6R9l00M62m30Q08n61N3M4Q9M8k43j99j18
$$ y = [-94, -186, -210, -30, 8, 180, 222, -63, -89, -73, -255, -55, 169, 42, -32, 132, -78, -4, -153, 223, 49, 406, -12, 28, 69, -30, -6, -236, 82, -64, -247, -260, 20, 255, -226, -354, 142, 17, 84, -253, -80, 52, 42, -126, 51, 152, 139, -267, 178, 120, 22, -48, -271, -29, -296, -164, -203, -15, 147, -87, -162, 355, -26, 0, -198, -344, 365, -137, -201, -102, -18, 385, -6, 162, 124, 241, -173, 279, 322, 211, -380, -111, -45, -268, 238, -23, -1, -138, 131, -375, 96, 30, 143, -40, -8, -331, 33, -319, -174, -95, -43, 224, 157, 230, 291, 171, 19, 1, 27, -68, -63, -90, 81, 68, -94, 0, -26, 88, 106, 146, 145, -78, 343, 73, -128, -198, -252, 17, 96, -141, 251, 62, -108, -207, -132, 210, 60, 196, -293, 62, -93, -242, 140, -36, -133, 63, -286, 163, 122, -19, 30, -338, 294, 228, -24, 13, 0, -194, 145, -172, -244, -40, 182, -3, 120, 1, 229, -139, -41, -31, -107, -8, -308, 154, -276, 532, -29, 24, 68, 157, 205, -38, -237, -355]
4990c55J20L55k16%L17m7j84K1m2K18j15p5J90k52j90K08k31M04J47j59q0k06
5012a72K79j7k08J21K84m91J69R5l06J34K56q3p4k4O0R8K5r7k45L82k32l6N0J58
5036A26k49N4pl4J31J01l25Q6P9J42J43j46l53l4L85k92L47N7J20j26k44J79j31
5059IMj60N7J8P6j58L01k41N7K04j64J24O3l26N30l47l2j45K40q4J74j82j4r5
5083i1N3k2P4n2L5k73L07J40n03J65L80j89L25j31l06O6k34N12j70k31O2K24J4
5106A55p3l94J88K70j26J32j15j83K19j26j47L68K5k58j13J54k2m5O8k69N34j84
5128E8j57P4Q1p1k51K58j40K02j41l27K06L49j41K10Lj36n45K16L21k66K49j46
5150i4k2J62k41nJ00K64j84j15K57r7R1j02l06O29l76l27K77Q5k04K88l3j14O1
$$ y = [-355, -235, 120, -96, -96, 221, 174, -10, 11, -31, 187, 72, -3, 187, -65, -255, -47, -278, 126, 273, 114, 34, -172, 107, 90, -118, 3, 287, -204, -35, 60, -246, -112, 144, 61, -13, -37, 23, 121, 146, 49, -196, 186, -46, -82, -32, 126, -123, -69, -76, -110, 21, 122, -203, -117, -38, 104, 247, 101, -252, -286, 99, -193, 154, 211, 331, 205, -39, 140, 9, 13, -147, -90, -72, 4, -154, 147, -94, -37, 167, 3, 127, 190, -136, 394, 47, 15, -130, 110, 26, 200, 18, 4, -91, -38, -60, 14, -38, -3, -276, 31, 171, -332, -167, 213, 24, 349, 218, -88, -22, -256, 256, 86, -145, -83, 141, 155, 82, -312, -124, 146, 20, 152, 37, -146, 73, -53, -200, 168, 193, -65, -178, -24, -46, -91, -23, -292, 242, 58, -99, -25, 56, -15, -266, -8, -148, 54, -87, -414, -208, 141, 0, 210, 213, 77, -468, -252, 69, -197, 52, -94, -116, 46, -195, -200, -100, 164, -20, -135, 122, 25, 116, 14, -292, 337, -39, -366, -89, -4, -208, 80, 47, -67, -6]
5173fm6Ol8j25J8L58j38J25k33n8l3K03j02J08m15J63K20J6J88n1j75On8L07o9
5198A71k88K17K26j30k94j41L1L75m58N03r1j50L4N6J77k41j85l2J12J16J95k00
5220CK04j28l39L13J9j32k8J12K79o23M65l52J63l21L23n6K12k10K22R6j64k71
5242b13p7M83R1n58P39m88j0K74j77qk42M35j47k26K7l0N2j27J15J62N9l5k05
5265a06M39p1l87J32j11K88j25k00N4K76m34L23j08K78J05m77O27m85n7m9J37
5286D9Q4N7l92K0J21L72l89P1j53L2K28K75m29M9j71r1K16j2J5r9K05k67O1J26
5310b2K27l77L37l41J15NK72m43L09j35o6K31M8n9R9m4j69o0K17k75k7L77k30
5333a1j25j36J57N17j13p4Q6l05M63m35M0j20%J14rr3j5J40q5J89k45K92l18K57
$$ y = [-6, -52, -46, -84, -209, -191, 167, 29, 154, -79, -137, -170, 33, -69, 39, -376, -213, 7, 23, 211, 160, -15, -9, -67, 240, 171, -117, 100, 326, 196, -98, -239, -208, 167, -291, 212, 121, -29, 5, 61, 238, -3, -188, -220, -108, 8, 203, 3, 207, 79, -260, 53, 72, -60, -88, 24, 303, -320, 145, -207, -44, -365, -42, -98, 114, -96, 126, 222, 58, -213, -290, 193, 284, -274, 465, -23, -33, 241, 64, 56, -186, 249, 102, -124, -97, -127, -75, -202, -87, 75, 134, 99, -106, 333, 262, -125, 7, -104, 184, 59, -141, -87, 189, -245, 78, -30, 248, 353, -124, 503, 18, -39, -88, 49, 133, 190, -202, -182, -61, 311, -78, -7, -160, -128, 100, 375, -54, -5, -176, -267, -51, -63, -48, -147, 58, -209, -148, -22, 205, -172, 165, -176, -61, -56, 216, -227, 82, -53, -119, 112, 160, 101, 200, 156, -13, -73, 144, -131, -158, 219, -11, -136, -272, -115, 402, 289, 215, 301, -4, 459, 24, 64, -56, -56, 58, 49, -44, -59, 81, -4, 185, -60, 232, -86, 171]
5357A71k60l1l3L45j03q0K88k12k07m3p6K78Q0k32j11p2J79M6k09J06K43j47n
5380h5K78q8J3J4j28nk58L83k48J11j37N3m4k31N91j99p3J13J2Rk04R2O3l48M10
5405I4j03j36p1K32j75K20J26l49l1J87J74jk21k6N6N1J80N3m75J77M7L36j80
5428A65k27K25j21j62J18p6J41J97q1m83K29r1K26J06k39o8j01k8L75l0j28J72
5450A19l07O1R9N1M5J30Kj34M1k40K19k48K74l23K54j23J63k1J57j28k25K87l28
5473a75K40j82q0O1j26J25J00J52p0j16J80qj06k7l8L58k69k1K8l2R4j43J02k31
5497a84K42N8K3qk0Nl62J53K96r7J60j48j51k70K19K37p2j90M1oN6n5K4j72L5
5522a86j3N02k48j18J96n0k9K5j70J78m0l4k67K86J18k93K51k42L14j42j09L8
$$ y = [171, -89, -120, -153, 192, 89, 9, 297, 85, -122, -165, -241, 37, 117, -115, -226, -298, -119, -73, -282, -176, 67, -80, -85, 193, 105, 118, 132, 4, -1, -259, 124, -124, -13, -150, -97, -141, -372, 219, 20, -53, 60, 72, 81, -123, -31, 32, -316, 94, -9, -145, -216, 16, -159, 61, 187, -162, -193, -6, 168, 167, -54, -80, -24, 27, 207, 260, -215, -38, 9, 345, 165, -62, 163, 42, -120, -2, -78, 63, 260, 179, -304, -75, -166, 60, 166, -73, -141, -242, -270, 105, 75, -53, 119, -188, -127, -28, 23, 68, 198, 200, 66, 107, -133, 86, -162, 112, -211, 43, -80, 83, 62, 219, 91, -134, 153, -175, 65, -117, -197, -136, -262, -137, -37, 115, 45, -71, 109, 101, -5, -32, -70, 288, 19, -2, 26, -6, 88, -55, 47, -184, 58, 116, 139, 131, 111, 116, -246, -93, 203, 106, 266, 118, -33, -303, -84, 153, 81, -109, -68, -74, -18, -73, -49, -221, -186, -199, 303, 55, -63, 133, 83, 54, 79, -91, 87, 47, 13, -254, 32, 150, -143, 108, -134, 180, 38, -71, -33]
5544c3j80K72j65j69M26k31N8J93k0l1j20j97m9J73J37j32Q3Q5r2K0J9K02k92
5567d3o5KJ05J15n17L22J96l86M67l68K62Q8J03l43L26k17R5l64Q6J78j24K23
5589A41k73K54J95n3k28J5m1j51j24O3J24J22N6p6j08J92n7J77k97L25l0K14m90
5612e0k78K73l3M2o3L1K94k13q6o5K44r5O0r7N1j1m5J79J96k17k58J14n3n9Q1
5637e8R5j08R8j44n4K48l2k92K27rJ57k34J13j31K20j12j8k50K11j23K99l80L68
5660I1K43l36J43j08j66qJ20Lj31K33M3j4j47q1N2K93k14J15m10M05j9J2q8K15
5684B46l00l8j14J50K47l22oJ89M4k58Q8L02l70J70Lj68J96q2J37J02P3j89P1
5707A71k52M13l06O5j12j01J24m6NM9o1P3P0l10M58j70m11M17r7j55J59o3R0P9
$$ y = [-33, -213, 59, -106, -275, 151, -80, -22, 171, 151, 120, 0, -197, -246, -73, 64, -68, 15, 100, 8, 28, 47, 249, -43, -108, -106, -1, 114, -403, -81, 115, -271, 196, -172, 90, 178, 281, -62, 264, 47, 142, -222, -136, 42, -82, 141, -132, 122, 317, 264, 36, 51, 10, -141, -265, -202, -78, 44, 100, 24, -84, 108, 51, 228, -69, 256, 226, 440, -50, -328, -55, -88, -46, -109, -78, 216, 3, -83, -148, 96, 1, 61, -36, 15, 4, -41, 138, 334, 117, -141, -27, -80, -139, -58, 37, -71, 27, -117, -171, 77, 45, -247, -20, -29, 128, -106, 7, -124, 96, -16, -34, -284, -73, -196, 103, -277, 91, 334, -2, 141, 33, -133, -141, -21, -18, -149, 84, 127, 113, -34, -115, -63, 230, 16, 131, -279, 126, 107, 119, 31, 246, -54, -92, -206, -56, 191, -131, -137, 52, 96, -162, -74, 228, -142, 28, 31, -137, 59, -23, 114, 216, 289, 100, 171, -81, 332, 26, 91, -21, -122, 2, -44, -39, 10, -51, 22, 92, -218, 240, 70, -341, 76, -21, -176, -17, -80, 10, 89]
5731H9J28j25k38q7K22j85K11J93k34p0k53K04n5J58L36m24L92k99k7M2Q8O1J11
5754B38l09l1J42p0J04k44K22k98L26k32L02j44l0J88k23n3L59l46p3L54l56j18
5776b92N45p9l65M62M2k29M0j92P0k1R2K40m49K36J88j94J22j90m77N57l05M01
5798B02j94lK58l24K41j66j29r8K48K1P5j25J71j90K43l17l04M92q4m0Q0K5m3
5821C9j6o2L2r7r8l0J69J73l4k42K55J13l37J81J36j31Ro7J48l6J58j48j01j60
5845a46J7N2J61l2j58o5l8J92j03L49j85k22J71j10J27j89L85k62r0J75q3M3m
5868a5j18K66l83L01K26j32Ll30O9K71K20o35L66M7j94N2p0J57j5k12J68nj00
$$ y = [89, 217, 92, -146, -233, -11, -196, 15, 208, -26, -96, -349, -145, -200, -42, 294, -130, 262, -37, -64, -22, 66, 127, 238, -71, -102, 40, -30, 74, -170, 52, -246, 80, -152, 150, 6, -24, 164, -59, -112, 247, -99, -172, 182, -174, -292, 253, 174, -191, 271, 313, 84, 124, -68, 2, -19, 73, 313, -136, 100, 288, 94, 216, 26, -451, 106, -199, 202, 8, 5, 263, -61, 180, 14, -115, -213, 35, 56, 131, 6, 177, -13, 230, -87, -391, 101, 17, -23, 57, 82, 39, 23, -39, -7, -104, -202, -232, -63, 110, 76, -166, 89, 202, -135, 46, 182, 51, 60, -7, 141, 105, 263, 115, 14, -146, -129, -77, 84, 52, -106, -171, -209, -17, -120, 229, 44, -178, -7, -117, 10, -179, 206, -56, -146, 29, -54, -11, -15, -133, 133, -250, 51, 277, 145, 148, -182, -113, 158, 378, -257, 109, 156, -38, 14, -56, 101, 86, -126, 42, 37, -63]
$$ [...]
8191A97
##END NTUPLES=NMR FID
##END=
