##TITLE=1H_AM_NV169_3
 CDCl3
 8 sc, 
 2.10.2024
##JCAMPDX= 6.0         $$ Bruker NMR JCAMP-DX V2.0
##DATA TYPE= NMR FID
##DATA CLASS= NTUPLES
##ORIGIN= UXNMR, Bruker Analytische Messtechnik GmbH
##OWNER= root
$$ XWIN-NMR		Version 3.5
$$ Wed Oct  2 16:34:28 2024 Russian Standard Time (UT+4h)  she@DPX200
##.OBSERVE FREQUENCY= 200.1318
##.OBSERVE NUCLEUS= ^1H
##.DELAY= (6, 6)
##.ACQUISITION MODE= SIMULTANEOUS
##.ACQUISITION SCHEME= undefined
##.AVERAGES= 8
##.DIGITISER RES= 18
##SPECTROMETER/DATA SYSTEM= spect
##.PULSE SEQUENCE= zg30
##.SOLVENT NAME= DMSO
##.SHIFT REFERENCE= (INTERNAL, DMSO, 0, 15.7039)
##AUDIT TRAIL= $$ (NUMBER, WHEN, WHO, WHERE, WHAT)
$$ ##TITLE= Audit trail, XWIN-NMR		Version 3.5
$$ ##JCAMPDX= 5.01
$$ ##ORIGIN= Bruker BioSpin GmbH
$$ ##OWNER= she
$$ F:/spectra/data/she/nmr/H-F/1/audita.txt
$$ ##AUDIT TRAIL=  $$ (NUMBER, WHEN, WHO, WHERE, WHAT)
(   1,<2024-10-02 16:32:47.46 +0400>,<she>,<DPX200>,
      <created by zg, POWCHK disabled, PULCHK disabled
       configuration hash MD5:
       00 E9 B6 7A A2 85 ED C7 34 08 36 98 17 FE 4E 26
       data hash MD5: 16K
       8C 07 0A 5D 92 F6 99 7B 83 09 F0 46 7A 5C 9D 36>)
$$ ##END=
$$ 
$$ hash MD5
$$ 8F EB C2 64 DE 6D 7F 2B CA C1 F5 6E 7C EB C4 EF
##$RELAX= 
##$RELAX= 
##$RELAX= 
##$RELAX= 
##$RELAX= 
##$RELAX= 
$$ Bruker specific parameters
$$ --------------------------
##$DU= <F:/spectra>
##$EXPNO= 1
##$NAME= <H-F>
##$PROCNO= 1
##$TYPE= <nmr>
##$USER= <she>
##$AMP= (0..31)
100 100 100 100 100 100 100 100 100 100 100 100 100 100 100 100 100 100 
100 100 100 100 100 100 100 100 100 100 100 100 100 100 
##$AQSEQ= 0
##$AQ_mod= 1
##$AUNM= <au_zg>
##$AUTOPOS= <>
##$BF1= 200.13
##$BF2= 200.13
##$BF3= 200.13
##$BF4= 200.13
##$BF5= 200.13
##$BF6= 200.13
##$BF7= 200.13
##$BF8= 200.13
##$BYTORDA= 1
##$CFDGTYP= 0
##$CFRGTYP= 5
##$CHEMSTR= <none>
##$CNST= (0..31)
1 1 145 1 1 1 1 1 1 1 1 1 1 1 1 1 1 1 1 1 1 1 1 1 1 1 1 1 1 1 1 1 
##$CPDPRG= <>
##$CPDPRG1= <>
##$CPDPRG2= <>
##$CPDPRG3= <>
##$CPDPRG4= <mlev>
##$CPDPRG5= <mlev>
##$CPDPRG6= <mlev>
##$CPDPRG7= <mlev>
##$CPDPRG8= <mlev>
##$CPDPRGB= <>
##$CPDPRGT= <>
##$D= (0..31)
0 1.2 0 0 0 0 0 0 0 0.06 0 0.03 0 0 0 0 0.0002 0 0 0 0 0 0 0 0 0 0 0 0 
0 0 0 
##$DATE= 1727872366
##$DBL= (0..7)
120 120 120 120 120 120 120 120 
##$DBP= (0..7)
150 150 150 150 150 150 150 150 
##$DBP07= 0
##$DBPNAM0= <>
##$DBPNAM1= <>
##$DBPNAM2= <>
##$DBPNAM3= <>
##$DBPNAM4= <>
##$DBPNAM5= <>
##$DBPNAM6= <>
##$DBPNAM7= <>
##$DBPOAL= (0..7)
0.5 0.5 0.5 0.5 0.5 0.5 0.5 0.5 
##$DBPOFFS= (0..7)
0 0 0 0 0 0 0 0 
##$DE= 6
##$DECBNUC= <off>
##$DECIM= 24
##$DECNUC= <off>
##$DECSTAT= 4
##$DIGMOD= 1
##$DIGTYP= 9
##$DL= (0..7)
0 120 120 120 120 120 120 120 
##$DP= (0..7)
150 150 150 150 150 150 150 150 
##$DP07= 0
##$DPNAME0= <>
##$DPNAME1= <>
##$DPNAME2= <>
##$DPNAME3= <>
##$DPNAME4= <>
##$DPNAME5= <>
##$DPNAME6= <>
##$DPNAME7= <>
##$DPOAL= (0..7)
0.5 0.5 0.5 0.5 0.5 0.5 0.5 0.5 
##$DPOFFS= (0..7)
0 0 0 0 0 0 0 0 
##$DQDMODE= 0
##$DR= 18
##$DS= 0
##$DSLIST= <SSSSSSSSSSSSSSS>
$$ [...]
##$SUBNAM2= <"">
##$SUBNAM3= <"">
##$SUBNAM4= <"">
##$SUBNAM5= <"">
##$SUBNAM6= <"">
##$SUBNAM7= <"">
##$SUBNAM8= <"">
##$SUBNAM9= <"">
##$SW= 24.0689170037331
##$SWIBOX= (0..15)
0 0 2 0 0 0 0 0 0 0 0 0 0 0 0 0 
##$SW_h= 4816.95568400771
##$TD= 16384
##$TD0= 1
##$TE= 0
##$TE2= 300
##$TE3= 300
##$TEG= 300
##$TL= (0..7)
0 120 120 120 120 120 120 120 
##$TP= (0..7)
150 150 150 150 150 150 150 150 
##$TP07= 0
##$TPNAME0= <>
##$TPNAME1= <>
##$TPNAME2= <>
##$TPNAME3= <>
##$TPNAME4= <>
##$TPNAME5= <>
##$TPNAME6= <>
##$TPNAME7= <>
##$TPOAL= (0..7)
0.5 0.5 0.5 0.5 0.5 0.5 0.5 0.5 
##$TPOFFS= (0..7)
0 0 0 0 0 0 0 0 
##$TUNHIN= 0
##$TUNHOUT= 0
##$TUNXOUT= 0
##$USERA1= <user>
##$USERA2= <user>
##$USERA3= <user>
##$USERA4= <user>
##$USERA5= <user>
##$V9= 5
##$VALIST= <valist>
##$VCLIST= <CCCCCCCCCCCCCCC>
##$VD= 0
##$VDLIST= <DDDDDDDDDDDDDDD>
##$VPLIST= <PPPPPPPPPPPPPPP>
##$VTLIST= <TTTTTTTTTTTTTTT>
##$WBST= 1024
##$WBSW= 4
##$XGAIN= (0..3)
0 0 0 0 
##$XL= 0
##$YL= 0
##$YMAX_a= 58328
##$YMIN_a= -55105
##$ZGOPTNS= <>
##$ZL1= 120
##$ZL2= 120
##$ZL3= 120
##$ZL4= 120
##$ABSF1= 10
##$ABSF2= 0
##$ABSG= 5
##$ABSL= 3
##$ALPHA= 0
##$AQORDER= 0
##$ASSFAC= 0
##$ASSFACI= 0
##$ASSFACX= 0
##$ASSWID= 0
##$AUNMP= <proc_1d>
##$AZFE= 0.1
##$AZFW= 0.1
##$BCFW= 1
##$BC_mod= 2
##$BYTORDP= 1
##$COROFFS= 0
##$CY= 11.3945322036743
##$DATMOD= 1
##$DC= 2
##$DFILT= <>
##$DTYPP= 0
##$F1P= 15.6554695791079
##$F2P= 12.8336369535428
##$FCOR= 0.5
##$FTSIZE= 0
##$FT_mod= 4
##$GAMMA= 1
##$GB= 0.15
##$INTBC= 1
##$INTSCL= 1
##$ISEN= 128
##$LB= 0.24
##$LEV0= 0
##$LPBIN= 0
##$MAXI= 10000
##$MC2= 0
##$MEAN= 0
##$ME_mod= 0
##$MI= 1.114404
##$NCOEF= 0
##$NC_proc= 0
##$NLEV= 6
##$NOISF1= 3.799351
##$NOISF2= 2.8
##$NSP= 1
##$NTH_PI= 0
##$NZP= 0
##$OFFSET= 15.70392
##$PC= 1
##$PHC0= -26003.72
##$PHC1= 19.18747
##$PH_mod= 1
##$PKNL= yes
##$PPARMOD= 0
##$PSCAL= 0
##$PSIGN= 0
##$REVERSE= no
##$SF= 200.130013532006
##$SI= 16384
##$SIGF1= 3
##$SIGF2= 2
##$SINO= 400
##$SIOLD= 16384
##$SREGLST= <1H.CDCl3>
##$SSB= 0
##$STSI= 0
##$STSR= 0
##$SW_p= 3612.71676300578
##$SYMM= 0
##$S_DEV= 0
##$TDeff= 0
##$TDoff= 0
##$TI= <>
##$TILT= no
##$TM1= 0
##$TM2= 0
##$TOPLEV= 0
##$USERP1= <user>
##$USERP2= <user>
##$USERP3= <user>
##$USERP4= <user>
##$USERP5= <user>
##$WDW= 1
##$XDIM= 8192
##$YMAX_p= 0
##$YMIN_p= 0
$$ End of Bruker specific parameters
$$ ---------------------------------
##NTUPLES= NMR FID
##VAR_NAME=  TIME,          FID/REAL,        FID/IMAG
##SYMBOL=    X,             R,               I
##VAR_TYPE=  INDEPENDENT,   DEPENDENT,       DEPENDENT
##VAR_FORM=  AFFN,          ASDF,            ASDF
##VAR_DIM=   8192,          8192,            8192
##UNITS=     SECONDS,       ARBITRARY UNITS, ARBITRARY UNITS
##FACTOR=    0.0002076,     1,               1
##FIRST=     0,             0,               0
##LAST=      1.7004516,     0,               0
##MIN=       0,             -55105,          0
##MAX=       1.7004516,     58328,           0
$$ Real data points
##PAGE= N=1
##DATA TABLE= (X++(R..R)), XYDATA
$$ [...]
1964g87P32J049j623l72J565k02m39N15l26n08R28Kj530M39N76l24k50R1P60K72
1984E68m40r5M39k36M35q87m89N34L53j204K95P02K5O01k95j180Q41J469j547
2003a11m55Q07q9l79j79j24R8Q31l0r39N29J007o64k93l68J2Q83n92m56J73J46
2024a93J19j7O1q0R17o32k74J09n1K73l06p94M25J262q70n56Q35k8j17R5Lm41
2046b60M86L45j009j66K89N16Pl39j86Q41L0p20NJ08L63q8o97J05J08J90j00J03
2068f9j27Q92j57n86J0P89m72m34J12k90p7J23K0l42R99N00m35o39L29K88m1m69
2090g6p13M29N21j84j022Q31N42K01n08j94L33M06L09q33l61K36O8l23K81o4K61
2111A40M25j94j84K15o4j89k88j35K12j29m2J4M09j1K3n68M70M81j09q44k53R18
$$ plain form
1964 -787 -55 994 -629 -1001 564 362 -77 438 112 -396 532 534 -996 -557 19 -305 -555 -464 296 568
1984 568 128 33 472 236 671 -216 -705 -171 182 -1022 -727 -25 0 601 306 -874 -33 1436 -111
2003 -111 -566 241 152 -227 -406 -530 -432 399 369 -570 -41 966 302 9 -359 -347 536 -56 -512 -339 -193
2024 -193 -74 -91 -30 -110 807 175 -99 10 -41 232 -74 -868 -443 819 -51 -607 228 200 83 178 181 -260
2046 -260 226 571 -438 -604 -315 201 208 -131 -317 524 554 -166 -161 -53 310 222 -475 -370 -262 -72 -172 -69
2068 -69 -196 696 539 -47 -37 752 280 -154 -42 -332 -409 -286 -266 -608 391 891 456 -183 146 434 393 -76
2090 -76 -789 -360 161 -23 -1045 -214 328 529 21 -173 160 566 875 42 -319 -83 -15 -338 -57 -121 140
2111 140 565 371 187 402 338 149 -139 -274 -62 -191 -233 -219 190 179 202 -366 104 585 476 -368 -621 297
2133B97J34l38p38p0O01P13p53l86J029J48l68l84J60k8L63k28o85L27L44O4m59
2154b57j52P38k4j33L3k1L5q6l18o46R85j59p26M27Q16l40L24m27k71M53L93q89
2176b45m69L61N09M28m65l53K06Q05j72q30J24N79L3l22m34j76K71K72n9n25M98
2197C6K86K88m72K56K17p43q8L69n89K73P1l05J37O73n16k35N14P5P8K6p08J2
2219c45N01K05o67j59K73M53k6l80K07M84n7l07q06j29Q40M54j182K17O81J19
2239C76l57J0k62K22O16j007K62M46m73m00K77J32k14O65n66P6J071j76p38j23
2259a63J38K76l41o83J96N36M43l75l33M4P77Km69l42M91j95K56m07n29M91M95
2280C08l31n24R15p5kl0n01J64M06l57l91o8L00k81L51K89l5k8O40p05j49P19
$$ plain form
2133 297 431 93 -645 -715 -114 599 -154 -540 489 637 269 -115 45 17 380 152 -533 -206 138 202 -257
2154 -257 -409 329 305 172 205 184 219 133 -185 -831 154 -5 -731 -304 512 172 496 69 -202 251 644 -245
2176 -245 -714 -353 156 584 119 -234 -28 777 605 -225 -101 478 511 189 -245 -421 -150 122 63 -462 36
2197 36 322 610 138 394 611 -132 -220 149 -440 -167 -96 -401 -264 409 -107 -342 172 247 325 351 -357 -345
2219 -345 156 361 -306 -465 -192 261 235 -145 62 546 489 182 -624 -753 87 541 -641 -424 257 376
2239 376 19 29 -233 -11 605 -402 -140 306 -167 -567 -290 -158 -372 293 -273 -197 874 698 -40 -163
2259 -163 -25 251 -90 -773 -577 -41 402 27 -306 -262 515 517 48 -294 197 2 258 -149 -678 -187 308
2280 308 -23 -547 368 293 291 261 -240 -76 330 -27 -418 -486 -186 -467 -116 173 138 110 750 45 -104 615
2302F15m71n18k39O92J89n63r1J42K71J44K6r49Q30M69n68j94R2m99P07p3r90
2323i78P37O28K10q09M26LN7Po2j45J9o6j46o22M78N25k67j48L26J73J2n84L40
2346A14j4K31k29p75QQ44p9n12M28J16j39L16j25p40R45l91j72l09O80K17k9m67
2368h2j33J93L18k3n40k13O01L35o61j24K11J20J88p0m64J011r9n52j84O20j70
2389B82l74j72j68J74M27k98l79J016j19p0l98j53N11ql90m11K44M55j68k96K0
2410b75K35J58l8J72o6j74L90l66l40L9N96o93J72L41K93k49j73l48L5O99o07
2431a99k41J59M75l28j87Q9K1O0J3J92l01P13J9m90m95L0M76l21P2K20l1N30m81
2454ej38K32M10m78p6l19J10M00R3l60q7K48j42j74K46M89j97k27j65L50m71K64
$$ plain form
2302 615 144 -374 -613 79 268 -295 -386 -244 27 171 197 -752 78 547 -21 -215 -123 -622 85 12 -978
2323 -978 -241 387 597 -212 214 217 274 281 219 74 93 27 -119 -741 -263 262 -5 -153 173 346 358 -226 114
2346 114 100 331 102 -673 -665 179 100 -412 16 132 -7 309 184 -556 389 -2 -174 -483 197 414 385 -82
2368 -82 -215 -22 296 273 -267 -480 121 456 -205 -329 -118 2 190 120 -344 667 568 16 -168 452 282
2389 282 -92 -264 -432 -258 169 -129 -508 508 389 319 -79 -232 279 271 -119 -530 -286 169 1 -295 -275
2410 -275 -40 118 80 252 186 12 402 36 -304 -265 331 -362 -190 151 444 195 22 -326 -291 408 -199
2431 -199 -440 -281 194 -134 -321 -232 -211 -151 -138 54 -247 466 485 -5 -500 -470 6 -315 -243 -23 -54 476 -5
2454 -5 -143 89 499 21 -55 -374 -264 136 229 -131 -218 30 -112 -286 -40 449 252 25 -140 210 -261 3
2476Cj84j81J34L24R2k83K02K97J39m31k32k56P31j11q32J19O75j58k49L75j78
2497dR1M18k89m79N85K1o51m4J30N79k59l44k19L63K03J48l24j66N90l15K31m36
2519a71K42L1p8l43J8L26K59l26J24K31p4p9l91J24o4K94j06o29P97J65k35L0
2541A45m31L41Q7j72l83K68j1L32k81j55K29J51l45J35q4M94k40j96l11L9P71
2562C83m40k64k39N07N05k48m74P24j12j65n02J40L30l72l13J04n8L92J46j20
2582g6k35L71L57n69l8L90j94K8j94l01K15M29m39L51M6j1o5j39k19j8P00l54
2604C5j44j32M87j51m91L41L47l2k9k50J2J14K8l07p9kM24k28k6R5r0L85J69q38
2628c62N19M18m13l04J15P6K87k83n38M23L44L3m08n0M22R8k37k30q7L02j10K88
$$ plain form
2476 3 -181 -362 -228 96 188 -95 107 404 543 112 -120 -376 355 244 -588 -469 206 48 -201 174 -4
2497 -4 87 505 216 -263 322 343 -308 -352 -222 357 98 -246 -465 -102 101 249 -75 -241 349 34 265 -171
2519 -171 71 102 24 -319 -301 25 284 -42 82 313 239 160 -231 -107 -171 123 17 -612 185 350 115 145
2541 145 -286 55 142 -30 -413 -145 -156 176 -105 -260 -31 120 -225 -90 -174 320 80 -116 -427 -388 383
2562 383 -57 -321 -560 -53 452 204 -270 454 342 177 -325 -185 145 -227 -540 -436 -494 -102 44 -76
2582 -76 -311 60 417 -152 -190 200 6 34 -160 -461 -246 183 -256 95 141 130 65 -74 -293 -311 389 35
2604 35 -109 -241 246 95 -396 -55 292 260 231 -19 -7 107 135 -172 -251 -253 171 -57 -83 12 -78 307 476 -362
2628 -362 157 575 162 -142 -27 49 336 53 -485 -62 282 315 -93 -143 279 377 140 -90 -177 125 15 303
2650C03o52K3N64J64p74L72M04m08K26j67j06q6J97m82J73N17j59R0k38j38L39
2671A62M75o56q6L51j73k12k21K00J53m8M9J08J75k23k0j47j53K18K79j000P85
2692A6J43l83L16m6M5N31k9o67j48O10n03k67K39r0q4O50j71m50N60j94M2j99
2714g9K21m62O14n19K00k82k4N48l72k62P10R1l82m6J72k30L80N5q41N66J87n91
2736c46M18L84l61K6K92q52O19L10m27m82P7N68k55j54m7M45M42o19r1J65K95
2757D07k11n2l92j28M62L6k56j83L67J69J12l67K19J86n74j88M11k80K9K32l66
2778c67J03L45n3o5K71J28l95N3k13k05MK78k41j28M61K67J12l86l55M18L24m33
2800g7j64l3L95j09k53J07L40o76N07O0j72q9L38J66o25L07O3m77j28K81K21J37
$$ plain form
2650 303 -349 -326 238 402 -372 0 404 -4 222 55 -51 -137 60 -422 -249 268 109 199 -39 -177 162
2671 162 637 -19 -105 246 73 -139 -360 -160 -7 -55 -6 102 277 54 34 -113 -266 -48 231 -769 16
2692 16 159 -224 92 46 91 622 593 -74 -222 388 -115 -382 -143 -233 -317 333 162 -288 272 78 120 -79
2714 -79 142 -320 294 -225 -25 -307 -331 217 -155 -417 293 384 2 -44 128 -102 278 333 -508 58 245 -346
2736 -346 72 456 95 121 413 -439 180 490 63 -419 -342 226 -29 -183 -230 215 657 38 -53 112 407
2757 407 196 144 -248 -376 86 122 -134 -317 50 219 331 -36 183 369 -205 -393 18 -262 -233 -1 -367
2778 -367 -264 81 28 -37 234 362 -33 20 -193 -398 -394 -116 -357 -485 -24 243 355 -31 -386 32 356 -77
2800 -77 -241 -274 121 12 -241 -134 206 -470 37 97 -75 -164 174 340 -285 22 85 -392 -520 -239 -18 119
2822A19l18K38J45O6q7k14K29L41m01m38J62K28K1j38n9j57K66O73o73k40O02
2843C65k39o9o0k46k91N86j43J55LL00j46j91j05M17l18K35m1n64L68J83j63j88
2865a52o7L46n36M11l8n5M9N0j17K70L5o73O1N72k22K42J9j48k33M21n1p47M38
2888a25O6j2J64n19K93J98J05j87m19M53L71mn45J21Q7m8J01m82L30J05m7n2K22
2911A76J52j78k29L85n10J88r7J6j34N52k63k7m5J80J09k56j85j74N87p5k2o08
2933d58O85j48K63n09J01m1N62J52q22R1K32k3j68k07K83l8J44j21J15J63M3m15
2955a16j14L23k20k4j99J96J38J09j35j73M9M60j67K46k85J08n23K17j80j02M65
2976G3J4j99N0K78J06l76J62o7j2M95p51J33J80K65k71j90j5j6M03o0j82J0K17
$$ plain form
2822 119 -199 39 184 250 163 -51 178 519 118 -320 -158 70 91 -47 -106 -263 3 676 3 -237 365
2843 365 126 57 -3 -249 -540 46 -97 58 61 361 215 24 -81 336 18 253 212 -352 16 199 36 -152
2865 -152 -219 127 -409 2 -36 -91 -42 8 -109 161 196 -477 -416 156 -66 176 195 47 -186 235 184 -563 -125
2888 -125 -59 -71 93 -426 -133 65 170 -17 -436 17 388 384 -161 -40 47 -1 100 -382 -52 53 6 -46 176
2911 176 328 150 -79 306 -204 -16 -113 -97 -231 321 58 31 -14 166 275 19 -166 -340 247 172 150 -458
2933 -458 227 79 342 -167 -66 -107 455 607 -215 -124 108 85 -83 -290 -7 -45 99 -22 93 256 299 -116
2955 -116 -230 93 -127 -151 -350 -154 -16 93 -42 -215 -166 294 127 373 88 196 -327 -110 -290 -392 73
2976 73 87 -112 -62 216 322 -54 108 41 29 524 -227 -94 86 351 80 -110 -125 -141 262 202 20 30 247
2999B47k33k1l62L80j50j13J09J06o2J16j52J75M46k49k38k38M44m90L42o5r3
3020a01j17M78j91l46j28Q95n06K88j47K1o8j68r8j55L34K13k10j50K90L9K3j85
3042A1l3k28M37j01l76M48J07l81K21j56K9L35l52k40O54r1m25p5K3K43j02j29
3064a81O6N5L40K03m55k91N62j66n2k42j38M23j63J85l12o8K80J29l15J9L32k27
3086a6L1J3j43J38P9nj85K76l0k3j76j60L82k21j68P6J03K69l86J94q7L46m84
3109a77J93j72M6L78j19m54p4P14l06j57J79j05J24O1j68l0J61K74o39kL03k12
3131a82O4L37j11K93m32J59k48J20o0O4l63J55J08J7J04m18L30k65N67l57j19
3152b37P44Pl59j32j41J88j65q8k74M72K11n03J99r8J30M83p03Q1J35K18n4k63
$$ plain form
2999 247 14 -7 -369 11 -139 -252 -143 -37 -99 17 -135 40 486 237 -1 -239 205 -285 57 -8 -101
3020 -101 -218 260 69 -277 -405 490 -16 272 125 146 78 -90 -188 -343 -9 204 -6 -156 134 173 196 11
3042 11 -22 -250 187 86 -290 158 265 -116 105 -51 -22 313 -39 -279 375 284 -141 -216 -193 50 -52 -181
3064 -181 -115 -60 280 483 28 -263 299 133 81 -161 -299 124 -39 146 -166 -234 46 175 -140 -121 211 -16
3086 -16 15 28 -115 23 102 97 -88 188 158 135 -41 -201 181 -40 -208 -132 -29 240 -146 48 -39 307 -177
3109 -177 16 -156 -110 268 149 -305 -379 335 29 -128 51 -54 70 131 -37 -67 94 368 -271 -273 30 -182
3131 -182 -118 219 108 401 -31 128 -120 0 -60 4 -359 -204 -96 -79 25 -393 -63 -328 239 -118 -237
3152 -237 507 514 155 23 -118 70 -95 -183 -457 15 226 -277 -78 -176 -46 437 -266 -185 -50 168 114 -149
3174a49k9J71J19J74m87K46K52J00k86k2Nj28M9l85J93J87k67J31K82K00j36n0
3196A70l78J02J06P8k13M3k83N07m48M32l85L88K61n36N18k21L16m72l8P3N1J1
3218H2j67k0j16J82K02n41N34k22k5J99NKK4M7k69P1J7o6j59K13R6K67J10o26
3242a60j16J88L39n40j43L42j52L00P8l7O1j74M40m33o5L74l68N1k48L42K59m16
3264g8K83l70J23K87k61j68K40L0k41O4j71M0M9j71M65j62J51q0J23j30o1J80
3286A42k15j68M17m06M19l72J31J12J47m10L09j31K02L6l4m55L92K76n33j20K20
3307d1K8J95j08J79l84J78k32K97j61J87R9m97K45m0P2L56k17k3J13m26R6j22
3329b06o8L09p9M6j11O8M9R8K0n7l2m0M5j34lM7j22j0k07O15k5l14J06O8K3j37
$$ plain form
3174 -149 -178 -7 112 286 -201 45 297 397 111 89 94 -34 15 -370 -177 10 -257 -126 156 356 220 170
3196 170 -208 -106 0 78 -135 -92 -375 132 -316 116 -269 119 380 -156 362 141 457 -15 -53 20 71 82
3218 82 -85 -105 -221 -39 163 -378 156 -66 -91 108 113 115 139 186 -83 -12 5 -61 -220 -7 89 356 466 -160
3242 -160 -276 -88 251 -289 -432 -90 -242 58 136 99 160 -14 426 -7 -72 302 -66 -15 -263 79 338 -78
3264 -78 205 -165 -42 245 -16 -184 56 86 -155 -91 -262 -222 -173 -344 121 -41 110 30 153 23 -38 142
3286 142 -73 -241 176 -230 189 -183 -52 60 207 -203 106 -25 177 213 179 -276 116 392 -141 -261 -41
3307 -41 -13 182 74 253 -131 47 -185 112 -49 138 237 -260 -15 -55 17 373 156 133 246 -180 -84 -206
3329 -206 -274 35 -44 2 -109 -41 8 106 126 69 37 -3 42 -92 -95 -48 -170 -180 -387 228 203 -111 -5 63 86 -51
3355e1k2j7OQ6j82Q7j27J26jJ13m4J5K00j59l1l7J6P7l17J75K11J97m79K68k68
3380a58K51O2k9l77n9K47j12J28O4K80k96L7N7m0P9J29k74K2P9k43q8K59J02l91
3404b71L85l37O3L83j45k9j88J06N05k97j92m2l59N56M8k08L6j09M31n61J67J70
3426A12Nr2m17K82O3L06k18k4k3J0J78j25R7j53N7l0j89K34m30M96j29K5j75K05
3450F5L59l25j90j80N93o87K35q6L93k92m58P76j88J40m96L56J10j46P9j37j77
3471b56J3M26m00K20j67M8K90k26J33J04r3K30m12K85o0N1n68K46j05L11Q4j59
3493eo5M7M64n02r9K96J31l39l9k09N59k81o9J49N6j48K8J47j09J40J59k76M7
3516H2o9k4k20J11O5K81r4j14j42K03J79M0l11j70K33K7j44q5j3L32m4j17k34
$$ plain form
3355 -51 -73 -90 -84 2 -180 -93 -220 -94 -95 18 -26 -11 189 30 -1 -38 -22 55 -262 -87 124 321 -158 110 -158
3380 -158 93 155 126 -251 -310 -63 -175 -47 17 297 1 38 95 55 134 263 -11 11 90 -153 -241 18 120 -271
3404 -271 114 -223 -160 223 78 49 -139 -33 472 175 -17 -59 -418 138 186 -22 14 -95 336 -225 -58 112
3426 112 117 25 -392 -110 -47 259 41 17 -6 4 182 57 154 1 58 28 -161 73 -357 139 10 35 -140 65
3450 65 424 99 -91 -271 322 -365 -130 -216 177 -115 -573 203 15 155 -341 15 125 -21 58 -79 -256
3471 -256 -243 183 -217 3 -164 -116 174 -52 81 185 92 322 -90 195 135 186 -382 -136 -241 70 154 -5
3493 -5 -70 -23 441 -61 -160 136 267 -72 -111 -320 239 -42 -111 38 94 -54 -26 121 12 152 311 35 82
3516 82 13 -11 -231 -120 -55 226 132 18 -124 79 258 298 -13 -183 50 77 -67 -152 -165 167 123 6 -228
3539b28J59M9o7R7J9k62K73J88m43M12j19j51L0J32J40J77l63NJ27j58j46J08
3561b1m9o8J88q9j76M33O9k14l94J97J44j49k08K35J53j73J78K67m64K18P2l71
3583b22J1K60K11m03N5j12J85L22p53L88K52j6N9k71nj30K09Q7j29j86J60kK07
3606A77l56K51P9k17K94l16k28O07J45o15L60j31n8k52N65j02l21j12M51l63K88
3627A46o1m17M37j78j00K54N8kr9J5m7j08L80k60j6j99pK0K83q5l3J4J72K11n85
3652b07K99J06m41J63o1J01OJ29k06J79Q5Qj29O3k43M21n53K90K23m40O1J66k71
3675b51K56J49l63Q4J75k27N43m98L54k93K28j38j72j76J37J36k38J35N1K34q6
3696D0k29j40N2N24j26j36K38j99J75l70M29k87M4K57j84j84j9K21m21J38J80
$$ plain form
3539 -228 -69 -20 -87 10 29 -233 40 228 -215 197 78 -73 -43 89 229 406 43 48 175 17 -129 -21
3561 -21 -70 -138 50 -39 -215 218 287 73 -321 -124 20 -129 -337 -102 51 -122 56 323 -141 77 149 -222
3583 -222 -211 49 260 -143 -88 -200 -15 307 -446 -58 194 178 237 -34 -39 -169 40 127 -2 -188 -28 -30 177
3606 177 -179 72 151 -66 228 -88 -316 291 436 -179 181 50 -8 -260 305 203 -118 -230 221 -142 146
3627 146 85 -332 105 -73 -173 81 139 137 38 53 6 -102 278 18 2 -197 -204 -184 99 14 -19 -5 167 378 -207
3652 -207 92 198 -243 -80 -141 -40 -34 95 -111 68 153 161 32 95 -148 273 -280 10 233 -207 -146 20 -251
3675 -251 5 154 -209 -125 50 -177 366 -132 222 -71 157 19 -153 -329 -192 -56 -294 -159 -108 126 40
3696 40 -189 -329 -277 247 121 -15 223 24 199 -171 258 -29 15 272 88 -96 -115 106 -315 -177 3
3717Co8K39k15J3M3J35m03K27l22L89j00k85N0J69L59l26l0j17M77L98m87j24
3739B5J21l50o1J99j54J32J10k90L36M8R9l6n4k30J32J48j85l01K75K44k28r1
3761a11l65L74L17oj67J2K40k54j97k4N60r8k79j16L32j49j58K64m01L51p2j5
3783C8l19K76K6j19K30m27M66J5Q3l04R3K12l99j04K85k36J81J65l20J90p5P9
3805C6k09K35L83k60o2l80L28l9l80M63o22M74J67j23J0l9Q8k18J84n7k87N77
3827B69m20K78j9m34J20P3J79L29j48p6l1q0p4l31K52J66N5j96L5j57R3J53k1
3850A5m12L74k64qN82k44j39L49l81K31j78j72N48o5j26P2n3j13m3l5j09K50j21
3873d2oK14p6p6k26L28j96q8K45q4o3k67K52K72Rm41L45Lj29K5k37K37k85K02
$$ plain form
3717 3 -65 174 -41 -28 15 150 -253 -26 -348 41 -59 -344 -294 -125 234 -92 -122 -239 238 636 149 25
3739 25 146 -204 -265 -66 -220 -88 22 -268 68 116 215 179 125 -105 27 175 -10 -311 -36 208 -20 -111
3761 -111 -476 -102 215 209 42 54 294 40 -157 -181 379 281 2 -114 218 69 -89 175 -226 125 53 38
3783 38 -281 -5 21 -98 132 -295 171 186 269 -35 58 270 -129 -233 52 -184 -3 162 -158 32 -43 36
3805 36 -173 62 445 185 123 -257 71 32 -348 115 -507 -33 134 11 21 -18 70 -148 36 -21 -308 269
3827 269 -151 127 108 -326 -206 -133 46 375 227 151 120 40 -34 -365 -113 53 108 -88 -53 -210 -117 36 15
3850 15 -397 -23 -287 -295 287 43 -96 253 -128 103 -75 -247 301 236 110 182 129 16 -27 -62 -171 79 -42
3873 -42 -48 166 90 14 -212 116 -80 -168 77 -7 -70 -337 -85 187 196 -245 100 103 -26 -1 -238 -1 -286 -84
3897h4Jj00L04j68j40K92j84K42o3j89K38jk43j22N18l52N18m43j25K8L48j91
3919H4n7K5K35j44k48J1K52l43J28K6j79L50j98J59j52K13k63j55K71k50N96l51
3941A0j04L6j36j30M06j91P3J11j26J83J25l1J00o35K34J67m5l65O83k33l03K13
3963D2l25J15J67j12J65k53o0j4J98N8L1K2k94L40l70Q36m93K1j78K91j10J9j66
3986g0O1J2k46N23k30j64P5J84j4J06k98L4mj07q3J07L8k57L59j8q8k15K97k04
4010b02Q2K33n3m8%J70J44j32k30j66r7N61k34Q5k35K57j53j86J84j61J20K32
4032A71l53J37J66k31K86k12K44o8k55lK43l28j02J57m7j25M18J29N9m15J88j21
4054f2l3M9o8J75j31j4O1o7K5L07j66k08j96L44j66J10P4L3j38j95L17r0j65K48
$$ plain form
3897 -84 -83 -183 121 -47 -187 105 -79 163 100 -89 149 148 -95 -217 301 -51 467 24 -101 -73 275 84
3919 84 27 52 287 143 -105 -94 158 -185 -57 -31 -210 140 -58 101 -51 162 -101 -256 15 -235 361 10
3941 10 -94 -58 -194 -324 82 -109 -36 75 -51 132 257 226 326 -309 -75 92 47 -318 365 132 -171 42
3963 42 -283 -168 -1 -113 52 -201 -261 -275 -77 -19 12 34 -260 80 -290 546 53 74 -104 187 77 96 -70
3986 -70 -9 3 -243 280 50 -114 -39 145 131 237 -61 -27 -31 -138 -221 -114 -76 -333 26 8 -80 -295 2 -202
4010 -202 -120 113 60 12 12 182 326 194 -36 -202 -299 262 28 113 -122 135 -18 -204 -20 -181 -61 171
4032 171 -182 -45 121 -110 176 -36 208 140 -115 -118 125 -203 -305 -148 -195 -320 98 227 286 -129 59 -62
4054 -62 -95 -46 -114 61 -70 -84 -23 -90 -65 242 76 -132 -328 16 -150 -40 34 67 -71 -266 51 -39 -204 44
4078D4J80k38n3K57j01r0j1j1m2J06K08n31K74R3j78QJ18k13K31O5k84K79k25
4101a14l1k26L03n9K80l84k1K43m1J75r5K8k00K24j65L0P3L31j33m38L08K90m71
4124i3N74n75M7K55P1j00m1q6j3j45L87j14Q1j00k90j82P66l13l46K91j53L04
4146B25M9j75l16M71K3k76j02L60l18l1L8J60m9q1j67J19n5r5K80l46L31j6N1
4169H0l2o8RJ55o1J51L8k45K2m9K97k20J05r8R8l27J18K7J7k52K30L2k86M87k66
4194c8j5J30J23m77J99K44Ok10q4k03M20k99J65k62O1L50J12k97j63J98n7K04
4216A07j95L36K3j53j71J91j35k16M46J72k36m51L93l0k45n1N76l57M0l4K39k71
4238b2j59J3L14j01J24q0l20P02n47K27k61J73j03J1J96j24j65p7M56m07K8K11
$$ plain form
4078 44 224 -14 -67 190 89 -1 -12 -23 -65 41 249 -282 -8 85 -93 -85 33 -180 51 116 -168 111 -114
4101 -114 -145 -371 -68 -127 153 -231 -252 -9 -50 125 30 58 -142 82 -83 -53 20 351 218 -220 88 378 -93
4124 -93 481 -94 -47 208 279 179 138 52 39 -106 281 167 248 148 -142 -324 442 129 -217 74 -79 225
4146 225 274 99 -217 254 277 1 -101 259 -59 -90 -52 108 59 -22 -189 -70 -125 -220 60 -286 45 29 80
4169 80 48 -20 -11 144 83 234 272 27 49 0 297 77 182 84 182 -145 -27 0 17 -235 -5 27 -259 228 -38
4194 -38 -53 77 200 -277 -78 166 172 -38 -122 -325 95 -204 -39 -301 -240 110 222 -75 -238 -40 -97 107
4216 107 -88 248 271 118 -53 138 3 -213 233 405 169 -282 111 81 -164 -215 361 4 44 10 249 -22
4238 -22 -181 -168 146 45 169 89 -231 471 -76 151 -110 63 -40 -29 167 43 -122 -199 257 -150 -122 89
4260H9j33k36K62J16n1J22j43M7l3m5k20K87l38J78oj6J22j3L01p2j70m38N55
4283A65n48L98J90l43k91L72K08l61J76K6K4k39J00k14J61O4J53J25j64r7J27
4304C2lj4k4J12k12J46N2j69j67J25j2p2R4L23k16P6J96m66J52J92p0k08K08j8
4328E7l13K47j0l33K45oJ89n2L7J56j83P2j07R2l6k37J03K17k82P6K60q9j40M3
4352FJ0k9J4j22K00k32J56M9r8O6J09l45O46j43k87k06J76K9k6o3K16K19l37m2
4376c4O0l64M97j55l57M37k51m1J66J14m57L82L5j05J81k5k48L60k60K8P8j04
4398f3L94l35j96M17k67q2K84j55M36m69N4J10m3j36R8k01L2K34Opm26K91LP5
4422E4r9l6j9K37m4M7j98J96j59r9N4K69n8oj53K19K52o54k4J47j16K81l14R2
$$ plain form
4260 89 -44 -280 -18 98 47 169 26 73 40 -5 -225 62 -276 -98 -104 -120 2 -11 290 218 48 -390 165
4283 165 -383 15 205 -138 -429 -57 151 -210 -34 -8 16 -223 -123 -337 -176 -112 41 166 2 -95 32
4304 32 29 15 -9 103 -109 37 89 -80 -247 -122 -134 -206 -112 211 -5 71 267 -199 -47 145 75 -133 75 57
4328 57 -256 -9 -19 -352 -107 -113 76 24 61 217 34 106 -1 91 55 -182 -79 138 -144 -68 192 103 -37 6
4352 6 16 -13 1 -121 79 -153 3 52 -46 20 129 -216 430 287 0 -206 -30 -1 -27 -90 126 345 8 -34
4376 -34 26 -338 159 4 -353 84 -167 -208 -42 72 -385 -3 32 -73 108 83 -165 195 -65 -37 41 -63
4398 -63 331 -4 -200 217 -50 -132 152 -3 433 -36 18 128 85 -51 47 -154 -122 112 118 111 -315 -24 -21 54
4422 54 -45 -81 -100 137 93 140 -58 138 -21 -120 -66 203 145 139 -14 205 457 -197 -221 -74 -190 91 -223 -131
4446a31K0L20k39j97J90K2R3k32R5K55k64K17k52J21k66J31o3L89m17K02j86K50
4468E8j41J5o0J61q0Q3N4j38J29k49L82j60L74m03j10K32j96K05JR4k64j73L79
4491A93k20k0M76l41k03J43j37M13m53N0l30N67r8M3j30N9l2J06J47p22O50j91
4513c0J45k79L48j27J92j16Jj32J12j08J63n6j38O3m9J62p5L5J6k90P3q7P0J36
4537B9J10q7J06J17j90qM6k09K49j50K21m4Jq8j70K93l69J29k4m3Q9K5J33Q1m04
4562a57J09L57m28q9K26l82L53Q0l49K10q7P3M5K74l26k13L70k5j20L83m86L03
4584A21p1l63J46K24q1P8o05O34R9l21j1L5N8k2N90n78j59K45Q8k53L40j59p0
4607c5j5j01O6k52J93L42k44J66Nl9l15K03n0L58l00L6J99m13J77j44L67j52J22
$$ plain form
4446 -131 -111 209 -30 -227 -37 -15 78 -154 -59 196 -68 149 -103 18 -248 -117 -180 209 -208 -6 -192 58
4468 58 -83 -68 -128 33 -47 36 90 -48 81 -168 214 54 428 25 -85 147 -49 156 157 251 -13 -186 193
4491 193 -27 -47 429 88 -115 28 -109 304 -149 -99 -429 138 40 83 -47 12 -20 86 233 -489 161 -30
4513 -30 115 -164 184 57 249 133 134 2 114 6 169 113 -25 38 -11 151 76 111 127 -163 -90 -177 -107 29
4537 29 139 52 158 275 85 77 123 -86 163 13 234 190 191 103 -67 226 -143 -14 -38 -81 8 33 166 247 -157
4562 -157 -48 309 -119 -208 18 -364 -11 69 -280 -70 -157 -84 -39 235 -91 -304 66 41 -79 304 -182 121
4584 121 50 -313 -167 57 -24 54 -551 83 182 -139 -150 -115 -57 -79 511 -67 -226 19 107 -146 194 35 -35
4607 -35 -50 -151 -85 -337 -144 198 -46 120 125 86 -229 -26 -76 282 -18 18 217 -196 -19 -163 204 52 174
4630A74j81l2J19k14k12N82j71k83L95n4M22r37L32o5m8K08p6J91N4m4j39K4R6
4653A41k27K9J47j12j54J52Q9P9n42K62K92j32k35Q6K68m7r4J89k15j59P8P1K14
4676A80l88J10J61j20p6l8J40J27j56J41l03M1J66L4L8k57L53r5Lk75J48J16p0
4699b0L9k39P7K46k59K38j21k25M05N8n63J98N3l46N65P1j68p3J66k72J86M4j33
4722g3j04L31k47q5K23k19M10k09j58J19K33l44J73k68mK15N0Nq1n8J04O0l66
4745b93K76k2o7mp1j11N7K92j29M7o8p9J42mP0j30J83j46r2J27L95j95Q4k53O5
4770G4l6j24N2K83Nk98L19k21p0L56n07J60Q4j78K33L7k32JM07p4m84n4L58j21
4794c0q2K04K1l45K49J01l00K36J9l0J03p7J13k36o7P6j74J12Q7m8L29K5k55k12
$$ plain form
4630 174 -7 -39 80 -134 -346 236 65 -218 177 123 545 -392 -60 -125 -173 35 -41 150 204 160 21 45 141
4653 141 -86 -57 90 -22 -176 -24 65 144 -398 -136 156 24 -211 -125 143 96 2 191 -24 -183 -105 -34 180
4676 180 -208 -98 63 -57 -133 -171 -31 96 -60 81 -222 -181 -15 19 57 -200 153 58 61 -214 -66 50 -20
4699 -20 19 -220 -143 103 -156 82 -39 -264 141 199 -364 -166 -113 -459 106 177 9 -64 102 -170 16 60 -73
4722 -73 -177 154 -93 -178 45 -174 236 27 -131 -12 221 -123 50 -218 -222 -7 43 48 -33 -91 13 73 -293
4745 -293 -17 -39 -106 -110 -181 -292 -235 57 -72 -25 -93 -172 -30 -34 36 -94 89 -57 -149 -22 373 178 262 9 74
4770 74 38 -86 -34 249 254 -44 275 54 -16 340 -167 -7 77 -101 132 169 -63 -62 345 271 -213 -267 91 -30
4794 -30 -112 92 113 -232 17 118 -182 54 73 43 146 69 182 -54 -121 -45 -219 -107 -20 -68 261 286 31 -181
4818a81K95l33N95k49J34k1l43j34Q6K14M7j03k99K96N9j25j81J51M14k04k04
4839h6K3j6L86l77J00K22l01M3m1J54q2K0q8J55n2J59j5l05L56r7o5j25J06K9
4863A03L1n2M5J52m17K06l41L18k7o7L3J34j96K03k10O2R4l36K76k0K83k79J61
4886A56k55J61j68K70rk43l35K25M24j57K47j27l37K0k16L88j13J96km6rk64K3
4909a71J0J5P7J25J09l56K29j41Rk4K30P2j06k20J75K52k52J61j20M9r0Q6l8J69
4933B50j47Q2k90r1J87NJ78k06j14K11j27R2k19J13M55k76Q3k52M3R5k76K38n6
4956b2l6l1R6K1k23J11J38L2k58P9j60J76J37P2l25o1J62k3J71o6Q4Rj47j5K16
4981A37Kp3r8K62l37J04j96K34j16J78k79J41J97l28J48q3K84M5o0m0j63K1J7
$$ plain form
4818 -181 114 -219 376 127 261 240 -103 -237 -151 63 110 7 -292 4 63 -62 -243 -92 322 118 -86
4839 -86 -63 -79 307 -70 30 252 -49 -6 -47 107 25 45 -43 112 60 219 204 -101 255 158 93 -32 74 103
4863 103 134 82 127 279 -138 68 -273 45 18 -49 -16 118 -78 125 -85 -23 71 -265 11 -9 274 -5 156
4886 156 -99 62 -106 164 155 -88 -423 -198 226 69 316 189 -148 -128 -344 44 -69 127 125 79 70 -194 -171
4909 -171 -161 -146 -69 56 165 -191 38 -103 -94 -118 112 184 78 -142 33 285 33 194 74 123 33 119 81 250
4933 250 103 185 -105 -196 -9 -4 174 -32 -146 65 -62 30 -189 -76 379 103 186 -66 -23 72 -204 34 -22
4956 -22 -58 -89 7 28 -195 -84 54 86 -172 -93 -253 -77 60 132 -193 -254 -92 -115 56 -10 74 83 -64 -79 137
4981 137 139 66 -32 230 -107 -3 -199 35 -81 97 -182 -41 156 -172 -24 -107 177 222 162 122 -41 -20 -3
5004cn3m4K13k20L55k54M0k6N0l5j33Q3L01j79J7L0k59N25j86p3J09k60J34j79
5028d7k5P4K06n4k28l3P8j24J7L17n63N51k33QN4J58l96N2K78r4P9N2k83K97J1
5053A52l42L5J47J74l34M9k26K05J09Q9O0j79j64J86l4J04J22m51L17k22J75p3
5075a01P0M1J29k10K67k07O1P8l42lL00l55K53j3p0J45K0j98R3J31KJ23l74J02
5099e8k0l09J32k4L79r8j36K61k24J97q6J35j05J10j18j00L6Q0M9l6j21Q4o6j67
5123b05M27K1Rj97m9j90L4j15K58K32k61K26l08J86p3P5J34l99J73k33L88k50
5145a17J47p1k30J90J03J65K41o50M23l28J43J54j1L6m93J21K86j3k36K24J74
5166B58j42k86N43ml81p7J67j71l6M5R4O5l27J03K41P8j88k94O62n88N53k62j45
$$ plain form
5004 -3 -56 -100 113 -107 248 -6 34 8 58 23 -110 -27 274 95 112 142 -117 408 222 149 258 -2 132 -47
5028 -47 -72 2 208 154 -74 -107 -29 -153 -136 181 -382 169 -64 -56 -2 156 -240 -188 90 -4 75 127 -156 141 152
5053 152 -190 -155 -8 166 -168 -119 -345 -140 -31 58 118 -61 -225 -39 -73 31 153 -298 19 -203 -28 -101
5075 -101 -31 10 139 -71 196 -11 50 128 -214 -217 83 -272 -19 -32 -102 43 63 -135 -42 89 91 214 -160 -58
5099 -58 -78 -387 -255 -279 100 2 -134 127 -97 100 14 149 44 154 36 -64 -28 52 101 65 -56 28 -38 -205
5123 -205 222 243 252 55 6 -184 -150 -265 -7 225 -36 190 -118 68 -5 70 204 -195 -22 -255 133 -117
5145 -117 30 -41 -271 -81 22 187 428 -222 201 -127 16 170 159 195 -298 -177 109 96 -140 84 258
5166 258 116 -170 373 369 -12 -89 78 -93 -129 -84 10 75 -252 -149 92 170 -18 -312 350 -238 315 53 -92
5189i2K44j53J3J14j71Q0P0j93K37J55l40j90J85J63q3J61l44K09J26j90J18J7
5211A36j0m7J15j17k84JL68j27j33J30N6k26k9jO5K5J26J80j57q7M8L43l58J53
5235A70j79L2m3k00RJ2J22K25m51JK39K25j25j85L64k56O7j19K10m6M4k11J73
5258G8j84j19L26k7K48l30K45k92L2O1j46J41Pm1m53L98k8J90oj7j09l4J63k22
5282a19L04k18Q1L7J07r5j60L5P4K6j89Q8K1J31p3j24j45K73p6K39k35J97j47
5305C2p9K14j33K10O5k55l1p2J18j12l8o7j0Q4J26l26K08M6l3l9N6J66q2j18p7
5330a47L13k40j18K6J9L14j39M4m4O0j59J54N9p5j89J10J96j73%Q1k55QK98M5
5354A88j6P4l28O5J66k08P6n6J89m0R2k62M1J5Q1k9P4K83p04L25j76j5K28P5K5
$$ plain form
5189 -92 152 -1 12 126 -45 35 105 -88 149 304 -36 -226 -41 122 39 200 -144 65 191 1 119 136
5211 136 126 79 194 77 -207 -206 162 35 -98 32 88 -138 -167 -168 -103 -78 48 228 71 -16 32 375 17 170
5235 170 -9 23 -20 -220 -211 -199 -77 148 -303 -302 -63 162 37 -148 216 -40 27 -92 118 72 116 -95 78
5258 78 -106 -225 101 74 322 -8 237 -55 -23 38 -108 33 40 -1 -454 -56 -84 106 100 83 -26 -60 103 -119
5282 -119 185 -33 48 85 192 97 -63 -28 46 72 -117 -29 -8 123 50 -74 -219 54 -22 217 -18 179 32
5305 32 -47 167 34 244 309 54 23 -49 69 -43 -81 -148 -158 -74 52 -274 -66 -20 -53 -92 -36 130 48 -70 -147
5330 -147 166 -74 -192 -166 -147 167 28 72 28 88 -71 83 142 67 -122 -12 184 11 11 92 -163 -155 143 188
5354 188 172 246 -82 -17 149 -59 17 -39 150 110 202 -60 -19 -4 77 48 122 405 -299 26 -150 -165 63 138 163
5379A63m44M12k22P22q44N07q5j59k90L97j81k84J88R0R2K74l73J79j3j8j38q5
5401a12r5L7K21K27k35K09m45K11P8p1K4k53N9P9K50j03j12P2k05J06J48k68M17
5424B39m98K3J66K77j80l5K7m0K0N2l06Q8N94m82K98l22l8J53oQ2Jk35q0K76k39
5449a65J33j52N5K51n04J48q7Q5L51m16K66J82K33l94M3O1k07J53J40j75n98P60
5471A63k90K8Nj02N1l8J65r4K46j79K6q2J9L35j16l45K77k38L83m20K93oRK04
5495B94p19O45k27J63k77J44j92P3K66m04M19l41K33p3j55L9j05J48Q3J58k02
5516c0Q9o6L91n06K05J06k6j23J89l28P0Jq2K29o7j95P7J54k88J81J12k1m0j00
5540f8J04j68j19L9M5K59J09l97M96j48p9m06r8L35L21L2m29j4J07L17l00K08
$$ plain form
5379 163 -281 131 -91 631 -213 294 209 50 -240 157 -24 -308 -120 -30 62 336 -37 142 129 111 -27 -112
5401 -112 -207 -170 51 278 43 252 -193 18 96 25 49 -204 -145 -66 184 81 -31 41 -164 -58 90 -178 239
5424 239 -259 -236 -70 207 27 -8 19 -21 -1 51 -255 -167 427 -55 243 -79 -117 36 30 112 113 -122 -202 74 -165
5449 -165 -32 -184 -129 122 -382 -234 -321 -236 115 -301 -35 147 380 -14 29 90 -117 36 176 1 -597 163
5471 163 -127 -99 -94 -196 -145 -183 -18 -112 134 -45 -19 -101 -82 253 137 -208 69 -169 214 -206 87 81 90 294
5495 294 -425 220 -7 156 -121 23 -169 -96 170 -234 185 -156 77 4 -151 -112 -217 -69 14 172 -30
5516 -30 59 -7 384 -122 83 189 163 40 229 -99 -29 -28 -110 119 52 -143 -66 88 -200 -19 93 72 32 -68
5540 -68 36 -132 -251 -212 -167 92 201 -196 300 152 73 -333 -431 -96 225 257 -172 -186 -79 238 -62 146
5562A46k99k31M87%Jk22L8K33l3j22K01k70K3J55k24K65rJ7m74M16k63OL11k52
5586a00J34j85k59L16J73j53J64k26n9J28j4r6M11l65p5L18j20M0l3L18l15M3
5608D5m17K69p5MQ6j94O1R7K8RO7K70k09l3k16O8r1J13K32k18o7p2M08j22o6J27
5634A04J50o4j81K84l05J87o1k07k06j7J06RO1L6M88k70k27M54m34NJ96n3k3j65
5658a33J97l91O91k87j71m0K16p5M0j43pO7N2j69rK83j2Q8k81J73n6J92n19oM08
5683A08K12k47o4j51N6J10j6M1k26K00K19k62j73J82J39J06l84%K35j16K42j54
5705E7J62j43j95j04K22j83k7K48L8j46j59K19j5J6j24K57P7k59K26j77P2pl25
5728b70J88k10K98Q0j20LL5J45j00j93L23j41m3J94l2k76Kpj7p7K81k20L40m6
$$ plain form
5562 146 -153 -384 103 103 104 -118 -80 153 120 -2 199 -71 -48 107 -117 148 139 156 -318 98 -165 -159 152 -100
5586 -100 34 -151 -410 -94 79 -74 90 -136 -195 -67 -81 -177 234 -131 -206 112 -8 32 -1 317 2 45
5608 45 -372 -103 -178 -174 -88 -282 -221 -124 -96 -87 -20 250 41 8 -208 -140 -231 -118 114 -104 -171 -243 165 43 -23 104
5634 104 254 190 9 293 -12 175 114 -93 -299 -316 -210 -201 -140 -104 384 114 -113 341 -93 -88 108 55 32 -133
5658 -133 64 -327 364 77 -94 -134 82 7 47 -96 -103 -36 16 -153 -162 121 109 197 -84 89 33 225 -294 -300 108
5683 108 320 73 9 -142 -86 24 8 49 -177 23 242 -20 -193 -11 128 234 -150 -150 85 -31 211 57
5705 57 219 76 -119 -223 -1 -184 -211 37 75 -71 -230 -11 -26 -10 -134 123 200 -59 167 -10 62 55 -270
5728 -270 -82 -292 6 86 -34 -31 4 149 49 -144 179 38 -5 189 157 -119 -117 -124 -141 -218 63 -157 183 137
5752A37k58K38j89J23j93N77m52J40K5k53J9M1rl4L32j78J24n81O08jO6m4l81
5775a43L51k23K32k11K8m6N38m18J70j42J2k35l56J28N12k95r3K15L0K8k49j23
5797b90L68q8k70K91k28J87J24q5J8j00J96J21l13Jj03k15M49j22j81P6J07p5
5819a32J61j55K00j92K41k19k32L25R2K40n3l39L55o7n45M60k63L69k38q2k06
5840b80R8J34m51N77r6J50k04M42l78k55M09j80p0J3J46K4pj82n8m9J24J22m1
5863a2q9J25j12K6m6j36Q9J56k63R2J25n7k1M08m93J57J13k89J53l1k37M00l00
5886b42M17k46j53K13J49R4j74j09m4m5J31R7m3j73K81j26j4p4oK49j02L8J05
5909B23r5j72k19J02J00J22R9Mj61L92o52M47k01r6OK83l31j73J63K15j48J74
$$ plain form
5752 137 -121 117 -72 51 -142 435 -17 123 148 -105 -86 -45 -54 -88 244 66 190 -391 217 216 282 238 -143
5775 -143 208 -15 217 6 34 -12 526 108 278 136 148 -87 -443 -315 197 -98 -191 24 54 82 -167 -290
5797 -290 78 -10 -280 11 -217 -30 94 9 27 -73 123 244 -69 -68 -171 -386 63 -59 -240 -164 -57 -132
5819 -132 29 -126 74 -118 123 -96 -328 -3 89 329 276 -63 292 225 -320 140 -123 246 8 -74 -280
5840 -280 -182 -48 -499 78 -18 132 -72 370 -8 -263 146 -34 -104 -91 55 79 72 -110 -168 -217 -93 29 -12
5863 -12 -101 24 -88 -62 -108 -244 -155 1 -262 -170 -45 -102 -123 285 -208 -51 62 -227 -74 -105 -342 58 -242
5886 -242 175 -71 -224 -11 138 232 58 -51 -95 -140 -9 88 45 -128 153 27 13 -61 -67 182 80 118 223
5909 223 128 -44 -263 -161 -61 61 160 164 3 395 -257 190 -11 -107 -101 182 -149 -322 -159 56 -92 82
5931H2l4q0R9K76j12l71k5J40j59J32j70K28K88k32P9J38l25n9J10P0L0j74k37
5954c06J80j70L16k51J99j05m2L26j59l0J9J80n10N03k80J87j86j71m8M28j87
5975a07P5O5J41j44k12M54l63P1J21l40j22M33j42rK10o9K96k46k97K40r6m16
5997d57J61M33P2p4l06L99l45J04K46J03l25k49J23K87J5p8l79K7L7K98j12K88
6019B68k77J89p4l4j29j5J99J46k65L08l78j29R0J03K20l61Q3J55j22l45M08j80
6041a40J23K8L6r5K4j24K72j66J57j06k79N93n47K65m7r9J23K62m26O7J46Q5k18
6064f6L74k37k35M33o3j27p1j5m4j30K28K48l62K6j23M16Jj28k58J65P3l16J6
6087a95J81n8J04rk6K53o67M00j97K13J71j23j37J03N0j11p9L06o8o2j70K5J96
$$ plain form
5931 82 48 -32 67 343 231 -140 -165 -25 -184 -52 -222 6 294 62 141 279 -46 -105 5 75 105 -69 -306
5954 -306 -126 -296 20 -231 -32 -137 -179 147 -12 -42 -23 157 -353 150 -130 57 -129 -300 -348 80 -107
5975 -107 -32 33 174 30 -182 272 -91 -20 101 -239 -361 72 -70 -79 131 62 358 112 -185 55 -41 -457
5997 -457 -296 137 209 135 -171 228 -117 -13 233 336 11 -238 -115 172 187 109 -270 -243 -206 92 -20 268
6019 268 -9 180 106 72 -57 -72 127 273 8 316 -62 -191 -101 2 222 -139 -56 99 -23 -368 40 -140
6041 -140 -17 11 47 -48 -24 -148 124 -42 115 9 -270 323 -224 41 -6 -105 18 280 -146 -79 67 152 -66
6064 -66 308 71 -164 269 206 79 8 -7 -51 -181 47 295 -67 -41 -164 252 253 125 -133 32 105 -211 -195
6087 -195 -14 -72 32 23 -3 250 -417 -17 -214 -1 170 47 -90 13 63 -48 -127 179 111 49 -121 -96 100
6110A00p5n2oj01J60q3j07MJ78J78j30J19k20L10k14j31M5K2K9O0j22J28J91r2
6134A91j47o3n1kl4l5r0L14r8K78k94k06M22k43J82o6j95L9j85L52kk63M48L4
6158B86r8k40l0R0L0j66o4N2L17j9J6J99j91k31jj7J08p6K51n93M52j35j98L70
6182A12j72L32m64J6J11j4N3J30M2J53P1k97K03m27K32m3q2%m7J46l02J59J28
6205D0Q7k03J0J44K2o9J15N7l54J08j07L17J32l10j48J59N3j55L44m80L60k97
6227a75K41L97k47j5m00L09m55M03l09o4J81P4M8J49J70l80K08p8J83l86J02n7
6249a01L77o47O19j53k83M5J86Kk14k10N06p0l69J71O1l3M8k3J84J00p7k90K86
6272A15L0k33L27m67K44J67k91J7J30l52J86J49k11l0R2M03l65qj2J15l8J28j39
$$ plain form
6110 100 25 -27 -33 -134 26 -57 -164 -160 18 196 66 185 -35 275 61 -70 -25 -3 26 86 -36 92 283 191
6134 191 44 -19 -70 -72 -106 -141 -231 83 -15 263 -31 -237 185 -58 124 58 -137 -98 -283 69 67 -196 252 286
6158 286 188 -52 -82 8 38 -128 -192 -140 177 158 174 373 182 -49 -50 -67 41 -35 216 -377 75 -60 -258 112
6182 112 -60 272 -192 -176 -65 -79 -26 104 146 299 370 73 276 -151 81 38 -44 -44 -91 55 -247 -88 40
6205 40 127 -76 -66 78 100 31 146 203 -151 -43 -150 167 299 -11 -159 0 53 -102 242 -238 122 -175
6227 -175 66 463 216 201 -199 110 -345 58 -251 -315 -134 -60 -12 137 307 -73 135 57 240 -146 -44 -101
6249 -101 276 -371 248 95 -188 -143 43 45 -169 -379 127 57 -312 -141 -80 -113 -65 -88 96 196 119 -171 115
6272 115 145 -88 239 -228 16 183 -108 -91 39 -313 -127 22 -189 -219 -127 276 -89 -97 -109 6 -32 96 -43
6295d3N1n8k38J70J93k25J49L19j68k28J06j9K54J18o05n0RJ32K21k98M7O1K03
6318A01k2m8k65M40l53K41k43K14k24M20j02k03J04j99K98p07L32p5L13K0k8k62
6340b48K11p6M6K80j30rk46O12j82j43k6L2l98L69K85m57J36K73n83L18O8k35
6362a03L5j85L90O9l19J11q8l5j2L3j05J73n7q7o0J91o6K96n3L4k75J86j85J68
6386E6L8J59j20r3r6j99J92j88J46N0J07p0K8QK55k84O2j41K54j4N6kk07J43k45
6411a05O8k02K15M9K01j48J49l37L95n29J96o6L80k43j41J95j87J34J1K88l18
6432EK22r2Jj57M13o2n03K32L6l15K94p2j0j02M0N8k49J19J57j04l1J99k5j00
6456d6K26j89m22N52k01L52j82r7j5m5j44L79j95j63K97m2J06j24P2l8J11j03
$$ plain form
6295 -43 8 -50 -288 -118 75 -150 -1 318 150 -78 28 9 263 381 -224 -274 -265 -133 88 -210 -163 -102 101
6318 101 79 31 -234 206 -147 94 -149 65 -159 261 159 -44 60 -139 159 -548 -216 -291 22 42 14 -248
6340 -248 -37 -113 -67 213 83 74 -172 440 258 115 89 121 -277 92 377 -80 56 329 -254 64 132 -103
6362 -103 -68 -253 137 206 -113 -2 -90 -125 -137 -104 -209 -36 -93 -180 -240 -49 -115 181 128 162 -113 73 -112 56
6386 56 94 253 133 40 -56 -255 -63 -251 -105 -55 52 -18 10 18 273 -11 51 -90 164 150 206 204 -3 140 -105
6411 -105 -37 -239 -24 25 226 78 227 -110 285 -244 -48 -114 266 23 -118 77 -110 24 35 323 5
6432 5 227 135 136 -21 392 330 -173 59 95 -220 74 2 -8 -110 -70 -12 -261 -142 15 -89 -120 79 54 -46
6456 -46 180 -9 -431 121 -80 272 90 -7 -22 -67 -211 168 -27 -190 107 65 171 47 119 81 192 89
6478H9k14K24k6o3m38K95N14l57l3J41J25l03N8j54L91j52k94n6J13J15j83M09
6500B01ok62QK8J77O9r3k78J31k11M53l90J91J02k91J10L26k66r2J18j07nN9q3
6524a11r6K97m5j79L1R9Q4j5J43k42J19k53Q3Q7j19K06k32J08ll2J08j91L44k10
6548a9J50j75O0j86j4J37L30m88N73l22p0J69m14N17l65k6n5L62j19J08q8l56
6570b91L91Oj07m3K05k67j84N79j74j90J02j59o0J83q7j4N5K08l2q8K5J1Q8k30
6594g3j03P1j44J61N7j68J91q1J75k72p1J93L53k58j27PL70j54k35j41Kn2N37
6617B38k65k4K46k52K01k34J48m8l2K00j22O3J74m4n32M66O8n34K75j71M00l54
6639a33L35j22K05%o8j29r8J91J22k22k94J33k55P17n18K7K23N7j82K20j46m7
$$ plain form
6478 89 -125 99 73 10 -428 -133 381 24 -9 132 257 -46 12 -142 249 97 -197 -253 -140 -25 -208 201
6500 201 195 -67 -59 -31 146 215 122 -156 -25 -236 217 -173 18 120 -171 -61 265 -1 -93 25 -82 -87 -28 -111
6524 -111 -207 90 45 -134 -103 -4 80 65 208 -34 85 -168 -85 2 -117 89 -143 -35 -38 -70 38 -153 191 -19
6548 -19 131 -44 16 -170 -184 -47 283 -205 368 46 -24 145 -269 248 -117 -143 -198 164 45 153 65 -291
6570 -291 100 106 -1 -44 161 -106 -290 289 115 -75 27 -132 -192 -9 -96 -110 -55 153 121 33 58 69 157 -73
6594 -73 -176 -105 -249 -88 -31 -199 -8 -89 86 -186 -257 -64 289 31 -96 -89 281 127 -108 -249 -247 -299 238
6617 238 -27 -51 195 -57 144 -90 58 10 -22 178 56 119 293 249 -283 183 251 -283 -8 -179 221 -133
6639 -133 202 80 285 285 217 88 -10 181 303 81 -213 -80 -335 382 -136 -109 114 171 -11 209 63 16
6661A6j70K68J1k70m6j29L21L2o2M2q2j0K18k35J12K03l48k7M27l83k03J38j00
6684b77R6J69J92m4j95M9l2K30j82m6QRl31L31L54k18j53l2R5K47q2q5J06l69
6708a60j52K58j30N7N2M02m02M24k90j12%L97m76kO0J65l22K81J34l63M42l98
6730a35P0L8L65l94l2Q3l0j57N4L51j59k43J85k61L59K45o94J84J34N80l92l78
6752b27K38J62n44N14j98o1K81P0n0k10J5K39k12l86L47K6k50J69j26J68K71l19
6774h3k9L5M33m61N1K09m92L08K48m12j51N69k05p9J52M9j99k60K67n7j07K14
6796@j91J85PK8l8J42k09P4n5j22k5K42j99M86l51J94L3n44L62l6J12j05J9J93
6820B02R9l56r5q8K81m8l18K92q9J42j77N42n03j48K59J20k00k58J06M57k87K05
$$ plain form
6661 16 -154 114 125 -145 -191 -320 1 33 -29 13 -69 -79 139 -96 16 219 -129 -156 271 -112 -315 -177 -277
6684 -277 -181 -12 180 136 -59 -10 -42 188 6 -40 -32 -23 -354 -23 331 113 -40 -72 23 270 188 103 209 -160
6708 -160 -312 -54 -184 -127 -75 327 -75 349 59 -53 -53 344 -132 -134 -74 91 -231 50 184 -179 263 -135
6730 -135 -65 -27 338 -56 -88 -5 -35 -192 -138 213 54 -189 -4 -265 94 339 -355 -171 -37 543 151 -227
6752 -227 11 173 -371 143 -55 -116 165 235 185 -25 -10 229 17 -369 -22 4 -246 -77 -203 -35 236 -83
6774 -83 -112 -77 356 -105 -54 155 -337 -29 219 -193 -344 225 20 -59 93 142 -57 -317 -50 -107 -214 0
6796 0 -191 -6 1 29 -9 133 -76 -2 -57 -179 -204 38 -161 325 -26 168 201 -343 19 -17 95 -10 9 202
6820 202 301 -55 -150 -238 43 -5 -323 -31 -120 22 -155 387 -116 -264 -5 115 -85 -343 -237 220 -67 138
6842A38j93l8L45L4l07j55J00k04L10rj31j56J03K41j19K09k28l4L36N8J6m29
6864a13K93j91j48J28m5l3L96k22j75K87p5l51M44j08k6n1R2j86o1K69k8Ro6K14
6888B53j52j42j34M55m09K23r9J45j19J20k27M4J24j73j34L32l52R9P5M35k53
6909A11j40L6L7l18M65k86K45J6l13Q2P6J4J4k03J73l0J82j99n9M8j1J39k71L12
6933A20r1J74L4k08j06J63j87L53j84RJ04m54J13M50l79J32m17K57P6J10J76l63
6955a18J57m6Q9j8J38j62l83L16j18j76M55k12J84j50j8ML19M8j85J12k23M4l24
6978b67J48J39p6J81k52O6K09k3P4l55J47J86j60O9m56J93K44j81p9J73n3J50
7000G7n8Q1R4J36n55P2M46m95J48k25L27j42K35k44r3L27K56l27R1j7n1K06l62
$$ plain form
6842 138 -55 -93 252 286 -21 -176 -76 -280 30 21 -110 -266 -163 78 -41 168 -60 -94 242 300 316 -113
6864 -113 180 -11 -159 -31 -76 -109 287 65 -110 177 102 -249 195 87 61 10 102 -84 -145 124 96 105 39 253
6888 253 101 -41 -175 280 -129 94 -5 140 21 141 -86 -42 82 -91 -225 107 -245 -146 -71 364 111
6909 111 -29 7 44 -274 191 -95 150 166 -147 -65 11 25 39 -164 9 -21 161 -38 -97 -49 -60 79 -192 120
6933 120 29 203 237 29 -77 86 -101 252 68 77 181 -273 -160 290 -89 43 -374 -117 -41 69 245 -118
6955 -118 39 -7 82 64 202 40 -343 -27 -145 -321 134 -78 106 -44 -62 -58 261 309 124 236 13 57 -267
6978 -267 -119 20 -56 125 -127 -61 148 125 199 -156 -9 177 17 86 -370 -177 67 -114 -193 -20 -73 77
7000 77 19 100 194 330 -225 -153 293 -202 -54 -279 48 -94 141 -103 -196 131 387 60 151 134 83 289 -73
7023g3nJ8L46l34k45L96K27l63q4K47l68p0L35j0j4l9j46K25l34J02M76q3j29
7046G5j62R1J40k95j77L54J2j30M02o09N87m1j76j36K99l27J66k98L78l85J37
7067i5J86k8k74RK65K23J42m89J26j62o3J35m3N9j30N0M8K99k90j58J03K87m3
7090A57m79J18J58R0l2K5L0j67K20j43l6J48j87K48j60M5p2J82O1l37j40k05K70
7113b06q9O76l59l5j06n7J08L5J30j46J40l79L78m09N86n3l13L11J98o14L09p0
7135C5l0r5N2K65j39Jl7k16J55j25K38k43R0lJ46k25M7L04k3k43P6k7k5J80m34
7160b76M32j20j14J4j45J51q1J11j16J27q3J43O6K35m29Pj05M06n0p4qK5k77j16
7184b77M02k55L01j49j30n3L10j21J40j65L72k98K12k23o1k49J35K85m62J51O7
$$ plain form
7023 -73 -78 -60 286 -48 -293 103 330 -33 -117 130 -238 -308 27 17 3 -36 -182 43 -291 -189 287 204 75
7046 75 -87 4 144 -151 -328 26 38 -92 310 -299 288 247 71 -65 234 -93 73 -225 153 -232 -95
7067 -95 91 63 -211 -202 63 286 428 -61 65 -97 -160 -25 -68 -9 -139 -89 -41 258 -32 -190 -87 200 157
7090 157 -322 -204 -46 44 12 37 67 -100 120 -23 -59 89 -98 150 -10 35 -37 145 206 -131 -271 -476 -206
7113 -206 -295 381 22 -13 -119 -176 -68 -33 97 -49 91 -288 90 -319 267 214 -99 212 410 -204 105 35
7135 35 5 -90 -38 227 88 89 52 -164 -9 -134 104 -139 -49 -52 94 -131 -84 220 197 -46 30 3 -22 158 -276
7160 -276 156 36 -78 -64 -209 -58 -139 -28 -144 -17 -100 43 109 344 -85 -78 -183 223 173 99 91 116 -161 -277
7184 -277 125 -130 171 22 -108 -161 149 28 168 3 375 77 289 66 5 -244 -109 176 -286 -135 -68
7205f8N3r6k48M54m69L95j7k28J57O8j34N7J06n08K64J93K0K6k20L96m1j56l7
7228c3K11l98p2J23K62k54K45k50J61o6L13m22J37K04m79K54L17j40l88K93j83
7249a65J10J41j10j31K07j96J34k73K54j45P4o0K17N4m14L13K77m07J95j44j18
7270a87M77l32K7j64k32L80O8k8k29K92q8j04M7K1M45m82K33j91l4j48J15q0r
7293b03J06l9K71l71K14J2J45P7j70r7N0m5k97L88J16Q2l04L20k79J75r6j14j79
7316b38j67M47J15l27K57j24K44j82J90k16q7P5J21J6J67j18j58j22o4L24m08
7337b55K46l2J68l8K2k9L7j25Lk56K21p5J8J64j09Q5K3j05J37J01k40J74q5k30
7361a80K11j88K20L57m54J21o2m1J56o8J24k45j8K0N0J07k09oK34J93l95J92o9
$$ plain form
7205 -68 -15 -111 -359 95 -374 21 4 -224 -67 1 -133 -76 30 -478 -214 -21 -1 25 -195 201 160 4 -33
7228 -33 178 -220 -292 -169 93 -161 84 -166 -5 -71 242 -180 -43 161 -318 -64 253 113 -275 18 -165
7249 -165 -55 86 -24 -155 52 -144 -10 -283 -29 -174 -100 -160 57 111 -303 10 287 -120 75 -69 -187
7270 -187 290 -42 -15 -179 -411 -31 37 9 -220 72 -16 -120 -73 -52 393 -89 144 -47 -81 -229 -114 -194 -203
7293 -203 -97 -136 135 -236 -22 -10 135 212 42 -55 -5 -50 -347 41 157 239 -65 255 -24 151 55 -59 -238
7316 -238 -405 42 157 -170 87 -37 207 25 215 -1 -88 -13 108 124 291 173 15 -107 -171 153 -255
7337 -255 -9 -41 127 89 111 82 119 -6 -3 -259 -38 -113 -95 69 -40 45 68 -37 100 201 -39 135 50 -180
7361 -180 31 -157 63 420 -34 87 25 -16 140 72 196 -49 -67 -47 3 110 -99 -105 129 322 -73 119 50
7384E0j74L1K22q4qQ5j37J67k34j25M72l29Q0Qm8j3m2L79n59K83Q2l32L65qJ24
7409B55l19j11O9J26K0p8K43L2m4j64K2r0l07K73jJ51O2l10K02k26L53l0J6l75
7433b31M42K24n07R5L1j50k9J52k78L16J0K4j12R4r5J50k17J85R0j84M7j24J25
7456E8o0j3m0R0q3J70j61J74k98J74N47o88J85Q4l04J59K29j60k7o2L00j79k91
7479a96M55p05L39Q4j1n0J37j64k18K06K82k14K36l67L99l01J30l12K17J40m1
7500D6N0J4Q7j11l37K51k3O5O6r9K19j36J62l36L35p7k03N8k12P4L1j40K60qo1
7525b5J84o42M83k00P8K19m6j62J00N1k43J94K61k04J12k63L61K7j49l53M46k70
7547d1k74K84K33k90L29j58j18j37o7jJ90L0o2j66RQ3L36k11k90J37N20l5m81
$$ plain form
7384 50 -124 -93 129 45 37 122 -15 152 -82 -207 265 -64 16 24 -24 -37 -79 300 -259 24 106 -226 139 131 255
7409 255 -64 -175 -106 20 40 -38 205 237 193 29 51 -39 -346 -73 -74 77 139 -171 31 -195 158 128 144 -231
7433 -231 211 435 -72 23 54 -96 -125 27 -251 65 75 99 -13 81 -14 136 -81 104 194 10 57 -67 58
7456 58 -2 -15 -55 35 -48 122 -39 135 -163 11 558 -130 55 139 -165 -6 223 63 36 -26 274 95 -196
7479 -196 259 -446 -107 -23 -34 -84 53 -111 -329 -123 159 -55 181 -186 213 -88 42 -270 -53 87 46
7500 46 96 110 197 86 -251 0 -23 42 108 9 228 92 254 -82 253 176 -27 31 -181 -107 -76 -216 44 36 -25
7525 -25 159 -483 0 -200 -122 97 51 -111 -11 40 -203 -9 252 48 160 -103 258 285 136 -217 229 -41
7547 -41 -315 -31 202 -88 241 83 -35 -172 -239 -240 -50 -20 -82 -248 -239 -156 180 -31 -321 -184 336 301 -180
7570a80K32j38n2J3K63Lk15J46o0K1K6l04J73M1r9J2J21q1k45N88p8q2j02J43
7594A46j58j12K56l8k3o3K36p0L7P8l83J52K20l49J37k83J86R3J13j50R0m1j28
7617e4k00K62j67J62j08L38o20M97j21K56l39q7j53M29M9J52k93k13M05n71L13
7638f3k10O13k99j29J28o0P0N7j58N5n7P2O0q0K03p0K59l24K75m78L56k51J55
7661A24l73K56k00K78J16k52J14J1j19L14k83M3m73O57k72j54L26k06J60k61L87
7682A93j15Q3m38M45l09M81n15K78j85J97j9k10R6N5K38j66M8o9P0k50K80m77
7704b89p9k4K26M5M55m67l2J72o1K83j65J66l22R9j44K54l7l3m2L86j12k12j36
7727f9K17k88J79L0ON9k08K20j46J53l25K59O6q5k35L85j01o3K25n31M64n94M41
$$ plain form
7570 -180 52 -86 -138 -125 138 141 -74 72 12 33 59 -245 -72 -31 -130 -118 3 -78 -323 265 187 105 3 146
7594 146 -12 -124 132 94 71 8 244 174 211 289 -94 58 278 -71 66 -217 -31 62 175 25 115 74 -54
7617 -54 -254 8 -159 3 -105 233 -387 110 -11 245 -94 -181 -334 95 144 296 3 -210 195 -376 -63
7638 -63 -273 340 41 -88 40 -20 50 107 -51 4 -53 19 79 -1 202 132 391 67 342 -136 220 -31 124
7661 124 -249 7 -193 85 201 -51 63 74 -45 269 -14 29 -444 213 -59 -213 113 -93 67 -194 193
7682 193 78 161 -277 168 -141 340 -175 103 -82 115 96 -114 -18 37 275 109 157 88 158 -92 188 -289
7704 -289 -368 -392 -166 -121 334 -133 -165 7 -54 229 64 230 -92 7 -137 117 80 47 5 391 279 67 -69
7727 -69 148 -140 39 69 75 134 -74 146 0 153 -172 87 153 68 -167 218 117 54 279 -252 212 -382 59
7750E9j20k2j26K14J51k2k2l61M46l91M42m34J48P3l7p9K16l00L0J73J05J6M37
7773E96o16j82J8M8r3K08R4j85j64P7L93j84m9J08j01K69j24l20K90j86l7mJ70
7796B6O12o91J71j4j18J97j55J91l22K98m36J67L8K0J43m5m5j40K00K4k03K92
7818B10j77lj34kK94l07L52j99k08K11k79M7L67l99Q3K20j22k63K71j1J3o4j84
7841b84K98q7K48J94n78L15l45L96Lj02M9l95M30k07Q3K24k79M23l66j86J49L4
7863A7k38J52p6J55J20k05J33n6q8L21p7K01m07j56Q2L8J74K6j66M08m08j47K25
7886B8m3J30j22k26K18K21k66K5J34L11l79M1j83M8L74p5K03m42J33%j07m0j17
7909a34Q0J0J94p6j45K47k46M0N5j54J5k5M6K55k93j97M11L9l1j56J96o4o1m7
$$ plain form
7750 59 -61 -83 -209 5 156 134 112 -249 197 -194 248 -186 -38 35 -2 -81 135 -165 -135 38 143 159 596
7773 596 -20 -202 -184 -136 -229 -21 73 -112 -276 -199 194 10 -39 69 -32 237 113 -207 83 -103 -140 -144 26
7796 26 638 -53 118 104 -14 183 28 219 -103 195 -241 -74 -36 -16 127 82 37 -103 97 121 -82 210
7818 210 33 30 -104 -106 188 -119 233 34 -174 37 -242 -195 172 -227 -144 76 -46 -309 -38 -49 -36 -100 -284
7841 -284 14 -73 175 369 -209 106 -239 157 160 58 107 -288 142 -65 18 242 -37 386 20 -166 -17 17
7863 17 -221 -69 -145 10 130 -75 58 2 -86 235 158 359 -48 -204 -122 -84 90 116 -50 358 -50 -197 28
7886 28 -15 115 -7 -233 -15 206 -60 -35 99 410 31 72 -111 -63 311 236 439 -3 130 130 23 -17 -134
7909 -134 -54 -44 150 74 -71 176 -70 -30 25 -129 -114 -139 -93 162 -131 -328 83 122 91 -65 131 67 6 -41
7933d1pP4j46P1l27O31j35m17M98K1o4j24p5l78M40k21K70l38K53q8J29K43k89
7956b0o1K5J36l02J52M9J27k07L15n57M94k39J29PL45j86k30j52l9L24l03PJ45
7979d1Q6N4J56l48K66k61J18j86K89j73q7M3k0k71L40M51m56l1N7L49m32Q4j47
8002a60Q2j55J69O0n6N9K0j2R2j94K58o6j26R5Q9Ok98K94o16N41J5j08r5L67k07
8027E4P9J44l51N6N2l25J02k26L26j24L22%k73j09K22R6l42N02M3L2k78j86K73
8050H9l1k14j10Q8K53j46J72j38J77k84J76j17j16O4J02O2J8j18L51k1m90QJ42
8073h3j52K51k99J84J01j1k65J30K87j64J02j92P1J36N5J1n04L73l48R6M47j61
8095F5Nj7j00M36l48K07n32K70L9r8j13K51q1lN4K35k88J16q8j13J84k79O54m06
$$ plain form
7933 -41 -48 26 -120 -49 -376 255 120 -297 201 222 158 34 -41 -419 21 -200 70 -268 -15 -103 26 269 -20
7956 -20 -81 -56 80 -222 -70 -21 106 -101 214 -343 151 -88 41 48 393 207 -23 -175 -214 110 -193 -186 -41
7979 -41 45 99 255 -93 173 -88 30 -156 133 -40 -127 -84 -104 -375 -35 416 -40 -71 -14 335 -97 -13 -160
8002 -160 -78 -233 -64 -4 -60 -1 19 7 99 -95 163 97 -29 66 155 161 -137 157 -459 82 97 -11 -106 261 54
8027 54 133 277 -74 -18 34 -291 -189 -415 -89 -213 109 109 -164 -273 -51 45 -297 205 248 280 2 -184 89
8050 89 58 -156 -266 -178 75 -71 101 -37 140 -144 32 -85 -201 -137 -35 27 45 -73 278 257 -233 -225 -83
8073 -83 -235 16 -283 -99 2 -9 -274 -144 143 -21 81 -111 -40 96 151 162 -342 31 -317 -221 226 65
8095 65 70 53 -47 389 41 248 -284 -14 25 -73 -186 65 -16 -19 35 270 -18 98 10 -103 81 -198 456 50
8119E0J04O6l74J46J40j64l98L92L83o49M12r5n1M7n2J68q1l23K45J03q6j1J62
8142A34l26j7K12j77J0m6O7J84m12J92J76P0j26J16J81j91k79j32M21j41O2J28
8164A06k01j4J25K26n75L47k16J22r5J92m8j44L19j39k48J73K42j32j32r4N66
8185C80m87K93j74j91R4K2
$$ plain form
8119 50 154 220 -154 -8 132 -32 -430 -38 345 -304 108 13 -38 9 -43 125 44 -279 -34 69 -17 -28 134
8142 134 -192 -209 3 -174 -164 -210 -143 41 -371 -179 -3 67 -59 57 238 47 -232 -364 57 -84 -22 106
8164 106 -95 -109 16 242 -333 14 -202 -80 -175 17 -31 -175 144 5 -243 -70 172 40 -92 -186 380
8185 380 -107 186 12 -179 -85 -63
8191f3
$$ Imaginary data points
##PAGE= N=2
##DATA TABLE= (X++(I..I)), XYDATA
0@%%%%%%%%%qJ6j6J6j6K4l2L4m2N0n8P2q3R4j09J25j46J69j90K14k45K77l11L49
33A84l90M35m85N41o03O68p38Q18r08J005j112J233j364J515j688J881k106K374
51A260k691L075l555M171n000O180q001J1201j8458O5133m234r5095P5911m829
65B5068m7627K8630j0553n0623N7774J5350n2659J7305L6448j7285P652L960j0846
78B594J5792K984k6875K75O794m711j2834j1368K2323J9939k8584M352L0470j5830
92E321O71J7216l8245q07M9248l0574l7383L7753O246k0177J3956r134r054L0815
106A5852m528j9471J5013k568p475J3422j6141j0573K2485p908q718K0882q312
119A960q296J7850j1072n099J8019k1919o240L3569j7139k1320L0468o018k2272
$$ plain form
0 0 0 0 0 0 0 0 0 0 0 -8 8 -8 8 -8 16 -16 18 -24 26 -32 40 -43 51 -58 67 -79 90 -100 114 -131 146 -165 184
33 184 -206 229 -256 285 -318 350 -388 430 -478 527 -585 648 -716 799 -889 992 -1114 1260
51 1260 -1431 1644 -1911 2260 -2740 3440 -4561 6640 -11818 53315 49081 -46014 29897 25068
65 25068 -22559 6071 -4482 -55105 2669 18019 -34640 -17335 19113 1828 9480 13440 2594
78 2594 18386 21370 -5505 -5230 1564 -3147 -15981 -27349 -5026 14913 -13671 -9319 21151 5321
92 5321 5992 23208 -15037 -15844 33404 2830 -34553 3200 9446 -10731 3225 -5909 -14963 15852
106 15852 11324 -8147 6866 4298 -3177 10245 -5896 -16469 6016 -1892 -10610 10272 1960
119 1960 -6336 11514 442 -4657 13362 -8557 -14797 18772 1633 -19687 10781 4763 -17509
132a7509K7789j642k7052K2701J0746k2573Q101P359j5664N366O360p460L377
145a01j954l021J4453j994j5241M179N851O45M66j1302R0J7430l977r715L423
160g68m653O251J4035k0633j1084K8616n6k2540R321N930q623P402k028j1379
174a0209J3665N072j5555K404R147j487j881n624j466J5317J367j8445JJ4634
188F940J945j0546j0303M416J4665l640j1526J488N938Q880L131j6891k305K2575
202A4767k493k0864L018P170l300k9n766m447J4518L713j2707N039J1885l127
216G377k857j016m731N598J561j5916m151J4354J849j1034m6J0675P166k128m127
231B574o66L360M025n245j2077J8R495k839r665L175O504K020K601m51p50O355
$$ plain form
132 -17509 10280 8638 -18414 4287 15033 -7540 561 7920 -7744 -2378 3982 -3478 -101
145 -101 -2055 -5076 9377 7383 -7858 -3679 2172 2817 3283 -8019 -7929 9501 5524 -4191 -768
160 -768 -5421 830 14865 -5768 -16852 11764 11708 -10832 -1511 4419 -4204 3198 1170 -10209
174 -10209 3456 8528 -7027 -4623 4524 3037 1156 -4468 -5934 9383 10750 -7695 -7694 6940
188 6940 8885 -1661 -11964 -7548 7117 3477 -8049 -6561 -623 8257 11388 -5503 -7808 14767
202 14767 12274 -8590 -5572 1598 -1702 -1731 -7497 -11944 2574 6287 -6420 -1381 10504 7377
216 7377 4520 3504 -1227 4371 5932 -9984 -14135 219 2068 -8966 -9012 1663 8829 6701 2574
231 2574 1908 5268 9293 4048 -8029 -8011 1484 -1355 -11020 -7845 -1341 679 3280 2829 2079 8434
247H434J366q080j098J880o299l309L269k920M0O495K2j546P283K715o770Q77
263B359M974m781m446K122k158m497L131J482l674J739N627J30J063K484k868
278B687j902M276k188p599M89L771j285N25K81k325M196N583o702n422P223M038
294E646o321j676J773k69K782p23o465K743Q728k854o634L706M409k855m648k150
310d808J539M256m25n950K097R031Q37q118j491O146J802m023m277j93N097L392
326D912q126o027Q404O461o912l595N260L728J460k648p097K309Q043n354q991
341h173N134P636k833l265m27J303L606r24p649R35R164L9p169O5N584M42k403
358A065l498k71M783K951o641l810O524K287n853k354K900K443J716j36l451K510
$$ plain form
247 8434 9800 1720 622 2502 -3797 -7106 -3837 -6757 -6717 -222 -200 -1746 5537 8252 1482 2359
263 2359 7333 2552 -1894 228 -1930 -6427 -3296 -1814 -5488 -3749 1878 2008 3071 5555 2687
278 2687 785 5061 2873 -4726 -4237 -466 -1751 -1226 -945 -3270 926 6509 -193 -5615 1608 5646
294 5646 -675 -2351 -578 -847 1935 1212 -5253 -2510 6218 3364 -3270 436 4845 1990 -2658 -4808
310 -4808 -3269 987 562 -5388 -3291 5740 6577 -1541 -3032 3114 4916 893 -3384 -3577 1520 4912
326 4912 -3214 -9241 -837 5624 -1288 -4883 377 4105 5565 2917 -4180 -1871 6172 818 -8173
341 -8173 -3039 4597 1764 -1501 -1928 -625 2981 2057 -5592 -4657 4507 4546 -2623 -2558 3026 3468 1065
358 1065 -2433 -2704 2079 5030 -1611 -5421 1103 3390 -2463 -4817 -1917 526 2242 2106 -1345 1165
374A165N629m397o215K370K591k167j187O22L92K539J247m073j049N087L66l742
390h22lK632j423p1p14k760N35M355j041k470L593K020k546m38n31k895R75J895
408B91l634p74M924P67j844J562J91p35K212J48m672Q68L795l540m178J240J493
425a886o34J602k22J82M774K797n126j977M013q28m608j187K89J184K057j524
441a094l703M362N057l552k955L255K281q49j904l181j03M443j833o149K324O332
457B731k77l165N19K472J178j680l680j713L560L017m984l392N895L301l804j357
473a379J750J112K015j775n542K871N086n230m165M093J286j37J032k877J004
488h56O244j709o716J987L890j951l280j05J368J933K3k348o62L090L591l132
$$ plain form
374 1165 6794 2397 -3818 -1448 1143 -1024 -2211 -1589 -1197 1342 2589 -1484 -2533 2554 2920 -822
390 -822 -825 1807 384 313 -401 -3161 -2626 1729 688 -1782 1811 3831 1285 847 316 -2579 -1604 291
408 291 -3343 -4117 807 1574 -270 1292 1483 748 2960 3108 -1564 -696 3099 -441 -4619 -3379 -1886
425 -1886 -2520 -918 -1140 -958 3816 6613 1487 -490 3523 2695 -1913 -3100 -2811 -1627 430 -1094
441 -1094 -4797 -435 4622 1070 -1885 1370 3651 2802 898 -2283 -2386 2057 224 -5925 -3601 2731
457 2731 2454 -711 -192 2280 3458 1778 -1902 -3615 -55 2962 -2022 -5414 481 3782 -22 -1379
473 -1379 371 1483 3498 1723 -3819 -948 4138 -1092 -5257 -1164 122 -15 1017 -1860 -856
488 -856 5388 3679 -3037 -1050 2840 889 -2391 -2496 -1128 805 828 -1520 -2182 908 4499 1367
504A367m435L407L048l429k425J104o2K357M62m306J851N471l181k106K201j331
520gR3K142m438k056N916m67m857L100K869j139P67j319p80J716n60j524j262
537a806j098L666J015m669R01N256j909j351J197k408J383L973n850k373N483
552A410j657j949K336k378L98P697l477n136N160J591n432J35O62j904K080n8
568e22j722J413K215O78r39k598L182K834n592j407M273j121j849L80l226K048
584a953O117n442k264O713r41j317K129n400j361Q426l144q619O250M221m014
599e99J230o97j334K688M54l658M63J338R66N95m209P13M922k753k976M584P74
616B501j124M32k542j35L327m112k990L564K09M8L335l777n67P579k140o778K718
$$ plain form
504 1367 -3068 339 3387 -42 -2467 -1363 -1425 932 1394 -2912 -1061 4410 1229 -877 1324 -7
520 -7 86 2228 -2210 -4266 1650 1183 -3674 -574 2295 1156 1923 604 -176 1540 980 -544 -1806
537 -1806 -2904 762 1777 -2892 -1991 3265 1356 5 1202 -1206 177 4150 -1700 -4073 1410
552 1410 -247 -2196 140 -2238 -1840 5857 2380 -2756 2404 3995 -1437 -1302 -640 -2544 -464 -522
568 -522 -2244 -831 1384 2062 1123 -1475 1707 4541 -1051 -2458 1815 694 -1155 -775 -4001 -1953
584 -1953 4164 -1278 -3542 3171 2230 913 3042 -2358 -3719 4707 1563 -7056 -806 3415 -599
599 -599 631 -66 -1400 1288 1742 -1916 -1453 -115 851 1446 -2763 -2050 2872 119 -2857 1727 2501
616 2501 1377 1809 -733 -868 2459 -1653 -4643 -1079 -870 -822 2513 -1264 -1831 5748 3608 -3170 -452
633d52K686j145m32k467j239L881n43k969J092m02K844M198n389k078O461j177
649B869n022J270M26j611L148q44k574M329k76l249K225p46j090K924k304l073
665c598N884R21o110O90L415M52k55k022k01K878N82k500j984j423K474K916l952
682a833k930O174L181l345j374j24J083J513k123k289J300M81L84J60k744N13
698a973M405k391k271M149J597l643J9P89l21m25k221l78L028O11o00J00j180
715g05K049K766m028m136L245L262k500k451K76K392J908j579j507Q85J334J334
731B545J23l755q49L895q05m950P88L016r11R5K250l75m48J692r03j497Q76Lk182
750a392L41J044j007K01K7j436K596K992m107j838N681j18l809R26j477j479M145
$$ plain form
633 -452 2234 1089 657 -1810 -3049 832 289 -2680 -1588 -1990 854 5052 -337 -2415 4046 2869
649 2869 -2153 -883 -457 -2068 1080 236 -2338 1991 1715 -1534 691 -55 -1145 1779 -525 -3598
665 -3598 2286 3207 -2903 -2213 1202 1654 1399 -623 -824 2054 2636 136 -1848 -3271 -797 2119 -1833
682 -1833 -4763 1411 4592 1247 -127 -251 832 2345 222 -2067 -767 -286 98 258 -2486 -1973
698 -1973 2432 41 -2230 1919 3516 -127 -108 681 360 -65 -2286 -2664 364 975 375 475 -705
715 -705 1344 4110 82 -4054 -809 2453 -47 -2498 -2222 170 2078 499 -1008 -123 1211 2545
731 2545 2668 -1087 -1936 1959 1154 -3796 -3008 8 -903 -808 1442 1067 619 2311 1408 -89 787 790 -1392
750 -1392 -1051 -7 -1014 -813 -786 -2222 374 3366 -741 -2579 3102 2984 -825 101 -1376 -2855 1290
767A290P99n998Q75O245n80l382K28O98Q65L68j980j933J253K625j181j516O67
784f57J373k63J124j462j052K862k53m455K071L012m477r27L823m80o31K331j896
801D3j277M607r50m933N15L018O31j664l229R36M730n95k398l77R77K528J23m307
819a622j029L571j77j674n15p50K516K424m017m8M334j725k056K531j523j390
835a150J944j758j798L297O88l066R21J939J082o41k639N52K779q44k731l52R67
852h10K223ml225l06L368K10r64k80j840K452K448m555j767L919q12j579K570
869A048j205r58L868j320k735K159m43j585K44M1n09J355k30j002K478J78j372
886A2J2K78M96J390l139k44J139n43L16m47k461K808L900l044j937L185p64o20
$$ plain form
767 1290 2089 -3909 -3034 3211 2631 -751 -523 175 1040 1408 -572 -2505 -1252 1373 192 -1324 -657
784 -657 716 453 1577 115 -937 1925 1672 -2783 -712 2300 -2177 -3104 719 239 -392 1939 43
801 43 -1234 3373 2423 -2510 -1995 1023 1654 -10 -3239 -2303 2427 1832 -566 -943 34 2562 2685 -1622
819 -1622 -2651 920 743 -931 -1446 -2196 320 2744 -1273 -1321 3013 1288 -768 1763 240 -1150
835 -1150 794 -964 -2762 535 1223 -1843 -922 1017 2099 1458 -1181 -629 2150 1306 -1425 -1777 -810
852 -810 1413 1409 -1816 -2122 1246 1456 492 212 -1628 824 3272 -1283 -3050 869 57 -1522 1048
869 1048 -157 -1115 2753 1433 -1302 857 414 -1171 -927 -886 -1395 -40 -270 -1272 1206 1384 12
886 12 24 302 798 2188 -951 -1195 -56 -599 -283 -730 -3191 -383 3517 473 -1464 1721 957 337
904C37J296l261j463M489r3l145J101J212o4Q22j070j575K191P44j827l95M40
921b61K65m56r78P29J181J2L6J70J40J492o84l613L64L232k255k112K065K99P58
940C84J351k903j99M276j51l573J82J383J50j2k347j405K058J837j652j298J808
957a11K609n32j782l33Q96m46q02p58j17K283K41k593O53K376r73j842J054m8
975b25R47R08k966p03L513n0k932J00J496J019O46j334j378J119J475k076k139
992b580J134J481Q0o01k50J184J174l85j537k38J711K49k008k86R51m15l24j83
1010h43n64J177J303r14p55K141L32j788m45J8m80O22n3j095O74K094m46j475
1028d97K62N20M10k68o92o95J173P29j228j536J162J571n17l46J45K86Q23j66
$$ plain form
904 337 1633 -1628 -3091 1398 1305 -1840 -739 473 409 1231 161 -1414 777 1521 -306 -701 -261
921 -261 4 -452 -1430 -701 480 492 528 698 838 2330 1646 -1967 -1603 1629 -626 -2738 -673 -374 384
940 384 1735 -1168 -1367 2909 2758 -815 -633 750 900 888 -1459 -2864 -806 1031 -621 -1919 -111
957 -111 2498 1966 184 -149 747 301 -501 -1259 -1376 907 1148 -1445 -792 1584 611 -1231 -177 -225
975 -225 722 1630 -1336 -2039 1474 1424 -1508 -1408 88 1107 1753 419 -959 160 1635 -441 -2580
992 -2580 -1446 35 115 -486 -736 448 1622 1237 -300 -538 1173 1422 -586 -872 79 -336 -660 -843
1010 -843 -1407 -230 1073 159 -596 1545 1877 89 -356 -338 -818 -196 -249 -1344 -670 1424 978 -497
1028 -497 -235 285 695 427 -265 -960 213 942 -286 -1822 -660 911 394 48 193 479 1302 1136
1046A136k176l58J958j003j454Q67N41L87R67o50o00J443Q57k332p22J576Q1q91
1064c73p05J66M19J041n68j410J214K468j019j760N52Q82l63j281o29l14K426
1081G46J98k337L23K445M05j856j54L43K45Q2j461m52J281J570j951r73J979Q20
1099A253l39q59m18R41Q44j070k284O41K151o61j684Q81J269N77j95r88l89J620
1117A290K27k447o26J718k12j154M29k1Q09J221q25j307J383J702k208j217Q31
1134d07Q98m40o26k48k16J342K63j015M3J669k28j194J68K4l00J98o77j050K082
1153B86P47j147m35J211J28o19L15j062j75J718m9k603J104J595r48n52O49k86
1171a23M57J134j087j508J008R10j292r73Q99Q52L31L0o20N15J110r74j534J99
$$ plain form
1046 1136 -1040 -1398 560 -443 -1897 -1030 -489 -102 865 215 -385 1058 1915 -417 -1139 437 518 -373
1064 -373 -1078 -912 -493 548 -20 -1430 -216 2252 1233 -527 25 907 544 -737 -1366 -1680 746
1081 746 944 -1393 -1070 1375 1780 -76 -230 113 358 440 -1021 -1473 -192 1378 -573 -1546 433 1253
1099 1253 914 55 -363 578 1422 352 -1932 -1291 860 199 -1485 -604 665 1242 1047 59 -330 1290
1117 1290 1517 -930 -1556 162 -50 -1204 -775 -796 13 1234 409 -898 485 2187 -21 -1238 -407
1134 -407 491 51 -575 -823 -1039 303 566 -449 -406 1263 1035 -159 9 33 -267 -69 -746 -1796 286
1153 286 1033 -114 -549 662 790 171 486 -576 -751 967 918 -1685 -581 1014 66 -486 163 -123
1171 -123 334 1468 381 -1127 -119 791 -501 -1474 -575 277 608 638 18 533 1643 669 -865 -666
1189f66R37q57l11qK1J174N41j284m93K183N22j968m69J379K84j048l40j084J70
1208a317J771k81j960K064J500k65j478l01N87N76p33j827O45K277n94j839Q33
1225c42Q83kj39l18n09J036P57j680j553J575J353j904q44J838R16k84l9J5p54
1244EJ218m30k602M34J726q11q70N35N10P54J076k253K61K719l24k620R92l03
1262A7n93K53n14j034J011J693o06r63J109J748j333j433J021L17j129O06r2j193
1280a115J323O72k145M69J510m63j96N74j348J193J388l166p04L301j241j514
1296a462K173n22p02K486q50k311Q53J341r36j173J69O36J105r61o46J056j51
1313A05L87K21j388Q37R52r67n69N13j189R60K86j731J311K486k515o97K447j244
$$ plain form
1189 -666 271 -586 -897 -905 -884 290 831 -453 -946 1237 1759 -209 -678 701 985 -63 -403 -1487 -1317
1208 -1317 454 173 -1787 277 1777 1512 34 -267 320 896 163 -1664 -1019 1258 664 -1175 -342
1225 -342 541 539 400 82 -427 609 1366 -314 -1867 -292 1061 -843 -1687 151 1067 783 744 759 5
1244 5 1223 793 -1809 -1375 351 -460 -1330 -795 -285 469 1545 -708 -447 2272 1948 -672 320 17
1262 17 -576 -323 -837 -1871 -860 833 227 -736 373 2121 788 -645 376 693 -436 170 78 -1115
1280 -1115 208 880 -1265 -796 714 251 55 629 -719 474 1862 -1304 -2008 1293 52 -1462
1296 -1462 711 189 -513 1973 1123 -1188 -335 1006 70 -1103 -934 -298 807 -154 -800 256 105
1313 105 492 713 -675 162 1114 147 -422 91 -1098 -138 148 -1583 -272 2214 -301 -998 1449 205
1331B05l94O73j061p38K835r19k064J303Q20m3l2j978P81K284j409j166J596j011
1349c18K75J022j962k19K652q16j188J087o49M99Q10k574j71L189j882j405K377
1366G27k83j175K107j355q44K319o04j810N01O29j41J75j870O01K380p41j708
1383a092J357l77Q82R17k568n16K309q02o86O41j478J512K328l317n39L577j613
1400E35j315J903j382j325K701j343j632K383j30j089J452j92l53J006j333q37
1416i51J738n53j482O25l61M46J225j157o65K287k79J14q9j643P43K104l055j574
1434b527K822l94j100K059j126r68L131l39k215J121P84j674P76q85p25J411o60
1451e09j133J430Q16q44J004m26K12R44j135p77O57q75o7O53j401N73K641j450
$$ plain form
1331 205 -189 484 -577 -1315 1520 601 -1463 -160 660 617 585 -1393 -612 1672 263 -903 693 -318
1349 -318 -43 979 -983 -1202 1450 634 -554 533 -116 383 1193 -1381 -1552 1637 -245 -1650 727
1366 727 444 -731 1376 21 -823 1496 892 -918 -417 212 71 246 -1624 -1023 1357 616 -1092
1383 -1092 265 -112 770 1687 -881 -1397 912 110 -576 65 -1413 99 2427 -890 -1429 2148 535
1400 535 -780 1123 -259 -1584 1117 -226 -1858 525 395 -694 758 566 213 1219 -114 -951
1416 -951 787 234 -1248 -623 -984 -538 687 -470 -1135 1152 873 987 898 -745 -2 2102 -953 -2527
1434 -2527 295 -99 -1199 860 -266 -1234 1897 1558 -657 464 1248 -426 350 -535 -1260 151 -509
1451 -509 -1642 -212 604 -240 764 338 550 1494 359 -418 239 -636 -703 -50 -1451 -878 1763 313
1469C13j549J907K76p32O81j092j161K351J06k942P89Q54P1O78r73n91K067J66
1487A219j709M12m03K07J043j281l19J430k75j10M31n25l83J016j261l25K064
1504A231q22j955J480L69j046P86j56r55K166J32j535l44Q28M19m96p99r85J366
1522c16J216r55m63J57P93L88q42m06N28R0k96O08j032l2J342j036p08J375j42
1541B69q24R12j89j98R36r89j192J569K19j316M59P68K61J13m41j387R87J261
1559A218j642n87K26J060L51m29j170N50Q48M20o61o34N43J092r68j136N51O1
1577c07k3L84l56J88J062o2r37L51P3o05J53m18j72P85J26j080O25J192l89q67
1597b77j09J049M31o69q58m17O46N15n91j434J357J005j11m47M62k34O33k63j293
$$ plain form
1469 313 -1236 671 947 215 896 -196 -1357 994 1100 -1842 -1053 -199 -128 550 -423 -1014 1053 1219
1487 1219 -490 -78 -481 -274 769 -512 -831 599 324 214 645 120 -263 753 -508 -833 1231
1504 1231 409 -1546 -66 303 -743 43 -113 -1068 1098 1230 -305 -649 179 598 102 -697 -1682 -316
1522 -316 900 -55 -518 -361 432 820 -22 -428 100 190 -106 502 -530 -562 780 -256 -964 411 269
1541 269 -555 357 168 -30 906 -83 -1275 294 513 -803 -344 424 685 798 357 -1030 -43 1218
1559 1218 -424 -1011 -785 275 626 197 -973 -423 425 845 184 -450 93 1185 217 -919 -368 -307
1577 -307 -330 54 -302 -114 948 886 -51 300 373 -232 -79 -497 -669 116 242 -838 -213 979 590 -277
1597 -277 -386 663 1094 425 -433 -850 -204 311 -280 -1714 -357 648 537 90 552 318 951 688 -605
1616f05m40J368k58r89J26P98l41N88p6m15Q59O80p40p77Q45j41j265J39J05k08
1636g47P95m39J22M39J387r36r47J97Q78k18n79o88J31R59M39j724n8J565O46
1655A222j229k10K26J80M02n33r32J01J176n95o71L80J088m86J20m5qL8k9q64
1675f69nR11m68l67M60K54K26Q4m01j18O17N79j122p79Q37L89n58m33l19N97Q73
1696E88k40p79J40J081l07j134L20N08l74Q7m90k79Q99Q63q85k14P13N2m68K66
1716C47m30pO0p1n23M77P53n02p32Q27N01j91n48p9K79M6M15j317l13J176K22
1737C90o57QO28J28L30p60p75O29Q98r88n96R26l02L45K07n31r3R37m27p81L11
1758a73M14k49n90P3J54L41K29j24l36P51O36o94p88Q93J77j018k10Q3M4O35j39
$$ plain form
1616 -605 -1045 323 65 -924 -798 0 -341 247 171 -244 615 1295 555 -222 623 482 -783 -644 -539 -747
1636 -747 48 -391 -269 170 1557 621 -326 -129 749 531 -48 -736 -605 354 793 -931 -989 576 1222
1655 1222 -7 -217 9 189 591 58 -874 -773 403 -192 -863 -483 605 119 239 194 186 224 195 -669
1675 -669 -674 237 -231 -598 -138 116 342 426 25 -93 524 1103 -19 -798 39 428 -130 -563 -882 -285 588
1696 588 348 -431 -291 790 483 -651 -331 177 -197 -110 -600 -879 20 883 -2 -216 497 549 81 347
1716 347 -83 -90 -30 -101 -624 -147 606 104 -628 199 700 509 -39 -118 161 207 622 -695 -1008 168 390
1737 390 -267 -259 369 497 827 67 -708 -79 819 -169 -765 161 -141 204 411 -120 -213 724 297 -484 -173
1758 -173 241 -8 -598 -525 -371 -30 199 75 -261 490 1126 432 -356 537 714 -304 -514 -431 -387 248 109
1779A09p92P23R21m40m71j46R5K29J0o28l66J198k89r95L57P60L72l93J80m27
1799GL50J17q76j69rP03k27n72L55J245j54l28k71j72Q45j24j354R8R27k29o18
1820d56k64j90J106O17j103K67P84L93p22p35J76j10K98r69K83N77N08m2j081
1839f63O80O91R8j019J89M21o10M99n72l45O64N61q51o81J656l1k66k2r57N59
1859AR31j228p81J046M54J60m69j80j38Q93K7r41P0L91K5o71l42M33P16j016o0
1880f79J272k23K4J82q61M14N22p32q55Q21l10J72M09q22L43J304p94q55R21M09
1900F62r77M74k99m39P50k32n51K34L55L22p0o41Q67M42n36p97N54m26J34M42
1920B68j144O14R59j3r05P97l78q8L99j130j81J419n69j069Q93L13n77N58l24
$$ plain form
1779 109 -683 40 961 521 50 -96 -1 228 238 -390 -756 442 153 -842 -485 275 647 254 434 7
1799 7 357 474 -402 -571 -580 123 -104 -676 -321 924 770 442 171 -1 844 720 -634 -536 391 162 -456
1820 -456 -720 -910 196 813 -290 -23 761 1154 432 -303 -127 -237 61 -908 -625 -48 460 418 -663
1839 -663 17 708 806 -213 -24 397 -213 286 -286 -631 33 594 -257 -938 718 687 421 399 -558 1
1859 1 932 -296 -1077 -31 423 583 114 -66 -204 689 716 -225 -155 236 261 -410 -752 -319 397 -619 -679
1880 -679 593 370 394 576 -285 129 651 -81 -936 -115 -425 -253 156 -666 -323 981 187 -668 253 662
1900 662 -315 159 -140 -579 171 -61 -612 -378 -23 299 229 -412 455 897 361 -436 118 -308 -174 268
1920 268 -876 -262 697 684 -221 576 198 110 509 -621 -802 617 48 -1021 -128 185 -392 166 -158
1939a58k1L69P33p33o81L86L33p6q16Q8N73K36l56M23m12L17L94j079k49J144
1959D15n07l21J68n19L67J075j022n01J673p7j221N53j86l61R21j58j126K51J262
1978F86o77p7N5J18P01p64l68M21J75m92J46m55K48P35q12j85O67J96J06k63n72
1999d11L17J515j612p35Q19J22n25M10m2j2O99k27n14N4P62l44m60m47M97N35
2019D01m35m73N92P2j87K13k34%M58l14m83J11K53j52O2o44O21O29k41n86P48
2040D11J74l89j34k96O9N60k87q78K79Q27M17n02n64J73P12k12k78n23M63r9J25
2061D8m64L38nJ83P5L9k83O34r5o40k36P28n3j055K39M73J57J60j26j8M23P88
2083A310j119o15L49M03l17l07r3O2O10l19l74M62L37M4m12j98K34L39J06r62
$$ plain form
1939 -158 -179 190 923 190 -491 -105 228 152 -664 -576 -3 233 -123 300 -112 205 599 -480 -729 415
1959 415 -92 -413 -245 -764 -397 678 -344 -845 828 751 -470 83 -103 -464 457 299 -827 -576 686
1978 686 9 -68 -13 105 806 42 -326 95 270 -222 -76 -531 -283 452 -360 -545 122 318 424 161 -411
1999 -411 -94 1421 -191 -926 -107 15 -510 -100 -142 -154 545 318 -196 -142 620 276 -184 -631 -134 401
2019 401 -34 -507 85 157 -30 183 -51 -51 407 93 -390 -279 -26 -178 -116 -760 -139 490 249 -337 411
2040 411 585 196 62 -234 -165 395 108 -770 -491 336 753 251 -313 -140 572 360 82 -441 22 -77 48
2061 48 -416 -78 -83 100 175 214 -69 565 470 -170 -406 322 269 -786 -547 -74 83 243 117 99 522 1310
2083 1310 191 -424 -75 328 11 -296 -389 -327 283 -36 -410 52 389 433 21 -177 57 396 502 -460
2103d60m39Q17M30o55n6L19M85k24j3k54j16k4l9k80K1Q20k28n22K92K98j68K02
2125B06k78K98M33j44j109J29N19p1l43j36J23L75P45k17p21P25K19p35m47j32
2145e61L99K35m6m25L64J02r1j57K11J46K97j41l00Q5j6K12n26j04K52J73l34
2166b25r1J028k87p18J17l36O01J82l32q83Q49O97l39l20k82L42N45j76o18K96
2186E0K11j45m53n33M88M65n8q2J94M2J69K8m70p7K67k79l90N40J75j41J71m77
2208c05J42N59j58n64O42Q7k42k18k15k38N79J3n93J08P74L11k15p44L64K22q4
2229B25n01m64L82J009k18p29M9Q09o23j03M89p93N64p2l97j41R87l65n47M28
2249a1l1O7N47l54l38Q41n32n47j44K79J21j3l54J88M86L80k20n15j36N94O8o61
$$ plain form
2103 -460 -899 -82 348 -307 -363 -44 441 217 204 -50 -166 -190 -229 -509 -488 332 104 -418 -126 172 4 206
2125 206 -72 226 659 515 -594 -465 54 -17 -360 -496 -373 2 747 530 -191 534 753 18 -429 -561
2145 -561 -162 73 27 -398 -34 68 -23 -180 31 177 474 333 33 118 102 314 -212 -316 -64 109 -225
2166 -225 -316 712 425 -293 -176 -512 89 271 -61 -944 -95 602 263 -57 -339 3 548 372 -246 50
2186 50 261 116 -337 -870 -382 83 25 -57 137 179 348 376 -94 -171 96 -183 -573 -33 142 1 172 -305
2208 -305 -163 396 238 -326 316 403 161 -57 -272 -510 69 82 -511 -403 371 682 467 -277 87 309 225
2229 225 -276 -740 -358 651 433 -296 -247 562 -61 -164 325 -468 96 24 -373 -514 473 108 -439 -11
2249 -11 -42 25 572 218 -120 721 189 -358 -502 -223 -102 -115 -469 -281 205 585 365 -150 -286 308 376 -285
2271b85l16R06k6m77j36j65M67O56m69l40M77J25m95K4n26K5N91K8q09N03L92
2292A50n64L73J91R2K41p10J76n9J84k84k70O3M10N09n81k61Q29J39k57k02k68
2313i9K51M12o05r23O62L24j68p0j90K96L65N42q03J68q5J77m88j64j5J59L34
2334H0m44M46j25J87j6n8k29M84k21k13J82k06N5l23k11L49N27K70p22K15Q30
2355H57o70j92k65j67L77N11p02k65M08M67k17J42l90P2m6J50n3n50P05J68q14
2376d74L81K75J99m51l1P5K39J13m41k94L78J40o08K26O3N24k3k57m96Q37k8l89
2398d2q2K17j3K70m26k72K44J79L1m10k2M76J32m06lR9K49m16L0l12K99L70J08
2421C00l82K25M7m48K17Q7l21L99o3k59L91L85p14r0L28j03J50M1k45J16J48m9
$$ plain form
2271 -285 -601 305 279 -198 -334 -499 -32 624 155 -185 292 417 -78 -54 -580 -555 36 64 -745 -242 150
2292 150 -414 -41 150 242 483 -227 -51 -110 74 -210 -480 -417 -7 502 -79 -340 489 628 371 169 -99
2313 -99 152 564 -41 -964 -302 22 -146 -216 -406 -110 255 797 -6 162 77 254 -234 -398 -413 -254 80
2334 80 -364 82 -43 144 128 70 -159 325 104 -109 73 -133 -78 -401 -612 -263 264 534 -188 27 857
2355 857 187 -5 -270 -437 -60 451 -251 -516 -108 359 142 284 -106 -34 -80 70 17 -533 172 340 -474
2376 -474 -93 182 381 -70 -101 -26 213 326 -115 -409 -31 109 -499 -273 -210 314 291 34 -462 375 347 -42
2398 -42 -124 93 80 350 -76 -348 -104 75 106 -304 -326 150 282 -124 -127 -28 221 -195 -165 -477 -178 192 300
2421 300 -82 143 190 -258 -41 46 -275 124 61 -198 193 578 -136 -226 102 -1 149 190 -55 61 209 160
2443A60o59K15Q2N49m66k98P49N3l7Jp80L65J96k24k03j09q8K00N74m92K13L48
2465C49k17k51J06M53j49l89Q3k83J13J01m79J92L16M83l98n6J55L52l16m09j5
2486b59KN07m91k37L40O72m09K11k99j15K89L36o21k42L48Q5o19j62N99j4N34
2507D55k12k42k6L13r5n23L4M04l20l12L84K9L46k43Q6KJ38J26m86L67pq0j03
2530C5n10L32M8K61j10k89N19kJ1n28M80q9l64N6L8n5M10J10m07QL62l54J76m47
2554c09M14o5k69k48J77J99K62j23l96L09K59J08o5m16K50Q9j85m28M38j38l3
2575a70j6k8N5L71K78l96n6J35L82o67J72j2k66K25J39n11L71M37k79j93J78M0
2597A89j53k05k85L99K40m6n54J41L86j55j5k12M90J49l85O6j61j12L61Km77K50
$$ plain form
2443 160 -499 -284 -202 347 -119 -417 332 385 348 349 -431 -66 130 -94 -297 -406 -494 -294 280 -212 1 349
2465 349 132 -119 -13 440 291 -98 -15 -298 -185 -84 -563 -371 -55 428 30 -26 129 481 165 -244 -259
2486 -259 -257 250 -241 -478 -138 534 125 336 37 -78 211 547 -74 -316 32 117 -502 -664 -65 -79 455
2507 455 243 1 -25 288 193 -330 -296 108 -212 -524 -140 -111 235 -8 78 80 218 344 -142 225 218 138 35
2530 35 -475 -143 -95 166 56 -233 286 284 295 -233 247 158 -206 -150 -112 -167 243 353 -54 -46 316 -38 138 -309
2554 -309 105 40 -229 -477 -300 -101 161 38 -358 -49 210 318 253 -163 87 176 -9 -437 1 -137 -170
2575 -170 -186 -214 -159 212 490 94 38 173 555 -112 60 48 -218 7 146 -365 6 443 164 -29 149 189
2597 189 36 -169 -454 -55 185 139 -415 -274 112 -43 -58 -270 220 369 -16 50 -111 -223 138 140 -337 -87
2619h7L44o9l29J9N17j06m20l06M45K17l03l83L30M58l86L26j1k78N08j74n05
2640a93K12o6L85n54j2L30j01J30k30R2K48J74j43k73P0J31l06K46j32j66K68
2661A10Q3n04L04L81J2k88m9j93J15N02p64k22O65P7j18m73L92L97m59M6k5j4
2683b5R0k07K60j77J7L24n25J6J55J06J17j15o0K36J83p69L6M25j04l9k21J69
2705a08J83L45m01l28M39jk23j26J28L52J74o74j50M02K8j49O4k56P61Kn59j09
2727b06J68j45K90j93k95L02J59k52K50K35m45J01k2J70k89L63l15m3L8M54m07
2748h2L67j39K17J23k89j26q3L65k57j88l89L92K16lo7q3K29K06L5j027L81K78
2770G6l39Q9J89k38j11M11j43k61Q36l17l28M26j39j24k81K26m23M18J79m53J38
$$ plain form
2619 -87 257 188 -141 -122 395 289 -131 -437 8 225 -78 -461 -131 327 -59 267 256 -22 486 312 -193
2640 -193 19 -47 338 -216 -228 102 1 131 -99 -7 241 415 272 -1 69 200 -106 140 8 -158 110
2661 110 193 -311 -7 374 386 98 49 -144 -29 473 -291 -513 152 229 111 -362 30 427 -32 14 -11 -25
2683 -25 65 -142 118 -59 -42 282 -243 -227 -72 34 151 36 -24 212 395 -374 -338 87 -17 -56 -277 -108
2705 -108 75 420 19 -309 130 129 -94 -220 -92 260 434 -240 -390 12 40 -109 -45 -301 460 462 -97 -206
2727 -206 -38 -183 107 -86 -381 -79 80 -172 78 313 -132 -31 -53 117 -172 191 -124 -167 -129 325 -82
2748 -82 285 146 363 486 197 71 -12 353 96 -92 -481 -89 127 124 57 -26 203 409 444 -583 -202 76
2770 76 -263 -174 15 -223 -334 77 -66 -327 509 192 -136 290 151 27 -254 -28 -451 -33 146 -307 -169
2791a69m7M40K30m96N2M38m18k30J67l38K54J63m6l92M43j0k10O27n03J85N7l64
2813a67l04N35jk55J63Q5k76M42O4n02M12j85P6k61J10K45l80j11j4K83k63L63
2835E9j66Q3M25J78k85o69L60k5l31L51j96K46M31k89m96K95M05l28j08P9J11
2856A30p3Oj94j4L00J53m11l5L17k72M28o66L56RK9m61R3K31J11j17j89J26M41
2879B98Rl69J39J5L89n35k54K94J63k76k5J40o01R81K9n83J3M98J35n81O6l44
2901c99O67m02K28k75M6K94j28j07J98J03q7j01j69K00j64K80p0k80K75o4K6j70
2923i9M18j91k0j21k78K55K55l94l17O47J10j10n25L61L14K0k94k4j65K22l3K8
2945E9l23K85K19o2j20P0k57K08l8n14N33j58l8qK90K74m46j35L56j20L11k85
$$ plain form
2791 -169 -216 224 454 -42 10 448 30 -200 -33 -371 -117 46 0 -392 51 41 -169 458 -45 140 197 -167
2813 -167 -471 64 63 -192 -29 56 -220 222 286 -216 196 11 87 -174 -64 181 -199 -310 -324 -41 -304 59
2835 59 -107 -24 401 579 294 -375 -15 -40 -371 -20 -216 30 461 172 -324 -29 376 48 -60 19 130
2856 130 57 63 -131 -145 155 308 -103 -138 179 -93 335 -331 25 34 63 -398 -305 -74 37 -80 -269 -143 298
2879 298 307 -62 77 92 481 -54 -308 -14 149 -127 -152 -12 -613 368 397 -186 -173 325 460 -121 -55 -399
2901 -399 268 -134 94 -181 -135 159 31 -76 122 225 138 37 -132 68 -96 184 114 -166 109 45 71 -99
2923 -99 319 128 108 -13 -291 -36 219 -175 -492 155 265 155 -370 -9 305 325 31 7 -158 64 31 59
2945 59 -264 21 240 178 58 128 -129 79 41 -473 60 -98 -136 -144 146 420 -26 -161 195 75 386 101
2967A01m30J77q8K52k2k73N6L38L65m42j27M19J63n50J45k3P7k05j39K45J4K33
2989B86k57l20k1N83q0j94l53K77L63j41m07J39%J31j18q1M30J73j48l92R9J70
3011A39Qm56n4L57J00k92L41o0j1J4J20k64O1M01n09N6p6R4l7k11j23M05L78K72
3035F53m98j33K72l2R0m83P3J47j88K15m04L79j45n40O00K73k56Nm99M12j54M97
3057B84K3o20K56J31j29j52M59j81R7j56j61J48J82n63K31k5m4R0R3M58n99J07
3079g1L29J16l73N3lj50O8L2N0k75L24j28m00P41j35K3l16K22j1k32N5k32K43
3102g0j0p3K29j8J72L3k72k06r1M09p0N5l79L49j8j91m2K86Q5P2j61m72M53Kk90
3127b18J66J67l41j49L53K52k20K09q3m76K09J43J96l12k78K96O1l09K58J04j34
$$ plain form
2967 101 -329 -152 -240 12 -10 -283 -227 111 476 34 -93 326 489 -61 84 61 138 -67 -206 39 53 286
2989 286 29 -291 -312 271 191 -3 -356 -79 284 143 -264 -125 -125 6 -112 -193 237 410 262 -130 -31 139
3011 139 147 -309 -363 -6 94 -198 143 83 72 86 206 -58 3 404 -105 -49 -125 -31 -68 -279 -402 3 381 653
3035 653 155 22 294 262 352 -131 -58 89 -99 116 -288 91 -54 -594 6 279 23 28 -471 -59 -213 284
3057 284 307 -313 -57 74 -55 -207 252 71 168 12 -149 -1 181 -382 -151 -176 -220 -130 -37 421 -178 -71
3079 -71 258 374 1 54 51 -99 -31 1 51 -224 100 -28 -428 313 178 201 -115 107 96 -136 -81 -313 -70
3102 -70 -80 -153 76 58 230 263 -9 -215 -306 103 33 88 -291 58 40 -151 -193 93 178 250 89 -383 70 72 -218
3127 -218 -52 115 -226 -375 -22 230 10 219 136 -340 -131 12 208 -104 -382 -86 -25 -334 -76 28 -106
3148a06K74m43L66K33j27j33k51p2M17k58M8P6K46j09R1l64K27N0p3rk79j73L72
3171CPk79K09Q3M22n56J97K69j32l16M1l1J31L16k74n84L73N48k73rl2qK78l88
3195ej76K63K39l18j81L02j30J87n8l22K20K89l34K87j65q3N1J99l60j70K28J41
3217A04Pj52K66k13J73m86L19J77l03j79L48k02K02r9r3J73K97k38j20k5j71M32
3239B17l24K55k67k42M23l81K64L32j56j16KqJ03p5j08P3k21l8J81R3J61l74K33
3262B7N7p5j50R1P4m6m11O04p6k89J29N1P4M31k72l24l3K07o9J22J08J33m82k32
3286c51J13J40j02L23K1m40L70L03m72q1J9K57J52k61j39j63O05m76m2J98L6m1
3308c1N5j10J43J54l80J14k64R4J66j25J46K24K58n30K58k29L1j02P9k8j61K65
$$ plain form
3148 -106 168 -275 91 324 197 64 -187 -259 158 -100 -52 24 270 161 252 -112 115 165 92 83 -196 -369 3
3171 3 10 -269 -60 23 445 -111 86 355 223 -93 -52 -83 48 364 90 -494 -121 427 154 145 113 105 383 -5
3195 -5 -181 82 321 3 -178 124 -6 181 123 -199 21 310 -24 263 98 15 66 265 -95 -265 -37 104
3217 104 111 -41 225 12 185 -301 18 195 -108 -287 61 -141 61 -38 -131 42 339 101 -19 -44 -215 217
3239 217 -107 148 -119 -361 62 -319 -55 277 121 5 7 -1 102 27 -81 -8 -229 -267 -86 7 168 -206 27
3262 27 84 9 -141 -50 24 -22 -433 171 95 -194 -65 -14 60 491 219 -105 -138 69 0 122 230 363 -119 -351
3286 -351 -238 -98 -200 123 144 -296 74 377 -95 -176 -157 100 252 -9 -148 -311 294 -182 -224 -26 10 -31
3308 -31 24 -86 57 211 -169 -55 -319 -225 -59 -184 -38 186 444 -86 172 -57 -26 -128 -49 -77 -238 27
3330B7J7n6j05J19R7N1j20J3J08k73k48O40m95K24K50k82m6M18l55j95L13k02
3352a00K85l66l4K25n1K12L45o46J20L00M9m84K74k03J78j52m3J10k8N7l8k03
3374a93K65j94n7K04l39N45k48nk28K4L15k90N99m11L64l97J83m19N37j64J17
3395B08k23K32k77r1M17l38j21J21J87M0J58k82J6ro3Kj22j18J37j02J44K37j53
3418@J4k4j42K3L48j14J37j31m24J59L33n4j71l7O9k4M38k55k99O9L04j10l95
3441b86R0J96K95nn82L07K24k69M42m42P8K43k32l47o4M38j88k67K11P14m89L04
3463C71j81m03K03J70k62j00k15N20k49Q2J06k65L35m2Qk17K55j79J75J87m37
3484a38o3k28L32P1J87l14K43o8k83K47K67m02j00K49o3j9l1R1J11k33L70j87
$$ plain form
3330 27 44 -12 -117 2 99 150 30 43 151 -122 -370 270 -225 -1 249 -33 -79 339 -16 -211 102 -100
3352 -100 185 -181 -215 10 -41 171 516 -130 -10 290 339 -145 129 -74 104 -48 -91 19 -9 48 10 -193
3374 -193 72 -122 -179 25 -314 231 -17 -22 -250 -226 89 -201 398 -13 351 -46 137 -282 255 91 208
3395 208 -15 217 -60 -151 266 -72 -193 -72 115 155 313 31 47 38 -25 -23 -145 -263 -126 -228 -84 153 0
3418 0 14 -10 -152 -129 219 105 242 111 -313 -154 179 125 -46 -83 -14 -38 400 145 -154 -85 219 109 -286
3441 -286 -196 0 295 290 -292 15 239 -30 412 -30 48 291 59 -288 -352 86 -102 -369 -158 556 67 371
3463 371 190 -213 -10 160 -102 -202 -417 103 -146 -64 42 -223 112 70 78 -139 116 -63 112 299 -138
3484 -138 -201 -429 -97 -26 161 -153 90 22 -261 -14 253 -149 -249 0 -63 -82 -113 -22 89 -144 226 39
3506C9J43L3j23l14j89M18J30n35l2M58N52l26n33K83J17j14J53J63m44J7L71
3527B67j64R2j35J32L4j39l24K30M5j41K57j93j56N6J42j93K31O3l28K79R7M0
3549A92j40m24K00K98J30l16m83M2Q47l29j94Q2L77j77l51J97K45k08j98K88n72
3570d94M55K26l06k93L78K1O0k28J00J00p2j61K3J10k29M3K63o4K82j88l20j76
3592d70M55P6j24NJ62l8l5j40k7L18r4L5j95J99k51k20J54M50m26m4J00qK22K8
3616A32j23j44L54j63K17j99k14j77J04k9J50j71R1K25n5M0K8J36k48q4o6n9L16
3639F1J52n61K55L8L74l80J36P4j23K60k98j30J57K3l57J07j52J4M76j72K80l24
3661i0M86j93q8j0l73K83m4L13o08J77Q6J56j02L4K14j53J4O4j91J55j46j86k0
$$ plain form
3506 39 182 215 92 -222 -411 7 137 -398 -430 28 580 254 -279 4 121 7 160 323 -121 -104 267
3527 267 103 195 60 192 226 87 -237 -7 38 -103 154 -39 -195 -139 3 -190 41 104 -224 55 152 192
3549 192 52 -372 -172 126 256 -60 -543 -501 346 17 -177 -95 282 105 -246 -49 196 -12 -210 78 -494
3570 -494 -39 187 -119 -412 -34 -13 47 -181 -81 19 -53 -214 -191 -81 -310 -267 -4 -68 214 26 -294 -470
3592 -470 -15 61 -63 -58 104 66 31 -109 -136 182 88 123 -72 127 -124 -344 -190 260 -166 -210 -110 -118 104 132
3616 132 9 -135 219 56 273 74 -140 -317 -213 -242 -92 -263 -172 53 -2 38 66 202 -46 -130 -196 -255 61
3639 61 213 -348 -93 -55 319 -61 75 149 26 286 -12 -142 15 38 -319 -212 -364 -350 126 -46 234 -90
3661 -90 396 203 115 105 -268 15 -29 284 -324 -147 -61 95 -7 27 241 88 102 166 -25 130 -16 -202 -222
3684b22L28k17K75j72j13K86k85K68j16L7J22k80l12N49j51J49N1l33lJ40K2j19
3706i6K76k91L57m07M8lj3J04p1J81J13K16o91Q4M30L0k48l74K27K69k72K30k57
3729a58O3J12r6j97K25K67j81j88P9l05N36k40J9O9j31J67O1l3N1Kj99l01L32
3752d6J44k5M3l53K39P0k2k68L51J40j52k79q0L84k92L18n88J21L78l53J76R7
3774CP8K38j40j13j18K35l10j8m0K93l17o4J69K25j71j6J78j3Kj84J44k14K68
3797A15R5l54J15k37J11L84k92K30l5o2Pr9j92J26L51r0j94r4N7K80Q3l67j64
3820b26M92k48j92J31J70J5j32l31K31N1j89K68m9p1J75m7l9j59j7J73nj2j7k8
3844e6J14L62m01J79j11m0l76M37k62K49n29M72j20K73l01M3K31n4J51k76K61
$$ plain form
3684 -222 106 -111 164 -8 -121 165 -120 148 32 69 191 -89 -401 148 -3 146 197 -136 -139 1 23 -96
3706 -96 180 -111 246 -161 -113 -116 -129 -25 -96 85 198 414 -277 -193 237 267 19 -355 -128 141 -131 99 -158
3729 -158 -95 17 -79 -276 -51 216 35 -153 -74 -379 157 -83 -64 5 -126 41 102 69 120 122 -77 -378 -46
3752 -46 98 73 116 -237 2 72 50 -218 133 273 121 -158 -238 146 -146 172 -416 -295 83 -270 -94 3
3774 3 81 319 179 66 -52 183 -127 -145 -185 108 -209 -273 -104 121 -50 -66 112 99 101 -83 61 -153 115
3797 115 210 -144 -29 -266 -155 229 -63 167 132 70 77 -22 -214 -88 263 173 -21 -115 -58 222 305 -62 -226
3820 -226 266 18 -174 -43 127 142 10 -321 -90 -39 -228 40 -9 -80 95 48 9 -150 -167 6 1 -11 -28 -56
3844 -56 58 420 19 198 87 47 -329 108 -154 95 -434 38 -82 191 -110 -67 164 110 261 -15 246
3865B46j71K0m9j52k4j9n4L47J33j89j43L38j32k16O8M7k35J60m0K29q4l95L27
3888A2k00L88k54l7O6NJ19q9k68J8J12J52k26R5kJ98r2k97L18J12l30J22N3m4
3912f9J98oj19j77K61k19L23o25M61j03OJ32o1K04k52j51J95J02q8K09k33R7o8
3935A7k17J42J45j17L4k75L6K05j2R0r3j90M81j42J51n54q0K78L44k78NP8j15
3958f7j2r6M11m74K25N0p4j81L97l03K20k57J52J88j65l87J94L45j36J3o0L00
3980B83k95j78K23m5j14J20P2j16q5r7J07Q4O7j15K23j63r3k73M39N4r6j48j6
4003a62L09j10Q2j65J05Q3l05J01J93J08m35j7K92l85N4oM78l86K49j49M11l28
4025A7j60K01n43N40l10L15K9N2j66J85J53n48L75p5k21L36l0j62P8L89k57k81
$$ plain form
3865 246 75 95 46 -106 -130 -149 -203 144 277 88 -55 283 151 -65 3 50 -185 -25 -65 164 80 -315 12
3888 12 -188 200 -54 -91 -25 -20 99 10 -258 -240 -128 24 -202 -107 -109 89 -3 -300 18 130 -200 -78 -25 -69
3912 -69 129 123 4 -173 88 -131 192 -433 28 -75 -69 63 2 206 -46 -197 -2 100 12 221 -12 85 17
3935 17 -200 -58 87 -30 4 -271 -235 -30 -42 48 -45 -235 246 104 255 -299 -379 -101 243 -35 -30 48 -67
3958 -67 -79 -175 236 -238 -13 37 -37 -218 179 -124 96 -161 -9 179 14 -373 -179 166 30 43 -17 283
3980 283 -12 -190 33 -12 -126 -6 66 -50 -135 -232 -125 -41 26 -89 134 -29 -122 -395 44 98 2 -146 -162
4003 -162 147 37 119 -46 59 142 -163 -62 131 239 -196 -213 79 -306 -252 -258 220 -166 83 -66 345 17
4025 17 -143 58 -485 55 -255 60 89 141 -25 160 313 -235 140 65 -156 180 150 -12 66 455 198 -83
4047h3J56k84J88KP2q0q5N18m95l0j46K70qj67K78M6R4n35K35j57M62k21l72M55
4071A13m8j6l49L75j28J03J85k78L0OK13o89O02n1l7l49L12M4o7R6K1j4n49L89
4095h6p8O2Q7J91k99kJ76P4m4Q5n96M21J25n5l30L09j79p2J0K83l11L59J82k55
4119E7j96K16k93K07q6k1RJ81K7k72K53k32L15j41j71K74m52L51Pq9J80L7k50
4142h9J47j20J16J09j88K31l90M41l91q7J68j88K39K41l67J49L3k41r0K33L73
4163C29k03m5k3k13L70k87J63j97K9J98k49J80Q3j32o6K27k94J84k51j76L05J45
4185G7J02l38J04J31l8pj20L5L5L48n31j27O60k92L7M2k90K09p6J77k64r8M6K81
4209A03J07l23K56l16P4l9L62om3P5l90K33o4o8j35K66j33K44m79M01m2l25J35
$$ plain form
4047 -83 73 -211 -23 -21 51 -29 -114 404 -91 -121 -267 3 -5 -172 106 152 246 -289 -54 -211 251 30 -342 113
4071 113 65 49 -300 75 -53 50 235 -43 -13 -7 206 -483 119 68 31 -318 -6 38 -29 67 88 74 -475 -86
4095 -86 -164 -102 -15 176 -123 -125 51 125 81 166 -430 -9 116 61 -269 40 -139 -211 -201 82 -229 130 312 57
4119 57 -139 77 -216 -9 -95 -116 -107 74 101 -171 82 -150 165 24 -147 127 -325 26 33 -56 124 161 -89
4142 -89 58 -62 54 163 -25 206 -184 257 -134 -221 -53 -241 -2 239 -128 21 54 -187 -277 -44 329
4163 329 126 81 58 -155 215 -72 91 -106 -77 121 -128 52 135 3 -63 164 -130 54 -197 -373 -68 77
4185 77 179 -159 -55 76 38 31 -89 -54 -19 329 -202 -329 331 39 76 118 -172 37 -39 138 -126 -224 -178 103
4209 103 210 -113 143 -173 -99 -138 224 218 175 250 -140 93 29 -39 -174 92 -41 203 -276 125 83 -242 -107
4232a07J13Q3L5M4k54K68k65O9J38k12K45k28L31j79j72r9P5j33J98j5P4L36k03
4255A42l6m21J4O25l43L3k7Q5l97K30j96L05k4O6r7Q8qj72L20l19O0j74M50l6
4279A68m43L75o2K69k87j63L09r7j70r4Q6q1J63N1L4j07j6j04J1L6K10l05Q8J03
4303b6L69k10j38J53k53N66l42l77K60M1K21n13K45K43p06N95l81L74p1pK38l40
4325e9J44lQO8J22j86ok71J86j8k15l6M30l86J00J02R4k17j34N44j19J16l13j54
4349b03Q9K44r1j22R9j9q6J42k4K51q7J96l72k50L06m63J20L24j40K4R2l23K87
4372fj1K15n44L79J79o92M79J46k58J96J26m08K05j17K15J27o6l13j0L31j3k70
4394a10N9k4R4j95J95R6o9Q5m75J95J2J01k5j87M16k54r5M20j98K0J83o3q4j32
$$ plain form
4232 -107 6 89 124 168 -86 182 -83 -14 124 -88 157 -71 260 81 -91 -190 -115 -248 -50 -65 9 345 142
4255 142 106 -315 -301 324 -19 14 -13 72 -325 -95 -291 14 -10 56 -41 47 39 -133 187 -132 -72 -246 204 168
4279 168 -275 100 38 307 20 -143 166 69 -101 -195 -109 -190 -27 24 58 -49 -65 -169 -158 -122 88 -217 -129 -26
4303 -26 343 133 -5 148 -105 461 119 -258 2 43 264 -249 -4 239 -467 128 -253 121 50 43 281 -59
4325 -59 85 82 90 158 280 94 88 -183 3 -15 -230 -266 164 -222 -122 -20 74 -143 -277 267 148 264 -49 -203
4349 -203 -114 130 39 -83 16 -3 -89 53 29 280 193 389 17 -233 73 -390 -270 54 -86 -62 30 -293 -6
4372 -6 -17 198 -346 33 212 -480 -1 145 -113 83 209 -199 6 -111 104 231 165 -148 -158 173 160 -110
4394 -110 -51 -75 19 -176 19 115 46 131 -344 -149 -137 -36 -61 -248 168 -86 -181 239 41 61 244 181 97 -35
4418c5p4Ol0M44k02j52K60l45J24l00L94J12l19J19O5p6p6O3J84j16J38p7L5l57
4442b15k4J53p7N11n23Q0K98n01K39N6K0J23k83k43L74k98N20k84L0J62k14J47
4464E1l77L95m6R5r0j16l4K0J52O8j12q0P3J88m25M03l76L05k39J60m9N8P9k91
4488a88K7J14M03k02j32K77j77N3j96J64p1O2j5J35o4o8k26K6O3K15j32K68k97
4511C9l66K18K39k50j56J73K6%m0n6K82j69K80j83k4P2J52m2q4o5k35N71k95j48
4535f1l7J17j6M28m01j49J78Q4K18n84NLK34j43K61J4k54k61N34k59K20L8m00
4558b31L00J04r0k76Q7M9J51p5j37K95p6j11R4k37J19J06p4J97m67J35k9M10r3
4581A51k72K51r3j34R2j25R0k33J15L15j13R8J27k20K41m00Q5j39L52p4l87M33
$$ plain form
4418 -35 -109 -103 -133 311 109 -43 217 -128 -4 -304 90 202 -117 2 67 -9 -85 -22 162 46 184 107 142 -215
4442 -215 -239 -86 -163 348 -175 -95 203 -298 -59 -3 17 140 -143 -386 -12 -310 210 -74 -44 118 -96 51
4464 51 -326 69 23 118 28 -88 -122 -102 50 118 6 -74 -1 187 -238 165 -211 94 -145 15 -34 24 103 -188
4488 -188 -161 -47 356 154 22 299 122 175 -21 143 72 134 119 254 190 122 -104 -78 -15 200 68 336 39
4511 39 -327 -109 130 -120 -276 -103 -77 -77 -117 -173 109 -60 220 37 13 85 237 195 111 46 -189 382 87 -61
4535 -61 -98 19 3 431 30 -119 59 143 361 -223 -218 -215 19 -124 137 151 -103 -364 170 -89 131 169 -231
4558 -231 69 173 83 -193 -106 -57 94 19 -118 177 101 -10 84 -153 -34 72 -2 195 -272 -137 -166 244 151
4581 151 -121 130 37 -97 -5 -130 -40 -273 -158 157 44 142 269 49 290 -110 -25 -164 188 114 -273 160
4603A60k16K84n03P2K79L3J63j78P0k56Kj89m2J14K18P9n3k76Q1Ml4K22J8J9p1
4628@j94K41N7p0j51L3m3Q5j29K75j64J35L1n02M75k0P6M7k28k76N37k01k8K02
4652A88m33J23K77J52j42J19l82L43o4l02o0K61j06J4M19n57J22q5K98k0j38j64
4674a37M44l20N0oj81M8K50j06j27j64J27Q8J81J5R9k61J1J56Rk48k52L66q4Q2
4698D0k13K17K94k48j57l8L75m07o9K37j56j04O7l3J58l2L11J95n82K48k31K37
4720A09J61l90j49J87l6L13m10K27J35j61pJ67k77J47j44L33j32l76K55K23Q4
4741B59n99O18k1k54J40l08K1j90N40m29J59P0L2J01n2n4r6K72M3k85j79N04m00
4764a08K94r2k31j5K57m3K30j97k09J28L67m92j01o2M6L35p1K5K41k66K4m21L05
$$ plain form
4603 160 -56 228 -275 -203 76 109 272 94 164 -92 -90 -279 -321 -207 11 90 37 -239 -158 -154 -188 34 52 71 0
4628 0 -194 47 104 34 -117 -84 -127 -42 -171 104 -60 75 106 -396 79 59 135 182 -46 -322 215 14 -14 188
4652 188 -245 -122 155 307 165 284 -98 245 181 -121 -181 80 -26 -12 407 -150 -28 -113 185 165 27 -137
4674 -137 307 -13 37 31 -150 -102 148 42 -85 -249 -122 -34 147 162 261 0 11 167 176 -72 -324 42 -42 40
4698 40 -173 44 338 90 -67 -105 270 -137 -206 31 -125 -229 -162 -195 -37 -69 242 437 -145 103 -128 109
4720 109 270 -120 -269 -82 -118 195 -215 12 147 -14 -21 146 -131 16 -128 205 73 -303 -48 175 259
4741 259 -340 278 257 3 143 -165 -144 -334 206 -223 -64 6 38 139 87 33 -63 209 252 -33 -212 292 -108
4764 -108 186 94 -137 -152 105 62 292 95 -114 14 381 -111 -212 -274 -228 107 36 61 302 36 60 -361 -56
4787e6N11m43Q2j38J18r6K6o7J80l00j40J49M51j51K5k55K01j42k48M17o5j23
4809f4jL03l27M5j40J09J29j4j43m5J33k5j34J2M13p0k88J57j13L6q3K02k9j84
4833a21K86q5k22J78o6K21l16L50j64L54l01q8m6K04m1k39K18j2Q2k66j96L90
4855A20k10J34j95k18M90R4m55M29l3o7r9J93r4J7j72rm9j56N16m11M99m90P9
4878h7j30L39j65j6oJ32k%j09j65mO66m11l7l72O26k27oK49l23J15k4K37m72L22
4903A30k11L19l78L85k18r0M4M8L3J34l80j4K63l2p9O1R9k31j37K56j11K24j66
4926e1J4j59OJ58m7M7P5n4K24j50J72k16L7j48kp1L60K28m21M9k7J25j27r9o4
4951a41J63M3q1n3J58R2k34J55K23p56N85m3l54K43L19k07K1j2j23L40o09K19
$$ plain form
4787 -56 455 12 94 -44 74 -22 4 -63 117 -183 -323 -174 277 126 151 -104 97 -45 -293 124 59 -64
4809 -64 -65 238 -89 -44 -184 -75 54 40 -103 -148 -15 -40 -174 -162 251 181 -107 50 -63 -27 -110 92 63 -121
4833 -121 165 80 -142 36 -30 191 -125 225 61 415 114 26 -20 184 143 -96 122 110 192 -74 -270 120
4855 120 -90 44 -151 -369 121 215 -240 189 156 89 -10 183 89 106 -66 -75 -124 -280 236 -175 324 -166 -87
4878 -87 -217 122 -43 -59 -65 67 65 65 -44 -209 -213 453 42 5 -367 259 32 26 275 -48 67 43 280 -192 130
4903 130 -81 238 -140 245 27 -63 -19 29 62 196 -184 -198 65 33 -46 15 114 -117 -254 2 -109 115 -51
4926 -51 -37 -196 -190 -32 -79 -32 43 -11 213 63 235 19 56 -92 -94 -165 195 423 2 51 24 149 22 -77 -141
4951 -141 22 65 -16 -69 89 181 -53 102 325 -431 154 111 -243 0 319 112 133 121 -2 338 -271 -52
4973e2P2J21j07m8J22J0n8k43K88l08K08o6j62q5K00p0N12p7j49Q8k42L58j22
4996A90l09r7OR6L67q7k43J42j87M26r6j31l00J51K60m19P1M88m92J44M2J66k59
5019g1k43M30k13K23k37k63L18J81k79J85O2J99k71k21K41Q0k92L15Q6m29M46
5040B47j62j77RLN8N5j71K43k77R5k5L11k42K7R9j18K18K0J23k98j8%k3J88l3
5065A52N1n4m45O31m13K09J20J31k53j60Lp1k23J21Q3rL09k24k04J42L83j58k43
5088a22K9J10N3R5j61k0j76J98J20k32j0J43j21j55J98k3K0J47K5R5j61K89l44
5111cO2J76l11J63n9J9j88K09l4j08k2R8O9m03M04M4j62j11J78n3l11M37m29L82
5135D7K70l40j23K10M4p9q7J84k1K56m46J83j42nQ5j43j22K62k77K94j21J34k13
$$ plain form
4973 -52 20 141 34 -14 108 118 60 -183 105 -203 5 -61 -223 -308 -108 -178 334 257 108 196 -46 312 190
4996 190 -119 -216 -210 -114 253 166 -77 65 -122 304 208 77 -223 -72 188 -231 -160 328 -164 -20 22 188 -71
5019 -71 -314 116 -97 126 -111 -374 -56 125 -154 31 93 292 21 -200 41 121 -171 144 230 -199 247
5040 247 85 -92 -83 -80 -22 33 -138 105 -172 -77 -102 209 -33 -6 93 -25 193 213 336 38 20 20 -3 185 152
5065 152 203 149 -296 335 -78 131 251 382 129 -31 -28 -99 -322 -201 -118 -127 182 -42 -246 -104 279 121 -122
5088 -122 -93 17 70 165 4 -16 -192 6 126 -106 -116 27 -94 -249 -51 -74 -54 93 118 213 52 341 -3
5111 -3 59 235 -76 87 28 47 -141 68 34 -74 -96 2 71 -332 72 116 -46 -157 21 -32 -343 94 -335 47
5135 47 317 -23 -146 64 108 29 -58 126 105 361 -85 98 -44 -49 36 -107 -229 33 -244 50 -71 63 -150
5158a50l3L75l74K7K44o6j69M16R3m00l4k6M85l40j10J63l83K49O3k41j04L44
5180B9j82L73n15K66j98K01J6OL49j58k93M7P2N9q5J77J05l97J45k3k16J64L00
5203B42m19n0J09J88l01K32J59j15k25J50K0j17N32j67k32J70j53r4j2M22l63
5224b4n7n7K75L0n60L61O7j02L20q3Qo6p6oP8m6K40l78j16K57M3l24N31m90K27
5249E2k0j59J82j08j02K75j65l4J93M3l16M10l22K21J94m03nK4K40n54M40o5m2
5272b1j32j76M64k64J60J22k42K9K32p8mM3N8k04J20m7r6K15k4o5j37M25n70N28
5296C36l16n5k3p0j39J71j32K73k52J06p1K21k90K79M79m89k9r6P4j82r5O1R0
5319a49L31R3l06J25k74L26k03L7qj22M28j22k1L3k03J7q8K05j44M9M5k3J56l45
$$ plain form
5158 -150 -183 192 -182 -155 89 23 -146 270 363 -37 -71 -97 388 48 -62 101 -282 -33 30 -211 -315 29
5180 29 -153 220 -295 -29 -227 -26 -10 -4 345 187 -106 -59 13 72 -13 164 269 -128 17 -6 -222 -58 242
5203 242 -177 -227 -118 70 -231 1 160 45 -180 -30 -10 -127 405 238 6 176 23 -71 -83 339 -24
5224 -24 -81 -138 137 167 -393 -32 35 -67 253 170 178 112 36 30 108 62 302 -76 -192 65 108 -216 315 -175 52
5249 52 32 -127 55 -53 -155 120 -45 -79 114 157 -159 251 -71 150 344 -59 -64 -40 200 -354 86 21 -21
5272 -21 -153 -329 135 -129 31 153 -89 -60 172 94 90 133 191 -13 107 60 -36 179 155 90 -47 378 -192 336
5296 336 20 -35 -58 -128 -267 -96 -228 45 -207 -101 -172 49 -241 38 517 28 -1 -97 -23 -205 -300 -239 -149
5319 -149 182 275 -31 94 -180 146 -57 -20 -28 -150 278 156 135 168 -35 -18 -106 99 -45 4 49 26 182 -163
5343a63K47k52K36n2Qk7L44j30p3m7o1K8J67j16K13k36Om23M72j52j50L6J11n9
5367g3K38j75j67P3Q0M6P6N8M8p3k00j4M6Q5J23j15j36J3J04j09j36K84K53k11
5391A18P3l79K60j10q6K2rJ89O0Q8j61R7M5q8j05r7J25k49J10L00k40K90l63k4
5415a34J85K5n2l7k0M28o39M19Rk34J23m59L56L0k30K94l37K20K8nlq2L07p4j70
5440e2K35j10j27J97l46lK97j53j09L03j46j9J65J4k2k15j14K27J3q1l5J37j52
5463i6j6L63n82L68q8K1K07k47K1K47l75K41j83J97k84L28P7j36k39J71J01j09
5485a3J94k8n9k0l6J20j85N1M2K00k49l6L09m07j24M35j94j28J02j74L39m69M59
5508A29j73q1K0p3K08j37p0K26p0J4j70L2m6L69k19r5j14L43j56j09M86n29M36
$$ plain form
5343 -163 84 -168 68 16 24 -3 341 211 138 91 30 58 225 109 322 86 92 -331 141 -11 -161 -125 -14 -73
5367 -73 165 -10 -177 -104 -24 22 98 156 204 131 -69 -83 -37 48 171 56 -80 -67 37 -72 -208 76 329 118
5391 118 191 -188 72 -38 -124 -102 -111 78 138 226 65 162 207 119 14 -83 42 -207 -97 203 -37 253 -110 -134
5415 -134 51 76 24 -13 -33 395 -244 175 184 -50 73 -386 -30 0 -230 64 -273 -53 -25 -30 -33 -115 192 118 -52
5440 -52 183 73 -54 143 -203 -206 91 -62 -171 132 -14 -33 132 146 124 -91 -205 22 35 -46 -81 56 -96
5463 -96 -112 251 -331 37 -51 -30 177 -70 -49 198 -177 64 -119 78 -206 122 199 63 -176 -5 96 -13
5485 -13 181 153 94 74 38 158 -27 24 66 266 17 -19 290 -117 -241 194 0 -128 -26 -200 139 -330 129
5508 129 -44 -125 -105 -178 30 -107 -177 49 -21 -7 -177 -145 -191 178 -41 -136 -250 93 -63 -172 314 -215 221
5531B21m66K86k42R6K75j9k83J09j40j42L20M3J8N6k15M95j13k84o6N7j13P0k35
5554b72K49J34J51J05n14j3n4J74l2R3l7K95j81J91n56N03m53L80k52j78L72j21
5576a6J25l8l1j15L08j04k3o9R0qJ61m7j07k66N01n22J1K12k10K3p0N2J64N0j44
5601g3O9j7k0J70j46j00m2j51K02K15l16m3N04p07N44Q1l17K66M1Lr1R8m03L40
5625A07j97J80qk6J27k29K66n14M45j09Q7J9N3k13M0N1O1k64M1j76k0O99m80Q0
5649B0j56J42P7p3k04L17l20M16l25m3r0M33k01o3J0m13M29J15j75J05m98M20
5671g7j21P1K1K59J15l8k32l1J86m65M66j64J41M3l6k66O5K52j95k89J25L3L1
5694a06K51l83J08J60K70k22J0L5l37J48L2K1K78k49r8M9L25k27Q6l60Q6Q1QM6
$$ plain form
5531 221 -245 41 -201 -105 170 151 -132 -23 -163 -305 15 58 76 132 -83 412 299 15 -51 6 -107 -37 -272
5554 -272 -23 111 262 367 -147 -160 -214 -40 -72 21 -16 279 98 289 -267 236 -217 163 -89 -267 105 -16
5576 -16 109 71 40 -75 233 129 106 37 127 119 280 233 126 -140 361 -161 -150 62 -148 -125 -195 -143 21 71 -73
5601 -73 -4 -21 -41 129 -17 -117 -159 -310 -108 107 -209 -252 252 -455 89 170 -147 119 160 163 72 170 -233 107
5625 107 -90 90 82 56 183 -46 220 -294 151 42 129 148 201 -12 28 79 140 -124 -83 -259 -279 420 -60 20
5649 20 -136 6 83 10 -194 123 -197 219 -106 -149 -239 194 -7 -70 -60 -473 -44 71 -104 1 -497 -77
5671 -77 -198 -127 -106 153 268 230 -2 -33 153 -312 154 -10 131 174 138 -128 -63 189 -6 -295 -170 -137 -106
5694 -106 145 -238 -130 30 300 78 88 123 -214 -66 -34 -13 265 16 -82 -33 292 65 151 -209 -123 -42 -34 12
5718A2Rn0K58K0k55k53N8K96M6K2j09K66m54O3J76k96L93j40R8k34L0K85o1ok67
5743i3J54l35L36r9Q6j46K60l68k3L14j20j21j03L12P0j17j10M9n2N3J30K2QJ56
5767B63o39L61K8j35N98l43j05J65q7j69K80l87kr7L22j28j07J69J21J24n7l71
5789a96K66R4j44n3l8j31K91J1J35m23L42m42K29MJ01n7J14M0J3r4L6j50o6M3
5813g5O6j43L04P7j85k33M04k92j21K34l76N28k89L06K5Kj59L38j99P0m45J55
5835hL4K05j30L8p8o7J15l5Q2M4k06J85k89L32k10l35L80k5J47o4j8k88L43R5
5859B47k6rk55r3J70L11l06J72j51N1j89Pl5M21m93J70j77M55k06m1K24m84J49
$$ plain form
5718 12 21 -29 229 249 -6 -259 -201 95 141 163 54 320 -134 -71 105 -191 202 62 160 -74 -44 241 180 174 -93
5743 -93 61 -274 62 -37 49 -97 163 -205 -228 86 -34 -155 -258 54 124 7 -103 -54 -106 -53 77 99 107 263
5767 263 -376 -15 13 -122 476 133 28 193 106 -63 217 -170 -172 -269 53 -75 -182 -13 108 232 175 -196
5789 -196 70 164 20 -33 -71 -202 89 100 235 -188 154 -288 -59 -55 46 -11 103 143 156 62 98 -52 -118 -75
5813 -75 -9 -152 152 229 44 -189 215 -77 -198 36 -340 188 -101 205 230 232 73 411 212 282 -163 -8
5835 -8 26 231 101 139 61 -6 109 74 156 200 -6 179 -110 222 12 -323 57 32 179 115 97 -191 152 247
5859 247 221 212 -43 -136 34 345 39 211 60 111 -78 -71 -106 315 -178 -8 -185 270 64 23 247 -237 -88
$$ [...]
8191A82
##END NTUPLES=NMR FID
##END=
