##TITLE=1H_AM_NV142
 CDCl3
 8 sc, 
 15.3.2024
##JCAMPDX= 6.0         $$ Bruker NMR JCAMP-DX V2.0
##DATA TYPE= NMR FID
##DATA CLASS= NTUPLES
##ORIGIN= UXNMR, Bruker Analytische Messtechnik GmbH
##OWNER= root
$$ XWIN-NMR		Version 3.5
$$ Fri Mar 15 14:12:09 2024 Russian Standard Time (UT+4h)  she@DPX200
##.OBSERVE FREQUENCY= 200.1313
##.OBSERVE NUCLEUS= ^1H
##.DELAY= (6, 6)
##.ACQUISITION MODE= SIMULTANEOUS
##.ACQUISITION SCHEME= undefined
##.AVERAGES= 8
##.DIGITISER RES= 18
##SPECTROMETER/DATA SYSTEM= spect
##.PULSE SEQUENCE= zg30
##.SOLVENT NAME= CDCl3
##.SHIFT REFERENCE= (INTERNAL, CDCl3, 0, 15.7039)
##AUDIT TRAIL= $$ (NUMBER, WHEN, WHO, WHERE, WHAT)
$$ ##TITLE= Audit trail, XWIN-NMR		Version 3.5
$$ ##JCAMPDX= 5.01
$$ ##ORIGIN= Bruker BioSpin GmbH
$$ ##OWNER= she
$$ F:/spectra/data/she/nmr/H-F/1/audita.txt
$$ ##AUDIT TRAIL=  $$ (NUMBER, WHEN, WHO, WHERE, WHAT)
(   1,<2024-03-15 14:11:00.10 +0400>,<she>,<DPX200>,
      <created by zg, POWCHK disabled, PULCHK disabled
       configuration hash MD5:
       00 E9 B6 7A A2 85 ED C7 34 08 36 98 17 FE 4E 26
       data hash MD5: 16K
       20 23 0D BC 1E 64 6D BB 8F 44 BD 66 1B 9A 5D C6>)
$$ ##END=
$$ 
$$ hash MD5
$$ AE 9C 1E 7B EA 1B 35 34 64 EA 1A 7C A2 32 2B 8E
##$RELAX= 
##$RELAX= 
##$RELAX= 
##$RELAX= 
##$RELAX= 
##$RELAX= 
$$ Bruker specific parameters
$$ --------------------------
##$DU= <F:/spectra>
##$EXPNO= 1
##$NAME= <H-F>
##$PROCNO= 1
##$TYPE= <nmr>
##$USER= <she>
##$AMP= (0..31)
100 100 100 100 100 100 100 100 100 100 100 100 100 100 100 100 100 100 
100 100 100 100 100 100 100 100 100 100 100 100 100 100 
##$AQSEQ= 0
##$AQ_mod= 1
##$AUNM= <au_zg>
##$AUTOPOS= <>
##$BF1= 200.13
##$BF2= 200.13
##$BF3= 200.13
##$BF4= 200.13
##$BF5= 200.13
##$BF6= 200.13
##$BF7= 200.13
##$BF8= 200.13
##$BYTORDA= 1
##$CFDGTYP= 0
##$CFRGTYP= 5
##$CHEMSTR= <none>
##$CNST= (0..31)
1 1 145 1 1 1 1 1 1 1 1 1 1 1 1 1 1 1 1 1 1 1 1 1 1 1 1 1 1 1 1 1 
##$CPDPRG= <>
##$CPDPRG1= <>
##$CPDPRG2= <>
##$CPDPRG3= <>
##$CPDPRG4= <mlev>
##$CPDPRG5= <mlev>
##$CPDPRG6= <mlev>
##$CPDPRG7= <mlev>
##$CPDPRG8= <mlev>
##$CPDPRGB= <>
##$CPDPRGT= <>
##$D= (0..31)
0 1.2 0 0 0 0 0 0 0 0.06 0 0.03 0 0 0 0 0.0002 0 0 0 0 0 0 0 0 0 0 0 0 
0 0 0 
##$DATE= 1710497459
##$DBL= (0..7)
120 120 120 120 120 120 120 120 
##$DBP= (0..7)
150 150 150 150 150 150 150 150 
##$DBP07= 0
##$DBPNAM0= <>
##$DBPNAM1= <>
##$DBPNAM2= <>
##$DBPNAM3= <>
##$DBPNAM4= <>
##$DBPNAM5= <>
##$DBPNAM6= <>
##$DBPNAM7= <>
##$DBPOAL= (0..7)
0.5 0.5 0.5 0.5 0.5 0.5 0.5 0.5 
##$DBPOFFS= (0..7)
0 0 0 0 0 0 0 0 
##$DE= 6
##$DECBNUC= <off>
##$DECIM= 32
##$DECNUC= <off>
##$DECSTAT= 4
##$DIGMOD= 1
##$DIGTYP= 9
##$DL= (0..7)
0 120 120 120 120 120 120 120 
##$DP= (0..7)
150 150 150 150 150 150 150 150 
##$DP07= 0
##$DPNAME0= <>
##$DPNAME1= <>
##$DPNAME2= <>
##$DPNAME3= <>
##$DPNAME4= <>
##$DPNAME5= <>
##$DPNAME6= <>
##$DPNAME7= <>
##$DPOAL= (0..7)
0.5 0.5 0.5 0.5 0.5 0.5 0.5 0.5 
##$DPOFFS= (0..7)
0 0 0 0 0 0 0 0 
##$DQDMODE= 0
##$DR= 18
##$DS= 0
##$DSLIST= <SSSSSSSSSSSSSSS>
$$ [...]
##$SUBNAM2= <"">
##$SUBNAM3= <"">
##$SUBNAM4= <"">
##$SUBNAM5= <"">
##$SUBNAM6= <"">
##$SUBNAM7= <"">
##$SUBNAM8= <"">
##$SUBNAM9= <"">
##$SW= 18.0517328524113
##$SWIBOX= (0..15)
0 0 2 0 0 0 0 0 0 0 0 0 0 0 0 0 
##$SW_h= 3612.71676300578
##$TD= 16384
##$TD0= 1
##$TE= 0
##$TE2= 300
##$TE3= 300
##$TEG= 300
##$TL= (0..7)
0 120 120 120 120 120 120 120 
##$TP= (0..7)
150 150 150 150 150 150 150 150 
##$TP07= 0
##$TPNAME0= <>
##$TPNAME1= <>
##$TPNAME2= <>
##$TPNAME3= <>
##$TPNAME4= <>
##$TPNAME5= <>
##$TPNAME6= <>
##$TPNAME7= <>
##$TPOAL= (0..7)
0.5 0.5 0.5 0.5 0.5 0.5 0.5 0.5 
##$TPOFFS= (0..7)
0 0 0 0 0 0 0 0 
##$TUNHIN= 0
##$TUNHOUT= 0
##$TUNXOUT= 0
##$USERA1= <user>
##$USERA2= <user>
##$USERA3= <user>
##$USERA4= <user>
##$USERA5= <user>
##$V9= 5
##$VALIST= <valist>
##$VCLIST= <CCCCCCCCCCCCCCC>
##$VD= 0
##$VDLIST= <DDDDDDDDDDDDDDD>
##$VPLIST= <PPPPPPPPPPPPPPP>
##$VTLIST= <TTTTTTTTTTTTTTT>
##$WBST= 1024
##$WBSW= 4
##$XGAIN= (0..3)
0 0 0 0 
##$XL= 0
##$YL= 0
##$YMAX_a= 206548
##$YMIN_a= -228215
##$ZGOPTNS= <>
##$ZL1= 120
##$ZL2= 120
##$ZL3= 120
##$ZL4= 120
##$ABSF1= 10
##$ABSF2= 0
##$ABSG= 5
##$ABSL= 3
##$ALPHA= 0
##$AQORDER= 0
##$ASSFAC= 0
##$ASSFACI= 0
##$ASSFACX= 0
##$ASSWID= 0
##$AUNMP= <proc_1d>
##$AZFE= 0.1
##$AZFW= 0.1
##$BCFW= 1
##$BC_mod= 2
##$BYTORDP= 1
##$COROFFS= 0
##$CY= 11.3945322036743
##$DATMOD= 1
##$DC= 2
##$DFILT= <>
##$DTYPP= 0
##$F1P= 15.7292609196834
##$F2P= 12.9074282941183
##$FCOR= 0.5
##$FTSIZE= 0
##$FT_mod= 4
##$GAMMA= 1
##$GB= 0.15
##$INTBC= 1
##$INTSCL= 1
##$ISEN= 128
##$LB= 0.24
##$LEV0= 0
##$LPBIN= 0
##$MAXI= 10000
##$MC2= 0
##$MEAN= 0
##$ME_mod= 0
##$MI= 1.114404
##$NCOEF= 0
##$NC_proc= 0
##$NLEV= 6
##$NOISF1= 3.799351
##$NOISF2= 2.8
##$NSP= 1
##$NTH_PI= 0
##$NZP= 0
##$OFFSET= 15.70392
##$PC= 1
##$PHC0= -25463.02
##$PHC1= 13.58731
##$PH_mod= 1
##$PKNL= yes
##$PPARMOD= 0
##$PSCAL= 0
##$PSIGN= 0
##$REVERSE= no
##$SF= 200.130013532006
##$SI= 16384
##$SIGF1= 3
##$SIGF2= 2
##$SINO= 400
##$SIOLD= 16384
##$SREGLST= <1H.CDCl3>
##$SSB= 0
##$STSI= 0
##$STSR= 0
##$SW_p= 3612.71676300578
##$SYMM= 0
##$S_DEV= 0
##$TDeff= 0
##$TDoff= 0
##$TI= <>
##$TILT= no
##$TM1= 0
##$TM2= 0
##$TOPLEV= 0
##$USERP1= <user>
##$USERP2= <user>
##$USERP3= <user>
##$USERP4= <user>
##$USERP5= <user>
##$WDW= 1
##$XDIM= 8192
##$YMAX_p= 0
##$YMIN_p= 0
$$ End of Bruker specific parameters
$$ ---------------------------------
##NTUPLES= NMR FID
##VAR_NAME=  TIME,          FID/REAL,        FID/IMAG
##SYMBOL=    X,             R,               I
##VAR_TYPE=  INDEPENDENT,   DEPENDENT,       DEPENDENT
##VAR_FORM=  AFFN,          ASDF,            ASDF
##VAR_DIM=   8192,          8192,            8192
##UNITS=     SECONDS,       ARBITRARY UNITS, ARBITRARY UNITS
##FACTOR=    0.0002768,     1,               1
##FIRST=     0,             0,               0
##LAST=      2.2672688,     0,               0
##MIN=       0,             -228215,         0
##MAX=       2.2672688,     206548,          0
$$ Real data points
##PAGE= N=1
##DATA TABLE= (X++(R..R)), XYDATA
0@%%%%%%%%%%%%%%%%%qJ6j6J6j6K1k9L2l4M2m9N7o6P5q9J02j15J30j47J65j85
38i8K09k35K61k90L23l58L98m41M85n38N96o56P22p95Q77r65J063j174J297j437
58g56J595j775J984k231K525k882L326l887M609n497O174k153K05516j53424k67756
73b14632K26037J66847k25326q4379K19927j1625j70444P9529J06931j40938k9102
84g7175J66880m1356j72543J05987J47703j51174j09943J83486O6587j86333k3862
95i1743J70506j6578j35187N0084R5664p5621n8230Q2749K3550q0674N045O8931
107C8496k6364n6602L7147M3744l5980k7740L2016J3685k5738j772K0914m911
119F895j3267R944J495j9515R174L1174j8210m3769K3942N1522l0345n4672L8731
$$ plain form
0 0 0 0 0 0 0 0 0 0 0 0 0 0 0 0 0 0 0 -8 8 -8 8 -8 13 -16 16 -18 24 -25 32 -34 41 -48 54 -61 69 -78 87 -98
38 -98 111 -124 137 -153 170 -188 210 -231 254 -284 312 -344 378 -417 460 -505 558 -616 681 -756
58 -756 839 -936 1048 -1183 1342 -1540 1786 -2101 2508 -2989 3185 1032 206548 53124 -214632
73 -214632 11405 178252 -47074 -131453 88474 76849 -93595 -14066 92865 -48073 -77175
84 -77175 89705 48349 -124194 -18207 129496 -21678 -131621 51865 118452 -67881 -91743
95 -91743 78763 62185 -73002 -22918 72746 -2875 -61105 21644 45194 -35480 -30435 38496
107 38496 12132 -44470 -7323 36421 441 -27299 4717 18402 -7336 -9108 11806 6895
119 6895 -6372 3572 5067 -14448 -5274 25900 7690 -36079 -12137 39385 9040 -45632 -6901
132f901N6238m4388n4523M5287M9286l9652l8312L0464K4870k0289j4770O674
144f016Q905J0522o406k9809M528M5912l159n4007N618N5298j1047n2141J6601
157a5201M5786j8544l6183J5793K2069j1780p953P540j820k374O318m455o364
170g168J2620O311j7029m803J5880M45j1367N858O265j2805l856J5356J521j5095
184g867R89J4584j567j4741q73J6156Q197j5075j5452J3486K0339j3669k3193
197a8686J5834K4541j9434k6991J9034K6788j5310k2915R892J6974l576j0824
209d673k352Q484J1404o960k1489N340K9685m036l4248L616L4003p047l3197J0067
223a1403L1441j0908k7995R246K1912o055j3119N045O473l211k134K32p39M382
$$ plain form
132 -6901 49337 4949 -49574 -4287 44999 5347 -32965 -2501 22369 2080 -12690 -6016
144 -6016 2889 13411 7005 -22804 -18276 27636 24477 -29530 -23912 31386 20339 -31802 -15201
157 -15201 30585 12041 -24142 -8349 13720 1940 -6013 1527 -293 -2667 3651 -804 -7168
170 -7168 5452 11763 -5266 -10069 5811 6256 -5111 747 7012 -5793 -9649 5707 7228 -7867
184 -7867 -6878 7706 6139 -8602 -9475 6681 14878 -197 -15649 -2163 18176 4507 -18686
197 -18686 -2852 21689 2255 -24736 -5702 21086 5776 -17139 -7247 9727 6151 -4673
209 -4673 -7025 1459 12863 5903 -15586 -10246 19439 15403 -18845 -15229 18774 11727 -21470 -11403
223 -11403 20038 9130 -18865 -9619 12293 6238 -6881 -1836 4637 1426 -708 -476 -1215 3167
237C167L569r114p257J0555P734j1228n645J2249J882j4621J605J6946l312j6218
251i688O759J4245j1358j2350J6355J1401j9206j0348J8353O366j6737j541J4658
264F909k708j1347M006N642l064L385K560j2093j271J8783j755k2794P561K5275
278A9089j4663k7169J9096K5879k0850k1002K0783J3231k0003n598J8090N09j2330
291d938L161M118o124M474Q472j1107q248J4911M561j8186J46K0777m133k1270
305a3386O271J8506p796j3153J0294Q503j1992n566J1631L497q935j049N907k199
319E33m627L639M111l265k805J912J56j351K361K371l077k172L234M36m020K266
335b98O395m105q966M299R316n219q208P197O668r660o453J0659O201r340l928
$$ plain form
237 3167 6736 -2378 -9635 920 8654 -2574 -8219 4030 5912 -8709 -7104 9842 6530 -9688
251 -9688 -2929 11316 -42 -12392 3963 15364 -3842 -14190 4163 10529 -6208 -7749 6909
264 6909 4201 -7146 -3140 2502 -562 2823 5383 -6710 -7981 10802 9047 -13747 -6186 19089
278 19089 4426 -22743 -3647 22232 1382 -19620 1163 14394 -5609 -11207 6883 7392 -4938
291 -4938 -1777 2341 -3783 691 9163 -1944 -10192 4719 9280 -8906 -8760 12017 7884 -13386
305 -13386 -7115 11391 3595 -9558 736 9239 -2753 -8319 3312 6809 -2126 -3175 2732 533
319 533 -4094 -455 3656 391 -2414 -502 -346 -1697 664 3035 -42 -2214 1020 1456 -2564 -298
335 -298 6097 1992 -6974 -2675 6641 1422 -6786 411 7079 -2581 -9034 1625 7826 -1514 -5442
350e442P486J175o056J177N171j145l006k54o69P01L713m87n176M13M506j991
366A16m128L932M934m261n634L069N593j301m227J077M099j733n560J707P448
381E131j164q313N26P130k242n818M748N077o286m231O218J859m487K431L582
396D161n985k427P764L1p689M016P237q864o936J1394N012j2231j361J1863l710
411B275j1583Q025J0644r914o974J0757K127j1225L100J1432o402r597P904N115
425E684r323j05J0099m300r710O831O384q888j497J1191k717j2316N903J1300
439H536p664p784R945L900j1569j127J1182r33q486K848M316n470j115O570j171
454A978n481L415K912o076m72Q489n69q462J547O701k909m625M563L370n000k758
$$ plain form
350 -5442 2044 3219 -2837 -1660 3511 2366 -640 -894 -1563 -862 2851 2364 -2812 -2399 2107 116
366 116 -4012 -80 4854 593 -5041 -1972 3621 2320 -1907 -830 3269 1536 -4024 -2317 5131
381 5131 3967 -4346 -3820 3310 1068 -4750 -2 5075 -1211 -5442 776 2635 -1852 579 4161
396 4161 -1824 -4251 3513 3544 -4145 -129 7108 -1756 -8692 2702 7714 -4517 -5878 5985 2275
411 2275 -9308 -1283 9361 -553 -7527 3230 5357 -5868 -2768 8664 2262 -7335 569 5684
425 5684 -3639 -3744 6355 2055 -7655 -824 5560 -3328 -4825 6366 3649 -8667 -2764 8536
439 8536 872 -6912 3033 6933 -4636 -5763 5419 4486 -4000 -1152 3164 -2306 -3421 3149 1978
454 1978 -3503 -88 2824 -3252 -3724 4765 4196 -4266 -2719 3982 1073 -3552 1011 4381 -619 -3377
470c377L324J298j359P36P3k140j38J809j43k95J295j66k415j96K285J113o95
487A009q81l27n9K4K2Q86P98j218j946L99J367o9K49Q22j490j918J580K202j123
506C27o21J734q03k612J409K832j058j479J110o76k330J686K685j997j928K033
522C12k62l019K076M103k333l694K586J915k753K91L843j264l794J549J858k193
538g79J95L143j813l992J810K927k111q27L077o53l831J148L737p47j797J400
554H87M11k366m2K511K83j548m19k0r53J75J574M13j202r40J58O56M09M81P36
573A204l88j523l30J828O92r91j49N64j518j309J867J728j620j283R36l56j109
590a757J731K031j655j705J512M12j396J285K163j864k233J352P96j429R06J776
$$ plain form
470 -3377 -53 1245 -114 622 695 -1445 -1583 226 83 -212 1083 917 -1498 -1694 591 1704 1009
487 1009 128 -199 -258 -234 -212 674 1472 254 -1692 -1293 74 5 254 1076 -414 -2332 -752 1450 327
506 327 -294 1440 637 -1975 -566 2266 1208 -271 839 163 -2167 -481 2204 207 -1721 312
522 312 50 -2969 -893 3210 877 -2817 -231 1684 -1069 -778 3065 1801 -1993 -444 1414 -779
538 -779 -584 2559 746 -3246 -1436 1491 -620 -1447 1630 977 -2854 -1706 2031 1284 -513 887
554 887 1298 -1068 -1110 1401 1684 136 -283 -303 -1256 -1081 493 906 -296 -1236 -1078 -422 -13 468 1204
573 1204 816 -707 -1037 791 1483 492 343 907 -611 -1920 -53 1675 55 -1228 -292 -648 -1757
590 -1757 -26 2005 350 -1355 157 569 -827 458 2621 757 -1476 -124 672 -757 149 1925
606A925k164k301J846J307j420P11J658k077j809K470J408j755N24J681k148j924
622b068K516J518k066j4J370k200j659L159J475l079j60K546j883k443L536K639
638C187l500j521L015m06k651K382K640l133k143K862L3k948K180L229l619l258
654c651L552K075l316R4L671j602l802K201L143k032j145K529o76l422J468L424
670B511j603k332J736N44k890L44L538m25l056O63J784j574n28K769O07k885m91
687a288J984k65j056J624P70k478j161K088M79j285P22R40j831j368J918J453
703A246j062m42P72p01r31J272J339p99o91K21n37p43J215J243r76j350N4M81
721c89p0M08P23k98q88k63L38O65P24J36q96p35M5N67M99J37l61o31k59j75J15
$$ plain form
606 1925 -239 -2540 -694 613 -807 -96 1562 -515 -2324 146 1554 -201 323 2004 -144 -2068
622 -2068 448 1966 -100 -114 1256 -944 -2603 556 2031 -1048 -1208 1338 -545 -2988 548 3187
638 3187 -313 -1834 1181 775 -1876 506 3146 13 -2130 732 765 -2183 -3 3226 -393 -3651
654 -3651 -99 1976 -1340 -1246 2425 823 -2979 -778 2365 333 -812 1717 1041 -2381 -913 2511
670 2511 908 -1424 312 856 -2034 -1690 1848 1423 -1633 -970 814 -760 -1288 1481 2088 -797 -1288
687 -1288 696 431 -625 999 1769 -709 -1870 218 697 -588 134 1074 -757 -2125 -207 1246
703 1246 184 -258 514 -187 -1118 154 1493 694 3 224 -313 -1056 159 1402 426 -924 -870 -389
721 -389 -459 -51 672 374 -514 -777 -439 226 950 1086 190 -545 -500 67 566 703 342 -289 -548 -723 -608
742f08R39O43j012j176L70Q92J41K50L42n91p97K25P13J69L08N7j139r94Q46J146
762G24l35n75J52k70p54L92J132L38n94m74l54J05Q50N75j90n70m02k45J66O46
782C17M94l61p43n38m0O52P96j63o78k15Q9j8L71Q96J13r34o30J39N61N36K31
803H75n42q61j7K70J43J73M89k78j049l27P86R49K91p39o53J93M56k13K00R57
823A103k52j636k75J299K02l77M42k40j564J79J717j19j100J030M97k078m68K876
841A236O38k376k4J547j242j334K366J239k618p99J964n66j734J908J972k589
857d12j843K445R25k124O53K457j646k483J719K018j581o30J665n73k356J079
873f87K114j112j166J245q0j945O77K432n03j904N72J001j107k70J696N01j563
$$ plain form
742 -608 331 974 -38 -1214 -844 48 189 439 781 190 -607 -382 331 500 808 865 -274 -1268 -422 724
762 724 389 -186 -34 -304 -1058 -666 466 804 210 -264 -618 -513 337 912 722 152 -250 -495 -329 317
782 317 811 450 -293 -831 -871 -219 577 414 -264 -479 -390 -408 -37 859 972 38 -592 -453 108 644 875
803 875 333 -528 -545 -275 -132 41 530 252 -797 -1124 -338 611 902 163 -490 -297 159 -54 146 1103
823 1103 851 -785 -1060 239 441 64 506 266 -1298 -1119 598 479 -621 409 906 -1172 -1640 1236
841 1236 1874 -502 -526 1021 -221 -1555 811 2050 -568 -1367 597 31 -1703 205 2177 -412
857 -412 -2255 190 1115 -1009 -356 2101 455 -2028 -309 1709 128 -502 1163 590 -1766 -687
873 -687 1427 315 -851 394 314 -1631 -954 1478 975 -929 -357 644 -463 -733 963 1464 -99
890i9o87O80J06Q1O47k34j127j75P23r5n5P50J47j286n81J083Q26k08k09q9n11
911c13j52O77L50k57j8j02r24k58J287O96j055o55N46Pn64P70J048n97j080L45
931b49M02l95O01J032j074j572Q76J206r93m35J508k46k285K82K285k60j379Q68
949A72N59j746j08K231J10j677M14J001j556p27K418O73k548n24J965m97j549
966a389J420J676j878j567J550Q36j111N67J340j373j486J461J220j348k39J518
982A197p31k047P62J983n12j368N29L27j050K52J450j34j027J94L05p13K61J483
1000A161j9j606k11R70j66l96N99L69r97o05M78M12K34J65k72p32lO72K60N8J86
1021E57l51o42mO94K60j07j64n44m26L71O56j90j38K62n44p47P47J282m16r80
$$ plain form
890 -99 -786 -106 0 81 728 494 -633 -808 -85 -180 -235 515 662 -624 -1205 -122 704 496 287 198 -313
911 -313 -465 212 562 305 287 185 -739 -997 290 986 -69 -724 -178 -171 -735 35 1083 486 -594 -249
931 -249 153 -242 359 1391 317 -1255 -379 827 -166 -601 907 661 -1624 -1342 943 683 -696 172
949 172 731 -1015 -1123 1108 1218 -459 -45 956 -600 -1327 1091 1764 -784 -1308 657 160 -1389
966 -1389 31 1707 -171 -1738 -188 648 -463 104 1444 71 -1415 46 1266 -82 -321 1197
982 1197 466 -1581 -819 1164 652 -716 -187 140 -910 -658 792 658 -369 -175 130 -583 -322 1161
1000 1161 1142 -464 -675 295 129 -267 332 701 -296 -901 -423 -11 223 388 116 -616 -619 53 313 371 557
1021 557 206 -436 -440 254 514 407 243 -301 -727 -356 300 110 -28 234 -310 -1057 -310 972 556 -424
1041d24L97L16p71J79J239n3j250o6N19m75J00J154k45j571N6J238l37o00J027
1060D33N83j534p60J446Q21q31q4N22p25o74R28O89p07k93L73n59o31P61J064
1079H22m45j093J95M75n2J7N52J99p09n04L26N06K21j65j71l86l75K86P34p8n23
1100a68K0K6n78L1J188M59j174n62Q20K49n25M85Q07q13j054N17N12k16J42K43
1120D09o34o99O03P18k04l25L95k26p27K57J088J07o48k47J31j21NM82K23m20
1140A67n18j60K44M34J43k10k81j77j72K73P24N0m54j68N1k39K72Q11j09r57j86
1161d62M74j27j42O58K30j056n61Q31M79l84P8M45n40p98P31R30m26l93L45k41
1181G1p71N19J141m22r93J92L69p10J03J075M6j171j27O72M9j66O63J08q88k88
$$ plain form
1041 -424 -27 289 -482 -303 936 883 -367 -433 86 -389 -289 865 620 -951 -895 343 6 -594 433
1060 433 1016 -518 -1278 168 989 158 74 596 -129 -803 125 814 107 -186 187 -372 -1003 -242 822
1079 822 377 -716 -521 -46 -98 -81 471 670 -39 -543 -217 289 510 345 174 -212 -587 -301 433 355 -168
1100 -168 -148 -122 -700 -669 519 978 -196 -758 62 311 -214 271 1078 265 -789 -272 240 24 166 409
1120 409 -225 -924 -321 397 193 -132 263 37 -690 -433 655 762 114 -133 -2 -123 -118 364 587 167
1140 167 -351 -511 -267 167 310 100 -181 -358 -530 -257 467 517 63 -105 -54 -293 -21 790 681 -276 -462
1161 -462 12 -115 -257 401 631 -425 -986 -155 324 -60 18 463 -77 -875 -144 786 360 -33 312 71
1181 71 -700 -181 960 538 -455 -263 106 -604 -501 574 620 -551 -678 -6 43 -123 540 648 -240 -528
1201e28O31K02r3K36q3p08l61N90M31k07j69j11k50j86M82N40N6l80l75j3L54
1222E8K91M5J0k09l86k76L76N62j81l87j44k22q2N24M29l35k92Q6q8j27N81O46
1244H79l89q59J78M18k28N4M95k85q77o2O13R5r7K34j06o50p5R46K96m75pK57
1266C55n15l55Q24O51p63n33L04k5m43M29P01n52q38L83M91m57K58Q97m38j099
1286g25L11J068l21m44O44l3j130p5J106J34p31Q1K97p10k66J059M17p93k62N69
1306A96k38m29P54O29o90p34L46L20j78K05L80m50o49J85L71M7M2Mj39m22o3N95
1328H2M69k63m63J00J66k90N3P38J42r70m98P21M13m74N7L93m63o23M29N85k47
1349E7r8L44m68o49P34R73n35q25O88L00j027l6J431M3j473k18J025j66o72O25
$$ plain form
1201 -528 103 305 212 448 365 -343 -704 -114 317 110 -59 -170 -420 -606 -124 416 472 92 -283 -296 58
1222 58 349 394 404 195 -191 -467 -91 471 290 -97 -241 -463 -545 -21 408 73 -219 -133 -221 -348 233 879
1244 879 490 -369 -191 227 -1 53 548 263 -614 -676 -63 32 -65 169 63 -587 -662 284 580 105 98 355
1266 355 -160 -515 309 960 197 -336 -32 -57 -500 -71 630 78 -760 -377 114 -343 -85 812 374 -725
1286 -725 -414 654 333 -111 533 500 -630 -705 401 535 -196 -115 182 -528 -794 265 682 -111 -373 196
1306 196 -42 -471 283 912 222 -512 -166 154 -24 181 561 111 -538 -353 18 65 107 111 -28 -450 -513 82
1328 82 551 288 -175 -75 91 -199 -146 592 734 -236 -734 -13 400 -74 -17 376 -87 -710 -281 304 57
1349 57 -41 303 -165 -814 -80 893 358 -467 221 521 -506 -542 889 932 -541 -759 266 100 -572 53
1369E3N42r35n42Q48K41m10M63M69q89o49J018O56p72k46O81l70j021N78R99m50
1389B64q18L07K55n64J54Q96n8p19J81J58k05K64P83l01q85L1M78j49j30L89j91
1410A40p05n7L57J72J86Q4l79l11M24L73j38J05L99m44o06K88N56j19l42J14l28
1431b31l70L68N25k48l82K84j18k86M15O83j55n05K1J05j90K17N96m17o92J26
1451b54K77l05N4M90q5p21j72O11L64m3p7j02j55J13J26O9M3K16l31o08J73O44
1473C27Ml90o1J5k14o8M60K60j92k36j55n6L94M55k21m80Q3J88l04N8O35o2q61
1496d21j13N93o6l22N38L81r44m09P02M62m27P5K93n27m24Q05M70o69j38N22l87
1517fo73O15Q98o63o98M25K10n92K47Q38k86q80K95M90l83L6Q57k11j123Q2J069
$$ plain form
1369 53 595 -340 -882 -34 207 -203 260 729 -160 -809 209 865 93 -153 528 158 -863 -285 714 264
1389 264 -554 -247 8 -556 -402 494 436 -283 -102 56 -149 115 898 597 -288 -257 221 72 -58 331 140
1410 140 -565 -622 -265 -93 93 177 -202 -513 -89 284 146 251 650 206 -400 -112 444 325 -17 97 -231
1431 -231 -601 -233 292 44 -338 -54 -172 -458 -43 640 485 -20 1 106 -84 133 729 312 -380 -254
1451 -254 23 -282 -228 262 177 -544 -716 -105 259 216 139 37 -118 -5 121 190 233 449 118 -490 -317 327
1473 327 331 -59 -120 -105 -319 -387 73 333 141 -95 -250 -306 88 543 322 -158 -75 113 -191 -133 502 440 -421
1496 -421 -534 59 -7 -329 209 590 -354 -763 -61 401 -26 49 342 -185 -609 196 666 -3 -141 381 -6
1517 -6 -679 -64 834 171 -527 -102 108 -484 -237 601 315 -565 -270 220 -163 -127 730 519 -604 -522 547
1538E47j28p41M58L36p98m00P41L87n21MJ79m87j66Q14K48m94r4L26k60l19P25
1559C57M06o15n11L35O1k59K41L98l49n32J08L28N0J00P9k85j69J95J41K2L81
1580D82q1o63j12O14N7m79K51K39o42l46O52L37m23O5K09n13j57Q21K78o94L1
1601g4M71n50m50J025M49j108l33Q63k13r08P89R43j044q21R27M19p65K53R86
1620H59o87r27P13P01p64n6R45o05j139P88R58r01m41R32q6j259N10J279n35r33
1640f48Q02L64j064J31J214j74j062L59M44n95p0Q94k32q26J73N36n36o0R55k48
1660C57j091M11Q08m68l56Q00J23j098l0R75l9o48M66P7p45j1P12K4m67K63N0
1681A13o35K09Q45k27o33L68K37o39n8J014N1q91j03N82k64k41M55K35o52j25
$$ plain form
1538 547 419 -322 136 472 -326 -726 15 402 -119 -115 64 -423 -589 225 473 -21 -115 211 -49 -368 357
1559 357 763 148 -363 -28 33 -226 15 413 64 -468 -360 -32 18 118 197 -88 -257 -62 79 101 482
1580 482 401 -262 -374 240 297 -182 69 308 -334 -680 -28 309 -114 -49 160 -353 -510 311 589 -105 -74
1601 -74 397 -153 -603 422 871 -237 -570 293 80 -828 -39 904 -140 -961 -34 385 -380 -127 859
1620 859 172 -755 -42 659 -105 -161 784 179 -960 -172 786 -115 -556 376 290 -969 -459 820 285 -648
1640 -648 154 518 -546 -415 799 625 -437 -78 366 -229 -299 595 363 -463 -290 246 -290 -350 605 357
1660 357 -734 -323 485 17 -339 461 584 -514 -544 431 392 -256 210 287 -458 -469 243 267 -200 63 113
1681 113 -522 -313 532 305 -328 40 277 -362 -420 594 645 -246 -349 233 -31 -272 183 418 -234 -359
1701c59L78r1QM55j01p02N3O60k59k49M75K21q63j93P74K02n90J25L51n50k51
1722e06O20K81m23MJ71m49j03O68K14p12N0M06l47k89O83L51p69l17O22M8n31
1743c28M11N78p09n61N90L10l77N9M02m25n33M60M40l51k3M08l66n34N30N53m42
1764I2k39L74j63n33L43N82l23m37K50K1l04K27M78j65l77M7O1j4K58K93l71k86
1786a86J93k4p1K85K48n39m16L43L21k92N5L62l00m30K85L90j07m5J80k70l16
1807c34M06L47l85j14L63l54n14M65O36m64l84L08J20l97Q4O59j02n31j9M10j74
1828B6q5L29O6n65j29M99j9k70K87J33n72j76N95K21m93P5L13k57m75N08M87l32
1850A66l71J80J39m34K47M82k47m63J73J85j89K8N05k04n49J00L76j02q6L52r0
$$ plain form
1701 -359 19 -72 -64 391 290 -412 -359 301 42 -207 268 489 -374 -567 207 409 -181 -56 295 -255 -506
1722 -506 114 395 -28 -24 147 -302 -405 263 477 -235 -185 221 -126 -415 268 619 -150 -467 155 203 -328
1743 -328 83 661 -48 -609 -19 291 -86 -27 375 -50 -583 -123 317 -34 -57 351 -15 -549 -19 534 92
1764 92 -147 227 64 -469 -126 456 133 -304 -54 -33 -337 -110 368 203 -174 -127 -66 -80 178 471 100 -186
1786 -186 7 -17 -88 197 445 -94 -510 -167 154 -138 -83 279 -21 -451 -166 224 117 72 252 -18 -334
1807 -334 72 419 34 -80 283 -71 -585 -120 516 52 -332 -24 96 -301 -217 442 340 -191 -210 200 26
1828 26 -59 270 336 -229 -358 141 122 -148 139 272 -300 -476 119 340 -153 -78 235 -22 -497 11 498 166
1850 166 -205 -25 114 -320 -73 409 162 -301 -128 57 -132 -104 401 197 -352 -252 124 22 -64 288 198
1871A98n03L1M13J23k44N5J7l20n1L99Q1j76m2n3k41J58L09kk07P9o0k00J39M02
1895C05o1l14ON5j21J31K92r6l39N7J1r6K02K93k41m63J40K60q1PK97k9n23Q0
1919b28M18k0r5J10m2m06oM12L6k65J05k8l60J41L72J2k39L6N2j74P3M24L4l36
1943B6l4M0j97P2L60o8m43L9J86k08Q2M01o8n46J71L06j52k9M88j08o74J43N63
1966C50k43l75M84R7p86j06R06n5o55K62N41p08l12R34K65q88P6P17n15n78R14
1987C25M05j055k40R45j97q95O91Q32r19p81J031L86r32J27J005n52j014P78P76
2006G16p78l39Q54j41j038M10J038o51o02O74K28j004J89J078l16q95N04N32p21
2025b62j71R95k3r58J19P67m29l74O35J91q01j67O88o4m13L70K00n92j38O22P4
$$ plain form
1871 198 -305 -274 139 262 18 73 90 -230 -281 118 199 23 -19 -72 -313 -155 154 152 -55 24 -36 -236 -97 305
1895 305 244 -70 -64 -9 -130 1 293 197 -142 -85 -74 -170 32 325 84 -379 -239 21 -60 -53 244 215 -308 -228
1919 -228 190 170 75 185 143 -263 -269 143 179 -86 19 -9 -369 -228 144 156 -83 -47 5 -169 -96 328 362 26
1943 26 -8 32 -165 -93 267 199 -244 -205 -19 -227 -145 256 188 -358 -187 119 -33 -62 426 318 -356 -213 350
1966 350 107 -268 216 313 -473 -579 327 272 -383 -121 420 -288 -600 334 599 -289 -213 504 -11 -589 325
1987 325 730 -325 -565 380 183 -712 -21 811 -108 -889 142 528 -404 -277 728 176 -838 -60 716
2006 716 -62 -401 453 312 -726 -316 722 71 -531 143 371 -633 -444 634 318 -577 -73 459 -262
2025 -262 -433 562 539 -419 -300 467 38 -336 299 490 -311 -478 210 146 -267 103 303 -289 -427 195 269
2046B69m64L16K06n20k21O31J95n59O7L05l71k44M27L54m98j11K52j39q1L64J92
2067C70m67n1K31j33j20M20R5l92j85K83J0j72K81O5m01r0K52Q0j55J64P6l46
2089a85n7K71Q5l4J14o0l90N1M09m4j99J81n7l93M6M81n3l12J71Jl36Q2N08n8
2113B22l37J14J60l14O2M97j50m40J39K49l49j53O88j35o87R1N47k35l26O12J78
2134D33p41j59P91l1n60L45L60o38k77P32J12n93J39L38m80l45P50K52o87p0O55
2155C26k26o39O34N70o13n67N88L12o95J79O58l77n93L28L28k72o0L72j83m53
2175c83K70L68k83p9M07j44m92J57N92k12l94K66J01l89q6M69L1k81j24J21L6
2196d9m4J63P1j30r1k1N0J86J54k05k45J73O6j31O3K13j32l25K3K33J1k6P7j17
$$ plain form
2046 269 -195 121 327 -193 -414 217 412 -147 -80 225 -146 -390 37 391 -107 -218 34 -105 -186 178 370
2067 370 -97 -148 83 -50 -170 250 345 -47 -232 51 61 -111 170 235 -166 -256 -4 76 -79 85 161 -185
2089 -185 -242 29 114 80 194 134 -256 -205 204 160 -39 142 85 -308 -262 219 166 -146 25 26 -310 -228 280 222
2113 222 -115 -1 159 -155 -93 404 254 -186 -47 202 -147 -300 388 253 -434 -343 204 -31 -357 255 433
2134 433 -308 -467 324 293 -267 78 438 -200 -477 255 367 -226 -87 251 -229 -574 176 428 -259 -329 326
2155 326 100 -539 95 665 52 -515 73 385 -310 -131 527 150 -443 -115 213 -59 -119 253 70 -383
2175 -383 -113 255 -28 -107 300 156 -336 -179 413 201 -193 73 174 -215 -301 168 199 -82 -206 -85 -49
2196 -49 -93 70 141 11 -80 -101 -51 135 289 84 -161 12 78 -53 10 223 91 -234 -211 22 33 7 84 -33
2220c3r6O0PJ07J26L7k56j95K57K09j71j12K18r9l37P6L43O4l28o9J73p6k1K00
2244H4J25j17k03M2P8J00Q4q8j18l7O6n9qK41j01l14q0L29J09j93P1R4j71k01
2268b67L02K08j04j71lM2j06R8J62J3j26k13J8R1J26Mj49j3Q0K0j52J63L25k43
2292A05k91P5L16o2k30J61J47l12j89K46K83j38k48nR0l6P9R2jl0o3j55N7K62
2316A53R1k24j55J50L7k03J04L39k17m29J02L47k8j38R0J01k13j10J57K87j09
2337A32j16q0RQ6k3K7N1N6k18j85K26J99q5j48l1O3q1M3J82Q0j23j66l8J57J52
2362A69n9j30M5N6j96q8L32J40l93j08K32M5j48Q2K67k49k75K13J35MN9N3k26
2385d0j42K63N8k56J98J85l97k20L44K84m19p6L54o2m20K56M13k01k76J28J18
$$ plain form
2220 -33 -129 -69 -62 45 171 208 -48 -243 14 223 52 -60 158 59 -278 -202 141 205 -123 -192 -19 -95 -116 84
2244 84 209 92 -111 -69 9 109 193 105 -13 -50 16 -43 -51 190 89 -225 -305 24 133 -60 11 105 -66 -267
2268 -267 35 243 139 -32 -35 7 -99 -1 161 174 48 -165 -147 -56 70 74 -75 -88 -8 12 -140 23 348 105
2292 105 -186 -111 205 143 -87 74 221 -91 -280 -34 249 111 -137 -142 -52 -88 -9 83 82 52 -11 -166 -109 153
2316 153 244 20 -135 15 52 -151 -47 292 75 -354 -252 95 67 -71 19 120 -93 -203 -46 241 132
2337 132 16 -64 -55 31 8 35 86 142 -76 -261 -35 164 79 -69 -100 -37 -118 -75 107 187 64 -102 -140 17 169
2362 169 110 -20 25 81 -115 -203 129 269 -124 -232 0 45 -103 -21 246 -3 -278 -65 70 74 133 186 -40
2385 -40 -182 81 139 -117 81 266 -131 -351 -7 277 -142 -218 136 74 -346 -90 323 122 -154 -26 92
2406I2k28P2L27j22k48K7J18j57J24K83k35l04J31L02k76J0K64Ll92k1M10N4k02
2429C2n8K01k15j24J77J75j25j65K8LM5PR5o4p8j9k1O1J81K0q6j42M9N0O0n8J6
2456D5kr7j33J51J54o2j55M5O1p0l7K20J27k44j87J84J27j85lK04q8l33J31K69
2480A22m2j66O3P7k94Q9K67l1j93J04J29l16O2L83lm26J01L01k89j25K83J99l90
2503i5j69K90j4j49J74J35k63j61K18Q2o8R1O4k29mJ34L7j34J31Lj82o9K14R3
2527A29j33k3n0l4K4J32N6l0l5m4j30J64K16k13l7O6Jk10Q7K99p9l41P8J29o7
2552d5o5K24pk59PK21o1j25K84J2l69M5K92j03j65K11J53m44p8L88l5k40O2K58
2576A61k91j81L50K25l05m4K11j41k24K82L13k99l36L15J10k95J36K99k55l47
$$ plain form
2406 92 -136 -64 263 141 -107 -80 38 -119 5 288 53 -251 -120 182 -94 -84 180 183 -209 -230 180 234 32
2429 32 -26 175 -40 -164 13 188 63 -102 -74 -71 -26 -19 76 12 -66 -85 -106 -45 136 156 70 -72 -23 27 87 29 45
2456 45 43 -54 -187 -36 118 56 -99 -54 7 -63 -100 120 247 3 -184 0 127 -58 -61 143 55 -278 -147 122
2480 122 80 -86 -23 54 -240 -151 116 85 -108 -4 125 -191 -129 254 251 -175 -74 227 -62 -187 96 295 -95
2503 -95 -264 26 12 -137 37 172 -91 -252 -34 48 -20 71 135 -94 -98 36 73 -61 70 73 -109 -178 36 129
2527 129 -4 -27 -77 -111 -87 45 101 71 36 -8 -138 26 242 29 -8 58 59 -151 -64 235 156 -185 -107 22 -45
2552 -45 -110 114 107 -152 -145 76 15 -110 174 186 -183 -138 154 51 -114 97 250 -194 -272 116 81 -159 -97 161
2576 161 -130 -311 39 264 -41 -85 126 -15 -239 43 356 57 -279 36 146 -149 -13 286 31 -316
2596c16K75J95j66j03L73j30m35J85L34j30j83K33K6l28J7K65L3k83P3J37j98
2617a26p7L39K0k63mJ56p9p7K42N2j54k07K07Q5n6lO0m6k11N7J47k7m5O8q1r1
2643a14Q0Q7j8qJj7q3%J91k2j08n8Q0k8oJ20j9n7j07nP7L3O0k9m4q6K5J47K4K7
2673A43j17n6j3k4J28M2p6n8m8l7N7J06K3j10M4k9m2N0J63o0j36K2J6J5L5J30
2699A68j00j27l1J04n8P4Nj4j57j3J87j2o2J53mk20NJ71Q2q4m5J9j99J17J27P6
2725A62j76p4N1o3K4Q1J06j05j07P0O5m1O9k5j4j33N8O6N5L0o9l3o6LN6P6k3p5
2753c2jj5J1M8R2Kj53k1O2Q0o7J13L4j80r2J19N1k3LL0j07r6P1J57q4j1K0r9m9
2782a37J43J59j14j05N0N3p5j8J49j0k30MK14j18K3Q2J6j57r7J77K3m3N8M9j02
$$ plain form
2596 -316 -41 154 -12 -115 258 128 -307 -122 212 82 -101 132 158 -170 -153 112 145 -138 -65 72 -126
2617 -126 -203 136 156 -107 -111 45 -34 -111 131 183 29 -178 29 114 58 55 115 69 -142 -85 62 35 -10 58 -23 -114
2643 -114 -34 53 35 27 28 11 -72 -72 119 97 -11 -69 11 -17 -23 97 78 21 -86 -91 -14 19 79 50 6 -80 -55 92 116 143
2673 143 26 -30 -43 -67 61 103 27 -31 -79 -116 -59 47 70 -40 4 -25 -67 -17 146 86 -50 -28 -12 3 38 168
2699 168 68 -59 -90 14 -44 30 35 21 -136 -149 38 26 -36 117 113 -107 -102 69 151 67 22 41 -158 -41 86 162
2725 162 -14 -88 -37 -100 -76 5 111 6 -101 -31 34 -7 62 37 23 -110 -52 14 69 99 30 -3 -69 -66 -10 66 43 -32
2753 -32 -33 -48 -37 11 103 105 -48 -69 -7 73 6 119 153 -27 -119 0 51 28 31 61 -46 -142 -71 86 2 -9 11 -88 -137
2782 -137 6 165 51 -54 -4 49 -26 -44 105 95 -135 -131 83 -35 -12 70 86 -71 -168 9 32 -11 47 96 -6
2807fj23J68J09p4n9M3r9n2Q0J50r6j49k8J08m7k1K01j2j35p3J25j5N5j2L3j18
2833d7mrJ38J1o9qo4j7M3J60r2p1o8N8NK3J35lj34q4K2J45l5K3P7j06j82M9J70
2862F6p2o0Q6l7j32O2J66Jj35O5%j25P2J58Pj38o4J36n4n3J27O5k20%J45j45M9
2889c0P3rj11n1J40O5r2N7L6j91k6K02L1o1o2L1r1j1M4N1M4q8ln4L8J41M1j29
2917a5K4j3j1j9J31j5r2p0pL7N2M8p4m3P5K51j42j67K03m8m9k93J61J64j45K05
2943A48n6j71mJ03N9m0j21Q6j60J21j5J31p9N9j99p9M2L08j49n9J14p2N5n7J02
2968F7N4o1j33m5J39L2n1J2K4l1j45J41N1J7n4om2l6J01J06r5r0J1Knk3K67n4
2996A53j85J3r7Q8j5J57q4o5l0J31m4J8L4O7k00K7M1K3J0n1J3m0m4O1J20r5M0
$$ plain form
2807 -6 -129 39 148 74 15 58 -41 -93 -13 137 41 -108 -136 -28 -75 -96 105 93 -42 -115 10 -5 50 38 71 -47
2833 -47 -51 -60 78 89 20 12 -52 -69 -26 134 42 -29 -97 -39 -34 -11 124 121 -13 -97 -75 70 35 58 135 29 -153 -104 66
2862 66 -6 -66 20 -17 -149 -87 79 80 -55 10 10 -115 -43 115 122 -16 -80 56 2 -51 76 141 -79 -79 66 -79 -30
2889 -30 43 34 -77 -128 12 77 -15 42 78 -113 -139 63 94 33 -29 2 -89 -100 -56 -5 39 -49 -52 -106 -68 73 114 -15
2917 -15 9 -4 -15 -34 97 82 -10 -80 -87 -50 2 50 -24 -67 8 259 117 -50 153 105 56 -237 -76 88 -57 148
2943 148 92 -79 -83 20 79 39 -82 4 -156 -35 -50 81 2 61 -138 -217 -175 133 -16 -75 39 -33 22 -35 67
2968 67 121 60 -73 -118 21 53 2 14 38 7 -138 3 54 71 17 11 -31 -67 34 140 45 -45 -34 -32 -37 -60 207 153
2996 153 -32 -19 -116 -28 -43 114 30 -35 -65 66 22 40 74 141 -59 -32 9 32 42 -9 4 -36 -80 -19 101 6 46
3023D6r8J2n5P6J07p4r5K8MN2L8L4p3p1N8L8nq7J02r5l5LP2Q5n1k3Jj11N1J21
3053E5J7l2k8k0pn2J14L5p9rL1o1n3J32P1r9o6L4j1k3j46m1K27lk1M9JN5J3j61
3083g8QQ5J8n2M4M3j67m9J50J25J56k37m9k1o0J25J30q1j15O7o6l6Q1J34j30k18
3109a93J44P5j29Q7J52j04j75M0J59r5R1M5m4j19j4L11j93j75k2K00m4r1J69P3
3133A48j23o0J17j02k3J14M8q1j4kk1J2N5M8j08o9N7M5q5N6J18j82q5JJ43r7J22
3160C2N2k51k1L20r7P5o7J42k84j94K75J05j23J6Qk20J93k11M37kp0j03Qj04L42
3185B58j49r5J45l72K83l96N78k81j11Q8j0O7J56j50P0n8j66P4J43m1n6L5L5j76
3209a29K1J77j7j23O1N8j06r1K78J3k21k3J67q9m8J04J08j72q9J27pk3L5P6l6
$$ plain form
3023 46 -52 -40 -95 -19 88 14 -81 -53 -49 3 41 75 2 -69 -11 27 22 -65 37 -58 -93 -90 -18 67 16 -7 -6 -117 -66 55
3053 55 72 40 12 -8 -15 -67 47 82 3 -6 25 -36 -89 43 114 15 -51 -17 -28 -51 -197 -238 -11 -14 -35 14 15 70 83 -78
3083 -78 -70 15 33 -19 25 68 -99 -148 2 127 283 46 -3 -24 -84 41 171 90 -25 42 -24 -60 21 155 25 -193
3109 -193 -49 26 -103 -16 136 32 -143 -103 56 -39 52 97 53 -66 -80 231 38 -137 -159 41 -3 -94 75 148
3133 148 25 -35 82 -20 -43 71 119 38 24 22 1 13 68 116 8 -61 -4 41 -44 12 130 -52 -137 -136 7 -90 32
3160 32 84 -167 -188 132 35 110 43 185 -99 -293 -18 87 -36 -20 -12 -232 -39 -250 187 185 115 12 20 -84 258
3185 258 109 14 159 -213 70 -326 252 -29 -140 -52 -62 5 161 11 81 23 -143 -69 74 33 -23 12 47 -129
3209 -129 -108 69 52 -71 -10 48 -58 -149 129 142 -79 -102 65 -24 -72 32 140 -32 -121 6 -1 -24 11 87 51
3234E1j87J55M6r0K4P4q6j34J49P1j25M9L3m0n8K9J20l2m4J1O4j19N7J04j69L
3260d4PQ6j10O5P1k8j20J6J02m8N1J4j7q1lO9MK8j6kn2o8J89q8k6N8q8q2N9L1
3290b3K2K1q1P0r0K9R3M8r4k9K8l%R9K9j60M0n6J8N3k2J2m4j7J5Q4J9n6KL2q5
3321d6R0l4K4k9k6pk1O3Lj1n4N9o3n8R6Q1r3j5K3k5K3M3O8p6J6p4P5k7j8L9n7
3352c1k1K3N6o2M8j0J4q5P2M9J6k4k9m9lL9m8O7Oj8j2j24P9J28j12l5J09o0o6
3381h3J07N7M2j92R0rp5J02N0q2n3O5K4j3r3J79o5q9j0P7j3k6R2l8q5l7J22OL
3410E3m0M8j15M9lO8n6l1QL5j19P0J12j11l5M3k0N6N1M0j29KPj3M0M4K5j13k0
3439e4O1J2m9L1N6o2q4O2R1j8r4Q8o2j6L5M1J0m5J3qk4K8J7K3j12k5Q7l6J8N4
$$ plain form
3234 51 -136 19 65 -25 -1 73 -13 -147 2 73 -52 -3 30 -10 -68 -39 81 49 5 16 80 -39 18 122 -47 -44
3260 -44 -37 49 -61 4 75 47 -73 -57 45 -3 48 62 45 -36 -39 30 34 62 46 44 -8 -76 113 25 -1 57 -31 -113 -54 -23
3290 -23 -1 20 -61 9 -81 -52 41 89 -5 -34 -6 -9 -9 90 119 -41 -1 -57 -39 14 -8 4 -40 -57 -42 42 61 5 7 39 -46
3321 -46 44 10 34 5 -21 -28 -49 14 17 6 -48 11 -52 -110 -14 67 -26 -41 -18 -43 -20 23 91 15 31 -43 32 5 -13 26 -31
3352 -31 -52 -29 27 -35 13 3 17 -68 4 53 69 45 16 -33 -36 3 -45 22 28 10 -2 -126 -47 81 -31 -66 43 -17 -83
3381 -83 24 81 123 -69 21 12 -63 39 89 7 -46 19 43 30 -63 116 51 -38 -48 29 16 -10 82 44 -41 -78 44 50 53
3410 53 13 61 -54 -5 -8 60 4 -27 -19 16 -103 -33 79 -32 -67 -24 -44 12 63 103 -26 -24 -17 -30 10 54 79 -34 -54
3439 -54 7 19 -30 1 57 -5 -89 -27 64 46 -48 40 -22 -38 -3 38 48 3 16 8 -16 12 29 52 -60 -85 2 -34 -16 38
3469C8O7j21q0Q6k8N6K6l1j1MJ7nK5j0m3J4o7P9j0Rj4j9m9M9j7J18o3j1Ml1N6
3500C8l5j2N6o4oqRj8K5j4mmpO4N5n8KJ0k9j2P4l2J1o9mQ5p8K1Q1p1o1M5n2R2
3534C0l8RK5q4J2Q6N8j21pL7o1pJ34Nq6k8Q5p2n4J24nn3m1M2N6p5O3K0q2rN2K
3566A7j5N6N6j02p9M9O0m8J3Ol2q0K9J80j14J7K0l4o4N2J27p2j00M6Jl4L7R0p7
3595Ej23N1O1%j6Q1o2j07R3Q0l8m6J21m1j06k5J11K1j6M3m2o0n8J51o2o2j1Q8
3623C1p8p8J13J04j05l9O8n1rK2J14q4l5L1K2n5L1L8k5n5NL3kMK6J8p4j8O2M4
3653E8p4JJ18j22l4R1ko5M1j1o1O5J4K1n5k7L2j8J2NK2m0o8Q1n1J11J5j1r1M5
3683Bk7J9J6l5K3o8%J21n6J6j0L6m6jK1Q3o0l2M5p2kM2M7l4m4l2k3O7N4p4K5l1
$$ plain form
3469 38 105 -16 -96 -10 -38 18 44 13 2 6 23 18 43 33 -10 4 -63 16 6 15 1 -18 -67 -18 -35 83 20 9 13 -18 38
3500 38 3 -9 47 -17 -23 -31 -22 -40 -15 -29 -33 -37 -44 20 75 17 19 29 0 -12 62 30 41 -28 -32 53 -25 -4 77 6 -55 -10 -62 30
3534 30 -8 1 26 -58 -46 40 98 -23 -30 7 -54 -61 73 78 -8 -36 49 -23 -77 47 42 -11 -52 -10 46 -29 34 54 -28 -37 15 17
3566 17 2 58 114 12 -67 -18 42 -6 7 13 -19 -99 -70 110 -4 13 33 -1 -65 -13 114 42 -58 -12 -11 -45 -8 82 5
3595 5 -118 -67 -6 -6 -22 59 -3 -110 -17 63 25 -21 100 59 -47 -72 39 60 44 87 45 -15 -73 78 16 -46 -57 31
3623 31 -47 -125 -12 92 -13 -52 16 -35 -44 -22 92 8 -27 4 26 -29 2 40 15 -40 -35 -2 -4 0 26 44 -30 -48 14 58
3653 58 -16 -15 103 -19 -53 38 36 -29 12 1 -60 5 19 40 -15 -42 -10 -28 -16 -11 11 -29 -97 -16 -67 44 59 48 -43 2
3683 2 -25 -6 10 -25 -2 -70 -70 51 -5 11 1 37 -9 -10 11 94 34 2 47 -25 -27 15 62 28 -16 -48 -71 -4 50 -24 1 -30
3715c0M7j18J40J1r3M9Jjl1N0K3j9l3j3N3k1N1Lj13L0NL4k4K8ro1k0K5P4k0j9
3746aRmk8J0K2k4rP2q6m1K7M5J4m5m4Q5m6j3O4Ln5M8p4O4j1M2k2J5n7j6L1O0k
3779C3q7J15n8j7K0j5N4p4P5o1J1L5%n0m4P5l6qL5Mn8NK4j5M2J8%r9K2M6N2q4
3811d0M7K3j0q1R9K0Kq9J3qk3N6M5m1j8K0mn2J7O4j0l6k3jj8L6M0k4lm1Q0p7O3
3844B6J9r1J6L0k1kL9mJ3l7q7M9N1K8qK7%k4L0l7m1P7k7o6J5L3oj9P7l0Lk6P5
3877H2o3k8l4L3O1pm0J1o1K3PNL7k1k4k0NJ0K6J3Pl3k0m2P7K2Rn5J3k4RP1j4K9
3911F4l0m0k7QL7M8n1k1K9%J1J7p6N7p0N9K3p3R4l5k9K7j2l0L9Kl5j0M5K0o0%
3943a9N4j0n7JR2J7q7Mj7jK7K3l5L9n4%k9Q3j8J1n1j7P7m5K4RL6j8p1QL3J4m5
$$ plain form
3715 -30 17 -101 39 50 -43 6 7 6 -25 25 48 29 -4 -17 36 15 66 69 -44 -14 -9 25 1 29 20 -41 -61 -36 38 18 -1
3746 -1 8 4 -24 -14 8 -16 -25 47 -39 -80 -53 -8 6 -39 -83 2 -44 -57 7 10 -45 3 -71 -7 -18 24 2 17 -40 -56 -25 35 33
3779 33 -54 61 3 -14 6 -9 45 -29 46 -15 -4 31 31 -19 -63 12 -24 -32 3 7 -51 -46 -22 -37 5 23 23 -76 -54 -8 44 -40
3811 -40 7 30 20 -61 38 58 60 -29 -16 -24 -47 9 54 13 -5 15 11 -41 -24 40 30 -6 -29 -30 -48 -12 28 4 1 -40 40 -37 26
3844 26 45 -46 -30 0 -21 -23 16 12 25 -12 -99 -50 1 29 21 48 48 24 54 17 -24 53 26 -40 -25 8 2 -17 60 30 33 7 82
3877 82 19 -9 -43 -10 51 44 4 15 -46 -23 -16 -11 26 5 -19 -39 -34 -24 2 15 22 -11 -31 -73 4 26 35 -20 -7 -31 -22 49 35 64
3911 64 34 -6 -33 -25 12 60 9 -12 17 17 28 45 -31 26 -44 15 38 -35 59 24 -5 22 10 -20 19 21 -14 -24 21 41 -19 -19
3943 -19 35 25 -32 -31 61 78 -9 -5 -22 -23 4 27 -8 31 -23 -23 -52 31 13 24 -27 -44 33 -12 12 21 57 39 -32 -24 9 23 -22
3976b2K7p0j6K5L2Q1j6q0MM3KnN1l3nrk8K7K7M1o6k2j8J5l0M6j4rO6m3l0J6rn
4010b7K1o1Q2pj6l9M9k3J3p3R2L5r5L9qm4N1O3j08P5p7O6j5J5M7K5o6L1l4%j5
4041dN4j3j27O3N0o6K8N8o6j6K2O3k7koL7n4LoK0%j3j6N5q8O0l1L3l5L9Ql5J6
4074DJ7l2k4K1j3L2J8PQm2nN7k8j01P9l3k2M1Jkn4O5j4j2k4J03l0j3Kk6J1J2P6
4107G9r0J2K2j6Pn3J12n9j4J2N6o0m2RL1QJL0n7J7K6j7j9k7K2M4o4K1j4l3M5m3
4139e4P8p2L5LLj5M2j6mJ3j5k7K1L0onn3P3m3J6PM3l8pl5O7KK2p8M1J9n0QrL8
4174C4Jj0l3j8J8j0K0l3K7L6k1qj7k0M9j6oj8rL3J4n8R3j0m5N5l5o1RL4k2M1j
4207A3k9K1K0p4M4nl3K9K1Kl3N5l7M4m9m4O6on1O6k8mrJ2M8l2%J6o4M2qk0l9M6
$$ plain form
3976 -22 5 -65 -81 -56 -24 57 41 -39 -35 8 10 5 56 23 18 9 -19 8 35 76 10 -12 -30 -15 -45 1 -13 -22 44 1 -29 -13 -22 -27
4010 -27 -6 -67 15 8 -8 -47 2 -21 -8 -81 11 46 -49 -10 -18 -62 -11 52 -56 19 -58 8 -7 8 55 80 14 45 11 11 -4
4041 -4 50 37 -90 -27 23 -43 -15 43 -23 -39 -17 46 19 17 11 48 -6 -3 -9 11 11 -2 -18 37 -51 9 -22 11 -24 15 23 -12 4
4074 4 21 -11 -35 -14 -27 5 23 30 38 -4 -9 48 20 -81 -2 -35 -57 -16 -15 -17 -71 -6 -20 -32 -56 47 17 4 6 -20 -9 3 79
4107 79 -11 1 23 7 14 -39 73 14 0 12 68 8 -34 -25 6 14 15 45 -12 5 31 14 -5 -32 -10 34 -30 -9 -23 -56 -11 -54
4139 -54 24 -48 -13 -10 -7 -22 20 4 0 13 -2 -29 -8 22 16 11 -42 31 -12 4 11 54 16 9 -26 41 43 65 -13 28 47 -3 5 -4 34
4174 34 35 25 -8 -26 -8 -18 2 -31 -4 32 11 3 -14 -34 15 -1 -7 -25 -34 -1 13 -45 48 38 -7 48 13 -48 -39 -5 -27 14 13
4207 13 -16 5 25 -49 -5 -10 -43 -14 7 9 -24 31 -6 38 -11 -55 11 5 -46 20 -8 -12 -21 -9 39 7 7 23 -41 1 -7 -27 -66 -20
4241b0L3l5M9Rk6jlj6j0K0K5k9NJ3k5L5j1K4mmRn3P9o8k2J6l5lK1j9O5J0LJ4l9
4276GM0n2O1n6o0K6qQ8m8%Q7n8j8qJ1j1L9l7J2n6mJ7N1l7J0k1M1M5p2O2j8n9j6
4309d2O6k4j9k6M2j2p8R6J4j3k8K9K5rj2%qo3O9%K9j6rj0jk3L8m4L7M2j3o6nK3
4343a1j1L6rN1q4K0k1N7m2L7J1l4oM1J2n4mqL2l9P0m6l6P5p0L5ql5N1K6p9N7J
4376A5l5K0m4N8J3j6m5Q4j5o6N1n0L8L8l8k6K4k1j4N3l5J5q8O8o0J3O6LJ9o7J8
4407b4J7K1MRk4J5rmK7j4l8N8p7L1MJ2L2rk3l7NL4l4N7pOnk3QM3q5L4%k4kkO8
4444D4m8K8n9jk7N8JK3m8J0J3j3J9J1kk7J5n2M8J9Rq5Q0n0J07o0l5M5J1k5l0P8
4476E7m7JJ5n4L5Pp1J0O1j2l4K3l3N3l3J6k9NN1j5l1P0o0pK6j9M2j5l0k7P1o3
$$ plain form
4241 -20 13 -22 27 36 10 9 6 -10 -20 0 25 -4 1 14 -11 24 13 37 33 29 38 -15 64 -4 -26 -10 -45 -48 -27 -46 19 29 32 46 7
4276 7 47 -5 56 0 -60 -34 -42 46 -2 -2 85 27 9 1 12 1 40 3 15 -41 -45 -28 23 -14 -4 -25 16 61 -11 51 33 -26 -42
4309 -42 24 0 -19 -45 -3 -15 -93 3 17 4 -24 5 30 21 9 9 1 -62 7 7 36 20 11 1 0 -23 15 -29 8 50 37 -29 -34 -11
4343 -11 -22 14 5 56 -28 -8 -29 28 -14 23 34 0 -6 35 47 -7 -11 -19 13 -26 44 -2 -38 37 -33 2 -6 -41 10 36 -43 14 15
4376 15 -20 0 -44 14 27 11 -34 50 35 -31 20 -30 8 46 8 -18 6 -15 -29 24 -11 4 -84 -16 -76 -63 3 6 25 -42 -24
4407 -24 -7 14 18 27 3 18 9 5 32 18 -20 38 -39 -8 -4 8 40 31 8 -29 -24 10 -24 33 26 32 27 4 12 55 -30 4 4 -20 -22 -24 44
4444 44 -4 24 -35 -36 -63 -5 -4 19 -29 -19 -6 -19 0 11 9 -18 -3 -55 -7 12 21 -64 16 -34 73 13 -22 23 34 9 -21 57
4476 57 10 11 26 -28 7 14 -57 -47 14 2 -32 -9 -42 11 -22 -6 -35 -30 21 6 -25 45 -15 -22 4 -15 27 12 -18 -45 26 -37
4508c7L0J10q7l2J3k0K6jm1M4k4rJ2J4j0L8kn6K7L6l0l7K8mRK1Mj8J5k1m1N6k5
4541a2K1M1o7K0J4j4Jm3J3JL7jK4n5J4J9rj4mn9O7oj3J0j3L6k1l2L3k7K1L8l3
4574a3pK6kn1N9JK8l1K9l6K2p2JOK1K7L0p4N3k9P8l4o5J1K6l6M5M5n3K9n5O8j3
4607C4n5M7rm4J1jN3n6J0K0J8r2N3N2l8J0mJ2m9%P9m1L1k2koJ2K2k4o7K7O0nj4
4641B2N3o5LNK5p2M7l6K0QLpm0K0M2m5j1k0N9J0k0j8J5J9j8j7N5m3m3J4j5P4L2
4674E6n0rK0%n6Q6k2L7l8k7M1k5KL8j9k8k4k5Q7k2J3l1l9K8jm1N5l0LrK0j1O1
4707D0J2m6o4Q1J2l9qK7Km6K4J1K4n7Q9q4lN2Jj2j1LJ7l3J5L4m3Qk6J4k0L5m3
4740c4N8n9%L6pJ4NJ0J4J2m3n6Q4ok0J1K9q6M9M6J5m0o4N9k1M2o7L2k8K4j6M5
$$ plain form
4508 -37 -7 103 16 -16 -3 -23 3 2 -39 5 -19 -28 -16 -2 -12 26 24 -32 -5 31 1 -36 -8 -12 -3 18 22 4 19 -2 -43 13 -12
4541 -12 9 50 -17 3 17 3 4 -39 -26 -25 12 11 35 -20 -6 13 4 -10 -14 -73 -6 -12 -25 -15 -28 8 -13 -45 -12 -39 -18 20 -13
4574 -13 -20 6 4 -47 12 13 41 10 39 3 25 -47 -46 -40 -19 8 38 -36 17 -12 66 32 -33 -22 4 -32 13 58 5 34 -21 47 34
4607 34 -21 26 17 -27 -16 -17 36 -20 -10 10 28 -64 -11 41 3 13 9 21 -28 -28 51 10 41 19 17 11 23 45 21 -46 -19 41 36 22
4641 22 75 10 13 18 43 -29 18 -18 2 10 13 6 -34 -14 28 -17 -28 -48 11 21 1 -17 -2 17 -1 -18 37 -6 -49 -35 -50 24 56
4674 56 6 -3 17 17 -39 47 25 62 24 -3 38 13 15 53 34 6 -18 -43 44 22 35 4 -35 -7 -8 -49 6 -24 -21 -30 -10 -21 40
4707 40 52 6 -58 23 35 -4 -12 15 17 -29 -5 6 30 -27 62 -22 -25 27 28 16 5 8 25 -8 7 41 -2 6 -20 -6 -26 9 -34
4740 -34 24 -35 -35 1 -6 8 13 23 37 49 6 -50 34 28 8 19 48 -38 11 57 72 32 -32 27 6 48 -19 13 -15 9 -7 38
4772C8L9p3k6K8J5jj8k0JPnJ4mk6M1j3Jj8K1K7K3m7j8Pj4j3N0rm9O5o6O8k8mJ7
4807A0j0K7r7P8j0rL0m2K3Oqlo9P5J1m7J1K2j4MM7m1J6k9k6J00m2l0K5Nj2M8j5
4840C4Rk9j4K8p0K3j9O6l6J5J7KL3k4n7M2M6m6K1k9krJ6o4P4l2l8K3qM7n6oR0
4873D7p3oM3j1J5j9Nn8L0K7K0m6K4M5k7j6L7Rk4j5j0K5oK6n3M7k1L6m7J3L1m8
4905@L3m6MJ4Ol2mN0k0j2K2l0k6N8j2n2K0N5Ll8L1p9N8J6l2k3P7m9pP2q1J8Nl4
4939c5P0l6J3j4L3o8L2k5j0L9o3K4PN9M1j21O4n2J0K2K4K4p7M2jJ9l6O3l1k6K
4970gpl0L7PM4j5m6J7K9J9j03J6N3k0j7lK6j2j8O7m6K5mn5M9m3K9K5jo8L3Kl1
5003d8K3L1k1k0K2j9N8ql6nK1RK0j9K8n7L7rk3M4n1j2O0j7J4L5l5Pm1K9l2P0j2
$$ plain form
4772 38 77 4 -22 6 21 20 2 -18 -17 -10 -15 -1 -5 -31 10 -3 -2 -20 1 28 51 4 -14 -7 -21 -34 16 7 -42 23 -43 25 -3 -7 10
4807 10 0 27 -70 8 -2 -11 19 -23 0 6 -2 -5 -74 1 12 -35 -24 -2 -16 -12 35 -6 10 -19 -45 55 13 -17 8 13 1 49 34
4840 34 43 14 0 28 -42 -19 -38 28 -8 7 24 26 59 35 -22 20 66 20 41 12 10 1 17 -47 27 -5 -43 -20 -28 19 -37 -43 47
4873 47 -26 -32 11 0 15 -4 1 -57 -27 0 20 -26 -2 43 16 0 37 46 22 7 -3 22 16 42 -11 36 15 51 4 17 48 0
4905 0 33 -13 -9 5 11 -21 -25 25 5 -7 15 -15 -41 17 5 -47 -27 28 31 -7 24 -55 3 19 -13 -36 41 -8 -15 57 -24 -6 -1 -35
4939 -35 35 -1 12 -2 31 -37 -5 -30 -40 -1 -64 -40 -33 26 67 -54 10 -42 -32 -10 14 38 -39 3 2 21 -15 48 17 -9 -7
4970 -7 -14 -44 -7 0 44 29 -17 0 29 48 -55 -39 14 -6 -23 -26 0 -12 -30 37 -9 16 12 -43 6 -37 -8 17 16 -52 -19 -17 -48
5003 -48 -25 6 -15 -35 -13 -32 26 18 -18 -23 -2 7 27 8 36 -21 16 7 -16 28 -23 -35 25 8 22 57 22 29 -12 17 -15 55 43
5036D3n0jK8qk3J6MLK9%l6k8lj3Q4q6O4pj8J3K9n6k3K9J3QJ2Noo1N3L1p4J3L6
5071B0k6RO8p9l6M3n3QM0j6L7j9nlJj4J3qqJ9M0j3n8lK1O4m1K5J4o2lL2Rj2NR
5107A8k6L9j2j8J1m0M8Pl4K5mn3M6k7l0nM9n2R9l4n2K3K3l8K4j9K6L5nn1K0k4
5139c1L0QJ5j2j2%%J6l8K9%J6k6L8j2lj9N0k5n2K5k3L7mrKNm8L0jL6m5N0j4n2
5174c9J7K1k1J2JN5k3l5J1L1J9l7k0k0L8J4Jm0O4k4N9p0J1j0j0l7O4j4q3N4n2
5205f3L6K3rj2K1j3L3o0N0k2MJ8M7q4L5PJ3m3omM3rQrj8O0l9l1P3l3mK5m1K9m8
5240b3l8N9RrO0p1kL2j9k7k0M3OJ2L%qk7L9k1K2k5K2o7N0R5q5J3K7j1p2QO2j1
5274B6k6QL3o5N2k8J4K1k4mj0M4l0l1qJ6M9p1J7k5j4K8l4O6K0n7O3r4N4K1n2L
$$ plain form
5036 43 -7 -8 20 12 -11 5 9 12 41 41 5 -23 -26 -39 45 -41 23 16 -2 11 40 -16 -39 -10 3 11 23 28 22 -39 14 45 -29 -16 20
5071 20 -6 3 71 -8 -44 -1 -54 -46 -6 -22 15 -4 -9 -12 -11 -25 -12 -20 -28 -9 31 18 -40 -43 -22 42 1 26 40 -22 -25 7 16 4 9 18
5107 18 -8 31 19 1 12 -28 20 27 -7 18 14 -39 7 -20 -50 -55 -6 -58 41 7 -45 -22 1 -37 -13 -32 -6 29 24 -27 -7 -31
5139 -31 -1 7 22 10 -2 -2 -2 14 -24 5 5 21 -5 33 21 18 -1 49 24 -28 -3 -26 11 7 -2 0 5 -43 -13 -14 22 -23 27 13 -39
5174 -39 -22 -1 -22 -10 -9 46 23 -12 -1 30 49 12 -8 -28 10 24 25 -15 49 25 84 14 25 15 5 -32 32 18 -65 -11 -63
5205 -63 -27 -4 -13 -25 -4 -17 16 -44 6 -16 -12 6 53 -31 4 11 24 -19 -25 -29 14 5 13 4 -14 46 7 -24 49 16 12 37 -4 25 -23
5240 -23 -61 -2 7 -2 58 -13 -15 17 -2 -29 -49 -6 0 12 15 15 7 -20 19 -2 20 -5 17 -50 0 95 10 23 50 39 -33 -25 37 26
5274 26 0 8 41 -24 28 0 14 35 11 7 -3 41 11 -20 -28 -12 37 -34 -17 -42 -56 -28 -62 4 24 -33 30 -64 -10 11 -41 -38
5306c8O0l9L6m5K5K5kNJ2m0K4Qn7J3J9l2M9J7j01J06n9NL5mn4l0K2O6K3j07Q2
5337B4Kr6P0K4o6N9p2M0k5N5k8K4L1k8m5L0K9l3L1r5R4l0J7k5K1Om8Q1o4Pj4N1
5369B7n7L6J7M9r8M4m5M6n6J04Nj03L6Mn6N8k6m2O5o0O8j8m2N8mq9P3M1Lnm5M7
5401C5j8k7j5KM4Lk5m6L1QQ6r3K1K7k9pm1L6j7K8l0K7J1m3jJ8KMj9j5J02m2m2
5434b5M9k2l2L4l4JMmj4L2N5o2M0o7L9k5Q1l6K0mm8K8l4N4o3J8j7N8l3l0Q3r9
5466e3M4j7M5Ml3J1mmJ4l9P2j8j0k7K6Kj4M0j8K5k8m5J7J1l2O1k1l6M6rk6NK8
5499A7J2o1K2O6p0l2K9M7m3M7m3L2m1RPjK2r6O4J6N7j00L8K6k6k4N0Oj6KM7n1
5531A2l4N2k6M0l9N2l3l3k5L2NJ4n0M9l9J4N3m9J9j4L2l7j8J3LJ9l6J8qlJ4j7
$$ plain form
5306 -38 22 -17 19 -26 -1 24 22 27 39 -1 23 31 -26 -13 6 -26 23 40 -61 45 -14 -9 26 22 -32 -62 -40 26 49 -58 24
5337 24 26 -70 0 24 -42 17 -55 -15 -40 15 -13 11 42 14 -31 -1 28 -5 26 -69 25 -5 12 -13 8 14 -34 47 -17 -10 -24 27
5369 27 -30 6 23 72 -26 18 -27 19 -37 67 72 -31 5 9 -47 11 -15 -57 8 -52 16 -2 -44 14 10 -79 -6 35 38 33 -12 35
5401 35 17 -10 -25 -23 21 24 -1 -47 -16 -8 78 -15 6 33 4 -3 -44 -8 -25 3 -27 0 11 -32 -33 -15 -13 -9 -28 -43 59 17 -25
5434 -25 24 2 -30 4 -30 -29 -25 -29 -43 -11 44 -18 22 -45 -6 -31 50 14 34 30 -18 10 -24 30 -33 -15 -32 26 -7 -37 46 -53
5466 -53 -9 -26 19 23 -10 1 -3 -7 7 -32 40 22 12 -15 11 13 -1 39 21 46 18 -27 -10 1 -31 30 9 -27 19 10 -16 -11 17
5499 17 29 -32 -10 56 -14 -46 -17 30 -13 34 -9 23 -18 -9 -2 -3 19 -77 -13 3 60 -40 -2 24 -2 -26 24 30 14 16 63 12
5531 12 -22 30 4 44 5 57 24 -9 -34 -2 3 17 -33 16 -23 -9 44 -5 14 0 32 -5 -23 -10 -7 12 -24 -6 -14 -17 -3 -20
5563b0L3K6j9k0J8o4O6m0L1pj2%K3ko3Q6qk3l4L7K6m2J8p7O7n1M3J3l8J7j2N3
5595B5q2N7kKj2K4k5l3M8N0r2M1K1Qm2L6j7K1no6J3K9K9Mj7l6M6kj6k3L9m7j1
5628c5K8J0KK8p5J7K7J6j6k3N1p7N2M4l7j2L8o1L8n7L1J0K6Ol1ln9M9j4L4J3O0
5660H0l9m2J4k0J6M5p2P0j36J16m6L2j5M1pq8M0L8m1l5L4k3P3m6J4lk6pM1Qo1
5691d5O0j8Mk1J1J6JK8o0M3N3n4J6NM9p4l3k4K5O0r8L0M8JkJ9Pm7k0j1N6k0J3
5724A8l2o3L0K0O3n2J8l6J3L4OMJ1l8M2l4L7q0O5n7M1Mq5J18n5M4j31J03J1kK9
5755D6j16P3j7k2P8p5M8k5j9L3k7J1J3j7j6N6n6rL3K0j8mJ2K0n5L1QLK6k1j8O
5787BO5J4o2n8N3l7M7o9N2j4nm2J02m9Pn0O3j1m0K1l8K5LN9q3O6p5P3pK6j3p1
$$ plain form
5563 -20 13 39 20 0 18 -46 20 -20 11 4 -8 -8 15 13 -50 36 28 5 -29 8 34 -8 10 -67 0 -51 -8 5 -33 -16 -28 25
5595 25 -57 0 -2 0 -12 12 -13 -46 2 52 -40 1 22 30 -12 24 7 28 23 -43 -30 -1 28 32 15 -21 25 23 7 -16 23 -24 -35
5628 -35 -7 3 5 33 -42 -25 2 18 2 -21 30 -47 5 49 12 0 38 -23 15 -42 -11 -1 25 31 0 -3 -62 -13 -27 7 20 80
5660 80 41 -1 13 -7 9 54 -18 52 -84 32 -14 18 3 44 37 -51 -11 27 -14 -49 -15 -38 35 -11 3 0 -26 -33 8 16 -45
5691 -45 15 -3 1 -20 -9 7 8 36 -24 19 72 18 34 39 88 14 -19 -43 -18 42 -56 -26 22 23 21 40 47 0 -20 -31 25 5 18
5724 18 -14 -77 -47 -27 36 -16 2 -34 -21 13 19 23 34 -4 38 4 41 -39 26 -31 10 14 -71 47 -8 36 -95 8 19 17 46
5755 46 -70 3 -14 -36 42 -33 15 -10 -29 4 -23 -12 1 -16 -32 24 -32 -41 -8 12 -6 -10 2 22 -33 -2 6 9 35 14 -4 2
5787 2 67 81 19 -39 14 -23 24 -45 7 -7 -12 -54 48 -1 6 -44 19 8 -32 -11 -49 -24 -21 38 -45 21 -54 19 12 38 25 -46
5819d6O4Ll9KrPL0k8K2k0Q7j07M3M4rn5N2mk8qK5j0pj2J5m1K7l2M7l7l5k6N8L3
5853F%j3k0L7n2j7N4K1pj4lj0Jk0M3kJ9l3k7N7K7k2m3J7J0Pk5J1Nj4On0R4o0R
5888hNk3L5Qm1k9M7K6n6j7Q4r3K9O1k4ML2m2J5K7m3PK4K5m2k4ML7k8j6QJ7N3r8
5922c6K2j7N5J5n0L5j0K8m4j8kO2n4J5Jo3L3j7M0mj2K7pK9j02Q5J8l3N0lj1qn3
5955b9P0l9j0K6l1J4pM2K2j5j3j6mj9j2L9J2j9k6N0l1M7p9K8ok8L5J0j8J1n5O9
5987A8qk9lN9J4j13N4N4m7K7n7K4rJ4M9n0Q6q6K8k8K8jJ4j8lmjm5O3m8J6J4m3
6020c1M4m3N2pkj6L9o0J7k2Q6m0l2J9%rM4l1m3Q1k5j1jl9N3p2%L8qK5k5JJ9M5
6054D6l7n8M2m7N9K6q0M9J2MQj2rL5k8k7M2k1j8k0M4MoL6n5K0m8J09m7n4OM5J8
$$ plain form
5819 -46 18 21 -18 -16 -25 -18 12 -16 6 -14 73 -34 9 53 44 -11 41 37 9 1 26 16 9 -3 12 -29 -2 -34 13 -24 -59 -85 -27 6
5853 6 6 -7 -27 10 -42 -59 -5 16 9 -5 -8 -18 -17 -37 6 4 23 -10 -37 20 47 25 -18 -1 9 16 -9 2 7 -7 -1 -51 43 -17 -8
5888 -8 -3 -26 9 17 -24 -53 -6 20 -36 -53 31 -62 -33 28 4 8 40 -2 13 40 -3 4 28 53 11 -13 -9 28 0 -16 -8 9 62 -36
5922 -36 -14 -31 24 39 -11 24 14 42 -2 -20 -22 40 -14 1 2 -61 -28 -45 -5 -9 -21 6 -1 28 -74 11 29 -4 46 43 32 24 -29
5955 -29 41 2 -8 18 -13 1 -6 36 58 43 30 14 10 -9 -21 18 30 11 -15 35 4 51 -28 0 -6 -34 1 11 -7 4 -51 18
5987 18 10 -19 -22 37 51 -62 -8 46 -1 26 -31 -7 -16 -2 47 -3 83 -3 25 -3 25 24 38 20 17 13 12 -33 30 -18 -2 12 -31
6020 -31 13 -30 22 15 13 -3 36 -24 -7 -29 57 17 -15 4 4 -5 39 8 -35 46 21 10 9 -30 23 -49 -49 -11 -19 6 -19 -18 1 46
6054 46 9 -49 -7 -54 5 31 -49 0 12 16 24 12 3 38 10 -17 25 4 -14 -34 10 14 8 44 -11 9 -39 70 23 -31 -25 20 38
6087C8o4N0RJ7o5J6o1j1Q6o7L6K8q9L5Q8r2O8Pl8K4oK3m2j9j4lM9M7l4k0J3K9
6119C8q9L0M2j6k1lP4k0Ol0M8n3J0K2k6n2K4lLPL2m2K4Qj7k0%M5l0K7j5m5K0L4
6153A2o3O2k9M0l6M3Lk6j1k1M0j1JPL0n6%M5p7Q0l0Nj8J1j2K7j4K3mn5Q8p0J0
6186fJ5l7N8n7J6M9p5j4M6J7n5L7km1M6M4p8M4k3M4J1p1RO4J2l5nJ2Ml4l0M0N5
6219F0Ln6J0J4j6K1l7J9k8m8O1k6L9r2Q7K3n9LJ9M1m5K2pJ5m7oK9L1L9k5m5mq
6252a3M4k6JlL5m3mL9k3L2J2j4K2o7P8l1m9qK8j0n7L1rK1O7k8j7qJj2k2K1L4k2
6286@m4L1k4K8PL6Nm3L7pK6q3M6l0K2pKJ3j8NO0j12N8KOo9M4Rj6J2K8n2KJ2JL1
6322A8j5m4L0Pm6N3k6M7m2J6j2N0k8L5m0K5n0jL7j2k9PM3K9m1%Pjo9J01m9rLJ8
$$ plain form
6087 38 -26 24 33 50 -15 1 -60 -71 15 -52 -16 12 -77 -42 46 -46 22 29 -9 15 9 32 -10 -29 -43 -46 3 50 16 -4 9 38
6119 38 -51 -21 21 5 -16 -19 55 35 41 11 59 6 16 38 12 -40 -16 -19 -16 -9 23 -19 5 13 -4 -24 -24 21 -9 18 3 -42 -22 12
6153 12 -51 11 -18 22 -14 29 32 6 -5 -26 14 3 4 11 41 -15 -15 30 -47 33 3 8 -10 1 -11 16 2 25 21 -34 54 -16 -6
6186 -6 9 -28 30 -27 -11 38 -37 -51 -5 12 -43 -6 -8 -49 -3 41 -37 7 -16 28 39 -32 -23 41 53 18 13 25 29 -5 -35 5 60
6219 60 63 7 17 31 15 36 -1 18 -10 -58 3 -23 16 -76 11 34 -25 -22 -3 38 -7 15 8 23 -24 -30 -1 30 69 44 -1 -5 -13
6252 -13 31 5 6 3 38 -5 -9 30 7 39 51 37 59 -8 70 39 -10 -18 10 0 -57 -26 -35 -14 53 25 8 0 1 -11 -33 -12 22 0
6286 0 -44 -13 -37 -9 -2 34 39 -4 33 26 52 -31 15 -15 7 0 2 15 -3 2 62 -50 8 10 16 -53 -9 0 -16 -4 24 -28 -26 -14 -13 18
6322 18 3 -41 -11 -4 -50 3 -23 24 -18 -2 -14 36 8 43 3 28 -22 -23 14 2 -27 -20 23 52 11 11 18 17 -52 49 0 -9 -6 12
6356A2jk3j0j6l4O4l2J1J7j3nM2o4N3M0l7P3q0qm2Q9j3l1L6qL5r3mK2j2M8O1q8
6389a1M3n4P8n4K4K0o5N5rrloK1J9p1P0m9j2lMn9R3n1k2J4L3M1J3j6l5MJ9k7O
6423AK7J2m4K8j5j9J4N4l8K0l2lJ9l2L8%p3M7n3N7L0l6l0M4Oj9l8K0l1L3L3o3
6455d3L9J9L0n1J2Pn2Q1p3J1RNL1j3l1L2JPj1nrk9O3k0K3k2j4K0lrq5R1M8o2L0
6490B7m6N6j5Olk8k6J2L1kk3l4M1J2Jj4L2qrl7J3M7l7N3m9kL6J0J6l9m1M7j2o
6524IMJ2l4mk7K1j3O6o3j4L7RL9p7j4M2K3j3k7L5l5qjJ5J0J5o5O4jQK9n4K9K3
6558D0m5l0N9m5J0N9lm1M3p1N8om3P6r1M8pn9LQ6n1oJ7N4n6k5M5Kk5rl9O0j1K9
6592B6m8M0J8Lj4k1K9j0l4K5m7J1M4m1M3m8K8j7l0O7j8l4K8m0J0j5K6k5P1l2k1
$$ plain form
6356 12 11 -12 -22 -38 -72 -8 -40 -29 -12 -25 -30 12 -52 1 41 4 77 -3 -11 -53 36 23 -8 28 20 55 -38 -42 -20 -32 16 77 -11
6389 -11 32 -22 56 2 26 46 -19 36 27 18 15 9 30 49 -22 48 -1 -13 -16 -12 -71 22 -29 -51 -37 -4 37 50 34 -1 3 22 -5 1
6423 1 28 40 -4 24 9 -10 4 58 20 40 8 5 24 -8 30 30 -43 4 -49 8 38 2 -28 16 22 3 -35 -15 -46 -13 20 -43
6455 -43 -4 15 45 -6 6 13 -39 42 -31 -20 -11 -6 25 12 -19 13 14 21 10 5 -4 -33 30 10 33 11 -3 17 14 5 -80 11 59 -3 27
6490 27 -19 37 22 28 25 -3 -29 -17 14 12 -11 -45 -4 8 9 -5 27 19 10 -27 -14 33 -4 49 0 -2 34 44 60 21 -20 27 15 9
6524 9 13 25 -9 -13 -40 -19 -32 34 -29 -43 -6 3 42 -35 -49 -7 16 3 -24 11 -24 -32 -33 -18 -8 7 -58 6 5 13 42 -12 17 40
6558 40 -5 -35 24 -21 -11 48 45 4 47 -24 34 28 -15 61 -30 18 11 -48 -45 41 -10 -16 1 55 -1 -26 19 21 -4 -13 -52 8 -3 26
6592 26 -22 18 36 39 25 4 33 23 -11 14 -33 -22 22 -19 24 -24 4 -13 -43 24 6 -28 0 -40 -30 -45 -19 -44 27 -5 -26
6623b6Kk7J1J3K2J4k3jQL6m1J3K3k5qP3l1j3K5l9k4K8j7lK5j9rLj1j1K5OO1q0
6657b0M2k9k9j8L4J5l9O9j2K8n2j6j3L2jm3OM4RpJ7K6q6M8qK4j1J8l6km1J8J1
6690b2nL1o6R8j7qN4l1m8J3jkk2QJ0k1J3O4n8j6L9%l1K4l8N4n2M4l0mK0lJ1l1
6724b3K7n2L6mK4k6QL5n1JO4p8K7l4K9m7N3kL8q2L5L%j4P7l8p4N7l0L9N6n2nm
6758gLJ0l0Q6m3j0n8L4JL0J4j5oJ5J6m3J5J3q3N2J7k1M4k1Mk3k4L5rL7o3o0O4
6791b6k0N9Mn0L6m0P7n1qL8mjkN3q4N9k7j6l7M0M4p1P9l0m0M3k6jJ7jk6L3k6L
6825b%j3J6L2m1j7om9J21l9k2n5L7L7l4M5j6mK5Ol7PQ0m9k6M7o4K4NL7k8K1j7
6858B1j9qN4l2Qn2pN1l0J6oO9j09O6m2MJ1J1J0l1J0m5M8M9j5p9K7L3o8M4LL6l9
$$ plain form
6623 -26 -24 -51 -40 -27 -5 9 -14 -15 -7 29 -12 1 24 -1 -9 64 33 20 45 6 -18 10 -7 -10 15 -4 -13 -10 -21 -32 -7 -1 60 -20
6657 -20 22 -7 -36 -54 -20 -5 -44 25 13 41 -11 -27 -40 -8 -9 -52 -46 -2 7 0 17 43 -43 5 -3 21 10 28 -8 -10 -51 -33 -22
6690 -22 -27 4 -62 36 19 11 65 34 -14 -1 -2 -4 -26 -18 -8 -29 -16 48 -10 -26 13 13 -18 6 -32 22 -30 14 -16 -20 0 -3 8 -23
6724 -23 4 -48 -12 -16 8 -18 -10 25 -26 -25 39 -39 -12 -46 -17 -64 -11 -13 25 -57 -22 -19 -19 -33 44 6 -68 -11 -41 -2 54 2 -3 -7
6758 -7 -4 6 -24 62 19 9 -49 -15 -14 16 30 15 9 24 40 -3 12 25 -58 -6 11 -10 34 13 17 -6 -30 5 -4 33 -30 -90 -26
6791 -26 -46 13 17 -33 3 -37 40 -11 -19 19 15 14 12 65 -19 40 13 -3 -40 0 44 -27 52 22 -18 25 -1 -2 15 14 -12 21 -5 -2
6825 -2 -2 -15 1 33 -8 -25 -31 -80 41 2 -20 -75 -38 -1 -35 10 -6 -10 15 21 -16 -9 71 22 -4 43 -21 3 8 45 17 38 21
6858 21 2 -6 48 16 24 -28 -35 16 -14 2 -4 65 -44 22 -20 -16 -5 6 16 -15 -5 -50 -2 47 32 -47 -20 13 -55 -11 -8 28 -11
6891a1m7O4l7K3Ql0M2l0N3k0l6Rk3Q1l8k2J8j2pN3j05P9k9O5m1m9K9r7N6P2m5
6922b7k7k4P1L6l4j0K7j6K5JK4l3j7k0K6j6nN3k6j5n7Q2p3P6m8K4k2NK0K8J2n6
6954a6L8nqk0J7n6QR0n6jJ9p9J17j4j24J34p7j5M0k3M8k8LN8n7L1L4m9m6L3N8
6985E4p9N7o4PP6p9JO1m4KM9M5l4j04%O2m9M8k1jL3rj7Mj4j2M1LlRm4M0lp4j7
7020g6N7J1LP3m9K4r9Q4L3k3l5jJ2l4K7m9J1J1PLj9l0O2k4M0n6N4l0j3P9p0Ol8
7053d9N9m3L4k6M2j3l0J7JqN9n4O7p4j4j3N5k6L8k0j5k3LJ7J2M1k1J2Om0L5k9
7085@M0k4j6J6j6J8l9Mj1L7k9J9j3L7n4O1l6m1N0m7L3lpO2n8M5k1MKJ8m5N3n1
7118a2rpNMJ9m1N0k7ORj2J9r1Q9m0M2JL4l9%m7K2L2J4No0L4k7pK9K0MK4m8J9k1
$$ plain form
6891 -11 -58 6 -31 -8 0 -30 12 -18 35 15 -21 -12 -35 46 8 -14 4 -8 -15 38 -67 12 -17 48 7 -42 -13 -110 -54 18 -27
6922 -27 -54 -78 -7 29 -5 -15 12 -4 21 22 46 13 -4 -24 2 -14 -19 34 8 -7 -64 18 -55 21 -27 -3 -25 -20 0 28 40 -16
6954 -16 22 17 9 -11 6 -50 -42 48 -8 -9 10 -69 48 34 -90 44 -33 -48 -8 -31 17 -11 -8 50 -7 24 58 9 -37 -4 54
6985 54 -25 32 -32 -25 51 -28 -27 34 -10 -8 41 86 52 -52 -52 10 -39 9 -12 -13 20 11 -6 -2 -16 -28 13 16 13 22 -22 18 15 -59 -76
7020 -76 -19 -8 -5 68 19 43 -56 28 61 38 3 2 14 -20 7 -42 -31 -20 -13 -10 -29 -59 3 -21 19 -37 17 -13 -26 53 -17 -11 -49
7053 -49 10 -33 1 -25 17 4 -26 -9 -8 -16 43 -11 56 -18 -32 -45 10 -16 22 2 -13 -36 -33 -16 -4 37 16 28 34 -6 29 0
7085 0 40 16 0 16 0 18 -21 -17 -28 9 -20 -1 -14 23 -31 30 -6 -47 3 -44 -11 -14 -21 41 -17 28 7 11 13 31 -14 39 -12
7118 -12 -21 -28 -23 -19 0 -41 9 -18 -12 -3 -15 4 -87 2 -38 4 5 39 0 0 -47 -25 7 21 26 -34 0 -27 -34 -5 15 19 43 -5 14 -7
7154gkN8l3Mj9L2k5j9M4Qo8J0M2q1M6L1n6R6r3K1j7j4N0l7K1k9L4k1oJ6j6O5m9
7187a4NJ5J0k3n4O4Mj1jj7M0J3p5J1O6m9K4J4k2jn5L5L4k5m7M4J3M8k2l0JK0k3
7220hnJ9k3O5m3qk6rO4j0l0K9l3J9m6M6n8P1N5n1j3mK5m1N9j9k1K8l6K6o8M4o
7253hkL4n3k4N5lk2N7k6m9L4jM4o6J9qK0M3rj6j4L8m5m4N4l2N7lkm3k6M7k4M0
7287B2j7opM0l6L8Kn3qJ6ORk9m7J28Mj04K9lK5j8OK0J9j0m9J5N1n5L2l8L4pL3
7321D2k5rJ8m8j9N4J9o6J7K8K1Pm3K0L4K3m3m4K3Roj1Lj1K3m9k3L6k8P4k2j0l0
7354c6L7K9Lop0J2N9q4J07r9M7l8lk6J20k6pM2l3j8J0m4J8L1k7M8p3J2j4oL4J1
7386A0Ln5R4m2k0RPn6M5j7NMNKK0m6L2lk4L4J1Mj0Lm9O3k3K5o6P6p7L9nK3k9k2
$$ plain form
7154 -7 -9 49 16 20 1 33 8 -11 33 41 -27 -17 25 -56 -10 21 -35 61 -32 -11 -28 -42 8 -29 -8 -37 -3 -24 -30 -14 -30 35 -14
7187 -14 -9 6 16 -7 -61 3 7 -4 -5 -22 18 31 -44 -33 33 -16 8 22 0 -1 -56 -21 13 -12 -59 -15 -2 46 24 -6 -5 15 -8
7220 -8 -13 6 -17 48 5 -3 -29 -38 26 16 -14 15 -18 1 -45 1 -57 14 69 18 5 1 26 -15 44 25 4 32 -4 22 -46 -2 -8
7253 -8 -10 24 -29 -53 2 -1 -23 34 8 -41 -7 -8 36 -30 -11 -19 1 44 35 19 5 43 -2 -46 8 -24 33 30 28 -15 -41 6 -18 22
7287 22 5 -1 -8 32 -4 34 36 -17 -25 -9 -3 6 -23 -70 58 62 -42 -13 -16 9 -9 -3 17 36 26 -23 -8 43 -12 20 -18 16 9 42
7321 42 17 8 26 -22 -41 13 32 -34 -17 11 32 39 -4 16 50 73 30 -14 9 18 12 1 4 -7 16 -33 -56 -20 -48 26 4 -6 -36
7354 -36 1 30 33 27 -43 -31 28 -56 51 -48 -1 -39 -42 -68 52 26 19 61 28 10 20 -24 -6 25 -2 46 -27 -15 -29 -35 -1 10
7386 10 13 -42 52 10 -10 -1 6 -50 -5 -22 -17 -13 -8 -6 14 -32 0 -3 -27 7 18 22 12 15 -34 29 6 31 -35 41 -36 3 -2 21 -8 -30
7422c0KK8Ok5K9oL8q8N1J0l1P4k3o0L8m1j4J11r0PK0m2N7o3M5Qj5L1J4j1J6j2
7454C4o2M2QK3Rj27O6K5j6K7kq9R5m4K0lQj9j0J2RJjOl2QkL5J8k9o2O7j6N0k5
7489B4J5o3O2rk1N2r0P3q6%O3Oj7k8j1N3k0j1RQq3L5O3n6M7jj1M0l8QNk7K6Lj2
7524HRl8Mj6KO4On6M0m9j3L8K5k5j4L2j7l3j2K2R9j05l0J7LM5j6l6L4m0K6O2j21
7557h5P3J3J4k0K8l6J2M0k2nl3J1K0J6n8j0P3l5M0Om1J8Pm1QklJ6J6l4M0n2lj3
7591d2L3k0l3O8j9Mm9R5j9K3l0Llo4O1l1K6NL4k3lj1OKM5m1Rl8N5kl9K1RK6o0
7626bJ2l0M8j9nk2L0k2j5j4J3K1j3j0K1k6NM9j2k1j9K7N5j3n5J3j5J7M7n3N3o4
7658a9N8l1J0L2l1j3m7O2p3J1L2K6j8K3m4M6N1o8nK2k9K8n2k8K2K7j1J8l3L8l6
$$ plain form
7422 -30 -28 0 6 -19 10 4 42 -46 5 15 -16 58 35 -25 13 -28 -42 69 -21 -14 6 -36 21 -42 3 11 -4 27 41 30 46 34
7454 34 -28 14 22 45 54 -73 -7 18 2 29 27 -62 33 -11 9 6 14 -5 -15 -3 6 7 6 12 -20 -12 -14 21 39 10 -52 15 -1 49 24
7489 24 39 -24 38 29 8 60 -30 43 -43 -43 20 26 9 -19 -30 23 3 -8 1 9 -74 -39 24 -32 15 14 3 43 5 13 18 -9 17 20 8
7524 8 17 -21 -17 -33 -31 33 39 -17 23 -26 -39 -1 24 -1 -15 17 0 -33 -45 -23 76 -29 -59 -42 -39 6 -10 -46 -12 -52 -26 36 -85
7557 -85 -12 1 15 -5 23 -13 -1 39 17 12 -21 -10 10 26 -32 -42 31 -4 36 42 1 19 26 -15 -7 -9 -12 4 20 -14 26 -26 -29 -42
7591 -42 -9 -29 -62 6 -13 -9 -58 37 18 41 11 14 11 -53 8 -23 3 8 42 19 16 5 11 13 58 17 26 -12 43 41 2 23 32 58 -2
7626 -2 10 -20 28 9 4 -18 12 -10 -25 -39 -26 -5 -18 -28 -7 -33 -28 21 9 -12 -31 -4 51 38 -17 -4 -19 -2 45 -8 45 -19
7658 -19 39 8 18 50 19 6 -41 21 -52 -41 -9 17 -1 22 -22 24 75 7 2 24 -5 23 -29 -57 -35 -8 -19 -1 -34 4 -32
7689c2N2Mk3k8N1jn3Q1l1l8j5J6J5J6k4M2l0J3l0oM5rJ6J0p0L1jlJ2l0O6No0k8
7723c7J9j2J6K5j2Lk7L5j4j1MpN4m8JM8k0k4l4O7k8j1j8K1N7%k9j1mJ6L6q7K1
7756a1N4n2j0l0O9q4J00m0L4l1l9L1j0K8j8j5k1O2o8M8J3L3j4k5M5q8M1J1K0k7
7786Fj3K7K0K2n3J9k1M6q5N2L4l7Kjn3P0j8L3r1R4k9k7k7Jkj6M6o3Q4Jk3kK0k2
7820fMK1jl2J6pKJK1J0J4oJ4ol8M4q9O1J4m2l1L4J2m2N8qm8K9M6p1oJ8L8qm3N6
7856B9Ol9mL7o6L1k6N1pm6LJM7OK6m1o8N7L4l7MPJ1OoL0j02N5j0L2j4Rml8pM%
7893b9K4J1j1K4l0l0O1p3R2j1Pq5R4m3k8Pj0L0J6o9L8N7l1j2n1L9j5O8n5K4k0
7924a1J8j3K0k0K8l7K7P7p7J3jn9J5L9j2J8n8j0K2K8pk7K4M9j04J6j0M9l2M6M6
$$ plain form
7689 -32 20 24 1 -27 24 23 -30 51 20 -18 -33 -17 -2 14 -10 32 2 15 -15 -21 24 15 31 41 -29 2 1 -2 10 -20 46 51 -9 -37
7723 -37 -18 -30 -14 11 -1 2 -25 10 -4 -15 -11 -18 36 -12 -11 37 17 -7 -41 26 -2 -13 -31 -10 47 47 18 7 3 19 55 -32 -11
7756 -11 43 -9 -19 -49 20 -64 36 -4 30 -1 -40 -9 -19 9 -9 -24 -45 17 -51 -3 10 43 29 4 49 -39 2 13 33 6
7786 6 -7 20 40 62 9 28 7 53 -32 20 54 17 19 18 -35 35 17 50 -41 53 24 -3 -30 -29 -31 -47 -1 -64 20 21 -2 -4 16 -6
7820 -6 -2 19 18 -14 2 -5 -3 -2 19 29 43 37 51 45 7 51 -38 23 37 -5 -36 -2 10 -32 26 18 -30 -1 45 -26 -32 -14 24 16 -27 29
7856 29 35 -4 -8 29 -37 -6 -32 19 12 -34 -31 -30 17 23 49 8 -60 -3 31 -6 -2 5 16 22 16 46 -56 -1 -11 21 7 16 12 -26 -33 -29 -29
7893 -29 -5 6 -5 19 -11 -41 20 -53 39 28 35 -50 44 1 -27 -20 -30 0 16 -53 -15 42 11 -1 -52 -13 -28 40 -15 9 -11
7924 -11 7 -6 14 -6 22 -15 12 89 12 25 24 -35 -20 19 7 25 -33 -43 -21 7 0 -27 -3 46 -58 -42 -52 -3 -35 11 57
7955E7l8k3J2J1j3L7o1L4j2l8L2l6Q3K3j23J3J01m8k2ONkKj8LJN0j7m3K3J3MM4
7988F0r6Jl3QL3J2LK4r7P0J2nK9l9K7m9mO0pK0l1J9l4l1O2K0m2m4N0Rm1jM5mj6
8023a0l6O5Ml7L7n7L2j8J2j7K4K4o4K1J2M7r2K7O2pjMJ7m3k9M1Rm6m5O6L9q4L1
8056a2k6Q7m1J7m5L1ok5M3m1l1KM1l2J05k1j9pj6KMrL3Oj00N6m0P2o1M9OKJ4l2
8090FJ8j7MlJ1K6oj3l9K6j8k0PK1j8Rk5L1qp4Q8m0K4oJK5l4Rj3L4K3Kl4k6N4l3
8126hOk3K1nJ7K2m5K0Mk5N6m9L9p3L1M5L2j21Q7k0m8N7r4Q0m0L5l6K0l1M6N7p1
8158a4L0n4N9K3m0m5M5M1q6O2Oj0k7k0J3N3Ko8L8jKOJ1r0O3J3M1m3Ql3m9O8K0
$$ plain form
7955 57 19 -4 8 19 6 43 -18 16 4 -34 -2 -38 45 68 -55 -42 59 11 -11 -5 0 -2 0 -18 -15 -14 36 19 -24 -1 12 16 60
7988 60 -36 -35 -68 -60 -27 -15 -12 12 -85 -15 -3 -8 21 -18 9 -40 -44 16 9 29 -2 17 -17 -48 14 34 -8 -52 -2 7 -34 -35 10 6 -10
8023 -10 -46 19 23 -14 23 -34 -2 -20 -8 -25 -1 23 -41 -20 -8 39 -53 -26 36 29 28 32 49 6 -23 18 27 -19 -64 2 41 -43 -12
8056 -12 -38 49 8 25 -20 11 5 -20 23 -18 -49 -47 -6 -38 67 46 27 20 4 6 10 1 34 40 -60 -4 -44 28 -33 16 22 24 38 6
8090 6 24 7 11 8 19 45 39 26 -13 13 -5 -25 -18 3 -15 -6 -31 0 -8 -82 6 -34 -10 -16 -15 10 -24 -15 -28 6 29 31 -3 -29 25 -8
8126 -8 -2 -25 -4 -9 8 30 -15 5 9 -16 40 -9 30 -43 -12 33 65 -56 31 11 -37 20 -74 6 -34 1 -35 -15 -46 0 57 -14
8158 -14 16 -38 21 44 4 -41 4 45 -41 21 27 17 -10 -30 -17 36 38 -30 8 7 9 15 26 -64 -1 12 53 10 18 -15 -64 4 24
8191B4
$$ Imaginary data points
##PAGE= N=2
##DATA TABLE= (X++(I..I)), XYDATA
0@%%%%%%%%%%%Qj6J6j6J6k4L2l2M0n0N8p2Q8j04J20j37J55j79K10k42K74l08L49
34A86l97M46m97N56o26O99p74Q62r59J064j178J300j435J583j744J921k118K333
52A222k570K834l129L462l841M276m779N367o069O926p998R380j1240J3899j8010
67a0270K5264m1729J42916k1807l22589K21370J99232k15521j38616K35021K5915
78I9186j92386M0939J45990j17704o3536J54198k783j75534P9122J61214j27436
89A270j31502J72318Q6712j86600m6815J81724J220j53993L2449J15693o5935
100F541p6338Q0234M0996q3321p544P5395j5805o2484L4164N0720l6913l5721
112c0076L4471K0221k8970p593K3007k705j8129O596P224j4461L848K5057j3910
$$ plain form
0 0 0 0 0 0 0 0 0 0 0 0 0 8 -8 8 -8 8 -16 16 -16 24 -26 32 -40 48 -56 64 -73 82 -97 113 -129 145 -163 186
34 186 -211 235 -262 294 -332 367 -407 455 -504 560 -618 682 -753 830 -914 1007 -1111 1222
52 1222 -1348 1486 -1643 1819 -2022 2254 -2525 2842 -3227 3699 -4299 5081 -6159 7740 -10270
67 -10270 14994 -26735 116181 94374 -228215 -6845 192387 -23134 -161750 73271 99186
78 99186 -93200 -52261 93729 -23975 -87511 66687 63904 -111630 -32508 128706 1270
89 1270 -130232 42086 128798 -57802 -104617 77107 78327 -75666 -43217 72476 6541
100 6541 -69797 10437 51433 -31888 -39432 35963 20158 -42326 -8162 42558 5645 -30076
112 -30076 4395 24616 -4354 -11947 11060 8355 -9774 -3178 4046 -10415 -6567 18490 4580
125D580l7609K1656M8728k6388n3026L4894N6037m1790n5620M5616N2384m3333
137F129m4615L4905L1192k5946j9625J3680J1142J377p502k0186N636L8898l357
150B1728n0695M174N5534p843n4028J4259M9372j8188m1581J7451K9302j3954
162E531j4890R463K156n341M591q23o648Q678O387j5472n685J7201L207j3641
176e286K675Q834r465m805J4806K806j5499k60J4655j834j4606O55J5226L962
190A1864j6063j2134J4045J8213j3252k1855J4651K4089j7515k5536K0038K7610
202B4155j7400k5130J2771K0069o798j3848N34R012O296p998j6781O015K5854
215A6751m588l2625L580L4777m785l3316R120L2735j0597k9875J0448K5328p643
$$ plain form
125 4580 -33029 -11373 37355 10967 -42059 -7165 48872 7082 -48538 -2922 49462 6129
137 6129 -38486 -3581 27611 1665 -17960 -4280 6862 8239 737 -19449 -13813 25085 21728
150 21728 -28967 -24793 30741 22898 -31130 -16871 32501 14313 -27268 -9817 19485 5531
162 5531 -9359 104 2260 -3081 1510 687 -5961 2717 9104 -6368 -12053 5148 8355 -5286
176 -5286 -2611 6223 -3242 -8047 6759 9565 -5934 -6194 8461 6627 -7979 -7324 7902 11864
190 11864 -4199 -16333 -2288 15925 2673 -19182 -4531 19558 2043 -23493 -3455 24155
202 24155 6755 -18375 -5604 14465 7667 -6181 -5647 3365 9661 1663 -15118 -9103 16751
215 16751 12163 -20462 -16882 17895 13110 -20206 -11086 21649 11052 -18823 -8375 16953 9310
228I310j7659N123R053m583m346J623M27J794K004p007n448J0363Q222j0608o588
243h320J1866M133j3022J73J6080k566j7035M557J4986r183j3538J3615J1452
256A3198j8401j1204J9088Q695j7396l703J5912m66j2912L925R226l432j283K859
270D106q071k279J5669r0k1436M064K3853j1412k6526J7176K7037k0222k3821
283b1952K1231J7446k0164q951J9596K886j5488J415Q496m836K57P266q389q997
297a0184J3021O582j6804k298J9665k438k1263N492K0477o775j5708R156J0759
310I682j1127o816J2218M491j0553k543P209q35n236L051M246l925l662K489J639
325C28j359J294J998k839k296L313J664l241J069N015l358p942M270R289m721
$$ plain form
228 9310 -8349 -3226 5827 1244 -3102 -1479 -1052 742 2746 -4261 -9709 654 8876 -1732 -8320
243 -8320 3546 7679 -5343 -5170 10910 8344 -8691 -4134 10852 1669 -11869 1746 13198
256 13198 -5203 -16407 2681 11376 -6020 -9723 6189 5723 -7189 -3264 5962 2530 1247 4106
270 4106 -3965 -6244 9425 9335 -12101 -8037 15816 4404 -22122 -4946 22091 1869 -21952
283 -21952 -721 16725 -3439 -12390 7206 10092 -5396 -3981 4515 -321 -64 7202 -1187 -10184
297 -10184 2837 9419 -7385 -9683 9982 7544 -13719 -8227 12250 5475 -10233 -1077 9682
310 9682 -1445 -8261 3957 8448 -2105 -4648 2561 1726 -3510 -459 3787 -138 -3800 -1311 328
325 328 -1031 263 2261 -578 -2874 439 2103 -1138 -69 4946 1588 -6354 -2084 7205 2484
340B484r047N884P232q581o547J0504O330j0208n143Q316K761o545L33N854j316
355B311m288N30J338O37K182o55m842J92M907j231m294L007M428m420n317L851
371a664N868k026m801J031M055j286m531J895O564j516q077O00P809j244o609
386c932L393N350n875m786O507L201n306J95M085m355k899P208J526p787J901
401a574P368o487p128J0335O289j2112l568J2022j268j1779O044J1219r228r193
415i060J0546M707j0903P10J1524m985j0722P294P740q593k550R723k337j0191
429g097N648Q226p873m118R962q72j2036M549J2124o753r715Q907N767j0783k265
444f329J1757J68j0088J859O413m210k605O214k05o356K081M225m764j601P365
$$ plain form
340 2484 -6563 -679 6553 -2028 -8575 1929 8259 -1949 -7092 1224 3985 -2560 -2227 3627 2311
355 2311 -1977 -1447 -109 528 2710 2055 -2787 -2595 2312 1081 -3213 -206 4222 -198 -5515 -1664
371 -1664 4204 2178 -2623 -1592 2463 1177 -3354 -1459 5105 3589 -4488 -3888 3921 2677 -3932
386 -3932 -539 4811 -1064 -5850 657 3858 -1448 -1253 2832 -1523 -4422 2786 4312 -3475 -1574
401 -1574 5794 -693 -7821 2514 8803 -3309 -6877 5145 3877 -7902 -1858 9361 133 -9060
415 -9060 1486 6193 -4710 -4000 7524 2539 -8183 -889 6851 -1742 -4292 5431 3094 -7097
429 -7097 -1449 6777 -1096 -5214 4748 3876 -8160 -3611 8513 1760 -7955 952 6719 -4064 -6329
444 -6329 5428 5596 -4492 -2633 3780 -430 -3035 3179 2974 -3382 -1301 2924 -1840 -3441 3924
459C924j45q722R98P833k053n461L876L913m994k974M368K207k379l79M87j605
475a106k54K105J05j189N33m7k001J36K615Q25j398j037J31M67M53K35M68K37
493A278j260j582Q08J751k13p66K19j038j487J663K267j310j465J419l7k093J425
510d21L001j206k339J009M31j709J217K622k078k630J876P06k433J322L623k364
526F27m021K432L020k472o68L418r29l907J420L058j789q96K628j250l697J764
542a262L600j937j954K515j07l414R91L998q64k779R45J097j880k1K653Q8k110
559d41m46O67k72K40J258K3j529q98O91J006J80JN4n54j140J42J826O98j392n66
579d52P19p52q01J807J586j837j703J116M50r89J166J585j905k030J587J228j378
$$ plain form
459 3924 3779 -4943 -3945 3888 1835 -3626 250 4163 -831 -3805 563 2770 391 12 499 -1106
475 -1106 -1360 745 850 -339 194 147 -1854 -1718 897 1722 324 -713 -582 -115 338 573 1041 1278
493 1278 18 -1564 -756 995 782 16 235 -803 -2290 -627 1640 330 -1135 284 247 -1846 -421
510 -421 2580 1374 -965 44 475 -1234 -17 2605 527 -2103 -227 479 -1954 -632 2991 627
526 627 -3394 -962 2058 -414 -1082 2336 1407 -2500 -1080 1978 189 -707 1921 671 -3026 -1262
542 -1262 2338 401 -1553 962 855 -2559 -1568 2430 1566 -1213 -268 829 -1051 -1072 1581 1669 -441
559 -441 -887 -220 -492 -252 1006 1029 -500 -1398 -707 299 479 480 534 -20 -1160 -1018 808 1506 114 -452
579 -452 267 -485 -1286 521 2107 270 -1433 -317 133 -856 310 1895 -10 -2040 -453 775 -603
596f03O71J749j608k362J700J746j300P8J581j714k169K129J818j620m31J442
612A107j540j928K365J837k049o34J663j313j770K627J896k289q30J662j118j481
628a795K868J604l242j042K679r59k424K785K553l658k277L236P65k657J500K752
644B688k835k522L154J248k846J141K977l085l365L506K859l487j093L329j000
659F69l752K026L576k035k117K256J19k788J252L631j527l038J585J456k323j22
675a132L273m41l568L31K458j081r93K194M88l078m66K717K48j454J037Q63k195
692g99r40K441R26j641r4R53j470j140J984J375j456j108Q48k33p09J160J299
709A396j077j012M60J02k89J078R76j246j444M54Q78m6M6L14n78r48K9O81N74
$$ plain form
596 -603 68 1817 209 -2153 -453 1293 -7 71 1652 -62 -2231 -102 1716 96 -335 1107
612 1107 -433 -2361 4 1841 -208 -842 821 -492 -2262 365 2261 -28 -858 804 -314 -1795
628 -1795 1073 2677 -565 -1607 1072 113 -2311 474 3027 -631 -2908 328 1093 -1564 -64 2688
644 2688 -147 -2669 485 1733 -1113 28 3005 -80 -3445 61 2920 -567 -1660 1669 669
659 669 -3083 -1057 2519 484 -1633 623 742 -2046 -794 2837 1310 -1728 -143 1313 -1010 -1132
675 -1132 2141 1700 -1868 -1537 921 -160 -1153 1041 1529 -1549 -2015 702 950 -504 533 1396 -799
692 -799 -1739 702 1628 -13 -107 846 -624 -1764 220 1595 139 -969 -121 -354 -1063 97 1396
709 1396 319 -693 -233 -131 -420 658 1634 388 -1056 -602 276 230 276 590 12 -936 -907 -226 348
728C48K94l09q86m14N79Q53L70j81n32m78L1K66K82N83J45j192j049O44J074l4
748C94l43K7n14n89N32J010j0j16n9p39n59J151J192n78r97R3j2m74M11R61j02
769F79j041n34J08M89O71K96n04o63M0J35M37O33J60o08p23j35L56P21L50m75
789C92r02k82M89Q0K35O02k32j009l80O54Q00K99j22o32o41L21P53J41j30N7m69
810B4q07q3R96O51k81r16o36M96O63k2q1O35k14j403Q8J620L12p97m0kj123K14
832g06J773j81j604M34P18j476m79K606N58k626l47K024n59j303J999J266k570
849d73j083K274J95j906J303J763k426k163K646J409k281j41K198j194k460J775
865e64K472j553j379J701p3j999R56K393j137j730R49M84j632M08K278o66k354
$$ plain form
728 348 642 333 -553 -967 -388 465 835 654 122 -356 -325 -59 223 806 951 -241 -1290 -646 428 394
748 394 51 78 -436 -1025 -493 517 507 391 332 -407 -966 185 1377 799 -198 -105 -117 -591 -180 781 679
769 679 -362 -896 -788 -299 372 668 164 -499 -459 -324 113 746 906 298 -425 -560 -204 517 867 392
789 392 -510 -792 -303 -223 12 614 382 -627 -1007 -353 447 746 624 -8 -649 -328 425 566 436 493 24
810 24 -783 -866 130 781 500 -416 -1052 -556 107 85 4 639 425 -978 -890 730 1042 245 205 203 -920 -706
832 -706 1067 886 -718 -284 434 -1042 -1521 1085 1643 -983 -1330 694 135 -1168 831 2097 -473
849 -473 -1556 718 913 -993 310 2073 -353 -2516 130 1539 -742 -883 1315 121 -2339 -564
865 -564 1908 355 -1024 677 604 -1395 -439 1954 817 -913 36 520 -1112 -704 1574 908 -1446
882a446M76J419o59n66J512L43j752m73J214N25k56L56k59r99j5R35J02m22L01
901C36J6j150m40J321Q14o97n65M4j60J20O80L89m78j85J9m94MJ142M82j221q92
922i15O78L40m99M17Q33q34j171N19Q89k49J31P80q75j332J019J524p99r08J231
941G79o3k007K22K329j89j964M17R05j307k72K050J89j964R3J422r53o19K056
959A124O71k581o34K280L0j790J015J512j868j648J711J249j321j16J155j063
975b74j365J599J472j320q12J452k74j745P96K121o47j840M70P51q14M5J212k97
993E30j314L7P90m16M8J188j47j585k3J400Q4n89L67K41r16l94O86N73j65k09
1013A86l26o09J14Q34J77l25o0k09m35K63Q59K11l88k96k29j49M79N95k99m64
$$ plain form
882 -1446 -970 449 -210 -776 736 1079 -673 -1146 68 593 337 693 434 -565 -580 355 457 35 336
901 336 352 -798 -1238 83 897 200 -365 -321 -481 -361 319 708 230 45 64 -430 -426 716 1198 -23 -915
922 -915 -237 103 -396 21 854 20 -1151 -632 257 8 139 919 44 -1288 -269 1255 456 -452 779
941 779 716 -1291 -1069 1260 1071 -893 -476 429 -878 -1150 900 1089 -875 -782 640 -313 -932 1124
959 1124 1795 -786 -1420 860 890 -900 115 1627 -241 -1889 -178 1071 -250 -366 789 -274
975 -274 -1639 -40 1432 112 -700 752 478 -1267 -471 1650 1003 -837 -367 384 -430 -385 827 530
993 530 -784 -747 43 -373 -325 863 716 -869 -892 508 592 3 370 611 -305 -699 -13 560 395 186
1013 186 -140 -749 -635 199 376 51 -9 -218 -653 -390 469 680 292 -4 -233 -382 97 692 393 -71
1033g1R6l69m49O53J185p20j219L41P39m92J8J102j47j256n1R48q2j59P96k03
1053F60j536O9J476j60j013N90N91j395o89J590Q57j089m75O26k46m96R79O96
1071A035p83o59N35j19n20O89Q65p32j264L51P89j00j82K42L1o34l24O33O73q
1091E18k84k56k01m2L64O41j95p05o1J51l19N1R08J50j277n60J043M77n91K34
1111D6N76o26q89P19Q62k51k18J17m28n54N50Q36m01o37J63l4m46K39R88q1r50
1132d19j81M34K08L3K90J58m93m52J32M35M05q3m37l41p5O6L39M10k39n87j39
1153e36K84J01J97O13k37r00o3Q25J00l32L54J50r55m66R83N40o74k51L75l91
1173b83o08P04R12n09o78L94Q3m89M71J005m95j063K27O49m09j01Q54j26j216
$$ plain form
1033 -71 25 -344 -793 -140 1045 325 -894 -553 186 -306 -288 814 667 -589 -640 308 226 67 863 660
1053 660 -876 -807 669 509 -504 86 677 -718 -1407 183 1040 -49 -524 102 -144 -640 339 1035
1071 1035 252 -407 128 9 -511 178 1043 311 -953 -602 187 87 -95 147 178 -456 -780 -147 526 518
1091 518 234 -22 -223 -265 99 740 545 -160 -221 -70 -389 -338 570 720 -557 -1117 -74 403 -188 46
1111 46 622 -4 -893 -174 688 437 219 336 -92 -646 -96 740 339 -298 -135 -169 -615 -376 612 531 -419
1132 -419 -600 -166 42 75 365 523 30 -422 -290 145 550 467 30 -311 -386 -320 19 429 190 -397 -536
1153 -536 -252 -151 46 659 422 -478 -541 284 384 52 406 556 -399 -865 118 658 -16 -267 108 -283
1173 -283 -891 -187 725 216 -462 -68 15 -474 -3 1002 507 -556 -329 320 -89 -190 664 538 -678
1192f78j37R85P1m05L08J25p84j36Q11K95j94o5k5m97q6P25L41m14l38k5j61n1
1214c35L89M03k46m95k67K07L86L14n4k96p5j99JM43M71l25n26o7M9J36L74K32
1236E20m75m93J03K34q4L92L39m82q05M07O61j53n0K26j11p63J05P80J19l61P
1257A16r0o04Q3Q91J90p46j97L04j70k49P44M77p67o27N14M33m52L05N95n56q92
1278f98M88O69m11j06N77m10j090M55J116k79p11M53K58r52L6J231K10j038m9
1297b51N67m48k65R20L59j098m44O55P1m92M46O32q71o72O26N13j45l2K85k88
1317F8n11K86O18n4j92o0k38l04R9N52J81m40n37K09L37j49K7N51N8q88k95Q60
1339A78N05n26j67L19l54n27M28O77l71m37J80k40l70O34R36o96r30O83N89p92
$$ plain form
1192 -678 -815 170 241 -164 144 269 -515 -651 160 455 261 196 171 -326 -412 313 654 240 -98 -123 -284 -335
1214 -335 54 457 211 -284 -551 -344 42 356 302 6 -69 -268 -267 176 647 322 -204 -271 -222 -86 288 520
1236 520 45 -448 -345 -111 -195 197 536 54 -751 -344 317 164 114 340 229 -534 -429 351 470 109 116
1257 116 26 -578 -495 396 586 -160 -357 -53 -223 -472 272 749 -18 -645 -131 302 -150 155 750 194 -698
1278 -698 -210 459 48 -58 519 109 -981 -526 590 311 -400 53 311 -641 -605 626 836 -202 -251
1297 -251 316 -132 -397 523 882 -216 -660 -5 66 -426 20 652 -219 -891 -265 248 103 71 356 68
1317 68 -443 -157 461 407 215 155 -83 -387 -288 264 445 5 -532 -323 14 -135 -108 443 501 -387 -682 178
1339 178 683 157 -10 309 -45 -572 -144 533 162 -275 -95 -335 -705 -71 865 169 -761 -78 511 -281
1359b81q8J320q4j506j29J234O4q12L50M73q84n58R05M69n96R3M56p25n16J010
1379A95P64r00m96O97o5q36N13J072n66j026L27N22m20R5O33k33p92J23N15j27
1399eM6N21l31q40J96P11m7k99K94j43n00K7N53J15j19k1l80k34N41L24l62j00
1421e3L03m10m75M68O73k44m28J10q6k42M73N64m09m83J81J31k96K51M95l35o80
1442d92J76K72p9J45L46l25o27K84N29j76l3L72r3o79n2P29K91l78k91j61j3J33
1464a22J82m7m4N9k57l45M13O39j7n42p2J77o3M6L59R9m17l17M9L9K48K65l25
1487Gm68Q3L87j12nM99k7p97%P28P0m08K90J98o64m50P70M56n59k55K91l56k78
1510f00P28M67o97l12N61q0n79O16Q31o79q80M69N55n75L8O88l05r72K64P42k96
$$ plain form
1359 -281 -369 951 867 -639 -768 466 530 -282 68 541 -343 -901 4 473 -123 -30 426 -299 -815 195
1379 195 959 59 -437 260 195 -641 -128 944 378 -648 -321 201 -219 -124 509 276 -516 -393 122 -5
1399 -5 41 562 231 -609 -413 298 251 -48 246 103 -397 -370 183 298 179 158 -222 -456 85 409 47 -53
1421 -53 250 -160 -635 -167 506 262 -166 -56 -142 -384 89 653 244 -239 -58 73 -223 28 523 188 -492
1442 -492 -316 -44 -123 22 368 43 -584 -300 229 53 20 392 299 -380 -432 297 588 210 -81 -242 -255 -122
1464 -122 60 13 -31 28 -229 -574 -161 478 461 -81 -153 24 -39 7 366 465 48 -269 -220 -181 67 332 7
1487 7 -461 -378 9 -103 -108 391 364 -433 -433 295 365 -43 247 445 -219 -669 101 557 -2 -257 34 -322 -600
1510 -600 128 595 -102 -414 147 67 -512 104 935 256 -624 -155 400 -175 -137 551 246 -726 -462 280 -16
1531a6k42O36j11r96J66J179p7q69K88M72n74m62Q73L75o77k07K37k37j06O06
1551B58K16o89j97L82m5k13N14L70p06m55N44K99k48P6L01m04m93K80M47rj61
1572F7Rk93j28L11J00J6J31o6n46k6O76J70m70J5K97m06k54O33L43n82j79K14
1594C2k79j78O71K75p60j81O09l60l74Q40M44r93m89J036J65q97M72Q61r21r56
1614i83R70P25q85j57Q96m85j056P61Q75p49l06Q68k90j059P74J051p72p61Q93
1633C10J46j110L75J259n70j168N54O62r01r1J133j72j184K89Q08m24j43P49p9
1652D43r63K00P66l12k97O87k32j032L15R46l78o55O41J96r45KJ038K7p90K53
1672i0L64m89o4Q12n4n95O2J98m19J7Q25k89p54K00M73n35j30Q74M6r61k8Q17
$$ plain form
1531 -16 -258 378 267 -729 -563 616 539 -330 -42 430 -144 -606 267 642 -35 -242 -5 -242 -348 258
1551 258 474 -215 -412 -30 -75 -288 226 596 -110 -565 -21 278 30 106 407 3 -490 -210 237 228 67
1572 67 76 -217 -345 -34 66 82 213 147 -399 -425 251 421 -49 -34 263 -143 -397 236 579 -3 -182 32
1594 32 -247 -425 246 521 -239 -420 189 -171 -545 295 739 -254 -743 293 458 -439 33 894 -27 -983
1614 -983 -13 712 -173 -330 566 81 -975 -214 661 -88 -394 474 184 -875 -101 950 178 -583 310
1633 310 456 -654 -279 980 410 -758 -204 458 -443 -534 599 427 -757 -468 340 -84 -227 522 443
1652 443 -520 -320 446 134 -163 524 292 -740 -425 521 143 -512 129 325 -620 -618 420 447 -343 -90
1672 -90 274 -215 -279 533 479 -116 -54 144 -275 -258 567 278 -476 -276 197 -338 -468 406 452 -509 -537 280
1694B80j1l99M37J35n89j85M85N6j66J60o0o15oP44j66m04L02K65o70j09Q81K11
1716E76o91J4M54l85k41O13K44o04j89J96k25j02N42J21p31j42N86j14k95N90
1736B17L45p56l66P91J72m85K38M72o60n61O01M29m88j37L34l29m79N09N44l90
1756Ak14L64j12m11M73N54m44l91L24Ll99K89M83m26n70K38K29l07J95M52k89
1777D2m84J47L43K4P0K00k79l11K68J88j68J85J40m44m86M93L59l97j10L54k51
1798a17l21L50L74j26k45K45k17k52M37L74l66k84K88o5m32L52N90m96o23L05
1818b29L80l72kN72j37o25N9N35m3j60K43Q6n14o2N31k9k40O9J17m98j41N95K75
1841D10n72j89L90j51l42M14N08l57n24M33J69k10Q3M05k63m99J47K71j57LK67
$$ plain form
1694 280 269 -130 307 442 -147 -332 153 209 43 203 143 -472 -478 266 100 -304 -2 263 -407 -516 365 576
1716 576 -115 -101 353 -32 -273 340 584 -20 -209 -13 -238 -340 202 323 -408 -550 36 -78 -373 217
1736 217 562 -194 -560 231 403 -82 156 628 -32 -593 8 437 -51 -188 146 -183 -662 -153 391 1
1756 1 -213 151 39 -372 101 655 211 -180 144 147 -252 37 520 94 -476 -238 -9 -316 -121 331 42
1777 42 -442 -295 48 72 142 342 63 -248 20 208 40 225 365 -79 -565 -72 287 -110 -220 134 -117
1798 -117 -438 -88 286 160 -85 160 -57 -309 128 502 136 -148 140 75 -357 -5 585 89 -534 -229
1818 -229 151 -221 -223 349 212 -413 -354 181 138 -22 221 307 -207 -269 262 233 -7 62 179 -319 -460 135 410
1841 410 -162 -351 39 -112 -454 -40 468 111 -413 20 189 -21 62 467 204 -295 -148 123 -34 -31 236
1862B36j75n59J52N39j12k74K70L9m05j3N82J59l93mP9j84j17M41P3l64j67k1
1884b18p4J19K99m3k89k3R4o0J79L57j36k81l1K28oQ4J54k46l49Q2J21j33J25
1907d7K60l05l85K17L63l8j11K56n9m00P0N28L4l43P2K7l72O2L72l6l09o1R1k12
1931c26J22L83ol60J8K19j35J02L16o0l70K7J44p7l1L26j76m52P4K49p3k2K34
1954A26k0m85J48M72j37r3K81r2n92K23O80j85n57L46K17p30n4Q48j2p82J12N95
1976C09n51l73R63K49q84j89R01k80o15P26N26j022m32R92Q0j000N39P63p97q43
1996i38J011N95j021j37J067m17r58O81Q86p04n13P64J39r82K71J027n01q34N67
2015CL44q24O0J075l09j036L86P18n83l52R61O1r84RR50k85m86N43J89p04j77
$$ plain form
1862 236 61 -498 -346 193 81 -193 77 116 -289 -302 280 439 46 42 121 -63 -180 261 334 -30 -197 -218
1884 -218 -292 -173 126 83 -206 -229 -135 -195 -16 341 205 -76 -107 121 115 199 353 107 -242 -160 -39 -172 -47
1907 -47 213 -92 -477 -260 103 65 -46 210 151 -249 -179 349 383 40 112 139 -233 -171 201 165 -144 -205 -114 -326
1931 -326 -204 179 173 -187 -169 50 -85 17 333 273 -97 -70 74 -3 -34 292 116 -336 -262 -13 -86 -108 126
1954 126 106 -379 -231 241 104 11 292 200 -392 -169 511 326 -231 115 332 -398 -452 396 384 -398 -286 309
1976 309 -242 -615 348 597 -287 -476 425 145 -470 256 782 -240 -672 320 400 -600 -61 702 -95 -938
1996 -938 73 668 -353 -490 577 160 -798 -117 769 65 -448 316 455 -527 -256 771 270 -564 3
2015 3 347 -477 -417 658 349 -687 -301 417 -166 -518 443 504 -480 -471 479 194 -292 251 440 -264 -441
2036d41P12on38K06K70n10j54O59J25n38J02L43m37j55O05K06n56n1L50j75k85
2057b68M27K41m76j99K63m4j54K81J38l67j45L16L8j71K95J24m29r5L62R3k22
2078HJ01J03l24j97L32J21j93N8J5k53p9L93J05k16N9L2k26M4L74j6k09J1J7k82
2102b22J8M70n8l52QJ72k27K0M10n6m25M4K79j63K2L91p4n65J42M05k12j47M50
2125C30mp36J04O03j32m92M15K80p25q5P41N5n68J30M76n32l20P42J84o74J4N22
2147C28l90l65O43K95p91j63O75k23m83M98N85p52n12O88L99n90J0O35k61p25
2167d99L84M86k72k18K85j11m63K21N10k68k75L27l3m35J50N84j82m12J34K40
2187A53k90oM40O2m71j43K43K7p4Q4L0j80kk8J20J50P9j95k04J48J13m1K2J57
$$ plain form
2036 -441 271 265 -273 -67 203 -307 -461 198 323 -215 -113 230 -207 -362 243 449 -107 -158 192 17 -268
2057 -268 159 400 -76 -275 -12 -56 -210 71 209 -158 -303 13 51 -120 175 299 -130 -225 137 230 8
2078 8 109 212 -112 -309 23 144 -49 9 24 -229 -308 85 190 -26 33 65 -161 -117 257 241 32 43 60 -222
2102 -222 -204 266 208 -144 -136 36 -191 -171 239 183 -242 -198 81 -82 -60 331 257 -308 -166 239 27 -120 330
2125 330 326 -410 -306 297 165 -327 88 368 -357 -442 299 354 -214 -84 392 -140 -460 282 466 -208 -194 328
2147 328 -62 -427 216 511 -280 -443 232 9 -474 24 609 -143 -655 33 432 -158 -148 487 226 -499
2167 -499 -115 371 99 -119 166 55 -408 -187 323 55 -220 107 74 -361 -211 373 191 -221 -87 153
2187 153 -137 -143 297 359 -112 -255 -12 15 -59 25 55 -125 -127 -155 -35 115 194 -1 -205 -57 56 15 37 194
2211A94p2k97M3K42R4j83m9o9j7k3Q1J21K1m0k45mK72K04k12j53J81n0k11Q7L88
2236C03n4m54lJ68L5j5P2K0j32k34J33K14M5J9q5j68J7K08mpN5j1k60n8L06Q5
2262A95j83p8J30k16j25K70K72k23j91k1K01n4j1K09j00l6j67O7J30J09m4j70
2284c6q0R3O5j53P9K19j66l95J71L99p0j96K1J92j93j87K87K74k31k58J00jJ08
2307D2Qj1qj37j7l4J13J73L9k62j46L19Pj48L5K69j81l07J21L59n1k41K3Q4j55
2332a06j52K42J94j64j48k5K9J65O9k4m7Pp7q5J83K02j37k66J09P6n9MN2M0j27
2357d5j40J7J74J26k2k67J37O8r9m4K78J39l36k40K36K13k71K4J97j81k45J69
2379a12K38q4r3R9j56n9K32J40l09J54J43k52k57L92L12m30k50L46M0l97K22M31
$$ plain form
2211 194 122 -175 -132 110 204 21 -28 -97 -114 -137 -56 65 86 46 -199 -203 69 273 61 -92 89 39 -172 -85 303
2236 303 249 -205 -208 -40 -5 -20 52 72 -60 -294 -161 53 98 117 32 -136 -119 89 85 78 133 122 -138 -196 110 195
2262 195 12 -66 64 -152 -277 -7 265 42 -149 -170 31 -23 -34 175 75 39 -128 -61 69 178 134 -36
2284 -36 -116 -23 42 -111 -32 187 21 -374 -203 196 126 -70 -49 143 -50 -237 50 324 93 -165 -65 -66 42
2307 42 50 39 31 -106 -123 -157 -44 129 168 -94 -240 79 86 -62 -27 242 61 -246 -125 234 183 -58 -35 49 -106
2332 -106 -258 -16 178 14 -134 -159 -130 35 104 80 33 40 -37 -122 61 263 126 -140 -31 45 -14 -10 42 82 -45
2357 -45 -185 -168 6 132 110 -157 -20 48 -51 -95 183 322 -14 -254 -18 195 -76 -52 145 -36 -281 -112
2379 -112 126 42 -51 48 -108 -167 65 205 -104 50 193 -59 -316 76 388 -42 -292 54 94 -303 -81 350
2401C50k42m14K03K10j47j3K94q9l28N3K15r0M2K28k13k97J95K62k16j48K66j
2423A20l57j3M61j1k96%J67o9j77K40J75j19j92j0O9K6M9K1p8m1l2k8R3P2%j53
2449h3m0N0J18L3l4J4k5j50J0J78J23j14k08K9J17n2l6Q8J69k34k36K64J43o0
2473F4j18J72m3k58P4L49o8k23kQ6k07Q3K63o0k41O3K3j00PL27n3l89M7L54p2
2498G8k19K69J29l79j62L62O2j83L8R2j69j57J59K24j71%Q4j60p2K22J50k02R
2521DO9j85M4K01P8j76r8P1l8o7J47L1j47K1n9j1J03J64j18j86J35N4r7J5K85
2546B40r3k99P0J90n3j59K72n9l17k9L35j04q5K01Ll34K7L51j0k92K16J48l25
2569a06j14M38Q6m71rK74j91j38K99J83l33j69L34k7j96J45K90l21k76L08J96
$$ plain form
2401 350 108 -306 -103 107 -40 -53 241 152 -176 -123 92 2 44 272 59 -238 -43 219 3 -145 121 120
2423 120 -237 -250 211 200 -96 -96 71 2 -175 65 240 121 -71 -81 -12 14 63 84 6 -35 -67 -95 -2 70 70 -83
2449 -83 -123 -73 45 78 44 58 33 -117 -107 71 194 80 -128 -99 18 -34 -70 18 187 -47 -283 -19 124 64
2473 64 -54 118 75 -183 -109 240 172 -51 -53 33 -174 -91 172 112 -129 -66 -43 -143 -136 191 138 -251 -204 150 78
2498 78 -141 128 257 -122 -284 78 140 -43 -5 87 -82 -239 -80 144 -27 -27 57 -103 -175 47 197 -5 4
2521 4 73 -112 -68 133 211 35 -63 8 -30 -97 50 81 -66 -45 -104 -115 -12 152 34 -152 -17 37 -60 -45 240
2546 240 147 -152 -82 108 55 -104 168 109 -208 -237 98 -6 -91 110 113 -221 -194 157 147 -145 71 219 -106
2569 -106 -220 218 304 -167 -176 98 -93 -231 68 251 -82 -251 83 56 -140 5 295 -26 -302 6 202
2590B02l02O2L14j90l87K66L16k80j07K38o1l57J10L92j68k37J84J00k88J5M20
2611B42l7l00j2J74p0r9K32M6k36j49K01J3j23J42J02k13j43J64J44j03K5J41
2633A41j17j20J40J05m6r4k8j4k5J6J05j7j41L3k2O5l0K01j20j10l9R8R5n4Q7
2658A09j4r9p3O0P6L8m8n8q6j0P1N9M8r4n1Mj9J50K6k8m8o0NL3Q7O7r3o9p1LP0
2689a5J5R1j10j19KJ14P4j0O1j02n2lJ24qnN5j16j61M2K36l1j06PJ9j58O1J17
2716B2Q7j47j9M4k1K0J26R0j76n1J9Pl2J41l1q4j23J8J52K8l7k0r8K2K0J16Km4
2744C1k8m9RM6L7N3n2j18k7P6J9o4J14p9j05J8J41Oq9Q9P9j77m1J29J25n8k6L
2772F2p9q5J43J20j30j40N4M8j00R1J65r6k34J05J08n0J0J38m4j65n0K65r1l6
$$ plain form
2590 202 -100 -38 276 86 -301 -35 281 1 -106 132 71 -286 -176 216 48 -189 -5 95 -193 -178 242
2611 242 205 -95 -107 67 -3 -102 130 176 -60 -209 -8 5 -118 24 126 -87 -230 -66 78 -25 0 141
2633 141 24 -96 44 149 103 9 -19 -33 -58 -42 63 46 -95 -62 -84 -19 -49 152 32 -78 -117 -19 76 22 109
2658 109 95 -4 -77 -17 59 97 49 -9 -95 -105 -34 25 73 -21 -72 -68 -87 63 89 61 13 -47 -42 -9 78 145 52 -17 -88 -85 -15
2689 -15 0 91 -19 -138 -136 -22 52 42 103 1 -51 -54 70 62 57 112 -4 -165 -123 113 82 -24 -17 2 -156 -95 22
2716 22 109 -38 -57 -13 -34 -14 112 202 26 -25 -6 1 -31 110 79 -5 -128 -110 42 70 33 13 -85 -63 -43 73 75 31
2744 31 3 -46 -37 9 46 99 47 -71 -98 -22 -3 -67 47 -32 -137 -119 22 28 -61 28 107 -70 -111 18 143 85 59 62
2772 62 -17 -102 41 161 31 -109 -55 -7 -107 -16 149 53 -181 -76 32 -18 -8 130 86 -79 -129 136 45 9
2796IL3Qj50K9J01J05j49j4J0o5qR8J33r5j01N0L4n7P6J43j01j59j4J23Oj02J13
2823E6k7j26k1J39L5o8m8R6r9j5O8J78j05k8p3j5K0P5L2K3j50p2J21j3jP3J3r8
2851c0q5O3J51o9K1l5J3j06P2J41q3o0l1Qm3K5J58j09j06K3Q9n4J7J04mj54l4
2878a18J68J1j12J38Jj28n8J11Q2j11J3L8j78j5J35R1r1jM9j11k8J52R4j34J1
2903IPOn0P8O6j50Lm3k2M2M5Q2j18m1M9m1O5O7L2j20j18J65J4L6%m5j25J03l18
2932c22K32K3J37j29q9P9J62j25m1J44q4o2K2J24L7m2q5M8j11N7O0K9j00Nk5j21
2958a77N9L79n19J88O9j00J97p0L7K7k9j51J7J11J2M3p3J8j00k1Q8O0l2j38J02
2983cl1l5N9R7o4j01L7R3nm2J22l6k78O6J80q0j6J10p9j47K9J26O7r2K5J3j06
$$ plain form
2796 9 42 50 -100 -71 30 135 -14 -28 -18 -83 -91 7 140 45 -56 -6 28 -29 47 190 89 -70 -84 39 45 -57 56
2823 56 29 -97 -118 21 56 -12 -60 36 -63 -78 -10 168 63 35 -38 -53 -33 42 74 97 -53 -125 -4 -17 -18 55 68 -30
2851 -30 -115 -52 99 30 51 16 29 -77 -5 136 53 -7 -38 -30 -73 -48 110 1 -105 -82 7 -47 -30 74 70 -84 -118
2878 -118 50 61 -51 87 88 -40 -98 13 95 -16 -3 35 -143 -158 -23 68 -23 -24 25 -86 -114 38 132 -2 9
2903 9 16 22 -28 50 116 -34 -31 -74 -96 -54 -9 73 -45 -86 -37 -78 -13 54 86 -34 -152 13 27 63 63 18 -107 -4 -322
2932 -322 -90 -67 70 -59 -148 -69 93 -32 -73 71 -13 -75 -53 71 108 66 -19 29 -82 -25 35 64 -36 -31 -56 -177
2958 -177 -118 261 -258 -70 -1 -101 96 26 63 90 61 -90 -73 38 50 93 20 38 -62 -83 5 65 33 -105 -3
2983 -3 -34 -69 -10 87 23 -78 -41 52 47 5 127 91 -187 -121 59 -21 -37 73 -6 -153 -124 2 69 -23 2 15 -91
3010i1oJ28P7l9r0N3l7k5Q4L2p8j09Q3n5P3K5K2q3o2L9K5J14q3O5m3o2OJ35m0
3039E8n3J3j2n1l3J32m6qo3j2j4K7J22ok6l3j0l5Q2Q7k8j50M9Nkj7J46j02q5k4
3069h9J44m6j8J03O3m68L1L74l5l9J10o3j37%J54N1j46LO6j40kJ12J27l13jL73
3095B14l46J60n0K08j63j06QO9q7J51P8j23j72J09Q0m2l2R3n1j62J29J62q1p3
3119b7L2L6j87R5K35o5j46o0J10R3k00R4R8j15QK9m8r7J49nq9LL7M1p0J19nj40
3147g5l8J72N6o5j6M3Lj95O3J02j23l4J93k17J61p5J54p2k39J93m3L7K10Jj97
3172aq8J50l7O9r9j50M06m97L74r7p6j98L03J17l44j36J96N8J20j99L25k73J35
3195E8l4N4l26L68j2k03j4J50m6n3M0J4j01L3J02P4j34PN6o0l4J50N4k10m7J46
$$ plain form
3010 -91 -97 31 108 69 -21 32 -5 -30 54 86 8 -101 -18 -73 0 25 47 -36 -98 -59 -34 80 -3 62 19 -43 -37 98 58
3039 58 5 18 6 -45 -78 54 8 0 -63 -75 -89 -62 60 54 28 -5 -15 -50 32 119 91 -59 -10 -5 -7 -24 122 20 -65 -89
3069 -89 55 9 -9 94 157 -311 -280 94 59 20 130 67 -70 -70 84 135 -11 -8 58 -82 -84 28 155 -158 -159 214
3095 214 -132 28 -22 186 23 -83 -75 -6 -93 58 136 13 -159 -50 30 -12 -44 49 -2 -164 -35 127 46 -27
3119 -27 5 41 -146 -51 184 119 -27 -87 23 116 -84 10 108 -7 1 30 -18 -115 34 29 -60 -57 -20 21 -49 70 65 -75
3147 -75 -113 59 115 50 34 77 80 -115 -52 50 -73 -107 86 -131 30 -45 109 37 -202 -9 -52 -15 195 196 -1
3172 -1 -89 61 24 93 -6 -156 250 -247 127 30 -46 -244 59 176 -168 -304 -108 -50 70 -129 196 -77 58
3195 58 24 78 -248 120 108 -95 -109 41 -5 -58 -18 -4 -105 -72 30 104 -30 -23 33 -27 -61 89 143 -67 -114 32
3221C2J5j49J79q8m9q7J84op7M5N4r2j01J68J21r6q6J00p6j46J82P3m4j49J30
3246C7o2o3M1Q5m2j02J6O5j5M3J10j22q7M7L0K5l6J41o9j38M1Q5n7m7J31l9p4
3273e6JJ57o2L5k4q2l9K1J28m1k3kn8k2L6J24p3o3k2L7j7J9O7n3L7p3kM9oP9k
3304G0p4l6O5q5J01K7k2r3j02R9J08qn7Jr9Q7K5K3L6p3pk4K8jN3Loq8L9l2R2J
3336E1p9j9j4N2nJKL1r7L1RM1K9MPj37O6L0J8o2J17n7p9%K9Q2l9n8k7kL8R9n6
3369FK0K5n2o8Q6Q3j4j15j8M6n5j3Q3J6r7J6M0jKO7l6n6k7J14q3K0N7m3q8lJ21
3400C3j2n7P3p7n7M6M1M1r8P5k9o8N2J04K4q0l9Q7o0J6nO9m1j17N2nk6P4rj1j08
3431a12J07M4p3K7N6p9m6N1R8n2n5O2m7j1L7J5jq3L1k5PK2M4Ro2qJ4k0R0N0j08
$$ plain form
3221 32 47 -102 77 -11 -60 -147 37 31 -46 -1 53 -39 -140 28 149 53 -33 67 -9 -155 27 100 56 -93 37
3246 37 -25 -88 -47 38 -4 -106 -90 -25 -40 3 113 -9 -96 -49 -19 6 -30 111 42 -96 -55 30 -27 -74 57 18 -56
3273 -56 -55 102 40 75 51 -31 -70 -49 79 38 15 13 -45 -67 -31 93 20 -43 -65 -28 -45 -26 41 -12 25 -48 -50 -1 -7 72 70
3304 70 -4 -40 25 -60 41 68 46 -47 -149 -50 58 50 -7 -6 -105 -18 7 30 66 -7 -14 -38 -10 -11 42 45 39 -49 -10 -42 50 51
3336 51 -28 -47 -61 -9 -14 -13 -11 20 -77 -46 -37 4 33 37 44 -93 -27 3 21 -41 76 19 -60 -60 -31 51 12 -46 -73 -75 -37 62 6
3369 6 26 51 -1 -69 17 100 86 -29 -47 -1 -56 -69 14 30 -67 -51 -11 -12 -10 57 21 -35 -62 52 -31 -11 46 3 -85 -88 33
3400 33 21 -36 37 -40 -97 -51 -10 31 -67 8 -21 -89 -37 67 91 11 -28 59 -1 15 10 79 38 -79 -27 -32 -58 16 7 -4 -112
3431 -112 -5 39 -34 -7 49 -30 -76 -25 73 21 -34 28 -19 -30 7 22 21 -62 -31 -56 -49 -27 17 26 -36 -44 -30 -50 40 90 -18
3462a8n9K8Q0kJ9m2J0o8J8j7%O0lj8r2J46J2p4M0K0n2n2L2L8N9r5L0K3q7K0J15
3493G1q6M7m3o1l8P8N7ml9Mk8O0M6j4J2r5M0o8M4L3J8l2n1OnQJ8N0M1j30M6P0
3525E5p5j5R1p0n6%J65k4j11M0J9l4%P5k9k8o4N3p2P2Q2J1q2k2K2rM0jM2p9o2
3556f6M5Q2j45P2L7r1k4Q4K2n6j0M6po0J00J7n1ON6m8n6L9N8m0j02J13k6j08J01
3585a2O7m0r3M8O5q1M8J03r7q2J07jk9n8R7L8j72K7J44j10j4L5L1j25M4N9Q4j21
3613c8N0k1m4k2J62k7j35K8Q4q4k6R0Ok7n3K7M2o8N4N2p0k2J8L8m6J7O7n6p2J5
3643f1J11K6q8M5o2q9M8J22p7%K4j9j4RO6J6r1L8k0J2K0L3k1o9k4K3O5m7N0K7
3673E3j35K5P2O2j22M4mj6j4K8N9ok1K3p5j1J8K2L6r2M8n6M3M7M2n9o1K8N1m6
$$ plain form
3462 -18 -77 -49 31 29 48 6 16 -52 -34 -51 -51 9 6 -12 -104 42 54 -20 20 40 -12 -64 -32 6 65 -30 0 23 -64 -44 71
3493 71 -15 32 -11 -72 -110 -32 25 21 -18 -14 -42 18 64 50 62 -33 7 -61 -17 16 34 2 -49 -43 -48 -40 -22 28 69 -61 -15 55
3525 55 -20 -35 56 -14 -70 -70 95 71 -40 0 19 -15 -15 60 31 3 -61 -8 -80 -8 74 85 3 -19 3 -6 34 33 75 -4 -66
3556 -66 -21 61 -84 -12 25 -66 -90 -6 16 -40 -50 -4 -11 -71 29 46 -5 1 57 9 -47 -8 50 10 -92 21 -5 -113 -12
3585 -12 55 15 -78 -30 35 -46 2 105 8 -74 33 32 3 -55 42 80 -92 -65 79 -31 -45 -10 21 -104 -60 -1 83 -38
3613 -38 12 -9 -53 -75 87 60 -75 -47 37 -47 -73 17 23 -4 -57 -30 12 -56 -2 50 -20 -42 -24 14 -32 -15 52 -4 -76 -61
3643 -61 50 76 -12 33 -29 -118 -70 52 -25 -25 -1 -20 -34 -25 41 57 -34 4 -16 -4 16 49 28 -41 -65 -42 23 -24 26 53
3673 53 -82 -57 15 77 -45 -1 -5 -21 -35 -7 52 46 25 48 -27 -38 -20 2 38 -54 -6 -62 -19 28 70 11 -50 -22 29 -17
3703a7N0Ljk8l9Q%N4J5p8J2j5L2O7j8Rl7k8J7k0M4l8Lj3ML7L9k7K8j18lP6M9r2
3737b5N7k7K0j24J21m9j9K7k3nP3l1J7J0k0j8oK2k9N6L5j06JO2n5KO7M4r0N6n3
3768a0L5J5o0R1m6m7O0km1j3K8m3Nl8N7J4j1Rj9K2k7N1Mk0pLpm3Q0M3o1l1N5P
3802E3J4q2%K1p1N2K9Qo0J7J1l0Q7L7o1l9K7mL6n7P5j9p2K4Pj6j1O6l4o8J0L8
3834a2J7K3Kj2l1OOJLmj2j9J9j5J06j20P1l1n7M4L1N5n1m4l4Q9KMJ3m8L1k6ok5
3868b4L5K5l4K6l9m1M8J2k1L0m0M6j7k3L9l8M0q0R9Rrm0K5m8J3jM7l7j9j2kK7
3900dqN6l0J5p7N6K1mll8J3Lj9N2k8J6j1l5J0k3L3M3J3r0K1J2Mm9J02k6k1lP3
3933G4j26N5Np2N6j0L8k4j3mK4p4P2j8M5k4j3nj4O2L1r2M9o1J9J3j2N1l1n5N2
$$ plain form
3703 -17 33 36 35 7 -32 -24 -24 30 45 -33 -21 -36 -4 63 45 54 17 -11 6 -14 30 -8 -5 -18 -14 23 62 35 63 -55 -58 18 67 -25
3737 -25 32 5 25 -99 22 -27 -46 -19 -42 -47 26 -5 12 22 2 -16 -22 0 -29 27 62 -44 -43 19 -36 -34 33 77 -13 43 -10
3768 -10 25 40 -20 71 25 -22 38 36 -5 -18 10 -33 -28 -66 -9 5 -6 3 -16 6 -21 30 34 14 7 10 3 -40 40 83 22 -9 46 53
3802 53 67 -15 -15 6 -65 -13 16 24 -36 -19 -8 -38 49 86 25 -14 13 9 45 -12 63 44 -28 -4 3 -13 -24 42 8 -60 -50 -12
3834 -12 5 28 30 18 -13 -7 -1 0 3 -1 -13 -32 -13 -28 78 -42 29 -2 -59 -15 16 71 20 -24 -58 31 33 37 50 2 33 7 1 -24
3868 -24 11 36 2 28 -11 -52 -4 8 -13 17 -23 23 6 -17 22 -16 24 -56 43 52 43 3 28 -20 -7 -8 39 2 -17 -29 -31 -4
3900 -4 -12 44 14 29 -48 8 29 25 22 -16 -3 0 -19 33 5 21 10 -25 -15 -38 -5 38 51 -39 -18 -6 -2 -51 51 25 4 1 74
3933 74 -52 3 8 -64 -8 -18 20 -4 -17 -21 3 -71 1 -17 28 4 -9 -14 -28 34 65 -27 22 -39 -20 -7 -19 32 1 -54 -2
3964bk2PL6M0j5q0j1O1J9J1kL8r6L2kJ1kMk5p2Q0l2OO3m5r9J25l4K6nK3o7rK4
3998a4J8l3qP3r4P4o8Q0l3qL7p4K6OL6JL4m8K8p9K8P9K0r4M2j4LK0j1no9O6k4
4031ej3K7L5oq0K9K1K9k8K9r7K9K1O7j9m2MM2n5o9J11l6lj0L6n4O9j8K6k8n5L1
4063a2j6l7K6Q7j7m8l0J8K6j3k8L4m5NN7J6o6M3l2l1P1QK0%j1m6r4O6Q6K1r8l
4095d3M4l3jK3Rj6l7RM0M3OL6q3k2J8j0P4k6j1o3KPQL2j0K8k1o7N0K2j0M8l0k1
4129ek2Q3k0r1K6L2k3K6o6N6J9l2N6j5m0JM3ok2J8K8l8K1j1nMl2N3l8%mj7nmL0
4164@qlJ7l0L3l9N7J0n3L9j2l6Pj1l6L1J5K6Qk4K3o4M6mJ1NJ8j6k3oL0j3J8l7
4198b1O8o9L0m7R7l4K1k5p7L3K3QK2K8j06QLM1rK8k4N5mq1J8L6l2k2K3K4M0n2
$$ plain form
3964 -2 -24 -17 19 59 44 -36 -47 14 33 44 42 80 -16 16 14 25 23 27 2 -70 10 -22 -16 47 2 -97 28 -6 20 15 38 -29 -38 -14
3998 -14 4 -29 -37 36 -58 16 -52 28 -5 -13 24 -50 -24 -18 18 19 53 5 33 -46 -18 61 81 -13 29 15 18 38 27 22 -47 19 -5
4031 -5 -18 9 44 38 -42 -13 8 37 9 38 -59 -30 -9 58 39 -3 1 43 -12 -81 30 -6 -9 -19 17 -37 32 14 40 12 -43 -12
4063 -12 -28 -65 -39 48 31 -17 -47 -29 -3 -16 -44 -10 -55 -50 7 23 -43 0 -32 -63 8 16 36 36 25 -21 -115 -49 37 58 -40 -43
4095 -43 1 -32 -33 -10 -1 -17 -54 -45 -5 38 44 80 -3 -25 -7 -17 57 31 20 -43 -41 -34 -26 6 -4 24 3 -64 -14 8 -2 46 16 -5
4129 -5 -27 56 36 -55 -29 3 -20 6 -60 -4 15 -17 39 24 -16 -15 28 22 0 18 46 8 29 18 13 17 -15 38 0 0 -4 -21 -26 -30 0
4164 0 -8 -11 6 -24 9 -30 27 37 -16 23 11 -25 -18 -29 -65 -34 -19 7 15 -9 14 -50 -4 -8 3 8 26 10 -13 -19 11 -2 16 -21
4198 -21 47 -22 8 -39 58 24 45 20 -57 -24 -1 7 29 57 -49 -41 -38 3 -6 22 -2 53 49 -32 -14 22 -10 -32 -9 15 55 3
4230CJ4M1q4j5L9J0L6p7L6n7M6K2j1m6J5M0k0M8p1K8k1J0j2K8l8JP1n2M2n1N7
4261C2k4j8K4ll6M6j3l5J5K3On9nM6M3m9j0K1j15R0k6J0P1Mm9qK2j0M8Pp7J9Q
4294b%QnNJ9l0k6RJ3k7K0L0j6N4m8N3j06L1L1j0KlM4o1QROj3l9M0k7L0j7Pk6M3
4330FrK6p6O5MK3Nl7l9k0O1L8jn8l4lK5K5JN2l9l0Nl6Q3j7J7n1K2Pm6J9M5o4R9
4365F8j43R6jpo9P7L0j52J14J8j6J1k7l3o%M0Nm5J3n4N1L6Oo2L6k1M8j8j6N4k7
4397Fk0%L8l7J1M8l1%Lk1J5k6N3m5O2q3O7l2K0n0MK9k1O4k6l1j7L6qpLK5q5M6
4431a0L2Nl3l8O2n2k9L5M2J4l8P0p9M7n0O6k6L2o9n2P5qjk0K8k3Rj9MJ3LKk0p
4465c5O0J8k7j9qpM8pl7L5j5Pl5M2on0L8k0K7R%j1PJ6o9jL6j7K4J4k2j1J9k6j2
$$ plain form
4230 3 17 58 -26 -41 -2 8 44 -33 3 -54 -8 14 3 -43 -28 12 -8 40 -31 -3 -24 -14 -26 2 -36 -35 36 -16 26 -25 32
4261 32 8 -10 14 11 -25 21 8 -27 -12 11 17 -42 -47 -1 42 -7 -17 4 -111 -21 -47 -37 34 38 -11 -19 3 -7 41 48 -29 -10 -2
4294 -2 -2 6 1 6 25 -5 -31 -22 -9 -36 -16 14 -2 52 4 57 -49 -18 13 3 5 2 46 -15 -7 2 8 -5 -44 -4 -31 -1 -18 -11 -37 6
4330 6 -3 23 -53 12 16 39 44 7 -32 -52 9 47 46 -12 -46 -49 -24 1 2 54 15 -15 -10 -46 37 20 37 -14 8 15 -31 -12 33 -31 68
4365 68 -75 21 20 13 -56 21 51 -101 13 31 15 26 -1 -34 -40 -40 0 5 -40 -27 -81 -30 6 12 -50 -14 -35 13 -5 -21 33 6
4397 6 -14 -14 24 -13 -2 46 15 15 18 -3 12 -14 39 -6 56 -27 40 8 28 -22 -18 11 -10 54 28 -3 -20 16 8 1 4 29 -56 -10
4431 -10 22 27 -6 -44 18 -34 -63 -28 14 28 -10 60 -19 28 -22 44 18 50 -19 -71 4 -4 -5 -25 3 -20 -11 -30 -26 -13 -10 -8 -28 -35
4465 -35 25 43 16 -3 -11 -18 30 23 -14 21 6 13 -22 20 14 -36 2 -18 9 18 18 7 14 30 -39 -40 -4 -21 3 17 -5 -16 3 -23 -35
4500c5pL8k0Mpk1J9j4M3k6K6K1j9l3P4n4l7M4L5j8N4q3KQo2N6K3J9o6j3J8O5l6
4533bM0m8mjnK0j9klj3K8K1J9k3nk5rL5j4M7n0J1l7M0k6L2Om2J0rK1oP8n9p%k3
4570b4L6k2k7O3k6jJ7pjJ5K2o3l3J3M3k9J6K3k4n7N6j9L4ql4K5J1l5N1lJl7m8
4603g2R1l8L2oJ5j0o6J9j7L0KmK4m1K4L0L8k8joj6o1R1l2K9j9l3R4o8j4M1L1r0
4636c1K3nn2R0k3oQj0L5k1k1K8L6n9l9Q7k1rl6J3L9l1N0p9K0M6km5J6k6L3j5j8
4669b5jN9n6QK2l6L2l4L3%L8m6M5r1K8J8J8o0N5lK6o0M6l6P5p0M3k5rL2qJ1m6
4702a7M2Qo8J9K5j8K6M0j04M5J7l1M4p9M7K2l6K3Mo3O6%RqL6o8mL4o2O1j2O6r6
4735c2M1PNJ8j1j3n9O1nK7p2J9L6o%J5j2Ro0l0P7o9O4l9RnJ1L8r5R3m2JL0o6M2
$$ plain form
4500 -35 -42 -4 -24 -20 -27 -48 -29 -43 0 -26 0 21 2 -31 43 -11 -48 -4 31 13 67 -16 -14 -6 -68 -12 11 30 -36 -49 -31 34 -2
4533 -2 38 -10 -14 -15 -20 0 -19 -21 -24 -37 -9 12 31 8 3 -22 -31 4 -10 37 -13 -2 -39 1 -25 7 13 -29 -19 -28 -7 -13 65 6 -1 -1 -24
4570 -24 12 -10 -37 26 0 -1 16 9 8 23 45 -18 -51 -38 5 -24 -8 15 -9 -66 -10 -29 5 -3 -37 -12 -1 -36 15 12 13 -24 -72
4603 -72 19 -19 13 7 22 12 -54 -35 -52 -22 -20 -24 0 -41 -17 13 51 23 22 16 0 -61 30 -2 27 8 -25 69 1 -13 28 59 -31
4636 -31 -8 -13 -65 25 2 -4 4 -6 29 8 -13 15 51 -8 -47 40 19 10 -26 -13 26 -5 45 -34 -14 32 30 -15 1 -25 8 -7 -25
4669 -25 -26 33 -23 -15 7 -29 3 -31 2 2 40 -6 39 -52 -24 -6 12 -48 7 4 30 -30 16 -20 55 -15 28 3 -6 26 18 29 -17
4702 -17 25 33 -35 -16 9 -9 17 57 -47 -2 15 -16 28 -51 -4 18 -18 5 9 -54 12 12 21 13 49 -19 -23 11 -51 10 -2 64 -32
4735 -32 9 16 21 39 28 15 -44 17 12 39 -33 -14 22 16 16 31 19 28 -32 -62 15 -54 10 -29 -20 -25 -14 24 -71 22 -20 -19 11 -55 -13
4770a3L3m5K3K6k5l4J5N9l8Qn5L9mJ1k3OL7j0J5L2n7K1k6n0O7K8o2O5m4lj5K0
4802Arnk4L6m6M5J0Ol3LJ8J8k3l3J3O9o7k3R8m8L6j4l5Kl4L8oJ6j6L6n9L1j7k
4836a8kK8lj4m6L1l3Q3o8P2Pk5k6k6M6K2m4m1P7k7j3M9l7K8Knj9K2qrj4M3Lj9
4870A6j6PL4n1Kl4N2L4m8l0K9J4Jqn1L5M0l1J4lql%M6m2m6J8K7k7L9l0M9l4N0
4904D5l1nn2M6k6K1J5J4kn1K0kml6J4N8r3O0l1J1lL4Nj0K5l9K1k9J6j0%OJ0j5
4938a8N0o1J0L7ql4l6N9K7k0M8n4K1m6O0n6NO6nK0n6K4p5K2M0m1N6o4L3Kn0L5
4970iL0j5k4J4rJ4qJ8k3J6p7P9Ql4J2J9n5P4k6LJ6Oj6j8n2Q7Jk4l0k8M6qN6k7
5004A6l3prLlO7o6QJ3L4nk5n9J3Q5k1n6L6L0p7Q9K0n0qm7O6m8L5k9L0j4M4m2k5
$$ plain form
4770 -13 20 -25 -2 24 -1 -35 -20 39 1 9 -46 -7 -11 0 -23 -17 20 10 25 57 0 21 -5 -55 12 40 -22 43 -1 -4 -19 1
4802 1 -8 -13 -37 -1 -47 -2 8 14 -19 -16 2 20 -3 -36 -23 46 -21 -44 54 6 42 28 -7 -5 -39 -1 -7 9 -7 29 -30 1 -16 -18
4836 -18 -20 8 5 -9 -55 -24 -57 26 -42 30 37 12 -14 -40 6 28 -16 -57 20 -7 -20 29 -8 20 22 17 -2 20 12 3 -11 32 35 16
4870 16 0 7 41 -10 -8 -42 10 44 -4 -34 -5 9 10 2 -49 -14 26 -5 9 6 -2 -5 -5 41 -1 -47 -29 -2 -29 10 -20 29 -5 45
4904 45 14 9 -43 3 -23 -2 13 27 25 -26 -6 -8 -12 -48 -34 24 -69 -9 -40 -29 -32 2 7 -3 22 -17 4 -25 -9 -19 -19 -13 -3 -18
4938 -18 32 -29 -19 18 10 -24 -60 -1 26 6 54 0 21 -25 35 -21 -16 50 45 65 9 33 -42 -20 20 -21 35 -29 4 6 -44 -9
4970 -9 21 6 -18 -4 -13 1 -7 11 -12 4 -73 6 14 -20 -8 11 -44 30 4 7 23 29 13 -5 -57 30 31 7 -23 -51 -5 -13 43 16
5004 16 -17 -24 -33 -30 -33 34 -32 -24 -11 23 18 -7 -66 -53 32 11 -45 -9 21 -56 33 53 3 -5 -52 14 -34 1 -28 2 -12 32 -10 -35
5038c5nJ5RJ4K3op3J3N2l6N8Nk9k4J7k4L3k0JM8k6j8P9n3j3o3N6j9J0k7K2L6k5
5071el5R9m6J8m4RNjK3k0l0K4k2QJ6M7j4o8K3M4k4K7o3RK5mLl2J3N2n9O2Pn7j4
5106b4O0o9O9l5k3%j8P1m5J1k1M5J7q0N0j2J5j1J2nJ3ol7M3l8L6N7o7l4N6J4r1
5138d7M4l6O7j0m1J4l1l9P1L5K0q0P6n8K2m9L6J3l5L7L2o4K2N9m9j8K1n4O3K8
5168D9o1LJ3rRL9l1%j3ok9mJ2K2l4K9qj0P0o0L0PL3n6Nj4pj7N4j8l6j5K1K5M3
5203C6m6J3N0ml4j9lLmMj5K2k2N0m8pJ9k0%K7nk8N5o6L3K3l9k3M6K6J1mj9k2J5
5238EmJM2k7j1l1j3J2M8n1J7nOJ2m0J2J1J5n6L7L2l0K4k7j5M3J8Nm4j4L6ml5M0
5272IqNl1Jj8k4N9j5PnLRK3KJ6m3L4k3QnmM2n1n2O8l7P3o7k5N5l5L3J2J2j7j0
$$ plain form
5038 -35 -40 -25 -16 -2 21 15 -58 -45 7 -29 29 34 5 -19 -2 -26 7 -13 -12 36 10 -8 71 18 5 -58 -2 -21 -11 -38 -16 20 -5
5071 -5 -40 59 13 31 -13 -4 1 0 23 3 -27 -3 -25 -17 -1 46 32 -36 -13 31 7 34 -29 -20 5 1 4 -28 -15 37 -22 40 47 -10 -24
5106 -24 36 -33 36 1 -22 -22 -40 31 -14 -3 -24 21 38 -42 8 -4 11 0 12 7 20 14 -23 20 -18 18 75 8 -26 30 44 -47
5138 -47 -3 -39 28 18 -23 -9 -40 -79 -8 27 47 -33 43 -15 7 -42 -6 7 -28 9 41 -23 -1 58 9 -9 12 -42 21 49
5168 49 -12 -9 4 -5 4 43 12 12 -1 -7 -36 -40 -28 -6 -40 -11 -19 -29 41 -19 11 18 51 -5 0 -14 -21 -38 16 -2 -38 -53 -32 -7 36
5203 36 -10 3 53 49 15 -4 -7 -4 -8 -4 -19 3 -19 31 -17 -24 -5 -25 -25 2 -3 -31 24 -42 -9 14 -25 -48 -2 24 35 31 12 -10 5
5238 5 1 2 44 17 6 -25 -38 -26 22 -29 -12 -17 -11 1 -39 -27 -16 -1 -57 -20 12 -18 6 -21 -36 7 25 30 -14 -28 8 4 -31 9
5272 9 1 6 -25 -24 -42 -66 -7 -22 -15 -20 -17 -8 15 17 33 -10 24 1 9 4 0 42 -9 -61 7 -30 43 -24 -49 6 -29 4 16 28 11 1
5308Ak5M5n2M8n4M8l7KJ4J2KJ8rm8P6m7j5J1P3j28P7Nlj2j1J5k5j0KJ9oJ0l9j7
5342f0N0J9oLJ0qjN0p6J1m8NP4r2R8n2J4Mk2L6Ok6n0M0j0N7l9l0N7%J8l8L1Ol0
5377AJ1J5j4K1J6o4KM6nn5J5K7j6K7K5r1OLJ1Q1pq0J5pj4L3k1l5O0j09J17L1o9
5410b4L6Nm0j7L3n4L0j9O5J8l8L1k7J4k2%qL5J2k3mK7k8J3k1oJMK4qL1j8l3l8
5444d9M3k1%K6j4K6k5l0L4k8%oJ1MM3n7M8Ok6nQ3j18N4oNM2j8Kk0rm9nM3O1o6
5479b1p4N4M0l3J9O5p9K5kL2n2M8l5K1l7KN7m4J5l0jqO5m9K7k8L3qopk1O2n8J4
5513a4m8N9Lm1J8Qj7j1J3%KnM7m7N9j5rn4O7j2qJ1M5p2J9K0K5j7Oj6m1j0O9o5
5547c1N0k8j5M9k6j9O1m2k4Q5o2nj2QJ8j0L7j8nj8mj2L1nl9M2m4K7OM2j8l3J7
$$ plain form
5308 1 -24 21 -31 17 -37 11 -26 -24 -10 2 4 22 13 -35 41 -6 -21 -10 63 -65 12 17 14 2 -9 6 -19 -29 -27 -8 -14 -4 -43 -60
5342 -60 -10 9 3 6 16 8 7 57 -19 -8 -56 -51 23 -69 29 -23 -9 -5 -27 9 15 -11 -61 -21 -31 26 -13 -43 14 14 32 -6 25 31 1
5377 1 12 27 13 34 50 -14 -12 34 29 -26 -11 16 0 27 52 -39 -33 -30 -19 62 55 -25 -10 -17 -31 2 -19 -54 6 -103 14 45 -24
5410 -24 12 17 -23 -40 -7 -61 -31 -50 15 33 -5 26 -1 13 -9 -9 -17 18 30 7 3 30 2 15 -6 -12 -11 -7 17 9 40 22 -11 -49
5444 -49 -6 -27 -27 -1 -15 11 -14 -44 -10 -38 -38 -44 -33 -29 14 -43 5 11 -15 -20 63 -55 -1 -7 -2 40 22 24 4 -5 -54 -59 -16 45 -21
5479 -21 -95 -41 -1 -34 -15 50 -29 -4 -6 26 -26 22 -13 8 -29 -27 30 -14 1 -29 -30 -38 27 -22 5 -23 10 2 -4 -11 -32 30 -28 -14
5513 -14 -62 -3 0 -41 -23 -15 -32 -43 -30 -30 -28 -33 14 -33 26 11 2 -52 15 3 -5 6 51 -21 -2 18 43 26 32 16 -25 -35 34 -31
5547 -31 19 -9 -24 25 -1 -20 41 -1 -25 60 -2 -7 -19 -11 7 -3 34 16 11 -7 -11 -23 8 3 -36 6 -38 -11 -5 37 19 -14 3
5580CRl3jK8mK3k1J1L9n7l1M5m0P0k0oJ8m4nL2l1J4Rm8M6QkJ2Ln4K8j6J5K9l9
5615a0K3J6r2L0oM4lPm7j3L8k5K3J1J0M0n7jl4K2Ok1N8nRl3K1%l4N8m3K9J1j0
$$ plain form
5580 3 12 -21 -22 6 2 25 4 15 54 -3 -34 11 -29 41 21 15 33 -11 -16 16 -15 -1 8 -40 6 14 12 24 27 -27 1 -15 0 29 -10
5615 -10 13 29 -63 -33 -39 5 2 9 -38 -51 -13 -38 -15 -4 6 46 -11 -12 -46 -24 -18 -39 19 14 23 -10 11 11 -23 35 -8 21 32 22
$$ [...]
8191b
##END NTUPLES=NMR FID
##END=
