##TITLE=1H_AM_NV141
 CDCl3
 8 sc, 
 15.3.2024
##JCAMPDX= 6.0         $$ Bruker NMR JCAMP-DX V2.0
##DATA TYPE= NMR FID
##DATA CLASS= NTUPLES
##ORIGIN= UXNMR, Bruker Analytische Messtechnik GmbH
##OWNER= root
$$ XWIN-NMR		Version 3.5
$$ Fri Mar 15 14:17:47 2024 Russian Standard Time (UT+4h)  she@DPX200
##.OBSERVE FREQUENCY= 200.1313
##.OBSERVE NUCLEUS= ^1H
##.DELAY= (6, 6)
##.ACQUISITION MODE= SIMULTANEOUS
##.ACQUISITION SCHEME= undefined
##.AVERAGES= 8
##.DIGITISER RES= 18
##SPECTROMETER/DATA SYSTEM= spect
##.PULSE SEQUENCE= zg30
##.SOLVENT NAME= CDCl3
##.SHIFT REFERENCE= (INTERNAL, CDCl3, 0, 15.7039)
##AUDIT TRAIL= $$ (NUMBER, WHEN, WHO, WHERE, WHAT)
$$ ##TITLE= Audit trail, XWIN-NMR		Version 3.5
$$ ##JCAMPDX= 5.01
$$ ##ORIGIN= Bruker BioSpin GmbH
$$ ##OWNER= she
$$ F:/spectra/data/she/nmr/H-F/1/audita.txt
$$ ##AUDIT TRAIL=  $$ (NUMBER, WHEN, WHO, WHERE, WHAT)
(   1,<2024-03-15 14:16:43.98 +0400>,<she>,<DPX200>,
      <created by zg, POWCHK disabled, PULCHK disabled
       configuration hash MD5:
       00 E9 B6 7A A2 85 ED C7 34 08 36 98 17 FE 4E 26
       data hash MD5: 16K
       9D D6 2D B5 01 16 4E F2 A2 33 E9 7F 25 3F 70 FE>)
$$ ##END=
$$ 
$$ hash MD5
$$ 85 27 A6 28 DC 30 FF B2 7F 6A E4 F3 E1 B1 B7 FF
##$RELAX= 
##$RELAX= 
##$RELAX= 
##$RELAX= 
##$RELAX= 
##$RELAX= 
$$ Bruker specific parameters
$$ --------------------------
##$DU= <F:/spectra>
##$EXPNO= 1
##$NAME= <H-F>
##$PROCNO= 1
##$TYPE= <nmr>
##$USER= <she>
##$AMP= (0..31)
100 100 100 100 100 100 100 100 100 100 100 100 100 100 100 100 100 100 
100 100 100 100 100 100 100 100 100 100 100 100 100 100 
##$AQSEQ= 0
##$AQ_mod= 1
##$AUNM= <au_zg>
##$AUTOPOS= <>
##$BF1= 200.13
##$BF2= 200.13
##$BF3= 200.13
##$BF4= 200.13
##$BF5= 200.13
##$BF6= 200.13
##$BF7= 200.13
##$BF8= 200.13
##$BYTORDA= 1
##$CFDGTYP= 0
##$CFRGTYP= 5
##$CHEMSTR= <none>
##$CNST= (0..31)
1 1 145 1 1 1 1 1 1 1 1 1 1 1 1 1 1 1 1 1 1 1 1 1 1 1 1 1 1 1 1 1 
##$CPDPRG= <>
##$CPDPRG1= <>
##$CPDPRG2= <>
##$CPDPRG3= <>
##$CPDPRG4= <mlev>
##$CPDPRG5= <mlev>
##$CPDPRG6= <mlev>
##$CPDPRG7= <mlev>
##$CPDPRG8= <mlev>
##$CPDPRGB= <>
##$CPDPRGT= <>
##$D= (0..31)
0 1.2 0 0 0 0 0 0 0 0.06 0 0.03 0 0 0 0 0.0002 0 0 0 0 0 0 0 0 0 0 0 0 
0 0 0 
##$DATE= 1710497803
##$DBL= (0..7)
120 120 120 120 120 120 120 120 
##$DBP= (0..7)
150 150 150 150 150 150 150 150 
##$DBP07= 0
##$DBPNAM0= <>
##$DBPNAM1= <>
##$DBPNAM2= <>
##$DBPNAM3= <>
##$DBPNAM4= <>
##$DBPNAM5= <>
##$DBPNAM6= <>
##$DBPNAM7= <>
##$DBPOAL= (0..7)
0.5 0.5 0.5 0.5 0.5 0.5 0.5 0.5 
##$DBPOFFS= (0..7)
0 0 0 0 0 0 0 0 
##$DE= 6
##$DECBNUC= <off>
##$DECIM= 32
##$DECNUC= <off>
##$DECSTAT= 4
##$DIGMOD= 1
##$DIGTYP= 9
##$DL= (0..7)
0 120 120 120 120 120 120 120 
##$DP= (0..7)
150 150 150 150 150 150 150 150 
##$DP07= 0
##$DPNAME0= <>
##$DPNAME1= <>
##$DPNAME2= <>
##$DPNAME3= <>
##$DPNAME4= <>
##$DPNAME5= <>
##$DPNAME6= <>
##$DPNAME7= <>
##$DPOAL= (0..7)
0.5 0.5 0.5 0.5 0.5 0.5 0.5 0.5 
##$DPOFFS= (0..7)
0 0 0 0 0 0 0 0 
##$DQDMODE= 0
##$DR= 18
##$DS= 0
##$DSLIST= <SSSSSSSSSSSSSSS>
$$ [...]
##$SUBNAM2= <"">
##$SUBNAM3= <"">
##$SUBNAM4= <"">
##$SUBNAM5= <"">
##$SUBNAM6= <"">
##$SUBNAM7= <"">
##$SUBNAM8= <"">
##$SUBNAM9= <"">
##$SW= 18.0517328524113
##$SWIBOX= (0..15)
0 0 2 0 0 0 0 0 0 0 0 0 0 0 0 0 
##$SW_h= 3612.71676300578
##$TD= 16384
##$TD0= 1
##$TE= 0
##$TE2= 300
##$TE3= 300
##$TEG= 300
##$TL= (0..7)
0 120 120 120 120 120 120 120 
##$TP= (0..7)
150 150 150 150 150 150 150 150 
##$TP07= 0
##$TPNAME0= <>
##$TPNAME1= <>
##$TPNAME2= <>
##$TPNAME3= <>
##$TPNAME4= <>
##$TPNAME5= <>
##$TPNAME6= <>
##$TPNAME7= <>
##$TPOAL= (0..7)
0.5 0.5 0.5 0.5 0.5 0.5 0.5 0.5 
##$TPOFFS= (0..7)
0 0 0 0 0 0 0 0 
##$TUNHIN= 0
##$TUNHOUT= 0
##$TUNXOUT= 0
##$USERA1= <user>
##$USERA2= <user>
##$USERA3= <user>
##$USERA4= <user>
##$USERA5= <user>
##$V9= 5
##$VALIST= <valist>
##$VCLIST= <CCCCCCCCCCCCCCC>
##$VD= 0
##$VDLIST= <DDDDDDDDDDDDDDD>
##$VPLIST= <PPPPPPPPPPPPPPP>
##$VTLIST= <TTTTTTTTTTTTTTT>
##$WBST= 1024
##$WBSW= 4
##$XGAIN= (0..3)
0 0 0 0 
##$XL= 0
##$YL= 0
##$YMAX_a= 416823
##$YMIN_a= -316799
##$ZGOPTNS= <>
##$ZL1= 120
##$ZL2= 120
##$ZL3= 120
##$ZL4= 120
##$ABSF1= 10
##$ABSF2= 0
##$ABSG= 5
##$ABSL= 3
##$ALPHA= 0
##$AQORDER= 0
##$ASSFAC= 0
##$ASSFACI= 0
##$ASSFACX= 0
##$ASSWID= 0
##$AUNMP= <proc_1d>
##$AZFE= 0.1
##$AZFW= 0.1
##$BCFW= 1
##$BC_mod= 2
##$BYTORDP= 1
##$COROFFS= 0
##$CY= 11.3945322036743
##$DATMOD= 1
##$DC= 2
##$DFILT= <>
##$DTYPP= 0
##$F1P= 15.7292609196834
##$F2P= 12.9074282941183
##$FCOR= 0.5
##$FTSIZE= 0
##$FT_mod= 4
##$GAMMA= 1
##$GB= 0.15
##$INTBC= 1
##$INTSCL= 1
##$ISEN= 128
##$LB= 0.24
##$LEV0= 0
##$LPBIN= 0
##$MAXI= 10000
##$MC2= 0
##$MEAN= 0
##$ME_mod= 0
##$MI= 1.114404
##$NCOEF= 0
##$NC_proc= 0
##$NLEV= 6
##$NOISF1= 3.799351
##$NOISF2= 2.8
##$NSP= 1
##$NTH_PI= 0
##$NZP= 0
##$OFFSET= 15.70392
##$PC= 1
##$PHC0= -25459
##$PHC1= 7.58731
##$PH_mod= 1
##$PKNL= yes
##$PPARMOD= 0
##$PSCAL= 0
##$PSIGN= 0
##$REVERSE= no
##$SF= 200.130013532006
##$SI= 16384
##$SIGF1= 3
##$SIGF2= 2
##$SINO= 400
##$SIOLD= 16384
##$SREGLST= <1H.CDCl3>
##$SSB= 0
##$STSI= 0
##$STSR= 0
##$SW_p= 3612.71676300578
##$SYMM= 0
##$S_DEV= 0
##$TDeff= 0
##$TDoff= 0
##$TI= <>
##$TILT= no
##$TM1= 0
##$TM2= 0
##$TOPLEV= 0
##$USERP1= <user>
##$USERP2= <user>
##$USERP3= <user>
##$USERP4= <user>
##$USERP5= <user>
##$WDW= 1
##$XDIM= 8192
##$YMAX_p= 0
##$YMIN_p= 0
$$ End of Bruker specific parameters
$$ ---------------------------------
##NTUPLES= NMR FID
##VAR_NAME=  TIME,          FID/REAL,        FID/IMAG
##SYMBOL=    X,             R,               I
##VAR_TYPE=  INDEPENDENT,   DEPENDENT,       DEPENDENT
##VAR_FORM=  AFFN,          ASDF,            ASDF
##VAR_DIM=   8192,          8192,            8192
##UNITS=     SECONDS,       ARBITRARY UNITS, ARBITRARY UNITS
##FACTOR=    0.0002768,     1,               1
##FIRST=     0,             0,               0
##LAST=      2.2672688,     0,               0
##MIN=       0,             -316799,         0
##MAX=       2.2672688,     416823,          0
$$ Real data points
##PAGE= N=1
##DATA TABLE= (X++(R..R)), XYDATA
$$ [...]
1071B186K506m296l603K568M657j13n480l276L761M636k426n811R93O505J398
$$ 2186 4692 396 -3207 -639 4018 3905 -1575 -4851 -1090 3546 1120 -4691 -3698 2807 4205
1086D205n360k449M248L846k515m911n07M631K949l456m844J807N923R0o042j950
$$ 4205 -1155 -3604 644 4490 1975 -2936 -3443 1188 4137 681 -4163 -2356 3567 3657 -2385 -4335
1102d335M978L124l791m076K072M782P50m215k861K939M669j143n776r37N514
$$ -4335 643 3767 -24 -4100 -2028 2754 3504 -711 -3572 -633 4036 2893 -2883 -3820 1694
1117A694K588m644l572L278M361j573m649q61L802K786k674m573Q01N557J653
$$ 1694 4282 -362 -3934 -656 3705 2132 -2517 -3378 424 3210 536 -4037 -3236 2321 3974
1132C974m931k857M408M177k783m836R36M407N51m090k922K091M344l16m905j612
$$ 3974 -957 -3814 594 4771 1988 -2848 -1912 2495 3046 -1044 -3966 -1875 2469 2153 -2752 -4364
1148d364M953L735l461m385K388M839o23m544j277L461K763k225m271j98M458
$$ -4364 589 4324 863 -3522 -1134 3705 3082 -1462 -2739 722 3485 1260 -3011 -3209 1249
1163A249K079m211l837L137M955j273m547L03M600J534l398l078J390L498j02
$$ 1249 3328 -883 -4720 -1583 3372 2099 -2448 -2145 2455 3989 591 -2487 -1097 2401 2299
1178B299m461k474L674M165k174m488J224N176O42m290k000L094K851j650l861
$$ 2299 -2162 -4636 -962 3203 1029 -3459 -2235 2941 3583 -707 -2707 387 3238 1588 -2273
1193b273m85L839K401l318m115J733M907m09m921r22M455K446k604k983J451L619
$$ -2273 -2758 1081 3482 164 -3951 -2218 2689 2280 -2641 -3563 892 3338 734 -2249 -798 2821
1209B821L59l742k745K442L823j572m745p5M825J878l711k511K686L320j067l620
$$ 2821 3180 -562 -3307 -865 2958 1386 -3359 -3434 1391 3269 -442 -2953 -267 3053 1986 -1634
1225a634p61L058K263k340l850R01M507Q19m332k019L668L171k219l406P51L488
$$ -1634 -2395 663 2926 586 -3264 -2363 2144 2963 -1369 -3388 280 3451 1232 -2174 -1423 2065
1241B065O67l098k570J817L556n90m428j050M251K556l133l225K200L771l56l406
$$ 2065 2732 -366 -2936 -1119 2437 1847 -2581 -3631 620 3176 43 -3182 -982 2789 2433 -973
1257i73r61K790K337j978l721N7L767J099l912k676K968L783j315l419M18L646
$$ -973 -1934 856 3193 1215 -2506 -2449 1318 2417 -1495 -4171 -1203 2580 1265 -2154 -1736 1910
1273A910J309k602k468J220L118k51l926j762L225K897k351l588J189L988M14
$$ 1910 3219 617 -1851 -631 2487 2236 -1690 -3452 -227 2670 319 -3269 -2080 1908 2322
1288B322l119j363K505K485j133l190l95L253J500l149l211J824L669n39l734
$$ 2322 -797 -2160 345 2830 1697 -1493 -1888 1365 2865 -284 -3495 -1671 1998 1459 -2275
1303b275m79L455K036k075k405J043L155K77l208k034K369K837j803l920J87L633
$$ -2275 -2754 701 2737 662 -1743 -700 2455 2732 -476 -2510 -141 2696 893 -3027 -2840 793
1319G93J091k984j764K340K992n48k773m55K824J833k486l246R09L358j68l672
$$ 793 1884 -1100 -2864 -524 2468 1920 -853 -1308 1516 3349 863 -2383 -1474 1884 1716 -1956
1335a956j356K948K360j632k627P28L023Q76k532j930J944L013r15l484m97L222
$$ -1956 -3312 -364 1996 364 -2263 -1535 1488 2364 -168 -2098 -154 2859 1944 -1540 -2037 1185
1351A185J416k723k683J411K797l20k764p89K641K207j491k781P58L279O05l316
$$ 1185 2601 -122 -2805 -1394 1403 1083 -1681 -2470 171 2378 887 -1894 -1136 2143 2748 -568
1367e68j898K293K496j431k979J77K877J192k259k049J478K719m35l217r18K912
$$ -568 -2466 -173 2323 892 -2087 -1910 967 2159 -100 -2149 -671 2048 1613 -1604 -2522 390
1383C90J927k056k579J135L147K52k695j351K065J951j402k826N6K773J127k469
$$ 390 2317 261 -2318 -1183 1964 2216 -479 -1830 235 2186 784 -2042 -1986 787 1914 -555
1399e55j968J920K871o69k943m99K572J423j964k179R89K714O9k590j173K271
$$ -555 -2523 -603 2268 1599 -1344 -1843 729 2152 188 -1991 -1002 1712 1781 -809 -1982 289
1415B89K019j728k897L12K928P55k362j511J960K630n94k639l27K364J040k442
$$ 289 2308 580 -2317 -2005 923 1678 -684 -2195 -235 2395 1801 -838 -1165 1199 2239 -203
1431b03k492J157K598r3k656o05K571K102j262k340N42K451K86k447j656J766
$$ -203 -2695 -1538 1060 967 -1689 -2294 277 2379 1117 -1223 -681 1770 2056 -391 -2047 -281
1447b81K040r44k678nK565J159k165j995J209K576k17k313m49K343J748j463k224
$$ -281 1759 815 -1863 -1868 697 1856 -309 -2304 -1095 1481 1264 -1049 -1498 845 2593 1130 -1094
1464a094O06K265j26k773j598J634K037r57k220L65K871J294j712j598J392K110
$$ -1094 -488 1777 1651 -1122 -2720 -1086 951 -6 -2226 -1861 1010 2304 592 -1006 386 2496
1480B496p89k753p85K050J228j729k102Q41K649L27k262j083J957J808j084k131
$$ 2496 1707 -1046 -1831 219 1447 -282 -2384 -1543 1106 1433 -829 -1912 45 1853 769 -1362
1496a362L88K408P05j953j533J328J969q40k698o91J998J318j660j669J238K597
$$ -1362 -974 1434 2139 186 -1347 -19 1950 1110 -1588 -2279 -281 1037 -623 -2292 -1054 1543
1512A543K45j859o78J803J369j465k476m8K104N26k159j401J733K289m74k099
$$ 1543 1788 -71 -749 1054 2423 958 -1518 -1566 538 1064 -1095 -2496 -763 1526 1052 -1047
1528a047p4K066R18j783j728R39K130j01k119p21K014J546j396k248K81K162J52
$$ -1047 -1121 945 1863 80 -1648 -709 1421 1320 -799 -1520 494 2040 644 -1604 -1323 839 991
1545I91j979j000J697J813n62j825Q9K067Q74j918k025Q90J969m12k172l75K111
$$ 991 -988 -1988 -291 1522 960 -865 -776 1291 2165 247 -1778 -888 1081 669 -1503 -1878 233
1562B33J399j128j558O60J829J15k100j316J448J691q21k018K81K332P88j707
$$ 233 1632 504 -1054 -394 1435 1550 -550 -1866 -418 1273 452 -1566 -1285 1047 1835 128
1578A28j336J081J563o61k040m31J798J229j190j694Q82K266J21k116j036J656
$$ 128 -1208 -127 1436 775 -1265 -1696 102 1331 141 -1553 -671 1595 1716 -400 -1436 220
1594B20J286j293j774L84J932N92j522j185J190J813o46k276m77J950J014j547
$$ 220 1506 213 -1561 -1177 755 1347 -175 -1360 -170 1643 997 -1279 -1756 194 1208 -339
1610c39j345J167K046mj584o05J368J005j249k041M2J827M23j718j011J680J856
$$ -339 -1684 -517 1529 1525 -59 -664 704 1709 460 -1581 -1539 288 711 -1007 -2018 -338 1518
1627A518m32j725J56J580N85j473j497O85J643n9j896n80J737J244j231j880M60
$$ 1518 1086 -639 -483 1097 1682 209 -1288 -603 1040 981 -915 -1495 242 1486 255 -1625 -1165
1644a165J827R8j662n74J416J549m15j447k5J767N53j899j678Q20J530n32j827
$$ -1165 662 760 -902 -1476 -60 1489 1074 -373 -398 1369 1922 23 -1655 -835 695 163 -1664
1661a664p6J769J233r14j077N65J593J16j746j096J202J371q42j806K95J937N70
$$ -1664 -1740 29 1262 348 -729 -164 1429 1545 -201 -1297 -95 1276 434 -1372 -1077 860 1430
1678A430j575j071R06J227m62j591l05J478J220j012j321P72J896p9j888q38J287
$$ 1430 -145 -1216 -310 917 455 -1136 -1441 37 1257 245 -1076 -304 1592 1513 -375 -1213 74
1695G4Q36r69j484L66J573O41j138q65J110J503o07j900l10J565O42j430j159
$$ 74 910 -59 -1543 -1177 396 1037 -101 -966 144 1647 1040 -860 -1170 395 1037 -393 -1552
1712a552J057J528M0j336n11J193R48j036j695J64J639L20j508o72J454J535o30
$$ -1552 -495 1033 1073 -263 -774 419 1367 331 -1364 -1200 439 759 -749 -1421 33 1568 938
1729I38j430RJ161M73j311j278O01J432lj420l47J639J056j120j477M53J361j0
$$ 938 -492 -483 678 1151 -160 -1438 -837 595 592 -828 -1175 464 1520 400 -1077 -624 737 727
1747G27j375n63J171J298m27j285J0J432M44j601j305P51J261m77j378k6J569
$$ 727 -648 -1211 -40 1258 831 -454 -444 988 1432 -169 -1474 -723 538 61 -1317 -1343 226
1764B26J035p10j018N18J280p9j581q79J073R68p66j366L58J525M05j265p88Q03
$$ 226 1261 551 -467 51 1331 1252 -329 -1208 -135 833 67 -1299 -941 584 989 -276 -1064 -261
1782b61J098l66j214k32J371Q80q60j153P84J393l19j565p47R89O76q76j120L46
$$ -261 837 471 -743 -975 396 1276 416 -737 47 1440 1121 -444 -1191 -202 474 -402 -1522 -1176
1800a176J426N85q03o44J013J256n48j540k39J187K46j150j007P60J269m4j162
$$ -1176 250 835 32 -612 401 1657 1109 -431 -670 517 763 -387 -1394 -634 635 591 -571
1817e71l50J049Q36q08j281L20J478L24j251n13J153J064o16j312j93R25K27j120
$$ -571 -921 128 964 156 -1125 -805 673 997 -254 -767 386 1450 834 -478 -671 254 481 -639
1835f39q91O65J325N4j077j03J397Q02q92j206K84J055j26j227n88Q77R86l71
$$ -639 -1530 -865 460 514 -563 -666 731 1533 641 -565 -281 774 648 -579 -1167 -290 696 325
1853C25j167J95J185M24j226p87P02J124k88j117j3J146O95p32j054K57J035j18
$$ 325 -842 -647 538 962 -264 -1051 -349 775 487 -630 -643 503 1198 466 -588 -331 704 586
1871E86j341n67R84R62n90r64M28J420K50j014p17O61P88m51j197k27J026O44
$$ 586 -755 -1322 -338 624 34 -930 -502 918 1168 154 -563 98 886 435 -762 -989 37 681
1889F81q02q65O72J177j42j164l48R19O67o22r21K09J212K77r38p14P36Q84n62
$$ 681 -121 -986 -314 863 721 -443 -791 128 795 173 -748 -539 673 950 12 -702 34 918 356
1908C56j275q8J020M29q27n99P18J129M0r16l79R60N50q12j131J70J046Q4j029
$$ 356 -919 -1007 13 442 -385 -984 -266 863 903 -13 -392 568 1118 306 -825 -655 391 475 -554
1927e54n17R50Q33l84r81Q3J010L79q37p72O24J030k27j028j79J017M80r29r19
$$ -554 -1071 -121 712 328 -653 -570 440 819 -18 -790 -166 864 637 -391 -570 447 927 -2 -921
1946i21K45R95o0r27l57Q55R67l62q79J64J105K62j027p73M94Q08l94j086jR42
$$ -921 -676 319 259 -668 -1025 -170 797 435 -444 -280 825 1087 60 -713 -219 589 195 -891 -892 50
1966E0O47o30p84M85J037k6j026m02Q02O70o40q93J69J020J77r24n44O29P77l28
$$ 50 697 67 -717 -232 805 779 -247 -649 153 823 183 -710 -541 479 656 -268 -812 -183 594 266
1986B66r75r3J079N28p35o27N10R51j48j052l56P54M47o72r05J75J064L13q02
$$ 266 -709 -802 277 805 70 -557 -47 904 756 -296 -652 102 549 -123 -1028 -853 211 524 -278
2005b78l95Q55Q81m24r24lQ17K00r01p38N08Q24p1r09k09Q98N92n86p32K47Q96
$$ -278 -673 182 1063 639 -285 -288 529 729 -172 -910 -402 422 351 -558 -767 131 723 137 -595 -348 548
2026E48N4q66l80P39Q24m70q31K6Q31J17q46p21M86P92q6q10n2R41O01o21p08
$$ 548 602 -264 -644 95 919 449 -382 -356 475 592 -254 -975 -489 303 217 -593 -645 296 897 276 -432
2047d32L36Q32j44r86l44O65O20m60p49K54R56J71q69n22N10O94l95q70J2Q58
$$ -432 -96 736 592 -394 -738 -73 547 87 -662 -408 548 719 -150 -672 -162 532 137 -733 -721 137
2067A37N31n81n34M39Q72j37r77l67O42M83o58p76K91R39K40p89l52O71O32l29
$$ 137 668 87 -447 -8 864 727 -250 -617 25 508 -150 -926 -635 304 544 -245 -597 74 706 377
2087C77q85rP86L27n93n23N44P57j22r25k69O71L69p56p74L27Q62J78n95j80P54
$$ 377 -508 -517 269 596 3 -520 24 781 659 -266 -535 136 505 -251 -1025 -698 164 342 -253 -433 321
2108C21O83l51q09r3O25R1q32o40M56Q11q7p09j4Q64M65o14o61K68O74O5q17l13
$$ 321 1004 653 -156 -249 376 467 -365 -1005 -549 262 175 -534 -548 316 781 167 -494 -226 448 513 -304 -617
2130f17P75O24m67p17P5O17J51p54o44M01P82qo48LR75N17n97o91K86N36k28r83
$$ -617 158 782 315 -402 -327 290 441 -313 -957 -556 226 218 -430 -427 548 1065 468 -223 63 599 371 -612
2152f12l08N86N12k69n44K57Q89K03o30n48M82N86m10p51mQ07L73n82m99L95O12
$$ -612 -920 -334 178 -91 -635 -378 511 714 84 -464 18 604 194 -557 -561 246 619 37 -462 -67 545
2173E45j47q55k78N18N30m45n22L31R19J81o71l27M62N25n39p96j23O50K80m94
$$ 545 398 -457 -735 -217 313 -132 -654 -323 596 777 106 -221 241 766 227 -569 -692 -42 238 -256
2193b56m14M82Q08m4p75k16O47K42n02o38K00P75J44o00j60N20N01l06p78j24
$$ -256 -670 -188 620 576 -199 -415 232 474 -28 -666 -466 309 453 -147 -307 213 714 408 -370 -494
2213d94N68K05p12l66N77P00j15n06m7N90L50o66n98J51N73Q7p12j67P15N64m07
$$ -494 74 279 -433 -799 -222 478 363 -143 -190 400 750 84 -514 -363 210 297 -415 -582 133 697 290
2234B90n96M4O03J5p33m53M56O28l6n61Q6O97K90m78n48K39M50j93p86j01O48
$$ 290 -306 -262 341 356 -377 -830 -374 254 218 -343 -257 440 730 252 -296 -57 393 200 -586 -687 -39
2255c9L86k68n00J89O64J59o48m90M84M90l17n92J19P78K38n44l85L65L50k16
$$ -39 347 79 -421 -232 432 591 -57 -547 -63 427 110 -482 -363 415 653 109 -276 89 439 223
2275B23o89k45N16M62l48m38L44O98J33o07l11M43L70l93p10m8O46K33m16m80
$$ 223 -466 -711 -195 267 -81 -519 -175 523 656 49 -262 181 551 158 -552 -600 46 279 -137 -617
2295f17M63O57j33o47p7N37K56m89m10K50O40N8n40k74M69M13m15o45o1O47L3
$$ -617 -154 503 370 -277 -354 183 439 -50 -460 -210 430 488 -52 -326 143 556 141 -504 -565 82 115
2316A15m36k46N85N45j05n52k2M82J50n11n51K04N05k4n90r9O68L33l50l86J02
$$ 115 -321 -567 18 563 458 -94 -116 366 516 5 -546 -342 163 139 -451 -550 118 451 101 -285 -183
2337a83N22Q1o32k36M06O34k57n81jN27K21n57m68L02M72j88m62j3N87L50k86
$$ -183 339 420 -212 -448 -42 592 335 -246 -247 280 501 -56 -524 -222 250 62 -400 -413 174 524 238
2358B38m42J30M96R6o34l73M00L69k40n18J04N79J49m48l27L43N11k05n22j38
$$ 238 -204 -74 422 518 -116 -489 -89 280 40 -478 -374 205 354 -94 -421 -78 433 228 -294 -432
2378d32N90L12l12n16K62N17o6n18k69M29L62l83m51J12O10K37n33k77L85M74
$$ -432 158 470 158 -358 -96 421 355 -163 -432 -3 359 -24 -475 -363 247 484 -49 -326 59 533
2398E33k44n34p3N41J13m11m06L09M66rm96j55M22L99l67m99J50M74J03m17k73
$$ 533 289 -245 -318 223 336 -75 -481 -172 294 285 -211 -366 56 455 88 -411 -261 213 316 -101 -374
2419c74K89M63k39m25p2N01K16l81l04J98N03j6n31q7L65K67l16m43J92L60Q4
$$ -374 -85 378 139 -286 -358 143 359 -22 -326 -128 375 359 -172 -259 106 373 57 -386 -194 166 250
2440B50m03k95L73M11j35m97j6N62K07m77k66K45M24j81m60j43M28K51m28l81
$$ 250 -153 -448 -75 336 201 -296 -312 250 457 -20 -286 -41 383 202 -258 -401 27 278 -150 -531
2460e31K25N43J8l48j72L83L42k57m68R9L87J00m75k26K64L66n0m95q7M86K67
$$ -531 -306 237 255 -93 -265 118 460 203 -265 -166 221 321 -154 -380 -116 250 200 -295 -382 104 371
2481C71l53m25K93M59j7m36j36L88K46k55m50N9M26M7m29k59L48M03j26m10N9
$$ 371 18 -407 -114 345 328 -108 -244 144 390 135 -315 -256 170 217 -212 -471 -123 280 154 -256 -197
2502a97M35J32l37l38J39L72j9m31j62M62K64k10l93J52L57O0l62l38L47K80j72
$$ -197 238 370 33 -305 -166 206 187 -244 -406 56 320 110 -283 -131 226 286 -76 -414 -67 213 41
2523D1l11JM06K56m00k51J99L91j16n00o4L97K35k31k90J06M70p0l55k89K56L68
$$ 41 -270 -269 137 393 -7 -258 -59 332 216 -284 -348 49 284 53 -237 -131 339 269 -86 -375 -119 249
2545B49j98m26N7N05J61l05k45K41L98k03m64j28L41J67k40l75K70M40K6k75k08
$$ 249 51 -375 -318 187 348 43 -202 39 437 234 -230 -358 -17 150 -90 -465 -195 245 271 -4 -212
2566b12L90K37k42m12J9L64O2l54k21K98L49j25m27l3L94K30l87k55K43M32l3
$$ -212 178 415 173 -239 -220 144 206 -148 -369 -71 278 153 -274 -307 87 317 -70 -325 -82 350 317
2587C17l57j46K94K89l28m20kL33P5l47j50L71M23j23k34L7L04J30l40l63J45
$$ 317 -40 -186 108 397 69 -351 -353 -20 55 -292 -442 -71 352 229 -5 32 336 466 126 -237 -92
2608i2K79n3m40p7L82K06j82l34J32L52R1l76j36K95K98j47k83j5L25N3l40l10
$$ -92 187 134 -306 -383 -1 205 23 -311 -179 173 264 -112 -248 47 345 198 -85 -100 225 278 -62 -372
2630c72J83K65j09k89o7M01L23k19k24J78K98j1l39j98J67J72j86l17K1L90J33
$$ -372 -189 76 -33 -322 -389 12 335 116 -108 70 368 357 18 -180 -13 159 -27 -344 -323 67 200
2651B00k23k11K50K85j29l89m7L49J54k41k31J79L42J0l37j95J71K71k62k91R5
$$ 200 -23 -234 16 301 172 -217 -264 85 239 -2 -233 -54 288 298 -39 -234 -63 208 -54 -345 -250
2672b50L55P7k28r7K88K13j36l46j32K78J50k23l09J79M31k4k59j33L60K02l21
$$ -250 105 182 -46 -143 145 358 222 -124 -256 22 172 -51 -360 -181 250 226 -33 -166 194 396 75
2693G5l26Q5K46R0k16k49L11K51p9l12k0K62J16l72k12J44L76m1l12ML45K09k11
$$ 75 -251 -166 80 170 -46 -295 16 267 188 -124 -144 118 234 -138 -350 -206 170 129 -183 -179 166 375 164
2716A64l22k3L14M6l71j38K97J96k5l18P3L29N9k72k28J64K34m8l26rL19K00k57
$$ 164 -158 -181 133 179 -192 -330 -33 163 138 -180 -107 222 281 9 -219 -55 179 131 -195 -204 115 315 58
2739E8k54J88K33o7l42j35K59J98j17k50N0L46O6k05k47J97K02j04k75m4K97J95
$$ 58 -196 -8 225 158 -184 -319 -60 138 21 -229 -179 167 233 28 -219 -22 180 76 -199 -243 54 249
2761B49k79j86J77K29Ml10j64K72J58j53k35K2L20J12k25j65K04K21j31k59o1
$$ 249 -30 -216 -39 190 194 -116 -280 -8 150 -3 -238 -216 104 216 -9 -174 30 251 120 -139 -200
2782b00K71R1j62k12R5L24k5l37j1K69J14k35k61J17L10O2l42n7K24K28j21k91
$$ -200 71 162 0 -212 -117 207 182 -155 -166 103 217 -18 -279 -162 148 210 -132 -189 35 263 142 -149
2804a49jK93O3k60k29J79L07j80j37r4K72J86j56l07Q1K85O9l02j43K88J67j55
$$ -149 -150 143 206 -54 -283 -104 203 23 -114 -208 64 250 94 -213 -132 153 222 -80 -223 65 232 77
2826G7k38N0K46O0k76k06K12K38r2k36n6L22J29k53j73J93K00k6k67j33K16K03
$$ 77 -161 -111 135 195 -81 -287 -75 163 71 -165 -221 101 230 -23 -196 -3 197 171 -96 -229 -13 190
2848A90j15k88Q2K58O7k31k07K38J84j20j75n8K56J46k11j55J28K32pl63jJ77
$$ 190 75 -213 -131 127 194 -37 -244 -6 178 58 -117 -175 81 227 16 -139 -11 221 214 -149 -150 27
2870B7J50j54k37P8K34M5k17o4J17K27j24k19L9K10R0k18j94J95K14q2k80j2K33
$$ 27 177 23 -214 -136 98 143 -74 -138 -21 206 82 -137 -98 112 202 -16 -210 -15 199 117 -163 -175 58
2893E8K03k34k48J58J86L2k05j26J40L00j86k09j0K88N6k35j21J44K24q9k75J6
$$ 58 261 27 -221 -63 123 155 -50 -176 -36 264 78 -131 -141 147 203 -32 -153 -9 215 126 -149 -133
2915a33J55J88j92k32J02K18N8k71p6J97J24p1k35N1K11J12k24j16P7K20j16j92
$$ -133 22 210 18 -214 -112 106 164 -107 -183 14 138 67 -168 -117 94 206 -18 -134 -57 163 47 -145
2937a45k0K27J75k24j89R3K26jk01j14J87R9p0j92M8J95L6k18r6J69J91o9k09
$$ -145 -165 62 237 13 -176 -83 143 142 -59 -173 14 113 43 -149 -101 94 130 -88 -184 -15 176 107 -102
2960a02n2K13P1j58j85J41J94n5j90j8J45J98j63k44P7K30J5k19r9K38J79j20
$$ -102 -154 59 130 -28 -213 -72 122 67 -123 -141 4 202 39 -205 -128 102 117 -102 -201 37 216 96
2982I6k20j5K84N4k54j72J54K16Kk45m2K37J19j20k04J5L06q5k31j13K30J15n0
$$ 96 -124 -139 145 199 -55 -227 -73 143 145 -100 -142 95 214 94 -110 -95 211 126 -105 -218 12 127 77
3005G7k13K7K39K3j10k39J33J62l3j95j3J80J08j48j36M2L01j17j90o5J88J23
$$ 77 -136 -109 130 153 43 -196 -63 99 66 -129 -142 38 146 -2 -138 -96 205 88 -102 -167 21 144
3027A44p9k17O6K22N6j86k03K46P0q4k30kK30P3j34j24J69J99p7j86k1Q3J48j54
$$ 144 65 -152 -86 136 192 6 -197 49 119 35 -195 -197 33 106 -28 -152 17 216 139 -47 -68 15 163 9
3051Ik36Q8J70N3j91p8J75J77j01j89L9J47P6j36j48J01K08k8j78r7J56J21j34
$$ 9 -227 -139 31 84 -107 -185 -10 167 66 -123 -84 63 139 3 -145 -44 164 136 -42 -139 17 138 4
3074Dk04P0J92J9j49j2J16J97j10j37m4K06ok58p6J12J76j07j50l5K93M6j04j88
$$ 4 -200 -130 62 81 -68 -80 36 233 123 -14 -58 148 142 -116 -192 -80 96 -11 -161 -196 97 143 39 -149
3098a49J45J02N1j97q6J53J19p4k17L1K06J1j91j05J10K23r2j01jK02J07k00j15
$$ -149 -4 98 149 -48 -134 19 138 64 -153 -122 84 95 -96 -201 -91 132 40 -61 -62 140 247 47 -68
3121f8L5J33k7j89kR3J40r8j78J07K24J9j95j75J93J04j30j54N6J29R0j13j65
$$ -68 -33 100 73 -116 -118 -25 115 17 -161 -54 170 189 -6 -181 12 116 -14 -168 -112 17 107 -6 -171
3144a71N8J32qj92L0J53J12p3j31OL08m4j53p7Q4O4p7j81RK06kr7j46J83J34n3
$$ -171 -113 19 11 -181 -151 2 114 41 -90 -84 224 180 27 -50 34 98 21 -160 -151 55 53 -44 -190 -7 127 74
3170G4p1r0J31R5j55j46Q0J85nj83o6J62P2o5j72N0J90l5j14r9J66J69j36p2l0
$$ 74 3 -87 44 139 -16 -162 -82 103 98 -85 -151 11 83 18 -154 -104 86 51 -63 -162 4 173 37 -35 -65
3195f5J48O4j78p3N0J92q8j46QJ49N2q4j09N2J40r3o8q1J46Q7n9j55K4J36M7j18
$$ -65 83 147 -31 -104 -54 138 50 -96 -88 61 113 29 -80 -28 112 19 -49 -130 16 103 44 -111 -87 49 96 -22
3221b2p0L4J41o1p4p9J49J19r9j55M6J96j0j53n5J31O0p1j29L8J77J8j57q3R4
$$ -22 -92 -58 83 22 -52 -131 18 137 38 -117 -71 125 115 -38 -93 38 98 27 -102 -64 113 131 -26 -109 -15
3246a5J37k4k17J0J54N1o8j61P0J55k2j30r5J60Q2n5j92P2K29k6j49p8J36R0l1
$$ -15 122 98 -119 -109 45 96 28 -133 -63 92 70 -60 -155 5 87 32 -160 -88 141 115 -34 -112 24 114 83
3271H3j70OP9J03j18j48J46J38j3j79o2K08M3k7j74PJ78j5q7j05J01J52j00o7
$$ 83 -87 -81 -2 101 -17 -165 -19 119 106 -73 -135 73 116 89 -85 -78 100 85 -2 -107 -6 146 46 -21
3295b1m9J39m5q7m9R1P2k2k2o9P1J43j25j66J00J36m3j53k7J00Q0p0q1l9K00K3
$$ -21 -70 69 24 -63 -112 -21 51 29 7 -62 9 152 27 -139 -39 97 54 -99 -126 -26 54 -16 -97 -136 64 87
3321H7n6j09K8J24J0k08L4R7J15j29j09Q1J09L2o9q8O6J20j10j24Q4J35l8j25
$$ 87 31 -78 -50 74 84 -124 -90 7 122 -7 -116 -35 74 106 37 -51 15 135 25 -99 -15 120 82 -43
3345d3o5N4J32l5j35mJ04M1n0l6k1J01K2j18l6J11O2m5j98J08J20K0j69RR1L8
$$ -43 -108 -54 78 43 -92 -96 8 49 -1 -37 -58 43 65 -53 -89 22 84 39 -159 -51 69 89 -80 -71 20 58
3371E8j4o3m0J01Q1r3j55N7K19p9q7q8J04Q9o7j43J1J42O8j08j65J20J18p4k6
$$ 58 44 -19 -59 42 123 30 -125 -68 151 72 -15 -103 1 90 23 -120 -109 33 101 -7 -172 -52 66 -8 -34
3396c4m0J45m5k9p4rJ71k7j26m5J10Q4n1j47Q6R6L4j16o5J25qm2p1K8J21j9m9
$$ -34 -74 71 26 -3 -77 -86 85 58 -68 -113 -3 81 30 -117 -31 65 99 -17 -82 43 35 -7 -78 -50 71 52 3
3423Cq4P1Q6m5q5k8J13Q6j21o2J2Q4K3o7j17J32N5l4r0j0R9L6r4p6J09N9nj44
$$ 3 -81 -10 76 31 -54 -82 31 117 -4 -66 -54 30 53 -14 -131 1 56 22 -68 -78 21 57 -37 -113 -4 55 50 -94
3451i4J09J6J3m1q3L9P2O8j76J5J58jq5r9N0J33n7r4j8P2R7j02n2j8J32J5j85
$$ -94 15 31 44 3 -80 -41 31 99 -77 -62 96 95 10 -89 -39 94 37 -57 -75 -3 94 -8 -60 -78 54 69 -116
3478a16K0N0J19M4j54l3J35K2n9j58J11P8n6q7N0K7Q0q0p2K6J09J0n9n6J3J28
$$ -116 -96 -46 73 117 -37 -70 65 87 28 -130 -19 59 3 -84 -34 -7 73 -7 -79 -53 56 66 7 -49 -36 92
3504I2j4q4o4J06M9n4%p1R8j2j12k2O6O8p3J5OK2K5o9p1Q2O3m1r2K3R2M4m4j58
$$ 92 78 -6 -70 36 85 31 31 -40 58 46 -66 -88 -22 46 -27 -12 -6 16 41 -28 -99 -17 46 5 -87 -64 28 72 28 -130
3534a30J12N0K0q9n5J19M3p8n1NP8L4p6J9l6J06k6p9j7O1N4k7n9J5Q7l1o5r7J55
$$ -130 -18 32 52 -37 -92 27 70 -8 -59 -54 24 58 -18 1 -35 71 45 -34 -51 10 64 37 -22 -7 80 49 -16 -113 42
3563D2k9j0j20K9Q4J3l1k3P1P1q0o6mJ20k6j09PM0J27kr0j9N1Ll6m0NR1nj14j2
$$ 42 13 3 -117 -88 -4 9 -22 -45 26 97 17 -49 -53 67 41 -68 -61 -21 106 104 14 -5 46 49 13 -27 -22 69 64 -50 -62
3594f2J23Ql2q8jR5Oj15n2P5L7ql0k8M1J14q5o1K8P1n1k2j8O6Q2j27L1n0J24j5
$$ -62 61 69 37 -51 -52 43 49 -66 -118 -43 -6 -14 -44 -72 -31 83 -2 -63 -35 36 -15 -37 -55 11 93 -34 -3 -53 71 56
3624E6j13m2J05J5%p0k8J36M7p7r2M4O8J5j28J0O0L4q9l9O7N0n3j8j1M5M9k9j19
$$ 56 -57 -99 6 21 21 -49 -77 59 106 29 -63 -19 49 64 -64 -54 6 40 -49 -88 -21 29 -24 -42 -53 -8 41 12 -107
3653a07J9O2Q2p2p5J11KO9j20m9J02M2m0q2N0P1J6q9mJ09l3l4j19NJ17Mn5j8%
$$ -107 -88 -26 56 -16 -91 20 22 91 -29 -78 24 66 26 -56 -6 65 81 -8 -12 97 64 30 -89 -84 33 37 -18 -36 -36
3682c6M8Kj8m9P6N3j10j03R2O4Qp0j1P3Mj0n7K6K5J6l1p0M2J12p1n8J7N3Q2r5
$$ -36 12 14 -4 -53 23 76 -34 -137 -45 19 27 -43 -54 19 23 13 -44 -18 7 23 -8 -78 -36 76 5 -53 -36 17 99 4
3712Dm4N0Q3nq3j11J34L9m9p5L5Q4Mp8k5M7RL6q0n9P9lj3n1M1O1l0j17Q1N7j4
$$ 4 -40 10 93 88 5 -106 28 67 18 -57 -22 62 66 -12 -37 10 19 55 -25 -84 -5 -8 -21 -72 -31 30 0 -117 -36 21 7
3743GM2k8l9R7J9j21j4N3m0J0mj2Q3M4n2r5O0J03p2q9kJ00j1j1m9KQ8J5q9l2N4
$$ 7 49 21 -18 79 98 -23 -37 16 -24 -14 -18 -30 53 97 45 -50 10 113 41 -48 -50 50 39 28 -21 -19 69 84 -5 -37 17
3774A7J4rr0K7P9Kl6p2P3N6n3n6N9K8K2n4r8J01K5J1n8JO8l7l6nj1J29j18k2k0
$$ 17 31 22 -68 -41 38 40 4 -68 5 61 8 -48 11 39 61 7 -91 10 35 46 -12 -11 57 20 -16 -21 -32 97 -21 -43 -63
3805f3L5J24q4p2L3P6j4m2OrM5Ro8k6J12j4j05jP6j0j0q8M5L1P7j8n9K0k0O2r3
$$ -63 -28 96 12 -60 -27 49 35 -7 -1 -10 35 44 -24 -50 62 48 -57 -58 18 8 -2 -90 -45 -14 63 45 -14 6 -14 48 -45
3836d5L1k3N9L0m9m0M3N0j3k2mL1o1j3K0L8m2J1l0MM1Mk4m6LJ14j8n5l7K8P4l2
$$ -45 -14 -37 22 52 3 -37 6 56 43 21 17 48 -13 -26 -6 32 -10 1 -29 -25 16 20 -4 -50 -47 67 49 -6 -43 -15 59 27
3868B7o4J6N2l1Om1J8N9k5k1PK6N0p2k7L8O5l1o2L1M9m8Ql3m8L9L9o6J0N7J3m3
$$ 27 -37 -21 31 0 6 -35 -17 42 17 -4 3 29 79 7 -20 18 83 52 -10 21 70 22 30 -3 -51 -12 27 -39 -29 28 41 -2
3900bj09O3L5J6J8n4L9M9l1l5rJ8Jk5l6N8P5l9n4J4O8k4l5m9N2R9k4p5n9P1O4
$$ -2 -111 -48 -13 3 21 -33 6 55 24 -11 -20 -2 -1 -26 -62 -4 71 32 -22 -8 60 36 1 -48 4 103 79 4 -55 16 80
3931H0n5Lo6O4m5N0n0J2J3K6k8q6J08k8J8k4j3J9M6n2k4J8k0K9o4M6L7Km1KK4
$$ 80 25 28 -38 26 -19 31 -19 -7 6 32 4 -82 26 -2 16 -8 -21 -2 44 -8 -32 -14 -34 -5 -69 -23 14 16 -25 -23 1
3962AN9n4o8N2O2n7L4n9KK6J9r8L0J10j5q5K3k4P6Mo1nM7j8O0n4J2l1P3q4l2K1
$$ 1 60 6 -62 -10 52 -5 29 -30 -28 -2 17 -81 -51 59 44 -41 -18 -42 34 38 -23 -28 19 1 61 7 19 -12 61 -23 -55 -34
3994c4M6K3o9J6Q2m4n4m3N1M1j4LOj4O3j2p2J7O1rk6l5O7k1JJ5n8K4K0n0q1R7
$$ -34 12 35 -34 -18 64 20 -34 -77 -26 15 1 4 10 -4 59 47 -25 -8 53 44 18 -17 50 29 30 45 -13 11 31 -19 -100 -3
4026cN7j8o6k1N5O1n5l4j1N9oJk2K5L5l1j4j5LL6o3m3K6J17l0m3RjL0J6p4j4J09
$$ -3 54 36 -30 -51 4 65 10 -24 -35 24 18 19 -3 22 57 26 12 -3 0 36 -27 -70 -44 73 43 0 9 8 38 54 -20 -34 75
4059G5j0q4O3m9N7J1j11k0O0N7l5Ok6j1j6l5jL8M6o9l1P9NPm4l3P9o1Q4m4n7Q4
$$ 75 65 -19 44 -5 52 63 -48 -68 -8 49 14 20 -6 -17 -33 -68 -69 -31 15 -54 -85 -6 -1 6 -38 -71 8 -53 31 -13 -70 14
4091A4K1Kn6K4O7p7l2K7L1pn0ML8L0j1o1k7P2M3k6m1j6L6Pn1om0Q3j9JL0n7L1
$$ 14 35 37 -19 5 72 -5 -37 -10 21 14 -36 -32 6 36 25 -36 -63 9 52 26 -15 -31 5 12 -39 -45 -85 -2 -21 -20 10 -47 -16
4124a6k9m3M3O9M9o9r7R5jK7n4N1K1m7N1j23P8Kr4O5pN6L5p2L3K3j2j2m6QO8o0
$$ -16 -45 -88 -45 24 73 4 -93 2 1 28 -26 25 46 -1 50 -73 5 7 -87 -22 -29 27 62 -10 23 46 34 22 -24 -16 52 -8
4156hMn6lL1J8m7N1Lk6L3l9k1O1O1o9p0J00j6k6K2l6K0L2kn2J8M3K3n2l4N5JK5
$$ -8 -4 -60 -63 -32 -14 -61 -10 -7 -33 0 -39 -60 1 62 -7 -77 23 7 -19 3 -33 -13 19 17 -35 -17 26 49 -3 -37 18 19 44
4189D4n2L5n2P0pj01Q5L1o6l7qR7k8m5L8l1N8k5l6O1p7J18o1m2qMN2J5j09P7L7
$$ 44 -8 27 -25 45 38 -63 22 53 -13 -50 -58 39 11 -34 4 -27 31 6 -30 31 -46 72 11 -31 -39 -35 17 32 -77 0 37
4220C7n4m0lL9O6j9m5O9k2Ro0J1K5L1j08O8l1O7j14P1j5j3O2nn7J1K9M3l0n1N1
$$ 37 -17 -57 -60 -21 45 26 -19 50 28 37 -23 -12 13 44 -64 4 -27 40 -74 -3 -18 -31 31 26 -31 -20 9 52 22 -29 22
4251B2J4j3k3K4l1J8j1k9pP7J5j08j4R5L0r9J7M4K3l7J0m9L6N1K0l6p7P8l0J8
$$ 22 36 23 0 24 -7 11 0 -29 -36 41 56 -52 -66 29 59 -40 -23 21 44 7 17 -32 4 55 75 39 -38 40 10 28
4281B8m1K9%J7m0j9j5O9L4p9J0K2Pl2m2N7K0l9k7O1L5j4j06O1k3L9j1j0m2Q4l5
$$ 28 -13 16 16 33 -7 -26 -41 28 62 -17 -7 15 22 -10 -52 5 25 -14 -41 20 55 41 -65 -4 -27 12 1 -9 -51 33 -2
4312bM3n9M3j7Qjk2j3Q0l5k8l0N8J1l4j2K2l0K9%n2J17j14J2moL5J6k2j7KN0L
$$ -2 41 -18 25 8 16 15 -7 -20 60 25 -3 -33 25 36 2 -10 12 -18 11 11 -41 76 -38 -26 -30 -36 -1 15 -7 -24 -22 28 31
4345C1m8J7j6N5n3j6J2O0ko9L7j7N3k7Lj9nLJ6n3O9j8J5l3L0K9m3J2q7J21p6P7
$$ 31 -17 0 -16 39 -14 -30 -18 42 40 -29 8 -9 44 17 20 1 -4 -1 15 -38 31 13 28 -5 25 54 11 23 -64 57 -19 58
4377E8o2J3k8O4qp1L1N7l7l2J8M2J7p2j3rN7k5j2k1K0M0k9n2O1J5l7J2Ol2O3P
$$ 58 -4 9 -19 45 37 -34 -3 54 17 -15 3 45 62 -10 -23 -32 25 0 -12 -33 -13 27 -2 -54 7 22 -15 -3 3 -29 34 41
4409D1k9k2j0m8Q7q2J13m9MJ5m0lOm2J9N5M0oo8n2O5L3n9L0n6N1j4l0J6Q0l4M3
$$ 41 12 -10 -20 -68 19 -63 50 1 5 20 -20 -23 -17 -59 -40 15 55 49 -19 -71 -6 27 -32 -2 -58 -7 -21 -51 -35 45 11 54
4441E4p4L5m1M0j0Kk0OK6k4mM3p2L9k6k8P7l8l2RlK4Q1p0qL0m4J4m4O7L2j2p9
$$ 54 -20 15 -26 14 4 6 -14 -8 18 -6 -10 33 -39 0 -26 -54 23 -15 -47 -38 -41 -17 64 -6 -14 16 -28 -14 -58 9 41 29 -50
4474e0L5j1N1Pm6nO4J6m3j9k9M7n3J9nP1oKj24Q9L4po8mN8l2nk4N8l8PK8k7K8
$$ -50 -15 -26 25 32 -14 -19 45 61 18 -1 -30 17 -36 -17 -22 49 43 45 -79 10 44 37 -31 -35 23 -9 -14 -38 20 -18 -11 17 -10 18
4508A8l8l5k0Q6o3J04p0%nL4o4j6J22m8L3l4j7M7Jql1l0L5L4j7m8J4L7jl6m0N1
$$ 18 -20 -55 -75 11 -52 52 -18 -18 -23 11 -53 -69 53 5 38 4 -13 34 35 27 -4 -34 1 35 18 -30 -16 21 20 -16 -56 -5
4540eO0K4o9n3Q1Op5j0M6J5l6J5l1L8k4NmlK8N0o8j2M7R%o8J1M6%L1l4k8J3L8
$$ -5 55 79 10 -43 38 44 -31 -41 5 20 -16 -1 -32 6 -18 -13 -17 -20 8 58 -10 -22 25 34 34 -34 -23 23 23 54 20 -8 5 43
4574D3n8k0N1K0o8N3m4k3K5J1m0O5K0l2k1kkJ2Ppj1L1L1p2K0M2qrJ5Kk0pNJ1l6
$$ 43 -15 -35 16 36 -32 21 -23 -46 -21 -10 -50 15 35 3 -18 -20 -22 -10 -3 -10 -21 10 41 -31 -11 31 23 14 29 31 11 4 9 20 -16
4609a6P4k8k4n0N9L0J3o7J1k0P9j00pJ07m7j00N5P7n1qJ6k2o2P8PL0n8K0j8M0
$$ -16 58 30 6 -44 15 45 58 -9 2 -18 61 -39 -46 61 14 -86 -31 46 -5 -13 3 -19 -81 -3 4 34 -24 -4 -22 18
4639A8n1jO8l6K7m9l7Q5o6N8j7KQ2o7M7m0mm3QM3j4l6N0l3L2l3O0j6j2o9P5K9
$$ 18 -33 -34 34 -2 25 -24 -61 24 -42 16 -1 1 83 16 63 23 19 -24 -16 27 13 -23 27 -6 26 -7 53 37 25 -44 31 60
4671F0n5l5lK6rJ2O3m8Qn4PP2j07L1j9P5Ol4m0J6K6J7k4rKL5M2o3kLO3r7J4M7
$$ 60 5 -30 -33 -7 -16 -4 59 11 19 -35 -28 44 -63 -32 -51 24 30 -4 -44 -28 -2 15 -9 -18 -16 19 61 -2 -4 -1 62 -35 -21 26
4705B6j9K1o2NO8n0J2k1j7P9m9j1j1K5K8l1K3k6k1L9mk1P0l2J3m8%K0NRJ8lk3
$$ 26 7 28 -34 -29 39 -11 1 -20 -37 42 -7 -18 -29 -4 24 -7 16 -10 -31 8 4 -17 53 21 34 -14 -14 6 11 20 38 35 12
4738A2NmL7l6L9j9p8K7K2%o4O8k3l3N2K5pRj3n0N4pj1k6k1j9J7N6qJ3r%J5k6N7
$$ 12 17 13 50 14 53 34 -44 -17 5 5 -59 9 -14 -47 5 30 23 32 19 -31 23 16 5 -21 -42 -61 -44 12 4 17 8 8 23 -3 54
4773E4q3K5J%j2J4PJ8o7P0J5l5RK2j2k5k5J0N2m3L6p8P5l9L1n5M1rj0L4K9p6J6
$$ 54 -29 -4 -3 -3 -15 -1 6 24 -43 27 42 7 16 38 26 1 -24 -14 38 -5 31 -47 28 -11 20 -35 6 -3 -13 21 50 -26 -10
4806a0l1M3j0rM0J0j3j7m0J6k4K3P4k6o4L1M2p2K5M2ql5RP8m8k5J8k9Q2n9l8m0
$$ -10 -41 2 -8 -17 23 33 20 3 -37 -21 -45 -22 52 26 -38 -7 35 -37 -12 30 22 -13 -4 74 26 1 19 -10 72 13 -25 -65
4838f5K7M6o0J1O3KJ9o9QN8m0k6Jm8N4N2o3j9O0m5K4Oj7N5l9jK3KK2n8k1L0L4
$$ -65 -38 8 -52 -41 22 24 43 -26 -18 40 0 -26 -25 -73 -19 33 -30 -49 11 -34 -10 -4 -21 34 -5 -6 17 19 41 -17 -38 -8 26
4871B6n8O2k3oK4J1l6n7L9J6J8oK8n2m1L6m3M4N8pn0L9p1O1J5rJ4m2M7k4o7J08
$$ 26 -32 30 7 1 25 36 0 -57 -18 -2 16 10 38 -14 -55 -19 -62 -18 40 33 -17 22 -49 12 27 18 32 -10 37 13 -54 54
4903E4p4kQ0m8l2MOK1j0k4K4M5j6j6J1K0rm6L1m2M9j4pk7K1lL4k1l1K0kO0j04
$$ 54 -20 -22 58 10 -22 -18 -12 9 -1 -25 -1 44 28 12 23 43 34 -12 19 -23 26 12 5 -22 -1 -4 30 9 -22 -2 -4 56 -48
4936d8L3j4K1mJ5J1l9L9%K2m4k1N0Jp5R8p1K4J4pnL%j5k1N5j9QJJ0l6L9m1pK3
$$ -48 -15 -29 -8 -12 3 14 -25 14 14 36 -8 -29 21 22 -53 45 -26 -2 12 5 0 3 3 -12 -33 22 3 11 12 22 -14 25 -16 -23 0
4971@KJ0o1Q0n9L0k7OK9j1L0l1m4JQO8n2J1j1Q6n4M0r8K8L5k8M0m5M4l7m8J23
$$ 0 2 12 -49 31 -28 2 -25 -19 10 -1 29 -2 -46 -45 -37 31 -21 -10 -21 65 11 51 -47 -19 16 -12 28 -17 27 -10 -58 65
5003F5n7J5k8L2k7l5N3n6K5n4N6j5m5N6MQl6K9k1j6N2k6L1j3K2n4OJ01n7j7p7
$$ 65 8 23 -5 27 0 -35 18 -38 -13 -67 -11 -26 -71 -15 -11 -3 -39 -10 -31 -47 5 -21 10 -3 19 -35 -29 72 15 -2 -79
5034g9Q6J9n9NM1P6j11M6k3l3K0L2l1OL7q7N1lJ1Kq0O6M6n2N5m9j9k8N8P3r8K0
$$ -79 7 26 -33 -28 13 89 -22 24 1 -32 -12 20 -11 -5 32 -55 -4 -7 4 6 -74 -8 38 -14 41 -8 -27 -55 3 76 -22 -2
5066bm5N0j3K5jJ7%m7K8%oj0L8J2o8K4J01n8p9P6m5K0J3l1J3oj2J1k2l9N2N6p9
$$ -2 -47 3 -10 15 14 31 31 -16 12 12 6 -4 34 46 -22 2 103 45 -34 42 -3 17 30 -1 12 6 -6 5 -17 -56 -4 52 -27
5099b7%K1j0k6K8N8m5rOm6L2nP6q6nL1J5ok9P1l3o4%j0J17l3Jj8j6M4k6m8N8j
$$ -27 -27 -6 -16 -42 -14 44 -1 -10 -4 -50 -18 -23 53 -33 -38 -7 8 2 -27 44 11 -53 -53 -63 54 21 22 4 -12 32 6 -42 16 15
5133A5J4l8NmM6l4Qj2K2l8NNk4K2K5l2K3k1K9j8j1K0LlM0n4N9qk9k1m8Q1Op9M6
$$ 15 29 -9 -4 -8 38 4 12 0 22 -16 -11 -6 -30 -8 17 -15 8 -13 16 -2 -13 7 10 7 47 -7 52 44 15 -6 -54 27 33 -46 0
5168@nM8m6kM9l0l8K5M0n7M0m9m9O0k2JM4OK2o5P8m3m1j4Q0q0J9L6k3j7K7k0q
$$ 0 -5 43 -3 -5 44 14 -24 1 41 -16 24 -25 -74 -14 -36 -35 9 15 37 -28 50 7 -34 -48 32 -48 -29 7 -16 -33 -6 -26 -34
5201c4P6o6K9j8L3j1L6j01Q2j2M7m7m0N5jj5j2lk7O4l2k9M4Jl9JML3p2J9oJ3M7
$$ -34 42 -24 5 -13 20 9 45 -56 26 14 61 14 -26 29 28 13 1 -2 -29 35 3 -26 18 19 -20 -19 -15 18 -54 -35 -41 -28 19
5234A9k2J7l3j8P3j7l5J9qj5K5K6Oko0L0K0k1Q%J1l9RP0n2ko7P3J2jo7P6n2Pm
$$ 19 -3 14 -19 -37 36 19 -16 3 -5 -20 5 31 37 35 -25 5 25 4 12 12 23 -16 -7 63 11 9 -58 15 27 26 -41 35 -17 -10 -14
5269a4k8M8l1K2k9lk9JN0RJ2n4P0l9NM2J6p7M4rJ1OJ1l3m3J18k7p2J9K1K2j03
$$ -14 -42 6 -25 -3 -32 -35 -64 -63 -13 -4 8 -46 24 -15 -10 32 48 -29 15 6 17 23 34 1 -42 76 49 -23 -4 17 39 -64
5301f4L6j2N3jM4qqk4j1M9j02J0L0m0Q4n0pL4m5O4o2K2M8l2Jl5Lj4O1LK3j02O7
$$ -64 -28 -40 13 12 56 48 40 16 5 54 -48 -38 -8 -48 36 -14 -21 13 -32 32 -30 -8 40 8 9 -26 -23 -37 24 27 50 -52 15
5334A5Rk8j7k2M0K4j1J9j3l8l0K0LO4m2Ll4k0kP3J7m0pj1M3j0qNK5o0N0j8J3k4
$$ 15 24 -4 -21 -43 -3 21 10 29 16 -22 -52 -32 -29 35 -7 -4 -38 -58 -60 13 30 -10 -17 -28 15 5 -3 2 27 -33 17 -1 12 -12
5368a2qm3N8J1N9m4o0P5j5o2K8J2p0J07j6j4RJ5j1k1oL4l4k0N1K9l3J8n8K6l4
$$ -12 -20 -63 -5 6 65 21 -39 36 21 -41 -13 -1 -71 36 20 6 15 30 19 -2 -8 26 -8 -28 23 52 19 37 -21 5 -29
5399b9K8n8L3LpjN2no0L7Qk1l1M0l6P1J6m8M3k7j3OM5r7K2L1j6M1k5J6Lrj1N1
$$ -29 -1 -59 -26 -23 -30 -31 21 16 -44 -7 1 -20 -51 -11 -47 24 40 -8 35 8 -5 1 46 -51 -29 2 -14 27 2 18 21 12 1 52
5433E2m3ron9R7n6L1lJ3n1L1j9MM5l9L1Kk8OK9LL0l9n2J08o0lk1lJ1pL6k3p3P8
$$ 52 9 0 -6 -65 32 -24 7 4 17 -34 -3 -22 -18 27 -12 19 21 -7 -1 28 31 61 22 -30 78 18 15 -6 -9 2 -5 31 8 -65 13
5468A3J9j7J1M3p4O2m5j8M3l0Prk0J9kL8m7l9M9Ll8J2%L3o4M5l0M1O2r8Q4r0J00
$$ 13 32 15 26 69 -5 57 12 -6 37 7 14 5 -15 4 2 40 -7 -46 3 6 -32 -20 -20 13 -51 -6 -36 5 67 -31 53 -37 63
5501F3q8J9J3K3n7Q0o3nM2pJl6M8n6LK6L3j0j4J0j3K3k0k2J6mK4l5j1kO7k6l5
$$ 63 -25 -6 7 30 -27 53 -10 -15 27 20 21 -15 33 -23 -20 6 39 29 15 25 12 35 15 -7 9 5 29 -6 -17 -19 48 22 -13
5534a3j2LQN2j7Rn1N1m3j7kL7Pm5J04q4J37j24m6N1mOj0K1K1l4k1LK2j5j3M4q5
$$ -13 -25 -22 -14 38 21 30 -21 30 -13 -30 -32 5 12 -33 71 -13 124 0 -46 5 1 7 -3 18 39 5 -16 -13 9 -6 -19 25 -60
5567f0M2j2P5p7N8k0L5j0p0k6Q0J6j0k5k7j4N1J6ok2O2l0L1l1JJ2m5J6j9mQQk9
$$ -60 -18 -30 45 -32 26 6 41 31 -39 -65 15 31 21 -4 -31 -45 6 22 16 -6 56 26 57 26 27 39 -6 10 -9 -13 -5 3 -26
5600b6P0j8m3kP7p0k3Kj8O5k4L2k2l1N5k7k2j0P6j0m0J4oL2k8K7J9m6L0jjl6o
$$ -26 44 26 -17 -19 58 -12 -35 -33 -51 14 -10 22 0 -31 24 -3 -25 -35 41 31 -9 5 -1 31 3 30 49 3 33 32 31 -5 -11
5633a1N3lo2P3o4J2qk3j8J02m0K9p2K9Qn5K3k5N4j4k2j4K3P6r8L3n2N9No6nN4
$$ -11 42 39 -23 50 -14 -2 -10 -33 -51 51 11 40 -32 -3 5 -50 -27 -52 2 -12 -34 -48 -25 51 -47 -14 -66 -7 -2 -68 -73 -19
5665a9k0O8K1n9ON3j16L4J01l9m6MMl7M8m2K6L4j6%Ro2P6j7j1lN3l3k3J3K5n7
$$ -19 -39 29 50 -9 -3 50 -66 -32 69 30 -16 -12 -8 -45 3 -39 -13 21 5 5 14 -48 28 11 0 -3 50 17 -6 7 32 -25
5697b5K5K6on0jK9J1k3QJ8J5q7Q7Ml8qj6N4o4J3L8L9qk8k2M0k1OJ2j1n5L4j7j3
$$ -25 0 26 20 -30 -31 -2 9 -14 -6 12 27 -60 27 31 -7 -15 -31 23 -41 -28 10 49 41 13 -9 31 10 16 28 17 -38 -4 -21 -34
5731c4N4Mkl6K5l1k0PO1l9K9l3K6j6K5n2L3k9l5J08j22P2l2P6l2On1Q3m3Lj6L0
$$ -34 20 24 22 -14 11 -20 -40 -33 28 -11 18 -15 11 -5 20 -32 1 -28 -63 45 -77 -5 -37 39 7 13 -38 45 2 5 -11 19
5763A9k9J2L6o7J0J7OK8n8L1k6M7m2RJ7Km5J7J4k1J4PQK9k8lm7m6J07K8p4M3l3
$$ 19 -10 2 38 -29 -19 -2 4 32 -26 5 -21 26 -16 -7 10 12 -33 -16 -2 -23 -9 -2 6 35 7 4 -43 -89 18 46 -28 15 -18
5796a8Q7r8jJ8J9jk0Q9o3l3MK0L2nj1j1j9j6K1N0l5l5Q4m9M1o5mp9J06rl9N7q9
$$ -18 69 -29 -30 -12 7 6 -14 75 12 -21 -17 3 35 30 19 8 -11 -27 -6 44 9 -26 58 9 50 -15 -19 -98 8 -1 -40 17 -72
5829g2M8LP0n6J8j3k2O5mp3O9o4N2J9l0j1jK1j9M5K1k2lJn2P0o1L3n7J8L6J5P
$$ -72 -24 -21 49 -7 11 -2 -24 41 37 -36 33 -31 21 40 10 -1 -2 19 0 45 66 44 41 42 -10 60 -1 32 -25 -7 29 44 51
5862E1K2q4L3o3l0J05q0O1m3L2J8o8lM8j9J1%L0m2Pk9O5L2k8n5O5p0O5l2L3J5
$$ 51 73 -11 22 -41 -71 34 -46 15 -28 4 22 -46 -49 -1 -20 -9 -9 21 -21 -14 -43 22 54 26 -29 36 -34 31 -1 32 47
5893D7k2Qm0jj9K9lK1j7k0m4N9Ll2nL2j0L4q7J5K9L0o2K2nN5l0k3R4r1M9p1L7
$$ 47 25 33 -7 -8 -27 2 -1 20 3 -17 -61 -2 1 -31 -36 -4 -14 20 -67 -52 -23 7 -55 -33 -38 17 -13 -36 58 -33 16 -55 -18
5926a8L9l8M9l6M7l9k3M0J6m1j1K4N1j4k7n9K7K6N3p4J9l5M9k9l1k1J2M2k3j5
$$ -18 21 -17 32 -4 43 4 -19 21 37 -4 -15 9 60 46 19 -40 -13 13 66 -8 11 -24 25 -4 -35 -56 -44 -2 -25 -40
5956d0K6K5j7jj2K0n9M3NL6n2k7P8n4L3J1K0j8l4M6n6LK9k9J0O6p7kL1K9J0n7
$$ -40 -14 11 -6 -7 -19 1 -58 -15 -10 26 -26 -53 25 -29 4 15 35 17 -17 29 -27 -24 5 -24 -14 52 -25 -27 4 33 43 -14
5988a4J8Kl0pL9jm8J1L2J6n4Q4k9nJ8k4J6m%k0lpP4p6LN6m0K4j8L5m9Lp4Q1J0
$$ -14 4 6 -24 -31 8 7 -41 -30 2 18 -36 48 19 14 32 8 24 20 20 0 -3 -10 64 -12 -9 47 7 31 13 48 -1 2 -72 9 19
6023A9m4K7jm0L4N3k4k4J8pj6j2K3L8l2n3J5K9l1M7n9j6O3m4L1k0M4L2m9J7KJ8
$$ 19 -25 2 1 -39 -5 48 24 0 18 11 -5 -17 6 44 12 -41 -26 3 -28 19 -40 -56 7 -37 -6 -26 18 50 1 18 20 38
6055C8j03P8L3j0j9o0J9M5n2N0n0K6K8m9N1k6J6m9%Q2n3k5L5Km0M7jj3o6P0k8
$$ 38 -65 13 46 36 17 -43 -24 21 -31 19 -31 -5 23 -26 25 -1 15 -34 -34 48 -5 -30 5 7 -33 14 13 0 -66 4 -24
6086b4L4l3L6m8L4L2l6%M8o5M8n3KQJ2KnL4m3P7p8Rj2M9Qk9L5k0J2k3k8K4l2K6
$$ -24 10 -23 13 -35 -1 31 -5 -5 43 -22 26 -27 -25 -17 -5 -3 -8 26 -17 60 -18 -9 -21 28 36 7 42 22 34 11 -17 7 -25 1
6120AK6l5m3L7jm6K4N3mNm7M1K8m9rQM4p6R2l7Lk3K6P0j25P9l6J1l7M3n2O1l4
$$ 1 27 -8 -51 -14 -15 -61 -37 16 12 17 -30 11 39 -10 -19 -11 33 -43 49 12 15 -8 18 88 -37 42 6 17 -20 23 -29 32 -2
6153bJ3ML9o5K7n8L5J9qm8QJ7k9O4n8M4%l3k8J05o6J0J4pj8oL6n0J6M2K1l0Nk6
$$ -2 11 15 54 -11 16 -42 -7 12 4 -44 -36 -19 -48 16 -42 2 2 -31 -59 46 -20 -10 4 -3 -21 -27 9 -41 -25 17 38 8 13 -13
6187a3N2j5oo3K6kM5N8r0nj0N6m3mK3K0l8J1l2r%O0Po4K7O9o9j8N5p0JO5lj1J4
$$ -13 39 24 18 -45 -19 -21 24 82 -8 -13 -23 33 -10 -14 9 29 -9 2 -30 -39 -39 21 28 -36 -9 60 -9 -27 28 -42 -41 24 21 10 24
6222B4p6L5J9k4Nj2J1N4j0j8j0mM7k5J0m5qL9ppK7K1p0K5L5l1L7p2L8j1J4l3r
$$ 24 -52 -17 2 -22 -17 -29 -18 36 26 8 -2 -6 41 16 26 -19 -27 12 5 -2 25 46 -24 1 36 5 42 -30 8 -3 11 -22 -31
6255c1K6N2p7Nn8Q3K4q5mO2K4m7L6j0L0k5K7n2L3l8O8l3k5j4L1mqpK5N4n6J0m4
$$ -31 -5 47 -30 -25 -83 0 24 -61 -65 -3 21 -26 10 0 30 5 32 -20 13 -25 43 10 -15 -29 2 -2 -10 -17 8 62 6 16 -28
6288b8K9J6nj4JK3p0lM9J4l4l2N9j1Mmk7K4jK1l8oL9n1N1n0M0j7qM1j1MO1j5o2
$$ -28 1 17 12 -2 -1 22 -48 -51 -2 12 -22 -54 5 -6 -2 -6 -33 -9 -10 11 -27 -33 6 -45 6 -44 -4 -21 -29 12 1 5 66 51 -11
6323a1k3rL6qM9k6J3J1Lj8n4J1L7L9j02J0K5l9Q3m2k8M1Km4L2R4p0l0j1k5R4j
$$ -11 -34 -43 -7 -15 34 8 21 32 35 17 -37 -26 11 50 -52 -42 -17 -56 27 -15 -43 -2 0 -44 -12 82 12 -18 -29 -54 40 39
6355C9Km4l8M6rL1m2K2l6M8pJ2rrjj0K2k3L6m5J5J3l1J1OK6l8JNJ3pKm5J1L4l
$$ 39 41 -3 -41 5 -4 27 -15 7 -29 19 12 24 15 6 5 -5 17 -6 30 -15 0 13 -18 -7 -1 25 -13 -12 -7 6 -1 1 -44 -33 1 -2
6391bo1L1J4K8k5M1j5k0L3Kk2N3q8L0K3l0Q1o2pJ1K1j4j2j7K1JK6l6M9r4Q5k4
$$ -2 -63 -32 -18 10 -15 26 11 -9 24 26 4 57 -31 -1 22 -8 73 11 4 15 36 22 10 -7 14 15 41 5 54 -40 45 21
6423B1om9J6lK0m0J9N6p4P3k9J1klk0K6j4k4N0J5l0nK9n8K0j6J7NK7l8K6J7o3
$$ 21 15 -34 -18 -21 -1 -41 -22 34 -40 33 4 15 13 10 -10 16 2 -22 28 43 13 8 37 -21 -1 -17 0 5 32 -6 20 37 -26
6456b6L2k8M7n9M7QL1o3J0nLK5m3K3m7M8j0J9M4r8L1J6m4O0j5kL8k1k8L7m3J9
$$ -26 6 -22 25 -34 13 21 52 -11 -1 -6 -3 22 -21 2 -45 3 -7 12 56 -42 -11 5 -39 21 6 4 42 21 -7 30 -13 6
6488FQL1l3J5k9pLK0qJ9l5nO6j36N4Mj8L7lL6Rk0kj4l2N2Mm9l6K9O5p2J9ml4R7
$$ 6 14 45 12 27 -2 -9 -6 14 6 25 -10 -15 51 -85 -31 -27 -45 -8 -11 25 34 14 12 -2 -34 18 22 -27 -63 -34 31 -41 -22 -26 -60 37
6524C7l9MnLM4L4o5j4L1m2M9M0m4l6k3k0N6j8N1j08M7K6j8j5L5J2m7k4j2M3Rk8
$$ 37 -2 2 -3 0 44 78 13 -1 30 -12 37 77 33 -3 -26 -46 10 -8 43 -65 -18 8 -10 -25 10 22 -25 -49 -61 -18 -9 -37
6556c7L2j8j5N6j8Nnj2j7O9k4k2rj9J9j0M7m3M1L3p6K7jQQ9q0k3JJ4l0L4L8n7
$$ -37 -5 -23 -38 18 0 5 0 -12 -29 40 16 -6 -15 -34 -15 -25 22 -21 20 53 -23 4 3 11 100 20 -3 -2 12 -18 16 54 -3
6589cK8k5JR3j55N1K0l0N5o5K2N6o0J5nk3O0p5L6k5m7O2oJ2m7L6L9L4o4M4n4j5
$$ -3 25 0 1 94 -61 -10 10 -20 35 -30 -8 48 -12 3 -2 -25 35 -40 -4 -29 -76 -14 -20 -8 -55 -19 20 54 -10 34 -20 -35
6621c5N9j5J7n3kO6Kn0L2m6K9jNl9K0k1JJ0k4RL3j5j9K5K2m6K4K6L1n7O9j8j2
$$ -35 24 9 26 -27 -29 37 39 -11 21 -25 4 3 8 -31 -11 -32 -31 -21 -45 -36 -3 -18 -37 -12 10 -36 -12 14 45 -12 57 39 27
6654B7Kn7O7k1m7PN1k1KK7k8J8k9jj1Ml6Q1m2J3nn3Q8j9J1m0Qj4L4l5l7R2q6J2
$$ 27 29 -28 39 18 -29 -22 29 8 10 37 9 27 -2 -3 -14 -10 -46 35 -7 6 1 -52 36 17 28 -12 -4 -18 16 -19 -56 36 -50 -38
6688c8K6L0ql1OK9Qm7M4m2N6m1J2m8Q6l7o5J10OJm7K2l5M2pL2p9J0k2Lk6L4J2
$$ -38 -12 18 10 -21 -15 14 22 -25 19 -23 33 -8 4 -44 42 5 -60 50 56 57 10 32 -3 39 32 64 -15 -5 -27 -24 -50 -16 -4
6721dl6L1n8QK8O9o8k5LKL0O3l3K0m0PO0r6N7nN9n1k9O3q4j9L0P0l0J1L4J1n6
$$ -4 -40 -9 -67 -59 -31 38 -30 -55 -52 -50 -20 43 10 30 -10 -3 57 -39 18 13 72 21 -8 55 -29 -48 -18 52 22 33 67 78 22
6754B2j7m1M5l4J3N2n7j9Q5p6K6J9jm3OLK5j6KqQ%MRn5K9O0m6M8m9j6L6qL0k7
$$ 22 5 -36 9 -25 -12 40 -17 -36 49 -27 -1 18 17 -26 -20 -17 8 -8 -6 -14 -6 -6 -2 7 -48 -19 41 -5 43 -6 -22 14 6 36 9
6789IL5m4jK9j5pJJ8j5j3m3J8L7J4k0mJk5L7l5K2M3o1k1N6j2pNJ2Nj4k2J8pQN
$$ 9 44 0 -1 28 13 6 7 25 10 -3 -46 -28 9 23 3 -1 0 -25 12 -23 -1 42 -19 -40 16 4 -3 2 14 19 5 -17 1 -6 2 7
6825GM2l7k8joO4J5o4M0m3M6ml3J3J4m1m1Q3l1K%j5mN7k0k1m0M3J9ko1L7L3j05
$$ 7 49 12 -16 -17 -23 41 56 -8 32 -11 35 31 -2 11 25 -16 -57 26 -5 -3 -3 -18 -22 35 15 -6 -46 -3 16 14 -47 -10 23 -82
6859h2R8k7O1n1l4QK2M8m8m9Q5o7O3K3Po5K0K8q8J29q7J3J2j8mlO1n6JrRNk1O
$$ -82 16 -11 50 -1 -35 -27 -5 43 -5 -54 31 -36 27 50 57 -8 12 40 -48 81 -6 7 19 1 -3 -6 55 -1 0 -9 0 5 -16 -10
6893a0Rj5%K8J0No1pO4jJ8r0K0K5J4Pj9l9J1O0k0j5m0M6L4k0j3J3m1L8j5J6J6
$$ -10 -1 -16 -16 12 22 27 -34 -41 23 22 40 -50 -30 -5 9 16 -3 -42 -31 29 9 -6 -46 0 34 14 1 14 -27 11 -4 12 28
6926B8o9K7K4%Ql2J0j8QL2oRJ6j5j9l7N5k4Nk6Lm3Q0l1L6m8O6j7k1K0KK8J0q3
$$ 28 -41 -14 10 10 18 -14 -4 -22 -14 18 12 21 37 22 3 -34 21 -3 2 -24 -21 -64 16 -15 21 -27 39 22 1 21 23 51 61 -22
6960b2L7PJ2pr1L0j4Q3J7m8j6J7RJk0L8p3N4qm3M8nk1nj0P6o0N1j7l6L0M0r9K0
$$ -22 15 22 34 27 -64 -34 -48 35 52 4 -12 5 14 15 -5 33 -40 14 6 -37 11 6 -15 -20 -30 46 -14 37 20 -16 14 54 -45 -25
6994b5J4RKJ4l4jJ5j6k4O8l1K1j2LJ6m0O4ko5L2j2j6K7k1K8k1K1r1N1L8j8l5R
$$ -25 -11 -2 0 14 -20 -21 -6 -22 -46 22 -9 12 0 3 19 -21 43 41 -24 8 -4 -20 7 -14 14 -7 14 -77 -26 12 -6 -41 -32
7027c2K7l0m9Q4j6mrM0nM2KQn0J0j7L4oq8N5J7L9n0N2q2L7LJk3N0j1p9Q5k6k4
$$ -32 -5 -35 -84 0 -16 -20 -29 11 6 48 50 58 8 18 1 35 29 -59 -4 13 52 2 54 -28 9 12 13 -10 40 29 -50 35 9 -15
7061a5l0M8j5K9k0J0k5J6k2K4J2J7k7o4M0M2m1nM4l5K2J5kJ9m8M3Mj3j9k0O0j9
$$ -15 -45 3 -12 17 -3 7 -18 -2 -24 0 12 29 2 -62 -22 20 -21 -26 18 -17 5 20 18 37 -11 32 36 23 4 -16 44 25
7093B5l4Q5p8K2J3K6p7j6M1k1MRKm7o0R4K9q6M1O5m7M2n2oM9n5O7m5J1M0Ln1J8
$$ 25 -9 76 -2 20 33 59 -18 -34 7 -14 -10 -1 1 -46 -106 -12 17 -69 -28 37 -10 32 -20 -26 23 -32 35 -10 1 41 44 -7 11
7126A1jL7j7j7K2l5l0k0P5Rj1k6K6j6k3J6j6mJ6j7J4n4J27o8k3j6N6Rn6M7pl3
$$ 11 10 47 30 13 35 0 -30 -50 25 34 23 -3 23 7 -16 0 -16 -20 -4 -21 -7 -61 66 -2 -25 -41 15 24 -32 15 8 -25
7158b5M5k8o3N9l9J7K7rj9K2J4K7l6l7M0LJ9k0J1l5L1KpO9j5l0k8O8p4pK2K0o0
$$ -25 20 -8 -71 -12 -51 -34 -7 -16 -35 -13 1 28 -8 -45 -5 -2 17 -3 8 -27 4 6 -1 68 53 23 -5 63 -11 -18 4 24 -36
7191c6K0K2J6k8K2p2R8lo5K6L1l9M2l2j5oN1k5mJ5pQ%K0n3K8k8j3K4j3l2P0lq0
$$ -36 -16 6 22 -6 16 -56 42 39 -26 0 31 -8 34 2 -13 -19 32 7 3 18 11 19 19 39 -14 14 -14 -27 -3 -16 -48 22 19 -61
7225f1J20n8j2L9j5m7%N2k0k2M5o7M5l2J6L0j2l6JKK1K5k0L9qo0O5n5N7l4J5q
$$ -61 59 1 -11 28 13 -34 -34 18 -2 -24 21 -46 -1 -33 -17 13 1 -35 -34 -32 -11 14 -6 33 25 -35 30 -25 32 -2 13 5
7257El2L5M%M1Lp9L5j8M3n1K3l3K7qK9k6n5Q7mn6NP0n6j0j4O1l9j4nL9k9pj9K1
$$ 5 -27 8 12 12 53 56 -23 12 -6 37 -14 9 -24 3 -5 24 -2 -57 30 26 -30 -25 45 -11 -21 -35 26 -13 -27 -32 7 -22 -29 -48 -27
7292b7l5N5O8j12O4l3nm2J23m7j9L5j4k5N0j8J3qk6L3m9K5m1M2l3J8J8m8J8j7
$$ -27 -62 -7 61 -51 13 -20 -25 -67 56 9 -10 25 11 -14 36 18 31 23 -3 30 -19 6 -35 7 -26 -8 10 -38 -20 -37
7322c7N8pk7j1LJ1k9j0K7P4n8jK4k0jN9m5j2L4rl5K0qL3qNk1k6N3j9K3k9n8N4
$$ -37 21 14 -13 -24 -21 -10 -39 -49 -22 52 -6 -7 17 -3 -4 55 10 -2 32 23 -12 8 0 33 25 30 9 -17 36 17 40 11 -47 7
7356GK4k0o1L8K2NOn0j1N6o1K3M0m6O1n0%M1n7J8k3O1Nj8k1M9j7j9Oj3Nl7j8K4
$$ 7 31 11 -50 -12 10 15 21 -29 -40 16 -45 -22 18 -28 33 -17 -17 24 -33 -15 -38 23 28 10 -11 38 21 2 8 -5 0 -37 -55 -31
7390c1M6Ll5K3r1M4P8m4J0L8p5N1k4J2OJl7M2k0LmL0k1J7n7N0qm9J00m6j4j8R6
$$ -31 15 18 -17 6 -85 -41 37 -7 3 41 -34 17 -7 5 11 12 -25 17 -3 0 -4 26 5 22 -35 15 7 -42 58 12 -2 -20 76
7423G6m6lk3M7Km5J1J9k4L0l8J6l7J3L1l2k3j9N4l4QK5jp9Q2k3j9R0j02OK8l4
$$ 76 30 27 4 51 53 8 19 38 14 44 6 22 -15 -2 29 -3 -26 -45 9 -25 -17 8 7 -72 10 -13 -32 58 -44 -38 -10 -44
7455d4O2LKk8Pk8O2K3r1L4KoRMK8k8j7P7o0N4p1Kk5J4J6m6K7K1L1j5M5q1Lj2j4
$$ -44 18 21 23 -5 2 -26 36 59 -32 2 4 -2 7 11 39 11 -6 71 11 65 -6 -4 -29 -15 1 -45 -18 3 34 19 64 -17 -14 -26 -40
7490d0M6l7J5Rj4j4L9K5J2j2m5j9J4O3l0J7n0Qk1R6l9j8J6l0L2J6m7K0J1O7q5
$$ -40 6 -31 -16 -7 -21 -35 4 29 41 29 -16 -35 -21 42 12 29 -21 -13 -34 62 23 5 21 -9 23 39 -8 12 23 90 5
7521Ej3N8m5j1k8L5Jj6qmL3j5mNqK2J8k7j1K4Ml2j0J5L7K4r7J0N2k0j8P2n0k0
$$ 5 -8 50 5 -6 -34 1 2 -14 -22 -26 7 -8 -12 -7 -15 7 25 -2 -13 11 15 -17 -27 -12 25 49 -48 -38 14 -6 -24 48 -2 -22
7555b2O9o6K2K6m8L6n5L0L4p0M3M0n4j6oN9pj0l0PMNJ2K3k6Mnj0K3k3j1l1M9k2
$$ -22 47 -19 3 29 -19 17 -38 -8 26 -44 -1 39 -15 -31 -37 22 15 5 -25 -18 -14 -9 3 26 0 4 -1 -11 12 -11 -22 -53 -4 -26
7589b6N9k3oQK9q0P8o8P0o3P2o9K4mJ1Nk2K8k3K5Ok0l6K0nM5p6O8j7l2K8qj5J2
$$ -26 33 10 4 12 41 -39 39 -29 41 -22 50 -19 5 1 12 17 -5 23 0 25 31 11 -25 -5 -10 35 -41 27 10 -22 6 -2 -17 -5
7623eJ2k7N5pn5J2K0k3P0o6Q3o7m2O6OJ9r6P8n4J5J6J1j8Qpl4j7R0n4kL0Kjk2
$$ -5 7 -20 35 28 -27 -15 5 -18 52 -14 69 2 -40 26 32 51 -45 33 -21 -6 10 21 3 11 4 -30 -47 43 -11 -13 17 19 18 -4
7657dM0j8j4K5n1P4o2M1l1jj6J6K2n4RP1j7l2l4J5%M6K1m7J9lK1l8K5Qj3Kn2K1
$$ -4 36 18 4 29 -22 52 -10 31 0 -1 -17 -1 21 -33 -24 47 30 -2 -36 -21 -21 25 46 -1 18 15 36 -2 23 31 18 20 -32 -11
7691a1M3k9K1nl8M6j5m6K1J6k0J9l7L7l3M5J1n4QPK4m2M6l5O3l4j0LJj3lN4l9
$$ -11 32 3 24 19 -19 27 12 -34 -13 3 -17 2 -35 2 -31 14 25 -29 -21 -14 10 -32 14 -21 42 8 -2 1 2 -11 -14 40 1
7724AL4n7O5k7qL2m1lL2rJ1K8r4P2l7j8Q9o1l9LkRK9k0jK0oJ5L1nm3K3m9J6jR
$$ 1 35 -22 43 16 8 40 -1 -4 28 19 30 58 -36 36 -1 -19 70 9 -30 -27 -29 -20 9 -11 -12 8 2 17 48 43 0 23 -26 -10 -11 -2
7760bJ6j0l0k3O4J4o8M9L1n0J7l8O0k0l2P2r2N4J0m5K2l6M0q4O4N7n1M1rpqLj4
$$ -2 14 4 -26 -49 15 29 -39 10 41 -9 8 -30 30 10 -22 50 -42 12 22 -23 -1 -37 3 -81 -17 40 -11 30 21 14 6 9 -5
7793eoK8j4k2J1j0O9m0l9j4N1l8kPK6k1L1KL1l0j4N8r9J6R5l9%M1n0k7M0p8K6
$$ -5 -11 17 3 -19 -8 -18 51 11 -28 -42 9 -29 -31 -24 2 -19 12 14 45 15 1 59 -40 -24 71 32 32 73 23 -4 36 -42 -16
7826a6%k0L6l0O9m1Rjj1o8J05p5M7K0m2K6p2N9P5n2m5Q1j2j9k0j3k3P5r5K4K6
$$ -16 -16 -36 0 -30 39 -2 7 6 -5 -73 32 -43 4 24 -18 8 -64 -5 70 18 -27 54 42 23 3 -10 -33 42 -53 -29 -3
7857cJ3PrJ7l6J6J5m4N9o4M9qN2k4p0k4J3M0Nl8K8m8K9M2m8lL8Rj8K8m4M0j6n
$$ -3 10 17 8 25 -11 5 20 -24 35 -29 20 12 64 40 -30 -54 -41 -1 4 -34 -6 -54 -25 17 -31 -34 4 13 -5 23 -21 19 3 -2
7891bj5JL5o0O1Rq1R0j6kOKk4OK2%l6j7K8jlk6J7n2Q3n7ON5j3K5k1n3L0n2N0k8
$$ -2 -17 -16 19 -41 20 29 -52 38 22 20 26 28 4 10 32 32 -4 -21 7 6 3 -23 -6 -58 25 -32 -26 29 16 41 20 -33 -3 -55 -5 -33
7927c3m9O5j1K8J2%n6O1l4J4o7N2M9J1m3J9k4K8l3jL2m1J6l6L4J4k3L6Mk2L1k4
$$ -33 -82 -17 -28 0 12 12 -44 17 -17 -3 -70 -18 31 42 -1 18 -6 22 -11 -12 20 -21 -5 -41 -7 7 -16 20 24 2 33 9
7959Iq9R2m0NP6p2M5L0q3P4j06Q2q4NO3m9L0%M3j0O6j32O4l4j9N3j6PK9p0R5l9
$$ 9 -80 12 -28 -23 53 -19 26 56 -27 47 -59 23 -61 -56 7 -42 -12 -12 31 21 87 -45 19 -15 -34 19 3 10 39 -31 64 25
7991B5n7P4r9M4K7K8kl8j2K6l5L5k0j7oJ6nj0j3jM8qj8k9O1mk1j5L0M5m1mj7N3
$$ 25 -32 42 -57 -13 14 42 40 2 -10 16 -19 16 -4 -21 -27 -11 -16 -26 -39 -40 8 0 -18 -47 14 10 -11 -26 4 49 8 4 -13 40
8025D0ko1O3j8j7nm7O0rK1K0r4O7m0L7N2j00oP2ro9m1P8J3n1K5LM9rJl6k3O1n0
$$ 40 38 -23 40 22 5 0 -47 13 4 25 45 -49 18 -22 15 67 -33 -39 33 24 -45 -86 -8 5 -46 -21 -18 31 22 23 -13 -36 25 -25
8059b5O2o5L1m4L3Nk1N0pk2K4l4J9j5k0Q6j2j7J8m2Qj9m5J1L2k4L8K4k6k4J5j1
$$ -25 37 -28 3 -41 -8 -3 -24 26 19 -3 21 -13 6 -9 -29 57 45 28 46 4 12 -7 -52 -41 -9 -33 5 29 3 -21 -6 -17
8091a7J4k7L6K4m5kN9nmQl6m7K3M1m2N4l5Kj9j5M2N6n0rL7j01Q7j15P4L5k9l8
$$ -17 -3 -30 6 30 -15 -17 42 37 33 41 5 -42 -19 22 -20 34 -1 1 -18 -33 9 65 15 6 43 -58 29 -86 -12 23 -6 -44
8123d4K2O2Km7O1p8l7QQ3rk5J3j6m6NM7J0k5J7l3J6Oj2R5m2ok0qM3p5k3P9j3l8
$$ -44 -22 40 42 -5 56 -22 -59 -51 32 23 -2 11 -5 -51 -46 1 11 -14 3 -30 -14 -8 -20 75 33 27 7 -1 42 -33 -56 23 10 -28
8157b8P7Mp3pN6l7L4o0M7Jk9K8J1j9M0Lo5j2nk9L0L4J8m4Rj1O6q6K9N1l5pL8l0
$$ -28 49 53 -20 -27 29 -8 26 -34 13 14 -15 13 24 5 45 48 -17 -29 -34 -63 -33 1 19 -25 -16 -27 39 -47 -18 33 -2 -9 29 -1
8191a
$$ Imaginary data points
##PAGE= N=2
##DATA TABLE= (X++(I..I)), XYDATA
0@%%%%%%%%%Lj1J6j6J9k7L3m1N1o0P3q9J07j30J54j80K12k46K86l33L82m33M92
$$ 0 0 0 0 0 0 0 0 0 0 3 -8 8 -8 11 -16 17 -24 27 -33 40 -49 58 -72 82 -98 114 -132 154 -179 203 -230 262
32B62n60O35p20Q15r13J020j143J276j422J582j755J944k151K379k626K896l194
$$ 262 -298 337 -383 432 -481 539 -604 672 -750 832 -923 1021 -1130 1249 -1377 1519 -1675
49a675L517l872M269m706N190n732O340p031P823q742R820j1103J2665j4618J7140
$$ -1675 1842 -2030 2239 -2467 2723 -3009 3331 -3700 4123 -4619 5201 -5902 6763 -7855 9285
64I285k0539K5396l2959M6469p7990K89125J78036m38933p4791L5726M222p8723
$$ 9285 -11254 14142 -18817 27652 -50338 238787 416823 -22110 -96901 -61175 -56953 -135676
76a35676P823o4695l7766O0759J02782K0075R7902R8798j03429j94639R7715K54419
$$ -135676 -127853 -192548 -230314 -169555 -66773 -46698 51204 150002 46573 -148066 -50351 204068
88B04068K9459j70519m1523O4703J2093k4877j4847p9671q0991j0463l5436q0954
$$ 204068 233527 63008 21485 86188 98281 73404 58557 -21114 -102105 -112568 -148004 -228958
100b28958P8710K00862J9590j56012P218J87366P6744q0461n5111j7028m0500
$$ -228958 -150248 50614 70204 -85808 -78590 108776 185520 105059 49948 32920 -7580
111g580j2588K0733j4441L920N8024k9447j28467J5396J82789M3868j71298j03272
$$ -7580 -20168 565 -13876 -9956 48068 18621 -109846 -94450 88339 132207 -39091 -142363
123a42363P5542P5466J278K09o010k2435K1671L6150k0969J797P3504j7013j55550
$$ -142363 -66821 8645 9923 10132 4122 -18313 3358 39508 18539 20336 93840 76827 -78723
136g8723n3841J40919R0551q8391q6904K9578N6310K7545J1509k7664m2941Q896
$$ -78723 -132564 8355 98906 10515 -76389 -46811 9499 37044 48553 20889 -22052 -13156
148a3156Q529o0356j7583J04810O0216r3835o6240R3195R8871k8776p2613l2426
$$ -13156 -4627 -64983 -82566 22244 82460 -11375 -77615 15580 114451 85675 13062 -19364
160a9364j2688J766J2277j7547j4584N2413M1602n8344m1247R0931Q1364p5907
$$ -19364 -32052 -30286 -18009 -35556 -50140 2273 43875 -14469 -55716 35215 116579 40672
172D0672j13729M021O4916K2158r463j1538p660K1742L1385k0842l4101L3202
$$ 40672 -73057 -69036 -4120 18038 8575 -2963 -10623 11119 42504 21662 -12439 20763
184B0763K8184q0112q4259N6267J06680k465o9942j3345M2717L7803J0130k6231
$$ 20763 48947 -31165 -115424 -59157 47523 45058 -24884 -38229 4488 42291 52421 26190
196B6190m0460J271K5242k5170l8416M4246O8308l3784q1809J1349P7965J8590
$$ 26190 -14270 -12999 12243 -12927 -51343 -7097 61211 27427 -54382 -43033 34932 53522
208E3522n0638m3215m065K5225K8841n492k4217K0940M6569j6857n3951K0486
$$ 53522 2884 -40331 -44396 -19171 9670 4178 -20039 901 47470 30613 -23338 -2852
220b852O9942r332q4504l7117L8636L6888n351k7057j7713J7358L6750L16l0554
$$ -2852 67090 57758 -26746 -63863 -25227 11661 6310 -20747 -38460 -21102 15648 15964 -14590
233a4590J2141M6437j4295o7389m181P1442L3083m5996m5853Q674L6009J8080
$$ -14590 -2449 43988 29693 -37696 -41877 29565 62648 16652 -29201 -20527 15482 33562
245C3562k1240l9978p303K7613M0l4426P551N8538J5808n0809k2729M9106M6506
$$ 33562 12322 -27656 -34959 -7346 -7306 -41732 -34181 24357 40165 -10644 -33373 15733 62239
258F2239j6692m8801k4774J6273K8432l581l3873p260L3354R103l7752j2228M6159
$$ 62239 45547 -3254 -28028 -11755 16677 13096 -20777 -28037 5317 14420 -23332 -35560 10599
271A0599K9180l7725m4149J3874M6614J9342k2624k9698M035L1804Q070l1502
$$ 10599 39779 2054 -42095 -28221 18393 37735 15111 -14587 -10552 21252 29322 -2180
283b180j6136K7418J3162l9348l1381L1309M6173p290m3424j5141L0937L5836
$$ -2180 -18316 9102 22264 -17084 -48465 -17156 29017 21727 -21697 -36838 -5901 29935
295B9935k796l3013j2565K5354J6313k4053j9182K5520K6451k4764m0953O964
$$ 29935 27139 -5874 -18439 6915 23228 -825 -20007 5513 31964 7200 -33753 -26789
307b6789M3865J6594l1714l4874P016L6022J3179k5722j9932J8774K2290j5109
$$ -26789 17076 33670 1956 -32918 -25902 10120 23299 -2423 -22355 -3581 18709 3600
319C600k3757J5876L4966k941l9222j7672K8141L1537j0844l8329j3088K6523
$$ 3600 -20157 -4281 30685 27744 -11478 -29150 -1009 30528 19684 -18645 -31733 -5210
331e210K1866j5243k1334J2646K5898o829k9514j027L3959J7384k7892l4137Q706
$$ -5210 16656 1413 -19921 -7275 18623 11794 -17720 -18747 15212 32596 4704 -29433 -20727
344b0727L8202J2514k7492k2607J4779K2948q602k4882R33K3788K722k8639j6009
$$ -20727 17475 29989 2497 -20110 -5331 17617 9015 -15867 -14934 8854 11576 -17063 -33072
357c3072K7143L5992n370l5840j0410K9832K2951j7874k9201O20J9979R28j9888
$$ -33072 -5929 30063 24693 -11147 -21557 8275 31226 13352 -15849 -15229 4750 5678 -14210
370a4210m817K4175J9105j7149k8888O022L4667R386l2404k6418J5481K8466m31
$$ -14210 -19027 5148 24253 7104 -21784 -15762 18905 28291 -4113 -30531 -15050 13416 12985
383A2985j9917k487J9676J0095j7182j9003J0106K4032n488l4971j2638L1347
$$ 12985 -6932 -9419 10257 20352 3170 -15833 -5727 18305 12817 -22154 -34792 -3445
395c445K8993j2577k6083L642K3890N387j9145j4391R077J4025r407k3827K383
$$ -3445 25548 12971 -13112 -9470 14420 19807 662 -13729 -4652 9373 -34 -23861 -21478
408b1478L4507J7877k5481k6067J5462K9117m407k8856j1973J3539J2278p092
$$ -21478 13029 30906 5425 -20642 -5180 23937 19530 -9326 -21299 -7760 4518 -2574
420b574j2346P637K4150N467k5427j5881K2636K3844j8153l4383l74K7361J2416
$$ -2574 -14920 -7283 16867 22334 -3093 -18974 3662 27506 9353 -25030 -25404 1957 14373
433A4373j2430j0515Q840J5835r55j9979r974J6826J2718k2118k6434J4700L6139
$$ 14373 1943 -8572 268 16103 15148 -4831 -14805 2021 14739 -7379 -33813 -19113 17026
446A7026N365k3398q337J7522J3776r099j9417o626J1363O617j6371j4742J9531
$$ 17026 22391 -1007 -9344 8178 21954 12855 -6562 -13188 -1825 4792 -11579 -26321 -6790
459f790L0558o214l0673k598K7084R871k1027j8759N054J6327O388q663n777J4803
$$ -6790 23768 17554 -13119 -15717 11367 21238 211 -18548 -13494 2833 9221 558 -5219 9584
473I584J7391j2917k9076L10K5086o72l1845j4590K1025K2789K35r467P93J4260
$$ 9584 26975 14058 -15018 -14708 10378 9706 -22139 -36729 -15704 7085 7320 -2147 -1354 12906
487A2906J1843q992j9228J917J8729m747l0309q180K7020J6101j7947j9465N609
$$ 12906 24749 15757 -3471 -1554 17175 12428 -17881 -26061 959 17060 -887 -20352 -14743
500a4743J5821L741j0848j0429P087J9012K930j5700J848K8359J0874k6617k1852
$$ -14743 1078 4819 -6029 -16458 -9371 9641 12571 -3129 -1281 27078 37952 11335 -10517
513a0517J1263J3623j3723k4601q583R935J3338J554p855O207K5361J1190j9032
$$ -10517 746 14369 646 -23955 -32538 -22603 -9265 -7711 -15566 -9359 16002 27192 8160
526H160j1570K0253J5511k0438k6520K762J7726L390j2102j1384J894J2333K300
$$ 8160 -3410 16843 32354 11916 -14604 -11842 5884 9274 -2828 -14212 -12318 15 2315
539B315j6802r266J8110J6021j3552j4043J9547K8225j396k0012p026P701L838
$$ 2315 -14487 -23753 -5643 10378 -3174 -17217 2330 30555 29159 9147 2121 9822 13660
552A3660j0327j9408r751J1074J1736r655r456J9662K5326o765k1881K552J9253
$$ 13660 3333 -16075 -25826 -14752 -3016 -12671 -22127 -2465 22861 16096 -5785 -3233 16020
565A6020K253j6937j2944K456J2365O131j0212j0849J0250J5134j1126k1817N734
$$ 16020 18273 1336 -11608 -9152 3213 9344 -868 -11717 -1467 13667 2541 -19276 -13542
578a3542K2972k92j9916l637J7794J3906k872j2115o678P197Q742j0671j8882
$$ -13542 9430 9138 -10778 -14415 3379 17285 14413 2298 -4380 2817 11559 888 -17994
591a7994L692J9161j810j9392J473K4300J0490j2968j1569M314J0451K210j1747
$$ -17994 -14302 4859 3049 -16343 -14870 9430 19920 6952 -4617 -303 10148 12358 611
604F11j4160L043J4822j293j6781J106K1848O055j8395r178J3713J1995o645j3483
$$ 611 -13549 -10506 4316 3023 -13758 -12652 9196 15251 -3144 -12322 1391 13386 6741 -6742
618f742m213R292J2221k075j3813m92J6336K451k0356r467J5445R754j3666j2564
$$ -6742 -10955 -1663 10558 8483 -5330 -5822 10514 12965 -7391 -16858 -1413 8341 -5325 -17889
632a7889Q353J6642O476o588r195K432J2494J73j8247q886J4069Q806j4462j0877
$$ -17889 -9536 7106 13582 6994 -2201 231 12725 12898 -5349 -14235 -166 8640 -5822 -16699
646a6699J3663J6142m582j3994l817Q040Q245l306j2985l047J5282J0502j0942
$$ -16699 -3036 13106 8524 -5470 -9287 -1247 6998 3692 -9293 -12340 2942 13444 2502
659B502r385J2559J2514j0963j7318J547J1988J407j0311q749L795J3483O144
$$ 2502 -6883 5676 18190 7227 -10091 -8544 3444 4851 -5460 -14209 -10414 3069 9213
672I213j0676q395J1051J2460r187j4352O550J5277k261j4377l476R909Q396l902
$$ 9213 -1463 -9858 1193 13653 4466 -9886 -3336 11941 9680 -4697 -8173 1736 10132 6230
686F230j2358n572R776R424q890j3059O995J5837k574j3832J862J5420N000j0153
$$ 6230 -6128 -11700 -1924 7500 -1390 -14449 -7454 8383 5809 -8023 -6161 9259 14259 4106
700D106r289K367R386K773j1100j1365O034J3219l133j3576K118J5343K575j2682
$$ 4106 -5183 -2816 6570 9343 -1757 -13122 -7088 6131 2998 -10578 -8460 6883 9458 -3224
714c224n241R559Q648l719j0465l949Q814J0084n164j3119J038J3335Q72j4038
$$ -3224 -8465 1094 9742 6023 -4442 -8391 423 10507 5343 -7776 -6738 6597 7469 -6569
728f569m427J1888O981q023q439M173J1036M028q320r813L564J1682p25j3939
$$ -6569 -10996 892 7873 -150 -8589 -4416 6620 10648 2328 -7485 -3921 7761 7036 -6903
742f903l790J2485O322j0091p354Q201J0151k746j0264l604P788Q684l896j1985
$$ -6903 -10693 1792 8114 -1977 -9331 -1130 9021 6275 -3989 -7593 195 8879 4983 -7002
756g002j326J2394M974j1089p497Q832Q796o043r778K221J0201L687p355q234
$$ -7002 -8328 4066 9040 -2049 -9546 -714 8082 2039 -7739 -5518 4683 8370 1015 -7219
770g219L005J0832J697j1542o519R190Q538o843r400M441J0363n69r432l659P172
$$ -7219 -4214 6618 8315 -3227 -9746 -556 7982 1139 -8261 -3820 6543 5974 -3458 -7117 55
785E5P948k794j0348k486J0276O750q408r657N102R843k733j0354m84R590M799
$$ 55 8003 5209 -5139 -7625 2651 9401 993 -8664 -3562 6281 3548 -6806 -7290 2300 7099
800G099o310p291L052J0303K687r851p680O566R298m539j0805O91J0049K078q316
$$ 7099 789 -6502 -3450 6853 9540 -311 -7991 -1425 7873 3334 -7471 -6780 3269 5347 -2969
815b969m437O556Q012k097r356k739Q644P015o200r673K675J0380O03r275l226
$$ -2969 -7406 -850 7162 5065 -4291 -7030 1614 8629 2429 -7244 -4569 5811 6414 -2861 -6087
830f087P502N195n680p831J561Q758K939p801o610N817R836j445j0058j861Q340
$$ -6087 1415 6610 930 -6901 -5340 3418 6357 -1444 -8054 -2237 7599 6154 -3904 -5765 2575
845B575L810p250o522M451P998p05q049k323Q002P001m963r740M66Q992K031q660
$$ 2575 6385 -865 -7387 -2936 5062 4357 -3692 -6015 1987 8988 4025 -5715 -5249 3743 5774 -2886
861b886n348O202P248k991p247R19Q455L198p328o994L993Q789n24r173l171P898
$$ -2886 -8234 -2032 5216 2225 -5022 -4103 4352 7550 222 -6772 -2779 6010 5486 -3687 -6858 1040
877A040O096m880p352J979P302q0q030l879O425O888l111p813O72R263L963o930
$$ 1040 7136 2256 -5096 -3117 4185 4105 -3925 -7804 -1379 5509 2398 -5415 -4743 4520 8483 1553
893A553o547L506O700j973q005j666P136M411n291o071L610Q484L82q418m310
$$ 1553 -4994 -1488 5212 3239 -4766 -6432 704 5115 -176 -6247 -2637 5847 6229 -2189 -6499
908f499O057O168l587p381P01P804K646o325m513M948O371l199q670j095P633
$$ -6499 -442 5726 2139 -5242 -4541 3263 5909 -416 -4929 19 6390 3191 -5479 -6574 1059
923A059M124n674o050L553Q043Q33o868l072N483M668m675p307J610P602J183
$$ 1059 5183 -491 -6541 -2988 5055 5888 -980 -4052 1431 6099 1424 -5883 -4273 3329 4512
938D512p002l868N636O521k208p360j347O317L662m988n441L720P335n32p145
$$ 4512 -2490 -6358 -722 5799 3591 -3769 -5116 1201 4863 -125 -5566 -1846 5489 4957 -2188
953b188j557O551L818n584p192J103O565J460n938l749N165O869j645o383L81
$$ -2188 -3745 2806 6624 1040 -6152 -5049 1516 2976 -2962 -6711 -1546 5323 3678 -2705 -2324
968b324P178J897o977n157L997O055j752o926j962N936M687l719o239J539O936
$$ -2324 4854 6751 -226 -5383 -1386 4669 2917 -4009 -5971 -35 4652 933 -5306 -3767 3169
983C169Q89o540k486O394N268l645o199R89O189J449o017n546K350N919o94o375
$$ 3169 4058 -2482 -4968 1426 6694 3049 -3150 -2161 4028 5477 -540 -6086 -3736 2183 1489 -4886
999d886j073P084M475m441m568L779O074j050o757l003M178M188k935o371j70
$$ -4886 -5959 1125 5600 1159 -3409 370 6444 5394 -1363 -4366 -188 4000 1065 -5306 -5476
1014e476O598K696n513l811M847N733k571n992N94O366K465m426m814J956N535
$$ -5476 1122 3818 -1695 -5506 -659 5074 2503 -3489 -2895 3471 5936 1510 -3304 -1348 4187
1029D187n2o828l609M830M473l888n329K835P029P70n135k100M439M435k245o235
$$ 4187 4135 -2693 -6302 -1472 3001 -887 -6216 -3381 3648 4418 -717 -2817 1622 6057 3812 -2423
1045b423j635N105L076m841n148L194O187j188n930l79N660K785l801m325J617
$$ -2423 -4058 1047 4123 -718 -5866 -2672 3515 2327 -3603 -3982 1678 4463 662 -3663 -2046
1060b046N346J364m890l986L681N077k575o285K37N976J299n111k687L992M762
$$ -2046 3300 4664 -226 -4212 -531 4546 1971 -4314 -4077 1899 3198 -1913 -4600 -608 4154
1075D154r63m911j473M553L748l598n878J330N983O8n999j742N223L543l193m269
$$ 4154 3191 -1720 -3193 1360 5108 1510 -4368 -3038 2945 3013 -2986 -4728 495 4038 845 -3424
1091c424J175M846J642m295m108K572N505q55n963r62N643K580m585l818K840
$$ -3424 -2249 2597 4239 -56 -4164 -1592 3913 3058 -2905 -3867 1776 4356 -229 -4047 -1207
1106a207M331q76m550j710L715M050j872n160J88N732J751n231l274M014L972
$$ -1207 3124 2248 -2302 -4012 -297 3753 1881 -3279 -3091 2641 4392 -839 -4113 -99 3873
1121C873k437m426M94M562J768l443l927J443M807J40n555k400M880L958l181
$$ 3873 1436 -2990 -2496 2066 3834 391 -3536 -2093 2714 2854 -2701 -5101 -221 3737 556
1136E56m050K346M931o8m381k039K856L413j670n048q83N045K799m346l939K998
$$ 556 -3494 -1148 3783 3715 -666 -2705 151 3564 1894 -3154 -4037 1008 3807 -539 -4478 -1480
1152a480M854j511m640r5M358K129k730l317J022M410Q64m704l478L345M198k486
$$ -1480 3374 1863 -2777 -2872 1486 3615 885 -2432 -1410 3000 3864 -840 -4318 -973 3225 739
1168G39m803R09M978J062l579j957K811L481q60m235j554L741L050l269m676J563
$$ 739 -4064 -3155 1823 2885 -694 -2651 160 3641 2781 -1454 -3008 733 3783 514 -4162 -2599
1184b599M939l4m638j119L948K736k250l290P26L888J410l733l415K430M485j288
$$ -2599 2340 2306 -2332 -3451 497 3233 983 -2307 -1581 2307 3717 -16 -3431 -1001 3484 2196
1200B196n175m62M520J733l609k691K297L648k67l492j327L346L336k250m609
$$ 2196 -2979 -3441 1079 2812 -797 -3488 -1191 2457 2190 -1302 -2629 717 4053 1803 -2806
1215b806M40M624P04m563k278L326L147j681l140M25L561J578k811l395J457M052
$$ -2806 -2366 2258 2962 -1601 -3879 -553 2594 913 -2227 -1802 1759 3337 526 -2869 -1412 2640
1231B640k90m644j471M154K723k780l216J662L602O4l236j684K527L141j347m119
$$ 2640 2350 -2294 -3765 389 3112 332 -2884 -1222 2380 2444 -792 -2476 51 3192 1845 -2274
1247b274l90M262J615l996l109K625L477j222l381q1L490K049k087k895J100L730
$$ -2274 -2664 1598 3213 -783 -3892 -1267 2210 988 -2393 -2474 1016 3065 978 -1917 -817 2913
1263B913L96m295k355L167K966k412l780Q80L737P30k880j575K205L146o28l477
$$ 2913 3309 -986 -3341 -174 2792 380 -3400 -2520 1217 1947 -933 -2508 -303 2843 2215 -1262
1279a262p84L523K107l102l651J516L670m55l666r09L079K183j583k722O73L487
$$ -1262 -2046 1477 3584 482 -3169 -1653 2017 1562 -2104 -3013 66 2249 666 -2056 -1383 2104
1295B104J025l222k556K502L172j448m089j55L498J161k755k242J790L067j41
$$ 2104 3129 -93 -2649 -147 3025 1577 -2512 -2667 831 1992 -763 -3005 -1215 1852 1711
1310A711k826q79L096K548k248l504P99L584N3l819j777K499K320j359k721L95
$$ 1711 -1115 -1994 1102 3650 1402 -2102 -1303 2281 2334 -1485 -3262 -763 1557 198 -2523 -2128
1326b128L178J548k359k318J920L357o27l795r80L106J685k639k656J042K864
$$ -2128 1050 2598 239 -2079 -159 3198 2571 -1224 -2204 902 2587 -52 -2708 -1666 1198
1341A198P2k677j278K438K616j307l080L35L530J149l080k067K030K640j115l032
$$ 1198 1270 -1407 -2685 -247 2369 1062 -2018 -1683 1847 2996 -84 -2151 -121 2519 1404 -1628
1357a628m73K528J411k164k473J317L286J72l152j081K936K284j995k968O31K827
$$ -1628 -2101 427 1838 -326 -2799 -1482 1804 1976 -1176 -2257 679 2963 968 -2000 -1369 1458
1373A458M29k715j518J974K606q82k984k42L004J312k687k526J509K974l39k820
$$ 1458 1887 -828 -2346 -372 2234 1352 -1632 -1874 1130 2442 -245 -2771 -1262 1712 1373 -1447
1389a447n53K610J857j601k443N22K741L28k949j718K200K613j260k937L00K904
$$ -1447 -2000 610 2467 866 -1577 -1055 1686 2014 -935 -2653 -453 2160 900 -2037 -1737 1167
1405A167R77k285j943J419K433m90k628o19K677J884j971k541R45K767n4k979
$$ 1167 2144 -141 -2084 -665 1768 1278 -1350 -1969 708 2592 621 -1920 -975 1792 1738 -1241
1421a241j358K021K140j155k321N39K904R90k237j746J534K307j050l177n87K505
$$ -1241 -2599 -578 1562 407 -1914 -1375 1529 2519 282 -1464 70 2377 1327 -1850 -2437 68
1437F8J444j940k003J283K763J95k380r86K229J761j532k577M00K644N92k476
$$ 68 1512 -428 -2431 -1148 1615 1810 -570 -1556 673 2434 902 -1675 -1275 1369 1961 -515
1453e15j585J610K146q61k628l62K371J282j668j701J520K722p4k427r00K085
$$ -515 -2100 -490 1656 795 -1833 -2195 176 1458 -210 -1911 -391 2331 2257 -170 -1070 1015
1469A015J381j900k711J45K373L98k147j108K177K310o64k062O9K383Q78k261
$$ 1015 2396 496 -2215 -2070 303 701 -1446 -2554 -377 1933 1269 -793 -724 1659 2537 276
1485B76k066J083K199l77k562o36K220J505j616k043P83K307J85k081r64K072
$$ 276 -1790 -707 1492 1115 -1447 -2083 137 1642 26 -2017 -1234 1073 1258 -823 -1787 285
1501B85K056q64k284L7K176O56k314k020J031J939o03k054o5K404J621j255j692
$$ 285 2341 1477 -807 -770 1406 2062 -252 -2272 -1241 698 95 -1959 -2024 380 2001 746 -946
1518i46Q44K185O1k633j384J605J617j167k132M20K327O98j824j202J297J880
$$ -946 -102 2083 2144 -489 -1873 -268 1349 182 -1950 -1530 797 1495 -329 -1531 -234 1646
1534A646o57k281l32K135J375j510j834R74K306k22k388r02J637J160j242j858
$$ 1646 989 -1292 -1624 511 1886 376 -1458 -484 1822 1600 -788 -1690 -53 1107 -135 -1993
1550a993N95K305P99j756j248J526J933q42k562l45J983P79j715j402J195K100
$$ -1993 -1398 907 1706 -50 -1298 228 2161 1319 -1243 -1588 395 1174 -541 -1943 -748 1352
1566A352k8j803o79J740J349j463k188L40K117M06j920q57J726J723q39j786o2
$$ 1352 1324 -479 -1158 582 1931 468 -1720 -1380 737 1143 -777 -1634 92 1815 976 -810 -872
1583h72J729N53j781j633J095K016j88j955l79K108J203j428j743O39J663p5j781
$$ -872 857 1410 -371 -2004 -909 1107 919 -1036 -1415 693 1896 468 -1275 -636 1027 952 -829
1600h29p69J473J704p26j928J22K039N97k102j516J155J616n22j602OJ937J230
$$ -829 -1598 -125 1579 853 -1075 -953 1086 1683 -419 -1935 -780 836 314 -1288 -1282 655 1885
1617A885j063j464N75J710j37k321j067J435J366j089j635N81K038N57j486r06
$$ 1885 822 -642 -67 1643 1506 -815 -1882 -447 919 -170 -1805 -1224 814 1371 -115 -1021
1633a021J088J457n13j897l03J810J049j477j538R36J776l60j957o89J330J044
$$ -1021 67 1524 1011 -886 -1189 621 1670 193 -1345 -409 1367 1007 -950 -1639 -309 735
1649G35r98j350N31K065O14j355r77J380J476j013k149j90J489L92j451j125J059
$$ 735 -263 -1613 -1082 983 1597 242 -735 645 2121 1108 -1041 -1231 258 650 -801 -1926 -867
1666h67J720P1j432m28J504J177j192j847M38J863N4j632o89J394J306p24j466
$$ -867 853 924 -508 -936 568 1745 553 -1294 -856 1007 1061 -571 -1260 134 1440 716 -750
1683g50j21J277N37j505j197R08J878j67j610r6J813Q84j283j483L51J316j32
$$ -750 -871 406 943 -562 -1759 -851 1027 860 -750 -846 967 1851 568 -915 -564 752 620
1700F20j534p24J269J502n84j450K40J835L88j797j154R40J362o48j340m0J591
$$ 620 -914 -1638 -369 1133 549 -901 -661 1174 1562 -235 -1389 -449 913 265 -1075 -1115 476
1717D76R61r74j193M51J516k21j914p44J407J086r00j229O36J569M46j221r29
$$ 476 1437 463 -730 -279 1237 1016 -898 -1642 -235 851 -49 -1278 -642 927 1373 152 -777
1734g77Q04J125n25j686k24J571P45j194j042R97J389k63j551n07J100Q08p92
$$ -777 27 1152 627 -1059 -1283 288 1033 -161 -1203 -206 1183 920 -631 -1138 -38 770 -22
1751b2j215M22J679M70j241q28J209J169r35j769j03J207L73j204q11R47J549
$$ -22 -1237 -815 864 1334 93 -735 474 1643 708 -1061 -1164 43 416 -788 -1599 -652 897
1768H97Q0j199l44J302Q72j132j585M71J444j52j329m25J111J072n78j368m0J151
$$ 897 977 -222 -566 736 1608 476 -1109 -638 806 654 -675 -1100 11 1083 505 -863 -903 248
1786B48M65j182r18R83J497j63j251l1J375O11j210j280J33J004j55j211n40J148
$$ 248 713 -469 -1387 -404 1093 930 -321 -352 1023 1634 424 -856 -723 281 126 -1085 -1625 -477
1804d77J335m24j122M02J427K80j335q99P38J005n10j302m5J191P23q99j103M62
$$ -477 858 434 -688 -286 1141 1421 86 -813 -75 930 420 -882 -927 264 987 88 -1015 -553
1822e53J262j19j538l84J323R77o13r50M70J232K92j267q65O14Q13n98j394q7
$$ -553 709 590 -948 -1332 -9 968 355 -595 -125 1107 1399 132 -733 -119 694 96 -1298 -1385
1840a385J354O82q64o85Q48J303j99j243l91Q95N73q03j133K99J327K43j116o21
$$ -1385 -31 651 -213 -898 -50 1253 1054 -189 -580 315 888 85 -1048 -749 578 821 -295 -916
1858i16R50R01o76j255N3J206M80r11o84P76J202j05j219l82J003M96j048j113
$$ -916 34 935 259 -996 -943 263 743 -168 -852 -76 1126 1021 -198 -580 423 919 -129 -1242
1876a242L73J243mr38k63J069R19n04j015j0R53L01j162p95P64J013k99j087l5
$$ -1242 -869 374 370 -568 -831 238 1157 653 -362 -372 581 882 -280 -1075 -311 702 403 -684 -719
1895g19J092N03q66r13L34J094M8j065l81J074R26o00j056K55J065K7j226p74
$$ -719 373 876 10 -903 -569 525 573 -492 -873 201 1127 527 -529 -274 791 818 -408 -1182
1913a182O72Q93l23r19l9J253O27o44q58N03J013j97j147m17Q62O49o87j004L83
$$ -1182 -510 383 60 -859 -898 355 982 338 -520 -17 996 799 -348 -765 97 746 59 -945 -562
1932e62J009J89r36o39P42R53m52j043P2J181M52q70o59N80R22k75j131l96P69
$$ -562 447 636 -300 -939 -197 756 304 -739 -667 514 966 96 -563 17 939 664 -467 -863 -94
1951i4N73o88q81L99J152K77r11l65Q89Q01n67j082j6Q58K71q70p22N19J023j07
$$ -94 479 -209 -1090 -691 461 738 -173 -538 351 1152 585 -497 -513 345 616 -254 -976 -457 566 459
1971D59j063q2R75N96p46q50L96R70J9r57m71R37O69n82r89J27Q89K01r04n74
$$ 459 -604 -686 289 885 139 -711 -315 655 674 -283 -754 183 852 270 -719 -592 297 498 -406 -980
1991i80P38R56k26r00O6R61M33p86p66K56P64j34j055l78Q29P05m51p03L14J045
$$ -980 -242 714 488 -412 -346 615 1048 262 -504 -248 516 382 -673 -1051 -222 483 32 -671 -357 688
2011F88K36q98n11N72P12m27r84k4Q27M52p24p25N11Q36j62q94k52Q47N93n03
$$ 688 924 26 -485 87 799 372 -612 -636 191 643 -81 -806 -295 541 379 -515 -767 80 673 170
2031A70p90L43R92R7p64n11O16N83n00j034l2R34L09p26n22O29R45j18r10q9P24
$$ 170 -620 -277 715 812 48 -463 153 736 236 -798 -830 104 413 -313 -835 -206 739 621 -289 -378 346
2052C46M15o96p93K74Q46R0p69k85Q48N97n38q63LP76N2p19m86O02Q62j60p29
$$ 346 761 65 -728 -454 392 482 -287 -572 276 873 335 -528 -525 251 303 -416 -902 -300 562 402 -327
2073c27LQ62L72p01p32K85O90j35q71k70P26P09m29o89J40P97J51q57m59N21P69
$$ -327 -324 538 910 209 -523 -238 452 317 -554 -824 -98 611 182 -507 -367 430 581 -276 -735 -214 555
2094E55j86p72P6Q79M06p43o63K28O88l21r30k80P83O07l41n23L22R63J95p62
$$ 555 369 -403 -327 552 958 215 -448 -220 468 147 -783 -1063 -280 327 -14 -537 -215 748 943 181
2114A81n24M52N73n52q91J6P50M42o07m57M73P25j45q36j85P01M42m45o43L76
$$ 181 -343 109 682 130 -761 -745 5 447 -160 -617 -144 581 436 -400 -585 116 558 113 -530 -154
2134a54P87J26p06m48M65M67m99r29lP86L47n24l07O40Q19n2p85j90O09J88p43
$$ -154 633 759 53 -395 70 537 38 -891 -894 -108 239 -285 -592 48 867 815 30 -160 449 637 -106
2155a06p30K04P80L8n76k02O76O19l51q37J22O73J24o56m23N67P88j81o81j12
$$ -106 -836 -632 148 186 -390 -592 84 703 352 -485 -363 310 434 -222 -645 -78 710 529 -152 -264
2175b64O09K82p02o62K21O84m9o78p8Q65N64l22n65J08O13n0p72n19L45O27j43
$$ -264 345 627 -75 -737 -516 168 119 -559 -637 228 792 470 -95 13 626 576 -196 -715 -370 257 114
2196A14n98J07P65L22o03n57L53M33j71o70j95P34N09k75n51J96P63%q02l95L96
$$ 114 -484 -377 388 710 107 -450 -97 336 165 -505 -700 34 543 268 -283 -87 676 676 -126 -521 -125
2217a25M78m46o39J60P87L82m83m18L27O07k13p75j96N87L71m97m32M18O98K8
$$ -125 353 -93 -732 -572 215 597 114 -304 23 630 417 -358 -554 33 404 -93 -525 -107 591 619
2237F19o51l35M19L46l94p07J8P59J97m52l18O88N99k27p42j22N31J76n47n84
$$ 619 -32 -367 52 398 4 -703 -685 74 271 -181 -499 189 788 561 -181 -303 228 404 -143 -727
2257g27L85O54P1n80k24N73M01l95o86J29O08M3n23k29N67O30j95o27o0M80K40
$$ -727 -342 312 383 -197 -421 152 553 158 -528 -399 209 252 -271 -500 67 697 502 -125 -185 295 535
2278E35p55n21L04N46nn47J2O71M46m20n06Q5O09J6o92m09M74N49k43n49N6O79
$$ 535 -220 -741 -437 109 104 -443 -431 240 686 266 -240 -155 454 470 -222 -631 -157 392 149 -400 -344 335
2300C35J57n83m51L64N32j39n86j01O48M91m11m70J32N44m5o88m14N01L85l59
$$ 335 492 -91 -542 -178 354 215 -371 -472 176 667 256 -214 -82 462 417 -271 -685 -184 201 -158
2320a58l85K33O28K13l72l70L51M11j61o99j65N12L10m63l85L02N78o4n34j99
$$ -158 -543 -310 318 531 159 -211 140 551 390 -309 -474 38 348 -115 -500 -198 380 316 -218 -417
2340d17N00L38l26n14J20O61K05n70k47L90L38k73n74m4M30K09m51l49L35O28
$$ -417 83 421 95 -419 -299 362 567 -3 -250 140 478 205 -369 -413 17 226 -225 -574 -239 389
2360C89N0n30j21M72L21l66n52J41M18L7n16j89M55M10k59n08o0O08J93m44m03
$$ 389 439 -91 -212 260 581 215 -337 -196 222 259 -257 -446 9 419 160 -348 -408 200 393 -51 -454
2381d54L51N35j13m95o1M82K51m54m48J68M21N7m77k60M36N07k78m26ON52J23
$$ -454 -103 432 319 -176 -237 245 496 42 -406 -238 183 240 -237 -497 -61 446 168 -258 -252 300 423
2402D23m27l41K58L83k04l95p2N13K61l81l86J68M85N4n80p9L84L05k66m36J09
$$ 423 -4 -345 -87 296 92 -303 -375 138 399 18 -368 -200 285 339 -241 -320 64 369 103 -333 -224
2423b24N05R5m76l38L18M98j70m88l5M65K98m49k98J91M63m4n37j66M04L42l26
$$ -224 281 376 -100 -438 -120 378 208 -280 -315 150 448 -1 -299 -108 355 311 -226 -392 12 354 28
2444B8m96J87N41O2m96j72L78L26j04m46k2M98J49m74k83J55M84j55m85j23M78
$$ 28 -468 -281 260 322 -174 -346 32 358 254 -192 -214 284 433 -41 -324 -169 315 160 -325 -448 30
2465C0L11k66m27K17M74M2m44k11L42L22k44m10nL92K14l97l47K33M55j81l73
$$ 30 341 75 -352 -135 339 381 -63 -274 68 390 146 -264 -269 123 337 -60 -407 -174 281 100 -273
2486b73m4M38K20k62l75J95M34N0n26k11L55K86k48m59J23M31J65l43k35K96L81
$$ -273 -317 121 341 79 -296 -101 333 383 -143 -354 1 287 39 -420 -297 134 299 -44 -279 17 398
2507C98j36m77m6L93J22l43k88K44M25K3m31q3K78L23l13m08P3L88J26m22k07
$$ 398 262 -215 -261 132 254 -89 -377 -133 292 315 -116 -199 79 402 89 -319 -246 142 268 -154 -361
2528c61L23L92j51l94j31M21K52l68l20K15L70n4l19j23L53K83k78m58J09L79
$$ -361 -38 354 203 -191 -322 99 351 -17 -337 -122 248 194 -125 -248 105 388 110 -348 -239 140
2548A40k5l08k69M85L62j86k91lL82J10l71l88J54L78j12m26J8L78L58k91k85
$$ 140 115 -193 -462 23 385 199 -92 -95 287 397 26 -362 -208 170 58 -368 -350 28 386 95 -190
2569a90J76M22m8m76j07K02K81j76l38K8M14P2l26l37K11L62p2l67k8M36L24k85
$$ -190 -14 408 360 -116 -223 -21 260 84 -254 -226 188 260 -66 -403 -192 170 98 -269 -297 139 463 178
2591A78k53Q1L78l8n21k12K75K21k88k76P5N37J14j85k62K98L56j84m56n3L42
$$ 178 -75 6 384 346 -175 -387 -112 109 -179 -455 -380 157 271 86 -176 122 478 294 -162 -215 127
2612A27J36l26k74J68L41J4l76j28L27K85k79k90J49L78J9k37j19K50K92k00m22
$$ 127 263 -63 -337 -169 172 186 -190 -318 9 294 15 -275 -126 252 271 34 -85 165 457 257 -165
2633a65j48K95Q2k51k60K05M36Pk69J6K87J98k93k62j3L58l4l40j71K46L91j77
$$ -165 -313 -18 64 -187 -447 -242 194 201 -68 -52 235 433 140 -122 -135 223 189 -151 -322 -76 315 138
2655A38l21O3K95M3l01k43K73L05j01k93o6L89K14l15k41oL39r2l60q0L12K53
$$ 138 -183 -120 175 218 -83 -326 -53 252 151 -142 -208 181 395 80 -161 -167 172 80 -280 -360 -48 205
2677B05j44k22J06L14L1k81k25J34K20n0l69K3L21K16k69j99J70L01k6l88j60
$$ 205 61 -161 -55 259 290 9 -216 -82 138 88 -281 -258 63 279 10 -189 -19 282 256 -132 -292
2698b92K52K22j44k60O8M24J9k71j98J88K32k04l21%L50J21j99k14K14K69Ll08
$$ -292 -40 182 38 -222 -154 270 289 18 -180 8 240 36 -285 -285 65 186 -13 -227 -13 256 259 -49
2720d9j56K52J36j97l04J22L14J05l01q9K22K14j26l24%K73O3k81j39J65L62o4
$$ -49 -205 47 183 -14 -318 -196 118 223 -78 -167 55 269 143 -181 -181 92 155 -126 -265 -100 262 198
2742A98k43q5K31J33k11l05P5K88P4k76r9K85J90j04k96k9L22M5k81j86K11K38
$$ 198 -45 -130 101 234 23 -282 -207 81 155 -121 -220 65 255 151 -145 -174 148 193 -88 -274 -63 175
2764A75n4k10j31L14J41j82k74J60K14j8l24l7J93K45j43k69Q4K77P1l04j82J59
$$ 175 121 -89 -220 94 235 53 -221 -61 153 135 -189 -226 -33 212 69 -200 -116 161 232 -72 -254 -95
2786i5K85j21k01k8K58J30k18j83M7K90p3k69p2K44J74j04k00K9K60J35l03j66
$$ -95 190 69 -132 -160 98 228 10 -173 -126 164 91 -178 -250 -6 168 64 -136 -107 153 288 -15 -181
2808a81K02K03j66k67RK92R9j90k24J48K66n1k59j35K71J78j55j61OL63n3k62
$$ -181 21 224 58 -209 -200 92 191 1 -223 -75 191 140 -119 -254 17 195 40 -121 -115 248 195 -67
2830f7o9J60J86j12k77j7K86Q3k12j58J17K75r0k30jJ99J09j59k21J32K51m4k19
$$ -67 -136 24 210 98 -179 -196 90 173 -39 -197 -80 195 105 -125 -126 73 182 23 -198 -66 185 141 -78
2853g8j17K29J82j73k50N9K70J3k30r0J79K07k9k72k9K41P7k05j66J42J87o7j91
$$ -78 -195 34 216 43 -207 -148 122 135 -95 -185 -6 201 172 -100 -129 112 189 -16 -182 -40 147 80 -111
2876a11j28K75J38j50j71P9J99O0k49r1J76J66q0j96p2K36J42k86p7O9K42m9k51
$$ -111 -239 36 174 24 -147 -68 131 191 -58 -149 27 193 113 -83 -155 81 223 -63 -140 -71 171 122 -129
2899a29k7K41J23j50k52P1L36j1k57j20J89J75j19k19LK39R6j99k23J77K21k4
$$ -129 -156 85 208 58 -194 -123 213 202 -55 -175 14 189 70 -149 -146 93 189 -10 -233 -56 165 141
2921A41k20r8K61Q4j52k32Q7K39p6j23l1J20K06j25j99MK65O1k38k13J60K36l2
$$ 141 -79 -177 84 168 16 -216 -129 110 34 -89 -120 0 206 81 -118 -114 151 212 -26 -239 -79 157 125
2944A25k88K7K06J60k27j53M4J73O5l01j9K09J62j38k00N8J80L2j64j29J76J31
$$ 125 -163 -136 70 230 3 -150 -106 67 132 -169 -188 21 183 45 -155 -97 83 115 -49 -178 -2 129
2966A29q1k12j9L02M9j36k15J34J62N1k65p8K11J12j52j22O9K20O3k92r1J77J78
$$ 129 48 -164 -183 119 168 32 -183 -49 113 164 -101 -179 32 144 -8 -130 -61 159 222 -70 -161 16 194
2989A94j17k29j8K21P0j40j32J49J67Jl21K9J70J02j38k18J45J61mj05j27J00
$$ 194 77 -152 -170 51 121 -19 -151 -2 165 166 -155 -126 44 146 8 -210 -65 96 92 -13 -140 -40
3011d0K28j33j10p8J63R2j71q2P7K24q5j81kJ61Q7j65j39O9J90J3j44n3J29J48
$$ -40 188 55 -55 -133 30 122 -49 -131 -54 170 85 -96 -98 63 150 -15 -154 -85 105 118 -26 -79 50 198
3035A98j06k44Q2J91o6j51k10K50J59n2j56pK13J57j82j59M6J68k4j88r9J92J04
$$ 198 92 -152 -70 121 55 -96 -306 -56 103 51 -105 -112 101 258 76 -83 -37 131 107 -81 -180 12 116
3058A16j42j34P0J54M0k14p4J21J98J7k04j7K13O6j90j55O5J42n3j24j38J83J67
$$ 116 -26 -160 -90 64 104 -110 -184 -63 135 152 -52 -69 144 210 20 -135 -70 72 19 -105 -243 -60 107
3081A07p1j58Q4K18K9j81j25K17O0j28k01j1K36J0j48j24J71J86m5k57L4J80P4
$$ 107 36 -122 -38 180 209 28 -97 120 180 52 -149 -160 76 86 -62 -186 -15 171 126 -131 -97 83 157
3104A57j61j51J25K07m9j78m2R2R5r8j80Q5J40Jq8j35K22J63q4j65l0J10J37k52
$$ 157 -4 -155 -30 177 128 -50 -92 0 95 -3 -183 -98 42 43 -45 -180 42 205 121 -44 -74 36 173 -79
3128g9p3M2K13o5j06r2J70J30j05p3l2K13k6j53r5J46J25n1j72L1J10N1k14n2
$$ -79 -152 -110 103 38 -68 -160 10 140 35 -38 -70 143 117 -36 -131 15 140 89 -83 -52 58 109 -105 -157
3152a57N9J30L0j46k1J47J35q8j86Q2J13l0k05j05K31J30n9j78j0J90Q1j14j39
$$ -157 -98 32 62 -84 -105 42 177 89 -97 -15 98 68 -137 -242 -11 119 60 -118 -128 62 143 29 -110
3175a10M8K03n0j27p6J72R4j49j06M9J18L9j56o1J32R2j21j21M1J59Q3j80j05
$$ -110 -62 141 91 -36 -112 60 154 5 -101 -52 66 105 -51 -112 20 112 -9 -130 -89 70 153 -27 -132
3198a32R0J70m1j63q3K21K9j16p4O1J32Rj59m8J32J29r1k24Q8J76J8j21j15J50
$$ -132 -42 128 87 -76 -159 62 91 -25 -99 -38 94 103 -56 -104 28 157 66 -158 -70 106 124 3 -112 38
3222C8Q5n5j47l1K02K1j39j05R8J71n5j23k4J44j4m4j36J7J68Lj18o6Q0J12n7
$$ 38 123 68 -79 -110 92 113 -26 -131 -33 138 83 -40 -64 80 66 22 -114 -97 71 74 -44 -110 -30 82 25
3247B5j28K5J43Jo1j46J13J19j0j72l3J90M6j11j27M7R6O3j06j04J50J18p1j38
$$ 25 -103 -78 65 66 5 -141 -28 91 81 -91 -124 66 112 1 -126 -79 17 80 -26 -130 20 138 67 -71
3271g1L9J05M7j33j60J74J03m8j26l9J64K3o0j03L0J16Jn9p6J00P3n2r2m4J70
$$ -71 -32 73 120 -13 -173 1 104 56 -70 -109 55 78 18 -85 -55 61 62 3 -73 27 100 48 -44 -88 82
3296H2J8j05j33P0J43o6q7k1J37j6%j12N6J61q1p5l1Q2P2l5j56M3N6R1j42q5J05
$$ 82 100 -5 -138 -68 75 9 -78 -99 38 22 22 -90 -34 127 46 -29 -60 22 94 59 -97 -54 2 93 -49 -134 -29
3323b9J64m1j18mJ13P4j75m1K8K33j56r4m3J05J6kq0J7J37r6mr4R7J00j9j63K8
$$ -29 135 94 -24 -28 85 159 -16 -57 -29 204 48 -46 -89 16 32 30 -50 -33 104 8 4 -90 7 107 88 -75 -47
3350d7Q3J15j84p8R8P5L9j77oJ65rj3j65P5J20N3j52p1O5J36j12j27R0L4P6p3
$$ -47 36 151 -33 -111 -13 62 101 -76 -82 83 74 61 -104 -29 91 144 -8 -79 -14 122 10 -117 -27 7 83 10
3376A0j03Q5J35r1j06L1J09Kj41o0O1J58n9j09k2J72op5k9k0J74k4r6j07J29O0
$$ 10 -93 -8 127 36 -70 -39 70 72 -69 -129 -68 90 31 -78 -100 72 66 -9 -38 -58 116 92 -4 -111 18 78
3402G8m3r7k9J55M8j31o2N1R9%q2k8P3P7q3p4L7J00j2q5j15J31M2J7j37PP7O3
$$ 78 35 -62 -91 64 112 -19 -81 -30 69 69 -13 -41 32 109 26 -48 -11 89 77 -8 -123 8 50 67 -70 -63 14 77
3430G7q9j17J02P9l4k3l2N3J03r4o2J1P1m2Rj02J28L5l7j05LQ0Q6j05o7M0P4Q
$$ 77 -12 -129 -27 52 18 -5 -37 16 119 25 -37 -26 45 3 12 -90 38 73 36 -69 -66 14 100 -5 -72 -32 42 50
3458E0j26rR2R6j07n5K8J37p5l6o7Q9M0l0j10NR6O2m5j23Q0J21q4o7mO8O3o6j08
$$ 50 -76 -85 7 103 -4 -59 -31 106 31 -5 -72 17 57 27 -83 -78 18 80 35 -88 -8 113 29 -38 -42 26 89 23 -85
3487h5O4J19k1j19j0L6J08o8j02L4J22k1q7%L5R6n5j19KR9L2l8r5O8J17p5n9n4
$$ -85 -21 98 77 -42 -52 -16 92 24 -78 -44 78 57 -30 -30 5 101 46 -73 -71 28 60 22 -73 -5 112 37 -22 -76
3515g6R4N8j04q1jJ53L0j06J9M6N3k7j46NJ31M3p4r7L1R9L0j50M7O1O5n1j15M1
$$ -76 18 76 -28 -109 -110 43 73 -33 -14 32 85 58 -88 -83 48 91 17 -80 -49 50 80 -70 -23 38 103 52 -63 -22
3543b2J12m3m1Qj1O3p4o6JJ01Mj7j20J46J8k2j31O8M4P0q7p3O1R0l0j10j0R5L3
$$ -22 90 47 6 14 3 66 -8 -74 -73 28 32 15 -105 41 59 37 -94 -26 18 88 1 -72 -11 79 49 -61 -71 24 57
3572E7j4j32P2O4J3m1q0P0O7k4q0JP8j4q3l4O1N6rj05k9J22Qj3m1KQ3mq0KL3O0
$$ 57 43 -89 -17 47 60 19 -61 9 76 52 -28 -27 51 37 -46 -80 -19 37 28 -77 -106 16 24 11 -30 -28 55 51 -29 -27 6 66
3604F6l9r6K4Q4K6n1p3J09K4n3l3k3O9K2p6k4JJ43p5j9k0Q2j7m7p6J1J29l4l7
$$ 66 27 -69 -45 39 65 14 -59 50 74 21 -12 -35 34 56 -20 -44 -43 100 25 6 -14 68 51 4 -72 -61 68 34 -3
3633cn5O0N3m5L3n7Q6j6o5o7Q4J1J6m1o7J21Qj7o7kJ9O9q1o5P0L5J7q2k9J23L3
$$ -3 -58 2 55 10 43 -14 72 56 -9 -76 8 19 35 -6 -73 48 56 39 -28 -30 -11 58 -23 -88 -18 17 34 -48 -77 46 79
3664G9o6o1L7M8o5Op3Q4M7n2k4J2R7p8k1j6Q1J0k6p6K7Q7K1r0lk0P4J4q6k7P3
$$ 79 13 -48 -11 37 -28 -22 -95 -11 36 -16 -40 -28 69 -9 -30 -46 35 45 19 -57 -30 57 78 -12 -15 -35 39 53 -33 -60 13
3695A3R2r7l2K1O8J4q0n2L6Q0n9j01J03P3%l5o0P5%J2j40N7K0Q4j21l7P0N6J1
$$ 13 105 8 -24 -3 65 79 -1 -53 -17 63 4 -97 6 79 79 44 -16 59 59 71 -69 -12 8 92 -29 -66 4 60 71
3724G1j35K0KO6j9l2l5R1J8n5n2O0J10l1j00L4M5N1j43o6J24K8K9j20Q9jJ7j9
$$ 71 -64 -44 -42 24 5 -27 -62 29 47 -8 -60 0 110 79 -21 13 58 109 -34 -100 24 52 81 -39 50 49 66 47
3752D7p5l7J47l2p5m8O3N1n3n2O8NK7l9m1k2J06Nl7n1M6M6n7ml8R5J8q5JR1k6
$$ 47 -28 -65 82 50 -25 -73 -10 41 -12 -64 4 9 36 -3 -44 -66 40 45 8 -43 3 49 -8 -12 -50 45 63 -22 -21 70 44
3783D4k7n9N1J8J0q1L9k8N7k3r9R5PP2m2j00N9N7J9j09K8J0J7j6m1L4KPK9q6N3
$$ 44 17 -42 9 27 37 -44 -5 -33 24 1 -98 -3 4 76 34 -66 -7 50 69 -40 -12 -2 15 -1 -42 -8 -6 1 30 -56 -3
3814cM5m0q8j1R0J01m5q8M8P5j3j14K2N7j6Jp8M4K1K2n5j9J7J02j7p8nJ20n1l6
$$ -3 42 2 -86 -97 -7 94 49 -39 9 84 71 -43 -21 36 20 21 -57 -13 8 30 -25 -44 -27 75 58 -20 -25 95 44 8
3844Hp0L2O7J3r6lR3qm7K1kR3p1r0M8j1J8N5q2m7P1qK7o4J9J07k3o5J0RL6m6p8
$$ 8 -62 -30 37 50 -46 -49 44 36 -11 10 8 101 30 -60 -12 -23 -5 50 -32 -79 -8 -16 11 -53 -34 73 50 -15 -5 4 40 -6 -84
3877h4O8L5P0q0k7N3Koo8N0N2o3kn6M3L5J9l4n8Q0l9M7n3nM7Jq1oM5N8k9q6P4
$$ -84 -16 19 89 9 -18 35 37 31 -37 13 65 2 0 -56 -13 22 41 7 -51 29 -10 37 -16 -21 26 27 -54 -60 -15 43 14 -72 2
3910BJ7L7m1p0M5L5k8m7l1Q0O2j18L6J8P5n6r4J6L7O4nn3k7J05jp4K2rM2l6o3
$$ 2 19 56 15 -55 -10 25 -3 -50 -81 -1 61 -57 -21 -3 72 16 -78 -62 -25 39 34 -19 -46 59 58 -16 6 -3 39 3 -60
3941f0K0M5qKj7M6K7m8l4O1m0M6J0q3OP0j3m6m8O5M0j0n7l9R3J4J6j05O5M5k4
$$ -60 -40 5 -3 -1 -18 28 55 7 -27 34 -6 40 50 -33 -27 43 30 -16 -64 1 41 31 -26 -65 28 42 58 -47 18 63 39
3972C9p6K8K3K4j10L9L3L8j1q4mO3J05j19k2J3L4J4L7o5KJ9j1r0L9J18n5q2k4
$$ 39 -37 -9 14 38 -72 -33 0 38 27 -57 -61 2 107 -12 -34 -21 13 27 64 -1 1 20 9 -81 -42 76 21 -61 -85
4001h5Q3K5P6j14P0m1N2o4n1K6N8J9l4m4J9R8j29K5m1K7Q9n5kL5Kj9o6oR7jp1
$$ -85 -2 23 99 -15 55 14 66 2 -49 -23 35 54 20 -24 -5 93 -36 -11 -52 -25 64 9 7 42 44 25 -41 -47 50 49 -22
4032b2k3L1j7M3l6l5P3J9k0n1J1O5n3K5m5pN0lq6L2O5L7j9n9K1N4J6p9k0K0O5
$$ -22 -45 -14 -31 12 -24 -59 14 33 13 -38 -27 38 -15 10 -35 -42 8 5 -81 -49 16 53 34 -25 -4 50 66 -13 -33 -13 52
4063E2j9q6R4K2l6m6kOJ8o6J0O8J6Nl7n5O5QJ5k8J5L3l6l2J0JM7rl2j7K6O9n3
$$ 52 33 -53 41 63 27 -19 -21 -15 3 -63 -53 15 31 36 -1 -56 9 17 32 4 19 52 16 -16 -6 -5 42 33 1 -16 10 79 26
4096B6p8lO5J6m5M0Nk0J2k2k1rL5l9J1K8RL1r8K6P2j5L9l2m2L8j0k4Qj2qL2Qm8
$$ 26 -52 -55 10 26 -19 21 26 6 18 -4 -25 -34 1 -38 -27 1 10 41 -57 -31 41 26 65 33 -9 29 19 -5 3 -9 -17 15 23 -25
4130b5J9rjJj2M6LK6r3J03j0Qk0l7M5l3M2p6J4M8k6q9M9O4n0j4o8Q8QL1l5Ll8
$$ -25 -6 -15 -16 -15 -27 19 22 48 -45 58 48 56 36 -1 44 11 53 -23 -9 39 13 -76 -27 37 -13 -27 -95 -7 1 32 -3 0 -38
4163c8L4rmk2M2Pk0%L1K1n9rN0M3n6onJ2M6rj08L6L1J5n7J5qK4J2PNn9J03j07
$$ -38 -4 -13 -17 -39 3 10 -10 -10 21 42 -17 -26 24 67 11 5 0 12 58 49 -59 -23 8 23 -34 -19 -27 -3 9 16 21 -38 65 -42
4197d2K7L2Qk0o1L5M0M5m1j6n0P5m7N0o6J6L9l1K4n1O0rLo6K2J6O2r4J6O3L2n3
$$ -42 -15 17 25 5 -56 -21 19 64 23 7 -43 32 -15 35 -31 -15 24 -7 17 -34 26 17 20 -46 -24 -8 54 -40 -24 39 71 18
4229A8q3K4M6M4j00RO3k6Nm4N6L6m0j2j4l1M9K8l7PJ1nL2j5k8L9jn7K8J2L1l8
$$ 18 -65 -41 5 49 -51 -42 21 -5 0 -44 12 48 8 -4 -18 -49 0 28 -9 -2 9 4 36 21 -7 32 31 -26 2 14 45 7
4261Goj3mL2l1j7P6k0k0J4l2J6l7N5k2n0Q0k2L7k1O4p1Pkk7j6N5p3L0M2kl7qK
$$ 7 1 -12 -16 16 -15 -32 44 24 4 18 -14 2 -35 20 -2 -52 28 6 43 22 86 15 22 20 -7 -23 32 -41 -11 31 29 -8 -16 -14
4295a4j2O3Nj4m6O3jl5OL%Pp5MQ8j6r6M2L4K3j4K4l1j9NM8o7JN7K3n8j4L5K1j8
$$ -14 -26 37 42 28 -18 45 44 9 15 18 18 25 -50 -46 42 26 -70 -28 6 29 15 39 8 -11 -6 42 -25 -24 33 56 -2 -16 19 40 22
4330B2o0M9j2M8q9j7j5N8O0m6p8O6rJ8K0k2J4J7l6K3pL7l9J3n6L6L%l3O3M0o0
$$ 22 -38 11 -1 47 -42 -59 -74 -16 44 -2 -80 -14 -23 -5 15 -7 7 24 -12 11 4 41 2 15 -41 -5 -2 -2 -35 28 68 8
4362Hm5j0N7Pk6l8L1J06k5n4k4k3M3m4k4R0j7Q6o2p2nL8j0M3p9P0K2l3K0j0l9
$$ 8 -37 -47 10 17 -9 -47 -16 90 65 11 -13 -36 7 -37 -61 29 12 98 36 -36 -41 -3 -13 30 -49 21 43 10 30 20 -19
4393a9M3k5Oo1R3j7j4mRl1j7LL4L6m7l5QJ4K5j8qJ2L2LLk7L2k1n0LKJ8J5K2k6
$$ -19 24 -1 5 -56 37 20 6 2 11 -20 -37 -34 0 36 -11 -46 -38 -24 1 -17 -25 -13 19 22 25 -2 30 9 -41 -38 -36 -18 -3 19 -7
4428gk7L1L0n1j6Q0l3j3k6oQ6l3J4m7J8K0m7J2k7O2j0k5k0L8j1lQJ8k7M9n6l3
$$ -7 -34 -3 27 -24 -40 40 7 -6 -32 -38 48 15 29 -18 0 20 -27 -15 -42 20 10 -15 -35 3 -8 -11 -3 15 -12 37 -19 -52
4460e2N2k3L5Qj5K4l2M4n8L5L3l9o7M3LK7m5l3J27p3Q5n9j2Jj8K6m9j8M9LJ4l1
$$ -52 0 -23 12 20 5 29 -3 41 -17 18 51 12 -55 -12 -9 18 -27 -60 67 -6 79 20 8 9 -9 17 -32 -50 -1 2 16 -15
4492a5j2Q3o7J8Kk2L5k3K5n9L4J5o0N6J3kj7n0l3P9l2M2rp2J05k4K0l7k2K5l0
$$ -15 -27 56 -11 7 9 -13 22 -1 24 -35 -1 14 -46 10 23 21 4 -46 -79 0 -32 10 1 -71 34 10 30 -7 -29 -4 -34
4523c4J5k9P8k1mLl2NQNj4L8k9k3L4pM5J9n9L5J3n4L7n1M5J5l2K5o2L6JLOj9j1
$$ -34 -19 -48 30 9 5 8 -24 -19 -11 -6 -20 18 -11 -34 0 -7 38 57 -2 33 46 -8 29 -22 23 38 6 31 -31 5 6 9 15 -4 -15
4558a5P3q1j3L9qPm9L3K1mj6kJP0m3k7lk1M4L1o6L4l6Q1q0oL4L2m4j5k0K7O4m6
$$ -15 58 -23 -36 3 -5 2 -47 -14 7 3 -13 -15 -14 56 13 -14 -17 -38 6 37 -29 5 -31 50 -30 -36 -2 30 -14 -29 -49 -22 42 -4
4592dmM2j3rn3j3P6m2N2m0k4P9LJq8K0N4k8j2l3Nl5M3K4k6N6K5r7L2k8O1L6q3
$$ -4 -8 34 21 12 -41 -54 22 -20 32 -8 -32 47 50 51 -37 -17 37 9 -3 -36 -31 -66 -23 1 -25 31 56 -41 -9 -37 24 60 -23
4625b3j7N4n7O8m7j8R0j1o6J8M7p2L6p2N0O5p4J1J1l1Q1m4k4L2M4j3ol0l1L3%
$$ -23 -40 14 -43 25 -22 -40 50 39 -27 -9 38 -34 2 -70 -20 45 -29 -18 -7 -38 43 -1 -25 7 51 38 32 2 -29 4 4
4656Dk0M4K4o8L1Nj8j9Pm0M6L7q8O3p8P0K2l0Ok2J6K1n7M3j2j3O9k1m4K7pJ9j0
$$ 4 -16 28 52 -16 15 20 2 -17 -10 -50 -4 33 -55 8 -70 0 22 -8 -2 -24 -8 13 -44 -1 -13 -26 43 22 -22 5 -2 17 7
4689Gk4O5l6j3k2K9j8J6j9K5K2j3k4l1N3J6m8k1L6M2m0k1L1p7J03j6k6Jl4L8L5
$$ 7 -17 48 12 -1 -23 6 -12 4 -15 10 32 19 -5 -36 17 33 -15 -36 0 42 2 -19 12 -65 38 22 -4 -3 -37 1 36
4720C6p7J9J9J2J0l3n1R1rRm2J1M3k0j6o0N7l0O1p8O8Ol6K2l7L0K3rj5k2O1n2
$$ 36 -41 -22 -3 9 19 -14 -65 26 17 26 -16 -5 38 18 2 -58 -1 -31 30 -48 20 26 -10 12 -25 5 28 19 4 -18 43 -9
4752iL2k3l4O3q6%L2M8K1Oj22M7P6j26jJ08m6L3K8n1L2mJ6k8L7j2j4n1M1mK3l0
$$ -9 23 0 -34 29 -57 -57 -25 23 44 50 -72 -25 51 -75 -76 32 -14 19 47 -4 28 24 40 12 49 37 23 -28 13 9 32 2
4784Bnp3P1L3Jm9L8J2l2qRO3m1K2m0Qm1j8N4l4J8J3l3M3mq4Q5k2mJ9K7l0KrJ2
$$ 2 -3 -76 -5 28 29 -20 18 30 -2 -10 -1 62 21 43 3 11 -30 -48 6 -28 -10 3 -30 13 9 -75 10 -12 -16 3 30 0 2 -7 5
4819EN7n2o9M9L1l2L4J2j6qk2MOn9J26j06NK1J4J9q1L3M9l0OJ6l5N4jo1J1J8K4
$$ 5 62 10 -59 -10 21 -11 23 35 19 11 -11 -7 -1 -60 66 -40 -35 -14 0 19 -62 -29 20 -10 -4 12 -23 31 30 -31 -20 -2 22
4852B2k6J8m1qQL9J7n4Pj1O9kn0O6l9k8L1j6%L5Np9PQ7l5kp6N2O6j17kO4L6p7
$$ 22 -4 14 -27 -35 -27 12 29 -25 -18 -29 40 38 -12 54 15 -13 18 2 2 37 42 -37 -30 57 22 20 -56 -4 62 -55 -57 7 43 -34
4886c4L8j7O1p9Kj2J3J2j9L5oJ9K1l8j4O0j7l8ON1o0L4k1j9MkM9Nm7m0O7q6N4
$$ -34 4 -13 48 -31 -29 -41 -28 -16 -35 0 -6 13 34 -4 -18 42 25 -13 -7 44 -16 18 -3 -22 -18 -20 29 34 -13 -53 14 -72 -18
4919a8J9J2L2k2k8N4j2n4k8J5M7l1l0O3n2m9J07m5K9l3MM0%n1nJ2l1O4l0N2n4
$$ -18 1 13 45 23 -5 49 37 -17 -45 -30 17 -14 -44 19 -33 -82 25 -20 9 -24 -20 20 20 -31 -36 -24 -55 9 -21 31 -23
4950b3K6K6%l5N9p5Rj2PNk0N0K1j28N5O1k6j3K2j6pK6l2J5p3R4Kj0k3JM0q1N9
$$ -23 3 29 29 -6 53 -22 -13 -25 -18 -13 -33 17 38 -90 -35 26 0 -13 9 -7 -14 12 -20 -5 -78 16 18 8 -15 -14 26 -55 4
4983Dm6K9L9k4n4O3jMk1lM2L9k5k4j9J2JL0n7L2M2n8rLj9M7k3l3kL3Km3O9r6Q6
$$ 4 -42 -13 26 2 -52 11 10 14 -7 -10 32 71 46 22 3 15 16 46 -11 21 63 5 -4 -1 -20 27 4 -29 -31 2 4 -39 30 -66 20
5018B0k0k6J0L6Oo2K6m3L2J5K0o1M0J5m0m0J9Q3l9K3Rj0l6rL1rj2lK0M6p0O9k
$$ 20 0 -26 -16 20 26 -36 -10 -53 -21 -6 14 -47 -7 8 -32 -72 -53 30 -9 14 23 13 -23 -32 -1 -10 -22 -25 -5 41 -29 40 38
5051C8p8nP7k0q8J00nk4l2O3m3K3j3j3J2nN2n7L1m6N2n5N8l0K9j1qlqN5q6M8l2
$$ 38 -40 -45 32 12 -76 24 19 -5 -37 26 -17 6 -7 -20 -8 -13 39 -18 13 -33 19 -36 22 -8 21 10 2 -1 -9 46 -40 8 -24
5084b4j2O0j7m0M3k4rL3m5j9N3J1J7lmj7rl9PN3l5M5q5L6L8K9o3KPJ1J1j6m4J9
$$ -24 -36 24 7 -33 10 -14 -23 10 -35 -54 -1 10 27 24 20 3 -6 -45 -38 15 -20 25 -60 -24 14 43 -20 -18 -11 0 11 -5 -49 -30
5118c0M5n1N6L4p6Q1o9QJ1M%j9j0Om2LqL2M4J4n2J0L6o8L5o2P8oK6n6O8n2J9P
$$ -30 15 -36 20 54 -22 59 -10 -2 9 13 13 -6 -16 -10 -52 -49 -57 -25 19 33 -19 -9 27 -41 -6 -68 10 4 30 -26 42 -10 9 16
5152A6J4n2O6rp2L2j1J8Qj0Rj6M4Om7K1J8k2j00O8R8l8p9j9P0m1P8k0r6N6qN2
$$ 16 30 -22 44 35 -37 -5 -16 2 10 0 9 -7 37 43 -4 17 35 13 -87 -19 79 41 -38 -57 13 -28 50 30 -66 -10 -18 34
5184C4o2L4K1om5J1QOJ8q2N1L1n0K4O4q6P0m3P0J6j20P0p1L6L0k1%pj5qK2K9k4
$$ 34 -28 6 27 21 -24 -13 -5 1 19 -63 -12 19 -31 -7 57 -29 41 -2 68 84 -36 34 -37 -1 29 8 8 1 -14 -22 0 29 5
5217Ej3K7J4l6j1j3K0Loj3K6L2om8P5p2J6mPk8M9m7L4kmpn8Q3k1K3qk4J9k7j3
$$ 5 -8 19 33 -3 -14 -27 -7 -4 -10 -23 3 35 29 -19 56 -16 0 -4 3 -25 24 -23 11 9 5 -2 -60 23 2 25 17 -7 12 -15 -28
5252b8N8n2K0J7J5p1qQ0kk3n3Q1Ql8j8K8j2Jj0L4l5KM1m0o%K5Ql4knJ1K8k5MQ
$$ -28 30 -22 -2 15 30 -41 -49 31 29 6 -47 34 42 4 -14 14 2 3 -7 27 -8 -6 35 -5 -11 -11 14 22 -12 -14 -19 -8 20 -5 -1 7
5288Go2K6M1k1kK0N3q9j2N7k9j4OK8lol5PQqM6M0o6Mj2K7Qp6L6J0K0L5o3k8mO6
$$ 7 -55 -29 12 -9 -11 9 62 -27 -39 18 -11 -25 -19 9 6 0 -35 -28 -20 -28 18 58 -8 -4 -16 11 19 -57 -21 -11 9 44 -19 -47 -51 15
5324A5J2m4N1n3N5m0k4JJ1qL0PjJ4l9K3k6L5l5L8l2k3QJ0K8j0j4Rk1M7j3M1n6
$$ 15 27 -17 34 -19 36 -4 -28 -27 -16 -24 6 13 12 26 -13 10 -16 19 -16 22 -10 -33 -25 -15 13 3 -11 -2 -23 24 11 52 -4
5357dJl7RM3m4N3p6O0O4p9Lj4NP3j25O0J5j2oL3m9L5L5l6k3mN6m2M5J5o1L0m0
$$ -4 -3 -40 -31 12 -32 21 -55 5 69 -10 -7 -21 -16 57 -68 -8 7 -5 -11 22 -27 8 43 7 -16 -20 36 -6 39 54 -7 23 -17
5390a7M1j4m3rkM0J0O7j23M3pj2M3k3L1l0K6J4l8l1M0%%J4j9k1M0J6p0O1M4r7
$$ -17 24 10 -33 -42 -44 -4 6 73 -50 -7 -14 -26 17 -6 25 -5 21 35 -3 -34 6 6 6 20 1 -20 20 36 -34 27 71 -26
5422b6jJ2PJ9l5mk1R0m8Nqk1K0N1n2J7J4j1K6o1K5LK8j3l0L7l3J2l3L2j0KK7j7
$$ -26 -27 -15 -8 11 -24 -28 -49 41 -7 -2 -10 -31 -11 40 -12 5 19 8 34 -27 -2 1 29 16 -14 23 -10 2 -31 1 -9 -7 20 3
5456CM9m5l7L7K3J4l8PP%QL9j21N8M4l2j3K5n0P0rm7M8n7J6J4l5K4K0lk0k5N9
$$ 3 52 7 -30 7 30 44 6 13 20 20 28 67 -54 4 48 16 3 28 -22 48 39 -8 40 -17 -1 13 -22 2 22 19 -1 -26 33
5489C3n6j0RL2O6r0Q9r4Q6r6O2j6%j6rL6J9n2L4Mn6J3OM7m9O2n3k7Q1m1j8N0o6
$$ 33 -23 -33 -24 8 74 -16 73 -21 65 -31 31 15 15 -1 -10 26 45 -7 27 31 -25 -12 -6 41 -8 54 1 -26 55 14 -4 46 -20
5522b0J7m7J08k9j5l5L0m0M4J3j9j4J8K6n3j6M4K9o2Kj1L6j5l4M5jLj0JOj7K0
$$ -20 -3 -50 58 29 14 -21 9 -31 13 26 7 -7 11 37 -16 -32 12 41 -21 -19 -30 6 -9 -43 2 1 4 -6 -5 1 -16 4
5554DJ2j0k0P0n3N4n0k7J4k1O3q8O4k9L6ml3K8K1J6n2QL7l0k6K8jl9K9k0kL4l
$$ 4 16 6 -14 56 3 57 7 -20 -6 -27 36 -52 12 -17 19 15 -18 10 31 47 -5 3 40 10 -16 12 11 -28 1 -19 -21 13 10
5587A0%M4j5n0k1K8KJ0j7M5l9l9N9l3O9n2J8Op1N4l6M4K6n4qk1O7l2%M5J1m5k5
$$ 10 10 54 39 -11 -32 -4 -2 8 -9 36 -3 -42 17 -16 53 1 19 25 -46 8 -28 16 42 -12 -20 -41 26 -6 -6 39 50 5 -20
5620b0Q3o7J0j9L2m2K9K0m9M0K1k6J5o9N2K8m4L9p6N2j6jl8K9L3jn0K2k5L6jm
$$ -20 63 -4 6 -13 19 -23 6 26 -23 17 38 12 27 -42 10 38 -6 33 -43 9 -7 -8 -46 -17 16 15 -35 -13 -38 -2 -3 -7
5652g%j1L6ko5k2J08j0o2J9J7n9M2k2O0ok5j5MJ2rO4q4P8jkj4rk6lj4N6Pm5ml
$$ -7 -7 -18 18 16 -49 -71 37 27 -35 -16 1 -58 -16 -38 22 16 -9 -24 -20 -8 -17 47 -37 41 40 38 24 15 -11 -14 -28 28 35 -10 -14 -17
5688a7M7j8rJ5k7K5ll4M1kj6K7J6m3l5K1J5m8N0l6k1Q9p3N5l2O0Rk1n6lL0l3j4
$$ -17 30 12 3 18 -9 16 13 -21 20 18 2 29 45 2 -33 -12 3 -45 5 -31 -52 37 -36 19 -13 47 56 35 -21 -24 6 -27 -41
5721d1Q1l2J8k7m7M6O3m7L9n1%j5K8pj8J6M7j06j1P0l2jj7N8j7K1nk8O2j8lm6
$$ -41 40 8 26 -1 -48 -2 61 14 53 2 2 -13 15 8 -10 6 53 -53 -64 6 -26 -27 -44 14 -3 18 13 -15 47 29 26 -20
5753b0J6K7Lm6Q6n0k9M4l3m4P2k8rR4n9on7M6l9M3K1n5P3j07M7RLPl4k8M9J0N
$$ -20 -4 23 26 -20 66 16 -13 31 -2 -46 26 -2 -11 83 24 18 -39 7 -32 11 32 -23 50 -57 -10 -1 2 9 -25 -53 -4 6 11
5786A1k3QoL0l9K2j8k5J7K1n3M3M2k3N3l2M8q1L5Pm8L6M3j23L2O1j8Pj9k4L6k9
$$ 11 -12 -4 -10 20 -19 3 -15 -40 -23 -2 -55 -12 30 7 60 28 76 -5 30 37 -11 25 68 -55 -23 38 20 27 8 -16 20 -9
5818io1M3L9o7K8O2p2L6k0M4q7k4M7O4nln9N5nk8nN4m1M1J3l5J1j3J1Nok9M4O
$$ -9 -70 -27 12 -55 -27 35 -37 -1 -21 23 -64 -88 -41 23 18 15 -44 11 6 -22 -27 27 -14 27 40 5 16 3 14 19 13 -16 28 34
5852C4pk6J2j1Q%pL4m0k1j2J1l0J03k3k7j0K3j2JJ1J1k3oK5k1omK5k2%M4pn5J4
$$ 34 27 1 13 2 10 10 3 37 -3 -24 -36 -25 -55 48 25 -2 -12 11 -1 0 11 22 -1 -7 18 -3 -9 -13 12 -10 -10 34 27 -28 -14
5887a4K0j7rM4m1K0k1O5l3jl5L1j3J7l7M3Nk2o8M8P6p0j2j5pK2J2L9p2K4Lk0Q4
$$ -14 6 -11 -20 24 -17 3 -18 47 14 13 -22 9 -4 13 -24 19 24 2 -66 -18 58 -12 -24 -39 -46 -24 -12 27 -45 -21 -18 -38 46
5920D6m7J0J5j8m9O6j0m9L5K4n1K4J3P2p1k0J3L0m6L6mp4O5N1j07K9M9k8JKK6
$$ 46 -1 9 24 6 -43 23 13 -36 -1 23 -28 -4 9 81 10 -10 3 33 -13 23 19 -55 10 61 -46 -17 32 4 5 7 33
5951C3k5k5M0j8N0j5l3Pp%J3k0%n0O8nM6o5l5O0rj3N0o4LL5l7k7K1n2O6J9n5J9
$$ 33 8 -17 23 5 55 40 7 14 7 7 20 0 0 -50 18 13 59 -6 -41 19 10 -3 47 -17 -14 21 -16 -43 -22 -74 -8 11 -44 -25
5985b5K4K3j2K0m1K7j7j8K3NMk2M8n2nl2j2J03k4oM0p3oL2K3o5j0M1K4M4j21K5
$$ -25 -1 22 10 30 -11 16 -1 -19 4 9 13 -9 39 -13 -18 -50 -62 41 17 11 51 -22 -28 4 27 -38 -48 -7 17 61 -60 -35
6017c5L2QJ4k2kolJ4M7l3J6mn9l4R1ml6O2o5NM5l3J8k3K0j8L9J9n3L1j8j5J9n1
$$ -35 -3 5 19 -3 -5 -11 -14 0 47 14 30 26 -33 -67 24 20 -16 46 -19 -14 31 -2 16 -7 13 -5 34 53 0 31 13 -2 17 -34
6051c4pL2K0on6N6j4j4J2K6J4l7J5j9L7l7mJ9k4L2j2P7r2pL3M8r2n6J04n0lL1
$$ -34 -41 -9 11 5 -51 5 -9 -23 -11 15 29 -8 7 -12 25 -12 -16 3 -21 11 -1 76 -16 -23 10 58 -34 -90 14 -36 -39 -8
6083hK9j0l0jnNP6n3K6m0L%J1Oo8R2k5l1J4k0L7K4M9p9pOP1m9j4rJ5l8j1O9m9
$$ -8 21 11 -19 -20 -25 -20 56 3 29 -11 -8 -8 3 9 -59 33 8 -23 -9 -29 8 32 81 2 -5 1 72 23 9 0 15 -23 -34 35 -14
6118a4k8pM7ML2m6J5RJ1k6o4O2k1O1n8R9j7m5J4k2mn0O3k9N5n7O3p5L1MK3k3n6
$$ -14 -42 -49 -2 2 34 -12 3 12 23 -3 -67 -5 -26 35 -23 76 59 14 28 6 2 -48 15 -14 41 -16 47 -28 3 7 30 7 -49
6151d9L6J0jolPM4k7k3K0mm3O1l2J7k0jMpj9O0m3rJ6L4k7Lk2MN8o2qQ2j2o6J0
$$ -49 -13 -3 -4 -10 -13 -6 38 11 -12 8 4 -39 22 -10 7 -13 -14 -10 -17 -36 24 -19 -28 -12 22 -5 -2 -24 -20 38 -24 -32 50 38 -28 -18
$$ [...]
8191c5
##END NTUPLES=NMR FID
##END=
