##TITLE=1H_AM_NV140_1
 200.13MHz, ,
 8 sc
 
 29.4.2025
##JCAMPDX= 6.0         $$ Bruker NMR JCAMP-DX V2.0
##DATA TYPE= NMR FID
##DATA CLASS= NTUPLES
##ORIGIN= UXNMR, Bruker Analytische Messtechnik GmbH
##OWNER= pz
$$ XWIN-NMR		Version 3.5
$$ Tue Apr 29 15:40:01 2025 Russian Standard Time (UT+4h)  she@DPX200
##.OBSERVE FREQUENCY= 200.1313
##.OBSERVE NUCLEUS= ^1H
##.DELAY= (6, 6)
##.ACQUISITION MODE= SIMULTANEOUS
##.ACQUISITION SCHEME= undefined
##.AVERAGES= 8
##.DIGITISER RES= 18
##SPECTROMETER/DATA SYSTEM= spect
##.PULSE SEQUENCE= zg30
##.SOLVENT NAME= CDCl3
##.SHIFT REFERENCE= (INTERNAL, CDCl3, 0, 14.3821)
##AUDIT TRAIL= $$ (NUMBER, WHEN, WHO, WHERE, WHAT)
$$ ##TITLE= Audit trail, XWIN-NMR		Version 3.5
$$ ##JCAMPDX= 5.01
$$ ##ORIGIN= Bruker BioSpin GmbH
$$ ##OWNER= she
$$ F:/spectra/data/she/nmr/H-C/1/audita.txt
$$ ##AUDIT TRAIL=  $$ (NUMBER, WHEN, WHO, WHERE, WHAT)
(   1,<2025-04-29 15:38:24.20 +0400>,<she>,<DPX200>,
      <created by zg, POWCHK disabled, PULCHK disabled
       configuration hash MD5:
       00 E9 B6 7A A2 85 ED C7 34 08 36 98 17 FE 4E 26
       data hash MD5: 16K
       95 1E ED 29 F6 56 B8 3B 68 BB 0F E3 E6 E7 91 A3>)
$$ ##END=
$$ 
$$ hash MD5
$$ 2A 99 3F EF ED 4E E7 17 36 E0 55 29 26 37 EB FE
##$RELAX= 
##$RELAX= 
##$RELAX= 
##$RELAX= 
##$RELAX= 
##$RELAX= 
$$ Bruker specific parameters
$$ --------------------------
##$DU= <F:/spectra>
##$EXPNO= 1
##$NAME= <H-C>
##$PROCNO= 1
##$TYPE= <nmr>
##$USER= <she>
##$AMP= (0..31)
100 100 100 100 100 100 100 100 100 100 100 100 100 100 100 100 100 100 
100 100 100 100 100 100 100 100 100 100 100 100 100 100 
##$AQSEQ= 0
##$AQ_mod= 1
##$AUNM= <au_zg>
##$AUTOPOS= <>
##$BF1= 200.13
##$BF2= 200.13
##$BF3= 200.13
##$BF4= 200.13
##$BF5= 200.13
##$BF6= 200.13
##$BF7= 200.13
##$BF8= 200.13
##$BYTORDA= 1
##$CFDGTYP= 0
##$CFRGTYP= 5
##$CHEMSTR= <none>
##$CNST= (0..31)
1 1 145 1 1 1 1 1 1 1 1 1 1 1 1 1 1 1 1 1 1 1 1 1 1 1 1 1 1 1 1 1 
##$CPDPRG= <>
##$CPDPRG1= <>
##$CPDPRG2= <>
##$CPDPRG3= <>
##$CPDPRG4= <mlev>
##$CPDPRG5= <mlev>
##$CPDPRG6= <mlev>
##$CPDPRG7= <mlev>
##$CPDPRG8= <mlev>
##$CPDPRGB= <>
##$CPDPRGT= <>
##$D= (0..31)
0 0.7 0 0 0 0 0 0 0 0 0 0.03 0 0 0 0 0 0 0 0 0 0 0 0 0 0 0 0 0 0 0 0 
##$DATE= 1745926703
##$DBL= (0..7)
120 120 120 120 120 120 120 120 
##$DBP= (0..7)
150 150 150 150 150 150 150 150 
##$DBP07= 0
##$DBPNAM0= <>
##$DBPNAM1= <>
##$DBPNAM2= <>
##$DBPNAM3= <>
##$DBPNAM4= <>
##$DBPNAM5= <>
##$DBPNAM6= <>
##$DBPNAM7= <>
##$DBPOAL= (0..7)
0.5 0.5 0.5 0.5 0.5 0.5 0.5 0.5 
##$DBPOFFS= (0..7)
0 0 0 0 0 0 0 0 
##$DE= 6
##$DECBNUC= <off>
##$DECIM= 32
##$DECNUC= <off>
##$DECSTAT= 4
##$DIGMOD= 1
##$DIGTYP= 9
##$DL= (0..7)
0 120 120 120 120 120 120 120 
##$DP= (0..7)
150 150 150 150 150 150 150 150 
##$DP07= 0
##$DPNAME0= <>
##$DPNAME1= <>
##$DPNAME2= <>
##$DPNAME3= <>
##$DPNAME4= <>
##$DPNAME5= <>
##$DPNAME6= <>
##$DPNAME7= <>
##$DPOAL= (0..7)
0.5 0.5 0.5 0.5 0.5 0.5 0.5 0.5 
##$DPOFFS= (0..7)
0 0 0 0 0 0 0 0 
##$DQDMODE= 0
##$DR= 18
##$DS= 0
##$DSLIST= <SSSSSSSSSSSSSSS>
$$ [...]
##$SUBNAM0= <"">
##$SUBNAM1= <"">
##$SUBNAM2= <"">
##$SUBNAM3= <"">
##$SUBNAM4= <"">
##$SUBNAM5= <"">
##$SUBNAM6= <"">
##$SUBNAM7= <"">
##$SUBNAM8= <"">
##$SUBNAM9= <"">
##$SW= 18.0517328524113
##$SWIBOX= (0..15)
0 0 2 0 0 0 0 0 0 0 0 0 0 0 0 0 
##$SW_h= 3612.71676300578
##$TD= 16384
##$TD0= 1
##$TE= 0
##$TE2= 300
##$TE3= 300
##$TEG= 300
##$TL= (0..7)
0 120 120 120 120 120 120 120 
##$TP= (0..7)
150 150 150 150 150 150 150 150 
##$TP07= 0
##$TPNAME0= <>
##$TPNAME1= <>
##$TPNAME2= <>
##$TPNAME3= <>
##$TPNAME4= <>
##$TPNAME5= <>
##$TPNAME6= <>
##$TPNAME7= <>
##$TPOAL= (0..7)
0.5 0.5 0.5 0.5 0.5 0.5 0.5 0.5 
##$TPOFFS= (0..7)
0 0 0 0 0 0 0 0 
##$TUNHIN= 0
##$TUNHOUT= 0
##$TUNXOUT= 0
##$USERA1= <user>
##$USERA2= <user>
##$USERA3= <user>
##$USERA4= <user>
##$USERA5= <user>
##$V9= 5
##$VALIST= <valist>
##$VCLIST= <CCCCCCCCCCCCCCC>
##$VD= 0
##$VDLIST= <DDDDDDDDDDDDDDD>
##$VPLIST= <PPPPPPPPPPPPPPP>
##$VTLIST= <TTTTTTTTTTTTTTT>
##$WBST= 1024
##$WBSW= 4
##$XGAIN= (0..3)
0 0 0 0 
##$XL= 0
##$YL= 0
##$YMAX_a= 235278
##$YMIN_a= -253246
##$ZGOPTNS= <>
##$ZL1= 120
##$ZL2= 120
##$ZL3= 120
##$ZL4= 120
##$ABSF1= 10
##$ABSF2= 0
##$ABSG= 5
##$ABSL= 3
##$ALPHA= 0
##$AQORDER= 0
##$ASSFAC= 0
##$ASSFACI= 0
##$ASSFACX= 0
##$ASSWID= 0
##$AUNMP= <proc_1d>
##$AZFE= 0.1
##$AZFW= 0.1
##$BCFW= 1
##$BC_mod= 2
##$BYTORDP= 1
##$COROFFS= 0
##$CY= -3
##$DATMOD= 1
##$DC= 2
##$DFILT= <>
##$DTYPP= 0
##$F1P= 0
##$F2P= 0
##$FCOR= 0.5
##$FTSIZE= 0
##$FT_mod= 4
##$GAMMA= 1
##$GB= 0.15
##$INTBC= 1
##$INTSCL= 1
##$ISEN= 128
##$LB= 0.25
##$LEV0= 0
##$LPBIN= 0
##$MAXI= 10000
##$MC2= 0
##$MEAN= 0
##$ME_mod= 0
##$MI= 1.114404
##$NCOEF= 0
##$NC_proc= 0
##$NLEV= 6
##$NOISF1= 3.799351
##$NOISF2= 2.8
##$NSP= 1
##$NTH_PI= 0
##$NZP= 0
##$OFFSET= 14.38212
##$PC= 1
##$PHC0= -1463.219
##$PHC1= 14.19221
##$PH_mod= 1
##$PKNL= yes
##$PPARMOD= 0
##$PSCAL= 0
##$PSIGN= 0
##$REVERSE= no
##$SF= 200.129724274929
##$SI= 16384
##$SIGF1= 3
##$SIGF2= 2
##$SINO= 400
##$SIOLD= 16384
##$SREGLST= <1H.CDCl3>
##$SSB= 0
##$STSI= 0
##$STSR= 0
##$SW_p= 3205.1282051282
##$SYMM= 0
##$S_DEV= 0
##$TDeff= 0
##$TDoff= 0
##$TI= <>
##$TILT= no
##$TM1= 0
##$TM2= 0
##$TOPLEV= 0
##$USERP1= <user>
##$USERP2= <user>
##$USERP3= <user>
##$USERP4= <user>
##$USERP5= <user>
##$WDW= 1
##$XDIM= 8192
##$YMAX_p= 0
##$YMIN_p= 0
$$ End of Bruker specific parameters
$$ ---------------------------------
##NTUPLES= NMR FID
##VAR_NAME=  TIME,          FID/REAL,        FID/IMAG
##SYMBOL=    X,             R,               I
##VAR_TYPE=  INDEPENDENT,   DEPENDENT,       DEPENDENT
##VAR_FORM=  AFFN,          ASDF,            ASDF
##VAR_DIM=   8192,          8192,            8192
##UNITS=     SECONDS,       ARBITRARY UNITS, ARBITRARY UNITS
##FACTOR=    0.0002768,     1,               1
##FIRST=     0,             0,               0
##LAST=      2.2672688,     0,               0
##MIN=       0,             -253246,         0
##MAX=       2.2672688,     235278,          0
$$ Real data points
##PAGE= N=1
##DATA TABLE= (X++(R..R)), XYDATA
0@%%%%%%%%%Qj6J6j6K4l2M0n0N9p4R1j14J38j63J94k28K67l13L64m20M83n53O32
$$ 0 0 0 0 0 0 0 0 0 0 8 -8 8 -8 16 -16 24 -26 33 -41 50 -64 74 -89 105 -123 144 -169 195 -225 258 -295 337
32C37p20Q19r28J046j177J321j478J652j844K053k278K525k796L091l414L764
$$ 337 -383 436 -492 554 -623 698 -780 872 -972 1081 -1197 1328 -1468 1623 -1791 1973
48A973m150M573n035N545o108O732p427Q205r081J0079j1227J2559j4129J6010
$$ 1973 -2177 2396 -2639 2906 -3202 3530 -3897 4308 -4773 5306 -5921 6638 -7491 8519
62H519j8315K1215k4989L0132l7612M9658p3317J92572k87828R9798J23859l36938
$$ 8519 -9796 11419 -13570 16562 -21050 28608 -44709 147863 -139965 -40167 83692 -253246
74b53246M88524k67140J1239P7857j69187J85281r2420L0270k0973o8882J95454
$$ -253246 235278 -31862 -20623 57234 -111953 73328 -19092 11178 -9795 -78677 116777
85A16777j44121N9047k4845j37650J52880N1613p9772N7004n2148j53644K36168
$$ 116777 -27344 31703 6858 -130792 22088 73701 -6071 50933 -1215 -154859 81309
96H1309m3543j16785K39541l02210J34917J33670k75259K63246j81145J1149J79254
$$ 81309 37766 -79019 160522 -141688 -6771 126899 -148360 114886 -66259 -55110 124144
107A24144j91254J61324j92451O5048R4016j48218K69355k74246M2173J50490
$$ 124144 -67110 94214 -98237 -33189 60827 -87391 181964 -92282 -50109 100381
117A00381k66432L03524j27843j09900K08739j84124R2091L6467j14481N1219
$$ 100381 -166051 137473 9630 -100270 108469 -75655 16436 52903 -61578 -10359
127a0359L3221j4294l829L1734r9133M8470M5242m4399N8744p0362K2813k2438
$$ -10359 22862 8568 4739 36473 -62660 -14190 31052 -13347 45397 -24965 -2152 -24590
139b4590L4994L1932j17076J54825j28759K1408J44639k50484J99324n8236r9740
$$ -24590 10404 42336 -74740 80085 -48674 -27266 117373 -133111 66213 7977 -91763
150i1763K30733k16134P8147L3669j06540J40105r5930M2524j7972k6526P9067
$$ -91763 138970 -77164 983 34652 -71888 68217 -27713 14811 -3161 -29687 49380
161D9380r8929Q9128m7087l7252J09103r6897L3626J8301n5064M5224J9297m3911
$$ 49380 -49549 39579 -7508 -44760 64343 -32554 1072 19373 -35691 9533 28830 -15081
173a5081J083M3015p6284P4198Q990r6475J07819q0225K2856O3414r7820P2173
$$ -15081 -13998 29017 -47267 26931 35921 -60554 47265 -32960 -10104 53310 -44510 27663
185B7663n2488K4204K6198n4198P3391r9615O7692K3364q8301J16784j11520K4843
$$ 27663 -24825 -621 25577 -28621 44770 -54845 12847 36211 -52090 64694 -46826 -21983
197b1983P8170r9604Q1486m2995l1791N6744k3765J9538j6883m127j1183J9312
$$ -21983 56187 -43417 38069 -4926 -36717 20027 -3738 15800 -1083 -5210 -16393 2919
209B919K1142l8924K3475k1571L972K6609j3470m37k4236K6160j4952K2965J4540
$$ 2919 24061 -14863 8612 -12959 -8987 17622 4152 3715 -20521 5639 -9313 13652 28192
222B8192p2035O2731l1025p76O5654q8987M1759n442k5314O5319n1310J2036q374
$$ 28192 -43843 18888 -12137 -12913 52741 -36246 5513 71 -25243 40076 -11234 802 -7572
235g572o546L6471l1316K7094l2048n213M0390l2458L0715j9125k6564L4095n454
$$ -7572 -14118 22353 -8963 18131 -13917 -19130 21260 -11198 19517 392 -26172 7923 2469
248B469N277p20j4867r297K3000O295j3256J3446l4937J3639K5989j8300J6542
$$ 2469 7746 7026 -7841 -17138 5862 12157 -1099 12347 -22590 -8951 17038 -1262 15280
261A5280k8597J031J6057k771J9993l2786O347L29l329L9498l9390R47O412j7714
$$ 15280 -13317 -12286 3771 1000 20993 -11793 -5446 -5117 -8446 31052 -8338 -7391 -979 -18693
275a8693M3201j7074j4689M281j4128K5056O477r069j4206n115J4578O680P283
$$ -18693 24508 7434 -7255 -2974 -17102 7954 14431 5362 -8844 -13959 619 7299 14582
288A4582j7610j1310Q838Q230J1586q013j3989r512J7072J5006r275l47k3584
$$ 14582 -3028 -14338 -5500 2730 14316 6303 -7686 -17198 -126 14880 5605 5258 -18326
301a8326P224K5148r789P371j9881j0895K4121K319N647j5188j3273J0641Q821
$$ -18326 -11102 14046 4257 11628 -8253 -19148 4973 7292 12939 -2249 -15522 -4881 3940
314C940J1879j4249j1235J700K803J9688m902j6201k373J761J3258P057j1999
$$ 3940 15819 1570 -9665 -7965 -5162 14526 9624 -6577 -8950 -7189 6069 13126 1127
327A127j1714M511N438R417K036j9212m49O013P385Q619j5906o095K943Q048R045
$$ 1127 -10587 -6076 -638 8779 10815 -8397 -8846 -2833 4552 13171 -2735 -8830 -5887 2161 11206
342A1206j0191l966o285O063J4628q521k558q114k12J6995l494m952m993l074
$$ 11206 1015 -2951 -9236 -3173 11455 2934 376 -7738 -7950 9045 5551 599 -4394 -7468
356g468R452M899l064p826j512K932P785K203j0938j290J260O468L990p717j907
$$ -7468 1984 6883 3819 -4007 -5519 -2587 5198 7401 -3537 -4827 -3567 2901 6891 -826 -2733
371b733l512P979M747n910k10r474R264P748p874K086j0192N563R111n306K442
$$ -2733 -6245 1734 6481 571 361 -9113 151 7899 25 2111 -8081 -2518 6593 1287 3729
386C729j0472K064Q075K38K233j2636J261O596K758L241j1772n91L066N362M404
$$ 3729 -6743 -4679 3396 3634 5867 -6769 -5508 1088 3846 7087 -4685 -5276 -2210 3152 7556
401G556q763l089k953J0307N457p394k916r147J1844O382l817j13j5178R305N950
$$ 7556 -1207 -4296 -7249 3058 8515 1121 -1795 -10942 902 7284 3467 3354 -11824 -2519 3431
416C431J311L299j9720Q255M707K505O867k0760N014L512M524J0327j7102k099
$$ 3431 4742 8041 -11679 -3424 1283 3788 10655 -10105 -5091 -1579 2945 13272 -3830 -5929
430e929k981R342J2936j1174k844j0687P953J1648n231J007j2890M504Q275K039
$$ -5929 -8910 432 13368 2194 -650 -11337 -3384 8264 3033 4040 -8850 -4346 3929 5968
444E968p18j6260O367L010J1053K826k2472O307o129J2085J4380j8713L851j2765
$$ 5968 5250 -11010 -4643 -1633 9420 12246 -10226 -3919 -10048 2037 16417 -2296 1555 -11210
458a1210P202J3754j0889O420j4857R427P732j0201J0156k0758Q610J2183n822
$$ -11210 -4008 9746 -1143 5277 -9580 -153 7579 -2622 7534 -13224 -4614 7569 1747
471A747J1597k1744k020Q020L483J0930j1558n38q366O455Q037r837J0207j3117
$$ 1747 13344 -8400 -10420 -2400 1083 12013 455 -83 -8449 -1994 6043 -3794 6413 -6704
485f704P216Q466j3749O918j2508R755O841k647N947k1698J0516l533L358J9114
$$ -6704 512 8978 -4771 2147 -10361 -606 6235 3588 9535 -12163 -1647 -5180 -1822 17292
499A7292k5225J2121o669o836J9617j8015J1384k261l167R263j3739Q520j1290
$$ 17292 -7933 4188 -2481 -9317 10300 -7715 3669 1408 -1759 7504 -6235 2285 -9005
512i005Q930R788j3157J3730j9323L358R459r858J6178j0246M32k082k053P464
$$ -9005 -75 9713 -3444 10286 -9037 -5679 3780 -6078 10100 -146 286 -1796 -3849 3615
526C615j0640J5013j0788L009Q786k2010J9577j1132M30J5100j6593J2819j2190
$$ 3615 -7025 7988 -2800 209 8995 -13015 6562 -4570 -4140 10960 -5633 7186 -5004
539e004J818N044p472J6149j6861J1657l632j3632K2484j9234J2179K896j4383
$$ -5004 -3186 1858 -5614 10535 -6326 5331 1699 -11933 10551 -8683 3496 6392 -7991
552g991J5796j4073O772l27j388O142j1090J4401j3944M243P162j6208K1075j3771
$$ -7991 7805 -6268 504 177 -1211 4931 -6159 8242 -5702 -1459 5703 -10505 10570 -3201
566c201J481Q041j4953J3470q736P399j904o110J1350j6940J7476p734o346J8573
$$ -3201 -1720 6321 -8632 4838 -3898 3501 1597 -4513 6837 -10103 7373 -361 -6707 11866
580A1866k3323J6308k286r393J4876j4920J0490m154l68M024r622J4642j4733
$$ 11866 -11457 4851 2565 -6828 8048 -6872 3618 -536 -904 3120 -6502 8140 -6593
593f593Q184L786j4646J8016j4372N732M897j0822J0871r556P392m654J055O887
$$ -6593 1591 5377 -9269 8747 -5625 107 5004 -5818 5053 -4503 2889 -1765 -710 6177
607F177j5540J7104j1897J687J2037k0253J8071r318k582J1341j2656J1863r938
$$ 6177 -9363 7741 -4156 -2469 9568 -10685 7386 -1932 -4514 6827 -5829 6034 -3904
620c904L582K582p657J4242j6210R759Q73j1469J7632j5191N378L335p181J0651
$$ -3904 -322 2260 -5397 8845 -7365 2394 3267 -8202 9430 -5761 -383 2952 -4229 6422
634F422r549L597l661K790M960q465J1422j2966L020O012r801J4642j0764J383
$$ 6422 -3127 470 -3191 -401 4559 -3906 7516 -5450 -2430 3582 -6219 8423 -2341 -958
648i58L144o603Q961r805Q248l473j222J0679j7079J0825o196k048J7193j5579
$$ -958 2186 -4417 4544 -5261 2987 -486 -1708 8971 -8108 2717 -3479 -5527 11666 -3913
662c913P739n246n719J1186p544R068n388j305L222p663J0212q898L142N976p218
$$ -3913 3826 -1420 -7139 4047 -3497 5571 183 -1122 2100 -5563 4649 -4249 -1107 4869 -2349
677b349Q603r271j001K536q61Q432l888P43p967Q50O101m900R826p831K61M099
$$ -2349 6254 -3017 -4018 -1482 -2343 6089 2201 2944 -5023 -4173 1928 -2972 6854 -977 -716 3383
693C383r547Q897n787K125N216m733O259j0694K079J375j754J1958r602K885k561
$$ 3383 -6164 2733 -3054 -929 4287 -446 5813 -4881 -2802 -1427 -3181 8777 -825 2060 -501
708e01p609J1598n121M054O25n635N492n657J621n75R27M875l526K760o081j412
$$ -501 -8110 3488 -1633 2421 3046 -2589 2903 -2754 -1133 -1708 -781 4094 568 3328 -2753 -4165
724d165L590m79O298l907j477j120j850L760k247M644k441r61K964o536M754k962
$$ -4165 -575 -1054 5244 1337 -140 -1260 -3110 650 -1597 3047 606 -355 2609 -3927 827 -2135
740b135M59P159o213K875l869k291N308k735N160k581k289J406l416M865k494
$$ -2135 -1676 5483 -730 2145 -1724 -4015 1293 -1442 3718 1137 -1152 254 -3162 1703 -791
755g91M81K849l741K876k895m61K021j279K843q19n46k193J03K271j197K535k497
$$ -791 -310 2539 -1202 1674 -1221 -1682 339 -940 1903 1084 538 -1655 -1552 719 -478 2057 -440
772d40Q3J234k973L358j752J21J573j947K402l115P10J189j266L155l497J139
$$ -440 -357 877 -2096 1262 -490 -369 1204 -743 1659 -1456 -746 443 -823 2332 -1165 -26
788b6O15k715L886k024J43Q00k104K514j103k27J68k94R50r91J256j254k64J043
$$ -26 589 -2126 1760 -264 -121 679 -1425 1089 -14 -241 -73 -367 583 -408 848 -406 -670 373
806C73p54J690j943p3R48l29J259k112J195l75p52K431k499J617o54j539L386
$$ 373 -381 1309 -634 -707 241 -88 1171 -941 254 -121 -873 1558 -941 676 22 -1517 1869
823A869k603O48M79j468K177j518N88P3j168J226m28J025r13r16J025j18M77m63
$$ 1869 -734 -86 393 -1075 1102 -416 172 245 -923 303 -125 900 -13 -929 96 -22 455 -8
841hN4m57L88K99n77J265k199J220J147k169K294k343P94J566k816K991j815l24
$$ -8 46 -411 -23 276 -301 964 -1235 -15 1132 -1037 1257 -1086 -292 1274 -1542 1449 -366 -690
859f90J502k147L028k109m42J898k291K454j273p32J850k123J290N84j376N55
$$ -690 812 -1335 1693 -416 -858 1040 -1251 1203 -70 -802 1048 -1075 215 799 -577 -22
875b2m6k48J130q68q78J968j821Q93Q27k315K738k518J071J887l964L824k593
$$ -22 -68 -316 814 -54 -932 1036 -785 108 935 -1380 1358 -1160 -89 1798 -2166 1658 -935
892i35L62K971n085M637k305j422M439m750L512j276k353M607l671J606L83k204
$$ -935 -573 2398 -2687 1950 -355 -1777 2662 -2088 1424 148 -2205 2402 -1269 337 720 -1484
908a484K778j890K88J314j828O10R28j262J116m44j761L401k682O22K350m849
$$ -1484 1294 -596 -308 1006 -822 -212 716 -546 570 126 -1635 1766 -916 -294 2056 -2793
924b793M826k778o83M953p224N699j555l060O541p624N197j87m751P505o696K986
$$ -2793 2033 -745 -1428 3525 -3699 2000 445 -2615 3926 -3698 1499 1312 -3439 4066 -2630 356
940C56J227m922O721m801Q28K457m129L783j783n74K279k330M08J668j885N30
$$ 356 1583 -3339 3382 -1419 -591 1866 -2263 1520 -263 -837 1442 -888 -480 1188 -697 -167
956a67J282l146L842j978j893N500o643M523Jm975Q303q238M062K477p728R558
$$ -167 1115 -2031 1811 -167 -2060 3440 -3203 1320 1321 -3654 4649 -3589 473 2950 -4778 4780
972D780p669K413L980q733R889o333J81N205q363P997l904j489N617o422L906
$$ 4780 -2889 -476 3504 -5229 4660 -1673 -1492 3713 -4650 3347 -557 -2046 3571 -2851 1055
987A055n72k099L306k354R0J707j309q76K518k920J752J245m316O068n352J115
$$ 1055 483 -1616 1690 -664 -574 1133 -176 -1052 1466 -1454 298 1543 -2773 3295 -2057 -942
1003i42M120p609Q762o130j58O945j0985J0207m633k945R136j1581R043k307n146
$$ -942 3178 -4431 4331 -1799 -1957 4988 -5997 4210 -423 -3368 5768 -5813 3230 923 -4223
1018d223R423r367N967m72m897P384o512L408P87l531L765l219J302J344j312
$$ -4223 5200 -4167 1800 1328 -3569 3815 -2697 711 1498 -2033 1732 -1487 -185 1159 -153
1033a53k07J108j483j54K859m491M838k038l177P208q576N555O3n259J0097j0175
$$ -153 -360 748 -735 -889 1970 -2521 2317 279 -2898 4310 -4266 1289 1352 -3907 6190 -3985
1049c985M787R20p471J1418q971M910J706r284J0644q328L249M137p815Q890o409
$$ -3985 802 1722 -5749 5669 -3302 1608 3314 -5970 4674 -3654 -405 3732 -4083 4807 -1602
1064a602j93L552n276N511j393J72N41k772L5L09J989q26K685k997o52J101m330
$$ -1602 -1795 1757 -3519 1992 599 771 1312 -1460 -1425 -1116 873 47 2732 -265 -917 184 -4146
1081d146P066l783J520L729q826P354o658J010Q062r106R675o421l381O795r558
$$ -4146 2920 -863 657 4386 -4440 2914 -3744 -2734 5328 -3778 5897 -524 -3905 2890 -6668
1096f668J0393k125k569O012r906N570k455j027P247n293L926k971l143K333j983
$$ -6668 3725 1600 -969 5043 -4863 707 -1748 -2775 4472 -821 3105 134 -3009 -676 -2659
1111b659M155Q63Mk575j141o21q21N254k711L586j742n070N066o582N554J823
$$ -2659 1496 2359 2363 -212 -1353 -1974 -2795 2459 -252 3334 1592 -3478 1588 -4994 560 2383
1127B383l326P255r988K760J20m267J0572o490M020o95q129P679n832M504L087
$$ 2383 -943 6312 -3676 -916 -796 -5063 5509 -981 3039 2344 -5785 1894 -3938 566 3653
1142C653m880N390o521L83J223j674N370j907J206k150k554P70rL768j180J595
$$ 3653 -1227 4163 -2358 -1975 -752 -2426 2944 1037 2243 93 -2461 -1691 -1700 2068 888 2483
1158B483k474j936J757l382N900j809m5K981p071M631l592O04O174n868N365m511
$$ 2483 9 -1927 -170 -3552 2348 539 494 3475 -3596 1035 -2557 -1953 4221 -1647 3718 -793
1174g93k162M241n219P093k186j376K952o070M406k133J77L799l505K744k898
$$ -793 -2955 1286 -3933 3160 974 -402 2550 -3520 886 -1247 -1070 2729 -776 1968 -930
1189i30k30R73j274L306j653J211j875r68J898k178L516j904M42P01l350L906
$$ -930 -1160 -187 -1461 1845 192 1403 -472 -1440 458 -1720 1796 -108 334 1035 -2315 1591
1205A591l110J659J165k936M462m702J586J112l024M876l945J742L91l245M281
$$ 1591 -1519 140 1305 -1631 2831 -1871 -285 827 -2197 2679 -1266 476 867 -2378 1903
1220A903l152J953j63k011L230l286K190m87j014K212k804K351j099k84J185j651
$$ 1903 -1249 704 541 -1470 1760 -1526 664 177 -837 1375 -1429 922 -177 -461 724 -927
1236i27K309k359J015K15j301K803k977K033o99j695L143k875K370r45j096K511
$$ -927 1382 -977 38 253 -1048 1755 -1222 811 112 -1583 1560 -1315 1055 110 -986 1525
1252A525l293K651j215j87K276l389K927j783n29K155k511K975j796l08J179j999
$$ 1525 -1768 883 -332 -519 1757 -1632 1295 -488 -1017 1138 -1373 1602 -194 -502 677 -1322
1268a322K255j569J174J04j690K047k087J436k66p42K028k116J220r59J75R42
$$ -1322 933 -636 538 642 -1048 999 -1088 348 82 -660 1368 -748 472 -487 -312 630
1284F30j637K337j928P68K24j861L005k573J303O07k113K544k605J629J99j604
$$ 630 -1007 1330 -598 170 394 -1467 1538 -1035 268 875 -1238 1306 -1299 330 529 -1075
1300a075K517k576J747o33j141K762k725J625k51j133J982k020J304k17m62O47
$$ -1075 1442 -1134 613 -20 -1161 1601 -1124 501 250 -883 1099 -921 383 166 -296 351
1316C51q98J238j243P78p3o48J234j721J595o22m54J204j607J759j608M99J155
$$ 351 -547 691 -552 226 153 -495 739 -982 613 -9 -463 741 -866 893 -715 -216 939
1333I39k141K564k232P34J168k766L113j806J42J228k201K233j509L62P69j232
$$ 939 -1202 1362 -870 -136 1032 -1734 1379 -427 -285 943 -1258 975 -534 -172 597 -635
1349f35J461j617J080n3r61J426j198R88o01k28O03p54J041j174J250n49r19J959
$$ -635 826 -791 289 236 -725 701 -497 491 -110 -338 265 -489 552 -622 628 79 -840 1119
1367A119k260J749m57j078K406k566J403j90q10J702j985J761q84m60J295j781
$$ 1119 -1141 608 151 -927 1479 -1087 316 126 -684 1018 -967 794 -90 -550 745 -1036
1383a036K050j332j23J222j615J451r29M24J3n43J028j268J505j434K74J388k357
$$ -1036 1014 -318 -441 781 -834 617 -312 112 125 -418 610 -658 847 -587 -313 1075 -1282
1400a282K418j553l3J421k359K534j508J23Q42j720K439k141Q46O72j965K513
$$ -1282 1136 -417 -450 971 -1388 1146 -362 -239 603 -1117 1322 -819 27 699 -1266 1247
1416A247j978Q09N44j659J779j030N47m09l7N01r45J486j631J169p7j517K569
$$ 1247 -731 78 622 -1037 742 -288 259 -150 -187 314 -631 855 -776 393 316 -1201 1368
1433A368k334J425k19j261K467k790K169q08r31K472l383L125j254j386L229l548
$$ 1368 -966 459 240 -1021 1446 -1344 825 17 -914 1558 -1825 1300 46 -1340 1889 -1659
1449a659K543o31j408K633k602J557m51k26Q86j580J681j348Q38N7r04J580j949
$$ -1659 884 253 -1155 1478 -1124 433 -18 -244 642 -938 743 -605 233 290 -614 966 -983
1466i83J433o49J18P05j774K567k536J293O10k625M001l648J651J348l816M137
$$ -983 450 -199 -81 624 -1150 1417 -1119 174 784 -1841 2160 -1488 163 1511 -2305 1832
1482A832l116J329J442l247L494l087J281P94k097L497l425J499L99k051K794
$$ 1832 -1284 45 1487 -1760 1734 -1353 -72 722 -1375 2122 -1303 196 595 -1456 1338
1497A338k285J307J74r49Q30j070J032j406J874l64j032J901l492K858o83r39
$$ 1338 -947 360 534 -415 415 -655 377 -1029 845 481 -551 1350 -2142 716 33 -906
1513i06L093l825K782j771m44K905m176M379k349l38K954n512M689j906o34M044
$$ -906 2187 -1638 1144 -627 -1071 1834 -2342 2037 -312 -650 2304 -3208 1481 -425 -1059 2985
1529B985m766K867j848q02L099k359K284j756R1M53j660K423j718J320j37o88
$$ 2985 -1781 1086 -762 -1564 1535 -824 1460 -296 -205 248 -1412 1011 -707 613 476 -212
1545b12R94k137J524j210J987J75k032K818m543K684O99k402N146n314J982O99
$$ -212 782 -1355 169 -1041 946 1121 -911 1907 -2636 48 747 -1655 3491 -1823 159 858
1561H58l568N051m071K555N19l151M174m776K577K99k082M945m608J377J06k467
$$ 858 -2710 2341 -1730 825 1344 -1807 2367 -2409 168 467 -1615 3330 -1278 99 205 -2262
1577b262L697j714J078k87j082L03m10J448j745J962p49p21J742l211K672j305
$$ -2262 1435 -279 799 512 -570 -267 -677 771 -974 988 239 -482 1260 -1951 721 -584
1593e84L22K277l441L098l483J030K666m215N315m051M6L211n477N555k557r01
$$ -584 -262 2015 -1426 1672 -1811 -781 1885 -2330 2985 -1066 -1020 2191 -3286 2269 -288 -1189
1609a189L576m435L568k132m09K290k658L096k259L63Q10k331K854j317L32K08
$$ -1189 2387 -2048 1520 -612 -1021 1269 -1389 1707 -552 -189 621 -1710 1144 -173 159 367
1625C67r03O90n90J159j607J729q19j289L258l768K499j78k343M173m108K268
$$ 367 -536 154 -436 723 -884 845 26 -1263 1995 -1773 726 548 -1795 2378 -1730 538
1641E38N4k204L639l920L078r12k006M153m653L375n06k648M436m115J904O90
$$ 538 592 -1612 2027 -1893 1185 273 -1733 2420 -2233 1142 636 -2012 2424 -1691 213 903
1657I03k159K535k146J097k10k01O99j197J569j732R94L96j183J408j684J362
$$ 903 -1256 1279 -867 230 20 -181 518 -679 890 -842 152 548 -635 773 -911 451
1673D51o18J42P35j996K675k580J264J498l790M004k746M92K461m091L383j912
$$ 451 -167 -25 710 -1286 1389 -1191 73 1571 -2219 1785 -961 -469 1992 -2099 1284 -628
1689f28M6K005k552K554k635Q61J252k060L073k954P33J109k267K720j497M0N06
$$ -628 -582 1423 -1129 1425 -1210 -349 903 -1157 1916 -1038 -305 804 -1463 1257 -240 -200 306
1706C06n84Q55j015O36j174J391N44j577J861k662Q14J139r86K194k380N25k70
$$ 306 -278 577 -438 198 -976 415 959 -618 1243 -1419 -605 534 -452 1742 -638 -113 -383
1723c83m03K086k525K404j208r57K858l674K157m06j109L485k670N81p98r17K085
$$ -383 -786 1300 -1225 1179 -29 -986 1872 -1802 355 -51 -1160 2325 -345 236 -562 -1479 606
1740F06o94J728j707n31M96j319K673j372L9R17j460J179j074J16p4N31J220j251
$$ 606 -88 1640 -67 -598 -102 -1421 1252 -120 -81 836 -624 555 -519 -403 -477 54 1274 23
1758B3Q91k534L18K220j354K470j930j169J137j448K309p36J8J01j010J851k230
$$ 23 914 -1620 -1302 918 -436 2034 104 -1065 72 -1376 933 197 215 316 -694 1157 -1073
1775a073Q55K71r93K970k038R2k49j823K433J00O18p96j139L80n65J920r44P7
$$ -1073 -218 53 -940 2030 -8 84 -165 -1988 445 545 1163 367 -772 -392 -957 963 19 96
1793I6N36j694J914j034m79P61o47J624o45k33q66m74J619p40J696j092j532J495
$$ 96 632 -1062 852 -182 -661 100 -547 1077 432 199 -667 -1141 478 -262 1434 342 -1190 305
1811C05j259J561j4j131R65q00O60m35J03j47m55J810j212L29l36j332K121p16
$$ 305 -954 607 593 -538 427 -373 287 -148 -45 -192 -647 1163 -49 280 -56 -1388 733 17
1829A7L95O9j215P69n81J188n68l21P29j365J744r23o26J457j579J272n4q20O62
$$ 17 412 481 -734 35 -546 642 74 -247 482 -883 861 -62 -688 769 -810 462 408 -412 250
1848B50q26O90N4J10l04m62R18q56O60j0o28P72o88M26n0r0J4j58Q12j325Q84
$$ 250 -576 114 168 278 -26 -488 430 -426 234 224 -404 368 -320 106 56 -34 -20 -178 634 -691 193
1869A93Q2r17J642j726O83N10j301J663j029N4K57o02J261j207N20j37m28J452
$$ 193 275 -642 1000 -726 -43 467 -834 829 -200 -146 111 -491 770 -437 83 -54 -482 970
1887I70j438N56lr31J492m19j93q8m92M03N72l6p81M87n11L17Q94j140M15n93
$$ 970 -468 88 85 -846 646 227 34 -54 -546 -143 429 393 -388 99 -412 -95 799 -341 74 -519
1907e19L37J004r03L69j162P38P87r17J345j982K40J332j210J849j655o72J467
$$ -519 -182 822 -81 288 -874 -136 651 -266 1079 -903 -663 669 -541 1308 -347 -1019 448
1924D48q29J305q21p26M30k00J270n89m01l96k26J444j89m06n14j72M66P09L5
$$ 448 -381 924 103 -623 -193 -393 877 288 -113 -509 -735 709 520 114 -400 -572 -106 603 638
1943F38j179M02n52Q79J195k096P28n98L4K000j765N25p13m14J993j084P00j269
$$ 638 -541 -139 -691 188 1383 -713 15 -583 -549 1451 -314 211 -502 -916 1077 -7 693 -576
1961e76m71J924j105J182j046j117J670q19J131k34j503O61K24O22l1o04p22N73
$$ -576 -1047 877 -228 954 -92 -1209 461 -358 773 539 -964 -303 -79 543 512 -92 -814 -241
1979b41O71k75N37j367P7Q31j54R57j654K24K91k39J703j945N71o9j028K707j878
$$ -241 430 155 692 -675 -598 233 79 1036 -618 -394 -103 -342 1361 -584 -13 -82 -1110 1597 -281
1998b81J55L14j584K591j050k43M37j465J527k94K37r3j121R21j09N91k28q32
$$ -281 -126 188 -1396 1195 145 -98 339 -1126 401 107 344 251 -870 51 -58 533 305 -527
2016e27L85k6M79q0Pq50L11P28o88J170j518K3J359j558J811j139o95J526j669
$$ -527 -142 -168 311 231 238 -612 -301 427 -261 909 -609 -586 773 -785 1026 -113 -808 718 -951
2035i51J900p49q58J211j518J849q06n00J100j779J710m17n37J044j621J087J67
$$ -951 949 200 -658 553 -965 884 78 -422 678 -1101 609 192 -345 699 -922 165 332
2052C32n13L98n06J99l6M68m52J70m1o84J318q67K72J81r31J384j203P66j3r17
$$ 332 -181 217 -289 -90 -126 342 -110 60 19 -665 653 -214 58 239 -692 692 -511 255 242 -675
2072f75J542j725J322p7j440K237j990R29M12j603K101j513L88N39j033J166r87
$$ -675 867 -858 464 387 -1053 1184 -806 123 535 -1068 1033 -480 -92 447 -586 580 -407
2089d07N76j10l84Q01q30P83p16m8O87m48N51p34K67l25J88Q21j144J172j253
$$ -407 169 59 -325 476 -354 429 -287 -335 352 -96 455 -279 -12 -337 -149 672 -472 700 -553
2108e53N1J528j964J648q92l93J691j881J348r65l34J421r64J436j636k65R44
$$ -553 -502 1026 -938 710 -182 -575 1116 -765 583 -382 -716 705 -259 1177 -459 -724 220
2125B20j053K093j136l78N08j243J459l65j18p3p1O69o21M72j302M93J081o69
$$ 220 -833 1260 124 -254 254 -989 470 105 -13 -86 -157 512 -109 363 -939 -446 635 -34
2143c4J430j875n02P18l23K000j279k9l45p53J845j539J165l13j000K285j927
$$ -34 1396 -479 -981 -263 -586 1414 135 106 -239 -992 853 -686 479 166 -834 1451 -476
2160d76M36l34r85K501o18K94r22j215R14j6J764q21o13m2r47J698p77P4L70n10
$$ -476 -40 -374 -1359 1142 524 818 -104 -1319 -405 -421 1343 522 -91 -133 -1080 618 -159 -85 285 -225
2180b25J127j044Q4q61J63J770o73J055k049q49J617r33K287q52j002O77j495
$$ -225 902 -142 -58 -919 -756 1014 341 1396 -653 -1502 115 -818 1469 617 -385 292 -1203
2197a203J677o01o3O28q13J602j543j86J58p71K340o58J6n48j510J241J11J035
$$ -1203 474 -127 -190 438 -375 1227 -316 -502 -344 -1115 1225 567 583 35 -1475 -234 -123 912
2215I12m58n54J59r17J311q71M01N82j043J565j402j81K24n52J979r45L43o73
$$ 912 454 -100 59 -858 453 -418 -17 565 -478 1087 -315 -496 -272 -824 1155 210 553 -120
2233a20j080J560j011J532l69j235J402j541J045p5p15J384r85O30m89m12M79
$$ -120 -1200 360 -651 881 512 -723 679 -862 183 108 -607 777 -208 422 -67 -479 0
2250@n59J338o52J2r4q65J220o97N51N5o11O71r39Q66n00pQ19j166J298j182M
$$ 0 -559 779 127 139 45 -820 400 -297 254 309 -302 369 -570 296 -204 -211 608 -558 740 -442 -438
2271d38J117j411J469r61j13Q74j281J335p91N6M62q95J271j065L01L67p82J123
$$ -438 679 -732 737 -224 -337 537 -744 591 -200 -144 318 -577 694 -371 -70 297 -485 638
2289F38j028L47J60n14Q66n56K87n06P2N06m31P58j011L94J83o94J223j061M83
$$ 638 -390 -43 117 -397 469 -87 200 -306 -234 272 -159 599 -412 -18 165 -529 694 -367 116
2308A16Jm98J103j324O98j86k25J265j524R22n64n55J568j154Q94n07p14J131
$$ 116 117 -381 722 -602 96 -90 -315 950 -574 348 -216 -771 797 -357 537 30 -684 447
2326D47q11O95l45j99M80n46O96o68O7J86k42R29p77O8k23j02O97m89P00q79M5
$$ 447 -364 331 -14 -213 267 -279 417 -251 -184 2 -240 689 -88 -20 -243 -345 352 -137 563 -316 -271
2347b71M65o84J226j072J47N97r48J180r28P0M69p56J200q40J50j3o49J312q27
$$ -271 194 -490 736 -336 -189 408 -540 640 -288 -218 251 -505 695 -145 5 -8 -657 655 -172
2366a72L41k9p30R78o25N24j29n55N42l31N93n02m0K46m25Q17o91K65j4n63R64
$$ -172 169 140 -590 388 -237 287 158 -397 145 -186 407 -95 -135 111 -314 503 -188 77 63 -500 464
2387D64n81L71l40l77Q96p39O72l94l76P41q41R52l24m69O10p06Q08l63k31M14
$$ 464 -117 254 -86 -463 433 -306 366 -28 -404 337 -504 448 124 -345 265 -441 367 4 -227 187
2407A87n84P36m23J51O7o19Q24m76L62j80m65O84n51N94k48k66M31p58R39l97
$$ 187 -397 339 -84 67 134 -485 339 -137 225 45 -420 264 -287 307 59 -207 224 -534 405 8
2427Hj84M61p85R45n14q3M13o98P32m41K43J12p39P82m16L21J5n42O21m87L39
$$ 8 -176 285 -500 445 -69 -152 261 -437 295 -146 97 209 -530 252 -164 157 172 -370 251 -236 103
2448A03mj94K41m89O27l05L3P5m87P91n90K90J47o38P39o53N62k6p00Q75p81O10
$$ 103 99 -95 146 -343 284 -21 12 87 -400 391 -199 91 238 -400 339 -314 248 222 -478 397 -384 226
2470B26r4n57Q86q91N60P5n09O98q20N40j7k54M00n48M73k56L3K84m54L63l17
$$ 226 132 -425 461 -430 130 205 -304 394 -426 114 97 -157 243 -305 168 -88 -55 229 -225 138 -179
2491a79K79j6k49L43n23O42l84l1M35q03Q25m61P5M64j001R52n06Q3M22r17R95
$$ -179 100 84 -165 178 -345 297 -87 -118 317 -486 339 -122 -47 417 -584 368 -138 -55 367 -550 445
2512D45o82J82N11r33Q45o26J51N25p87N99l78P0J65k54L72m13K34p9P5J48m69
$$ 445 -237 -55 456 -477 368 -258 -107 418 -369 230 -148 -78 87 -167 205 -208 26 -53 22 170 -299
2533b99M18k70K97q0k51M86p67P09j61l17P52j147R15j81n18R89j075P15j10m54
$$ -299 119 -151 146 66 -185 301 -466 243 82 -235 517 -630 285 104 -414 575 -500 215 105 -349
2553c49Q89r96N81j16j60O89j000O22k02k88P14n95L63j26k77K78m1J8j53L92
$$ -349 540 -456 125 9 -151 538 -462 160 -42 -330 384 -211 152 26 -251 27 -14 4 -149 243
2573B43l66J27J40n58P38n45K34L47p10N95o27L94K15n71R71j003M24P8q07J380
$$ 243 -123 4 144 -414 324 -221 13 360 -350 245 -382 12 227 -344 627 -376 48 126 -681 699
2593F99r81K96M64j050Q78n64J23M38n11M61l51J82k22j96N58l09L62k18k32O5
$$ 699 -282 14 478 -572 306 -258 -135 303 -208 253 -98 84 -138 -334 224 -85 277 59 -173 -108
2613a08j20L28n0L32n89R4L45p87R81n78QP44j140Q60m18l98Q48n75P63n62k57
$$ -108 -228 100 50 382 -207 -113 232 -555 426 -152 -144 600 -540 320 -98 -496 352 -223 540 -22 -279
2634b79L73o65J054m69j8L72j044Q94j98k37M61m95L80L1j60k04O3J07j18P09
$$ -279 94 -571 483 14 -4 368 -676 218 20 -217 244 -251 129 160 0 -204 -141 -34 -152 557
2654E57o16j40J51l65Q63m23N3o5l53N75n26O15l67l37R71r78O86k40p35J174
$$ 557 -59 -199 -48 -413 450 27 80 15 -338 237 -289 326 -41 -378 593 -385 301 61 -674 500
2674E00p17M20P3o75M55l28N05r6j82Q8l95O60l63K4K10n30N16j97J22j06k16
$$ 500 -217 203 276 -399 56 -272 233 137 -45 43 -352 308 -55 -31 179 -351 165 -32 90 -16 -232
2695b32K99k26N85o43P5M14p59Q96m50j52N02p82P25j99j02J77m41O15n45L53
$$ -232 67 -159 426 -217 -142 272 -487 409 -41 -193 309 -473 252 53 -49 128 -313 302 -243 110
2715A10O9n17P03o81M12J30n19N54m31J92j6n5K08m08M49m32L73J16o90P19n36
$$ 110 179 -338 365 -316 96 226 -293 261 -170 22 6 -49 159 -249 200 -232 141 257 -433 286 -250
2736b50K01L34m92M47n29K49J89j92L30p26N32q5j04N45q22M14j26p2N68n67J70
$$ -250 -49 285 -207 240 -289 -40 149 -43 287 -439 93 8 -96 449 -373 41 -85 -157 411 -156 14
2757A4k18K58J64l60L14n74N20J06l31N00r23M10K58j05M34p89K72j04J32M61
$$ 14 -204 54 218 -142 172 -402 118 224 -107 393 -530 -120 138 33 467 -322 -50 -154 -22 439
2777D39o56M42m93J48N64p59L92k87J61N25n21J23n07K37L63K6K94q69K27j3J20
$$ 439 -217 225 -268 -120 444 -315 77 -210 -49 476 -45 78 -429 -192 171 197 491 -378 -151 -164 -44
2798d4N00o41L30k11RK43m35L44l40M40K19n70K86p38N44M06l87N24p70J08J17
$$ -44 456 -185 145 -66 -57 186 -249 95 -245 195 414 -156 130 -608 -64 342 -45 479 -291 -183 -66
2819f6j48N89n19L32j48j64K93o38O22j06k7L88o77K43k61J64M01k21K31m89J99
$$ -66 -214 375 -144 188 40 -124 169 -469 153 47 20 408 -269 -26 -287 -123 278 57 288 -201 -2
2840br9j65N19l26L90k47k71K50m26N27k9J7L1n49N45l84K15J72m37P17n82J32
$$ -2 -101 -266 253 -73 317 70 -201 49 -377 150 121 138 169 -380 165 -219 -4 168 -269 448 -134 -2
2862bO5n38O66k38L90j19o19L59k70O00m4l99K99n14M84O3k72J38l13M87Nj48
$$ -2 63 -475 191 -47 343 224 -395 -36 -306 294 250 -149 150 -364 120 183 -89 49 -264 223 228 80
2884H0k24k62N44q1L20k92n42L93j57O59k59m13J73k80P80l34k38J30n17Q91j84
$$ 80 -144 -406 138 57 377 85 -457 -64 -221 438 179 -234 -61 -341 439 105 -133 -3 -520 371 187
2905A87j88M8p14R01K2r7o1o45N47O9K39o1o46K60qM88k9n92J32p1M75k1k06j63
$$ 187 -1 47 -667 234 256 159 98 -547 0 69 308 247 -399 -139 -147 341 312 -280 -148 -219 256 235 29 -134
2929a34j99O17j67J43l37m90Q01j81K72k07o67O46k12M28r6n19L22l56P05j75
$$ -134 -333 284 117 260 -77 -567 234 53 325 118 -549 97 -115 313 217 -302 20 -336 369 194
2949A94n00L70l99O17n2m82K81l16L99J47j76j45k62L67J4J66k24k53L44j98L03
$$ 194 -306 64 -335 282 230 -252 29 -287 112 259 83 -62 -324 43 57 223 -1 -254 90 -108 195
2970A95k10j69K28j63M45l67j27J90k42O55m88p2K43m96P16l42q3J91m91O09j37
$$ 195 -15 -184 44 -119 326 -41 -168 22 -220 435 -53 -125 118 -378 338 -4 -87 104 -387 222 85
2991H5j41M4k74N43k34M9o1l19M50j18J73j69l16K65O1K66l74m0J3M6M22m85J41
$$ 85 -56 -12 -286 257 23 72 11 -308 142 24 197 28 -288 -23 38 304 -70 -110 -97 -51 371 -114 27
3014B7j51j36P16m56M2k21j25O82l81J73k97k39N72k96M17l70l88N52j76L77k55
$$ 27 -124 -260 456 0 42 -179 -304 378 -3 170 -127 -366 206 -90 327 -43 -431 121 -55 322 67
3035F7m52L72o7L41j54k35q0K2M40j25p6k76k0M54j51R7k92j12L33j17M17n08
$$ 67 -385 -13 -80 261 107 -128 -208 -186 254 129 53 -223 -243 211 60 157 -135 -247 86 -31 386 -122
3057a22r3K20j16N98n94j02K49l06O17l27j13N6k93N73j26j17q5j98M39j58J08
$$ -122 -215 5 -111 487 -107 -209 40 -266 351 24 -89 -33 -326 247 121 4 -81 -279 160 2 110
3078A10j07k19K73j20K25j50j35P9n3L32l05J31r1j50M12l68K79j39k94N06l34
$$ 110 3 -216 57 -63 162 12 -123 -44 -97 235 -70 61 -30 -180 232 -136 143 4 -290 216 -118
3099a18K08n6k31L53l25K73o2j38K68m31L64l4j75K86l51J79Mj9J12k02P9j34
$$ -118 90 34 -197 156 -169 104 42 -96 172 -259 105 71 -104 182 -169 10 14 -5 107 -95 -16 -150
3121a50K67p0j49J70k96L41m9o5J38l91L04o7J31M5m63L90j92J88J62n31M03k81
$$ -150 117 47 -102 68 -228 113 64 -1 137 -254 50 -17 114 159 -304 86 -106 82 244 -287 116 -165
3143a65J66L09m73J38j39J83K04k19j3k32K59M8p3J70l99J92R9K7lk66J50K2K31
$$ -165 1 310 -163 -25 -164 19 223 4 -9 -241 18 66 -7 163 -236 -44 55 82 79 -187 -37 -15 216
3166B16j56k50J93k64M82K9l55J77l96L87J55k69J40k97K73Rq0P9m17M47L2o0
$$ 216 60 -190 3 -261 221 250 -105 72 -324 63 218 -51 89 -208 65 74 -6 73 -344 103 135 75
3188G5J30o23K30K49L2J29k91r4N2J94k8m7K0j58L56j43k48Q8j84M73J6r7k29
$$ 75 205 -418 -188 61 93 222 -69 -163 -111 83 55 8 28 -130 226 83 -165 -77 -261 212 228 131 -98
3211i8l12L96l9L83j82m51M42k92J95J01m76M87l4jL2m64M9J46M60J2l85r5k92
$$ -98 -410 -14 -53 330 148 -303 139 -153 42 143 -333 154 120 119 151 -313 -264 -118 342 354 -31 -126 -418
3234d18M44K05j95O9k44Q1J65m2k84O4K49N2K43n48l11M03o2N79j46m91Oj50N08
$$ -418 26 231 36 105 -139 -58 107 65 -219 -155 94 146 389 -159 -470 -67 -129 450 304 -187 -181 -331 177
3257A77mj67o7j31M94l12j12Q9l71P29L6k78j00n16L09N35Nj68l08q7J10L50j57
$$ 177 173 6 -61 -192 302 -10 -122 -33 -404 325 361 83 -17 -533 -224 311 316 148 -160 -247 -137 213 56
3280E6j65Q2n9L30r0l80r6K17L76j0j06m81q0N38r4L43l07n20N19p9J50m3m06
$$ 56 -109 -27 -86 244 154 -226 -322 -105 271 261 155 -326 -406 132 38 381 74 -446 73 -6 144 101 -305
3303c05L03Q1J45j96k68J03%N67j66m67J04k12M53J68l35o7r9J30K02Q7m41oK79
$$ -305 -2 79 224 28 -240 -137 -137 430 264 -203 -99 -311 142 310 -25 -92 -191 -61 141 228 -213 -219 60
3326F0l2K84l66k45K96NK60j96k10n0J13L88k65l4j52j16O03k64r5N6l58M26N9
$$ 60 28 312 -54 -299 -3 2 262 66 -144 -194 -81 307 42 8 -144 -260 343 79 -16 40 -318 108 167
3349A67j48Kk01J84J54J8l18k5K11n5K50j43l09J45nJ94L3j73j78J64J71j94J51
$$ 167 19 21 -180 4 158 176 -142 -167 44 -11 239 96 -213 -68 -73 121 154 -19 -197 -33 138 -56 95
3372I5j95m5M05k90R6j13k36L93L4J4j75j51Q9M0K72k56j5R4k71L90j33k26K28
$$ 95 -100 -145 260 -30 66 -47 -283 110 144 158 -17 -168 -79 -39 233 -23 -38 56 -215 175 42 -184 44
3395D4m4J00pj73j07J64J14q5J63k79p4K68j70K27j08j53J57l2Q5j66O0pn3L19
$$ 44 0 100 93 -80 -187 -23 91 6 169 -110 -184 84 -86 141 33 -120 37 5 90 -76 -16 -23 -76 243
3419B43l47Q5M5k33M33j99q9J15k03J86pj0n9kJ05j31K08k33k2K79k55J53lj44
$$ 243 -104 -19 26 -207 226 27 -62 53 -150 36 29 19 -40 -42 63 -68 140 -93 -115 164 -91 62 59 -85
3443h5P1K3K1q1J40j99O0K13l42K68n4k07L27k54J12P4j77R5o6J62j87J01N6k39
$$ -85 -14 9 30 -51 89 -110 -50 163 -179 89 35 -172 155 -99 13 87 -90 5 -61 101 -86 15 71 -168
3467a68L20j90K4J72l50K38Mo5Q0r7nm3J68o7kM0k59L26m6j52J40j84J21K1kq
$$ -168 152 -38 -14 158 -192 46 50 -15 65 -32 -37 -80 88 21 19 59 -200 126 80 -72 68 -116 5 26 24 16
3493A6j10J51j43K31q1k98L25k01J55J50l19J68j29Q6Q6q9K5j84K86r6m9R7k67
$$ 16 -94 57 -86 145 64 -234 91 -110 45 195 -124 44 -85 1 87 -2 23 -161 125 29 -20 77 -190
3516a90K55k5k7Q5k24P6P8J20j24j52J41j23K68q1j86J80k25K22O7j99N5j50K31
$$ -190 65 40 13 98 -126 -50 28 148 24 -128 13 -110 158 77 -109 71 -154 68 135 -64 -9 -159 72
3539G2J3p1l3j92L22j13O9P6l94K75j0L1O6k60J15j5J80p5j13M4j23K80n3j67
$$ 72 85 14 -19 -211 111 -2 67 143 -251 24 14 45 111 -149 -34 -49 131 56 -57 -13 -136 144 91 -76
3563g6Q0k12K84M2j01m9j38K15m2J50j45j94K31j44K55o5l02K18m7J59lk04N8
$$ -76 4 -208 76 118 17 -32 -170 45 3 153 8 -186 45 -99 156 91 -211 7 -40 119 116 -88 -30
3586c0r5K75j08m8j3k19L64m5j02M7k30K68J3k6o2j17J38j9K00j88j63J84j10
$$ -30 -125 150 42 -6 -19 -238 126 81 -21 26 -204 64 77 51 -11 -128 10 -9 191 3 -160 24 -86
3609h6K69j43j40J16j13K55j11l3r6n7K87j29J2r7j59L98j50K0nk62K68o8J83
$$ -86 183 40 -100 16 -97 158 47 14 -82 -139 148 19 31 -66 -225 173 23 43 38 -224 44 -24 159
3632A59j34j96J12j9K23j00j45J19j50K34o9o7J9j02K39o6m8j02o5K73j26J23
$$ 159 25 -171 -59 -78 145 45 -100 19 -131 103 34 -33 -14 -116 123 57 9 -93 -158 115 -11 112
3654A12j24j53J84q5J56q9q7P4n0J90j94J9N7p9K44j88l9L4j73L61j13l5m8j39
$$ 112 -12 -165 19 -66 90 1 -86 -12 -62 128 -66 -47 10 -69 175 -13 -52 -18 -191 170 57 22 -26 -165
3678a65K42j20J26q6r4J62p6R2n0j85J85k2J37j19j46O8j1J76p5k3o0p3K06r1
$$ -165 77 -43 83 -3 -97 65 -11 81 31 -154 31 9 146 27 -119 -51 -62 114 39 16 -44 -117 89 -2
3702bJ7m0p3K17j64Q3q8k7J39j06J80j55j12J52j22K34j20p8J12j36J55n6l6O9
$$ -2 15 -25 -98 119 -45 38 -50 -77 62 -44 136 -19 -131 21 -101 133 13 -65 47 -89 66 10 -26 43
3726D3r7J46p7Qm2p6J76r5M7m6p6Q0j3J03r7n4O2k4J33j48RP4q0J05j11L7mq3
$$ 43 -54 92 15 23 -19 -95 81 -14 33 -13 -89 -9 -22 81 -16 -70 -8 -32 101 -47 -38 36 -44 61 -50 -13 -17 -100
3754a00K02r2ml4l8J53j73J27k7r1J28j12J28o2o9R3o9J03q7k9J01p1R7j01oO8
$$ -100 102 10 6 -28 -66 87 -86 41 14 -77 51 -61 67 5 -64 29 -40 63 -24 -53 48 -23 74 -27 -33 35
3780C5j27J51n3oj1n5J14q9O4j0n6O8j00J10k2q1Q3o7J04j20L6P8j02Q5q5M7K5
$$ 35 -92 59 6 0 -11 -66 48 -41 23 13 -43 25 -75 35 13 -68 15 -52 52 -68 -32 46 -56 29 -56 -9 16
3807A6j08J71j23L6J5p6J45r5K6J3q5J13q9Q6l0o2J04j12J00n1n7J13r4P8n3m
$$ 16 -92 79 -44 -8 7 -69 76 -19 7 20 -65 48 -41 45 15 -47 57 -55 45 -6 -63 50 -44 34 -19 -23
3833b3ln8J49m9M0o0p5P8o1R8j4l7O3j37J14j9l0Q4j12J53p8o2P8j46J59k9ON5
$$ -23 -26 -84 65 16 56 -4 -79 -1 -62 36 22 -15 48 -89 25 6 -24 60 -52 101 23 -39 39 -107 52 23 29 84
3861H4j96Q3oN6M6r8M7q7K5O3m6O3o7O6rr1J4k4J21k2L8m7j33J11p1J28J3j14
$$ 84 -112 -29 -35 21 67 -31 16 -71 -46 17 -29 34 -33 33 24 -67 -53 -77 44 22 60 13 -120 -9 -80 48 61 -53
3889e3J50j69P8Kj35K39j49O8L0k13J99j55J37Q1j37O5j20K5P8p2J17o5%j5pK7
$$ -53 97 -72 6 8 -127 112 -37 31 61 -152 47 -108 29 110 -27 38 -82 -57 21 -51 66 1 1 -14 -21 6
3915Fl7O2o4J03q5k8M1j31K07o6K5J4k18K24o2j9J50k77K53j35m8K05k79K11n2
$$ 6 -31 31 -33 70 -15 -43 -2 -133 74 8 33 47 -171 53 -9 -28 122 -155 98 -37 -85 120 -159 52 0
3940@j9J41k35J12j1j8R3j17N8k7j9P7K8m8m4N0o1N6k8n1J29j56J11pj11K00k39
$$ 0 -19 122 -113 -1 -12 -30 63 -54 4 -23 -42 35 63 15 -29 21 -40 16 -12 -63 66 -90 21 14 -97 103 -136
3967a36J78J7j82K18k10J54J9j80K55k28R2N7j27J99k04P3M1j09J13o0J7K1n5
$$ -136 42 59 -123 95 -115 39 58 -122 133 -95 -3 54 -73 126 -78 -5 36 -73 40 -20 -3 18 -37
3990c7K0K2kl8J11p5j4L6j01J68j45M3J00k30K46j92M5J32k70L09j57l2J39k25
$$ -37 -17 5 3 -35 76 1 -13 23 -78 90 -55 -12 88 -142 104 -88 -43 89 -181 128 -29 -61 78 -147
4014a47K50j25k6J76k20J37r6%J41j54R9m8k4N9o2M2j0M1r4J08p7m9J43j36J42
$$ -147 103 -22 -48 128 -92 45 -51 -51 90 -64 35 -13 -37 22 -40 2 -8 33 -61 47 -30 -79 64 -72 70
4039G0q3o7J91k57K26j04o3K33k83J78k8j45K59j98J29j2j76K04j58J01L1j09
$$ 70 -13 -80 111 -146 80 -24 -87 146 -137 41 13 -132 127 -71 58 46 -130 74 -84 17 48 -61
4061f1J14r0M4K8l9KJ0J8l5K2p6P2K2r3J85j75O5Rj37K62k63J35L4j81K44k25
$$ -61 53 -37 7 35 -4 -2 8 26 -9 13 -63 9 31 -62 123 -52 13 22 -115 147 -116 19 53 -128 116 -109
4087a09J17M9k14K94k09N9R4k28K65j34m7J34j63J18l3OM0p8J2M8J8p6N6n0J5
$$ -109 8 57 -157 137 -72 -13 81 -147 118 -16 -63 71 -92 26 -7 -1 39 -39 -27 21 39 -37 19 -31 -16
4112a6L2r7J42r7J4R6j75K13j61J5J51l18L01j49PJ97l03K27o8j01J67k12J99
$$ -16 16 -81 61 -36 -22 74 -101 112 -49 -34 117 -201 100 -49 -42 155 -148 79 11 -90 77 -135 64
4135F4n5q1J77j62J01m5k4Q8j28Q3Ql6K9j2Ml2P2p9R0p4n4J41j44J07p1j6J63
$$ 64 9 -72 105 -57 44 -1 -25 63 -65 18 26 -10 19 7 11 -21 51 -28 62 -12 -66 75 -69 38 -33 -49 114
4162A14j93J33n6p4K06k23J42k3j07K04k23J20K8j64J88j60O8N0n7Q5j12K9O7
$$ 114 -79 54 -2 -76 130 -93 49 26 -81 123 -100 20 48 -116 72 -88 -20 30 -27 58 -54 -25 42
4185D2q8O6l3M5m9MJ2M5k9k0O8q7M1j5o1Q4r0R2L5j31J19j47J02O7k01K06j40
$$ 42 -46 20 -13 32 -17 -13 -1 44 15 -5 63 -24 17 2 -59 25 -65 27 62 -69 50 -97 5 72 -129 77 -63
4212f3N3O0j20J70j33j5J10j67J75r4nR9j24J02m8m0N3m6P3j0o0K4pJ9L3n3qM4
$$ -63 -10 50 -70 100 -33 -48 62 -105 70 -24 -29 70 -54 48 0 -40 13 -33 40 30 -30 -6 -13 6 39 -14 -22 22
4240B2p8R3nr7R3n1L7O8j71J04n9J9J60j80Q2j09k7J97j42R8p4q6J60j30R8K6
$$ 22 -56 37 32 -65 28 -23 14 82 -89 15 -44 -25 135 -45 37 -72 -99 98 -44 54 -20 -106 54 -76 22 48
4266D8j42J70j09J14o3j56J44k4J19l0q9pm4R4P5m3q7j8M4j6Q1j01M3J4n5J14
$$ 48 -94 76 -33 81 18 -138 6 -18 101 71 -18 -25 -69 25 100 57 -30 -48 -4 -20 61 -40 3 17 -38 76
4292G6j71L7N4l2J75j39Nm4r0K21q7P3j8j84J63r9P0N6j32J33n7l3jr7J27k3P4
$$ 76 -95 -58 -4 -36 139 0 5 -39 -129 92 5 78 60 -124 39 -60 10 66 -66 67 10 -23 -24 -121 6 -17 57
4319E7M6j60k6j2J32J7j8rp6J7l1Q5j1l1Q0o6O9q0q5J34p5J36o8p8P9j57J69O
$$ 57 103 -57 -83 -95 37 54 36 27 -49 -32 -63 22 11 -20 60 -6 63 -17 -102 32 -43 93 25 -53 26 -131 38 44
4347D4rJ9j79J32kl8Q5q1Q5p1J1L8j14R0J1K2j1p2N8r4P0K2J2K1j26J07n4RN4
$$ 44 35 54 -125 7 5 -33 52 -29 56 -15 -4 34 -80 10 21 43 32 -40 18 -76 -6 16 28 49 -77 30 -24 -15 39
4376C9r4J26p8qK3n9J05j09N9N2j18J31j29Q0kr2J52j29J00o8m4J10q3L6k0J6
$$ 39 -55 71 -7 -15 8 -51 54 -55 4 56 -62 69 -60 20 18 -74 78 -51 49 -19 -63 47 -36 0 -20 -4
4402dK3m2P9j02J1J5oJ05j00M8l9k2R7j03J02o1p8J08p2O5q7K5R8q9R8j04k7O3
$$ -4 19 -23 56 -46 -35 -20 -26 79 -21 27 -12 -34 63 -40 62 1 -77 31 -41 24 -63 -38 60 -29 69 -35 -62 1
4430Aq3J79q0j3p2k8J47o5M5q3j5J37p1P9j12n7J37k8Q2j18j02J12k9J47q5l3
$$ 1 -82 97 17 4 -68 -96 51 -14 31 -52 -67 70 -1 78 -34 -91 46 18 100 -18 -120 -8 -37 110 25 -8
4456hn4k9J84m1l6m7l5J18o7K1m5m4J01k1J32j57r1P6K0J57j12o1ol1J47m7N4
$$ -8 -62 -91 93 52 16 -31 -66 52 -15 6 -39 -83 18 -3 129 -28 -119 -43 -23 134 22 -39 -45 -76 71 24 78
4483G8j35m6J75n3N8j29m2J12k6J13q0j18N4J9J68r5j10j8RJ63m2k4p8n1J41j
$$ 78 -57 -103 72 19 77 -52 -94 18 -8 105 25 -93 -39 -20 148 53 -57 -75 -66 97 55 31 -47 -98 43 42
4509D2M1j26m5J01J5Q9j71j8K4k5J92q1r5No2K36q2Kr5o9J60n0J07r0j36J15j0
$$ 42 83 -43 -88 13 28 117 -54 -72 -48 -73 119 38 -57 -52 -114 122 40 42 -53 -122 38 -12 95 5 -131 -16 -26
4536b6J40p9j19O7nJ08l9n1p3MJ28j7lj08oJ53m9M4r6o4Q0k3J51j25m8M0o9J77
$$ -26 114 35 -84 -17 -22 86 47 -4 -77 -73 55 38 35 -73 -79 74 25 69 -27 -91 -11 -34 117 -8 -56 -16 -85 92
4564I2r6k3J2r2J67n2K0j5j17J32l5O2n6m9O1l7N9Pl2ll0O3j6k7m4J1J03j05N8
$$ 92 -4 -27 -15 -107 60 8 28 13 -104 28 -7 55 -1 -50 11 -26 33 40 8 5 -25 38 22 -5 -49 -38 65 -40 18
4593A8k6k6P2p2Q4o1n3J04j17R8Jm7O8j21J18n0K2K2j12J01o2J4P0p4M2m1J7R
$$ 18 -8 -34 38 -34 50 -11 -64 40 -77 21 22 -25 43 -78 40 -10 12 34 -78 23 -39 -25 45 -29 13 -28 -11 -2
4621bL3Rp6K1K5K6K7r2L8n4M8O6q7k7k8P8O6n8K7j55P7O0OP9k16N2Q1jQ1j59L
$$ -2 31 40 -36 -15 10 36 63 -29 9 -45 3 69 -18 -45 -73 5 71 13 40 -115 -38 22 28 107 -109 -57 24 23 104 -55 -52
4652e2j2Q8P3r8j6r2Q2J23m8n0o5QQ6O3k0j35m1Q2O6J13k06j8NJ02J00j16o7l7
$$ -52 -64 24 97 -1 -17 -109 -27 96 48 -2 -67 -59 27 90 70 -65 -106 -24 42 155 -51 -69 -64 38 138 22 -45 -82
4680h2K5J31km6j39L2J05J7L8j45k6P5O6L2p9q6j0J49N0o7j10m2Q3J04K8m6j26
$$ -82 -57 74 72 26 -113 -81 24 41 79 -66 -92 -17 49 81 2 -84 -94 55 105 38 -72 -114 -31 73 101 55 -71
4707g1n1J42O5J4j61n7R0Q0M6j25k6j0M8J42q7j03k7j9J92N3j23j02%R0O2L0j41
$$ -71 -122 20 85 99 -62 -119 -29 51 97 -28 -54 -64 -16 126 39 -64 -91 -110 82 135 12 -90 -90 0 62 92 -49
4734d9o3Q0L2J02p8j08J5K4J40k3j32k4L1J26M5p5j20qJ14J0J3qj27M9P1J6j8
$$ -49 -112 -32 0 102 24 -84 -69 -45 95 72 -60 -84 -53 73 118 43 -77 -85 29 39 52 44 -83 -34 37 53 35
4761C5r0j5R3NLo0m5j9O7Q1n3k8o1N6Q5k5k1o1J5N5M9m4m9%k3Q6J0r1O7l2K0N9
$$ 35 -55 -70 23 28 31 -29 -74 -93 -26 55 2 -26 -87 -31 54 29 8 -53 -38 17 66 22 -27 -27 -50 36 46 -45 22 -10 10 69
4793F9o5J9r2M5PK6M4r9L1L3K2jp0J6Nk4N6om3J7qK1jM1m7m0L3J9K8k5n3L0QL1
$$ 69 4 23 -69 -24 -17 9 53 -46 -15 18 40 39 -31 -15 -10 -34 22 16 -27 -10 -18 3 2 43 -4 -44 -11 8 36 11 -42 -12 -4 27
4827B7j4Mm6rM2l3J19p5p1M7n6J12k8n0Qm2R5O%m6q6J07KL6l9j15J01kM5j4p6
$$ 27 13 17 -29 -38 4 -29 90 15 -56 -9 -65 47 19 -31 -23 -65 30 36 36 -10 -96 11 13 49 10 -105 -4 -6 39 25 -51
4858e1j2K0J07k8l7q3JJ12k1M5q1o1J02K4O8j02p9N0K9Q4o5p6K7q5K07l6j05N
$$ -51 -63 -43 64 36 -1 -84 -83 29 8 53 -28 -89 13 37 105 3 -76 -26 3 87 22 -54 -27 -112 95 59 -46 -41
4886d1n7J15Q2p0r2m3P0M9O4q4j03M5O7N3J4j34k7N3Q3J5o8m5l5J46lJ0j01r5
$$ -41 -98 17 99 29 -63 -106 -36 13 77 -7 -110 -65 2 55 69 -65 -92 -39 44 59 -9 -54 -89 57 54 64 -37 -132
4914a32J63J2J4l2j37R5k3J34m4j01Mj0J31k3q7km9Q5O8m5k1r1M5Q2N6n1j13M4
$$ -132 31 43 57 25 -112 -17 -40 94 50 -51 -47 -57 74 51 -36 -38 -87 -2 66 21 0 -91 -46 36 92 41 -72 -28
4942b8J5O9n5k1k9k0J10J7n3o4n0J51k3K9m1j35J54o0R9K2j70M3J0N0J9q7L4k7
$$ -28 -13 56 1 -20 -49 -69 41 58 5 -59 -109 42 19 48 7 -128 26 -34 65 87 -83 -40 -30 20 39 -48 -14 -41
4970d1N0Nj3m4j2N2L0k7qm3%M9K9Om8j0n4J12n1J1N6j46J32ml2K7p5L1L1J4K9
$$ -41 9 14 1 -43 -55 -3 27 0 -8 -51 -51 -2 27 33 -15 -25 -79 33 -18 -7 49 -97 35 31 -1 26 -49 -18 13 27 56
5001E6j11O8n3N3M0r6O5p4L2N5m9nJJ2K3Ll3l0L8m4J02qo2K9k6J3Pok5k9P5j6
$$ 56 -55 13 -40 13 53 -43 22 -52 -20 35 -14 -19 -18 -6 17 20 -13 -43 -5 -49 53 45 -17 12 -14 -1 6 0 -25 -54 21 5
5033E%L4j14N6J4PN5q3nL8k7M6m3Kk1K1L7k6K4m1L1Kk1pj0K1k3N7J1n6M5j23Q9
$$ 5 5 39 -75 -19 -5 2 57 -26 -31 7 -20 26 -17 -15 -36 -15 22 -4 20 -21 10 12 -9 -16 -26 -5 -28 29 40 -16 29 -94 -5
5066eL2o6M2l8MN0l5O5q5L8Qn2J08j18O7j2p2J09o8M4m9k8O8J2k7L0m2j5L4K9
$$ -5 27 -39 3 -35 -31 19 -16 49 -36 2 10 -42 66 -52 15 3 -69 40 -28 16 -33 -61 7 19 -8 22 -20 -35 -1 28
5096B8nl7j9J0O1l4rj0k4N5k3N9j11K9M2j1O7j02k4N7l2J10n6o0Rl6J14j1m9j7
$$ 28 23 -14 -33 -23 38 4 -5 -15 -39 16 -7 52 -59 -30 12 1 68 -34 -58 -1 -33 77 21 -39 -30 -66 48 37 -12 -29
5126b9l1J24l9k6K2r6J03rK9l9p0QO9M7o8ll6K0J31o9m4nk3R6k5k3n7ON9qM0p3
$$ -29 -60 64 25 -1 21 -75 28 19 48 9 -61 -53 16 63 -5 -8 -44 -24 107 38 -6 -11 -34 62 37 14 -43 -37 22 14 54 -19
5158a9n6N6OP1l4q3J9L7P3j9r3J0lO9Pk9k9j6J4N9lm5l7K9QO3q0k7M0j6O4m0j1
$$ -19 -75 -19 -13 58 24 -59 -40 -3 70 51 -42 -32 -35 34 41 12 -17 -33 -19 40 37 -8 -45 -16 -8 55 -25 -52 -12 -28 36 -4 -15
5191a5Pm1Q5k2j5j3l4P5k6MJp1O8l3M8Jo0L0RKL9o0JKL5L0m2k3J2JLK8l7Jj5K7
$$ -15 -8 -49 36 14 -1 -14 -48 27 1 5 6 -65 3 -30 18 19 -41 -11 -2 0 39 -21 -20 -18 17 47 5 -18 -6 -5 -2 26 -11 -10 -25 2
5227BMm2L6k5qM6J2rJ7m6Mj0MM7m3LJ1k6L3l7JM9o8N6njl0M6rl6K4K5n3M0J4j4
$$ 2 6 -36 0 -25 -33 13 25 16 33 -13 -9 -19 -15 32 -11 -8 3 -23 10 -27 -26 23 -45 11 6 5 -25 21 12 -24 0 25 -28 12 26 12
5263A2J1m5rJ6K7j6Pk3J3K4%nm1K4Rj7L7m0j4M4l1L4j4m0M8l3N9j0n7O2m4K1J4
$$ 12 23 -22 -31 -15 12 -4 3 -20 -7 17 17 12 -29 -5 4 -13 24 -16 -30 14 -17 17 3 -37 11 -22 37 27 -30 32 -12 9 23
5296B3k1Lk8K2J8j1Mm1OL7j6J9k2kPK7n7K4Lk4M7m7K3J9j3Nk2J8L5o0J9j5L0j2
$$ 23 2 5 -23 -1 17 6 10 -31 -25 12 -4 15 -7 -9 -2 25 -32 -8 -5 -29 18 -29 -6 13 0 5 -17 1 36 -24 -5 -20 10 -2
5330bl5N8k8K3k1j0M8n3oL1pL3Op3K5L0oK1Qp9K8K4j5L1l7j0K7m7M9l2J4QLK5
$$ -2 -37 21 -7 16 -5 -15 33 -20 -26 5 -2 31 37 -36 -11 19 13 34 42 -37 -9 15 0 31 -6 -16 11 -36 13 -19 -5 3 6 31
5364C1n4nK1j4O0m4K1k9J5J8j3mk6J4J3J0Rk5j2J1J2J2p4K5oN1J0l2k9M2k2J9
$$ 31 -23 -28 -7 -21 39 -5 16 -13 2 20 7 3 -23 -9 4 14 23 -2 -14 -3 9 21 -53 -28 -34 17 27 -5 -34 8 -14 5
5396Ej9J5m0J5J1rJ5j4lJ8Moj7j7M6%L8q0L8oK0Rkmk7L6j2l3L3k4K9j4lJ4l0%
$$ 5 -14 1 -39 -24 -13 -22 -7 -21 -24 -6 -2 -8 -25 -42 4 4 42 -38 0 -6 14 23 21 17 -10 26 14 -19 14 -10 19 5 2 16 -14 -14
5432a4MpK3Nj6J8j4K1m2MRrK8j7KJ3Knk0Oj3K5k4N4m8j2K5PP%k9K3k1L3pk3L2
$$ -14 -10 -17 6 11 -5 13 -1 20 -22 -18 -9 -18 10 -7 -5 8 10 5 -15 -9 -22 3 -21 33 -15 -27 -2 5 12 12 -17 6 -15 18 11 -12 20
5469B0m4K9Lj4L0m2J1MqL8n5OL8j4j1K3m2PKJ5J2k1J3J3j3j3jQN5m9K1l8l7Q3
$$ 20 -24 5 8 -6 24 -18 -7 -3 -11 27 -28 -22 16 2 -9 14 -28 -21 -19 -4 8 -13 0 13 0 -13 -14 -6 49 0 21 -17 -54 29
5503B9j0Lk0lK1l4L4pk6K3k3J8J9o1jL5KL2m7J4j4L1kJ4o0K0PMJ9k0k6K6J8j8
$$ 29 19 22 2 -1 20 -14 20 13 -13 10 -13 5 24 -37 -38 -3 -1 31 -16 -2 -16 15 13 27 -33 -13 -6 -2 17 -3 -29 -3 15 -3
5537cOl2M1J3m1J6j1MoL8j0j0K7n0L6l2K2k3j7M6%j7Kpj0j7O6m7lj9K7J0Kj6L
$$ -3 3 -29 12 25 -16 0 -11 -7 -13 25 15 5 32 -18 18 -14 8 -15 -32 14 14 -3 -1 -8 -18 -35 31 -16 -19 -38 -11 -1 1 -15 -12
5572a2jK2qJ5m2L0L5k4j3On4O2m5J9M4l8K1j8J0J0k2J3MK0l3lJ4ql0L0l1L9j3
$$ -12 -13 9 1 16 -26 4 39 15 2 8 -46 16 -29 -10 34 -4 17 -1 9 19 -3 10 14 34 1 -2 12 4 -26 4 -27 12 -1
5605aMj4JK2J2j7k9K0Kpj5%K3j8J1K1n6M6j2OJ9n1M7l8K0N5q5J9L8m6L0j5%k6
$$ -1 3 -11 -10 12 24 7 -22 -2 0 -7 -22 -22 1 -17 -6 15 -41 5 -7 -1 18 -33 14 -24 -4 51 -34 -15 23 -23 7 -8 -8 -34
5639c4M1KK2j9j9QK1J6k3qj4MK8m5j8N1k4j4J2j1J6k4J8Rm1Q9o6J5j1jM8l4j6
$$ -34 7 9 31 12 -7 1 22 38 15 7 -7 -3 25 -20 -38 13 -11 -25 -13 -24 -8 -32 -14 -5 -46 43 -23 -8 -19 -20 28 -6 -22
5672b2L0jJ3pj4J2l4L9qk1K8j9Nk6J0K2K0k6k8L1rNj3K1j9QK2l3OKQNj8j6K7m
$$ -22 8 7 20 13 -1 11 -23 16 8 -13 15 -4 1 -25 -15 7 27 1 -27 4 -5 0 -13 8 -11 -3 19 -14 -8 -6 2 7 -11 -27 0 -4
5708dkrRL1m6N4n5L9rrJOk4L7l7L0k7J1K6k9jOj3J9j9J7k%Kj0k8J4K1rJ5qmL3
$$ -4 -6 -15 -6 25 -21 33 -22 17 8 -1 0 6 -18 19 -18 12 -15 -4 22 -7 -8 -2 -15 4 -15 2 0 0 2 -8 -36 -22 -1 -10 5 -3 -7 26
5746B6k9k0PRN4o0j4K2k0K0L6m5K7%J1k0j3NjJ9kj4K0l6J3j2K0llJj7K9j1j6K5
$$ 26 -3 -23 -16 -7 47 -13 -27 -5 -25 -5 31 -14 13 13 24 4 -9 -4 -5 14 12 -2 18 -18 -5 -17 3 0 -3 -2 -19 10 -1 -17 8
5781Hk5K6Ll1%K1K1l5%nJ2J6k4qJ6%KmK3%n4N8k8L1k9k0K8j6K7lJk9J7rJ6J5j3
$$ 8 -17 9 12 -19 -19 2 23 -12 -12 -17 -5 11 -13 -21 -5 -5 -3 -7 16 16 -38 20 -8 23 -6 -26 2 -14 13 10 11 -18 -1 -10 6 21 8
5818Ho1N6j3K5m3J3L3kml1J9Mk5K5k5K8l9L3NMNJ6n0L6lk3J7Krk7M0jj9K4m5L4
$$ 8 -53 3 -10 15 -28 -15 18 16 12 -19 0 4 -21 4 -21 7 -32 1 6 10 15 31 -19 17 14 -9 8 10 1 -26 14 13 -6 18 -27 7
5854GPk3L1n6M4j0k2JJ7K2kj4Rl8M2j5Qkj7J0k5M0j5j6M4pk6j0J8J4Lqj7J1j4
$$ 7 14 -9 22 -34 10 0 -22 -21 -4 18 16 2 11 -27 15 0 8 6 -11 -1 -26 14 -1 -17 27 20 -6 -16 2 16 19 11 -6 5 -9
5889i%L9m0J7k4L7jm1O2p2M2rJ8Ol7qK6k0J6Jlk5NRJ2k5RJ5JJ9m0L6j2RJ3k2j2
$$ -9 -9 30 -10 7 -17 20 19 -22 40 -32 10 1 19 25 -12 -20 6 -14 2 3 0 -25 -20 -11 1 -24 -15 0 1 20 -20 16 4 13 26 4 -8
5926hK6k2K4j5j1Oj7JL9m1J2J1j9Mj3M2j7lJ8j9Nk8j6J8M5j9J8qj6K2k4%j1M9
$$ -8 18 -4 20 5 -6 0 -17 -16 23 -18 -6 5 -14 -10 -23 19 2 -1 17 -2 3 -25 -41 -23 22 3 21 13 -3 19 -5 -5 -16 33
5960C3p1L3N%nMoj4K5K2Kj9kK8j3k3rJ4rPRK1m3J1j4K1Kk3K3J2l7K3j6j1K5l3
$$ 33 -38 -5 0 0 -5 -1 -7 -21 4 26 28 9 7 35 22 -1 -10 4 -5 2 11 32 -11 0 -14 7 9 -14 9 21 -16 7 -9 -20 5 -28
5996b8L3J1L2m4j5Rj0J0pJ7j2%%k2K6k2K2kJ1K0n1K8Qqj3JkL6k2j5l0L2L9l9k9
$$ -28 5 16 48 4 -11 -2 -12 -2 -9 8 -4 -4 -4 -26 0 -22 0 -2 9 29 -22 6 14 6 -7 -6 -8 28 6 -9 -39 -7 32 -7 -36
6031c6M3qknQK6l9J5M1l8Qoloj8RrON2k9Nrm4O5m7L0k6JL4Nj9Rk7L1j6lJ3l9L2
$$ -36 7 -1 -3 -8 0 26 -13 2 43 5 13 7 4 -2 -20 -11 -20 -14 38 9 14 5 -39 26 -21 9 -17 -16 18 23 4 13 -14 17 1 -2 11 -28 4
6070Dj6kKJ1lLJ6j1J6n0J1PK1J0l9oL1j7K4pJ2j7rJ7mm1L6pN0l3%Rm4N5J3m5L4
$$ 4 -12 -14 -12 -1 -4 -1 15 4 20 -30 -19 -12 9 19 -20 -26 5 -12 12 5 17 0 -9 8 4 -37 -1 -8 42 9 9 18 -26 29 42 -3 31
6107C1n6K8L9m3mj0K5nK4prj7J4L9l5m4K2nK1lLm1j0P2m0Rlj7L8Ol4K7m4L3J8
$$ 31 -25 3 42 -1 -5 -15 10 5 29 22 13 -4 10 49 14 -30 -8 -13 8 5 8 -33 -43 29 -11 -2 -5 -22 16 22 -12 15 -29 4 22
6142B2k2J3k8qK4K3jn0j8L6K4nJmpJ9Lk2j4%PJ3k0JLLJ5Oj8j9K3jL8j6l1J2j2
$$ 22 0 13 -15 -23 1 24 23 -27 -45 -9 15 10 11 7 0 19 22 0 -14 -14 -7 6 -14 -13 -10 -7 8 14 -4 -23 0 -1 37 21 -10 2 -10
6179a0N7j9m9L4qrLjNj8rL9opqMOl3K8j0RoN0k4l6J3PPqj6J6j2JPok0pL6k7M8
$$ -10 47 28 -21 13 5 -4 -1 -2 3 -15 -24 15 9 2 -6 -2 4 -29 -1 -11 -2 -8 42 18 -18 -5 2 9 1 -15 1 -11 -10 -3 -9 -29 -36 0 -27 21
6219B1k2oJ4jl6K5j1J3J2l7J5j0N0KjNk6K2j0j7j8J4K9m7L3nj0j6J4K1j6j5L4
$$ 21 -1 -7 7 6 -30 -5 -16 -3 9 -28 -13 -23 27 29 28 33 7 29 19 2 -16 -2 27 -20 13 8 -2 -18 -4 17 1 -14 20
6252B0m5J4J0QJ2j8j8K4Ljk4Rl5M8k4J8%oL9m6L2kl2J1Ql6M8k2MJ8%k0pjM1j9
$$ 20 -25 -11 -1 7 19 1 -17 7 10 9 -15 -6 -41 7 -17 1 1 -5 34 -12 20 18 -14 -3 5 -31 17 -5 -1 17 17 -3 -10 -11 30 11
6288A1LRj9j5K2k7J1KJRj8J8k0lJ8kNNk0M0m2K2j3rN0k0l9L4k8N6p7K6NnK0j0
$$ 11 14 23 4 -11 11 -16 -5 -3 -2 7 -11 7 -13 -16 2 0 5 10 -10 30 -12 10 -3 -12 38 18 -21 13 -15 41 -36 -10 -5 -10 10 0
6324@k3K9k1J3j5K2j0j5J8j4J0Oj6L4jl3lMPJ1L3o1J9pN0j9l4J7NrJ9kJ7l9%L2
$$ 0 -23 6 -15 -2 -17 5 -5 -20 -2 -16 -6 0 -16 18 17 -16 -19 -15 -8 3 36 -25 -6 -13 37 18 -16 1 6 -3 16 14 31 -8 -8 24
6360B4%Pm2PmK7Rl6J0kl0K4OQl1OL8lk4Nj2K9Nml9KL2LPm8OJ0M3k8J2m9J1J1N1
$$ 24 24 31 -11 -4 -8 19 28 -8 2 0 -30 -6 0 8 -23 -17 21 18 -6 -1 -13 16 21 17 -22 -20 12 15 22 -26 -20 -10 33 5 17 -32 -21 -10 41
6399D1j6m3K5l3O5j1k2j7qL7k8oL2l0KK4J5l7PLLL0mm1oPJ3Jk3K9k1MLOk1J8K1
$$ 41 25 -18 7 -26 39 28 6 -11 -19 18 -10 -16 16 -14 -12 12 27 -10 -3 0 3 33 29 -12 -18 -11 2 3 -20 9 -12 -8 -5 1 -20 -2 19
6436A9k4NL1rrOk6KK0KJKnj6J5r%k0nK7j8Qj8J9QNJ0j6rkj2Oj3K5pn5M8MJ0J0
$$ 19 -5 0 31 22 13 19 -7 -5 15 17 18 20 15 -1 14 5 5 -15 -20 7 -11 -3 -21 -2 6 11 21 5 -4 -6 -18 -12 -25 0 -7 -62 -14 -10 0 10
6476A0JLqj3NJ0L0k2mqk8K5j8K9rqJ4j9J5j8J5J6l5M1rlj9jK7Mn9J5J9j8J5J6
$$ 10 11 14 6 -7 -2 8 38 16 12 4 -24 1 -17 12 3 -5 9 -10 5 -13 2 18 -17 24 15 12 -7 -8 19 23 -36 -21 -2 -20 -5 11
6512A1kl6L8j5mJk6L9KJ1mj3j9OK9k4K7n1MM2k8j3J3J4J7mj5K4m1QNJ5Kn0L1j7
$$ 11 9 -27 11 -4 -8 -7 -33 6 8 19 15 2 -17 -11 18 -6 21 -30 -26 16 -12 -25 -12 2 19 15 0 24 -17 -9 -4 11 13 -37 -6 -23
6548b3J8K0j6k5K2j6mM1mk5K0J4qJ3j4j4k1PM8n3kK7K2k8Kj8k9L6J7l1M9J0l8
$$ -23 -5 15 -1 -26 -4 -20 -24 17 13 -12 8 22 14 27 13 -1 -22 -15 33 -20 -22 5 27 -1 1 -17 -46 -10 7 -24 25 35 -3
6581cjQpk5J9nNJ8J4l1MJ6j1J0Jl0%L2%k4L0l9NLLM9m1Qk3MK8j8k1j2K3L7j2j9
$$ -3 -4 4 -3 -28 -9 -14 -9 9 23 -8 -4 12 1 11 12 -18 -18 14 14 -10 20 -19 -14 -11 -8 41 0 8 -15 -11 17 -1 -22 -34 -11 26 14 -5
6619eNk2M2pnk3J3J2Qk8J0j4KkK1rj1K1j3LL6l0j1L2%k3K4l3k4O0j3joj8J7JL9
$$ -5 0 -22 20 13 8 -15 -2 10 18 -10 0 -14 -12 -14 7 -2 -13 8 -5 -2 34 4 -7 25 25 2 26 -7 -31 29 16 15 9 -9 8 9 48
6656D8k6l9PLJ4k0K4l3POOJJ3k6PK2ll2NrK4J0j7MKOJ1l1K1jplMQm2M3J2k5L3
$$ 48 22 -17 -10 -7 7 -13 11 -22 -15 -9 -3 -2 11 -15 -8 14 11 -21 -16 -25 -1 9 -8 -4 -2 4 15 -16 5 4 -3 -6 -2 6 -36 7 19 -6 27
6695B7k1j7J6ok8M4j3J3pnk0K4k3%KJmNrL0Mk1qJ5l0J9J3rL6l3j2Rj9N6l8oJ1
$$ 27 6 -11 5 -1 -29 15 2 15 8 3 -17 7 -16 -16 -14 -13 -17 -12 -21 9 13 -8 -16 -1 -31 -12 1 -8 28 -5 -17 -8 -27 29 -9 -15 -4
6732dqJ2JL7n7K1k4N5m0K1j9pj6L5mJ2l2nPL3Nq0K5kO3l1oLl0J7J7L%lmK7m1q
$$ -4 -12 0 1 38 -19 2 -22 33 -7 14 -5 -12 -28 7 3 15 -17 -22 -15 18 23 -57 -32 -34 29 -2 -8 -5 -35 -18 -1 2 2 -1 -5 22 -19 -27
6770b7K1j3J6K9j0j5k0J2QK0k4Jl3N3J3j6j2k1OjK9j1j2k5J6j1M4k3Ll8L4K6q
$$ -27 -6 -19 -3 26 16 1 -19 -7 1 21 -3 -2 -35 18 31 15 3 -18 -12 -13 16 5 -7 -32 -16 -27 17 -6 -3 -41 -7 19 11
6803A1k6j6M4j0Pj8J%K8p%l9J6J8M3n6j3Rk3L3QmPm3K9J5Pj1k3KK3k3J6m4M7m3
$$ 11 -15 -31 13 3 10 -8 -7 -7 21 14 14 -25 -9 9 52 -4 -17 -8 -31 2 10 6 13 -30 -1 14 21 10 -13 -11 12 -11 5 -39 8 -35
6839c5K4J8l4J0k8M7Qj1j7j8L7K2Pl1mk2J8M9k1j4j0nJ3J9j5j3k2N1lJ4l3l0J4
$$ -35 -11 7 -27 -17 -45 2 10 -1 -18 -36 1 23 30 -1 -5 -27 -9 40 19 5 -5 -10 3 22 7 -6 -28 23 20 34 1 -29 -15
6872a5J4QOl4OK5l4N1n0kL6j0j6K1k1k3K4M0l6Jjj0M6j9j8J9mpMK7m0qJ3K1k0
$$ -15 -1 7 13 -21 -15 10 -24 27 -23 -25 11 1 -15 6 -15 -38 -14 26 -10 -9 -10 -20 26 7 -11 8 4 -3 1 28 -12 -20 -7 14 -6
6907fL2nlm3N1mj0rj9L7j2l6oK5K5k1pJ7j2Ll5K2PL0l8K3j5J6j4J5jjLolk0L4
$$ -6 26 21 18 -25 26 22 12 3 -16 21 9 -27 -33 -8 17 -4 -11 6 -6 -3 -38 -16 -9 21 -17 6 -9 7 -7 8 7 6 9 3 0 -20 14
6944A4Nj9Oj4Pj2JM7k4J8n2K7L0m8K5l0L8j3j2%J8m7L6m%%JQj8j0J9lJ5j6LK3
$$ 14 19 0 6 -8 -1 -13 -12 35 11 29 -23 4 34 -14 11 -19 19 6 -6 -6 12 -35 1 -3 -3 -3 -2 6 -12 -22 -3 -6 9 -7 -4 19
6980A9pk7K2J0k3K5k0K3k5KL2k4Jlk6J7L3l2J5K1l4qJ6Ll2K0%K5j2Jk7J2J3J8
$$ 19 12 -15 7 17 -6 19 -1 22 -3 -1 31 7 8 5 -21 -4 29 -3 12 33 -1 -9 7 10 -22 -2 -2 23 11 12 -15 -3 10 28
7014B8k6j9J8K8l7J8m8oJ1M8k1Oj0J0QJ7j0KLk1pL6k5Kl7M9qOk9j4J5NM0l5k1
$$ 28 2 -17 1 29 -8 10 -38 -44 -33 15 -6 0 -10 0 8 25 15 17 20 -1 -8 28 3 5 -32 17 9 15 -14 -28 -13 -8 32 -3 -24
7049b4J3PlLoL0m0M5k4j5JL8l4nK8k5oK2JK8j8Nj9j7%J2rK4k1QK0j5j5J3J1l3
$$ -24 -11 -4 -7 -4 -10 20 -20 25 1 -14 -13 25 -9 -14 14 -11 -17 5 6 34 16 21 2 -15 -15 -3 -12 12 -9 -1 19 4 -11 2 13 -20
7085b0L1qK0m0J5kK1l4K1J8m6K0J8jj4k9M2ok0Nj9L1j8%L5m6N1l4K3Pk8J8KLJ0
$$ -20 11 3 23 -17 -2 -4 17 -17 4 22 -24 -4 14 13 -1 -30 12 6 -14 -9 -28 3 -15 -15 20 -26 25 -9 14 21 -7 11 13 16 26
7120B6j3jJ7qj7j7J1J%Ok0J2j1J4QJ0k4J2l1jM8oj3JJ1j3j2PK5%j1l4J2J3l2K2
$$ 26 13 12 29 21 4 -13 -2 -1 -1 5 -15 -3 -14 0 8 18 -6 6 -25 -26 22 16 3 4 15 2 -10 -3 22 22 11 -23 -11 2 -30 -8
7156hjj4M7l7Mmj0K8j4K5Lm2L4l4K1J5kj9qJK9rj6QKNj0j3j4L7mJ7j6mnJ1jj5
$$ -8 -9 -23 24 -13 -9 -13 -23 5 -9 16 19 -23 11 -23 -2 13 11 -8 -16 -15 14 5 -11 -3 -1 4 -6 -19 -33 4 0 17 1 -3 -8 3 2 -13
7194a3K1k0K6lk2OKj0K1J8k1J9m3K3l1J3L8j7Oj9K7j0j7j1J0K3j1rMJ8k3J0L2
$$ -13 8 -12 14 11 -11 -5 -3 -13 8 26 5 24 -19 4 -27 -14 24 7 13 -6 21 11 -6 -17 -7 16 5 -4 0 18 -5 5 37
7227C7l3rk1L4k7JL6lj1k4M1k4J8k8J0QJ6PQm6J5J5Jl2L1ok1J6k4OKoJ9lk5K7
$$ 37 4 -5 -26 8 -19 -18 18 15 4 -20 21 -3 15 -13 -3 5 21 28 36 -10 5 20 21 -11 20 14 -7 9 -15 -9 -7 -13 6 3 -22 5
7263EJ2pk9J2J2j5j3MK2rN7k4k0j6MK1ok3K1qJ3k5JL9m5L0k3pJ0jK8qK6l3jj7
$$ 5 17 10 -19 -7 5 -10 -23 -19 3 -6 51 27 7 -9 -5 16 10 -13 8 0 13 -12 -11 28 -17 13 -10 -17 -7 -8 20 12 38 5 4 -13
7299a3J1J4Jl3K7Mm1K1J1j1J2K8rl2Kj0J7QKk3J9oPJ0j6j9P9n7j3K1l2K1J0j3
$$ -13 -2 12 13 -20 7 11 -30 -9 2 -9 3 31 22 -10 -8 -18 -1 7 9 -14 5 -1 6 16 0 -19 60 3 -10 11 -21 0 10 -3
7333cOk6N1n1K3J2l1L3l1M1lk9J4k0K5k1J0j1K3ok5K4K1l5Qj8J2rK8mRNlk6lK6
$$ -3 3 -23 28 -23 0 12 -19 14 -17 24 21 -8 6 -14 11 -10 0 -11 12 6 -19 5 26 -9 -1 -19 -7 -16 12 8 17 22 19 -7 -10 16
7369A6j6PpLKRJoj8rKK5j1Rj2lK1k2plJ2nJ7kLJ1l1J6k6L5J2qrOj2Jj0L2k8J6
$$ 16 0 7 0 3 5 14 15 9 -9 -18 -16 9 -2 7 -5 -8 13 -9 -16 -19 -7 -12 5 3 6 17 -14 2 -24 11 23 15 6 12 0 1 -9 23 -5 11
7409A1J0j9%PJ2rpk8jK4PRj3nJ0kk5J7pK4Rj9J3o3J9J5kM7m9J7J4j9J5%j0K2k6
$$ 11 21 2 2 9 21 12 5 -23 -24 0 7 16 3 -2 8 6 -19 -2 -9 15 24 5 18 -45 -26 -11 -13 34 -15 2 16 -3 12 12 2 24 -2
7446bkJ9m9N6rj9L7k9j6MK6j7J3LKJlpkNJ1j4pllrK0K2j9Ll5J5K6k0J3j6pJ5j1
$$ -2 -4 15 -34 22 13 -6 31 2 -14 -10 16 -1 12 15 17 18 15 8 6 11 22 8 1 -2 -5 -14 6 28 9 12 -23 -8 18 -2 11 -5 -12 3 -8
7485hK6k3NL4m3M0k4kk4M6k6j7L9k1nK7l0M6j9k4LJ8J4j0p6N5j1qK4j2L8k2kk
$$ -8 18 -5 0 34 -9 31 7 5 -19 27 1 -16 23 2 -3 24 -6 40 21 -3 0 18 32 22 -54 1 -10 -18 6 -6 32 10 8 6
7519FqJnj8kL2k6J1JJ0K5l9K0nj3K1j8LK3J2m9L0j3OJ6j1pRnl5K8K0j1J2qk8J7
$$ 6 -2 -1 -6 -24 -26 6 -20 -9 -8 2 27 -12 8 3 -10 11 -7 -4 19 31 -18 12 -1 5 21 10 3 12 7 -28 0 20 9 21 13 -15 2
7556Bk3kQmJ8J3m5M2l9N3k3kj3K2K5k1KpK6m8K2k0N1k3oQjk2L0k6lM1m6J4jJ5
$$ 2 -21 -23 -15 -19 -1 12 -33 9 -30 23 0 -2 -15 7 32 11 13 6 32 -16 6 -14 37 14 8 16 15 -7 23 -3 -6 35 -11 3 2 17
7592A7MKql5K0j2J0k9PJ7K5Mj3j7k2K4K9Mo6L3RJ4o0O0ooj3L4l4PK6m6L1k2OK
$$ 17 21 23 15 -20 0 -12 -2 -31 -24 -7 18 22 9 -8 -30 -6 23 27 -39 -6 3 17 -43 17 11 5 -8 26 -8 -1 25 -21 10 -12 -6 -4
7628dK2pRj9L3n7K5lK0k0nRl6L9k0JJ4Nk3K1j6%JK8rRl5k7L5L1k0K2l2J9JqK3
$$ -4 18 11 20 1 34 -23 2 -1 19 -1 -6 3 -33 6 -14 -13 1 6 -17 4 -12 -12 -11 17 8 17 -18 -45 -10 21 1 23 -9 10 11 3 26
7665B6j4oNK1l6L8l7J3rJ4k8Oj3K4mL1m4MPj6L8ljj4jkQPqj1K2Kj8K%Qk5J7Nl5
$$ 26 12 6 11 32 -4 34 -3 10 1 15 -13 -7 -20 4 0 31 -13 -9 -2 -18 20 17 16 2 1 -1 7 14 6 -5 17 19 1 3 3 11 -14 3 8 -27
7705b7N1j9KOQl1LK2kj1k3N5k2%Qk1j8L1rkpNj0%K6jk3okRLl5L1LK3l5L1l9PK1
$$ -27 24 5 7 13 21 -10 -7 15 13 2 -21 34 12 12 20 -1 -19 12 3 1 -6 -1 -11 -11 15 14 -9 -15 -17 -8 -5 -40 -9 -6 17 -18 13 -26 -19 2
7745BoK4j8nK3j3nj0j3M0l2K4j0L0lm1J8J7k9J1pJoK7l1j6L2Mk5K7m7J0N1k3Q
$$ 2 -4 20 2 -3 20 7 2 -8 -21 19 -13 11 1 31 28 -13 5 22 -7 4 -3 -2 -8 19 -12 -28 4 8 -17 10 -37 -27 24 1 9
7780Ik3L2l5K6k6K6k9L1K4l6qNNK2k8nlJ7J7m1J7mpPqN6l2l5J6rK6j4kRNoJlJ4
$$ 9 -14 18 -17 9 -17 9 -20 11 35 -1 -9 -4 1 23 -5 -10 -13 4 21 -20 -3 -7 -14 -7 -15 41 9 -26 -10 -19 7 -7 -9 0 5 -1 0 -3 11
7819A1l8J0K8j7J4j1M1m7j6N5l6mL2k4jk2L9j8J7j5k6K9KL1k7kk1KPmRk9L5jj1
$$ 11 -27 -17 11 -6 8 -3 38 -9 -25 30 -6 -10 22 -2 -3 -25 14 -4 13 -2 -28 1 3 34 7 5 -16 -14 -7 -11 -2 -31 4 3 -8
7854hnNJ3MJ0k3K5j1Rk5J6Pj8lRmK0k1qKM4j8m0K8M%k6pL7k7K6J3kj3n1M2j3P
$$ -8 -13 -8 5 9 19 -4 21 10 19 -6 10 17 -1 -4 5 1 21 0 -8 -6 38 20 -20 8 12 12 -14 -21 16 -11 15 28 26 13 -38 4 -9 -2
7892bkK0kk5M6m8rM4m3M5k2LJj9J5J3mppk7J7M5k3rJ4M1k5j7LKj6L5j9Jl2qNJ6
$$ -2 -4 16 14 -11 35 -13 -22 22 -21 24 2 5 6 -13 2 15 11 4 -3 -30 -13 32 9 0 14 55 30 13 16 18 2 37 18 19 -13 -21 -16 0
7930@jK4ll1M3m7L2j0l%JJ2oj3PMm8L3jJ6j2jnL5l2N6k0j4KqK9m1J6j6J2Rk5J6
$$ 0 -1 23 20 -11 32 -15 17 7 4 4 5 17 11 -2 5 9 -39 -6 -7 9 -3 -4 -9 26 -6 50 30 16 18 10 39 -2 14 -2 10 19 -6 10
7968A0Nk1rKJ0k8M0rJjj8J0J3K0k6K0rl0J9nrj2M5j1K0l8K0jk6L6Lk3KOQJ3l2
$$ 10 15 -6 -15 -13 -3 -31 9 0 1 0 -18 -8 5 25 -1 19 10 -20 -1 -6 -15 -27 18 7 27 -11 9 8 -18 18 21 -2 0 6 14 27 -5
8005eNJ3J7l6j8J3J9l5J0L4Jj2l1J2%J6j0K2k2k2M2l1J6Rk5K3Rmk3oJ0j2L1j6
$$ -5 0 13 30 -6 -24 -11 8 -27 -17 17 18 6 -25 -13 -13 3 -7 15 -7 -29 13 -18 -2 7 -18 5 14 10 -13 -19 -9 -21 10 -6
8039fJ7l3PM3m8M3pk1J0nL0k8l8N7l1J8jj7K8qol5L7k4L5lrj5J2j8j4J6j3Oj0
$$ -6 11 -22 -15 28 -20 23 16 -5 5 0 30 2 -36 21 -10 8 7 -10 18 10 4 -31 6 -18 17 14 5 -10 2 -16 -30 -14 -27 -21 -31
8074c1L5PM1n8K3l2L2j0k2L2ol7J8%K5J6n3K9k5L2mjJj7k3M9km0K1j6K4k9LL3
$$ -31 4 11 52 -6 17 -15 17 7 -15 17 11 -26 -8 -8 17 33 -20 9 -16 16 12 11 12 -5 -28 21 19 -21 0 -16 8 -21 -18 15
8108A5kj4J0lpJ1j9NqRL3k9J7k2mJ5Qj2nk7L4koj3L0m1KN2j6LNl2K2L4l5rk8L8
$$ 15 13 -1 9 6 -1 10 -9 -4 -12 -3 30 1 18 -4 -8 7 15 3 -2 -29 5 3 -3 -16 14 -27 -25 27 11 14 19 -13 9 43 8 -1 -29 9
8146Ik6k0N3l1qJ5l3N4n4J1MK0OJ1k3kL4k8%L4l2K5l1M7l7K4lk1J5jm0L1JK3l0
$$ 9 -17 -37 16 -15 -23 -8 -41 13 -41 -30 -26 -6 0 11 -12 -14 20 -8 -8 26 -6 19 -12 35 -2 22 19 -2 13 12 -28 3 4 27 -3
8181clRJ8J6j8k6K2Ok5m
$$ -3 -6 3 21 37 19 -7 15 21 -4 -8
8191h
$$ Imaginary data points
##PAGE= N=2
##DATA TABLE= (X++(I..I)), XYDATA
0@%%%%%%%%%%%%Qj6J6j6J6k1K9l2L7m5N1n9O9p9R0j02J15j30J46j65J89k12K36
$$ 0 0 0 0 0 0 0 0 0 0 0 0 0 8 -8 8 -8 8 -13 16 -16 21 -24 27 -32 37 -42 48 -54 61 -69 77 -88 101 -111 125
35A25k63K91l23L58l95M36m81N30n82O39p02P71q48R32j023J126j243J370j515
$$ 125 -138 153 -170 188 -207 229 -252 278 -304 335 -367 404 -444 488 -535 591 -652 718 -797
54g97J681j871K095k359K675l061L542m160M974o084P673j0092J4100k1665L9851
$$ -797 884 -987 1108 -1251 1424 -1637 1905 -2255 2719 -3365 4308 -5784 8316 -13349 26502
69B6502j43078j13541M23061l79238L07140J0777l06102K73499j93498J18410
$$ 26502 -116576 -230117 192944 -186294 120846 131623 -174479 99020 -94478 23932
79B3932K9902j11282R8911j17118J64091o3519q7684R7335j39799J23357R6885
$$ 23932 53834 -57448 41463 -75655 88436 24917 -62767 34568 -105231 18126 115011
90A15011j28395l036K1493j21486J47426J01424k45661J99849j12167j01817L15768
$$ 115011 -13384 -16420 5073 -116413 31013 132437 -113224 86625 -25542 -127359 188409
101A88409l03328J19107O3661j99681K83194j91875K9357J1519j10509K44204
$$ 188409 -114919 4188 67849 -131832 151362 -40513 -11156 363 -110146 134058
111A34058j95822J39945o0933j88366L20046k44376J19366R8912k88514K53270
$$ 134058 -61764 78181 17248 -171118 148928 -95448 23918 122830 -165684 87586
121H7586r0936n3384J42136j45902M0475O0878k6548k6220K5890m8327k850J01821
$$ 87586 -3350 -56734 85402 -60500 -20025 40853 14305 -11915 13975 -34352 -37202 64619
133F4619p5347K8262k4603k7476M8142k7124O8918j10901P2588J8040j25519K08837
$$ 64619 -10728 17534 -7069 -34545 13597 -13527 55391 -55510 17078 35118 -90401 118436
145A18436j89663L2994J46134k30062K20602r6258r3948J81488j59403J06799
$$ 118436 -71227 -38233 107901 -122161 98441 2183 -91765 89723 -69680 37119
155C7119j5181o2242P4244q0439R0913o1287N599M9896j02206J16147n1094m0337
$$ 37119 21938 -40304 33940 -46499 44414 -16873 -11274 38622 -63584 52563 1469 -38868
167c8868P6251o6266K9658L0804m2001j6235N2326m0370M103O9814j19166P0454
$$ -38868 37383 -28883 775 31579 -10422 -26657 25669 -14701 -10598 59216 -59950 10504
179A0504J1112o8332J11933r7225K1855K7679m8048P5696p5268M7147k6470k2448
$$ 10504 21616 -46716 65217 -32008 -10153 17526 -30522 45174 -30094 17053 -9417 -31865
191c1865J00802j21335P4496j3335p1585J37506r9078J7414L4122p9734P7554
$$ -31865 68937 -52398 22098 8763 -62822 74684 -24394 -6980 27142 -52592 24962
202B4962j3898j0877L130j8926J2494J633K8515l9599M353J2136j8478L6945k0318
$$ 24962 11064 187 3317 -15609 -3115 -1482 27033 -12566 -8213 3923 -14555 22390 2072
215B072o739r628J3052J3289j5533L1690o4000K8550L2717n4140P4290o2281j3098
$$ 2072 -4667 -14295 -1243 12046 -3487 28203 -35797 -7247 25470 -28670 45620 -16661 -29759
228b9759N9129n7410N8290k4910l0314L4532k6490M0250k3378l944O611l0276
$$ -29759 29370 -28040 30250 5340 -24974 9558 -16932 23318 -60 -4004 2607 -27669
240b7669N3360k4429l315J2474m0621L8454N605j3989L806j3829j442J7130J3229
$$ -27669 25691 1262 -2053 10421 -30200 8254 13859 -130 3676 -10153 -11595 5535 18764
253A8764k4851O887j1233m741M1467k5603k56n579j3924L3103j0681Q096j7754
$$ 18764 -6087 800 -10433 -15174 26293 690 434 -5145 -19069 14034 3353 11449 -6305
266f305j1697K6721j5031K8563k1500k5656L4098j9562K6106j08l6552J8845n887
$$ -6305 -18002 8719 -6312 22251 751 -24905 9193 -10369 15737 15629 -20923 -2078 -7965
279g965J4916J1161k1189p805j304J8418M959l801j2185j2362J7053Q581K843
$$ -7965 6951 18112 -3077 -10882 -12186 6232 11191 7390 -4795 -17157 -104 8477 11320
292A1320r472j4486Q62J4595J6336j7080p266o757N89L1486j2979q684l587j4247
$$ 11320 1848 -12638 -11776 2819 19155 2075 -5191 -11948 -11359 20127 7148 -1536 -5123 -19370
306a9370K8671M222r595p625j3638J7343R727J584j1718j4955J1373N631J0719
$$ -19370 9301 13523 3928 -3697 -17335 8 9735 11319 -399 -15354 -3981 1650 12369
319A2369l640k1224L144Q568Q904L200j3997j0268Q754J0032J615m96j6572j530
$$ 12369 8729 -12495 -9351 -783 8121 11321 -2676 -12944 -4190 5842 7457 6961 -9611 -11141
333a1141J5188K060L426j3553q493J1750N527N452j1022p345L527L229J3681r329
$$ -11141 4047 6107 9533 -4020 -12513 -763 4764 10216 -806 -8151 -4624 -1395 12286 2957
347B957r411J816j177J5708k650j2222M61o71R030L835o625o824M44O500M085
$$ 2957 -6454 -4638 -5815 9893 7243 -4979 -4518 -5189 3841 7676 1051 -5773 -5329 1171 5256
362E256O27j0893j687P088L006L137r056k532K442M175O439r606j258j979L635
$$ 5256 5883 -5010 -6697 391 3397 6534 -2522 -5054 -2612 1563 8002 -1604 -2862 -4841 -1206
377a206J1745j1855j251j338K03J3171q575k037k812j625J2389l462j464p376
$$ -1206 10539 -1316 -2567 -3905 -3702 9469 894 -1143 -3955 -5580 6809 3347 1883 -5493
391e493j439J2270j401N1q740k389R343J403K544r135l339L553N941O477j1841
$$ -5493 -6932 5338 3937 3988 -4752 -7141 2202 3605 6149 -2986 -6325 -2772 3169 9646 -2195
406b195k820j435P087J0763j1478j031p518M566J4051p919K023j3394K277J5789
$$ -2195 -5015 -6450 637 11400 -78 -1109 -8627 -4061 9990 2071 4094 -9300 -7023 8766
420H766p164N158j4828j156J5796m147P350j4448o385R649L239J2216j4107p461
$$ 8766 1602 6760 -8068 -9224 6572 2425 9775 -4673 -11058 -1409 1830 14046 -61 -7522
434g522P64L491J5615j0081l718m615M83J3951m635j929j1581M276J2307j079
$$ -7522 -6758 -3267 12348 2267 -1451 -6066 -5583 8368 3733 1804 -9777 -5501 6806 5727
448E727L764k1919L254J0621l91J6504k1433m101M062k068K0010j4299r71k043
$$ 5727 9491 -12428 -9174 1447 1056 17560 -3873 -7974 -3912 -5980 14030 -269 -1240 -3283
462c283k068J7255j6208N203o007l271K3229j3733L127r984r316K0543j108N633
$$ -3283 -5351 11904 -4304 899 -5108 -8379 14850 1117 4244 -5740 -15056 5487 4379 10012
476A0012j0506o769L329J45J3734j2229L507j284n372J6187j6489K729N60n11
$$ 10012 -494 -7263 -3934 -3789 9945 -2284 1223 -61 -5433 10754 -5735 -3006 -2446 -2957
490b957J5277j2470L653j3173J572J4732r718J8831j9587m690J4028j7219K1398
$$ -2957 12320 -150 3503 -9670 -8098 6634 -3084 15747 -3840 -8530 5498 -11721 9677
503I677r529m146J2001j4159J1885j0424J465L500l896J7487j7873M957l454r374
$$ 9677 148 -3998 8003 -6156 5729 -4695 -3230 270 -3626 13861 -4012 945 -2509 -11883
517a1883K1972j2503P679j331j1121Q319o551J0313p333M830K456j2331J6831
$$ -11883 10089 -2414 5265 3934 -7187 1132 -5419 4894 -2439 2391 4847 -7484 9347
530I347j9020Q003Q508j5885K1482j5447J177L343j0487J6067j1060J0625o200
$$ 9347 -9673 -1670 6838 -9047 12435 -3012 -1835 1508 -8979 7088 -3972 6653 453
543D53n868J3142k0998K0184m901p832J7816k1745J2544k498n751J1620r925R226
$$ 453 -5415 7727 -13271 6913 2012 -5820 11996 -9749 2795 297 -5454 6166 -3759 5467
557E467r604N794J36j0347J8150j6928J0765K097j5266J8212j5087O997K895o078
$$ 5467 -4137 1657 1793 -8554 9596 -7332 3433 5530 -9736 8476 -6611 386 3281 -2797
571b797Q938j3628J2528q711K375R851k0002K1144j3346j559J5901k0725J5981
$$ -2797 6141 -7487 5041 -3670 -1295 8556 -11446 9698 -3648 -5207 10694 -10031 5950
584E950p252j680Q503j0950J0382j0133Q535k262p283J5995j8575J1967n19r655
$$ 5950 -1302 -2982 5521 -5429 4953 -5180 3355 1093 -6190 9805 -8770 3197 2678 -6977
598f977J5872j4904P735j329k755O265q732J1704j3084O727M402j3855J9774j7370
$$ -6977 8895 -6009 1726 397 -2358 3907 -4825 6879 -6205 522 4924 -8931 10843 -6527
612f527N224Q063j6457J7727j0851K840K275q304J2375j1708J0306n525n047J4471
$$ -6527 -1303 6760 -9697 8030 -2821 19 2294 -6010 6365 -5343 4963 -562 -5609 8862
626H862j7588J3704l526q466J4538j2106Q043l471m057N646m188R121r766N074
$$ 8862 -8726 4978 1452 -7014 7524 -4582 3461 -10 -4067 1579 -2609 6512 -3254 1820
640A820j823p765J5239j1451P649o94r972J1749r097O870k927j435O925j0151
$$ 1820 -3 -7768 7471 -3980 3669 2975 -6997 4752 -4345 2525 -402 -1837 5088 -5063
654e063J2117j1663O2R457j2052J8006j0731n313Q232j1951J3869l749l45K730
$$ -5063 7054 -4609 -4547 4910 -7142 10864 133 -5180 3052 -8899 4970 1221 876 3606
668C606r289Q442o921N709J55o108J1712r448L292j537o785R615k489N563l110
$$ 3606 -5683 2759 -4162 1547 1702 -4406 7306 -2142 1150 -387 -7172 2443 -46 5517 2407
683B407m829q83k451J0862n110L280r23q227R626q444M367K928n656R292p310
$$ 2407 -2422 -3305 -5756 5106 -4 3276 2353 -5874 3752 -4692 -325 2603 -3053 6239 -1071
698a071K217l647l795R968n097Q406n338o597O384r045J0649P65m869N403q458
$$ -1071 1146 -2501 -6296 3672 -1425 6981 1643 -4954 1430 -7615 3034 3799 -1070 4333 -4125
713d125M529j104k193M573k190M963m065j110r89l540P425q27K470k031n452K660
$$ -4125 404 -700 -2893 1680 -510 4453 388 -722 -1711 -5251 2174 1347 3817 1786 -3666 -1006
729a006j829M347n57L34R70n108M517m430J316L389m154P638n322k320K150m629
$$ -1006 -2835 1512 955 1289 2259 -2849 1668 -2762 -1446 1943 -2211 5427 105 -2215 -65 -4694
745d694P281j371K87O76n827L779j987K592J175l472M321l810N12O25k578L942
$$ -4694 2587 1216 1503 2179 -3648 131 -1856 736 1911 -1561 2760 -1050 -538 87 -2491 1451
761A451j287J057m0k321j20m41L335j161M14m75k316L057k550J674R21k513K919
$$ 1451 164 1221 1181 -1140 -1260 -1701 1634 473 887 412 -1904 1153 -1397 277 1198 -1315 1604
778A604k239R54n66j568L417k107J769j275j802L266l112K462L41k568K475k134
$$ 1604 -635 319 -247 -1815 1602 -505 1264 -11 -1813 1453 -1659 803 1144 -1424 1051 -1083
794a083J444M46j772J279o59R58p15J65J31j308J884q45O08m87j405K141p73O48
$$ -1083 361 807 -965 314 -345 613 -102 63 194 -1114 770 -75 533 46 -1359 782 9 657
812F57j111k95J556j814K224j280o93J742k656K944q59j722K401k086J617k42
$$ 657 -454 -749 807 -1007 1217 -63 -756 986 -1670 1274 415 -1307 1094 -992 625 383
828C83j073J320j539J136J46j36pj434J450Q4p5j64l76J51j28Q35q97P27p69m61
$$ 383 -690 630 -909 227 373 237 230 -1204 246 330 255 91 -285 -134 -262 573 -324 403 -366 -827
848h27K505k583J050O8j493L097k835J157P52k544K831j870J170L11k687L150
$$ -827 1678 -905 145 213 -1280 1817 -1018 139 891 -1653 1178 -692 478 789 -1898 1252
864A252j765N62Q75k427K411j185k24J672j804L15O04m97O66j75j349J656l66
$$ 1252 -513 49 924 -1503 908 -277 -501 1171 -633 -318 286 -211 455 280 -1069 587 221
881B21j003K167k502J373J89j788L563l764J424J256l128M579m105J126K296m777
$$ 221 -782 1385 -1117 256 445 -1343 2220 -1544 -120 1136 -1992 2587 -1518 -392 1904 -2873
897b873N268k884m21K805m642M504j405j769L043l170K097k9j613K169j504k19
$$ -2873 2395 -489 -910 1895 -2747 1757 352 -1417 1626 -1544 553 524 -1089 1080 -424 -643
913f43J516j036p6Q52k047K327j31k462L920l975J534K063m721O080m743K32M632
$$ -643 873 -163 -239 613 -1434 893 762 -1700 2220 -1755 -221 1842 -2879 3201 -1542 -1310 3322
930C322p063O570l560j295O003p907O188j802l285O345o562M529k61m118N552
$$ 3322 -3741 2829 -731 -2026 3977 -3930 2258 456 -2829 3516 -3046 1483 1222 -2896 2656
945B656m259J678J227l039L026j518p65K112j213q25K160k295J129J622m608N370
$$ 2656 -1603 75 1302 -1737 1289 -229 -994 1118 -95 -920 1240 -1055 74 1696 -2912 2458
961B458k994j349N569p620O332k038l820Q645r332N661J24n963R498r030M796
$$ 2458 -536 -1885 3684 -3936 2396 358 -3462 5183 -4149 1512 1636 -4327 5171 -3859 937
976I37J800p628R383p222K561L200p222P574m448l89L842m573L378r12j478K234
$$ 937 2737 -4891 4492 -2730 -169 3031 -4191 3383 -1065 -1454 2388 -2185 1193 281 -1197 1037
992A037q30j508K119p44j297L577m549L111J45m596P639o809L210K045p734J0429
$$ 1037 207 -1301 818 74 -1223 2354 -2195 916 1061 -3535 4104 -2705 505 2550 -5184 5245
1008E245q279K238N342j0678J1201p002j05P335j1258R663m074k166O984q881
$$ 5245 -3034 -796 4546 -6132 5069 -1933 -2038 5297 -5961 3702 -372 -2538 4446 -4435
1022d435O783k082k481N488n777L241n93j364K976k053k67P39q6j427L185k619
$$ -4435 2348 266 -2215 3273 -2504 737 144 -1220 1756 -297 -564 175 89 -1338 1847 -772
1038g72M29K891o542O864l597j904P358r036P835l393m469R270j0321Q502j288
$$ -772 -343 2548 -3994 2870 -727 -2631 4727 -4309 3526 133 -4336 4934 -5387 3115 1827
1053A827n419R161j1521P310L02n751J0069r288M385N89o566P932m896K532J984
$$ 1827 -3592 5569 -5952 1358 1660 -4091 5978 -3310 1075 1664 -4902 3030 -1866 666 2650
1068B650l827K078k876O99J194J664o54k4o49l256L756l106L902J254n078O461
$$ 2650 -1177 901 -1975 -1276 -82 1582 928 904 255 -3001 755 -2351 1551 2805 -2273 4188
1084D188q053K699K467n965J1569q090J390K655j0413J0863n654K746N792j0286
$$ 4188 -3865 -1166 1301 -4664 6905 -1185 205 2860 -7553 3310 -2344 402 6194 -4092
1098d092P380o387J15N651n770Q033m138j689J832n548M746l06J878J527k965
$$ -4092 3288 -3099 -2984 2667 -3103 4930 792 -897 935 -4613 133 -173 1705 3232 267
1113B67j427j767K194n48M211r41j932J823o969N261j029l70P027p597M718m582
$$ 267 -1160 -2927 -733 -1281 2930 1989 57 1880 -5089 172 -857 -1227 5800 -1797 2921 -1661
1129a661l701Q192o511Q375j940n036N464r820O834R52k532P296p840K743j672
$$ -1661 -5362 2830 -3681 4694 2754 -2282 3182 -6638 196 1148 -1384 5912 -1928 815 -857
1144h57l545O131k664L857p88k779M05l303K869P53K428o81j826n1l430L709j398
$$ -857 -4402 1729 -935 2922 2134 -645 -240 -3543 -674 79 2507 1826 0 -51 -3481 228 -1170
1161a170K538J890n038M261n499J236L066l950P742n284j85J500o219P240l200
$$ -1170 1368 3258 -1780 2481 -3018 -1782 1284 -2666 5076 -208 -393 1107 -5112 2128 -1072
1176a072K212K557o632M668m269J423K907l594N035l499p9M19k561L466j582K149
$$ -1072 1140 3697 -2935 1733 -2536 -1113 1794 -1800 3235 -264 -343 76 -2485 981 -601 1548
1192A548n21j559N83k329L244j379J221N54k796K719l371K426L28k080L877m093
$$ 1548 1027 -532 51 -2278 966 -413 808 1362 -1434 1285 -2086 340 668 -1412 2465 -1628
1208a628K720j077k458M766m150L262p48k502L830m332L287l00j751K802l601
$$ -1628 1092 15 -2443 2323 -1827 1435 687 -1815 2015 -2317 970 670 -1081 1721 -1880
1223a880L009j266p38K372k956K596j686K00J365k295K315j679J072l19j292K405
$$ -1880 1129 -137 -875 1497 -1459 1137 -549 -349 1016 -1279 1036 -643 429 110 -1182 1223
1239A223k350K303j238p92K140l269L192j139n65J830l100L019j970J87J846k697
$$ 1223 -1127 1176 -62 -854 1286 -1983 1209 70 -495 1335 -1765 1254 -716 -529 1317 -1380
1255a380L124k687O18J322k916L436j991Q27N62k626K648j844J188K98j110J755
$$ -1380 1744 -943 -325 997 -1919 1517 -474 353 915 -1711 937 -907 281 579 -531 1224
1271A224k506J681m86n12J680k077K067j288l65J005j314J939j654J040p4j452
$$ 1224 -1282 399 -87 -599 1081 -996 1071 -217 -582 423 -891 1048 -606 434 360 -1092
1287a092K099k352K152m43j457K705k941J837m66r34K417k812K141r28o90J835
$$ -1092 1007 -1345 807 364 -1093 1612 -1329 508 42 -892 1525 -1287 854 -74 -764 1071
1303A071k595K761j316p10J968k431K017r18l13J325j585J123p37N90j50n38J174
$$ 1071 -1524 1237 -79 -789 1179 -1252 765 -153 -466 859 -726 397 -340 250 100 -438 736
1320G36j445J312r54J31J083j817J707j168M52K96j357K370k215J170J13j727
$$ 736 -709 603 -351 -220 863 -954 753 -415 37 333 -1024 1346 -869 301 414 -1313
1336a313K869k813J538O41k298K639k156J009L93j459K022j679R37m02m63J410
$$ -1313 1556 -1257 281 922 -1376 1263 -893 116 509 -950 1072 -607 330 -72 -535 875
1352H75j775J455m92k37N62j137J217p75O13k95k37R80j933J960r80k74J626k476
$$ 875 -900 555 63 -174 388 -749 468 -307 306 11 -226 754 -1179 781 -199 -473 1153 -1323
1370a323K353j220o36J874k054J835j083KJ024j929J985j316N79N51j789K124
$$ -1323 1030 -190 -826 1048 -1006 829 -254 -252 772 -1157 828 -488 91 642 -1147 977
1386I77j472M59M22q98J040j131J108p20K26K99j331K314k044P75P55k108K575
$$ 977 -495 -36 386 -512 528 -603 505 -215 11 310 -1021 1293 -751 24 779 -1329 1246
1403A246k067R38O94k028K239j885J360j71j424K410k432J598j24j336K153k166
$$ 1246 -821 117 811 -1217 1022 -863 497 326 -1098 1312 -1120 478 354 -982 1171 -995
1419i95J271J13q38P98q72J090j019Q01l00o31J600k263K065o53j027J989k477
$$ -995 276 389 -449 349 -523 567 -452 349 49 -582 1018 -1245 820 167 -860 1129 -1348
1436a348K348j219l78J883k863K920j988K45J982l709L632j893l42K277l245K843
$$ -1348 1000 -219 -597 1286 -1577 1343 -645 -400 1582 -2127 1505 -388 -730 1547 -1698 1145
1452A145j344m50J596j764J602j448Q07J02q33J467j731J460q97j49J178j458
$$ 1145 -199 -649 947 -817 785 -663 144 246 -587 880 -851 609 -288 -437 741 -717
1468g17J653j813J341k38j409K858l316K630n46k172M092m352K380M40k446L963
$$ -717 936 -877 464 226 -1183 1675 -1641 989 443 -1729 2363 -1989 391 831 -1615 2348
1484B348l955K040j15j823L353l166K442j037j575L092l137K265m58j005J963
$$ 2348 -1607 433 318 -1505 1848 -1318 1124 87 -1488 1604 -1533 732 274 -731 1232
1499A232k118J143o89M74j05N0J345k609K067j773L30K449l307L306k416j91J908
$$ 1232 -886 257 -432 42 -63 -13 1332 -1277 790 -983 -653 1796 -1511 1795 -621 -812 1096
1516A096l181M140l036J018J704m155M585m068J339K801m452M932l537l92K219
$$ 1096 -2085 2055 -981 37 1741 -2414 2171 -1897 -558 2243 -2209 2723 -814 -1206 1013
1531A013l234M163j873K9M54k026K240j898J798j95q73J517k074J356j315N69
$$ 1013 -2221 1942 69 98 552 -1474 766 -1132 666 471 -402 1115 -959 397 -918 -349
1547c49Q35m36J764l369K166j552o41M305m339L618j994k538M831m817L810n47
$$ -349 486 50 1814 -1555 611 -941 -1582 2723 -1616 2002 8 -2530 2301 -2516 1294 747
1563G47k116L988m951L299j390j366M284m159L837k073k410L719l430L176o2j575
$$ 747 -1369 2619 -2332 967 -423 -1789 2495 -1664 2173 100 -2310 1409 -2021 1155 1093 -482
1579d82J300k055J120k85J108p12m9J140k414K261j987N92J749k416L222l136
$$ -482 818 -1237 -117 -402 706 -6 -55 1085 -1329 932 -1055 -463 1286 -1130 2092 -1044
1595a044P74M87k394N087m272K058N52m446N848m512J937K177m985N057l353N34
$$ -1044 -270 217 -2177 2910 -1362 696 1248 -3198 2650 -1862 75 2252 -2733 2324 -1029 -495
1611d95J722l324L862k429R99M22k418K802k424J787M33j751J454j440R35k85
$$ -495 1227 -2097 1765 -664 335 757 -1661 1141 -1283 504 937 -814 640 -800 135 -150
1627a50N11m59j79J288k696L062j639q78L132m072L542j448j449L455m043L364
$$ -150 361 -98 -277 1011 -1685 1377 -262 -1140 1992 -2080 1462 14 -1435 2020 -2023 1341
1643A341j536o86K828m382M175k128p14L396m797L992j374j649L564l474K050
$$ 1341 -195 -881 1947 -2435 1740 -388 -1102 2294 -2503 1489 115 -1534 2030 -1444 606
1658F06n28q32J598j479J277j196Q30k47p45J849j933J173n72j39J068j462J658
$$ 606 78 -754 844 -635 642 -554 276 29 -716 1133 -800 373 -199 -338 730 -732 926
1675I26j899J349l9j634L438l848J938Q25l000M268l697J068J460k848L502k537
$$ 926 -973 376 337 -1297 2141 -1707 231 1056 -1944 2324 -1373 -305 1155 -1693 1809 -728
1691g28Q03Q1j651L271k666J674n63j912L219k608J534L18j819J696j063P07n13
$$ -728 75 156 -1495 1776 -890 784 221 -1691 1528 -1080 454 772 -1047 649 -414 293 -220
1708b20k1J45q7J627k314J075n46j029K906j783J187r98j279J843j418K180j506
$$ -220 -241 -96 -183 1444 -870 205 -341 -1370 1536 -247 940 -58 -1337 506 -912 1268 -238
1725b38RJ374k907L168k054m35K587k823L063j400j773J601j591K474l69q7l23
$$ -238 -229 1145 -1762 1406 -648 -1083 1504 -1319 1744 344 -1429 172 -1419 1055 686 599 276
1742B76j924J892j006J575J57j922J847j511M68J27o85J062k82J215j471j61m26
$$ 276 -1648 244 -762 813 970 -952 895 -616 -148 -21 -706 356 74 1289 -182 -343 -769
1759g69q50L421j446L65j65k690K395p38J011N83j700J040j308J335o98q30K107
$$ -769 -1619 1802 356 721 556 -2134 261 -477 534 1117 -583 457 -851 484 -214 -1044 1063
1776A063j717K008p76k005J589j640K034R14j173j22j573J115J7R90Q0j463J318
$$ 1063 -654 1354 578 -1427 162 -1478 556 1470 297 175 -1398 -283 -266 724 804 -659 659
1793F59j545R30N06j642J569n53P35o0j337K99o17J876l01q7J95k433J909n9P
$$ 659 -886 44 550 -1092 477 -76 659 599 -738 -439 -1056 820 519 432 627 -1806 103 44 51
1812E1J110j982R47j91k4L45o80O71p03J279m35j132R64j383J713K66j139Q74
$$ 51 1161 -821 126 -65 -89 256 -424 247 -456 823 388 -744 220 -1163 550 816 -323 551
1830E51j448P73K21J11L32j257J110q49N86N00j754J829q92p0J126j610Q39l01
$$ 551 -897 -124 97 208 540 -717 393 -456 130 630 -1124 705 -187 -257 869 -741 98 -203
1848b03J12O08n55J24o28Q58k97k24P40j025O98j71k28N12n10L47l69N91o07j58
$$ -203 -91 517 -38 86 -542 316 19 -205 535 -490 208 37 -191 321 -189 158 -211 380 -227 -385
1868c85J168j444J186n40p82J753j617R56Q0j123J202q86Q62l87n60R59r70J196
$$ -385 783 -661 525 -15 -797 956 -661 295 375 -748 454 -432 430 43 -517 442 -528 668
1886F68o82o29J152j189J101J81j009L54l77M65M33j21p78K03L05l30J042r90
$$ 668 -14 -643 509 -680 421 602 -407 -53 -430 35 468 347 -431 -228 77 -253 789 -201
1904b01k27M82l46J218r97k10l8r7J500j379N82n42r64K397j332N63j56j811K235
$$ -201 -428 54 -292 926 -71 -281 -319 -416 1084 -295 287 -255 -1219 1178 -154 409 253 -1558 677
1923F77m94Q9J29j461J068m6O70k18j088M15j91J210r5j042j3o7P27L07q7j158
$$ 677 183 272 401 -1060 8 -38 632 414 -674 -259 -450 760 665 -377 -390 -457 270 577 490 -668
1943f68J97N30p1J348j895k43J083q82J934j276q51R63j086K013o66p61K50j177
$$ -668 -471 59 -12 1336 -559 -802 281 -601 1333 57 -794 169 -917 1096 430 -331 -81 -1258
1961a258K251o53l62L26j764J966p7l33N49j785Q08P68K7j09p81j84M45R32o18
$$ -1258 993 340 -22 304 -1460 506 429 96 645 -1140 -332 436 463 354 -427 -611 -166 766 148
1980A48K5n81m34J543n01L40q54o56J473p53J218j043r33J620j510J965n31j786
$$ 148 173 -408 -842 701 200 540 -314 -970 503 -250 968 -75 -1008 612 -898 1067 536 -1250
1998a250J867j611J613L32j906J354j175Q87O40r68M86j106P79M75k72J89j035
$$ -1250 617 -994 619 951 -955 399 -776 111 751 -217 269 -837 -58 417 145 334 -701
2015g01N31K98J58n9l38k27j31J181p57K89k96j031K118j282L82M90j999K114
$$ -701 -170 128 286 227 -111 -338 -469 712 -45 244 -52 -1083 1035 -247 135 625 -1374 740
2033G40r54K39Q90k136J716q41M70P13j870J671j188M59J047j755J341r83Q3J188
$$ 740 -214 25 915 -1221 495 -346 124 837 -1033 638 -550 -91 956 -799 542 -441 -358 830
2051H30j157M31l17P4K57N2p7m17N78p53Q81p4q46J041j110R35j79o03J166j518
$$ 830 -327 104 -213 -139 118 170 93 -324 254 -499 382 308 -538 503 -607 328 149 -454 712 -806
2071h06J322n67m07J501k207J802m52j029J983k131J409p7j218J690j354P59j05
$$ -806 516 -51 -458 1043 -1164 638 186 -843 1140 -991 418 341 -877 813 -541 218 113
2088A13m37P49r24Q92n03L1K53q20J184n71J52j93l16N51m35J030j001K18J72
$$ 113 -324 425 -499 393 -110 -79 174 -646 538 -33 119 -74 -390 161 -274 756 -245 -27 145
2107A45j117K139j571J87Q99j725K071j303q9P80j382J924q94J82j88j428K012
$$ 145 -972 1167 -404 -217 682 -1043 1028 -275 -364 416 -966 958 64 246 58 -1370 642
2124F42q97Q86R1j812J419r93P97N35j062N15l80O89n23j14j25k81J802j103L13
$$ 642 -255 631 722 -1090 329 -664 133 668 -394 121 -259 430 -93 -207 -332 -613 1189 86 399
2143C99o09j397K032m19J074n45j476R88r96J691n42n26J190j879J912p71j230
$$ 399 -210 -1607 425 6 1080 535 -941 47 -949 742 200 -326 864 -1015 897 126 -1104
2160a104J502j375K070m2j369J40j328J497M24O11l00j740Q31o08J175K25j124
$$ -1104 398 -977 1093 1051 -318 -178 -1506 -9 415 1026 726 -1014 -183 -791 384 609 -515
2177e15J098q57O89m93o62N25l48J947q00m29n28j651K664l79N04L57k435J362
$$ -515 583 -274 415 -78 -740 -215 -563 1384 584 155 -373 -2024 640 261 765 1122 -1313 49
2195D9p25O80P88j337J247r63P20m39j272J509p78J567j8j570M09j329J434P55
$$ 49 -676 4 792 -545 702 -261 459 20 -1252 257 -521 1046 1028 -542 -133 -1462 -28 727
2213G27j03o5j324O93n95Q32K07p92J307j306P21j86j292J454o42J307k79j170
$$ 727 624 559 -765 -72 -667 165 372 -420 887 -419 302 116 -1176 278 -364 943 664 -506
2231e06N30j281J647m9j38P96k135J387m65k12J236j474J251l95m71M94r69R98
$$ -506 24 -1257 390 341 203 999 -1136 251 -214 -426 810 -664 587 192 -279 215 -754 244
2249B44l81O10J3j004O61q86J018M3n19P75j101O95l67Q0M93q93J137r19L19K46
$$ 244 -137 473 486 -518 143 -743 275 318 -201 574 -527 168 -199 -119 374 -519 618 -301 18 264
2269B64j154J738j196L54M84j348J522j051M71L38j025J123r81P22j00p23J163
$$ 264 -890 848 -348 6 490 -858 664 -387 84 422 -603 520 -461 261 161 -562 601
2286F01j076Q01k53o02R74q20P01j76l67J60l24Q62n56L27l53m28R96r37Q80l16
$$ 601 -475 326 73 -529 445 -375 326 150 -217 -57 -381 481 -75 252 -101 -529 467 -470 410 94
2306I4n56R67j033R68n91l30R92r57J218r63k64Q28j252J649o19l47N97j307J301
$$ 94 -462 505 -528 440 -151 -481 511 -446 772 -191 -455 373 -879 770 151 -196 401 -906 395
2325C95k77k22M47p90P66m75K52K8n97P61m42O14l46n76M78l40P91l98j4o9o27
$$ 395 118 -104 343 -447 319 -156 96 124 -473 288 -154 460 114 -462 16 -324 467 69 55 -14 -641
2346f41J073o61N51j55q63J306r74N13M5q70J194q49O38k8q20Q01p67J002j91
$$ -641 432 -229 322 167 -696 610 -364 149 194 -676 518 -331 307 279 -541 260 -507 495 304
2365C04p01P68r92Q58n2l70N58q54N61n0Q9L1n67O63m68M71j32m63O36p52P70
$$ 304 -397 371 -621 237 185 -185 373 -481 80 30 119 150 -417 246 -222 249 117 -346 290 -462 308
2386C08j00m50M22p14R44l77j35M07r29R75m60J14M84j104Q38l28J13L63q16P07
$$ 308 208 -242 180 -534 410 33 -102 305 -624 351 -109 5 489 -615 223 -105 8 371 -445 262
2406B62m58L03J06m77N38o85N89Q6l93L55p34P37j80p4L32p16O55m78K83L83r22
$$ 262 -196 107 213 -264 274 -411 178 264 -129 226 -508 229 49 -25 307 -409 246 -232 51 434 -488
2427d88Q06n58K90L08q27P95o07L02K58n46O13p85N19J37l64M88p51N65j19j55
$$ -488 318 -240 50 358 -469 326 -281 21 279 -267 346 -439 80 217 -147 341 -410 155 36 -119
2447a19M17n54L81k76J97J75m72M62n68N29K0m80O58p91N65p8k57O53r64P02j76
$$ -119 298 -256 125 -151 46 221 -251 211 -357 172 192 -288 370 -421 144 66 -191 462 -502 200 24
2468B4k20O75j032Q52l19k58P76r15O05k77j04O06p04M53k97R1K69m58N21m35
$$ 24 -196 479 -553 299 -20 -278 498 -417 188 -89 -193 413 -291 162 -135 -44 225 -233 288 -147
2488a47J21M9q7L39n08L34k23J75J95n79O94o73L44K67o95Q70q77L91L56p49Q41
$$ -147 -26 23 -64 275 -233 101 -122 53 248 -331 363 -310 34 301 -394 476 -401 -10 346 -403 438
2509D38q33M38K07o92R94r21L25K28n89R33p90K13K29m31N53m32J80o3j46L21
$$ 438 -395 43 250 -442 552 -369 -44 184 -405 528 -262 -49 180 -251 302 -130 50 -13 -159 162
2529A62k68L09m14J95R6j39L03n24M64l33O4N21q22P65o62L5Q44j179J010n01
$$ 162 -106 203 -211 -16 80 -59 244 -280 184 -149 -85 436 -386 379 -283 -248 596 -583 427 -74
2549g4k18Q11j025Q71m88j80P00p39P45o19l3N67p04P46l49j49L24m87L67kj5
$$ -74 -292 519 -506 365 -123 -303 397 -342 403 -216 -249 318 -386 360 11 -138 186 -301 66 64 49
2570D9j18J69m5l03M82n43M39P7n08P59p73K85M1k67P82q47O46l07m78R20j032
$$ 49 -69 100 55 -248 234 -309 130 207 -301 458 -315 -30 11 -256 526 -321 325 18 -460 460 -572
2591e72R56o9q43J133j100M21L06o05Q49o14J81Mk37K49l50N60j60p2J03m85K97
$$ -572 384 315 -528 605 -495 -74 232 -373 476 -138 43 47 -190 59 -291 269 109 37 140 -345 -48
2612d8k4K67Kl6k29l31P22o52M56K27q50J054q55Q4N68r86J057l43K7J16q91Q26
$$ -48 -72 195 197 161 -68 -399 323 -329 127 354 -496 558 -297 -213 355 -631 426 83 110 226 -665 161
2634A61m20N05K03q79P88q33L33N85p86O01l48L6K68l72L5m5L63k10L22k32n94
$$ 161 -259 246 449 -430 358 -475 -142 443 -343 258 -90 -54 214 -158 -123 -168 195 -15 307 75 -519
2655e19O12l14N46k2n75M03m43N29j98m6L12q34R92m46k29O39j142J079p7n09
$$ -519 93 -221 325 303 -272 131 -312 217 19 -27 285 -549 443 -3 -232 407 -735 344 267 -242
2675b42O47q77M40P7LK67n86L10k70L85J00n41N00m73K71J83l12J87l21L56j09
$$ -242 405 -472 -32 45 48 315 -271 39 -231 154 254 -287 213 -260 11 194 -118 69 -252 104 -5
2696eJ83j03n08Q40o69L60K57q17Q37o08K13L98o57M76m13L26l2k72N65p58N55
$$ -5 178 75 -433 407 -262 98 355 -462 375 -233 -20 378 -279 197 -216 110 78 -194 371 -387 168
2717A68j62k63O72p45M32l2k53L52l26L36l45J44Q9k51N80p67M19Q7m45P62o50
$$ 168 6 -257 415 -330 102 70 -183 169 -157 179 -166 -22 67 -184 396 -371 48 135 -310 452 -198
2738a98K11l4k06N67m40K42l44N1N09n77N83n31p0M77m82O29m12j92K75j27M00
$$ -198 13 -21 -227 340 -100 142 -202 -151 358 -219 364 -167 -237 240 -242 387 -25 -217 58 -69 331
2759C31m98K09j78RN93p43M24m01q9Q28n33K82n00j02N43k85N54o26K7K03l86
$$ 331 -167 42 -136 -127 466 -277 147 -254 -343 485 -48 234 -266 -368 175 -110 444 -182 -155 48 -338
2780c38Q37p00NL83l77O92n83j19N0n4O11k76J16n74o2N78k67N28n49o0K99m05
$$ -338 499 -201 -196 187 -190 502 -81 -200 -150 -204 407 131 247 -327 -389 189 -78 450 -99 -159 140 -265
2802b65M73l87J74R8q9M46p99K01p7N5Q52p57K34l29l08P03l61M96k98k08L00
$$ -265 208 -179 -5 93 4 450 -349 -148 -225 -170 682 -75 159 -170 -478 225 -136 360 62 -146 154
2823A54m72M41l34J93M32n07M10n34p1L42j64N37l84oj67j12L51l26M75j36j09
$$ 154 -318 123 -211 -18 414 -93 317 -217 -288 54 -110 427 43 37 -130 -242 109 -217 258 122 13
2844A3J71o37M63j46J72L37m79K48n42L51J77l11N36n64M21j10m78N63n41M82
$$ 13 184 -453 10 -136 36 373 -106 142 -400 -49 128 -183 353 -211 210 100 -378 185 -356 126
2864A26J90k82J94p78M56J80N0L14p89L61j61P9M15n56K33j68K38K16m46jj59
$$ 126 316 34 228 -550 -94 86 136 450 -339 22 -139 -60 355 -201 32 -136 102 318 -128 -129 -288
2885b88N00O4j85k3n95M99J39J15Q2q00M32k5L21P8p20M92l72M89K61q03L86n08
$$ -288 212 276 91 68 -527 -28 111 226 308 -492 -60 -85 236 314 -406 86 -286 203 464 -339 47 -461
2907d61N63M57p01J77n18M58M04k60N0o33L18K95N7J47p29J72K46J82P6n06J01
$$ -461 102 559 -142 35 -483 -25 379 119 169 -464 -146 149 206 353 -376 -204 42 224 300 -206 -105
2928a05j16M46N3l53K1m48P83N5l67J39o67O11J67j39K29p90M46LJ74K44q23M19
$$ -105 -221 225 278 -75 -54 -502 281 336 -31 108 -559 52 219 80 309 -481 -35 -32 142 386 -437 -18
2950a8k0J18L14p55L14k4P9L95m70j6j59L21J56j84j1l39M08m5k6J08m30L58q9
$$ -18 -38 80 394 -361 -47 -71 8 403 -67 -83 -242 79 235 51 40 -299 109 64 38 146 -284 74 -15
2973a5J62m6m48M28j74L54j14n67O14m28L84J04n80M82l94L18J92m97K56k27L82
$$ -15 147 101 -347 81 -93 261 147 -420 194 -234 150 254 -326 156 -238 80 272 -225 31 -196 186
2994A86L3l46J34k75L69J02j89R3m10L47J32Kj61k64K87n8L40l34k35L16l12O34
$$ 186 219 -127 7 -268 101 203 14 107 -303 44 176 178 17 -247 40 -18 322 -12 -247 69 -243 391
3016C91k60m12K54k65O49j90l06J65l89O40j53r6N5n86O93l7o7N5o16M49J49L1
$$ 391 131 -281 -27 -292 357 167 -139 26 -363 277 124 28 83 -503 190 153 86 141 -475 -26 123 154
3038A54j5m01J30N1L61q0l38j0p1N34j69j96k2k32N12j06P3j84m10N96k06K74
$$ 154 139 -262 -132 -81 280 200 -138 -148 -219 315 146 -50 -72 -304 208 102 175 -9 -419 177 -29 245
3060B45j81n00N99k71K69M8n24L84k61L30J44m68J65k00L86j2k30J13k67L18J4
$$ 245 64 -436 163 -108 161 209 -315 69 -192 138 282 -186 -21 -221 165 153 -77 36 -231 87 101
3081A01k5K0l02J98j8K23j76j69K59k64L40j60j24K60m45M01m9j49K44m10L81
$$ 101 76 96 -206 -8 -26 197 21 -148 111 -153 187 27 -97 163 -282 119 70 -79 165 -245 136
3102A36j40n8K37l73L36k51Q2K76m52K79j54kK20k01J70j73OL6P4J25l59K51j58
$$ 136 -4 -62 175 -198 138 -113 -31 245 -207 72 -82 -84 136 -65 105 -68 -62 -26 48 173 -186 65 -93
3125i3R4J76l15K31k47Q4K39k16J96m00K26J67k11L10n16K19J71k43M15m32l9
$$ -93 1 177 -138 93 -154 -70 169 -47 149 -251 -25 142 -69 241 -275 -56 115 -128 287 -145 -184
3146a84K09n0K87l54%m3J20K37k47R4k30M3L34j85K9k19Q9K08l8ol69K81q5J54
$$ -184 25 -25 262 -92 -92 -135 -15 222 -25 69 -161 -118 216 31 60 -159 -70 138 100 94 -275 6 -79 75
3170G5L00o33K11p5O8M54n31R5o4R5K12l02J59k63K06L27m03J34l69R4N23k33
$$ 75 375 -258 -47 -122 -54 400 -131 -36 -100 -5 207 -95 64 -199 7 334 -69 65 -304 -210 313 80
3192H0L1k18q9J53J69nj97J16j52J90N9m17K23J6J99J25l67l9j78L82J48o7L8
$$ 80 111 -107 -196 -43 126 121 -76 40 -112 78 137 -280 -57 -41 158 283 -84 -123 -301 81 229 162 200
3215B00o33M47J00k02L46m94K75K37l38J39l88J47L15J76qn86K2rL42L04m19P
$$ 200 -433 14 114 -88 258 -236 39 276 -62 77 -311 -164 151 327 319 -267 -245 -254 88 392 -27 -20
3237b0j03%K63j13j57K3L20m6k8l06l74O81L3J56m1p32K19J20K43K10m53N4r5
$$ -20 -123 -123 140 27 -130 -107 213 167 139 -167 -541 140 173 329 288 -444 -225 -105 138 348 -105 -51 -146
3260a46L04k0m63L57k07M02K68p17K9j80K49O43k58l14k39P5K15K26p8l26J43
$$ -146 158 138 -325 32 -175 227 495 -222 -193 -373 -124 519 261 -53 -292 -217 -2 224 146 -180 -37
3281c7L1J27Om29N6L23K70j51k77k14n6O31l1j28l5o08N84J86k59J58m44K94K28
$$ -37 -6 121 127 -302 -246 77 347 196 -81 -295 -351 280 249 121 86 -522 62 248 -11 147 -297 -3 225
3304B25r4j32l08K49J33K24o3n80J77P4K08K55n06p8J50Q0J60m5k83q0L82q1M8
$$ 225 131 -1 -309 -60 73 297 234 -346 -169 -95 113 368 -138 -216 -66 14 174 129 -154 -234 148 67 115
3327A15j21l84M83P1l0n4l26J25J40K38j65k73J25j09M72j18l98K47k53K53K80
$$ 115 -6 -390 93 164 134 80 -246 -121 19 257 92 -181 -56 -165 307 189 -209 38 -215 38 318
3348C18l85K3q2J07J72n7k29q9L61n7J2l6l71K35J25O9M4k60p4J16K37k09J3J4
$$ 318 -67 -44 -126 -19 153 96 -133 -222 139 82 94 58 -313 -78 47 116 160 -100 -174 -58 179 -30 -17 -3
3372cj38M21k28j89J93k91L60J37k77n0j43K21N3Q9p2k77K48j67J77J13l89K47
$$ -3 -141 280 52 -137 56 -235 125 262 -15 -65 -208 13 66 155 83 -194 54 -113 64 177 -212 35
3394C5N9r6Q8k14k0J90J03j04J5q9k05L39n5l5O5k50K17j8l8rl2J20j11K38j89
$$ 35 94 -2 86 -128 -148 42 145 41 56 -33 -238 101 46 11 76 -174 43 25 -13 -22 -54 66 -45 193 4
3419Dk02L37k88L16l6l35K94j54L9J03j09M5n7J01j16J22n5j75L32j60n1J40j99
$$ 4 -198 139 -149 167 131 -204 90 -64 -25 78 -31 14 -43 58 -58 64 9 -166 166 6 -45 95 -104
3442a04J03JK7j4l7k2n9K67k48L0K38l53K72p1r6J82k16R6PJ9Mr3J94k27J64K4
$$ -104 -1 0 27 13 -24 -46 -105 162 -86 -56 182 -171 101 30 -66 116 -100 -4 3 22 26 -67 127 -100 64 88
3468H8k28K97k82P6J98k41J21k9k2KP9J8j84J80j85J11J95l28J82r5J4J11j09
$$ 88 -140 157 -125 -49 149 -92 29 0 -22 -20 59 77 -107 73 -112 -1 194 -134 48 -47 -33 78 -31
3491c1M9j11J33m8K6J16l75K49N0j15K47l39Q7J26o8J41j71Pp8J66P9k36J80j98
$$ -31 18 -93 40 -8 18 134 -241 8 58 -57 190 -149 -62 64 -4 137 -34 -27 -105 61 140 -96 84 -114
3515a14J42J61k74J65j70QJ99m8m0j67J31jN5Q4l32K51o6k1K51l33O5k8J43P3
$$ -114 28 189 -85 80 -90 -82 117 69 29 -138 -7 -8 47 131 -201 50 -16 -37 214 -119 -54 -82 61 134
3539A34j82L8j29K40J8j68J73l23J60J73j56J29k62Q6J53J4k7k08J41o4J70O8
$$ 134 -48 -10 -139 101 119 -49 124 -199 -39 134 -22 107 -155 -69 84 98 71 -137 4 -60 110 178
3561A78k93J00j09J61J95k97j3l9J74O5j02K0k69K53M9l5J17m17K59P1l2R1k76
$$ 178 -115 -15 -124 37 232 -65 -78 -117 57 122 20 40 -229 24 73 38 155 -262 -3 68 36 127 -149
3584a49J39k9Q7O9k34J47j75K33J12l23J42j36J43J41j80J9j13J34L0L4o3k43
$$ -149 -10 -39 48 117 -117 30 -145 88 200 -123 19 -117 26 167 -13 6 -107 27 57 91 28 -215
3606b15K56j6N6pk80K22k1N7P0j96L6q5K20Nj95R9j99L25Ok11J08k43K45N0p2
$$ -215 41 25 81 74 -206 16 -5 52 122 -74 -38 -123 97 102 -93 6 -193 132 138 -73 35 -208 37 87 15
3631A5L6k62K04N9K8Rk64K07m4N4Q4k43J19p1J73Pj69j6n6K75o7p9J8k36K24L4
$$ 15 51 -211 -7 52 80 89 -175 32 -12 42 126 -117 2 -69 104 111 -58 -74 -130 145 78 -1 17 -219 5 39
3657C9J2M1k70K02j6N8q5j25K22j10J47o3k11J91j56K41K7k38J03j43J97L6j01
$$ 39 51 92 -178 24 8 66 -19 -144 78 -32 115 52 -159 32 -124 117 144 -94 9 -134 63 99 -2
3680bQ3k02J88m8m5P0j98J94K6l3k0j68J54QQ1k7j18M2j04K20o5q8N0r1J70p1
$$ -2 81 -121 67 19 -26 44 -154 40 66 33 13 -155 -1 7 88 61 -57 -15 -119 101 36 -52 -2 -93 77 6
3706Fq5P5j12K11q0J2kk00K27n0Q2K0k57J68l7L2O8j47R9j08J47n5r1Q1r1J66
$$ 6 -79 -4 -116 95 15 27 25 -175 52 2 84 104 -153 15 -22 10 78 -69 30 -78 69 14 -77 4 -87 79
3732G9j6q9M2j17J48o0M1J2j33J13n3Q6m4r4J92j50L9J0j13J36j02J08J1j10R5
$$ 79 63 -26 16 -101 47 -13 28 40 -93 20 -33 53 9 -85 107 -43 -4 6 -107 29 -73 35 46 -64 31
3757C1j03J42m6r7J43j49J29j1n0Q0j35Q9J3l7Oj00J54q1rO8r3Q9o8Q5m5n2N2
$$ 31 -72 70 24 -73 70 -79 50 39 -11 69 -66 23 36 -1 5 -95 59 -22 -31 37 -56 33 -35 50 5 -47 5
3784Eo4J20m5m5R5j32P1n5J5Q9j31J36p1J3J0p8J12o8N2K1q9J15j26R8j3p5J02
$$ 5 -59 61 16 -29 66 -66 5 -50 -35 54 -77 59 -12 1 11 -67 45 -23 29 50 -39 76 -50 48 35 -40 62
3811F2j42J28k3q2R5j18J04k1k1J08j82Q7J7k5M1j07J44o4Jmn3L6k8Q3L2j02N6
$$ 62 -80 48 25 -57 38 -80 24 3 -18 90 -92 -5 12 -13 28 -79 65 1 2 -2 -55 -19 -47 36 68 -34 22
3838B2j12R8j1PJ04j63Q3q8N3N1q6J14q0nP8k02J93o7J7J04j43J18j58PJ19o9
$$ 22 -90 8 -3 4 108 -55 28 -60 -7 44 -42 72 -8 -13 65 -137 56 -11 6 110 -33 85 -73 -66 53 -16
3864a6J20j32k2J1n4J30m5L2l3j0J8o1M5j3Q8J6r8O7j47Q2K5JJ51k23P9k0n4J60
$$ -16 104 -28 -50 -39 -93 37 -8 24 -9 -19 -1 -62 -17 -30 58 74 -24 43 -104 -22 3 4 155 -68 11 -9 -63 97
3892I7j65J42k1j20J64k29J38j1PJ81k34K7l1l9J91q0J6k0m6qqN6o1R6j3%l9j06
$$ 97 -68 74 53 -67 97 -132 6 -5 2 183 -51 -24 -55 -94 97 17 33 13 -33 -41 -49 7 -54 42 29 29 -10 -116
3920a16J54m8N3O7j77J41k00R7J60j94K11j89K3J03k40K38r3j6J39k05J78j59
$$ -116 38 -10 43 110 -67 74 -126 -29 131 -63 148 -41 -18 85 -155 83 -10 -26 113 -92 86 -73
3942g3JJ69j56J26p9k3M7p1R6k9K3p3J6N6l6K4j08J71j02l2J68k23J87q8n4K12
$$ -73 -72 97 -59 67 -12 -35 12 -59 37 8 31 -42 -26 30 -6 18 -90 81 -21 -53 115 -108 79 -9 -63 149
$$ [...]
8191a5
##END NTUPLES=NMR FID
##END=
