##TITLE=1H_AM_NV140
 CDCl3
 8 sc, 
 12.3.2024
##JCAMPDX= 6.0         $$ Bruker NMR JCAMP-DX V2.0
##DATA TYPE= NMR FID
##DATA CLASS= NTUPLES
##ORIGIN= UXNMR, Bruker Analytische Messtechnik GmbH
##OWNER= root
$$ XWIN-NMR		Version 3.5
$$ Tue Mar 12 16:20:39 2024 Russian Standard Time (UT+4h)  she@DPX200
##.OBSERVE FREQUENCY= 200.1313
##.OBSERVE NUCLEUS= ^1H
##.DELAY= (6, 6)
##.ACQUISITION MODE= SIMULTANEOUS
##.ACQUISITION SCHEME= undefined
##.AVERAGES= 8
##.DIGITISER RES= 18
##SPECTROMETER/DATA SYSTEM= spect
##.PULSE SEQUENCE= zg30
##.SOLVENT NAME= D2O
##.SHIFT REFERENCE= (INTERNAL, D2O, 0, 15.7039)
##AUDIT TRAIL= $$ (NUMBER, WHEN, WHO, WHERE, WHAT)
$$ ##TITLE= Audit trail, XWIN-NMR		Version 3.5
$$ ##JCAMPDX= 5.01
$$ ##ORIGIN= Bruker BioSpin GmbH
$$ ##OWNER= she
$$ F:/spectra/data/she/nmr/H-F/1/audita.txt
$$ ##AUDIT TRAIL=  $$ (NUMBER, WHEN, WHO, WHERE, WHAT)
(   1,<2024-03-12 16:19:27.70 +0400>,<she>,<DPX200>,
      <created by zg, POWCHK disabled, PULCHK disabled
       configuration hash MD5:
       00 E9 B6 7A A2 85 ED C7 34 08 36 98 17 FE 4E 26
       data hash MD5: 16K
       11 D0 B0 61 EE A9 6A 1D 03 2E 3F AF 69 1E FA 94>)
$$ ##END=
$$ 
$$ hash MD5
$$ 46 57 87 C3 38 56 A9 DF 5E 83 14 5A 3B 5F 3B 9C
##$RELAX= 
##$RELAX= 
##$RELAX= 
##$RELAX= 
##$RELAX= 
##$RELAX= 
$$ Bruker specific parameters
$$ --------------------------
##$DU= <F:/spectra>
##$EXPNO= 1
##$NAME= <H-F>
##$PROCNO= 1
##$TYPE= <nmr>
##$USER= <she>
##$AMP= (0..31)
100 100 100 100 100 100 100 100 100 100 100 100 100 100 100 100 100 100 
100 100 100 100 100 100 100 100 100 100 100 100 100 100 
##$AQSEQ= 0
##$AQ_mod= 1
##$AUNM= <au_zg>
##$AUTOPOS= <>
##$BF1= 200.13
##$BF2= 200.13
##$BF3= 200.13
##$BF4= 200.13
##$BF5= 200.13
##$BF6= 200.13
##$BF7= 200.13
##$BF8= 200.13
##$BYTORDA= 1
##$CFDGTYP= 0
##$CFRGTYP= 5
##$CHEMSTR= <none>
##$CNST= (0..31)
1 1 145 1 1 1 1 1 1 1 1 1 1 1 1 1 1 1 1 1 1 1 1 1 1 1 1 1 1 1 1 1 
##$CPDPRG= <>
##$CPDPRG1= <>
##$CPDPRG2= <>
##$CPDPRG3= <>
##$CPDPRG4= <mlev>
##$CPDPRG5= <mlev>
##$CPDPRG6= <mlev>
##$CPDPRG7= <mlev>
##$CPDPRG8= <mlev>
##$CPDPRGB= <>
##$CPDPRGT= <>
##$D= (0..31)
0 1.2 0 0 0 0 0 0 0 0.06 0 0.03 0 0 0 0 0.0002 0 0 0 0 0 0 0 0 0 0 0 0 
0 0 0 
##$DATE= 1710245967
##$DBL= (0..7)
120 120 120 120 120 120 120 120 
##$DBP= (0..7)
150 150 150 150 150 150 150 150 
##$DBP07= 0
##$DBPNAM0= <>
##$DBPNAM1= <>
##$DBPNAM2= <>
##$DBPNAM3= <>
##$DBPNAM4= <>
##$DBPNAM5= <>
##$DBPNAM6= <>
##$DBPNAM7= <>
##$DBPOAL= (0..7)
0.5 0.5 0.5 0.5 0.5 0.5 0.5 0.5 
##$DBPOFFS= (0..7)
0 0 0 0 0 0 0 0 
##$DE= 6
##$DECBNUC= <off>
##$DECIM= 32
##$DECNUC= <off>
##$DECSTAT= 4
##$DIGMOD= 1
##$DIGTYP= 9
##$DL= (0..7)
0 120 120 120 120 120 120 120 
##$DP= (0..7)
150 150 150 150 150 150 150 150 
##$DP07= 0
##$DPNAME0= <>
##$DPNAME1= <>
##$DPNAME2= <>
##$DPNAME3= <>
##$DPNAME4= <>
##$DPNAME5= <>
##$DPNAME6= <>
##$DPNAME7= <>
##$DPOAL= (0..7)
0.5 0.5 0.5 0.5 0.5 0.5 0.5 0.5 
##$DPOFFS= (0..7)
0 0 0 0 0 0 0 0 
##$DQDMODE= 0
##$DR= 18
##$DS= 0
##$DSLIST= <SSSSSSSSSSSSSSS>
##$DSPFIRM= 0
$$ [...]
##$SUBNAM2= <"">
##$SUBNAM3= <"">
##$SUBNAM4= <"">
##$SUBNAM5= <"">
##$SUBNAM6= <"">
##$SUBNAM7= <"">
##$SUBNAM8= <"">
##$SUBNAM9= <"">
##$SW= 18.0517328524113
##$SWIBOX= (0..15)
0 0 2 0 0 0 0 0 0 0 0 0 0 0 0 0 
##$SW_h= 3612.71676300578
##$TD= 16384
##$TD0= 1
##$TE= 0
##$TE2= 300
##$TE3= 300
##$TEG= 300
##$TL= (0..7)
0 120 120 120 120 120 120 120 
##$TP= (0..7)
150 150 150 150 150 150 150 150 
##$TP07= 0
##$TPNAME0= <>
##$TPNAME1= <>
##$TPNAME2= <>
##$TPNAME3= <>
##$TPNAME4= <>
##$TPNAME5= <>
##$TPNAME6= <>
##$TPNAME7= <>
##$TPOAL= (0..7)
0.5 0.5 0.5 0.5 0.5 0.5 0.5 0.5 
##$TPOFFS= (0..7)
0 0 0 0 0 0 0 0 
##$TUNHIN= 0
##$TUNHOUT= 0
##$TUNXOUT= 0
##$USERA1= <user>
##$USERA2= <user>
##$USERA3= <user>
##$USERA4= <user>
##$USERA5= <user>
##$V9= 5
##$VALIST= <valist>
##$VCLIST= <CCCCCCCCCCCCCCC>
##$VD= 0
##$VDLIST= <DDDDDDDDDDDDDDD>
##$VPLIST= <PPPPPPPPPPPPPPP>
##$VTLIST= <TTTTTTTTTTTTTTT>
##$WBST= 1024
##$WBSW= 4
##$XGAIN= (0..3)
0 0 0 0 
##$XL= 0
##$YL= 0
##$YMAX_a= 516665
##$YMIN_a= -451160
##$ZGOPTNS= <>
##$ZL1= 120
##$ZL2= 120
##$ZL3= 120
##$ZL4= 120
##$ABSF1= 10
##$ABSF2= 0
##$ABSG= 5
##$ABSL= 3
##$ALPHA= 0
##$AQORDER= 0
##$ASSFAC= 0
##$ASSFACI= 0
##$ASSFACX= 0
##$ASSWID= 0
##$AUNMP= <proc_1d>
##$AZFE= 0.1
##$AZFW= 0.1
##$BCFW= 1
##$BC_mod= 2
##$BYTORDP= 1
##$COROFFS= 0
##$CY= 11.3945322036743
##$DATMOD= 1
##$DC= 2
##$DFILT= <>
##$DTYPP= 0
##$F1P= 15.7292609196834
##$F2P= 12.9074282941183
##$FCOR= 0.5
##$FTSIZE= 0
##$FT_mod= 4
##$GAMMA= 1
##$GB= 0.15
##$INTBC= 1
##$INTSCL= 1
##$ISEN= 128
##$LB= 0.24
##$LEV0= 0
##$LPBIN= 0
##$MAXI= 10000
##$MC2= 0
##$MEAN= 0
##$ME_mod= 0
##$MI= 1.114404
##$NCOEF= 0
##$NC_proc= 0
##$NLEV= 6
##$NOISF1= 3.799351
##$NOISF2= 2.8
##$NSP= 1
##$NTH_PI= 0
##$NZP= 0
##$OFFSET= 15.70392
##$PC= 1
##$PHC0= -25459.01
##$PHC1= 10.18731
##$PH_mod= 1
##$PKNL= yes
##$PPARMOD= 0
##$PSCAL= 0
##$PSIGN= 0
##$REVERSE= no
##$SF= 200.130013532006
##$SI= 16384
##$SIGF1= 3
##$SIGF2= 2
##$SINO= 400
##$SIOLD= 16384
##$SREGLST= <1H.CDCl3>
##$SSB= 0
##$STSI= 0
##$STSR= 0
##$SW_p= 3612.71676300578
##$SYMM= 0
##$S_DEV= 0
##$TDeff= 0
##$TDoff= 0
##$TI= <>
##$TILT= no
##$TM1= 0
##$TM2= 0
##$TOPLEV= 0
##$USERP1= <user>
##$USERP2= <user>
##$USERP3= <user>
##$USERP4= <user>
##$USERP5= <user>
##$WDW= 1
##$XDIM= 8192
##$YMAX_p= 0
##$YMIN_p= 0
$$ End of Bruker specific parameters
$$ ---------------------------------
##NTUPLES= NMR FID
##VAR_NAME=  TIME,          FID/REAL,        FID/IMAG
##SYMBOL=    X,             R,               I
##VAR_TYPE=  INDEPENDENT,   DEPENDENT,       DEPENDENT
##VAR_FORM=  AFFN,          ASDF,            ASDF
##VAR_DIM=   8192,          8192,            8192
##UNITS=     SECONDS,       ARBITRARY UNITS, ARBITRARY UNITS
##FACTOR=    0.0002768,     1,               1
##FIRST=     0,             0,               0
##LAST=      2.2672688,     0,               0
##MIN=       0,             -451160,         0
##MAX=       2.2672688,     516665,          0
$$ Real data points
##PAGE= N=1
##DATA TABLE= (X++(R..R)), XYDATA
0@%%%%%%%%%%%%Qj6J6j6J6k0K8l2L5m3N4o3P4r0J06j22J41j61J85k12K40k75L11
35A64l51L98m47M98n58O23o91P67q51R43j043J151j270J403j545J700j872K064
53A083k277K513k777L073l410L800m255M788n427O214p209Q510j0297J2928j7235
68i978K5921p5744J62270m4357l26182l119O561q7983J60937L49248m2508k41568
80a26502P7145K31743J8075O9063J76444j42299l88231l8591K20208k7065j73802
91a03812N6m6975j83646N9425K87678K7536j82677K0774J16574m2598N8125K68414
103B78874N6678k37693p5860J34854r809j05687K1176m9176k27223n8670J88716
114h3820O1846r7590L5814P3644j03993l7170K08096J19217j26749m9948J08434
$$ y = [0, 0, 0, 0, 0, 0, 0, 0, 0, 0, 0, 0, 0, 8, -8, 8, -8, 8, -12, 16, -16, 19, -24, 30, -33, 41, -49, 57, -65, 76, -85, 100, -112, 128, -147, 164, -187, 211, -236, 262, -296, 327, -364, 403, -448, 495, -548, 603, -667, 736, -809, 891, -981, 1083, -1194, 1319, -1458, 1615, -1795, 2005, -2250, 2538, -2889, 3325, -3884, 4626, -5671, 7257, -9978, 15943, -59801, 102469, 58112, -268070, -271189, -264628, -352611, -191674, 157574, 115066, -126502, -49357, 182386, 200461, 269524, 445968, 303669, -84562, -123153, 97055, 69990, -103812, -103756, -150731, -334377, -274952, 12726, 40262, -142415, -121641, -5067, -47665, 10460, 278874, 335552, 97859, 21999, 156853, 147044, 41357, 62533, 13357, -213866, -272536, -83820, -21974, -119564, -83750, -10106, -114099, -151269, 56827, 176044, 49295, -653, 107781]
125A07781P715m5212R6061L8453j90963j36525P0969J0313j00610L4794R2695
136a4529q5018q2813J39038J31150n5979k9885O5267l4967o6661J03359J07111
147A76073q8358q5157N6837j0668j12248J5529Q2338q8672j30593N5481R7208
158c2230j4877K3759R4569k4451q6147O2253J00083m9968n8197N1093j2119j02497
170d8729K0023J05042l7757j12063J446K4486m8294J9746R9080j1596q2628M4670
182b6574R6695j6182k3105O3806m819j08315j6625Q2926q77o4345k31k652o3608
195h3906M875Q7218L34p6133J1887O2432j0400k451P9253K6255p8316k9802N1275
208D2521N263l3736J1364r234p6396j9670P1515J8308n6602n498L4174j9870j1389
$$ y = [107781, 115496, 70284, 166345, 204798, 13835, -122690, -51721, -41408, -142018, -107224, -14529, -99547, -182360, -43322, 87828, 31849, 1964, 67231, 32264, -34397, 68962, 176073, 87715, 2558, 59395, 48727, -63521, -47992, 34346, -54326, -184919, -129438, -32230, -47107, -23348, 71221, 46770, -39377, 22876, 122959, 72991, 14794, 65887, 53768, -48729, -28706, 76336, 38579, -73484, -72038, -47552, -95846, -76100, 22980, 11384, -71244, -26574, 70121, 53939, 30834, 94640, 89821, -18494, -35119, 47807, 46930, -17415, -17646, -20298, -83906, -79031, 8187, 8521, -67612, -55725, 6707, -3693, -6144, 73109, 99364, 21048, -8754, 42521, 47784, 14048, 25412, 16178, -60218, -79888, -8373, 9935, -46667, -52165, -17991, -37861, -49250]
221d9250O9487M7777l8879k2730L0924K625j3964K9434K790p6161m3437M4545
233a6839K0864l7925k657K5406k6350k7471M5674M5984j6470j1518K0869m433
245A5134q191M3648K9785m8775m6412J7052R206k9623m075J6409k5319l1920K2925
258d0156L3630j423M054J8546j3592j9200L4764M2354j8109l2625P818P171j9363
271C869k013J4239j8098l3528j471J0453l831J0291K3110r376k3897J9406M0192
284B9346K929j5658N182L121j5167j010J5137o269k1963o936m216j4839L583K3150
298c610j840k5592R0K6830J2946n81Q071M576r118j033J1142P81q016j770q496
313D380k1613n606J7865N105j9191j1438Q436Q912N698J0613O850l131o5O647
$$ y = [-49250, 20237, 68014, 29135, 6405, 37329, 39954, 25990, 55424, 58214, -17947, -61384, -16839, 4025, -33900, -36557, -11151, -37501, -64972, -19298, 26686, 10216, -1302, 19567, 15134, 6943, 50591, 80376, 31601, -14811, 2241, 11447, -18176, -22251, -5842, -31161, -63081, -40156, -6526, -7949, -3895, 14651, 1059, -18141, 16623, 58977, 40868, 8243, 16061, 23232, 3869, 1856, 16095, -2003, -35531, -37002, -26549, -30380, -20089, 3021, -6355, -30252, -10846, 29346, 32275, 16617, 21799, 24920, 9753, 8743, 23880, 17611, -4352, -11288, -15504, -30343, -26760, -3610, -5450, -31042, -30952, -4122, 8824, 8243, 16314, 20890, 11772, 10739, 21881, 22662, 14646, 12876, 4380, -17233, -22839, -4974, 131, -19060, -30498, -22062, -13150, -7452, 3161, 10011, 6880, 6815, 13462]
327A3462K795J440O161l180j9477j3008P607Q947o798j2448o333m72M592Q031
341h681M748O98K389K963O47M976J2322O437r563j4158l020O726L521p284j2874
356a0153p109J392K852J153L560M535q11l236L138J0073R600K675o772r247J450
371C100J1120K596j1212r109r59l181m927K551M263l367m247J572L370P015J2927
386A1512L903j2222n755J2488Q119q289n705K095n272q172L390M725n302l809
400h294P38o424l382J4912J1963j0624q517J2731J0340m872L23O120o977j0180
414b143L534K482p786J87N943j0035j2312J1911J5390q330j0913P830O706m324
428a860M046R639m135o512O111J501r535K072J0711r095j8282M368J4383m215
$$ y = [13462, 16257, 17697, 23858, 20678, 1201, -11807, -4200, 4747, -2051, -14499, -20832, -21304, -16712, -8681, -3933, -3235, -846, 2117, 2764, 7740, 20062, 26499, 16936, 2778, -242, 6484, 10005, 2721, -10153, -17262, -15870, -13018, -11865, -8305, -3770, -4581, -7817, -4679, 5394, 14994, 17669, 10897, 1650, 3100, 14220, 16816, 5604, -3505, -4464, -7645, -12572, -10021, -5758, -9125, -13372, -11800, -8430, -1415, 11512, 15415, 3193, -2562, 9926, 18045, 9756, 4051, 6146, 874, -7298, -3908, 817, -4485, -8294, -7556, -13980, -17362, -2450, 9513, -1111, -9628, 3103, 13443, 8571, 8894, 15014, 8037, -2143, 1391, 3873, -3913, -3726, 2217, -7818, -20130, -8219, 7171, -1159, -12072, -4242, 2464, -1860, 2186, 11825, 7690, 1178, 7289, 8790, -745, 1327, 12038, 2943, -15339, -10971, 3412, -803]
442h03r412M648L405n300L763J0176k433n424P531K976j1490n40J4972o58j7675
457f264k347J2302o5p209L282J452r095k08R695k979q091R051R113j1212n910
472h485J6859Q329j4800p138Q590j158p191O493M631j0802j670J3269k068j3781
486h922N949J1421j3163j3656J3429J2265q584j843J1149k436p838R920N922j6073
500b460o434J3882j118j5589P025J6632r375j4564Q981P152j0817o59J0614o022
514b752q242J5130J1897j2509m540J4351k846j8850K311J3280q480j1729Q671
527d308N967q326L324J1861p525j2197J0119R947j0967l716J4837J792j4046J648
541a590J1842n732j0836M264J799r545K363J3028l283j0874P518J0006r489o922
$$ y = [-803, -10215, -5567, -2162, -7462, -3699, 6477, 4044, -1380, 6151, 9127, -2363, -2903, 12069, 11411, -6264, -8611, 3691, 3626, -3583, -301, 1151, -7944, -8152, 1543, -1436, -9527, -476, 8637, -2575, -8485, 8374, 16703, 1903, -5235, 3355, 2197, -4994, 1499, 6130, -4672, -6342, 6927, 4859, -8922, -2973, 8448, -4715, -18371, -4942, 7323, -1261, -3104, 8045, 5609, -2229, 7691, 13613, -2460, -8894, 4988, 3870, -11719, -4694, 11938, 2563, -12001, -3020, 4132, -6685, -7344, 3270, -2752, -10994, 4136, 16033, 3524, -1016, 13335, 10489, -8361, -6050, 7230, -1250, -12979, -4308, 1659, -6667, -3343, 8518, 993, -11204, -1085, 8862, -2105, -5821, 9016, 10808, -3238, -1590, 10252, 4520, -6316, -2052, -253, -9798, -7435, 5593, 2310, -8564, -1046, 8960, -529, -7451]
555g451J1507L976j2236j105J1813n92p234M760K109j1404j904J1994j778j2474
569a0019N448J2595p025q986J0206O309j2078m215R394q72n629R141O347j1327
583g11l249J3530j039j6462Q72J1543o658j0018R948Q721p800j535Q270m758q597
598g943R055O977j2317m145J5757M076j2436J088J0164p184j1638M455L175q295
612i211J602J0458l645p056J1073R563j1431p700R977K656j0344J050R769k755
626D006n899N627J358r733m96P789o110j0838P883J1834n064n031R206M391p873
641A050q36N921l974n917N460K607q139J41J0105k642j2139J627Q481m316o254
656h825O700N224m467J482P701k266n692M694K578r826l277R776R05j0235J76
$$ y = [-7451, 4056, 8032, -4204, -5309, 6504, 5912, -1322, 3438, 5547, -5857, -7761, 4233, 2455, -10019, -4571, 8024, 999, -7987, 2219, 8528, -3550, -7765, 1629, 757, -4872, 4269, 10616, -711, -3960, 9570, 8531, -7931, -7059, 4484, -2174, -12192, -2244, 6477, -1323, -2858, 5412, 654, -7943, 1112, 8089, -4228, -8373, 7384, 11460, -976, 112, 10276, 3092, -8546, -4091, -916, -9211, -7609, 2849, -796, -7852, 3221, 12784, 1353, -6347, 3630, 6286, -4058, -3008, 6761, 4006, -1893, 3734, 5092, -4641, -5137, 2652, -3458, -14296, -6413, 5421, 357, -4674, 4532, 8923, 1050, 214, 6135, 2161, -3756, 1704, 4311, -3828, -3687, 6418, 3776, -8363, -6736, 1745, -2571, -8825, -2125, 3099, -1368, 114, 7815, 5549, -143, 4551, 7129, -2697, -5974, 3802, 4707, -5528, -5352]
671e352Q029l108o244M233K863n907R66Q096j248m413P318N530q872n184P991
686D698J215r762j164O301k450m272N045K209o378J57O606k991n954O770P446
701G476n713m052P572L027o830j586L112l988m404M132J640n625R53P094k107
716G01o612L967O413m311m592N117L529k824P99L650k935l605L137L54o876j273
732e361N820r43o116K327O660j488l748K762J915k557J111L664k125k651M306
747C576K353n691k501M660m63o776p39M427m39k255K497J696k079J638M104k122
763A886l561L630L439m275k743M426J464m948j843K094j183k090J696N11k652
778d149J536M944p32l385K938L869k953l175K738J955k834j102J289j399j432
$$ y = [-5352, 2677, -431, -6675, -2442, 421, -5486, -4520, 3576, 2328, -2085, 5233, 10763, 1891, -3293, 4698, 5913, -3849, -5013, 1288, -1162, -5434, -389, 1820, -4558, -4401, 2205, -786, -6740, 30, 7476, 1763, -2289, 5283, 8310, 1480, -106, 3006, -982, -5386, -1254, 386, -5239, -4286, 2808, 701, -5911, -1944, 4469, 158, -4434, 683, 4212, 1388, 2187, 5837, 2902, -703, 2434, 2788, -4088, -5361, 459, -484, -6600, -4273, 2387, 899, -2849, -87, 1828, -729, 382, 4046, 1921, -730, 3576, 5929, 238, -2263, 2397, 1934, -4842, -5581, -1154, -1593, -3848, -1351, 345, -1734, -96, 4008, 1886, -1675, 1955, 5394, 1119, -1624, 2802, 4266, -682, -2525, -431, -1614, -3704, -2008, -1497, -4149, -2613, 2331, 1599, -1786, 1152, 5021, 2068, -1107, 1631, 3586, 752, -350, 939, -460, -1892]
793a892K015j90l983R0M246l76l272K059M342j019k283J796J540j572l37O07k167
810c96j229K577M71l862p47L384J3l184M24K875Rj154J113R31k82J262Q49k207
828H47j603K104Q52l111j602K049O07k014n08J393N04r4M60j01k33J720J510j493
846A287j602J541J444j665j989M84P85r96j110JM09N20M82m78n81J407K083l53
864A669j648N68J921l00j783n76O47k80r97o61l34L79R24j56j221L35K186O58
882A331j389k60J707P25q13m69J46J70k10q17j361l56R82J03j580l76J632J147
900C12n04l09P18R05M20l39n39J99R03l22j538n43Q97L8j246q89J53N88M00l45
920a041m34Q85J496J10q69O48J244j85j080l33J10o9q0p01j189K75J131m93j352
$$ y = [-1892, 123, -67, -4050, -3960, 286, -90, -3362, -1303, 3039, 2020, -263, 1533, 3073, 1501, 1164, 1771, -396, -1625, 952, 1423, -2439, -3186, 198, 211, -2973, -2549, 326, 335, -819, 294, 1225, 943, 2205, 3054, 847, -756, 1348, 2200, -911, -2513, -464, 143, -1871, -2379, -986, -482, -576, -116, -217, -450, 1270, 2780, 1287, -315, 1226, 2670, 1005, -984, -500, 285, -711, -1821, -1820, -1411, -891, -409, -887, -1468, -61, 2022, 1669, 21, 589, 2510, 2210, 427, -149, 498, 218, -779, -1440, -1774, -1395, -471, -627, -1848, -1513, 673, 1331, -58, -318, 1389, 2114, 1301, 832, 978, 1148, 938, 121, -1240, -1596, -614, -511, -2091, -2467, -835, 312, -192, -501, 217, 1122, 1542, 1203, 664, 863, 1766, 1444, -94, -637, 260, 298, -948, -1837, -1684, -1096, -696, -1041, -1475, -590, 906, 1016, 147, 795, 2039, 1854, 774, 441, 551, 482, 402, -299, -1488, -1213, -82, -575, -1927]
939a927N82J503l42q41P62R93J19R9J04m71K56J051o20j930J25J269p24j712K63
958a441J047j62n38L08K33L27R13j51r79M23J720m4j632OJ297l7j356n03K08q7
978d48k76m70m54M47J227K77r46o2J538Q72r95r45Q11Q96n86j032l8L79l8l54
998a97o78o90O11J151n31j256Q57K030q7j535M40J264l65p58ok72l00P61k8j693
1018a282j86K118P1k259J08K140m1j228O03P75o29K45P07j263q71J669O49k309
1036i83n65K350K60j918O3J282n32n81R49l00r53J140J234j599j037J856P43j893
1054d84o82J578J90j077M04M60o02O6Q68o84j183R88J016j199q50J381R43r29
1072B04o40O32K47o06J4J09m86J97Q68j28r58M64J099o01j335L46J097l52p46
$$ y = [-1927, -1345, 158, -184, -1025, -263, 730, 849, 948, 1052, 581, 837, 1888, 1268, -662, -537, 732, 8, -1704, -1441, -394, -556, -1094, -786, -553, -226, 687, 536, -443, -20, 1700, 1656, 24, 30, 1327, 1290, -66, -569, -361, -448, -724, -1194, -1648, -1201, 26, 303, -643, -705, 833, 1705, 710, -235, 576, 1472, 886, -146, -184, 195, 157, -197, -875, -1565, -954, 197, -334, -1590, -733, 1297, 1210, -325, 115, 1379, 1014, 256, 250, -22, -322, 439, 411, -1282, -1468, 650, 721, -1538, -1430, 710, 669, -559, 44, 819, 190, 435, 1142, -121, -992, 677, 1326, -983, -1548, 802, 1062, -856, -793, 489, -43, -624, 325, 25, -928, 212, 1446, -153, -1190, 666, 1409, -484, -1166, 412, 602, -475, -71, 389, -213, -147, 721, 37, -1146, -158, 858, -341, -1191, 190, 1133, 204, -436, 196, 443, -163, -149, -40, -526, -329, 539, 411, -547, -83, 1016, 415, -920, -574, 523, 171, -575]
1091e75M00N93k98p0L48n39n46P77L08j180j21J663K91j417l5J376l13j221K40
1110c19M36o30J10R95o27p84J168R20j675q52J566M92j534n9J405j21n96O83p1
1129E07j026L55J080j077j268J396J215j454p47J436L72j234r0O38n28k04J137
1146E08p8j120P56J437r61j401Q32J030j109q17Q31L01n28L23L54q31j53J122
1164D96j70j369M30J479j45j176M17J016m84o60J28p1m14L84L76p22j67J128L12
1183G88j218l15J155N1r31L7Q09q8j97K46n9n74L70N03r22o76R91P63r06n25J006
1204C08N07q84k17L88k69j79M92Jo25M44R89o44r47N41P70p49p36O56M57l75K5
1225d7L78l56j47N74j00j054K17J122k03r30L38R38l88o12J74J51l85J76L22n24
$$ y = [-575, -175, 418, 120, 50, 398, -141, -687, 90, 398, -782, -903, 760, 1051, -366, -401, 975, 662, -559, -319, 117, -513, -403, 592, -35, -819, 349, 1269, -406, -1258, 308, 800, -734, -793, 612, 491, -105, 578, 507, -519, -164, 916, -161, -1429, -33, 1182, -272, -1019, 417, 789, -445, -535, 103, -425, -629, 508, 430, -690, 66, 1503, 542, -859, -27, 1003, -106, -923, -92, 209, -319, 4, 358, -473, -626, 496, 326, -1043, -613, 866, 721, -455, -38, 978, 494, -166, -38, -109, -523, -139, 237, -485, -652, 476, 788, -430, -745, 410, 461, -470, -433, 376, 288, 91, 337, 278, -296, 74, 577, -345, -1021, -30, 733, -173, -698, 308, 815, -69, -286, 102, -167, -346, 146, 147, -478, -34, 955, 311, -636, -95, 675, -74, -810, -154, 303, -72, -47, 331, -25, -172, 402, 302, -752, -535, 587, 384, -546, -208, 730, 342, -270, -96, 55, -330, -154, 168, -356]
1245c56p1Q83K92j053p1R62q7r27m1O93p8l27K26N5l42L26L18o89m55Q96M03p65
1267b08l09Q79K26o18j03K55j40j01J17j89l30N09N66n31n42N67N49o37m07M58
1287A1K69k67q3J90j74M3L26k67n82K13P27l08o31M14O12k10m78J62J53j40M2
1308B2N8l49N6N23L2o54N0O81p9o63kN30k0k57j2O8n7J90J82m37k05M69K53n81
1332b02j65O28J87n05p7K47n9r2P9j58k43M02K85m41k92N26K84l92l06L54J57
1353B17j22j51L7o0J79J11l37j64K68L33l64l16L05L13r8k76N5J64J20p3k95L2
1375a22K43J30j82l20J40K92n3l35j38L60K11k48k22K58J78l9p4j63j1K84N4l25
1397h2j62L49J52l08k32J81J98j05j66Q6PK09R3j51k72M14K14l40l86K28L01k50
$$ y = [-356, -427, 456, 748, -305, -376, 586, 499, -428, -469, 224, 146, -181, 45, 100, -242, 84, 402, -287, -742, 154, 557, -208, -517, 362, 588, -30, -133, 122, -18, -119, -2, -191, -521, -12, 554, 23, -519, 48, 597, -40, -447, 11, 280, 13, -70, 120, -54, -11, 315, 48, -534, -321, 406, 98, -533, -119, 493, 283, -195, -33, 120, -20, 22, 80, -269, -213, 310, 342, -312, -262, 419, 340, -323, -325, 205, 185, -72, -84, -16, -73, 117, 299, -138, -343, 126, 379, -202, -367, 261, 448, -57, -134, 113, 54, -38, 41, -117, -360, 42, 327, -114, -406, 120, 404, 12, -294, 60, 217, 95, -56, -19, -79, 100, 211, -126, -290, -22, 311, -53, -369, -64, 249, 151, -125, -70, 94, 214, 141, -154, -122, 121, 251, 69, -251, -111, 181, 128, -207, -345, 15, 226, -22, -244, 14, 192, 153, 79, -84, -95, 189, 243, -82, -244, 105, 257, -51, -283, -102, 96, -9, -175, -89, -82, 127, 220, 69, -203, 211, 425, 85, -301, -73, 228, -22]
1419b2j90J09K6L3K11j94k50L37L11l37l31K80L25k26j89J19J9J2N6j41k19K03
1441e8K55k19k47K40K63j26j63Q6N7oQj31j21K15J47k83j37L46J13k46j2QN2o2
1465b1L2j97j0K49O0k19j48L56J13k52q5J80m4MK8q6p3K23Q7l47j06K85M7k72
1489a96mJ76K0K7P8j06lJ59J16l42m5K92n1k73q9K60n4p8O3Nr9L01m6k38j4K77
1515A36j8k13MJ91J7m9j05r2Q5J66q7k50J13K73m6k16j6J45N6k6j34q1J64J94
1539B11k14k36J50K48p7j61M7P6rN6q1j85J76K07k13k57K65J95j64k18K01k2J6
1562A1K1l9k07J63K45k00k49K53K94k48j94J59J22j55O6q7p9M2K44j74k19J32
1584i9K61j36k64J02K26l1q7J01k0K9J64j74j81L1K70j54k61P3K08kj53j5J31
$$ y = [-22, -212, -103, -77, -44, 167, -27, -277, 60, 371, 34, -297, -17, 308, 82, -107, 12, 31, 43, 99, -42, -261, -58, 197, -22, -269, -29, 234, 108, -55, 31, 88, 82, 90, -41, -162, 53, 200, -83, -220, 126, 239, -7, -19, -11, 41, -21, 11, -186, -196, 53, 113, -106, -254, 102, 215, -37, -122, 58, 14, 18, 46, -40, -113, 110, 197, -150, -256, 29, 76, -196, -200, -24, -4, 23, 101, -5, -8, 151, 267, -75, -120, 172, 121, -152, -241, 19, -35, -113, -50, -45, -144, 157, 111, -127, -141, 136, 118, -95, -91, 100, 117, 68, -37, -129, -44, 122, 35, -215, -102, 171, 125, -91, -107, 38, 94, 68, -66, -147, 17, 211, -3, -239, -89, 159, 82, -79, -32, 44, 35, 91, 10, -175, 1, 208, -5, -262, 3, 198, 34, -184, 17, -5, 11, 32, -7, -214, -51, 194, -6, -255, -2, 292, 44, -150, 9, 131, -24, 42, -45, -124, -82, 162, -12, -231, -99, 162, 26, -238, -136, 90, 59, -28, 73, 53, 82, 246, 72, -109, -78, 192, 38, -223, -150, 58, 56, -97, -112, 19]
1607A9O8n7%j15Q1J10l2j05RR6M1r6q9R0O8j28l9L3O9k1Mq3M1Q0N2j09j73J69
1635a7J65j68r0J85M2k6r9n1O3MM0n5j38M1J68j09j91J35J98n6j31M8J67Mpj40
1661a8L1k3J19j8k41K5J74M4k71L0J84j6o7Kj9M7Q4P7j61K0J14L2k30q9K05Lj35
1688i7l9J44%l1N4m8p5J50k2r5j02K03J60j92m1J21K0o5n6l1nK8N6r9p5J51P4
1715H8o8j20O2J45n8n9L1M0l7K7m5o5R4K1Pk22M2J58k2j00J4J12k2Pql1M5N2m7
1744D1o5q2J20L7j06%Q8L1r5JN3Lm6K4j3l9R9k3n9n4J28O0j61o5J46L5n6n7N2
1773cJm0J15j19o8J34J24j47j41O3J17o6p1O3O6J3J6j3n9J7J10j14j41O4J43o4
1799@o1L2Q3ok4k9j3JK6p0m2R8R2j2p7m0R0J9j16l3N6Q3p6L7j3m7O8K2m8n7L2
$$ y = [19, 87, 30, 30, -85, -4, 106, 74, -31, -22, 74, 115, 19, -70, 20, 88, -40, -79, -46, 23, 2, 6, -77, -36, 44, 96, -13, -186, -17, 148, -20, -110, 75, 117, 91, -8, -59, 4, 8, 48, -7, -145, -104, 64, -45, -236, -101, 97, 41, -90, -42, 125, 129, 122, -18, 13, -10, 109, 91, -150, -125, 49, 93, -178, -148, 36, 20, -47, -45, -64, -17, 67, 144, -17, 3, 117, 149, -81, -170, 35, 38, -97, -136, 8, 8, -23, 31, -17, -92, 58, 36, -59, -161, 42, 202, 10, -31, 90, 110, 45, -11, -42, -47, -19, 37, -62, -137, 14, 88, 20, -100, -38, 107, 49, -10, 21, 61, 24, 51, 6, -59, 35, 56, 63, -159, -117, 41, 19, -81, -67, 45, 23, 30, 22, -9, 36, 88, 41, -24, -106, 14, 51, -55, -55, 33, 64, -31, -30, 23, 26, -20, 4, -9, -48, 51, 28, -31, -85, 43, 103, -58, -123, 23, 58, 2, -55, -3, -2, -42, 73, -46, -114, 20, 144, -3, -144, -81, 36, -30, -101, -38, 28, 41, 57, 44, -15, 2, 112, -2, -143, -79, 64, 0, -61, -29, 54, 48, 24, -5, -18, -17, 9, -61, -103, -5, 87, 75, -2, -42, 48, 67, -49, -82, -26, 57, -19, 18, 5, -42, 26, 48, 0, -57, -25]
1830b5O8l8j14J28M6q0n6J02rM6l8Nn7L9M8r6j9j7J81o2j42R1K7l2k5L2o6N3N1
1859D1M2j35L3J59j44k3L8R2r1p8M8Ll4Q3k9n0mJ53r0r3J22L6q8m9kK4M3K4Jo2
1889c0k8J04m4n3m0J40p8k8L2J4J5N2l9rL5L9p7n2PJ31m1q0J9M3O4r8lMN2m0k2
1920a1l4N1L6j0j09P9n7N5k2L1l9O7L2q9m9Q0Mk1qk6lJ36k1j42J0J00J6p9o1J26
1950D2J6o0o1K6M3k1Q2m9r4J15K9j23M5M1P7j46J3M9L6k8k4K1r0Q4m8J4o7Q5M9
1979E6r4K6K6J9k8M2n2J3P2l2j07j3M5N1q1j4R6K3k4L2q6jO1K3m5o2J34l7k0k9
2009fO7k0n7L3r7M8P8j9j11N9P1mk1q4J04j9O1m6r3L8J8M2q2N7N7n5p4M4lN2K0
2040E8k7o5K7K1M0o3j0N4n0k4K2J4k7K6k1N1j7K1k4j1k6R2o1m7K1J5pJ8j4m9O2
$$ y = [-25, 43, 5, -109, 19, 65, -15, -71, 31, 22, 68, 30, 35, -22, 17, 65, -31, -50, -67, 114, 52, -90, 1, 28, -4, -29, 3, -63, -10, 41, 83, -52, -19, 140, -4, -27, 11, 103, 12, -66, -18, -15, -49, 34, 5, -45, -49, 104, 14, -79, 43, 79, -9, -58, -60, -36, 7, 31, 32, -30, -58, 46, 2, -51, -91, 49, -29, -57, -25, -11, 4, 56, 17, 8, 43, 82, 5, -47, -40, 91, 50, -30, -11, 32, 96, -2, -5, -1, 51, 11, -11, -45, 6, 42, 32, -77, 2, -55, 0, -22, 9, -30, 37, 69, -20, -69, 11, 15, -6, -14, -40, -43, 93, 72, -70, -60, 40, 56, -23, -84, 42, 58, -2, -63, -37, 6, -15, 67, 18, -76, 39, 68, -55, -10, 31, 108, -38, -25, 24, 60, 32, 8, 29, -61, 23, -25, -11, -78, 7, 56, -38, -12, 14, 33, 5, 47, -5, 8, 80, 48, -59, -72, -27, 24, -57, -71, 25, 48, 24, 56, -30, -31, 30, 53, 8, -54, 80, 43, 23, -6, 61, 41, -16, 17, -80, -32, 46, 27, -84, -25, 46, 42, 21, -63, 41, 22, 83, 37, -56, -18, 0, 42, -40, 17, 74, 19, -55, -11, -14, 38, 58, 31, -34, -7, 14, 54, -9, -19, 35, -15, -39, -17, -3, -30, -4, -25, 26, 9, 30, 6, -5, -31, 61, 0, -47, -26, -11, -18, 0, -14, -63, -1]
2071aJM0p6L0lk1J7L7M5q1ol0%P4m1J6J0l5Qj6k2K8JL4L4l8o7N5Ml8k2L8N9l9
2105ek4K2K1J1k9j2L2K3k6K1o0L0K3K3q7K0K9j5k2M3j3oM8n4MJ2k3oj4l0M2L0
2137Hk2J0J2K5q7M2J3OL4o5Rj1N9l5p5K2P2J2j0n5pO0K0k2m6PO8q3K1l1N1m8J9
2170b7l2M2P1r2J1J5m2M5l0M2k8l2J30n2o2J7O3jj10M4J5k1M6J3m6L4L3k1m6J
2200b0Q9n0l9L2m8j1N0k3k0P2j3k6j4K4k1j1J2L5L2q0rLk0L2K2K1k4J3L0m5l3
2231d0L2k4P6n0n8N4P2p8K8j8m1O7j6J5o3P0Nk3L9p5M6J3m9K7k3NK8Nm1rN8L7
2263F9p4n9M7M5n2n4Q0Ml2j8L6K5m6R8n5k9J0J4l0rJK9j2jk6O4l1JL7q4N2L2k2
2296A0j5k0Q1j01L7L3o5J04q0L3n8N9J7n5oJ6L7j9k1m3Q1m2nJ3l2K9N0o1j9O2
$$ y = [-1, 0, 40, -36, -6, -9, -30, -13, 24, 69, -12, -18, -48, -48, 26, -15, 1, 11, -24, -16, -32, -54, -26, -25, 9, 43, 5, -62, -7, -3, -41, -63, -25, 34, -5, -29, -7, 14, 25, -4, -16, 16, 39, 13, 34, -26, 4, 27, 50, -37, -17, 12, -3, -25, 18, 5, -1, 47, -7, -3, 9, -14, -20, -34, -64, -22, 8, -14, -4, 8, 33, -54, -12, 1, 7, 41, -24, -15, -26, 33, -2, -77, -55, 17, 29, 19, -36, -43, 17, 37, 15, -31, -24, 44, -39, -18, -49, 2, -46, -27, -59, -17, 54, -38, -27, -12, -54, -9, -39, 3, -25, -57, 73, 21, -41, -24, 39, 38, -72, -28, -13, -34, 12, 25, -21, 13, 46, 25, -21, -20, 69, 19, -20, 12, -36, -47, 3, -20, -40, 32, 19, -7, -21, 3, -18, -29, -17, 18, 50, -30, -39, -36, -56, -24, -2, 19, -5, 8, 38, -7, -40, -8, -32, 44, -6, -64, -10, 62, -16, 12, -6, -47, 20, 4, 19, -44, 26, 31, 8, 47, -28, 18, 31, -18, 9, -14, -9, 19, 24, -17, -26, 32, 69, -5, -64, -17, 28, -24, -78, 2, 6, -26, -44, -8, 17, -29, 69, 14, -15, -5, 9, -21, -30, -29, 0, -12, -13, -39, 25, -6, -5, 32, -52, 0, 32, 10, -5, -25, 56, -45, -8, 25, -40, 64, -16, 17, -41, 18, 35, -20, -26, -10, 27, 8, -13, -56, 25, -17, -22, -9, -41, -12, 38, -23, -42, 20]
2326B0L2l6l2OJ8j7L8l1J9PL3q1l9R2ol7j3J0M1Pjn0m1N7J8o2L1K1l8J8J3K6n0
2359b7l2j3J03j0jk1o9M6nO9l1J9j2p2K9M4PJ9o4k0OL2rM0j7n0P7m7RK0o2MM3
2392EJl3L0K6M6j29L5R5j11R5l4m5L5k7Mj3L1qNm4K0K6m7j8L3K7l2P2n0p2M6J7
2424a4M1p1l0L8Mn0Q5N7q9L0m2m4N9OJ3ln2N5k5LK0K7J5l8l3J1mL1k6K1L7r2J8
2457d2M6oK7L7p0J4m0N2m7N2n8k2J31q6jpO0n7N2l0p2Q0j9p6N6L7k2K9j1m7L0
2488a0J1rnnN7k3l7pL0m1M2m3P7p4JK4l0O1m4Kk8k6O3oN3o5M7k7RJ6o1N9J0o2
2522d1LN4j6L0Pn3Lj7K0K7o3N7k4L3p3L7K4L6j14O2rK0J4l1K6j7J1o5L0O5o6l8
2554f8P9Oj7L6k4m6L5PL8k1k3j4L1m8K3qM8n8L7o3M5j6N1m6L2Om1P0Oo8N0ml7
$$ y = [20, 52, 16, -16, -10, 8, -9, 29, -2, 17, 24, 57, -24, -63, 29, 23, -14, -27, -17, 24, 31, 30, -20, -61, -4, 14, -48, -17, 4, -34, -16, -3, 23, -27, -59, -72, 31, 21, 20, -1, -70, -24, -29, 40, 9, 28, 16, -56, -27, 17, 24, 43, -21, -41, -35, -3, -12, 28, 11, -39, 38, -9, 0, 20, -42, -38, 5, 6, -27, 3, 29, 75, -54, -19, 76, -35, 60, 26, -19, 16, -11, -7, -20, 11, 3, 8, -36, -16, 10, -37, -55, -22, 5, -27, 45, -5, -77, -31, -14, 27, -44, -74, -36, -32, -82, 3, 60, -29, 1, -41, -85, -26, -20, -7, -10, -62, -7, -32, -29, -9, 18, 33, -5, -38, -27, -31, 0, -26, -5, 32, -60, -42, 4, -2, 25, 62, -8, 6, -34, 18, -29, 23, -35, -57, 74, -12, -13, -20, 40, -17, 35, 5, -67, 13, -6, -82, -26, 11, -11, 18, 7, -40, -10, 1, -8, -13, -18, 39, 16, -21, -28, 2, -39, 3, -40, 37, -37, -36, -12, -42, 19, -25, -23, -51, -77, -14, -20, 33, -32, 15, -12, -3, 13, -48, 11, 21, -41, -38, 16, 0, 30, 37, -16, -13, -30, -10, 17, -46, 11, -13, 20, -53, -16, 8, 44, -70, -8, -17, 3, 17, -14, 12, -5, 6, -59, -29, 36, -30, -68, 11, 17, 0, 36, 12, -34, 1, 8, 46, 25, 2, -12, 19, -29, -6, -14, 34, -24, 13, -50, -5, -21, 30, -16, 16, 22, -19, 51, 57, -11, 39, 35, -2]
2587bRj2k0R1l4n8J0O1j6l7j4K1rk3O0n0O0Kn0J5q7Q7K7p0N9%qj8n7P8jj8l4M5
2621Gll9P9k2k6M1k3kJ1l8oJ2l5M9n0N8k0j8J5L4K9j7m4n9Q5m1j4L0p4Q5K8n4
2653b2qP9k8l1Q5n9J1j4j9NN0n8j2K9n9N0j0J6Mj2K3j3J8l3MJ4njRj9oM7o4k3
2687e2Q8k9n4L4L4kl1M8o0K9k4J9o4N9l6N0l2l8M0L6n2L1l4P9l4Mmp%jl1L0J1
2720Gj3L7n1l8K1LM7l8j9L6Qk4j6L2L4l4M3l9J7J1nm3M9p5K8K1Mj3KN8j3oPl4
2754DLk7M8j6%J1k3K7m1J2Oj1j4j8M8k0k5M1k4L0j4J5l6M8Mj5qK9m5k6L8PPOk8
2789gO2q4P2oq0J1P8m9P%K5n0k2M5%k3j3K3p5J15rOm3J4P1l1o6N1k7l2M0Rm4K1
2823a1J1ooJ2MJ5oj6k9L5L5j0o6M5l1MjlJ2M4o5K3LQJ6J2q0J4J6M5j9k5K0j7j7
$$ y = [-2, 7, -5, -25, 66, 32, -26, -16, 45, 29, -8, -22, -1, -10, -33, 27, -23, 37, 39, -11, 4, -83, 4, 31, -39, 20, 20, 12, -6, -63, 15, 14, -4, -38, 7, 4, -35, 44, 22, -4, 37, 14, 12, 23, -15, -21, -9, -44, 5, -45, 13, -7, -25, -10, 24, 53, 36, -8, -67, 18, -23, -37, -7, -81, 4, 32, -22, -30, 49, 21, -10, 75, 16, 27, 13, -6, -1, 49, -9, -21, 8, -51, -1, -11, 5, 9, -3, 20, 7, 25, -8, -4, 10, 5, 4, 13, -6, -12, 35, -29, -52, 36, 7, -47, -13, 21, 19, -12, 36, -24, 5, -19, 0, -64, -5, -41, 9, -23, -61, -21, 15, -37, -6, -40, 39, 5, 9, 5, -2, -2, -3, -34, -4, 7, -6, 31, -20, -58, -37, -34, 13, -25, -44, -8, 0, -24, -40, -8, 26, -8, 35, -4, 13, 24, 19, -24, 25, -50, -22, -1, 3, -10, -8, 50, 37, 31, 38, 4, 7, -20, 28, 12, 12, 23, 0, 27, -14, -2, 4, -7, -21, -39, 9, -11, -36, 5, -19, 11, -3, 12, -24, 24, 28, 13, 5, 34, -11, -37, 1, 8, 15, 21, -7, 55, -29, 43, 37, -43, -32, 46, -3, 4, 4, 29, -21, -43, 2, 2, -21, -34, -11, -86, 29, 20, 26, -17, -3, 68, 37, -29, 22, -5, -37, 3, 12, -32, -11, 0, -6, -12, 0, 4, 19, 13, -3, -32, 3, 38, 28, -38, 7, -24, -20, -21, -24, -12, 32, -33, -10, -7, 1, 17, 29, -51, -37, -21, 24, 5, -20, 0, -17, -34]
2858c4L6J7m5O3p6M1rjn1M2pJ2M3l6J3j7K8k6l1J0M5o8K2N0k7mL6o9N5PrqJ7l8
2892a9k2M0k3J0K0Oo1L4M1n3J5M0j00N8m2N4K8l1OlM8o0L2m1M0L4l8m4K7j3O3
2923D6J3r4K5ll2K0O2l4l7Q4l7j3k2k4P0n5J6k3j4J6L5J2M3p9J1LjM3J9m1n6R7
2955E0m3j9L0JRj14J10onk3l2KM4OL0l2K0k6Lj5mOMnL2k3k2PR8m9m5j3K4M9n4
2990erk5J2M3j3N6p7PN3m8J1k1k9N0KM9j08lN7n7M8L8l0k1Mp6J11k1N0l5n1N1
3022A3k0K8J2OL6p2J8Rn7M3Lm4k0L2rK7nN6m5j9M1q8L3K4M1n3j9L3j9J2K1j6k3
3055b1K0pJ4j5L0K2J1n7k8k4N9l0L8qj0NJ9l4K2Jl5L2j1L6l8K2l7R1j06N5k9j1
3087b4k0j8O5k7k3L7N4o1j7M2j4k5L1l6L9L8q1J8J7kn4Q7nJ2o9P4k4m7Q1q4M3
$$ y = [-34, 2, 19, -26, 37, -39, 2, -7, -8, -59, -17, -24, -12, 31, -5, 8, -9, 19, -7, -38, -28, 17, -51, -29, 21, -6, -10, 26, -43, 12, 19, 10, 2, 19, -19, -41, -1, -24, -14, 6, 12, -49, -15, 26, -27, -12, 28, -72, -14, -56, -2, 26, -5, 1, -2, 46, -14, 18, -23, 17, 51, 13, -31, -4, -17, 46, 59, -35, -10, -13, -45, -25, 37, 3, -34, 50, 13, 0, -22, -46, 24, -31, -15, -38, -52, -36, -1, 11, 54, -25, -14, -11, -12, 31, 50, 9, -47, 50, 7, -12, 18, 19, 28, -86, 24, 18, 13, -10, -42, -40, 4, 10, 40, 8, 28, 2, 5, -10, -14, -8, -4, -9, 23, 0, -22, -15, 83, 34, -11, -24, 0, 49, -5, -14, -39, -27, 16, 3, 59, -18, -11, 42, -6, 5, -16, -45, 5, 7, 56, -52, -55, 2, -55, -7, 31, 1, -20, -16, -92, 19, -2, 48, 13, -38, 13, -7, 21, 33, 39, 75, 3, 21, 30, -27, 16, 19, -25, -45, -13, -22, 5, 0, 56, 11, -8, 33, -55, -22, 2, 43, -10, -29, 4, -15, -3, 18, 2, -21, -1, -8, 6, -9, 21, 43, 54, -3, -31, -55, 4, -26, 12, 4, -6, -1, 18, -16, 6, 7, -28, 4, -7, 29, -9, 13, -24, 67, -39, 16, -13, -24, -44, -62, 3, -24, -47, -10, 44, -17, -34, 8, -6, -31, 0, -36, 3, 41, -40, -22, -5, -7, -61, 26, 21, 33, -36, 38, 14, -33, 48, -36, 7]
3118Gm8O4k3K7qJ3n2M9o6M1j1Nj5L5J7r0L1O6m9k2O8n4k7N8K1j4k4jo5M9KL8m3
3151b1QJ05o9o4J09p6J2J0j7Qj8Jj4J7MroL0M0o8Ql8R9o6LM7r8R3m1OL5pl2j7
3185b6M9lJ5j0l7kl7J12r0j9OP0o9M7K5j4K6n0l4k3J8J8K4k3M3J4k1O0o2n3N9
3216A3l3k8N8J9o0LL0m0K6J1LJ3M5l3j5j2K9L9m0pm4J3K4k3l7K2K5KJ0J6jp1K0
3249b3j8L0K8J1m3J7rJ6l4L1rmK3Mk9K6J1jl5K4%l6k6L6OJ5l5K7l6Kn0M0N1m3
3283c3O3Rk6j6J1Lp0R0k0NJ5jk8J2j7Rl7J4Lk3R4k9j1Km6K1kOL5mk0L5r1Jk6M7
3319b5J2m9P1M2p4jK5mkk0Q3m0l4M3J8n5J4n8O2N5l7m4KK6k1J7k1l4P1jk7j1m
3352b1J9l2L8J5j4pK5n8O4p6J03k5o0l2K3L8j6k9K1j0NRM5j1j5K5j8l1M5N2n6
$$ y = [7, -41, 23, 0, 27, 19, 32, -20, 29, -37, 4, -7, -2, -17, 18, 35, -55, -24, 42, -7, -29, 39, -15, -42, 16, 37, 23, -1, -2, -67, -18, -16, 22, -21, -13, 92, 23, -41, 68, -8, 4, 14, -3, 5, -13, -12, -26, -9, -5, -14, -20, 10, 50, -18, -10, -48, 51, -15, -12, 35, -63, 30, -11, -5, 30, 23, -9, -26, 23, 20, 35, 25, -12, -14, -51, 61, -29, -48, -42, 28, -41, 6, 31, 17, 43, -7, -41, -64, -46, -28, -4, -27, 16, 30, 9, 69, 7, -46, 13, -20, -48, 10, 29, -31, -28, 2, -38, -12, -1, 2, 15, 60, 27, 12, 0, 29, 68, 28, 21, -23, -10, 14, -9, -46, -24, 1, 3, 13, 29, 28, -43, -23, -41, -11, 17, 28, -15, 2, -7, 9, -25, 6, -3, -7, 16, 20, -9, 17, 28, 27, -8, 16, 16, -20, -46, -10, -4, 11, -24, 3, -33, -31, -81, -41, 10, -33, 30, 39, 13, -3, 8, 11, -59, 31, 11, 16, 31, 30, 2, 14, -3, 6, -31, -17, -14, -37, 57, 28, 17, 19, -27, -6, -8, -2, 33, 29, 9, 44, -47, -46, -72, -25, -13, -62, 9, 51, -23, -24, 1, -3, -5, -25, 58, 18, -16, 27, 45, -10, 4, -54, 8, 63, 26, -18, -16, 10, -11, 6, -15, -49, 22, 21, -6, -17, -21, -2, -34, 4, 19, 5, -2, 23, -35, 29, -47, 56, 31, -29, -61, -38, 0, -16, -45, -24, -34, -29, -20, 25, 14, -1, 24, 6, -25, 20, 72, 16]
3383A6m1J0LPJ9o6R5j1lQp6N0l2j9Q1n2K1k5L3n1L7J8j2l9J3NM5k8PoOL6m9K7
3417B7l6p6Q6J7j8L3n2M7l8N0J4o2KOK9l6O5k3l6K5j8olK9k4j2RMM0l1n0RRJ0
3451a0O9q3J8%m1N4qmL3l9K2l8O8n2j6j1K1K0ok2J1J0n5N8OJ6k0Kl2J1M2L2r3
3484c7O0p6O2J8jJ2m0l2K5J4K7m1N9n8K1Lm2P9p1L1m3k9O0L1r3Q4J1p3R8q6O0
3515C3J1j4o5kM5Pp2R6j04M8L1l7P7m8o8O2K3n1QM6k1k9N9k3J9l0k7l1J03lq8
3546d5O4k5J5K3n8M1k0K2l7j2L0LkrJ4J1l4L7M6r6O2m1L4jqm4K0J2LPl6J3RJ0
3580Hkj9Nm0K4L7K7p4N2l9N0m4K0k7j4J8k3M1M3k6k0KLj1n5M8pJ5LL9o8j8K5P3
3614D6m5k7NM7pm1J9L1L9q0K5O4o0n9J04p5O8q1okO3j5J6%n9K9Mk9N5J4o9R4j38
$$ y = [16, -25, -15, -12, -5, 14, -52, 43, 32, 29, 37, -39, 11, -21, -40, 41, -11, 10, -15, 18, -33, 4, 22, 10, -29, -16, -11, 34, 6, 13, 7, 13, 49, 0, 27, -9, -85, 1, 18, 0, 33, -19, 28, -10, 40, 54, -8, -6, 0, 29, -7, 58, 35, -1, 24, 6, 0, -3, 26, 2, -10, -1, 3, 43, 12, -38, -29, -20, -10, 59, -24, -6, -6, -47, 7, -1, -5, 28, -11, 11, -27, 41, -11, -27, -38, -17, 3, -3, -25, -14, -4, -59, -1, 5, 21, 1, 3, -29, -18, 24, 56, -37, 23, -53, 9, 27, 26, 38, -2, -34, -9, 5, 32, -9, 50, -8, 13, 16, -26, 53, -18, 13, -30, -59, 1, 32, -61, 23, 34, -39, 59, -27, 33, 44, 30, -35, -37, 8, 15, -57, 39, -65, -17, 14, -23, 54, 6, -62, 0, 23, -28, -20, 26, 5, -24, 35, 12, 31, 1, -26, -57, 46, 43, -45, 19, -6, 9, 32, -26, 15, -5, 17, -20, -32, -2, 1, -1, -10, 4, 15, -19, 18, 64, -32, 30, -11, 23, 22, 14, -30, -10, 2, 5, 12, -24, -11, -2, 8, 6, -13, -8, -48, -24, 13, 40, -34, 18, -21, 29, -15, 5, -22, -36, -18, -41, 0, 43, 17, -3, -1, 2, -9, -64, -16, -23, -8, -5, 34, -34, -52, -27, 46, 1, -26, -21, 26, 19, -22, -3, 28, 67, -13, 12, 76, 16, -43, 61, -14, 54, -27, -33, -35, 28, 13, 29, 29, -30, -1, 3, -26, 29, 43, -26, 68, -70]
3647g0P9j5l8P1r4M2M6nk7Ok4K0krrO2n5j5L9N7o5o6M6K7J2n4K6J3kj8M0mk0q6
3681i2J25oj4o4K6M1Nj5J8n9M8JoRl3j0PJ0jM6j4L2m3K8k4k3NJ2Jj2k5LMK0L8
3716C8Km4m8L8lL3m9K2M8o1K0l8P0l3K0L2j4n8K5L8n7M4Qm9k9P5j05P7Jj3lO8
3748E5o5j7PL0J8J8l3klrj4K9K4k6k3n3P2%Rj3K1l7M8o4L2l8J0PL6j9j7rL9o9
3782e6Q2Kq7O6q1R4o2J3L4J3m2N2%o8M7N3o5j4Q4r0J2j0K6K2n7mL1kONj2k4M2
3815A0J0j7L2m6OJ4J1m1N9k6k3L7m4N3Qqm8O2m5n9J6N7j7MQl6m6P7k3L5j9k5K5
3848AK9q5O0J2K1j5q5M5j1K7N9k9m3K0N5j34R6QJ4n1J1J7Jo4O3JKj7Ol4L9o0j
3881d2Q8o5Km3Q2%l2L0j2J6k4M3l8M8q3L7N4q6K9JJ5n3N6j7J6l2Lj2K7j1J9ok3
$$ y = [-70, 9, -6, -44, 27, -67, -25, 21, 16, -11, -5, -29, -9, -11, -20, -29, 33, -22, -37, 2, 59, -6, -72, -26, 1, 13, -41, -15, -2, -4, -22, 18, 14, -6, -92, 33, 27, 13, -51, -25, 16, 21, 6, 24, -35, 13, 14, 8, 17, -16, -26, -19, -9, -10, 36, 22, 54, 11, 39, 15, -8, -3, 9, 10, -2, -27, -24, -20, 0, 38, 40, -4, -52, -14, -17, 16, -33, -11, 37, -24, -4, -42, 28, -5, 15, 47, 33, -25, 0, 38, -19, 25, 33, -16, -45, 30, -75, 2, 3, -10, -13, 55, -10, -27, -20, 10, 28, 46, 13, 11, 8, -1, -15, 14, 38, 12, -11, -64, 8, 8, 17, 4, 25, -12, 36, -28, 4, -34, -24, -17, 19, 0, -17, -26, 13, -56, 26, 28, -59, 7, -74, 20, -42, -29, 5, 18, -24, 28, 28, -40, 7, 60, -5, -19, 65, -25, -13, -23, 3, 25, -32, -36, -5, -7, -1, 4, -8, -32, 10, 20, 3, 35, -11, -5, 9, 20, -21, 38, 12, -11, 26, -18, 35, 43, 35, -13, 49, 4, -55, -39, 18, 1, 5, 13, -23, -69, 8, -15, 20, 1, -24, 1, 30, -55, 5, 17, 38, 23, -62, -17, -28, -1, 58, 29, -14, 6, 61, -73, 23, 31, 45, -6, 5, 22, 23, -41, 22, 23, 25, 8, 14, -20, 19, -41, -42, 46, -19, -17, -60, 22, 22, -10, 20, 8, 24, 0, 43, 5, 53, -30, 7, 61, -25, 4, 5, 20, -33, 23, 6, 22, -10, -7, -19, 8, -3, 16, 10, -13]
3914a3l2Q2m1M8n4J5K3mn2L2j0K2k9J7l4K3mj3M2K4j7K4q8J05j12K9J01j37P8
3943B5l5pKJ0j5L7J9l2k2j0L9j2J0k6J6J0ol2N0n3J8K1l9M9L9k0o3L7k8KL3n6
3975c9%K7N2j8m9Q4l7kk9m0J0J2L1l0M3l7jM2o1O6j8k1l4O9m5RM3j8l0K8l1MN4
4008C4l0j9rK1lpL0m8N2j2Pm1J3k6LM7J6Jm3N7r4L5J4P7o9j9J2K4Mo6K9L1Lq7
4042f3R2n4J7J1m9M6J8n1LK4J9o3O4k0L8q1L6K0p7R1j1l4M0n5L0OMl7J7k7J0P3
4074C7kl6j4J6J4l3kj1R9l6p5N6j7MK8k7RL6n0k3M8k1M6Pm9l0JK3Jk1QK2l1M8
4108B5Rn3j2O9k7k5J4qqK8J8l7M3%qn0k1M5m7J2L4Pj8mJ3rK1K4o8qO5k7k1NJ4
4143eJ0j5M9j10P3ROnl0j%j7N6k9L7l3k2OK2Pn4L3nkN0l2k4j3j2M8L0K2n8J6m0
$$ y = [-13, -45, 37, -4, 44, -10, 5, 28, 24, -28, 4, -6, 16, -13, 4, -30, -7, -11, -24, 18, 42, 25, 49, -39, 66, -46, -17, 84, -53, 25, -10, -17, -15, -5, -20, 17, 36, 4, -18, -28, 11, -1, 9, -17, -1, 9, 3, -29, 21, -32, -14, 7, -32, 17, 56, 36, -27, 10, -18, -16, 17, -39, -39, -12, 40, 22, -27, 57, 20, 18, -11, -51, -41, -29, 2, -28, 15, -22, -23, 19, -42, 24, 6, -15, -49, 20, -25, -16, 27, 9, -21, 7, -24, -20, 34, 4, -15, -24, -3, -6, -13, 17, -31, 21, 9, 16, -25, -12, -38, -35, 12, 28, 29, -14, 43, -51, -16, -2, 75, 6, -13, -1, 23, 27, -39, -10, 21, 24, -63, 29, -25, -8, 3, -46, 0, 18, -33, -30, -6, 13, -50, 14, -6, 32, -49, -13, 7, -70, 21, 10, -24, 16, -39, -9, -3, 1, -36, -19, -46, -36, 37, 35, -1, -15, 1, 15, -18, -20, -31, 68, 32, -43, 13, -4, 0, 28, 1, 10, 46, -4, -27, 21, 0, 46, 53, 4, -26, -25, -2, -1, -22, -14, 8, -23, 25, 34, -19, -31, 38, 11, -14, 0, -8, -16, 12, 30, -7, 36, 36, 28, -22, -43, 2, -45, -33, 1, 8, -10, -14, -1, -10, 11, 35, -33, -41, 24, -3, -24, -19, -5, 5, -10, 39, -71, 2, 11, 17, 12, -18, -19, -19, -36, 20, -9, 28, -5, -27, -21, 1, 8, -46, -13, -18, -20, 30, -2, -26, -39, -51, -3, 27, 49, -9, 7, -33]
4178c3j9P2j8k9M2l2j6N1k9o0J18o5L8J7q9M8j4M7l9j5oL5L7mm9jQjJ9p0M3j1
4210b5M9pLj4kJo9O6kk5N7k1M7j01Q4l1n2P0k3o0N4j1J2J3j9j8L4n4O1J5j6Ql2
4243hrJ2K3j9K9k9l9J0O8k0ok6J1j3K0PMl1j2J9k0M2l6K7jM2l2n4Q8n6m0M0K3
4276A4o2N5k4n1J08k9m8K6l8K1RM3n0J4J1J4Mm1l3J22n6k2J3Ql9R1o8K7n6Q9O
4307E8o8krK7K7n5K8l3M0j3L8l3j5%k9K9N3l3lN9q2J9r7J8P2m0K0PJ8l1L1JNj3
4341fN1L4n2m6RM0n2K3l0QPL8J0l3Pkj7k4M9M1n2m1j7Q4l8Kk1L0lk7J5QQKl8R
4377b4MMj7j3L4J5l1J3J0J9K7p2J7Q4q1L9k9LK9n4J9j4M5l8N2n0N1p0K1l5J8k0
4409d4N5l8K3olj8PnN3m1L7l2L8J8o9J8m2L9K4j6PLk0J6k2mJ8L5l4M3r3mP6o9
$$ y = [-33, -52, 20, 2, -27, 15, -17, -33, 18, -11, -71, 47, -18, 20, 37, -52, -4, -18, 29, -10, -25, -31, 4, 41, 37, -12, -13, -5, -6, 13, -57, -14, -25, 24, 17, 20, 6, 4, 5, -64, 2, 0, -25, 32, 11, 58, -43, 41, 10, -42, 28, 5, -55, -1, -12, 0, 13, -6, -24, 10, -44, 17, 32, 16, 24, -8, -17, -5, 18, -1, 28, -1, -40, -30, 38, 18, 12, -14, -3, -16, 4, 11, 15, -16, -28, -9, -29, 13, -23, 4, 3, 45, 13, -41, 47, -9, -49, -9, 14, -48, 7, -17, -68, 40, 11, -37, -11, -49, -28, -19, 24, -26, -12, -1, 13, 17, -24, -57, 65, 9, -13, 0, 8, -31, 60, -8, 19, -37, 52, 58, -10, -12, -21, 6, 33, -22, 6, -27, 13, 0, 38, 5, -10, -10, -39, -10, 43, 10, 7, 66, -16, 3, -94, -76, -4, -44, -24, -17, 1, -30, 1, 2, 7, -6, 45, 79, 27, -19, -10, 30, -22, 1, -29, -21, -14, 24, 34, 1, 8, 6, -11, -35, 14, 55, 3, -38, -55, 29, -9, -7, -28, 2, -1, -28, -13, -5, 3, 5, -33, -24, -20, -16, -33, -46, -12, 3, -28, -15, -5, 14, 41, -31, -14, 70, -11, 28, -1, 2, 31, -23, -4, -18, 27, -11, 41, -9, 42, -28, -7, -42, -24, -44, 11, -27, -4, -10, -13, -31, -24, -29, 24, -17, 20, -12, 26, 44, -25, -7, -49, -10, 14, -2, 5, 8, -12, 4, -18, -22, -4, 31, -3, 40, -53, -57, 19, -50]
4443e0j0L4K9PkL4l1j2m0K2NJ2J5M1j4n6L7K5Op7P2o7N7n6pL1j3nj2L8oqk5QL
4478a5N3q7K0L6l5N3plk5j6J8N5%Lo5m0K0K8j4J2k0L4l0KJ2k3L9Om9K7nOk5K7
4512hPJ3oj6QM3j2o4L8k3QJ7MK9l9qJ8J7k6L0q2K4j7O4l8O7l2lm8L9qJ7lj7l2
4547c9K9k5Jn3J12n1qK8j6P1n7K8K0m3q0O1L2j5Pj2M2l3K0k0k4K7Kk1k8P2K7m1
4579A3K5n8j5K5Pj0L4n3KM4kk6l5k1Q6K1Pjr1Q3l8J1L3n1j4K3J0j3o9J11p1Q7
4611E4r0K0M5l3J0JN6j08l0P7K2q0P5L7l6orm9O3p2O9k2L5m4J1kO8q3P4k1%l6
4643dl1L3K5j24R0NN5l8l0N6q3RP5o5K4L3n2O5m1O2p6J9oK3n3L9m7m4Q3j0M1o3
4675c0L7Ql5Jl1N1J0k6K3p5N6L1q7M5K2rlL6LK2m9mK0k5J9K6m6k3L3l1L1n6Q6
$$ y = [-50, -60, -26, 3, 10, 8, 42, 11, -1, -41, -19, -14, -2, 13, 54, 40, -16, 21, 46, 52, -25, 47, -20, 37, -19, -26, 5, -8, -13, -25, 13, 7, -1, -26, -18, -15, 38, -49, -29, 7, -28, 25, 18, 15, -10, -26, -8, 47, 47, 50, -15, -55, -35, -7, -21, -9, -29, 5, -25, -23, -11, -34, 5, 11, -38, -11, -16, -10, -35, -8, -1, 12, 6, -10, -2, 41, 29, -35, 3, -20, -12, 5, 9, 38, -1, -9, 9, 26, 0, 30, -52, -28, -45, 19, -19, 48, 16, 13, -35, 4, -4, 13, 10, -7, -39, -10, -35, -34, -87, 25, -26, -34, -6, -22, 49, -8, 20, 40, -3, -83, -22, 10, -5, 2, -10, 32, -1, 19, -1, -25, 2, 4, -17, -45, 27, 54, 13, 38, -20, -35, -10, -3, -13, 21, -32, -30, 14, 12, -14, -49, -70, 16, 37, 44, 43, -48, 35, -3, 8, 41, -10, -24, -1, 9, -4, -73, 38, -33, 54, -36, -16, 29, -4, 6, 7, 63, -45, -75, 2, 24, -56, 19, 56, 20, 14, 5, -44, 19, -53, 16, -6, 29, -15, -4, -6, 62, -21, 53, 32, 32, -4, -35, -2, 23, -101, -11, -6, 49, 11, -19, 37, -46, -37, 38, -27, -3, 30, -22, 43, 2, 64, -12, 7, 1, 24, -29, 10, -37, -81, 2, -8, 33, -30, 7, 15, -20, -19, -50, 1, 11, -15, 8, -67, -11, 20, -67, -22, 0, -9, -12, 24, 27, 49, 0, -4, 16, -9, 10, 36, -10, -33, 0, -31, 0, -56, 30]
4708C0pJ7j9n4qK0M3n6K9q4N9QM1p8LQ1m5rK8rk8JML8j0k2m8N0J1N8o1Ml6O5J
4743A7l9M5o2pL0L4k7LNK8q1J1N1M3n8kJ7l1N8k4mNn2O0o7J2k9P3j9k3L7k7N1
4776B8%m0K4Nj2J5m8j2L2J4j5j7lK2N1p1Qml3N6k5K3K3m8j3M2m3M3%K3j7jj7j5
4810b5M6n5lK6Pj1j2K4L8l9Nk6oO4Ko8L5j2j7K5l9PM5k0qJ0omq3N9O2l2rl3J04
4845E1m3j3Nk0M4m1J7j5K5l7l3N6M9J6l4j7k9k6L8N9m9n1OO9o5K9N9q0K4K6k3
4876cK4m7N0k0j1NK6p4LN9k5J0l9R3m6J4q5OJ2K7l7N2K9j04Q7l6k2M0k5J6L5o6
4908e2R4l3lpK3J1o6K9%pn7P0o0J4L1l5L5jrj5N3J5n6lM1j1Qj7l2R0o0l4O1j3
4942Dn6Q5l4j0P8q9KJ1N2pm2j2K5Lj8J4Rj6K4ll3M1j6q4J13p1J9n2J6J9L3k6L4
$$ y = [30, 23, 40, 21, -33, -41, -21, 22, -34, -5, -89, -30, -22, 19, -59, -56, 25, -20, -29, -1, -10, -38, -37, -33, 5, -5, -27, -75, -25, -14, 44, -17, -13, -49, 16, 17, -22, 23, -39, -46, -16, 18, -9, -6, -1, 27, -54, -43, 8, 51, -7, -9, 8, -23, 35, 11, 7, 12, -40, 20, -47, -35, -64, 9, -10, -33, 4, -23, 28, 28, -12, 12, 17, 5, 20, -28, -40, -8, 6, -9, -26, -29, -7, 44, -27, -19, -23, -56, 0, -25, -2, 21, -27, -40, 2, -41, 2, 2, 25, 8, 7, -10, -25, 21, -34, -37, -11, -4, -15, -27, -3, 35, -4, 1, -25, -31, 33, 35, -33, 2, -10, -27, -2, -41, -34, 11, -9, -17, -7, -13, -17, -100, -41, 21, -11, -20, -53, 51, 8, -5, 0, -20, 24, -17, 0, -15, 10, -27, -60, -4, 45, 61, 27, 10, -19, -45, -7, 52, 3, -48, -42, 27, -38, -9, 50, -30, -6, 20, -3, 21, -26, 24, 4, -7, -2, 24, -50, -47, 12, -13, -3, -42, 51, 5, 19, -66, -60, -48, -21, -58, -6, 23, -81, 6, -30, -52, -12, -37, -21, 14, -52, 42, 9, 6, -1, 22, 33, -33, -4, -4, -11, -68, 2, -58, -44, -13, -48, -13, -14, -23, -38, 15, 30, -26, -29, 12, 1, 9, -8, -40, 50, -10, -44, 17, 4, -52, 33, -1, -11, 67, -22, -20, -9, 43, 36, -6, -18, 7, 10, -8, 6, 15, -1, 23, 20, -13, 28, 12, -72, 41, -30, -11, -63, -47, -28, 5, -21, 13]
4975A3lm0J5L4L2n8qnK7L3n9j5P6q3O1o1K8j5K8k5J00j12N3m4J7J6m8L1m5L2J3
5006a2j7J7K%nrlJ1J2k2Mj0M5L0Jm4K4j7M3j08P3l3L4l6m6N9k2j7K3J6K0k6Ol8
5040d5K1K9M5o6l4K8J1L1p3J13m8NrMj7%J0l0lM7n5O7r0P1n5K5K6nj9J0L1m0n1
5073f6R7rp0N6l5N8o8J7pM5l1K7mJ0r0Q0p3N5oK8K7l5Ok6l1jL6L0Nl3K3o4N1l2
5107c0M8n3k8O1OL7o9J2n6P2KJ0J7l8l1M0%L4m5kj6J5JL6kl0J3k0L7m1N8ln8J3
5141a0K2k4O1k9mk3Jk4Pk0J1QL3j0j8k7M2jl4O7k5j4l8J4P2p7K5n1L7J3L0L4o2
5174a4M0m2QLM3o0J8l6O6l0j7K2km7M6k6kN0n3O4%o9R6q1l8K4J2N3m9kPK7n7J1
5208c5L5J5%L7p5j8j8L8l6L3K5l5m3Q4j3lJ6no4P7n3K8M2j3k9K1jj7K0m3R1o0
$$ y = [13, 10, -30, -15, 19, 51, -7, -15, -20, 7, 40, -19, -34, 42, -41, 20, -41, -13, -28, 0, -25, 75, -37, 16, -28, -11, 5, -43, -12, -57, -25, -12, -29, -12, -10, -10, -15, -24, -27, -16, -4, -26, -22, -32, 13, 43, 44, 0, 24, 7, 50, -58, 15, -18, 16, -20, -66, -7, -29, -46, -23, -7, 13, -13, -7, -45, -24, 5, 50, -16, -50, -22, -11, 20, -53, 60, 12, 17, 8, 12, -5, -5, 5, -25, -28, 19, -36, 31, -59, 12, -43, -18, 8, 3, -16, -6, 25, -15, -66, 31, 22, -48, 8, -27, 31, -37, -20, -27, 18, -13, 14, 10, 20, -70, 10, -63, -8, -14, 14, 41, 6, 12, -14, -45, -46, -10, 20, 25, -8, 15, -49, 2, -30, 18, -35, -63, -2, 4, 41, -28, -16, -72, 0, 2, 12, 29, -9, -40, 0, 0, 34, -11, -13, -29, -14, -13, 23, 21, -9, 4, -16, 21, -20, 38, 35, -23, -10, 12, -12, 49, 20, 16, -7, -6, -30, -23, -43, -32, -24, 9, -1, -19, -46, -4, -5, -39, 28, 3, -11, -49, -35, 37, -40, -15, -66, -29, -16, 14, 48, -14, 26, -16, -8, -5, 38, -22, -4, -40, 26, -4, -21, 1, -1, -48, -2, -28, -30, 20, -33, 31, 31, -38, 58, -23, -61, -37, -25, 28, -21, -23, -16, 11, -46, -35, 0, 15, 15, 52, -23, -41, -59, -21, -57, -24, 1, -34, -77, 7, -6, -9, 7, 2, -62, 15, -38, -10, 32, 19, -10, 11, 10, -7, 13, -30, 61, 1]
5240Aj5j2P6Mk6J7l7j4K2p2M9N8J0r6P3q3P4m2J1prN3n3NJ1ok2M3K0l1j0m3L5
5273a6j5O2k6l2L6l9K6Q6m9om6j3J2J6j0lnP4m1l0M1n9J1MJ3J3l1J3L5k2p2N1
5305b2l0K6kK9%Nl0K1L7m5M1k5J8l9l2P8n4L3J2k1L6p0O6j9mJ8l5J1oj4J5NJ8
5338B1J2l7J03j11k3K9jK%K8Kl2J4jJ9p0J15j20K4Q3m3k1k2O5l1K2n2O8o3Jj1
5369c0j3OL0J6pL2j6N3n5m2rJ4rK2K6j0rj1J4J4j6J3Mk4N2m6nj4OJ7l1M0j4m2
5403d4O6n1qj3M9m5qN5M0j7J3k6l9j4M6jM2p9O6po0J0O2m5nRJ5k3nj9R3j16J3
5436d6N2J1n5O3m0L7m0%j9K7l1O2l0j3J8N5m1KL5n7n1N9L0m0J3m0K8j0Qj5N5J1
5468C8r0M2N2m8n4J09n9K6n3OJK2k6k8M3J6J8j8k2oK6k2k0J1K9J0LnM6p6O0Ko0
$$ y = [1, -14, -26, 50, 54, 28, 45, 8, -6, 16, -56, -7, 51, 61, -35, 38, -45, 29, -13, -2, -9, -18, 35, -18, -13, -2, -8, -30, 13, 33, 2, -8, -51, -16, -31, 31, 5, -27, 9, -30, -4, 82, 33, 27, -19, -32, -20, -4, -14, -17, -22, 52, 11, -19, 22, -37, -26, -22, -9, 4, -27, -14, 21, -1, -73, -22, -52, -26, -28, 1, 1, 6, -24, -3, 34, -11, 30, 5, 23, -16, -48, 30, -24, 9, 21, 0, 36, -34, 32, 13, 9, 27, -8, 3, -3, -17, -2, 3, 21, 33, -4, 99, -12, -35, -6, -7, -5, -5, 23, 25, -7, 7, 6, 25, -45, 70, -50, -26, 57, 14, -7, -29, 36, 5, 27, -25, 43, -20, -19, -30, -43, -37, -7, 9, 2, 34, 18, 71, 16, -26, -35, -21, -30, -8, 18, 8, -1, -12, 2, 16, 0, 13, 17, -7, 45, -1, -6, -20, -14, 3, -28, 12, -2, -44, 22, -29, -37, -50, -1, -46, -54, 1, 41, 24, 37, 11, -28, -42, 4, 3, 45, -34, 32, 25, -35, -25, 37, -8, -13, -4, 11, -12, -17, -36, 57, -59, -46, 6, 17, -38, 25, -15, 22, -18, -18, -37, -10, -41, 21, -9, -22, -4, 51, 10, 12, 47, -10, -61, -2, 28, -12, 1, -39, -11, -21, -13, -28, 27, 38, -52, -10, 42, -6, -60, 49, -10, 16, -37, -31, -30, -8, -34, -62, -19, -3, 15, -3, -25, -31, -5, -27, -47, -36, -7, 3, 6, 1, 47, -29, 31, 33, -27]
5501b7O6n6M8k6Mj8j0%J6J7l1j9PnpLpJ0K8j6K3j8l3K2N7q1J42o0m1l3J7L1m9
5534d6LL2j6K9J8n2M4l4Rj1NmO4o5M0l1K6j0j4j6N8J0p3J1K8l7Ml4N6J7qJ1j4
5567@qOKn3M9JL0J9j4j8n8j2N1L3l8L9q4P3j5K3k0n2M9L5k9%j2k3K5%J5K2k6l4
5601b4J2N8l9J5m2M3j2p6M2K1k3m3L8JM4K3n0L2p5K4N6mK5l6oj9pN8J2ok9m3N6
5634B6p2P0lJ8p9K7Mj7L0m8P8l7%K5J7m6l7L4n0P4m0J3l4L3mJ3L0kKm2L9l7l2
5667d7O3l1j6N7J9Jqk1K6j5p7K3J9K8r3N5M2qJ6m3K5l8N9m0N1p3RkK8j6P3m7L
5700B2m0M5l3MLK4n5L5M8Pk0m3J6k4K0j9J5m0K2k6M0nO7RJ0r8L4K0p3P2n6Q4p2
5733go3P1n5P1J2l6l9O6jn3%J2J5K8n4mN6o1OnN2n7k4M0K5n3M6J6N0p5j7L5M2
$$ y = [-27, 39, -17, 31, 5, 9, -9, -19, -19, -3, 14, -17, -36, -29, -34, -41, -38, -45, -35, -7, -23, 0, -18, -51, -29, 28, -53, 89, 29, -12, -45, -28, 3, -46, -43, -11, -27, 2, 20, -32, 12, -22, -13, -24, -19, -23, 41, -24, 16, -15, 11, 1, -13, -29, 29, 39, -34, -23, 5, -32, -28, -62, -6, 11, 3, 14, 0, -8, -2, 0, -53, -4, -3, 27, 46, 32, 14, -44, -56, -5, 28, -10, 29, -55, 18, 3, 26, 6, -46, 3, 38, 9, 9, -3, -26, -1, -1, 14, 36, 10, -24, -12, 46, 7, 22, -20, 23, 11, -65, -23, -2, -25, -68, -30, -29, 15, 38, -12, 20, -55, -31, 25, 21, 46, 10, 4, -15, -22, 36, 48, 42, 13, -30, 26, -46, 24, 21, 39, -40, -13, -9, -26, 4, -44, 34, -3, -3, 22, 39, -7, -44, -10, -60, 14, -26, -13, -47, -14, -18, -5, 25, 23, 25, -17, 22, -15, -47, 16, -15, -31, 26, 45, 46, 38, 17, 43, 28, -49, -26, -7, 21, -72, -17, 25, 17, 33, -10, 15, -23, 36, -4, 47, -26, -17, -19, 9, -7, 66, 19, 22, -18, 27, -6, -2, 1, 25, -30, 5, 53, 60, 40, -3, 13, -11, 9, -10, 5, -35, -13, -39, 1, -4, 63, 72, 82, -16, 18, 38, -35, 37, -19, 65, -7, -70, 1, -54, 17, 29, -7, -46, 20, 19, -34, -34, -22, -7, 21, -33, -37, 19, -42, -36, -41, 11, -46, -70, -30, -5, -58, -12, 4, 54, -21, -38, -3, 39]
5766C9l7k2j6N9j7qn6L7lK3j7L0j5J2m4L8Jl0jN9l7j3L4%J3nm5nL5j9M7p3O0n7
5800c3M7j3%lK7l2Pm8Q6k7OK0l4l1J5lM2l0j4l5K9nM6J8n7QJ5kk4M3n6M1j4Q1
5834G0n5k3N5j2Ol%p8M0pN9k6m1J2j9L3Ppmk1Mj6JQ0k9j9nM0l4mJ9K8l3k9K7q
5870Hpj5L7l1RrN2m7m3J1K4K9k1o7P1J4J3o9j4M6M3l5%L2o3N8L7q3K3M3o5j6K4
5903a1j6Nj2K5j4mL9k6l0L0j0jP6m4j0J0l3M3n8M2lJ6k3kQjn3P0n8J3N4o8QN6
5937A8n8N2J3J9j9nN1j27Q0r8J7NN8K9l8rm8J00rk1j2j6L4K7oo5L5J0J8j1J1l5
5969@p5J17m7OK3m2Q1n9j2K5l7L9n0rJO2j8nO5q2J7M4n6o5P7L4p1R6k7m9J6K2
6001B1nk5K2Lj2rk3J6K4l8N7K3j9M0r9N3n0ML9Oj2J1m5N5j9M0p2P0r3N7k2M3k2
$$ y = [39, 2, -20, -36, 23, 6, -2, -58, -21, -24, -1, -18, 12, -3, 9, -35, 3, 4, -26, -27, 32, -5, -18, 16, 16, 29, 24, -21, -26, 9, -10, 37, -36, 24, -33, 14, 1, 1, -2, 25, -7, 0, -48, 38, 11, 17, 37, 3, -28, -13, -16, 26, -4, -18, -53, -24, -29, 17, 35, -22, -14, 1, -1, -25, 18, -38, 3, -11, 70, 15, -8, 47, 35, 41, 38, 38, -40, 0, -7, 52, 26, -15, -3, -22, 11, 18, 11, 7, -14, -10, -26, -25, 55, 26, 7, 2, 42, 8, 4, 23, 51, 18, -11, 16, 8, 1, -14, 23, -8, 1, -8, 44, -3, -46, -35, -11, 18, -3, -70, 1, 15, 28, -41, -55, -9, 34, -1, -1, 31, -32, 26, 63, -20, 3, 46, -19, -35, -11, -27, -22, -34, -9, -23, -27, 12, -14, -44, -14, -24, -25, 51, 7, -3, 7, -26, 17, -41, 1, -2, 14, -9, -11, -3, -4, -57, 13, -45, -32, 22, -46, -38, 18, -40, 12, 25, 44, 25, 20, 71, -56, 24, -74, -57, -52, 6, 35, -3, -12, -60, 40, 31, 10, -2, -18, 16, 43, 37, -28, 7, 17, 35, 24, 35, 0, -75, 42, -5, 1, 24, -18, 63, 4, -8, 17, -20, 19, -31, -40, -39, 23, 5, 0, 65, -17, 0, 44, -12, -77, 0, 34, -37, 59, 32, -17, -1, 21, 16, -9, 13, 16, 4, -5, -28, -12, 12, -26, 31, 54, 35, 75, -24, 29, -21, -17, 22, 28, 16, 27, -18, 37, 18, 58, -14, 56, -37, 20, -2, 41, 19]
6034A9Q6j26j9M0jL8n0l8P1pK3n4J7m8L7J9JL9q2J7K9m9J6J3l1K6j5O6k3jk8K5
6066A0K3k6k8Q1n4K3Jl9LJ1n4N7O3o2J7l7K9oj3P0n5jJ3m8pJ3k2O3k5jNK0l1%
6100gk3M2L6m8K2j2l7L0k0J8k0M4l7Q6o4m3PP8o0J5K0l8K8l7M0l6L2OJ0j5o6N5
6132FJ0pj4j8k7P0o5N6m6P5l3n3J9L1Nn4Q5o1j5P6r3N9k5lJ8Jk0L6Pj6rm8L3j5
6166c5M9M1n4n8M1M0k7K2j6m9nJ1N0jl0N7k0n7P3r6J06p6O9J1m2K8n2Q5q9RO5
6197E0pm4K0J1k9N3m5k7L6m7P3k2k3j5QM2p3M1k6K2k3L8o7P0n9O9k2j2%jL2r0
6229f7N5K9Qp3M2lk4J7no2J19l2j8PPK4p3j1N1L4K5q0Q2j7m9K1lk5L1%J5j7Ln7
6263d6N6j3L3k3l0K2K0j8j5Ml2M8k2m5PQ3n9K6k2l3M3Lj0J8J2j7M0o9K8J0j0o
$$ y = [19, 105, -21, -40, 0, -1, 37, -13, -51, 20, 13, 36, -18, -1, -49, -12, 7, 8, 47, -35, -18, 11, -38, -22, -9, -40, -14, -29, 37, 14, 13, -15, 10, 33, 7, -21, 60, 6, 29, 30, -9, -6, 5, -49, 8, 71, 9, 26, -11, 18, 12, -1, 69, 14, 13, 26, -22, -29, -16, -38, 25, 0, -1, 4, 24, -7, -7, -30, 12, 48, 0, 22, 10, -27, 3, -17, 1, -19, 25, -12, 74, 10, -33, -26, 52, -8, 7, 27, -11, 17, -20, 20, -16, 16, 22, 32, 17, -49, 6, 16, 9, -5, -23, -50, 20, -45, 11, -35, 40, 7, -46, -27, 4, 9, -45, 40, -21, -36, 40, -53, 6, -19, -22, -4, -3, -23, 13, 20, 4, -5, -53, -20, -35, 14, 55, 1, -57, -16, 24, -3, 19, 3, -46, -51, -40, 10, 9, -21, 36, 16, -41, 32, -64, 42, -34, 35, 46, 4, 32, -20, 65, -24, -15, 50, 43, -1, 19, 30, 1, 54, 9, -18, 18, -29, 44, 22, -1, -16, -8, 34, -39, 2, -24, -2, -25, 13, -54, 16, -43, 26, 4, -8, -8, -9, 23, -67, -12, 17, 25, -48, -6, -9, -33, -16, -21, -83, 36, 4, -14, -7, 0, 24, -49, -60, -9, 25, 50, -30, 52, 35, -14, 7, 4, -21, 10, 10, 25, 8, 11, -46, 10, -3, 30, 7, -23, -1, 19, 1, -14, -10, -42, 6, -16, -61, -54, 29, -30, -4, -26, -59, -16, -13, -23, -5, 7, -10, 30, -39, -11, -1, -11, -17]
6295a7L8J5n6M5jjm2l2j5P3J5j6q8R3m7M5l1mpJ4K6l4J5%J0Qmk2K0k6J2RL0K7
6329E2l3Jp5J17j11j0N8M0q7K8L2L1p0j6M2j5K5L6p0O6o0M7Jm1N1n9P8m6K6Jp4
6360c5M2lJ3j8%Rk8oM0lm8N0m4M9J0%k3n5M3j1J8J2k9K2J1k1L8j3l6mL8lK4r1
6394e2NL9N6m2k2K3j2O8l1l4j6N7jj9m2m0J22k7m8k7R1o4j8Q4j03N5L9k5J0qk7
6425ij3O0l6ML1l4l6P8l4K8j13P1k5L1M7m7j0n9Q0j0%pN1m2J5l4J5knKK1n8j6
6458e6L5L8J8l5J5m2M4l1Q0k6o7r%N5J3o2JO5l3L2QJ0q5J0Ll2M7J0l8L7M7j7p
6491B8n4O8Jl9k3M4n8J8O0l2J0k8RM5o8L9k5L2l7K9k0Oj2K3J5n2j5m4Q8K8k1l9
6523b4k6J8L9lj0L3Rn0rJ4J4rj6l6P6l5J2M8m3L0K8m7K8o5O4j6p9N8K0k4j1Lk8
$$ y = [-17, 21, 36, -20, 25, 24, 23, -19, -51, -66, 7, 22, 6, -82, 11, -36, 9, -22, -26, -33, -19, 7, -27, -12, -12, -2, 6, 2, -20, 0, -26, -14, -5, 25, 52, 19, 20, -55, 62, -49, -59, -1, 39, -48, -20, 12, 43, -27, -43, -1, -16, 9, 45, -25, 41, -19, 28, 29, -12, 39, -20, 58, 12, 38, 39, -35, 7, 4, 17, -1, -1, 8, -20, -26, 14, 11, -37, 13, -31, 18, 28, 28, 5, -50, -7, -18, 0, 12, -17, 5, 16, -5, 33, 20, -16, -20, 18, 15, 39, -52, -47, -8, 48, 6, -16, 7, -5, 63, 32, -2, -18, 39, 38, 19, -23, -63, 59, 32, -16, -43, 48, -16, -34, 50, -53, 2, 41, 16, 26, 18, -9, -22, 38, 2, 6, 37, 3, -33, 45, 11, 39, -74, -3, -28, 3, 50, 3, -7, -66, 14, 4, 4, -3, 48, 6, 21, -13, 2, 0, -5, -3, 18, -40, -56, -21, 17, 35, 0, 15, -27, 17, -14, 66, 40, -27, -36, -36, 19, 32, -30, -29, 36, 3, 35, 43, 53, -32, -22, -19, -51, -4, 6, -32, 5, 52, 35, 28, -26, 42, 43, 4, -19, 25, -33, -15, 45, 13, 23, -5, 4, 49, -19, 20, -5, 27, -10, 19, -1, 5, -7, 16, 31, -21, -36, -80, 8, 36, 15, -24, -50, -32, 7, 4, -6, 27, 36, -14, -23, -9, 5, -4, -20, -56, 20, -15, -3, 45, 2, 32, 60, 13, 41, -24, 40, 24, -55, 3, 23, -1, -12, -9, -37]
6556c7N0j6K7M9p9l3N1k0L7m8P2p7qJM3n7Q3k3m5K7N7j6q9P0l4%NK8J0Qk1LoL2
6590D4l0qnJ9m1Q2l9n8K9l0L2RrpP3o4J3npM0l9K0j0L7l4n4M6nNm6LO0k8j8J0
6625a5l1J3P9o6k9P6l3N2j8m6L5L1l6Km9O6n0j8L8j0k3qN4n6N2pL6m7L6m9l0P6
6657B5p4J03k8o7Q1n0P4m7ml1Jj5J6M7%M3p5K0%Ll7M9j8J1jl1rK4m7J6L1L3k1
6690B2n0K5k3J2L1k1qj9M7J1n5M7j4Rj2K0k3J5k3kL3n6O7o0K3K1K7qj8MpM3n7
6723Aj9O5o3j1K3rKNK0PQn0K0j1L5pn0J7K8J6n6PJ2k9M4%k5k1L1J0k8L4l4J5K1
6758Hj0K0n0oK8P7m0qm9kK2m2J8L7k5O7m7OOK2m9L7n1RqJ05m1l5k8L7m9J9m7J
6792f8N8M4p4J8N0j8pm0O6ml3oQ6j07M4k7J3%LJ6l4K6k4J0L0Ol3KJ6K5Jm7pLL3
$$ y = [-37, 13, -3, 24, 73, -6, -39, 12, -8, 29, -19, 53, -24, -32, -31, 12, -45, 38, 15, -30, -3, 54, 38, -51, 19, -15, -15, -10, 18, 28, 36, 15, 18, 12, 44, 14, 6, 1, 20, -21, 61, 22, -36, -7, -37, -5, 4, -5, -12, 61, -3, 10, 5, -2, 38, -1, 19, 9, 46, 12, -42, 4, -1, 4, -42, -39, 21, -7, -25, -15, -46, -33, 46, -20, -49, 27, -6, 46, 28, -18, 17, 48, 12, 14, -35, 31, -19, -37, 1, -9, -32, -40, 14, -42, 10, 3, 39, -8, 28, -21, -51, 25, -49, 54, 26, -41, 40, -10, 64, 17, 13, -18, -17, -32, -16, 31, 31, 74, -1, 19, 19, 22, -15, 34, 16, 27, 26, -5, -14, 10, -37, -21, 10, 43, 22, -28, -3, -26, -14, 17, -4, -12, -31, 16, 27, -28, 19, 5, 14, 2, 22, -1, 14, -9, -11, 22, -34, 33, -27, -4, 17, 44, 36, 18, 22, 15, 58, 1, -18, 47, -16, -27, -4, -13, -11, -6, 14, 21, 29, -21, -1, -12, 23, 16, -34, -17, 11, 27, -29, -22, -10, -39, 5, 5, -20, -41, -10, 0, -28, 6, -28, -13, 8, -2, 18, -32, -38, -10, 67, 27, 19, -30, -32, -10, -52, -34, 3, -22, 45, -2, 4, 10, 32, -17, 20, -31, -22, -30, 75, 34, -1, -29, 8, -41, -22, -69, -68, -10, 34, -40, -22, 28, 10, 3, -37, 29, 25, -8, -14, 72, -35, 9, -18, -5, -5, -2, 14, -20, 6, -18, -8, 22, 28, -5, -3, 13, 38, 39, -8, -15, -12, 21]
6827B1J5n1L7n3J8k4K1M2J6m5M4J7p1j3M7J1l3Pr3M2P8p5Q2l5k4P6j00J3K3kN
6858dJ8K8q0J3%J7j0oM2k9k7J9O6n4k0J7j3N4N5j03j1K6JJ0j3Rk3J4K6k6J0j4
6890hK8k7OrOl6M3l9K7L5n7nN4om7N4o9L0M1ll6L3j9K0lk4M0L4p2K6k4m3O9p7
6924e8J06l3j8k8J7k6J1R4n9J5k3O3n3J0p9Q9nm7lrK6J8n7J07q1n0R4n8L4MJ2
6955A3mlK3L0n8PNn1P9o3J8rK3K7k1k6j4K3j6OK9k9l1RL3j3%L6n5K7J8m7K3N9
6989D8o1O3l7n7M6l6O2L7j17P2k7J6mJ6nr0N4j6K6Ll5j0M8L9m4m2L5J8j7L4n4
7020c5K7J9j9J4J8o0K2j1j5JK8N5k6j8j8j1M2ll3j2L0K8j8K3q7K2N7olKjkj9k1
7054c0rK3Mk0K9l3R2p6K4k0Qj0k8L1oM3n%o1M3LOj1%K1J8j2k3R%j1L8n0J3l1l7
$$ y = [21, 36, -15, 22, -31, -13, -37, -16, 26, 42, -3, 41, 58, -13, -26, 21, 32, -1, 6, -87, -45, 33, -42, 40, 5, -19, 57, -43, -30, -7, -9, -4, 14, 42, -38, -25, -25, -8, -18, -24, 18, -11, -38, -19, 47, -7, -27, -10, -23, 31, 86, -17, -28, -2, -1, 9, -4, 5, -18, -4, 22, -4, 6, -8, 20, -7, -1, -10, -4, -40, 3, -36, -9, 26, -31, -36, 18, 12, -35, 19, -50, -20, 21, 18, -18, 15, -4, 16, 13, -11, 29, 63, -9, 17, -7, -50, 19, -58, 48, 15, -3, -31, -14, -40, -29, 65, 6, 21, -2, 61, 8, 18, -61, 28, 23, -24, -27, -36, -10, 8, -49, 58, -23, -73, 21, -37, -3, 1, 13, 9, 6, 29, 59, 1, 8, 13, -38, 41, -22, -4, -13, 10, 37, 16, -10, -24, -1, -17, -11, 18, -11, -42, -33, 0, -13, -13, 23, -32, -5, 13, -34, -11, 48, -13, 50, 13, -44, 2, -34, 28, 65, -52, 20, -7, 9, 5, 21, 16, -74, -20, -36, -10, -7, -42, -52, -4, 35, -9, -51, -16, 2, -15, 19, -35, -8, 11, -8, 6, 24, -36, -14, -25, -40, -39, -11, 44, 18, 0, -18, -29, 13, 10, -23, -35, -5, 23, 5, 28, -59, -37, 20, 14, 11, 13, 12, 10, -9, -30, -39, -16, -12, -32, -3, -36, 56, -20, 4, -16, -8, -18, -46, -15, -21, 22, 17, 17, -44, -1, 2, 8, -3, -3, 18, 36, 24, 1, 10, 10, -1, 37, -13, 0, -31, -68]
7090f8O0K8k1mj6K6K1n9mk1Q5n7OJ9Mqk4M0m2k1N0L2o3J6P9l0n3%l1L3M3J1o5
7123c4L4J1k1K2J0m6k6L7Q6o1J4n7O8l7l0K3M4l7Mj2L0J8r5R0k3l2nk0O6l9K2
7154Dlk1k6jL8k6Q9o4L5k1nj1J8k3RL1J2n3J5m6J9LLNJ8QQl8oL2J3k3J5rr6J19
7190B2Lm5JJ7l4N4N0j03K1k1k9kQ8n4L8k9M8l4j8K0m5J8L7K2k8%K7m6l0J9O1o4
7222c6M4RJ5m9L2k0L3k4l3L1m2M7J0j9j6N8n3MJk3O0j6rJk1Pj0J4k5J8L0m6mM5
7256A3Ok1K2j2k8NO3q3L4L0j3mo5j0O7j7K9m7N0o3j2R4m8jN6q1P9n7L7j5koK6
7289B6M2r4K5j5J7j6M2J7n8j0L1rRJ7j1l9M1Ln9L0L3o0M1j7K6j2on0M4M2n1N0
7321B9k5j1K1j3l4M3k8J4kk9M6J4L5l1o6K4O1n5K8m9K8L0m9kk8J06q2L1j6k9P6
$$ y = [-68, -8, 20, -1, -5, -21, 5, 26, -33, -37, -58, 27, -30, -24, -5, -1, -9, -33, 7, -35, -56, -6, 26, -37, -21, 58, 28, -25, -25, -56, -23, 20, 31, -34, 0, 11, -10, 12, 22, -24, -50, -13, 73, 12, 26, -31, 37, 0, -30, -7, 37, 0, 4, -8, 22, 40, -55, 35, 12, -20, -25, -45, 21, -18, 4, 1, -20, -46, -47, -9, -35, 54, -10, 25, 4, -1, -12, 6, -17, -8, 23, 35, -18, -3, -49, -30, -27, -24, -19, -1, 7, 15, -23, -29, 3, 16, -7, 8, -1, -97, 22, 25, -20, -19, -2, -36, 18, 68, -35, -14, -35, -64, -66, 22, -32, 6, -23, 25, -9, -27, -7, -52, -34, 3, 25, -3, -3, 24, -22, -52, -33, 28, -36, 8, 17, 32, -17, 15, -5, 28, 4, -29, 2, -40, 7, 17, -2, -18, 40, -13, -9, -8, -31, 29, 13, 4, 5, -16, -9, -19, -5, -30, -12, 18, -28, -32, 13, 19, -2, 20, 8, -20, -15, 48, -35, -1, 29, 16, 12, -53, -63, 4, -13, 16, -31, 19, -44, -56, 38, -10, -11, 45, -36, 43, -14, 23, 8, 6, 0, 26, 68, -26, -1, -16, 1, -15, 27, 44, -14, -24, 7, -2, 7, 24, 13, -26, 15, 18, -41, -11, 22, -38, 3, -14, 12, 0, -6, -56, -12, 30, -21, 29, 4, -7, 14, 1, -33, 10, -18, -4, -6, -35, 11, 25, 60, 29, -37, -13, 48, -7, 21, -28, 0, 30, -19, -21, -49, 57, -25, 6, -10, -39, 37]
7352C7kn4J6m7M0K1pnk8p0J15K3p0K3j1J5l7O2kNok9J4J7Kk6k5L0J8n2J03q1N
7385fM0k2m8N4K1k9J3J4l3pK4k5j8qL0K9l8k1N1o8J15o2J0L4n3kO4n7J5mm5K0
7417a2k3K9N1k8k7K1j7Pl3N4m7lM2j5N4J4o5k2%M0J5nkj1lm4M4p1R0l8j9l1L8
7450a7j6O4n7j1Qj9N6K8m0J9km5O3j3J9n7L2r1N8RMQ4p3l0P0m6j1J4J7m5k0L2
7482a6lL3jK4j5k5M0l0k4NK4mJ5l7L8Kj4m8L1k2L9nKo6N3K9k3j6pL6K7n7l7L8
7516a4L5l3j0J8K4n6K4nM2m7L3rl6O3l0m5M9j7OJ3l0J6J1J0l1L3m3l8MO7j5Km9
7549e8Q0Pj%J7mp9L9P6q8j1MM0Kn2J1rl6N3Rm7L5l9O0o5N9J3o5N8n7L4rM8k5K0
7584B0j0o3Q0ml9Nl5K4M4J5Ll0L5m0l7K2l8j3M2MK3j0o3M4j7k4O0m4J6K9k5j0
$$ y = [37, 35, -19, -3, -50, -10, 11, 4, -1, -29, -99, 16, 39, -31, -8, -19, -4, -41, 21, 19, 24, 18, -11, 3, 20, 22, -4, -29, 1, 19, -33, 70, -11, -6, 34, 12, -36, 18, 39, 10, 23, 37, 4, -3, 21, -4, -22, -30, 0, 29, -9, -30, 21, -47, 68, 6, 16, 50, -3, -5, 59, 2, 17, 13, -32, -12, -35, -6, 45, 17, -10, 11, -6, 1, -32, 22, -25, -28, 14, -1, 53, 67, 2, -20, -20, 20, 35, 30, 28, 17, 14, -30, 14, -57, 33, -5, -24, -55, -17, -33, 31, -26, -37, -29, -48, 8, 36, -4, 15, 13, -32, 31, 18, 37, -20, 12, -79, -21, -12, -8, 76, 3, -27, 43, -3, -14, 0, 17, -28, -48, -16, -19, 14, 13, 37, 22, -3, 37, 7, -17, -12, 12, 8, 23, -14, 24, 26, 12, -36, -5, -27, 12, 7, 9, -57, -4, 25, 2, -14, -21, 15, 42, -15, -52, -14, 21, -12, -22, -4, 20, -36, -12, -17, 25, -22, 11, 2, -34, 29, -1, -46, 3, -14, -8, 5, -25, -9, 2, 12, -19, 14, -29, -67, -63, 4, -11, -9, -58, 22, 29, 28, 28, 45, 41, -38, 1, 77, -11, -22, -18, 22, 24, -28, -17, -26, -62, -9, 0, -47, -12, -51, 9, -56, 3, 16, -49, 9, -48, -14, -23, 25, 0, 20, 10, -53, 27, 23, -16, -11, -46, -22, 22, 37, 40, 10, 45, 5, -32, -10, -48, -61, -19, -15, 8, -2, -65, -21, -38, -62, -2, -46, -30, -1, -26, -36]
7616c6M8m0mM6n6L8k7K3K7l5K5k4O1p5qRN3k9L3k9oj5M3j6J9m7M6k6j7J6L8Rm5
7649aMPK9l7J3j8k5J4m2L7j1J2k1J7jkJ2m0R5l2Mkml7P6n5J7j7l3N6j5j2k0N0
7683A8j7lJ7k5j2k2L6nl4J07n0l7L1j5j3P0j6j2J3j7k1l1M1J1J7Pmr7J30n6j4
7714cM6p2j2N7K8m4M1Kl3l0L1l6nL4L9q2L0mJ3j2N9j1J1m7L0k2km6O1m5m7O3l0
7747c8N6%on0P3n1Rm7L5kO8o2J7K2Qk6rlJ3N7p0L5l9K5jL4r2OK7L3J2k6Pq6M3
7782b8j5N6l5RK7k8L4k4J4j0nmMK4k4j1J8j5Qnl4qN5L5l4pk1N9L2r0L5N5j6m6
7816ElMM1pn1l1K2O1l9Lp3P1j8K8j5MNj9KOk4J3L1m9P2q5N1J9k1kL5p%p5M0RL
7853FMnl7L9l2L6qrJ0nk8L1K6Kk4L7o6J7Om3O0l9j2M8%mj3m0P9q2P8j5%j2%RM7
$$ y = [-36, 12, -28, -32, 14, -42, -4, -31, -8, 19, -16, 9, -15, 46, -29, -37, -28, 25, -4, 29, 0, -6, -21, 22, 6, 25, -22, 24, -2, -19, -3, 35, 44, -1, 3, 10, 39, 2, 15, -3, -28, -14, -56, -19, -30, -18, -39, -22, -23, -25, -13, -53, 42, 10, 14, 12, 8, -29, 47, -8, 9, -8, -41, 15, 0, -12, -32, 18, 1, -2, 15, -10, -22, -44, -8, -13, -47, 60, 10, -27, 4, -11, -24, 46, 30, 18, 31, 14, -7, -38, 3, 14, 31, 38, 34, -63, 67, 11, -3, 43, -29, -41, 16, 44, 0, 41, 43, 10, -20, 11, -25, -30, 4, 43, -39, -9, -13, 0, -12, 47, 36, 47, 0, 30, 8, 6, -40, 21, -24, -71, -8, -38, 18, 18, 12, -38, 35, -16, -7, -54, -19, -21, 47, -15, 2, 24, 32, 6, -3, -6, 7, 64, -6, 29, -10, 15, 14, 48, -44, -38, -11, 22, 34, 8, 15, -71, -28, -43, 13, -22, -13, 14, -14, 20, -4, 10, 0, -5, -9, -5, 19, -5, -16, 2, -13, -5, -10, -44, -52, 3, 38, 4, -3, -24, 35, 67, -23, 12, 67, 51, 5, 2, 6, 47, 40, -11, -42, -20, 41, 2, 5, -68, 3, -15, 13, -2, 2, 7, -12, -10, -4, -28, -15, 16, -33, 39, -46, 5, 24, 3, 1, 36, 29, 29, -46, -6, 3, 6, 10, 5, -32, 7, -25, 11, 3, -6, 4, -1, -29, 2, 28, 30, 6, 43, -23, -6, 0, -43, 17, -22, -34, 14, 14, 10, -3, -43, 36, -46, 32, 17, 17, 5, 5, 14, 61]
7890F1k8m4Nm5O8k4PML5r0Q2q2K5N7K1p0%m5O8j5n1O0m1P4p0L9Ok6K6K4n2pL9
7923A1k1L4l7Q0p0J6J1kK6p9M6j4j4k8K8jK9J1k8K7l3K5kK2k9n8Q5j8Qj6l8L5
7955Fk2mJ6Rj7J7NJ2J0n0J4j6KL1n7R1k8j5l6j4O3LK4j1k1%l2P9j1k9l2O2m7l6
7989c4K6l3M3O0q3PL3m4J4J8J8M9l3Ql4J3lJ5q5L2L0K1k2qJ0K6m7J5RjJ5k9K1
8022B7m6J4N0k3m4KJ3L1m8j1M6j5Ll0L1j7k9N5l3K8J2J0l8N7l2k1K6k5k%k7L5
8054aM7lq6Q1k8k1J1l4M2o1K8K5k3N3n4N7n5l3R7n6l6M9j0K7l9P3k2k3kRk8PK8
8087A9n3Q4j3omn5M8K2k6n4M2Ml0K5m3J9K2j0L6q3L6n9N0PP4m9m3L6oL4k7L1L
8120C1k3k9qN8k7j2PM7q3R9l1ml6K7n4L1K8k3K9k8m1L0J9Rlo4O2mOk9rK2Jkj5
$$ y = [61, 33, -11, -6, -51, 17, -7, 0, 4, 39, -51, 31, -51, -26, 31, 52, -18, -18, -63, 5, -10, -61, -1, -42, 32, -38, 1, 7, -19, 7, 31, -21, -28, 11, -10, 24, -13, 67, -3, 13, 24, 22, 48, -31, 15, 1, -13, -41, -13, -14, 15, 26, -2, 25, -8, 17, 15, 37, 8, -50, 35, 17, 25, 9, -29, 6, -16, -20, -4, 5, -12, 5, 10, 22, 32, -18, -4, -20, -18, 13, -44, 47, 19, 4, -32, -46, 17, 20, 44, 33, 12, 12, -20, 59, 48, 19, -13, 49, 2, -34, -8, -41, 2, 62, -21, -14, 19, -25, -11, 7, 25, 74, 41, 49, 15, 28, 25, 40, -45, -13, 17, 38, 16, 8, 18, 44, -3, 12, 21, 20, 35, 6, 27, -19, -5, 45, 22, -22, -20, -7, 24, -24, -35, 11, -4, -1, -31, 0, -17, -46, 9, -24, 4, 16, 26, -12, 45, 13, -8, 18, -7, -9, -9, -36, -1, 46, 43, -43, 38, 10, -11, 0, -34, 8, -53, -25, 0, -23, 30, -24, 33, -22, -55, 42, -14, -50, -1, -11, 16, -23, 50, 28, 5, 3, 12, -16, -9, 19, -34, 50, 37, 31, 27, -28, 20, 42, 16, -38, 4, 8, -22, 3, -40, -21, 1, -9, 27, -56, -20, -79, -29, -22, 52, 3, -40, -4, -10, 24, -3, 28, 31, 8, -21, -29, 29, 2, -10, -3, 44, -39, 60, 29, 25, -11, 16, -38, -7, 21, -2, 27, -1, -42, -12, 7, 16, 13, -51, 11, 7, 13, -16, -25, -3, -2, -4, -19]
8155a9j6Q3o0K1%Lk3L1o9M7ml3K2L1n9Q8p4M8L1l8M2o2M1L4j2k8k3r7M3M7L4l3
8187dK8pl3l0
$$ y = [-19, -35, 48, -12, 9, 9, 12, -11, 20, -49, -2, -6, -39, -17, 14, -45, 43, -31, 17, 48, 10, 52, -10, 31, 65, 53, 25, 2, -95, -52, -5, 29, -4, 24, 17, -16, -46]
8191d6
$$ Imaginary data points
##PAGE= N=2
##DATA TABLE= (X++(I..I)), XYDATA
0@%%%%%%%%%Qj6J6j6K4l2M0n1O0p4R1j14J38j63J94k27K62l04L55m11M72n43O20
32C29p02P96r01J014j137J276j430J597j778J975k193K433k692K974l285L624
48A900l994M399m845N339n885O492p169P932q799R789j0933J2280j3890J5847
62H463j8295K1457k5716L1802m1282N8213r7675L59967K19731n39964m0397P033
74e6663r6316j4316J87847j68797l02915O9796L17216M3424O570J30992n1884
85F4954k41414J23901L66486N2089k01676j3614Q706j46557j0370J69445j04672
96F7278l21880o9620J29061j6612J7755K11021N3640k04707p307K50323Q9190
107A98142q8213K5377J8390j41096j9863J92809K8794j94814p5046K6976j16143
$$ y = [0, 0, 0, 0, 0, 0, 0, 0, 0, 0, 8, -8, 8, -8, 16, -16, 24, -27, 33, -41, 50, -64, 74, -89, 105, -122, 140, -164, 191, -220, 252, -291, 329, -373, 423, -478, 536, -601, 675, -755, 842, -936, 1039, -1154, 1279, -1413, 1561, -1724, 1900, -2094, 2305, -2540, 2799, -3086, 3406, -3763, 4169, -4630, 5159, -5774, 6506, -7384, 8463, -9832, 11625, -14091, 17711, -23571, 34642, -63033, 296934, 516665, -23299, -63696, -56663, -152979, -167295, 20552, -148245, -451160, -381364, -64148, -20724, -14154, 116838, 64954, -176460, -52559, 313927, 366016, 164340, 150726, 159432, 12875, 2505, 171950, 67278, -254602, -324222, -195161, -211773, -194018, 17003, 70643, -134064, -141371, 108952, 198142, 109929, 135306, 153696, 12600, -7263, 185546, 214340, 19526, -55520, -28544, -144687]
118a44687q1547J48023P9200j59885o0518J62814Q6973j7916R3234P2317j31172
129D6836q2896J33712O7921j05513j9754N6324j02762j23710Q8029Q8504j15770
140f9079r3065O1095J2894l6234J08544J24954o7005p3515R3723N4663p5165J2684
152E4494Q4329p7992j37103M5655R0718n9558o1390L3627l7714r0511O0127J20208
164B4890k8410n3319P5700M5962n7634L0738J09042l8281j27735r1N1721l9589
176g006j6634N7543l4670j07760K1063R2220k3247m9674N3716K5961o4823K0754
188c2557J21873K4094p0873o911J7536m7922j2790N7578k3663j02856q086O5214
200a9363q604k6127N2329K0443p1908j5293Q3728L6888k7357J2845J6905m2991
$$ y = [-144687, -226234, -78211, 989, -158896, -219414, -56600, 30373, 12457, 105691, 178008, 46836, -36060, 97652, 165573, 60060, 40306, 96630, -6132, -129842, -41813, 46691, -69079, -162144, -101049, -88155, -124389, -15845, 109109, 42104, -31411, 62312, 116975, 41810, 54494, 138823, 60831, -76272, -30617, 60101, 543, -60847, -27220, -64934, -155445, -95318, 24890, -3520, -56839, 18861, 64823, 7189, 37927, 146969, 108688, -19047, -19138, 32583, -7006, -23640, 33903, -767, -108527, -87464, 4756, -18491, -68165, -14449, 11512, -53311, -32557, 89316, 113410, 42537, 35626, 53162, 5240, -7550, 50028, 26365, -76491, -84577, -19363, -27967, -54094, -1765, 18678, -53230, -68523, 15205, 52093, 24736, 37581, 54486, 11495]
212A1495o127O9166N630q6027l6235K4550k1831k9959M4017L1704n0039k5924
224f9580N0889L1798m395K7219J6318m9369k0104O3634L1624m8613k4629J6141
236B0933k7463l9285K6552K8399l9016l3697K0425J2297m62M0353L3452l5216
248G272k8475M2842L5525k0843j0260J4003k3292l6900J3258K3056k2286k4487
260c0587L033j1463j5725L2529M0665j7728k8972K2779L0684l736K353J9305j0620
273C2517k9577J925J4888r665j0508K151k0325l0607J2656L4359m247k2957Q001
286b1389J8329N00Q678K4031K351j7421j374O425p657j549J1385j2601l4317o629
300c1238K1917M049j4796k120N107l520N264J9789R851k515L683K763q216J724
$$ y = [11495, 5368, 74534, 80164, -5863, -42098, -17548, -39379, -69338, -25321, 6383, -43656, -69580, -18691, 13107, 8712, 35931, 52249, 2880, -17224, 46410, 78034, 29421, 4792, 20933, -6530, -45815, -19263, 9136, -29880, -63577, -43152, -30855, -31317, 9036, 42488, 7272, -21203, 21639, 57164, 36321, 26061, 40064, 16772, -20128, -6870, 16186, -6100, -30587, -27554, -39017, -54742, -22213, 18452, 724, -28248, -5469, 25215, 21479, 23832, 43137, 32517, 2940, 4865, 19753, 10088, -420, 1731, -18594, -49201, -36545, -2186, -6433, -29390, -21389, -3060, -2560, 6118, 30149, 32500, 15079, 13705, 20130, 12473, 10924, 22309, 9708, -24609, -31238, -9321, -5272, -20068, -22188, -17081, -20601, -15337, 4452, 14303, 11788, 15471, 18234, 10018, 11742]
314A1742J7889n2k6713j7085O122M220o163k850k007p671j127J0222Q592M889
328HQ202L182q308q23J6757J1902r537j5498n626M02L52p46n082q661m802j1M93
345a7796M624J0614N555o036m710R411J6022O869o462j0170l420L324R29m937
359C817n029l714o457o291J715Q063N047j834n782k450R008J5487M953q491m384
374C658N867L117l010K44J75q651j0015k065R35J221M151j379j1108j680J7093
389a447J1943o510m301P044J596l979M845O055o277p219j57m134m769Q004M696
404E390j5945j2370J1917J1466n922j536R169R8m495Q585Q703n247k546M349q287
419C329j2088Q834J1947j2558j5279P106Q578n803q55P346l693p128P072O999
$$ y = [11742, 29631, 29579, 2866, -14219, -8097, -3877, -10040, -12890, -14897, -22568, -23695, -13473, -4881, 8, 8210, 11392, 3084, 2261, 19018, 30920, 21383, 5885, 259, 661, 1013, 267, -4815, -13476, -18278, -18289, -17796, -13172, -2558, 2997, -3039, -7749, 1662, 17684, 24553, 18091, 7921, 4501, 7825, 8754, 3817, -1212, -4926, -11383, -17674, -15959, -7896, -2849, -4683, -10465, -12915, -3907, 11580, 16533, 8042, 3658, 9525, 12642, 9632, 9876, 10051, 1400, -8615, -10680, -9745, -8524, -4373, -5752, -16860, -18540, -1447, 10496, 3986, -315, 6729, 8325, 4346, 9191, 15246, 8969, 1750, 1593, -2541, -7310, 694, 5390, -10555, -22925, -11008, 458, -5464, -7000, 2169, 2267, -2228, 6357, 15060, 9813, 7267, 11616, 3329, -8759, 75, 12022, -536, -15815, -8709, -131, -5934, -6789, 557, -3136, -10264, -3192, 3807]
433C807m609L218J2351m540j4413O159J4890p113j5672O64L605o392n2Q537k134
448a694o639O261N499q314p74J3976Q2j6215j2J6558K613r086J529L166p863k666
464c579P504l369j0736M810Q398r391o015J6174Q674j5281p533J2034L204p690
478b796L902N940q581k559J2973M85j3571L362J1279j1237j4299J2142J2288j2039
492b711p685J0100O17q305Q009Q466j2048n369J6162L316j4486M122J5663r345
506F506j6978Q374J0054j0972n034R588l672j0147J0788J0640j3291p230J5276
519C902K966j4442M861J7821n137j3584P089O763j1147l846Q087p082j2669R748
533f670J2832q940n401J4070L411j4443J84J3308l632j1138N506O975o393M43
$$ y = [3807, -802, 2416, 14767, 10227, -4186, 1973, 16863, 9750, -5922, -5258, -1653, -8045, -8097, 440, -1694, -8333, -2072, 3427, -4887, -5661, 8315, 8397, -7818, -7830, 8728, 11341, 2255, 3784, 6950, -913, -3579, 3925, 556, -10180, -5370, 3028, -6363, -12378, 3796, 12470, -2811, -10344, 1690, 4894, -2796, 1106, 7046, -1535, -4094, 8879, 9364, -4207, -845, 10434, -803, -15102, -2960, 9328, -2711, -10396, -296, 321, -7984, 25, 8491, -3557, -8926, 7236, 10552, -3934, 188, 15851, 6506, -10472, -2098, 7956, -3016, -8050, 1538, -2134, -12281, -1493, 9147, -4144, -11374, 3902, 6868, -7574, -2713, 15108, 9971, -3613, 3476, 10239, -908, -4754, 3333, -3749, -16418, -6670, 6162, -2778, -8179, 5891, 9302, -5141, -4957, 8351, 4719, -6419, -913, 6062, -331, 112]
547A12J0709m602j4193L337Q876r391q453J1665P021j0004m64J3758J088r997
561e38J657L293r307k606J1999O51j1615M438J3332o321j1552P503O034j2890
575e922o517J0681K348o181O507P499r293m173J2951R01j5686L03J3893l914j0730
590g333Q710R466r450o125P041k835r574O383P785j0561m727J5902N914j2699
604b103k80J2128m082j1246N408O761p341k023Q304l845r826O744P900j1673q713
619a3887J1704O522q905P10J1437r68p369M464L458q182j476Q117l765j0261O260
634b141J0504p510r594O455M452q431j654Q524K15m236O508N486o317j332Q470
649I399k739j2776Q63R532l665p959N244N453n945k122O042j744o424M508N585
$$ y = [112, 10821, 6219, -7974, -4637, 4239, -5152, -13605, -1940, 5081, -4923, -5387, 8371, 9459, -538, 1119, 4412, -4895, -7501, 4498, 5149, -6466, -2028, 11304, 4983, -6569, 934, 6968, -5922, -12439, -1758, 590, -5591, 916, 8415, -878, -5051, 7900, 8801, -6885, -6582, 7311, 3397, -7333, 1377, 10843, 1393, -4732, 2309, -526, -10100, -3717, 4068, -6493, -11220, 4682, 10596, -2103, -2383, 9745, 5663, -5583, -175, 6586, -755, -2778, 5526, 1681, -8145, -1401, 6499, -5174, -13887, -2183, 4339, -4566, -3856, 7581, 6613, -756, 3708, 7166, -1016, -2492, 5625, 1860, -8401, -2141, 8363, 853, -8741, -2286, 2166, -6265, -7919, 605, 820, -3416, 3092, 8578, 2261, 929, 9399, 6660, -6116, -5253, 4279, 614, -7345, -2101, 3352, -2593, -4715, 1327, -417, -6841, -2333, 3252]
664C252n688j085J1536L032j0167r85P812l431r205J918L274o058j114P505m46
679A50n543N108N674p659m730R402M089q084m88Q694m81n659K990J802p526k738
695d999N136k569o614N190P519n442m640P959M639o508j721N427r33l703M195
710B936K851n396j062N474k737q029K147N827m679n593N263M899k962l28M297
725B908j087l067L618K387m968r98O129l89o804Q09N422l028o128J319K504k425
741c798J8L960o89k172M296L584m418k035N452R41o065n86N082o34m307M82R74
758H5l140n44K948j715l283L733M685k832k007N263K704m421j796L250k30k858
774a58O57M42l197m9L395j628m370J871L993k329k778L933L485j996q92K389n0
$$ y = [3252, -2436, -3521, 8015, 11047, 880, -105, 7707, 4276, -4929, -3011, 263, -5795, -6909, 596, 150, -5393, -285, 5389, -2270, -7000, 2402, 6491, -1593, -2081, 6613, 6132, 473, 3463, 5265, -2261, -4999, 137, -2432, -9046, -3856, 3663, -1779, -6419, 1540, 6179, -329, -2050, 3377, 2444, -1259, 2936, 5787, 391, -671, 4803, 2066, -5963, -3816, 2011, -2668, -8261, -2998, 1901, -1061, -1389, 2908, 1821, -1246, 2372, 4759, -209, -1207, 4922, 4533, -2271, -1462, 3960, 932, -5196, -3877, -1373, -3798, -3780, 180, -509, -2681, 1615, 5199, 781, -1254, 4198, 5139, -926, -1512, 3570, 2936, -1371, -889, 85, -3055, -3599, -651, -2366, -5649, -1916, 2769, -63, -2070, 3193, 5897, 1476, -320, 2930, 2700, -158, 499, 941, -2256, -2305, 1090, -538, -4908, -3037, 956, -1373, -4151, -218, 3267, 1271, 379, 2768, 2718]
791B718j453J265q3l843o27L529q87m288Q50L715j532l049J787K570r92j39J731
808A272l97m84K601P74l588j076K989j78l936l78K692m96k257N65J197l93N52
825e41J044j169o79K895J732k347j187K477P63k652j260J049j12j417k44j64j84
842a996J230J253j237j112K091K021j216j442J320J469p82j185J35K22m18n80
858b27j071j069P58J322o89j496J019K506K54j245L20J476K00r26m74m0Q4J54
876H56p85j633n0J444l3j881m45J832R12p55j77J070R37K71j57m86P6R08l18j927
896c41r42J129L35j413r77O43P92J21k20k0P02J200J29q67K01J327L74j169q37
915A67L31L00m13j072q97K27O87m32j020O43J585J79o57M64R04M22j2l56o80K94
$$ y = [2718, 1265, 2530, 2447, -1396, -2023, 1506, 619, -3669, -2819, 896, -636, -3685, -1898, 672, -320, -459, 1272, 875, 391, 2992, 3766, 178, -898, 2091, 1913, -2023, -2401, 291, -205, -2462, -1897, -700, -1093, -541, 503, -666, -1345, 1550, 3282, 935, -252, 2225, 2988, 336, -924, 125, 13, -1404, -1648, -1812, -1996, -766, 487, -750, -1862, 229, 2250, 1034, -408, 912, 2381, 1599, 414, 549, 771, 353, -227, -1298, -2367, -1609, -287, -976, -2472, -1453, 1053, 1307, 62, 382, 1858, 2058, 1132, 658, 618, 702, 856, 71, -1562, -1612, -168, -201, -2082, -2527, -695, 217, -538, -715, 355, 1292, 1563, 1406, 920, 996, 1904, 1586, -341, -1283, -154, 181, -1232, -2209, -1566, -774, -653, -873, -893, -191, 1009, 1138, 271, 472, 1799, 2173, 1004, 167, 498, 798, 385, -687, -1584, -1357, -670, -1102, -2122, -1479, 106, 285, -372, 92, 996, 1418, 1406, 1050, 370, 664]
935F64Q35o42j680K40J062p12j482L21Q47k06l29K83J60M85J270k6j222O60J594
954B122m56j738K09J015o46j059j16R3r7K63l17r00M09J561N1j430L39J893K75
973A471j145mQ19K21n03n69n00J1M81m37j366k48J217O72j047n21J249J336l93
992G44p88N06P28j4n02m76k62K60O25p89j624M55J616n06j771M74J719j00o89
1011c94N88N31r1M54J30j473l60J711j20k361j23K129k3j652L51J029m81k13P10
1030C42n88p39J678Q16j920o20K323M28k352k85J446l81r80P18J66q41Q44J108
1048A163j274j190J746P97j979o63J858M62j252J99Q29n20k58O89n05j156P20
1065c34J149j089r00J336R44j141o91Q28L32o61k6L42k99J85O40j25r44K53R78
$$ y = [664, 1499, 857, -823, -583, 479, -233, -1715, -1394, -547, -753, -1082, -799, -639, -154, 1116, 1090, -132, 528, 2122, 1666, -72, 137, 1152, 506, -553, -669, -576, -673, -410, -727, -1627, -1218, 343, 394, -1036, -697, 1196, 1471, 326, 322, 1141, 1362, 859, 290, -210, -199, 282, -155, -1521, -1769, -552, 120, -927, -1448, -199, 1137, 744, -44, 462, 1190, 1176, 674, 198, -64, 196, 821, 32, -1592, -1137, 479, -27, -1798, -1324, 395, 295, -394, 194, 725, 634, 1088, 1218, -255, -615, 1096, 976, -1385, -1508, 621, 598, -1054, -703, 326, -155, -368, 342, -246, -985, 693, 1509, -411, -1031, 1292, 1720, -632, -917, 529, 148, -832, -114, 52, -789, 55, 1163, -111, -1301, 445, 1242, -737, -1400, 458, 920, -332, -133, 696, 176, -82, 607, 102, -1054, -334, 815, -274, -1174, 162, 1106, -35, -726, 102, 434, -227, -253, 89, -210, -25, 615, 490, -454, -201, 777]
1084G77n46j289M96J228l19r52N43P16l96l05J61k20n37P24L01r11k56J432L14
1103I61j597j63J394n8j220K24R08l85p8P81m21r99Q50P82j566q23J619P14j607
1122f84j76J504k3j007M20K95r46J94J213o38j219J336J296j430j107J334N29
1139H91j434k90R42k74l17Q27R4j209M44J332q12j531R87J384r06q22J100N91
1157I97p17j25K79p93l08Q37l6j210L21J473j99j207M23J005m22q01L77L71k87
1176b2K54L77n45m38Q97K20j374m05J147K57j018l3J082J14n20J95J09m96J16
1195h3N08o10o55R73Q15r77o22R80M12j025l44O17L1l11L93J36n56L31P96o07
1215B02j053O02R45p28p01P37N88m58k76L73k28l24M62k6p92J65J090j59r44L44
$$ y = [777, 231, -1058, -562, 666, 347, -605, -62, 654, 258, -47, 114, -106, -643, 81, 382, -529, -785, 647, 961, -636, -799, 595, 537, -683, -459, 449, 64, -14, 767, 346, -653, 197, 979, -587, -1410, 209, 923, -684, -860, 644, 621, -386, 34, 329, -617, -423, 790, 152, -1067, 269, 1565, 135, -972, 362, 891, -543, -833, 109, -165, -482, 345, 439, -770, -326, 1006, 194, -1337, -350, 1034, 128, -694, 406, 997, 280, 155, 434, -359, -667, 170, 134, -1076, -755, 718, 519, -688, -265, 740, 318, -483, -106, 265, -22, 232, 609, 64, -374, 523, 743, -631, -1036, 111, 368, -650, -683, 399, 513, -7, 188, 297, -199, -83, 425, -185, -840, 133, 948, -29, -651, 329, 741, -284, -628, -11, 20, -291, 102, 238, -318, 13, 809, 202, -851, -249, 696, -32, -733, 4, 592, 134, -142, 231, 3, -321, 141, 115, -677, -512, 578, 419, -525, -181]
1235a81R26l82q72L80L35k99K7L64m39j64P26R7j031j21R53R6r54J02Q89p7m18
1256d3J80Q4m16K02J85n00l87Q00M24p39l79R16K60p10k44M86Rk65K56mk91K95
1278A19M53n70o81O16M69n90m70O44M21k44k05K54j14p0K00j70n43K61N84k47
1298A17n70L57N98k84n62K62J66j31K6O4j45J3M29o5n81lO61q7o67Q6N90k9l58
1321a13J09J15j32J24M7l74j72N46J82n28j64O48J23m67k00L61O6j60k7P9k25
1342a62L22J27m16k52M22K16m16l48M62L11j84j95J47P9O6K4k48k82L36K60k96
1363b7l25K70L97k13k68J3K28M2j16j68Q8J62J35j51j62O2K93m5m35n5L41K25
1385B91l94j50K46J04j0j90n6O4K18R3k86j55L48K87m09k30K96K03k60j95L3P5
$$ y = [-181, 745, 363, -509, -129, 206, -93, -66, 298, -141, -305, 421, 518, -513, -634, 319, 415, -539, -437, 452, 375, -43, 137, 221, -195, 7, 192, -308, -695, 105, 529, -210, -589, 327, 587, -123, -367, 119, 128, -137, 119, 115, -176, 119, 572, 2, -679, -63, 406, -184, -654, -10, 411, 167, -38, 216, 102, 32, 232, 62, -481, -220, 364, 117, -453, -96, 502, 218, -344, -82, 84, -47, -21, 43, -102, -89, 340, 275, -306, -309, 352, 265, -402, -316, 274, 245, -113, -4, 111, -21, 103, 150, -224, -396, 150, 332, -196, -360, 288, 411, -56, -256, 105, 171, 11, -16, 63, -162, 160, 287, -129, -381, 41, 257, -159, -507, -45, 266, 82, -113, 34, 113, 179, 203, -45, -327, 9, 269, -27, -352, -82, 315, 102, -166, -153, 75, 117, 1, -167, -79, 83, 218, 67, -95, -33, 260, 215, -220, -275, 66, 291, -103, -253, -7, 97, 87, -103, -159, -95, 123, 216, -70, -225, 123, 410, 1, -229, 67, 270, 10, -185, -152, -77]
1407g7N0J26k72j03L19L02l14k79L27K54k73j79J33J25o1k7j55j47K31L25l35
1428c0l82L83L03l02j90K04J23J7m5k6k16J61K59k75l17L01K37k29k68K79P2m8
1450A1J28j22q2J33J53k19k43K93J54k37j50K50R2r7rq0j15K38K1k79q7L00Q9
1473A42l12oK32j9n5L7n5m8K15O7l29l0L66N4l84K9J83o8j44J0ro3J90J16k33
1498a14PL18N3k99l0J74N0k21pn2M1J02nj67J5K50L5l30L5K61k6j25L7o5J02R9
1524A38q4k48J79K07j62k05j4K75L7n2j18k3J70J24k00j96J16K51k06j75J41J02
1546E7J3j3m8p0J00J96k26k63K40K45k18j34J12Q5q9j1N5r2rJ36r1l17L17K50
1570B25j71k27J81J57j37p1J58r7J6J17m5k43R6K57j24l34J51J57n9j34P4M1J9
$$ y = [-77, -27, 99, -173, -276, 43, 345, 31, -248, 79, 333, 60, -119, 14, 139, 78, 51, -104, -251, -20, 305, -30, -412, -29, 274, -28, -218, -14, 109, 126, 81, 55, -161, 0, 259, -16, -333, -32, 205, -24, -292, -13, 59, 11, 139, 17, -65, 68, 221, 2, -241, 52, 206, -31, -181, 69, 161, 64, 55, -25, -140, 98, 119, -160, -247, 53, 142, -170, -176, 56, 37, -18, 19, -36, -84, 131, 198, -131, -161, 205, 259, -125, -96, 87, 19, -125, -115, -124, -187, 3, 119, -114, -107, 211, 264, -35, -65, 109, 159, -62, -69, -121, -80, 22, 17, -150, -135, 115, 150, -180, -145, 116, 90, -35, 2, -63, 39, 138, 54, -194, -15, 192, 30, -175, -189, 86, 123, 71, -47, -70, 100, 224, 24, -172, -56, 195, -11, -186, -45, 57, 70, 57, 9, -61, 39, 235, 9, -254, -14, 231, 13, -121, -9, 76, -13, -24, 31, -61, -70, 66, -25, -342, -25, 225, 54, -173, 8, 165, 28, -43, 115, 18, 34, 151, 106, -137, -41, 216, 92, -242, -91, 66, 7, -127, -53, -12, 7]
1593GM8j0j27R8J45k9k23O6J92p1j89j4J30m4j3l9m3O5J36n5j23RJ75Jj79L8P9
1620C0J09r3j14J28L9jp2j02p7J92J6q3j02J41J69j98j01M1J85r9j38O0N3O9J6
1645F8j4p1L9J29j97j57P4K04j61j50J18J75m8K0K7j39M8J81m9j96L2K42j7j72
1669a4lJ21m3j70RJ4pR3Rl4n3J23J07k21QK19n3r4q0J22J0j17N4j13K9J10jj02
1697g7p3J63J04j21j06J78N0r8j4O8l3P8l7q9r2M0J13q8j54J58J22j30n5P6R2
1722G5n5Pj5n8PP4K9j51M4J69r2j19OJ30p2j32O5J02j9M3K5j03L1J16J1j82l0
1749i4J30L2j36K3R5L8p5%k3j3L7K5r9n8J72N0j41m2J38K0j18n9R3Nk7O4m7k2
1777c2L6R8l3j34J00R6j24j39P7J22j16L6Q0j02P2Opj52J06Q0o3p5O9O8o3m1k7
$$ y = [7, 55, 45, -82, 16, 161, 132, -91, -25, 167, 96, -93, -107, 23, -21, -34, -73, -116, -51, 85, 30, -93, -84, 91, 92, -87, -49, 30, 139, 46, -68, 60, 99, 98, 26, -76, -153, 39, 55, -28, -130, 11, 180, -18, -119, -78, 107, 8, -130, -70, -17, 52, 68, 54, -17, 22, 151, -46, -203, -129, 75, -86, -236, -118, 57, 9, 29, 56, -83, -35, 146, 97, -99, -67, 175, 158, -14, -17, 104, 61, -109, -100, -86, -93, 0, 9, -25, -78, 45, 152, -69, -61, 158, 105, 11, -69, 53, 63, -54, 0, -113, -84, 26, 25, -77, -150, 13, 117, -4, -110, 68, 118, 20, 6, 74, 41, 119, 82, -7, -99, -59, 54, -34, -188, -30, 92, -38, -93, -17, 75, 20, 27, 12, -46, -39, 35, 64, -87, -43, 126, 34, -85, -79, 51, -21, -153, -88, 14, -5, 38, 63, -40, -9, 107, 118, -64, -94, 36, 68, -68, -45, 50, 88, 13, 13, -10, -23, 14, 39, -60, -118, 54, 104, -37, -79, 59, 79, -39, -98, -5, 0, -27, 37, -10, -32, 4, 102, 69, -65, 35, 131, 7, -132, -55, 67, -49, -13, 67, -35, 37, 43, 36, -116, -10, 70, 7, -68, 1, 69, 6, -35, -62]
1804f2J3L0O6m2o0QP3j2j28N6R2Q0j48k7O8J6l3k2J7N4k0k1j0m1Q9O4j42K8K7
1833A3M3j01k5K2M4K3l3K0M2O5o9l0p1Q5M4q2m6K7J38j02p2J26r5J1K7K0j48N7
1861f7J40r8p3J09Q8k6j31L8Q2o8m1P0n8J7J17p1r0RJ21k9r3M9O3pp0K2n2M0P4
1890F5o1o5J7J53j32r2Q0Q1j6l9k3N3JL2J2j23P1M5n1o6J2N0j%j0l5N8j0Rl2M1
1921B4K9r2RO6K3k0k4n5j7Q8k9j4r8J18Q4j11n3J04J2m7rk5k7L9M6k0l8J10J6
1950H9j15J4L4K3k5Ql1o9N6R8p5r0J15M8j03K3K4J6k3K3r2K9P9L0j41jJ00Mr2
1979d4QN2p0k1P1Kk6P3k2m2oJ23l5n3r7J31l6l3J7n1J0O6m4J7m9R5M8j03N8n5
2009a6P3k5j06Q3n5J15l9q6N5rN9j08N1M3On3NJ3j6j1K8o7J2J17o3okk0O1o6K7
$$ y = [-62, -49, -19, 47, 5, -55, -47, 26, 14, -114, -58, 34, 114, -34, -61, 7, 23, -10, -32, -15, 39, 19, -2, -12, -53, 36, 100, -42, -14, 13, 56, -45, -70, -48, -4, 19, -14, 6, 48, 113, 44, 14, -57, 28, 72, -10, -56, -29, 109, 7, -65, 61, -34, -23, 4, 24, -124, -67, 73, -25, -98, 11, 99, 73, -58, -20, 62, -6, -47, 23, -35, -18, 99, 28, -62, -53, 68, 39, -54, -5, 58, 51, -19, 3, -49, -9, 65, 4, -61, -44, 109, -23, -115, -35, 46, 30, -9, -32, 21, 22, 54, 66, -57, 14, 59, 8, -58, -46, 4, 3, 3, -7, -42, 16, 6, 15, -17, 24, 53, -39, -30, 36, 59, 39, 15, -40, -57, 31, 2, -12, -110, 8, 92, -19, -72, 32, 44, -3, -12, -37, -64, -25, 21, 1, -37, 73, 89, -26, -12, 22, 45, 20, 28, -3, -72, -16, 82, 7, -83, 32, 80, -23, 0, 24, 40, 17, 40, -52, -23, 56, 86, -55, -56, 44, 48, -44, -36, 16, -54, -75, -4, -2, -28, 45, 23, -19, -25, 98, 63, 10, -87, 44, 8, -25, -8, -59, -49, 17, -27, -10, -59, 36, 84, -19, 39, -16, 57, 32, -74, 9, -46, 69, 30, -56, -1, -10, 49, -59, -8, 35, 41, -12, -7, 6, -10, -21, 7, -60, -48, 69, 6, 0, -2, -22, 39, -27, 0]
2040@oM6M7o5j9RN9q9l0R4l4L4l2l1j4O3lo4k8M8P5n1Oj1J7k8OJ0q4J17l6n3r
2073e6M4L8o9M5j0j0kL1Mj04J75n3m7j8O1l0pj2Kk2N6j9j7pN8N7r0NL3k2k2k5
2105c3n0R9J8m9J5L0q2O7K2p5L8L8l5m7J03J4p8k7K4O6qr9K6kL2M0n5k0K0J8K2
2136C2o7K7j6KKJ8k6m0Q2p2M0M0m0J7j2j6J7lL1k4K7n0P0n4L8k9j4J33j08n5O2
2167A2J6l9n2J39n8%L6m1%K0J3o8L8q1Q0m0J0k5N8l3j7M0lk6J0K1j8k1L1j4J6
2198DLK8m6l7j1R0Kj8o1M2j5O3o9O1k4K8J6q5j2P0L9j40N0L5K5j0k0m5l1P5Lj6
2230fk7l3J10n9j8lK5K7o4M9Qk9P6j01rN8L7k2m4L0l5M8k1L5n9N0ll0K3l0KJ0
2262em8M7K6l8J3poO1p3K3m3mN3k6j2J7O5n1Mk2l5Q7Ln1M0k7PLJ5l0N9k7JkPk5
$$ y = [0, -6, 40, 87, 22, 3, 12, 71, -18, -48, 46, 12, 46, 14, -17, -31, 32, 29, -35, -63, -15, 60, 9, 15, 4, 21, -7, -1, 9, -75, 42, 6, -47, -56, -12, 26, -43, 2, -8, -18, -20, 11, 15, -89, 86, 33, -14, -32, 29, -1, -8, -20, -18, -40, 16, -3, -20, -27, 31, 88, -2, 3, 36, 14, -8, -33, -83, 16, 34, -15, 0, 30, -52, 15, 37, -38, 0, 38, 3, -44, 59, 73, -5, -32, -8, 58, 50, -49, -23, -25, 7, 47, -8, -28, -8, 10, 32, -35, -8, -24, -22, -20, -2, -28, -68, 14, -58, -18, 22, -18, -1, -13, -29, -12, -15, 16, -8, 19, -31, 39, -15, 23, -6, -20, 113, 5, -50, 12, 28, -11, -63, 76, 18, 18, 54, 13, 13, 33, 46, -22, 16, -65, 15, -25, -15, -40, 18, -15, -32, 8, 5, -21, -11, 10, -8, -29, 2, -12, 4, 7, 35, -11, -48, -59, 31, 33, 15, -46, -4, -19, 44, -25, 36, 12, 40, 56, -29, -41, 29, 68, -72, -22, 13, 38, 28, 8, -37, -68, 7, 10, -6, -33, -66, 44, -15, -33, -36, -11, 16, -48, 1, 9, -20, 56, -45, -54, 4, 41, 19, -25, 5, -30, 18, -3, 32, -27, 23, 20, -10, 13, -17, -15, -5, -53, -6, 20, -18, -5, -12, -18, 43, -30, -7, -50, -54, -1, -27, -39, -22, 43, -8, -4, -26, -61, 26, 29, -22, 18, -9, -2, 1, 16, -14, 45, 18, 19, 17, 24, -1]
2298aNj7lP0l3p3L2O3j02P2j7k5k4R1p9O4k4k4L0n3M4K7n7J6M3k8K1j4K0p5M7
2329dM3k9pJ0j9J0Jl5n1J26n6L5j1J7l3j4M6Lq7J18l8l2LRMm5JL5j1QL0p0oK8
2363b1mrO1M2q8J5L3o3L3K3k8L2m3K2K0j4orJ3Lnmo7Q4k3j0N4m8k4N4p9K7M6p7
2397f0N6mJ2mm6Q7l7l5j2M4k5J7J6n3M5nK6j11J11m3k4R2j6m1j3P5l2k3j4M5l3
2428ek6J4P7m1k5Pm3L2j4J8j7K7m3L2m2M3k0j3Rll3P2M0o9j1M0k2pJ1L6jl2K6
2461A7r9P1K1K1k1n5M6j4o6J12j7l4M5n6MJ8k4qJ3k7kM8J2n6M1oj0K1k0mLM9l6
2494a3K0K8j7Qk1M7r7N2rm3O2K8l8q0Q7Rnn4N3J5l1l0RK9l8K3l4Jl1L8k2N3n4
2527e5P1j1j9J7%l8O0q7N8m5R0o6K8m3OJ05j17N3k9oLK8l0L6l7K1L8l3p6Q5m3
$$ y = [-1, 4, -13, -16, 54, 21, -52, -20, 43, -59, 13, -4, -29, -53, 38, -41, 23, -1, -25, 5, -48, -4, 23, -34, -18, 25, -3, 18, 4, 24, -51, -4, 39, 10, 3, 13, -6, 4, 5, -30, -81, 45, -11, 24, 13, 30, -3, -17, 29, 32, -55, 63, 25, -7, -4, 5, 9, -36, -35, 0, -11, -3, 27, -43, -49, -21, -25, -34, 27, 69, -19, -4, 29, -34, -1, 22, -6, 26, -17, 5, 25, 11, 5, -4, 9, 12, 7, 3, -64, 20, -3, -13, 41, -7, -31, 23, -56, -29, 17, -60, -4, -8, 4, 0, -46, 41, 4, -31, -43, 1, -24, -7, 9, -44, 1, -4, 22, -89, 22, -21, -45, 47, 31, -10, -23, 52, 20, -3, -17, 28, -5, -31, -17, 60, 19, -6, 1, -42, -10, -24, -6, -23, 4, -39, -7, -49, -6, -26, -39, -30, -33, -66, 6, 46, -23, -34, 6, -16, -23, -12, 24, 23, -9, 17, -82, -11, 10, 31, 10, -45, 1, -13, -79, 33, 16, -18, 27, -29, -25, -7, -31, -39, -26, -53, -55, -7, 5, -51, -10, -16, -26, -5, -25, -29, -26, 23, -13, 7, 35, 18, 26, 5, 52, -45, 7, -2, -45, 17, 45, 7, -73, 14, 23, 18, -36, 17, 32, 1, -29, -20, 9, -29, -6, -40, -39, -70, -32, -54, -1, -55, 16, 5, -14, 3, 3, -35, 25, -62, -4, -49, 41, -25, 3, -40, -34, 71, -46, 7, -22, -28, -25, 3, -27, 9, -28, -7, 31, -2, -78, 7, -36]
2558c6PJ2k2O6q2R7k7Rk6J0p4P9k6k8N6l9jL4n9QL2k4O5l3l2L9j3K3RJ2n0K2j7
2591il7M6m5K0k5L1K0k5j1k0L4K6j1L1o1k3M6J7n0N5k4RK0m1RL8j8K0l3KK4m4
2623b9j7K1N4j7l6N0jj2J7L5o1l2J0j9R0l2K5j17N7j9RO2q5P8m6K8j2k0l9K5K1
2654a2j1M1j8Kj3K2j4o0K2O3mn3N2L7q3RK3J2L2n7L8k1Mj3k0j3qK9Q4m2J4p1K8
2687al2J8K6o6PJ5j1O6l7n3M9J3k9J7O2p6lO7l7nK0%Ll5NK0pJ7m8P6rj4M8o4q
2722fJ6l9L8rl4NJ7j8L6k4J6L0n8K3j3KL7n1J7L5jm5qM6J6j2k8jO7n1L4j8mL0
2756D5m8j1l3J2L9J7l1j1N0n9K2o7N2qL3j3j5OO0n8J4J8m7j5L5J2mN5n1km2j7
2788f2O8m7l6R1J2l6M9o3Ql1K1l1L3O3l3J9j5j7J2l1m2Q3J7p1M9l0l2M5j2O8o1
$$ y = [-36, -29, -17, -39, 27, -55, 42, 15, 24, -2, 8, -66, 13, -13, -41, 15, -24, -25, 9, -50, -42, -10, -34, 31, -2, -34, 5, -8, 15, 24, 36, -14, 8, -9, -46, 0, -45, -25, -50, -19, 1, -24, -35, -55, -21, 5, -6, 25, -36, -59, -13, 4, -46, 9, -15, -6, 14, -27, -18, 20, 2, 22, -11, -9, 15, -29, -46, -25, 29, 12, -24, 26, 25, 13, 30, 65, 4, -28, -18, -37, 53, 21, 46, -71, -14, -33, -24, 38, -47, 31, -15, 13, 1, -19, -58, -33, -12, -23, 18, 0, 2, -11, 11, -3, -63, -41, 22, 18, -35, 17, 54, -29, -20, 3, 15, 47, -10, 28, 7, 11, -2, -22, -35, -43, -14, 70, 28, 42, -29, -1, -33, -15, 11, -55, -48, -33, -44, 22, -15, -68, -19, -6, -35, -18, 44, -32, -35, 32, -5, -10, 10, 10, 13, -22, -17, 3, -4, 13, -35, 41, 32, 18, 66, 2, -6, 10, -29, 9, 0, -34, -29, -12, -30, 6, -18, -2, 28, -30, -7, -20, -18, 19, -32, -15, 20, 19, -26, -34, 12, 28, 16, -12, -13, 54, 3, 37, 19, 15, 45, -3, -14, -47, -35, 4, 21, -10, -21, 29, -30, -8, -75, -23, -31, 2, -11, -26, -20, 40, -18, -4, 14, -33, -48, -13, -1, -5, 50, -1, -3, -45, -62, 6, -41, -77, 14, 26, -10, 39, -24, -16, -47, -26, -57, -24, 39, 6, 25, 10, -7, 5, -26, -68, 15, 32, -39, 10, -20, -52, -7, -19, 49, -12]
2819a2J1J7n7jLO4l6j9J6nLL0J3Ro3qJ7jK0l9K8l8Q1j18J47k4n5M4m6M0l0J0l3
2852c2K1Jk5jP2q2M7n8K8N5jl0N2l8k6K0k6J2j0L4k5l5M4J4l5j2P3k9K4l8J7J5
2884B6o5M0Nj9NL6Kk3n2L9l0N0LJ4m2L2n4j4P9omNm5L3rK5qj5j1l3L9l2J01q5
2918a3l0N9K0J2m9%j6m2P9k4M1pl5j6N7Rm7j2N2kn5J2N5m5J3j4j8PN0l0n2N7p9
2951f3O9m4QK8Mm2L3k8R8j29K3O0m7K2j9L6l3OJ5m9J1J4N1n1J7J4j8J4K0pl2K2
2983CL2j3oj4l4J8j9Q7m6p3Q5m0K4j0k9j4L1l2P3pq1N4k7M9L0o5kP8rl0NJ4m1
3016iL3l3L3n0J6kN2q6K5kJ9k9l2M1k8M2J4m9J22p2j8j1L1k6pM3K7n0k1K8qL9
3048C2m0M0m3L4n1M1J5o7Q5l6m3K3L8l7Kl5M4o6L8J6m7P5n7J04q3JM6j06O9k4
$$ y = [-12, -1, 16, -41, -42, -39, 25, -11, -30, -14, -19, -16, 14, 27, 36, -27, -35, -18, -19, 1, -38, -10, -48, 33, -85, 62, 38, -17, 27, -19, 21, -9, 1, -32, -11, -10, -35, -36, 36, -46, 1, -57, -29, 26, 25, -5, 47, 9, -17, 3, -23, -11, -21, 13, -12, -47, -3, 11, -24, -36, 37, 8, 32, -6, 11, 26, -39, 1, 6, -13, -8, 28, 30, 7, -45, -6, -36, 14, 17, 31, -11, 21, -33, -47, 32, 26, 22, 27, -18, 15, 6, 31, 23, 8, -3, -36, 3, -29, 72, -13, -43, 16, 36, 48, -1, -1, -17, -59, 20, -4, 37, 30, -5, -21, 36, 45, -2, -14, 38, 36, -19, -7, 48, 3, 16, 2, -16, -9, 41, 11, -41, 16, -63, 6, -38, -30, -2, 2, -40, -7, -35, 63, -66, -43, 17, -30, -8, -27, 9, -24, -18, -3, -52, -41, -27, 24, -27, -10, 4, -14, 0, 20, 13, -19, 3, 35, 22, 16, 2, -32, -14, -33, 54, 8, -65, 20, -20, 4, -6, -35, -49, -18, -50, 23, 16, -65, -11, -38, 11, 41, -24, -26, 52, 43, 13, 18, 32, -9, 24, -9, 24, -26, -10, -12, 40, -46, -21, -23, -4, -33, -65, -24, -52, -10, 4, -45, 77, 5, -13, -24, 7, -19, -26, 17, 44, -6, -27, 1, -7, 32, -8, 32, -11, 23, -28, 13, 28, -39, 46, 10, -33, -10, 28, -9, -7, -42, 2, -64, -26, -10, -57, 18, -39, 65, -18, -17, 29, -77, -8, -32]
3078c2lj6Q8Op3M9m8K3M1m1N1m7l3J3N8L2m3p9P4LnK3rk4j3L2Mn6K5m6PK5M8p2
3112c8O5Qn6J8J9j8L1o6J9m5L4N0J3l5k0QJ2jl1j1MM2mJ5rl2L6o2J19p8j2QJ0
3145gJ5J2K6j11J16j6Pj05R4m0k8Mk6pO0j8l5M1k5oO4k3L7k7k2m6L9O1p3P6L1
3176F8j00N0L5o9nL1j6K4n5P2m1J6MRq0J6L0kpL2j6k5Oj5M1l8R0n5m2QJ7O7p9
3209b9N1Lqj7k5P5n0L5k1n3K7K5n2O3o9K1L6m6O5l9k9J5j8M0pM0rl0%K5k6j8L9
3242A4n5N6%o7N2K1p0N7K4l5K1k7k0O4K%n5kO2m7j5K7L4l8o0P4k8Kn2R3o7l7N1
3275b1l2Q6k0k3J0K4k3K4Jk6k2L8j4J1l2rL3j6J9pK6m1lJ8K0K6n8J0K0k1K9k2
3307Erl4J2P7k5o5MO4%r5M8K1noK8jK0p2M1l0pM6l2j1k6O0j0lmL7k6J4k8M8n7
$$ y = [-32, -35, -51, 37, 43, -30, 19, -29, -6, 35, -6, 45, -2, -35, -22, 36, 68, 25, -54, 20, 23, 18, 41, 32, 8, -5, 27, 31, -25, 0, -46, -39, -14, 34, -38, 27, 35, -21, -3, 16, -2, 29, -37, -18, -63, -29, 21, 34, -1, -21, -13, -1, -2, -33, -44, -40, 2, -2, 13, 4, -28, 8, -54, 65, -13, -25, -17, -7, 8, 20, 46, -65, 51, 35, 42, -63, 31, -9, -37, -33, -59, -66, -6, -24, -59, -18, -43, -49, 15, -8, 29, 2, -20, -66, -27, 34, -39, 37, 68, -32, 18, 53, -16, -21, 10, -6, 18, -37, 35, -6, 10, 14, 23, -57, -41, -11, -13, -20, 12, -4, -29, -23, -38, 3, -35, 55, 0, -42, -34, -17, 50, -29, 22, 25, 17, 0, -25, 50, 0, 35, 14, -39, -12, 13, -39, 24, -45, -24, 12, -34, 31, -8, -37, -22, -40, 0, -7, 33, 24, -6, -6, 19, -7, -25, 14, -41, 15, 15, -52, 0, 21, -49, 8, 32, -3, 18, -9, -29, 35, 37, 37, -18, -20, 42, -5, -20, 7, 41, 3, -57, 17, -11, -9, -61, 32, -35, -72, -21, -53, 33, 13, -10, 0, 24, 1, 25, 26, 0, -22, 16, 2, 13, -19, -28, 5, -11, 8, 1, 27, -14, -17, 1, 21, 47, -11, -1, 19, -2, 27, 5, -4, -38, -26, 51, 26, -39, -35, 29, 29, -66, -18, 3, -2, -8, 20, 19, 39, -33, 8, -22, -29, 17, -15, -26, -52, 8, -2, -5, -9, 28, 2, 16, -12, 36, -21]
3342b1J4l6N3NRk3L5l8k5L9QJ4k1j4k8L4Kj1l4mQJ9K0j6jOk0Ol8M5j2J2jL3%o
3378A3o2Q8n7rJ9k4L2j9kj6O3NPrm7L3KK4n6N0n5J2j3M2l4K6N0n8m2PRj1J7mN
3413a4oJ5k0N7l1L5n6J3L1j04M2N3k9k8O0J0j3j9M1l3N6r2Q4k7q8R5r2J8M0kk4
3444b8L4k0J0m3N5l3qL6J8m5M0o4K4k0L5J1j5m3O9omJ4J7J9j7m1K2J5k2l1k8O9
3476B0J3n8J0j6O8j9Qn5L1j2Nk9O9l4L4n7roN2n2K1j0L7rk2L1mNL1J8r7O0l6R1
3510G9j51K7K2K1NkK7pj7j8l1M2L2l3qK7K1o7L3nN%J1m3N7n2P0J2r0L4n3L2k0
3543d0K1rN7m0K9k3J4l7K7P2Kn9n5J8L3k2M1pm9K9lJ0J4oo0Q2o3k9L9PMo2O5l
3577cm6O8k6Om6K1M3m0j5M7J1Ml0N1m8O3j2n6Ll4K7RK6L7j12N5k4mj5rR8q9K5
$$ y = [-21, -7, -43, 10, 15, 24, 1, 36, -2, -27, 12, 20, 34, 13, -1, -29, 5, 7, -4, -38, -42, -34, -15, 5, -11, -12, -6, -26, -20, -58, -13, -25, -13, -14, 19, 19, 13, -49, 39, -18, -27, -8, -32, 0, -19, -21, -37, 26, 31, 38, 29, -18, 15, 17, 41, -15, 35, -20, -8, -21, 21, -13, 13, 63, 5, -37, -30, -21, -32, -15, -19, -14, -20, -5, -25, 32, 1, 36, -20, -7, 24, -80, -38, 15, -14, -42, 18, 28, 15, -4, 37, 4, 60, -32, 52, 25, -63, 32, -60, -42, -2, -4, -28, 6, -14, -4, -47, 8, -25, -33, 3, 21, -24, 16, -48, -24, -44, -9, 2, -13, -56, 13, 7, 3, 17, 34, 53, 36, -5, 17, 32, 10, -21, -49, 20, 33, -25, -15, -31, 37, 18, 26, -29, 2, -10, -5, -34, 35, 1, 35, -22, -31, -37, 15, -37, -16, -26, 11, 2, -20, 11, 7, 12, 43, 61, -36, 24, -12, 79, -72, -45, -23, -2, 3, 1, 28, 21, 4, -14, -45, -3, 29, -4, -12, 15, 36, -31, 2, -3, 2, 2, 13, -30, 27, -25, 45, 57, -33, 1, -52, -20, -40, -19, -28, 29, -11, 18, -5, 9, -28, -1, 71, 73, 14, -41, -23, 10, -12, 29, 22, -27, 2, -1, 9, 23, 17, -43, 39, -24, -53, -14, -7, -3, -65, 0, -3, -49, 19, -7, -1, -47, -26, 17, -23, -38, 9, 20, 24, -6, 45, -3, 60, 48, -8, -5, -39, -12, -3, 23, 60, -52, 3, -21, -25, -40, -49, 49, -40, -15]
3610a5Kj0rMJ4qJ0j1J4k9L4l3L7j0J9om0K3J2K8j5Pj2qm6nQ9j9k7j5L9k5L0n0
3644c1Q9k1n0l0LK0K5L4K0j05K7M1l0k3qOM3j4k4N8o3o9M9K8L0k5L4J8Rl3K6q2
3676d8J8L6Rm3L7Pk9l4O8j0l4j5M9J1Rmk2J6k5L9n6K6pK0j7j6K8j7j4k6O7j7j6
3709a0L4j6rM%l1K0k7L3J9n1N0m2Nm6O8mj0K8Oj8k4L3k9nL8m4N5om5L0Rj2q9R9
3744A3o3O4l1J8m4P4km7M6l4nMJ7L5p8LL8LK7j1l6M0o8oRML7k4N0r8Q8n5j4K5
3778b1L9q5N8K8k0M5o0J5k0N1L2n1m5Pj4L8Ll2K1PjJ7Pl1K0l9k5N4rLk2rL6j4
3812a7M0m1L4j2lj5k1K9k3P3p2l7L9L8L1n1K3K1m1NL8n1L2n9K0N9jj0k3k1J4N
3844CM3l5l5qL9j6K1km1J7K1k4MJ5K4L6m2k1P5j03M4m3j0oJ5mJ4LoL0J1j9j6j3
$$ y = [-15, -13, -23, -32, -28, -14, -22, -12, -23, -9, -38, -4, -37, 0, -10, 9, 3, -37, -14, -2, 26, 11, 18, 6, -2, -48, -53, 36, 17, -10, -25, 14, -11, 19, -31, 58, 37, -13, -43, -40, -20, 5, 39, 59, -46, -19, 22, -8, -31, -39, -33, 10, -4, -28, 30, -33, -102, -53, -25, 5, -20, 14, 32, 41, 8, 34, -48, -30, 6, 15, -28, 9, 16, -13, -47, 21, 11, -23, -38, 11, 22, 31, 27, 5, 21, -4, 35, -21, 5, -2, 18, 1, -15, 13, -4, -18, -44, 23, 6, -10, 24, 8, -1, 3, 3, -28, -8, -35, -2, 17, -34, 16, -26, -21, -67, 1, -3, -13, 15, 21, 3, -21, 12, -17, -22, 16, -28, 27, 21, -24, 6, 15, 3, -86, 13, -50, 14, -17, 1, -43, 31, 29, -18, 28, -6, -11, -7, 10, 45, -33, -30, 8, 11, 38, 27, -9, 31, -37, -43, -34, -30, 7, -17, 33, -65, 23, -32, -46, -21, 18, -67, -9, 19, -1, 44, -16, -1, -21, 30, 62, 11, -34, -27, -41, -3, 0, -32, -11, -4, -5, 12, 19, -12, 8, -31, -56, -2, -11, -8, -30, -39, -3, -17, 23, -18, 16, 4, 1, -14, -35, -6, -29, 44, -28, -65, -26, 12, 43, -8, 15, 36, -5, 0, 38, -13, 19, -40, -20, 39, 38, 28, 5, -16, -2, 3, 46, 11, -24, -32, 7, -9, 12, 10, -31, -14, 7, -17, -13, 2, 26, 62, 20, -1, 74, -29, 15, -28, -38, -44, -29, -33, -19, -16, -22, 8, 19, 0, -16, -29]
3878b9j0PO6r6M3K2m8L5k8R6j00N7qNPr7M7M6N0n5Lk6j2J8M4k1%J6o3K9M3j44
3910a03M4J7nN2j1K8n3K6M0oLn8N9n7lM0K2n5M9pK6q5P4K3q1L8m4L6pj2oj8kM6
3944A0j8L6l1J9L0q7K4m0M0J6rPk2N3n1j7O4m8MNJ7L4m4Jm7P4l4J8%JJ7m4J2P
3978ck7M2Qp8O8o7O8J0n1N3k9N4o4o6R9n0K5J2n0K4k1M2K7k0k0k6M1pkM4l2j6
4010a2%RJ6q7J26o0K9Km7k1R7lm7O3j01K2K0J5m5K0l8L3j6%K1k3j2O7m9N5m6N0
4042C8m9J0m1K0j1qJ7P1k3k3j3n3O2L6j6n7O4k7j4K8Pm7O5l1K3m8rM5j7L1K3q3
4074c0K3LJ0j9k6O4n9K1l8J6J4l4O7p4NP7jlk5k6L4l7J1L1%J8k5J6l4M6L3m9J4
4107B3l4k8M3k2mK6O2n5m1mL8k0J0j7N2j5l6%QM9n3L9j7k6j6N0qm4L1k9Q7r0K6
$$ y = [-29, -39, -32, 34, -62, -19, 3, -45, -10, -38, 58, -42, 15, 7, 12, 19, -78, -31, 15, 65, 10, 13, -13, -25, -7, 37, 16, 16, 32, -31, -2, 41, -103, -59, -42, -47, 5, -6, 22, -31, -5, 35, 29, 32, -26, 33, -24, -27, 13, 35, -20, 29, 22, 48, -37, 37, 60, -21, 17, -27, 9, 2, -10, -16, -34, -36, 10, -8, 28, -3, 16, 46, -41, -17, -57, -17, -1, -10, -3, -25, 28, -23, -40, 24, -24, -20, -15, 2, 36, -8, -7, -54, 20, -14, 4, 4, 5, 22, -22, -10, -3, -30, 12, 20, -58, 10, -57, 11, 21, -30, 23, -6, 48, -16, -82, 17, -33, -8, 4, -46, -22, -43, -1, 26, 6, -14, -40, 1, -6, -8, 36, 4, -12, -12, -3, 13, -74, 52, -8, 21, 23, -24, -45, 52, 49, 2, 65, -36, -14, 6, 21, -24, -4, -42, -9, -25, -25, -4, -27, -39, 28, -21, 34, -12, 38, -11, -1, -42, -22, -33, -41, -24, 47, 24, 1, -12, -65, -3, 33, 17, -40, 24, -3, -17, 11, 18, -29, 36, 5, 28, -20, -29, 16, -1, 30, 53, -30, -7, -4, 6, -13, -39, 25, -34, -13, -51, -35, -21, -55, 12, -62, -57, 20, 19, 16, -9, -35, -1, -38, -27, 4, 4, 22, -3, 13, -21, 25, 58, 9, 23, -11, -39, 4, -18, -22, 4, 66, 11, -30, -34, 4, -16, -6, -23, 29, 14, -22, -22, -14, 35, -18, 21, 4, -22, -38, 12, 4, -40, -9, -38, 49, -41, -15]
4140a5JN3j3m7M7P3r2k7LLK6OK6k5k9n9P3j7OjM1l9l6N8M5p3ok5M8Nj2l2M4k2
4174a2K6Rl8J3N1n3K4m2L7KJ1n4L2L2n6k8J1O4p8M9j3j5L3J0N5m8k8j2j2NN4l5
4206fL1o1N2PJn1K1l2K3MJk6OM4K3j0L5n8k4L5K1k9J8jl4M2J0l3k1J2nlJ6n7J0
4241c9J5M0q7Q2k3rQ4j11N6rrl0O2l3K1k5j1Kl1M5L5k8j6J1J7m0N7n1O4l8l8K1
4273a6M5n0LP3o7L3l1Q4o1j2J0n4K9L5l9k5P0jpM1q0K7j7n2J9J7m6R3j3NJj4k1
4306b1j2O8l6J9L8q0N1l4J8Pq0K6J0j7P7l3k1Kj6N4m0K7m5k5K7J8mM9m4J0l6J7
4338b6RJ7n4M7M1m9l6Q0%j6OJ1K9n2K4K3k5r9J26q3RJ9J9j7M3pq3K6ok0M4j9M6
4371B7K0j04rM5K7m3P0n0mN8q4L8N9m3j6k8J4J3J6mj7L5k0L4p5Q3n0l9M6N9j22
$$ y = [-15, -14, 39, 26, -21, 26, 99, 7, -20, -17, -14, 12, 18, 44, 19, -10, -69, 4, -13, -7, -8, 33, -6, -42, 16, 61, -12, -18, -43, 5, 10, -2, -34, 10, -12, 14, 23, -15, -2, 49, -4, 20, -22, 15, 17, 28, -26, 6, 38, -18, -46, -35, 29, -49, 0, -13, -28, 5, 15, 70, 22, -6, -18, -30, -25, 29, -6, 25, -36, 16, 23, 24, -27, -6, -38, -15, -11, -10, -36, -30, 14, 37, 27, 62, 4, -20, 15, 36, 7, 25, 24, -10, 32, 42, 9, -12, 0, -5, -8, 8, -49, -39, -24, 16, -71, 11, -12, -21, 63, -48, 8, -1, -10, -40, 22, -11, 10, -15, -26, -24, -55, -10, 25, -3, -19, -8, 9, -31, 26, -25, 39, 1, -37, -16, 29, -21, -18, 55, -12, 21, -10, 74, 13, 1, 11, -43, -14, 21, -18, -43, 27, 26, 19, 60, -20, 7, -10, -62, -43, -26, -72, 21, 8, 13, 14, 0, -21, -33, 35, -1, 18, 56, -24, 27, -7, 11, 18, -62, -36, -26, -43, 34, 1, -20, -18, -34, 20, -20, 7, -38, -63, -36, -18, -22, 27, -17, -7, -43, -26, -17, 0, -54, -7, 34, -15, -51, 29, 29, 13, 19, 30, 59, 7, 31, 54, 29, -70, 56, -27, -18, 1, 20, 3, 46, 39, -44, -18, -24, -44, 0, -19, 27, 47, -57, -66, -21, 6, -37, 33, -17, -21, 37, -47, -9, 50, 7, -9, -37, -23, -10, 6, 2, -15, 20, 0, 34, -41, 42, -8, -47, -1, 58, -64]
4402f4P1Lnm3OJM8Kn3K3N3j2l7J5k2O0m6m3K2Kk7J5K3N4m2J1n0O4n1N3kl5J6L8
4436D8o5M8m3J2l8O9nq5P8l8L3k3k2J3k2M2j2Pn9N7k8M5rj3MK8rK1m0m%k2J4l5
4470e3P0m2J9J9l9M2m5J8k5N5n9O3n7pM8j4n7N4j0J6Jj4nj2PJ0J6j1LMj0J1l3
4503c7L2k6J2O4p5Ll3J8N4k8K3l9J6K7J1pm7K7k2k0M4N0j8jm9N7l7j8J6oK8k1
4535bl9N5M4j8l0n1N5k7jML9m0jK2k2l3K4Qj4P6r7P1O%o3L0K7LLk5J6mk3k0J07
4570H0l9q3j0M7K2p3K0K5m5Q6m6L6ojn1L8j9Rk0M1qjr0O0RJ1j9L9k1N5m3QKl3
4604b0Mk0LN7j7m3O9n2L1rPj4k8kjO4k8o0P9p4M0pK6krK4k9K1l1J3oj1ML8k5J9
4640A1J6mm3j2L6m0O6k0k3rK5n2N5o5L8j5K9l1M7qK4On7QK7kJ2o9N0L1j3j0Mr8
$$ y = [-64, 7, 10, 5, -38, -32, -31, 17, 19, -34, -11, 42, 30, -7, 8, -14, 46, 0, -43, -21, -19, -46, -31, -8, 46, 4, 15, -35, 29, -22, 31, 29, -6, 10, 48, -17, 31, -12, 0, -38, 31, 26, -59, 19, -19, 14, -9, -31, -18, -40, 2, -10, -3, -62, -5, -33, 12, 3, -10, -6, 22, 13, 34, -6, -10, -10, -32, -18, -53, 17, -25, -6, 13, -26, 16, -29, -11, -36, 19, -40, 23, -34, -41, 7, -7, -64, -10, -20, -4, -3, -17, -22, -34, -27, -17, -1, -12, -9, -5, -15, -4, -37, -5, -31, -19, 45, -30, -27, -60, -42, 12, -16, 7, -32, -16, 11, 22, 15, -32, -5, -27, -47, -3, 47, 29, 28, -21, 36, -1, -19, -3, -9, 19, -2, -41, 14, 58, 40, 10, -41, 14, -13, -14, -10, 29, -11, -12, 10, -12, -45, -21, -13, -27, 49, -48, 23, 29, 29, -34, -4, 23, 26, 29, 4, 20, 16, -7, -27, 80, 41, -42, -52, -5, 17, -56, -36, -11, -56, 30, -16, 20, 14, 13, -38, 0, -19, -10, -30, 11, 3, 2, -88, -28, -19, -8, -27, 12, -9, 46, 3, 11, 13, -20, -16, -36, -33, 24, 7, -36, 33, -19, 12, 3, 10, -4, -32, -34, -35, 29, 1, -59, 20, -54, -14, -21, 5, 3, -6, 18, -11, 10, -21, -8, -14, -25, -21, 17, -8, 11, 27, 23, -20, -32, 4, -36, 30, 10, -13, -22, 3, -49, 6, -59, -21, -36, -7, -38, 9, 1, 25, 31, -26, -18, 9, 7, 19, -50, 0, 31, 18, 8, 12, -86]
4674h6P5KK5MJ1j2j3K6j6k6%k7jK5l0L4L9Jm4k3j4N2jK9pJ9j9l5J8l2M4m2k1L1
4708a4L3k9J3oN0j02J3N3j3J2J1k2QJ2N1o7j7j0O8n5L7K8q2M5j7L3lp8N0noj9
4740b8O3J5kj6j7l6K2mn6J27j10O3rOn3L9j9oj6oR0n8k8K6M3m4j4N9k3J0l0M2
4772C0j6j6K3k8M2j0ol8nRK9o1Q0Qn7K3l3QM2p2Q5n2Nk2K9j7l7M2l8J5L2RJ9R
4806C1m9RM8o9J00p3J6L9j5M5j05P0k8k7M5J0m8L5n4QJ6M2n0M4o0N9qK6j01K7
4836a7J0l6j3M8prL9m1l6oJ06n1N3pkol2K2l3M3K3q3M0j4N7l1l2K7j2K3n5J5J9
4869BJ4j2Ql1j0k2K4PK6J3Op0kM0M0p2O4l1k0L1j5N1j1J1J5p5j8M9mM5l6pM6p0
4903a4J2M0Jq8L8K0nK5l0KJkl2Ok5L4m3R0Po8om7R8JrJ0j6lL4n1lM3nK2n1J9N3
$$ y = [-86, -11, -9, 16, 20, 31, 19, 6, 32, 16, -10, -10, -37, -38, -13, -43, -9, 30, 31, -13, -36, -50, 2, 1, 30, 23, 42, 23, -12, 6, -26, 18, -24, -45, -14, 19, -10, 3, -3, 47, -55, -42, 11, -2, 10, 21, -1, 7, 19, 70, 3, -14, -24, 44, -11, 26, 54, -28, 17, 0, 33, 30, -48, 2, -3, -9, -28, 35, 50, 48, 32, 15, -21, 1, -3, -59, 68, -42, 21, 12, 18, -35, 4, -15, -21, -37, -43, 47, -11, -39, -13, 30, -14, -28, 31, 8, 18, -12, 30, 14, -2, 21, -7, 35, 25, 19, -19, -24, -15, 14, -47, 33, 41, -16, 7, -26, -18, 24, -48, 37, -15, -10, -32, -3, -20, -57, -15, -53, -38, -6, 3, 22, 31, -18, -9, 39, -30, 70, -3, 13, 52, 37, 82, -23, 47, 19, -8, 37, 47, -1, 34, -20, -12, 4, 46, -4, 40, -20, 39, 31, 57, -44, -17, -7, -43, -56, -8, -15, -24, 15, -26, -62, -68, 38, -13, 40, 33, 31, 25, -7, 15, -18, 25, 48, -35, 5, -9, 48, 17, -15, 12, 0, 23, -32, -17, 2, 16, 4, 12, -19, -29, -51, -27, -20, 6, 19, 25, -45, -47, -7, 33, -39, 25, -6, -26, 5, -10, 41, 30, 41, 56, -19, -37, 12, 8, 53, 17, 10, 56, -14, -2, 38, 39, -49, -11, 9, 4, 29, -1, 1, 2, 0, -32, -26, -51, -17, -60, 30, 37, -31, -37, -84, 14, 15, 6, 16, 0, -3, 31, -20, -23, 20, 15, 37, -14, 5, 58]
4940E8k4j7j8J9j7M4o9M9l5NJ01j21LN6o2N5o5L3M1M8j29mO8m3L2K2l8M8p0JJ6
4971a3%K5o0P1j1jm4J9J0mm8P9Pl6Ll8L6k5K5j8k3N5M4o7K0Oj2j1OL1Ll8J8l8
5005b9qK5m2L8L4k7JJ7n1Q4n6P1o5M3p0K2Pj6Q0o4jk4j5jL6J8J6K0k1mL2m1l9
5038c0N2m6K7k0J2k7O3q4M1J3j3k8P8n8O5l7k4k6L5M5Lk9K2o6M1M8p8O5k8k7K5
5069A4L1p1rM1n0N3k6l4M9j5J2o0Q2J5qj1Rl0o3P8NLk2L5l9nK5k4J7J9k6O4l3
5102B6J0k8J3Nn8M4Mj1k1j2Q4p4O5o6l7L2j1N8n4O1o6L6JNq8J25m5j2J2l4K0J6
5134@k9J9l0M4l5J5l1M8J3QoK0m5k7K7L3Lm8L1PK5Qp9M4Pj2j9J6m3J2J4M7k3k7
5168a3K2kl5N8p6N9m5K5pNp0P3P9j17L7M1kn8M7n6L2K0m3O3j8oj4kN5l9J1kl6
$$ y = [58, 34, 17, -1, 18, 1, 45, -24, 25, -10, -5, 96, -25, -22, 34, -28, 27, -38, -5, 36, 84, -45, -49, 19, -24, 8, 30, -8, 40, -30, -29, -13, -13, 12, -48, 23, 12, 11, -33, -14, -4, -8, -56, 23, 30, -6, -3, -41, -5, -30, -5, -23, -46, 9, 53, -14, 6, 12, 0, -11, -5, 26, 29, -9, 9, -29, -37, -12, -54, -16, 18, -9, -8, 9, -42, 42, -14, 57, -8, 35, -35, -13, -6, -22, 58, -6, -7, -31, -46, -47, -11, 7, 23, 43, 22, 18, 50, 9, -30, 22, -24, 3, -17, -5, -32, 31, -53, -12, 1, -12, -40, 38, -20, 45, 8, -16, -42, -7, 38, 41, 12, 34, -32, 9, 57, -21, 44, 16, -11, 14, 45, -26, -35, 6, -44, 9, -17, -51, -2, -17, -5, -65, 17, 32, 24, 13, 22, -8, -71, 7, 12, 15, -7, 28, -11, -16, 9, -15, 2, 21, -5, 59, 26, 36, 8, 21, 26, -32, 12, 16, 5, -16, -28, 56, -18, 47, -19, -56, -24, -35, 23, -31, 30, -36, 0, 1, 6, -82, 43, -2, -14, -2, -36, -16, 0, -29, -10, -40, 4, -31, -16, -47, 1, 14, 22, 16, 36, -9, -36, -9, 24, 27, -21, 10, 17, 42, 50, -29, 15, 22, 10, -9, 7, -36, -24, -10, 37, 14, -13, 9, 7, -28, 30, -46, 13, -32, -7, -14, -9, -79, -6, 73, -44, -7, 34, 32, -26, 21, -35, -3, 17, -26, 37, 19, 13, -1, -3, 52, 13, 24, 22, -14]
5201a4O3o6k2M4k9j9M7M1j9m2Rj3L0l6k2R3o5K1kJ5l3J7o0J02m8K5j2K0M1l0n8
5232b2P1k6j2j2l9P3pk7l8K9K7n5kK8j4N7k5l5N1q0J0J6L6Lj3L1m9K1k3J1jL3
5264A7n4RKM3n7j6N3j4J2Ql3kO0k7K6n8K6Ml7N4PQjl9M1J%o0J8p1N0K7k3J9oN9
5300D6p1j7k%pK4L2L9n6N5l4Lo0M6J9L3m2Kj7RoK8M3l2l5J6jrk2L5m9J2L7l3M2
5335B8o2K3m3L0M4Jm4qN2LKk8n6N4K5m5L7L0m0Ok3J9l7n4J13k0jp0O3j6jjj6J7
5369a8L8o1L3KJ6J5r%jk7kkqL0K9J2n2J4q0Q1j4j7N6n0NK6j8n1M4K0l2N0%%j2
5404A7qn1Q1l8k4L9Mk8jk1J12n0l3Mm9O9k9J2n2K3K0J8MJ8p3O2o5N5j3M8l9k6
5436a4M7l5J5l8L0l7j5K4%M0j5j2N3m6mL2k5J8k7K9j7j9K7k3KM0l9kL9r3M1M3
$$ y = [-14, 49, -17, -39, 5, -24, -43, 4, 45, 26, -16, -7, -20, 10, -26, -48, 45, -20, 1, -1, 14, -19, -2, -62, 40, -8, 17, 5, 25, 66, 36, -22, 49, 23, 11, -1, -40, 33, 26, -1, -39, -10, 17, -38, -40, -12, -26, 31, 6, -29, 22, -58, -48, -32, 4, 7, -6, 25, -24, -3, -26, -15, -16, 17, -37, -28, -26, 17, -40, -56, -3, -17, -5, 3, -30, -32, 28, 1, 27, -31, -5, -1, -38, 16, 23, 31, 30, -9, 32, 33, 33, -27, -9, -80, -30, -3, -26, -7, -13, 46, -25, -42, -44, -44, -51, -27, 5, 44, -12, 43, 9, 12, -48, -2, 17, 50, 8, 10, -7, 2, -4, 24, 67, 35, 0, 16, 15, 6, -16, 19, -30, -18, 19, -14, 28, -34, -11, -54, -24, 20, 21, -23, -31, 21, 24, 26, -2, -58, -4, 21, -24, 13, 43, 3, 9, -14, 5, -32, -86, 27, 7, 6, -64, -1, -17, -18, -19, -35, -18, 20, -41, -8, -6, 10, 25, 16, 16, 15, -12, -14, -16, -24, 6, 35, 47, -5, 9, -71, 10, -4, -21, 35, -15, -10, 16, -2, -53, -9, 11, -21, 29, 29, 29, 17, 9, -42, 39, 1, -23, 16, 20, -8, -9, -30, 82, 32, -1, 3, -46, 23, -6, 6, -46, -23, -3, 15, 19, 37, -36, 26, -39, 16, 3, 51, 12, -14, 33, -2, 13, -25, 5, -32, -47, -23, -23, 17, 2, -10, 43, -3, -7, 25, 0, 18, -9, 20, 3, -16, 11, -12, -10, 30, -9, -11, 28, -65, -24, 19]
5468A9j8oj2l5O4l3N4o9N8J3L4q3L4J6n3L4o6K7J8K0l7PL1L9l6Ok9k7K8j6mLN4
5501C5j9n8O4m8M1rm5k4jK6kj%O6k8N0p3KnK1k4%K0M7rJ5N1k2r1L7n5P5l1J5k5
5536eK3j8K1l9K0M4q2N1Jn7L7p4J10j6l9O8n5l8N5J1J4k1J3l4L8Mpl3K4Lj2K7
5568C4l5n9R2l8Q5q6o0M9N1k5m5M1l6N4j6k1L0m0L2j7J3o8M6K9l4n2P4l1J2J0
5598a1L0k1K7n1N1n1N1n3%O6pjp5M9l6R2q7M7J8k3K7n9K3j5k8M2kK9o7K0m1Q4
5630B8r7P2Kj7lK3O0l5l6j2L4j3m4M9J8l5j3Lm6R6K4n6rL5L1m8j6K3k2l7O3n4
5662c2M4j9K7m3PJ7L8k5K4o8M4o0N0j8kM8p9OJ7J0Oj9J3%Kl5L5O1m8J0J6k0j1
5695dnM5mk7O4q2M7m8j0K5PJJ7pl8O7n6j7J7j4K1l0l7O4J5jj8Pj9RJ8k5K2K4m8
$$ y = [19, 1, -5, -17, -52, 12, -21, 33, -36, 22, 35, 69, -14, 20, 36, -17, 17, -49, -22, -4, 16, -21, -14, 17, 56, 20, 26, -3, -30, -2, -18, -22, -19, 35, 16, -42, 22, -26, 15, 6, -39, -63, -64, -38, -40, -41, -41, 25, -3, 47, -26, -24, -29, -8, -32, -32, -12, 35, 26, 41, 92, 70, -21, 16, -39, 36, 5, 20, -5, 18, 0, 21, -18, 2, 46, -36, 15, 16, -41, -4, -78, 32, 16, -23, 45, -10, -48, 7, 18, 32, 11, 24, -10, 28, 32, 25, -8, 16, 19, 7, 34, -1, -60, 32, -6, 79, -7, -67, -18, 33, 8, -37, 4, -32, 22, 6, -15, 15, -25, 7, -10, 3, -65, -19, 10, -24, -76, -2, -33, -21, -11, 19, -2, 25, -26, 25, -26, 25, -28, -28, 38, 31, 30, -45, 4, -32, 60, -27, 20, 38, 15, 42, -17, 6, -9, -37, 5, 3, 32, -35, -15, -56, 28, -69, 3, 5, -12, -15, 8, 68, 33, -3, -15, 19, 6, -38, 11, 29, -6, -19, -16, -62, 34, 58, 2, -7, 28, 59, 11, -5, 18, -4, -41, 22, -32, 12, -7, 20, -23, -16, 1, 39, 14, 38, -30, 14, -46, 4, -14, -16, 32, -47, -41, -24, -14, -8, -27, -14, -14, -12, -47, -12, 49, 1, 11, 27, 7, -4, -9, 36, 32, 5, 69, -13, 34, -14, -24, 1, 8, 9, 26, 19, -19, 48, -8, -25, -8, -22, -1, -31, -68, -4, 11, 10, -8, -1, -20, -11, 7, -18, 4, 28, -20]
5730b0M5k8Nl2L2K7j4m1J3kl5N5Mk7M9Lp5R3p9K4%K8m6l4J14p9K8Mj4n0O6Ol1
5763a1p2O3kk6J18p5qJk4J7%L8k3k2J5L3k2J2kj1K0qnN5l9k3m3O1p6M5QK4j11
5796i3M9oM9l7L6l0PJ1l1K8NN4ll9l3J8N0m6n7Q5j2M0l7J1Np3L4J7p0J00Pn6l
5829b0Rm6Q9k9m6N0l9L2j0l3Q6m3JKk6k0P5l6l5O5l6NK9q4O2J7J3l2K7j9k2jn
5862b0J02r4JJ7ML3m7OL4j9J5Po1N3k0l1j1P4p0J3M4q5O6jRm6L3k9l7J11k9K8
5894E0k4K0l4Rj1RRJ2m6K5o2M9lnK1O5q7j2J8k0J2J4K2k6k3j7J8M9n8Rk6M1n0
5927e2O7J1Ql2n5L7K1j3L4j6m3N6lkj9K1l5%J5jK7Olnl7pJ8J5k2N0k0l5k1Q5m8
5962BL6n8N4k7o2J2L8l5L6ON0p0j8kM8K3Nl9j2RNK7Mmk4J2jl5P7o4N0qm6jkPL9
$$ y = [-20, 25, -3, 2, -30, 2, 29, 15, -26, -13, -15, -50, 5, 9, -18, 31, 34, -41, 52, -27, -3, -3, 25, -21, -55, 59, -20, 8, 12, -2, -52, 14, 20, -11, -83, -20, -22, -48, 70, -5, -13, -12, -36, -19, -19, 19, -4, -26, -11, 22, 0, 12, 10, -1, 19, 11, 6, 61, 22, -1, -44, 17, -59, -14, -6, 18, -93, -44, -50, -1, -38, -2, -32, -25, -14, -45, -17, -12, 42, 39, 0, -33, -15, 35, -11, -68, 17, 5, 45, 8, 19, 24, -49, -15, 2, -68, 32, 39, -17, -20, -11, -57, 32, 3, -43, 7, -32, 0, -10, -43, 43, 0, 1, 3, -23, -43, 32, -4, -39, 26, -10, -5, 24, -60, 2, 19, 32, 0, 27, 8, -14, -15, -20, 82, -12, -11, 6, 10, 43, -4, 2, 36, 17, 32, 39, -22, 31, 11, -20, -31, 43, -27, -14, 30, -55, 11, 10, 19, -27, 6, -23, -60, 51, 22, 50, 26, 46, 12, 21, 10, 19, 28, 40, -6, 19, -43, 6, 3, -2, 19, 84, -3, -15, 3, -17, -5, 9, 31, 5, -18, -35, -17, 32, -26, -17, -43, -2, -52, 15, 26, 34, 2, -53, -16, 5, -8, 26, 10, -33, 23, 20, 18, -1, 20, -15, -15, 0, -1, 26, 32, 29, 24, -13, -20, -2, 13, -9, 41, 21, -14, -35, 50, 2, 38, -20, 34, 7, -55, -43, -5, -40, -4, 2, 52, -18, -36, -38, 10, 33, 38, -1, -13, -4, 1, 28, 32, 28, 4, 16, 15, -20, 57, -7, 43, 35, -11, -12, -14, -7, 32]
5999C2MOo0nM2J4j2k5m7K3P3m0Om8N3L5p8J7K7Qm9J3KK6j1K8l3J2k0j8M8Nol3
6033a1L7rjp2O5NN2r8K5JK0J0m9J0k0Jj9M9J3l0JK8m7P7n2K3oj1L9l8k4J4lO3
6067D3J0jn2J03r2n8M3M3p9M4qL0NJ1o6NL3qj6OLpM0o9J0mJ8K3m0l2K2K9J1j9
6101a9J1J2J6pm1k8Q5l5J2N6q2P2Nn4jJ1j2j7mJ5Mj5J28j17j5JqN4j7k0j3L1j6
6134hrK4k2K6ok9%NN7r0JM1J2m6R1m8N2p6N3ll8oK2j4kL2l1J9n0N9l5J3Mk8K9
$$ y = [32, 36, 42, -18, -23, 19, 33, 21, -4, -51, -28, 45, 5, 11, -37, 16, 51, -27, -10, 17, 25, -24, -11, -9, 17, 6, 34, 1, 13, -7, -25, 23, 28, 22, -11, 26, 17, 16, -56, 9, 14, 66, -32, -7, -6, 14, 24, -25, -15, -35, -34, -53, -4, 9, -21, -20, 8, -39, 38, -14, 9, 3, -8, 31, -7, -31, -17, -20, 43, 53, 52, 0, 103, 11, -47, -4, 39, -40, 4, -4, 26, 31, 42, -24, -19, 14, 6, -10, -4, -1, -8, 32, -37, -27, -31, -13, 10, -30, -62, -40, -11, 0, -19, -8, 4, 20, 13, -28, -56, 29, -6, 6, 62, -20, 52, 57, 3, 2, 13, 1, -16, -20, -5, -1, -16, 112, -5, -20, -19, -27, 27, 10, -10, -23, 8, -8, -17, 7, -15, 11, 5, -24, -24, -19, 38, -52, -51, -10, 2, -44, 47, -1, 51, -25, 28, 25, -13, -19, 3, -11, -13, 19, -12, 7, -43, 16, -19, -6, -2, -30, -1]
$$ [...]
8191H
##END NTUPLES=NMR FID
##END=
