##TITLE=1H_AM_NV139
 CDCl3
 8 sc, 
 12.3.2024
##JCAMPDX= 6.0         $$ Bruker NMR JCAMP-DX V2.0
##DATA TYPE= NMR FID
##DATA CLASS= NTUPLES
##ORIGIN= UXNMR, Bruker Analytische Messtechnik GmbH
##OWNER= root
$$ XWIN-NMR		Version 3.5
$$ Tue Mar 12 16:13:15 2024 Russian Standard Time (UT+4h)  she@DPX200
##.OBSERVE FREQUENCY= 200.1313
##.OBSERVE NUCLEUS= ^1H
##.DELAY= (6, 6)
##.ACQUISITION MODE= SIMULTANEOUS
##.ACQUISITION SCHEME= undefined
##.AVERAGES= 8
##.DIGITISER RES= 18
##SPECTROMETER/DATA SYSTEM= spect
##.PULSE SEQUENCE= zg30
##.SOLVENT NAME= D2O
##.SHIFT REFERENCE= (INTERNAL, D2O, 0, 15.7039)
##AUDIT TRAIL= $$ (NUMBER, WHEN, WHO, WHERE, WHAT)
$$ ##TITLE= Audit trail, XWIN-NMR		Version 3.5
$$ ##JCAMPDX= 5.01
$$ ##ORIGIN= Bruker BioSpin GmbH
$$ ##OWNER= she
$$ F:/spectra/data/she/nmr/H-F/1/audita.txt
$$ ##AUDIT TRAIL=  $$ (NUMBER, WHEN, WHO, WHERE, WHAT)
(   1,<2024-03-12 16:12:23.17 +0400>,<she>,<DPX200>,
      <created by zg, POWCHK disabled, PULCHK disabled
       configuration hash MD5:
       00 E9 B6 7A A2 85 ED C7 34 08 36 98 17 FE 4E 26
       data hash MD5: 16K
       B5 CC A4 0F 03 C0 AA C5 48 45 04 EF 14 E7 5A F4>)
$$ ##END=
$$ 
$$ hash MD5
$$ 78 7A 71 D1 0E 8E CB 64 FB 21 5F 16 62 7D 15 E7
##$RELAX= 
##$RELAX= 
##$RELAX= 
##$RELAX= 
##$RELAX= 
##$RELAX= 
$$ Bruker specific parameters
$$ --------------------------
##$DU= <F:/spectra>
##$EXPNO= 1
##$NAME= <H-F>
##$PROCNO= 1
##$TYPE= <nmr>
##$USER= <she>
##$AMP= (0..31)
100 100 100 100 100 100 100 100 100 100 100 100 100 100 100 100 100 100 
100 100 100 100 100 100 100 100 100 100 100 100 100 100 
##$AQSEQ= 0
##$AQ_mod= 1
##$AUNM= <au_zg>
##$AUTOPOS= <>
##$BF1= 200.13
##$BF2= 200.13
##$BF3= 200.13
##$BF4= 200.13
##$BF5= 200.13
##$BF6= 200.13
##$BF7= 200.13
##$BF8= 200.13
##$BYTORDA= 1
##$CFDGTYP= 0
##$CFRGTYP= 5
##$CHEMSTR= <none>
##$CNST= (0..31)
1 1 145 1 1 1 1 1 1 1 1 1 1 1 1 1 1 1 1 1 1 1 1 1 1 1 1 1 1 1 1 1 
##$CPDPRG= <>
##$CPDPRG1= <>
##$CPDPRG2= <>
##$CPDPRG3= <>
##$CPDPRG4= <mlev>
##$CPDPRG5= <mlev>
##$CPDPRG6= <mlev>
##$CPDPRG7= <mlev>
##$CPDPRG8= <mlev>
##$CPDPRGB= <>
##$CPDPRGT= <>
##$D= (0..31)
0 1.2 0 0 0 0 0 0 0 0.06 0 0.03 0 0 0 0 0.0002 0 0 0 0 0 0 0 0 0 0 0 0 
0 0 0 
##$DATE= 1710245542
##$DBL= (0..7)
120 120 120 120 120 120 120 120 
##$DBP= (0..7)
150 150 150 150 150 150 150 150 
##$DBP07= 0
##$DBPNAM0= <>
##$DBPNAM1= <>
##$DBPNAM2= <>
##$DBPNAM3= <>
##$DBPNAM4= <>
##$DBPNAM5= <>
##$DBPNAM6= <>
##$DBPNAM7= <>
##$DBPOAL= (0..7)
0.5 0.5 0.5 0.5 0.5 0.5 0.5 0.5 
##$DBPOFFS= (0..7)
0 0 0 0 0 0 0 0 
##$DE= 6
##$DECBNUC= <off>
##$DECIM= 32
##$DECNUC= <off>
##$DECSTAT= 4
##$DIGMOD= 1
##$DIGTYP= 9
##$DL= (0..7)
0 120 120 120 120 120 120 120 
##$DP= (0..7)
150 150 150 150 150 150 150 150 
##$DP07= 0
##$DPNAME0= <>
##$DPNAME1= <>
##$DPNAME2= <>
##$DPNAME3= <>
##$DPNAME4= <>
##$DPNAME5= <>
##$DPNAME6= <>
##$DPNAME7= <>
##$DPOAL= (0..7)
0.5 0.5 0.5 0.5 0.5 0.5 0.5 0.5 
##$DPOFFS= (0..7)
0 0 0 0 0 0 0 0 
##$DQDMODE= 0
##$DR= 18
##$DS= 0
##$DSLIST= <SSSSSSSSSSSSSSS>
##$DSPFIRM= 0
$$ [...]
##$SUBNAM2= <"">
##$SUBNAM3= <"">
##$SUBNAM4= <"">
##$SUBNAM5= <"">
##$SUBNAM6= <"">
##$SUBNAM7= <"">
##$SUBNAM8= <"">
##$SUBNAM9= <"">
##$SW= 18.0517328524113
##$SWIBOX= (0..15)
0 0 2 0 0 0 0 0 0 0 0 0 0 0 0 0 
##$SW_h= 3612.71676300578
##$TD= 16384
##$TD0= 1
##$TE= 0
##$TE2= 300
##$TE3= 300
##$TEG= 300
##$TL= (0..7)
0 120 120 120 120 120 120 120 
##$TP= (0..7)
150 150 150 150 150 150 150 150 
##$TP07= 0
##$TPNAME0= <>
##$TPNAME1= <>
##$TPNAME2= <>
##$TPNAME3= <>
##$TPNAME4= <>
##$TPNAME5= <>
##$TPNAME6= <>
##$TPNAME7= <>
##$TPOAL= (0..7)
0.5 0.5 0.5 0.5 0.5 0.5 0.5 0.5 
##$TPOFFS= (0..7)
0 0 0 0 0 0 0 0 
##$TUNHIN= 0
##$TUNHOUT= 0
##$TUNXOUT= 0
##$USERA1= <user>
##$USERA2= <user>
##$USERA3= <user>
##$USERA4= <user>
##$USERA5= <user>
##$V9= 5
##$VALIST= <valist>
##$VCLIST= <CCCCCCCCCCCCCCC>
##$VD= 0
##$VDLIST= <DDDDDDDDDDDDDDD>
##$VPLIST= <PPPPPPPPPPPPPPP>
##$VTLIST= <TTTTTTTTTTTTTTT>
##$WBST= 1024
##$WBSW= 4
##$XGAIN= (0..3)
0 0 0 0 
##$XL= 0
##$YL= 0
##$YMAX_a= 272270
##$YMIN_a= -282315
##$ZGOPTNS= <>
##$ZL1= 120
##$ZL2= 120
##$ZL3= 120
##$ZL4= 120
##$ABSF1= 10
##$ABSF2= 0
##$ABSG= 5
##$ABSL= 3
##$ALPHA= 0
##$AQORDER= 0
##$ASSFAC= 0
##$ASSFACI= 0
##$ASSFACX= 0
##$ASSWID= 0
##$AUNMP= <proc_1d>
##$AZFE= 0.1
##$AZFW= 0.1
##$BCFW= 1
##$BC_mod= 2
##$BYTORDP= 1
##$COROFFS= 0
##$CY= 11.3945322036743
##$DATMOD= 1
##$DC= 2
##$DFILT= <>
##$DTYPP= 0
##$F1P= 15.7292609196834
##$F2P= 12.9074282941183
##$FCOR= 0.5
##$FTSIZE= 0
##$FT_mod= 4
##$GAMMA= 1
##$GB= 0.15
##$INTBC= 1
##$INTSCL= 1
##$ISEN= 128
##$LB= 0.24
##$LEV0= 0
##$LPBIN= 0
##$MAXI= 10000
##$MC2= 0
##$MEAN= 0
##$ME_mod= 0
##$MI= 1.114404
##$NCOEF= 0
##$NC_proc= 0
##$NLEV= 6
##$NOISF1= 3.799351
##$NOISF2= 2.8
##$NSP= 1
##$NTH_PI= 0
##$NZP= 0
##$OFFSET= 15.70392
##$PC= 1
##$PHC0= -25460.9
##$PHC1= 13.58731
##$PH_mod= 1
##$PKNL= yes
##$PPARMOD= 0
##$PSCAL= 0
##$PSIGN= 0
##$REVERSE= no
##$SF= 200.130013532006
##$SI= 16384
##$SIGF1= 3
##$SIGF2= 2
##$SINO= 400
##$SIOLD= 16384
##$SREGLST= <1H.CDCl3>
##$SSB= 0
##$STSI= 0
##$STSR= 0
##$SW_p= 3612.71676300578
##$SYMM= 0
##$S_DEV= 0
##$TDeff= 0
##$TDoff= 0
##$TI= <>
##$TILT= no
##$TM1= 0
##$TM2= 0
##$TOPLEV= 0
##$USERP1= <user>
##$USERP2= <user>
##$USERP3= <user>
##$USERP4= <user>
##$USERP5= <user>
##$WDW= 1
##$XDIM= 8192
##$YMAX_p= 0
##$YMIN_p= 0
$$ End of Bruker specific parameters
$$ ---------------------------------
##NTUPLES= NMR FID
##VAR_NAME=  TIME,          FID/REAL,        FID/IMAG
##SYMBOL=    X,             R,               I
##VAR_TYPE=  INDEPENDENT,   DEPENDENT,       DEPENDENT
##VAR_FORM=  AFFN,          ASDF,            ASDF
##VAR_DIM=   8192,          8192,            8192
##UNITS=     SECONDS,       ARBITRARY UNITS, ARBITRARY UNITS
##FACTOR=    0.0002768,     1,               1
##FIRST=     0,             0,               0
##LAST=      2.2672688,     0,               0
##MIN=       0,             -282315,         0
##MAX=       2.2672688,     272270,          0
$$ Real data points
##PAGE= N=1
##DATA TABLE= (X++(R..R)), XYDATA
0 0 0 0 0 0 0 0 0 0 0 0 0 0 0 0 0 -6 6 -8 8 -8 8 -16 16 -16 22 -24 28 -32 38 -42 49 -56 65 -73 82 -92 103
37 103 -116 129 -145 161 -179 200 -220 244 -270 298 -328 362 -398 438 -483 532 -587 648 -718
56 -718 796 -887 989 -1112 1259 -1437 1658 -1948 2338 -2892 3769 -5339 9099 -39757 -24708
71 -24708 -65159 -255172 -282315 -128694 23732 22805 -16715 36856 168192 198241 76034 -37381
83 -37381 21951 129349 77203 -87838 -119765 9454 84226 -9761 -121533 -105812 -21440
94 -21440 -16584 -96594 -124514 -16888 112027 108624 21493 38959 166750 200397 56542 -87292
106 -87292 -82335 -21801 -56978 -154132 -166010 -58296 43230 34357 -17975 23626 137743 152862
118 152862 21414 -80140 -25061 63258 23901 -80123 -82585 17927 72715 15198 -56112
129 -56112 -34154 37302 27203 -74674 -118255 -21055 85032 57231 -26864 -5562 98538
140 98538 123817 30084 -55207 -42382 2524 -23500 -100481 -110291 -15606 66626 34820 -32486
152 -32486 -337 94645 99439 -3212 -71043 -30635 25530 3135 -54072 -45005 32648 74611
164 74611 23008 -40625 -15602 50815 32098 -65781 -102412 -27073 44273 20441 -30265 -5919
176 -5919 67114 83184 18986 -34885 -9993 35286 4473 -76394 -85653 94 58584 14790
188 14790 -42620 -12231 57604 56049 -14779 -52396 -13018 30562 5685 -47330 -33853 43461
200 43461 76329 16369 -42669 -13345 44891 25390 -51680 -76030 -21365 25001 3834 -32063
212 -32063 -7397 56391 69114 9279 -35555 -1570 46302 16441 -57099 -65944 -998 38265
224 38265 3563 -35340 -10128 41325 38713 -16454 -41921 164 40973 10682 -45870 -34544
236 -34544 34697 59442 6951 -37192 -9969 33919 17383 -38298 -51107 -4660 28279 -571
248 -571 -38652 -12999 49963 58243 -771 -37305 -1214 40581 14899 -41448 -45066 4002 28227
261 28227 -4613 -35114 -7554 40898 34830 -19991 -40171 5174 43450 12837 -38482 -30321
273 -30321 23036 39172 -1913 -31930 -5219 31588 15919 -32217 -38653 8473 36586 1506
285 1506 -40254 -19110 35863 42037 -6247 -32142 248 33640 12274 -31202 -29280 14013 29142
298 29142 -9251 -40186 -11098 36749 30373 -19435 -34697 6708 38065 11464 -29158 -20866
310 -20866 19811 26292 -11963 -33605 -2325 34369 17803 -27768 -31114 13727 37130 3228
322 3228 -34708 -19336 22277 24329 -13373 -28113 4944 33900 12133 -26675 -20795 21234 32153
335 32153 -8379 -39941 -15319 26330 21892 -17506 -26769 9265 33378 7881 -26310 -15038
347 -15038 21998 22675 -17813 -37292 -3662 33675 20345 -19586 -22244 15574 33041 1790 -30730
360 -30730 -16665 16643 12822 -22507 -30163 7486 36658 15517 -20628 -14935 22425 30968 -5793
373 -5793 -34474 -15368 17262 11244 -20392 -21970 13859 32976 5776 -25295 -12401 21972 21157
386 21157 -16497 -34789 -5873 27319 17861 -13460 -13227 18916 29306 -2952 -30925 -14684 15499
399 15499 8119 -26193 -31501 5995 35631 19188 -12266 -8637 21966 26701 -7623 -32040 -12824
412 -12824 14759 4509 -25281 -21991 15640 34180 8470 -21042 -11450 18219 18521 -13862 -30227
425 -30227 -5350 22729 12922 -13359 -8133 22917 28836 -4245 -30457 -15819 11229 6165 -23057
438 -23057 -29057 2460 29875 18256 -7092 -2104 24068 23575 -10349 -30261 -10090 14149 3306
451 3306 -23920 -21664 11468 30061 9780 -16808 -10223 14730 13308 -15997 -26936 -240 23800
464 23800 10797 -12885 -4907 24549 29129 -1702 -27642 -17831 4941 987 -24264 -27980 2166
477 2166 25704 13308 -6643 4244 29677 26072 -6784 -25070 -8449 12005 3057 -21275 -22171
490 -22171 4885 20761 3097 -18114 -8294 14470 9956 -16456 -21379 5745 26844 15051 -5891
503 -5891 -1474 21760 25923 -1114 -26065 -19383 -1037 -7488 -30363 -28475 3310 23447 10786
516 10786 -4423 8751 32585 30399 1472 -17515 -6387 10027 389 -23243 -23028 2264 13173
529 13173 -6087 -21705 -6602 15545 10345 -12534 -16200 7504 26929 17977 -1547 404 19812
542 19812 21135 -5326 -25599 -15926 -1028 -11400 -31864 -26280 3345 21223 11547 -958 8957
555 8957 29342 28529 3281 -13754 -3803 8398 -4458 -25560 -20724 3781 11024 -6962 -18994
568 -18994 -4860 14941 12162 -7572 -13139 5934 22620 13237 -4670 -302 18354 16471 -9044
581 -9044 -23790 -11228 2563 -6684 -24663 -21389 3045 19524 11391 -1634 5959 23821 21065
594 21065 -2800 -14626 -1544 8652 -5032 -22611 -16346 5563 12873 -1489 -13369 -3709 13065
607 13065 10619 -7895 -12713 4586 16598 4687 -9719 -1362 16540 14464 -6586 -17779 -6652
620 -6652 6210 -356 -16797 -16288 3508 15689 5146 -6466 3180 19306 13641 -7850 -14518
633 -14518 -76 9814 -1402 -16371 -11927 6745 13772 467 -10726 -1509 12661 6504 -11633
646 -11633 -12899 4676 13058 471 -11299 -2624 13907 14015 -2729 -12837 -3484 8003 1313
659 1313 -14137 -12771 4809 11888 -827 -9896 1246 15861 10869 -6626 -11899 627 10360
672 10360 1961 -11665 -8671 7354 11408 -2533 -11375 -360 11496 3519 -12643 -12223 4068
685 4068 11920 1535 -9357 -2887 12133 12882 -2122 -10302 -138 9344 164 -14420 -10943 5600
699 5600 9858 -2801 -11096 -1227 12518 10044 -4524 -9479 1764 10676 2142 -10381 -6161 8309
713 8309 9243 -5103 -11890 -748 10235 3974 -9797 -10501 2946 10737 2208 -8086 -2723 10270
727 10270 9617 -4438 -9759 1539 9806 557 -12382 -9287 5003 9373 -1337 -9732 -2230 10102
741 10102 8128 -4874 -8101 3610 10392 200 -11051 -5376 8090 8179 -4948 -11163 -1321 9403
755 9403 5153 -7010 -7901 4094 10028 248 -9026 -2297 9534 6810 -6680 -9993 1421 9533
769 9533 2142 -9185 -7329 4779 8852 -978 -8550 -1306 9133 5508 -6620 -7566 4234 9699
783 9699 -100 -10180 -5579 6237 7298 -3628 -9418 -851 8810 4606 -6101 -5428 5987 9450
797 9450 -1422 -9826 -2977 7826 5447 -6464 -9671 539 8798 3061 -6867 -4897 6056 8095
811 8095 -2406 -8666 -556 8787 4097 -7280 -7609 3534 9092 923 -8286 -4788 5440 6084 -3846
826 -3846 -8086 553 8526 3116 -6621 -4661 6176 8641 -1561 -9334 -3653 5879 4502 -5257 -7714
841 -7714 1629 8402 2575 -5887 -2785 7041 7062 -3714 -9253 -1557 6924 3011 -6780 -7051 2966
856 2966 8234 1093 -6520 -2426 6517 5286 -4532 -7443 1561 8285 2322 -6837 -5040 4948 7278
871 7278 -1631 -8488 -3211 5064 3234 -5349 -5936 3378 8581 1974 -5612 -1969 6980 6530 -3526
886 -3526 -8771 -2175 5203 1994 -6151 -5552 3508 7110 103 -5858 -1026 6788 4666 -4839 -7219
901 -7219 1062 7341 2240 -5849 -4072 4499 6116 -1888 -7014 -1589 5162 2087 -6018 -5643 3588
916 3588 8104 1607 -5565 -2129 6108 5750 -3172 -7403 -1193 4807 999 -5975 -4157 4334 6752
931 6752 -549 -6038 -1154 6278 4257 -4494 -6664 855 6163 1609 -4862 -2536 4824 5097 -2490
946 -2490 -6513 -1066 4989 1657 -5953 -5669 2860 7204 1525 -4469 -1124 5776 4702 -3041 -5734
961 -5734 26 4540 196 -6401 -4417 3810 5923 -1055 -5989 -1308 5605 3741 -3613 -4584 2199
976 2199 6045 1053 -4415 -1596 4913 4355 -3315 -7255 -1816 4097 1037 -5744 -4950 2908 6292 1235
992 1235 -3084 616 6169 4331 -3007 -5179 322 4312 -171 -6664 -4887 2543 4471 -1567 -5167
1007 -5167 -399 5146 3061 -2849 -2846 3372 6054 985 -4498 -1932 4317 3685 -3707 -7056 -1810 3304
1023 3304 294 -5068 -3300 3510 5607 689 -2821 1073 6265 4120 -3273 -5357 212 4065 -460
1038 -460 -6172 -3973 2603 3432 -1813 -4118 587 5200 2665 -2975 -2916 3110 5726 464 -4824 -2175
1054 -2175 3541 2771 -3366 -5413 -561 3386 412 -3962 -2221 3822 5350 207 -3581 -182 5007
1069 5007 3089 -3576 -5081 160 3355 -563 -4698 -2269 3223 3580 -1339 -3629 714 5090 2445
1084 2445 -3346 -3544 2214 4583 -240 -4498 -1737 3078 2135 -3027 -4095 566 3807 830 -3647
1099 -3647 -2220 3547 4850 -386 -3968 -647 3887 1953 -3285 -3740 979 3185 -369 -3763 -1454
1114 -1454 3424 3451 -1613 -4089 8 4064 1598 -3417 -3010 2069 3629 -342 -3285 -487 3480 2240
1130 2240 -2546 -3624 737 3855 696 -3883 -2515 2665 3502 -1169 -3690 -242 3339 1361 -2798
1145 -2798 -2530 1947 3861 185 -3492 -1364 3276 2948 -2164 -4178 -284 2988 490 -3290 -2128
1160 -2128 2346 3338 -344 -2838 -27 3669 2438 -2396 -3565 631 3307 190 -3567 -1965 2268
1175 2268 2459 -1399 -2897 297 3283 1420 -2477 -2351 1959 3709 66 -3430 -1380 2685 1993 -2316
1191 -2316 -3341 215 2684 344 -2857 -1388 2689 3408 -336 -2899 -290 3309 1875 -2673 -3216
1206 -3216 606 2511 -457 -3172 -1202 2512 2372 -1222 -2646 558 3460 1461 -2528 -2421 1629
1221 1629 2966 -470 -3081 -944 2340 1450 -2030 -2507 732 2782 513 -2575 -1560 2336 3014 -693
1237 -693 -2993 -391 2565 1030 -2429 -2325 1057 2362 -278 -2511 -668 2674 2522 -1188 -2720 241
1253 241 2819 786 -2766 -2189 1316 2114 -813 -2513 -98 2732 1755 -1521 -2039 1084 3024 467
1269 467 -2717 -1702 1734 1866 -1405 -2776 -217 2129 741 -2077 -1614 1607 2789 222 -2210 -593
1285 -593 2541 2044 -1474 -2622 81 1982 -84 -2705 -1688 1365 1838 -729 -2098 250 2994 1945
1301 1945 -1354 -1786 1129 2509 -83 -2719 -1472 1277 957 -1801 -2468 161 2332 933 -1681 -1128
1317 -1128 2002 2888 139 -2238 -507 2058 1139 -1820 -2375 182 1631 -331 -2485 -1261 1648 2092
1333 2092 -515 -1886 322 2794 1653 -1224 -1467 1037 1863 -520 -2507 -1250 1179 876 -1662 -2258
1349 -2258 361 2502 1195 -1408 -834 1797 2329 -270 -1994 -463 1523 611 -1920 -2071 475 1799
1365 1799 17 -2081 -1048 1719 1953 -653 -1843 247 2164 944 -1381 -1178 1185 1692 -594 -2260
1381 -2260 -906 1444 977 -1469 -2046 386 2238 791 -1240 -641 1576 1728 -587 -1857 -316 1463
1397 1463 637 -1631 -1667 670 1959 214 -1709 -795 1401 1315 -888 -1703 151 1705 512 -1360 -858
1414 -858 1404 1927 -220 -1842 -611 1317 809 -1433 -1828 234 1557 255 -1316 -503 1576 1593 -613
1431 -613 -1693 -79 1645 760 -1400 -1402 786 1704 48 -1583 -645 1092 840 -1185 -1747 118 1645
1448 1645 570 -1175 -658 1371 1943 -13 -1447 -556 1010 375 -1525 -1783 120 1389 136 -1264
1464 -1264 -375 1722 1693 -264 -1298 -13 1418 620 -1277 -1334 562 1265 -201 -1574 -585 1131 817
1481 817 -1067 -1509 284 1688 708 -859 -465 1268 1603 -101 -1394 -538 711 18 -1723 -1765 170
1498 170 1259 243 -955 -140 1622 1754 -35 -1073 -9 1084 208 -1350 -1342 361 943 -394 -1433
1515 -1433 -429 1180 910 -729 -1160 345 1391 641 -803 -315 1127 1243 -324 -1356 -402 754
1531 754 70 -1524 -1513 245 1187 281 -704 -9 1478 1374 -242 -949 18 896 -52 -1533 -1146 458
1549 458 1009 -261 -1069 -99 1186 853 -570 -914 258 1042 198 -962 -419 968 1055 -392 -1116 -129
1567 -129 852 231 -1168 -1092 301 992 163 -753 -3 1234 989 -401 -945 99 862 -94 -1303 -968
1585 -968 520 893 -105 -795 70 1155 718 -583 -884 215 850 -118 -1094 -408 942 908 -264 -755
1603 -755 121 963 254 -947 -912 273 675 -161 -958 -122 1050 806 -466 -786 225 844 27 -942 -655
1622 -655 460 757 -139 -702 139 956 435 -783 -899 194 650 -303 -1070 -353 884 1009 -28 -435
1640 -435 359 1049 304 -913 -814 217 399 -574 -1093 -244 894 670 -429 -576 382 950 132 -728 -485
1659 -485 569 661 -321 -701 98 888 320 -790 -828 160 501 -325 -999 -242 780 844 -32 -319 509 1071
1679 1071 279 -842 -708 216 358 -594 -1048 -280 696 627 -266 -419 443 875 86 -710 -404 574 591 -408
1699 -408 -745 134 868 331 -623 -638 148 435 -316 -907 -330 678 614 -175 -367 554 1048 265 -686 -569
1719 -569 243 286 -482 -888 -200 600 420 -332 -321 502 808 -30 -800 -317 454 460 -342 -616 176 788 334
1740 334 -464 -446 229 414 -355 -916 -296 580 439 -305 -339 474 926 293 -465 -358 267 318 -403 -807 -176
1761 -176 564 262 -389 -353 454 707 -31 -694 -301 421 380 -224 -456 254 858 342 -400 -381 345 387 -411
1782 -411 -970 -390 346 205 -347 -257 406 853 355 -305 -88 519 421 -412 -720 -100 522 187 -520 -397 252
1803 252 509 -59 -642 -234 417 331 -264 -371 356 815 369 -234 -185 381 332 -427 -825 -440 208 78 -466
1824 -466 -380 382 799 274 -248 -2 556 409 -382 -674 -71 440 125 -404 -383 235 459 -155 -530 -144 408
1845 408 262 -350 -362 398 741 304 -250 -167 440 302 -304 -692 -344 171 57 -447 -329 369 715 193 -268
1866 -268 -35 509 292 -369 -603 -41 304 -17 -431 -255 326 451 -155 -490 -107 401 224 -353 -331 252
1886 252 568 235 -308 -114 380 305 -301 -662 -189 229 -9 -482 -286 357 627 93 -192 35 454 305
1906 305 -304 -513 -71 301 -19 -479 -225 322 385 -129 -368 -41 380 204 -279 -344 230 498 118 -222 -6
1927 -6 363 252 -312 -528 -108 291 -25 -446 -263 304 464 131 -215 101 488 251 -237 -406 88 238 -91
1948 -91 -431 -232 247 309 -142 -382 -24 356 247 -299 -293 213 388 70 -319 -55 402 286 -257 -447 -43
1969 -43 219 10 -413 -275 271 420 6 -221 98 471 308 -218 -332 55 203 -148 -533 -266 256 280 -137
1990 -137 -308 122 425 171 -235 -172 185 379 -62 -367 -76 279 209 -308 -421 4 257 16 -417 -210 278
2011 278 386 9 -205 194 527 279 -254 -341 61 164 -213 -501 -292 144 190 -125 -146 227 523 274 -208
2032 -208 -207 222 291 -151 -451 -168 272 103 -254 -301 119 282 -52 -369 -148 340 338 -119 -241 130 492 264
2054 264 -254 -206 70 205 -241 -507 -145 195 164 -190 -180 230 519 187 -241 -172 174 234 -165 -443 -94 286
2076 286 158 -219 -224 212 327 -25 -371 -177 185 224 -228 -340 115 405 151 -118 -134 245 279 -169 -439 -154
2098 -154 197 151 -245 -278 225 436 169 -252 -143 173 151 -167 -361 -34 327 193 -225 -103 267 399 -52
2119 -52 -411 -259 73 88 -311 -359 73 377 182 -123 12 273 338 -80 -432 -205 208 96 -219 -290 77 358
2141 358 69 -292 -139 225 140 -203 -348 3 321 243 -112 -128 205 391 -41 -369 -253 39 -92 -339 -338 44
2163 44 380 196 -60 13 387 339 -29 -307 -145 158 -23 -334 -227 72 274 32 -256 -75 254 169 -206
2184 -206 -316 10 381 233 -131 -75 279 303 -36 -288 -151 81 -50 -378 -396 19 355 121 -113 -18 290
2205 290 306 -105 -250 -72 118 -21 -312 -181 174 304 -11 -244 -100 259 162 -225 -344 21 331 83 -130
2226 -130 -11 372 329 -40 -241 -35 121 -32 -319 -365 -9 285 37 -149 54 321 213 -139 -236 -66 127
2247 127 -31 -380 -182 119 311 68 -208 -32 246 140 -242 -281 -38 182 28 -183 -22 307 344 56 -206
2268 -206 -36 162 4 -302 -262 80 309 39 -147 -2 324 199 -163 -296 -46 161 1 -277 -176 276
2288 276 360 42 -111 27 263 61 -285 -308 -3 191 -8 -163 -127 302 383 38 -158 13 209 -30 -232
2309 -232 -177 72 221 26 -210 -97 230 173 -174 -295 -65 198 27 -237 -90 250 263 7 -125 31 178
2330 178 102 -303 -327 -66 162 -12 -240 -58 276 306 34 -103 44 288 63 -237 -211 40 167 -56 -208
2351 -208 -82 236 202 -106 -213 11 204 27 -162 -114 198 237 13 -177 -13 164 105 -287 -313 -85 130 -53
2373 -53 -191 -79 292 215 -52 -124 73 265 59 -280 -261 60 197 -43 -241 -66 198 154 -149 -174 60 137
2395 137 10 -168 -117 176 209 -1 -251 -83 143 38 -235 -229 -15 142 -47 -169 -49 231 222 -2 -177 -13
2417 -13 219 58 -192 -216 31 210 -44 -188 34 134 167 -117 -170 84 229 92 -177 -80 182 233 -64 -167
2439 -167 -36 136 -17 -213 -125 61 158 -2 -170 -47 188 177 -41 -183 -16 182 66 -176 -196 109 100 -83
2461 -83 -217 -129 180 97 -67 -145 61 226 100 -138 -77 99 150 -53 -246 -62 147 73 -195 -139 126 248 67
2484 67 -118 -59 161 129 -75 -187 -35 167 -34 -202 -154 69 75 -72 -213 -39 187 118 -32 -94 73 254 74
2507 74 -145 -13 78 45 -171 -203 -92 167 84 -145 -96 130 288 74 -66 -10 147 160 -112 -209 13 172 -14
2530 -14 -206 -152 57 147 -46 -225 -39 96 108 -64 -80 77 276 93 -165 -124 121 69 -168 -275 -69 149
2552 149 126 -54 -61 153 223 34 -129 -54 153 13 -125 -200 36 171 42 -93 -82 112 155 -100 -164 -91 122
2575 122 -7 -185 -134 84 200 38 -158 -85 100 133 -72 -202 -78 117 111 -124 -51 154 162 14 -223 -81 149
2598 149 51 -100 -190 33 179 106 -70 -32 110 120 -114 -221 -72 73 15 -180 -155 131 253 78 -107 -14 154
2621 154 82 -81 -219 -32 143 6 -164 -90 101 125 -43 -192 -96 135 117 -120 -91 61 202 90 -82 37
2643 37 162 123 -143 -274 -76 75 -4 -246 -105 106 237 107 -103 32 153 107 -111 -184 -54 107 -58 -196
2665 -196 -149 115 183 -27 -183 -15 96 58 -106 -103 101 222 43 -105 -61 166 141 -108 -258 -120 85 40 -105
2688 -105 -89 112 214 80 -39 -28 139 141 -131 -238 -41 134 83 -178 -131 138 207 -11 -150 -58 126 34 -138
2711 -138 -143 79 184 54 -176 -48 173 153 -144 -234 -104 81 62 -94 -96 121 238 142 -118 -83 175 107 -160
2734 -160 -234 -57 145 21 -91 -104 110 151 0 -153 -17 168 74 -157 -235 17 219 24 -121 -60 56 84
2756 84 -71 -173 -41 94 89 -117 -85 160 297 60 -141 -73 106 90 -111 -226 -71 120 42 -98 -89 112 185
2779 185 2 -146 -98 147 85 -121 -209 6 125 87 -129 -53 118 138 -94 -193 -93 145 56 -113 -88 103 183
2802 183 43 -128 -103 103 81 -97 -214 23 80 63 -150 -70 148 210 5 -153 -29 142 66 -92 -213 15
2824 15 148 28 -110 -94 107 112 -58 -163 -25 181 70 -82 -68 40 156 -57 -54 -68 126 88 -124 -150 39
2847 39 167 109 -112 -21 135 146 27 -108 -44 106 96 -46 -102 3 156 -7 -158 -124 85 120 -75 -142 -28
2870 -28 123 150 -66 -101 42 107 -18 -135 -38 143 96 -107 -116 -16 164 -7 -66 -40 97 89 -13 -81 -53 113 54
2895 54 -113 -144 83 157 43 -172 -108 112 63 -23 -113 -23 125 24 -112 -100 43 137 46 -181 -23 135 74 -35
2919 -35 -168 22 115 -22 -62 -38 92 95 22 -90 -27 85 114 -85 -109 38 134 -20 -169 -85 74 92 -58 -86 13
2944 13 139 96 -64 -130 -3 110 -49 -127 -72 52 17 -93 -85 32 59 54 -174 -45 63 102 21 -167 -13 136
2968 136 86 -29 -120 17 72 -45 -86 -18 70 131 -21 -102 92 186 124 -89 -122 42 64 11 -111 -63 49 86 -68
2993 -68 -65 79 195 9 -172 -99 41 85 -52 -94 -39 94 65 -76 -70 -5 114 -6 -125 -12 128 133 -26 -96 28
3018 28 169 31 -117 -96 82 42 -70 -101 0 152 109 -44 -59 11 107 80 -148 -65 32 57 -40 -74 -16 96 52
3043 52 -78 -63 55 81 29 -181 -92 113 161 -55 -43 71 121 48 -87 -59 47 100 -88 -93 -17 110 99 -72 -43
3068 -43 67 138 25 -87 -84 98 126 -45 -65 53 178 73 -103 -141 47 137 -10 -125 -91 75 63 -42 -6 14
3092 14 168 27 -107 -74 75 99 -46 -179 -21 132 126 -35 -47 26 59 47 -96 -57 110 129 -88 -124 -45 110
3116 110 48 -110 -124 50 -1 -9 -118 10 108 70 -60 -73 58 190 30 -120 -84 57 75 -62 -123 -22 97 47
3140 47 -63 4 65 124 27 -168 -69 140 155 -43 -85 -31 40 26 -100 -96 -19 96 -44 -155 12 103 168 -77 -68 32
3166 32 101 -18 -94 -113 46 44 -90 -94 -12 123 49 -89 -73 82 145 -23 -84 -74 93 86 -31 -61 -38 118 74 -119
3192 -119 -42 52 114 2 -112 -15 159 131 -86 -71 36 65 -33 -95 -118 11 81 -87 -102 -15 128 64 -90 -36 63
3217 63 111 15 -115 -71 82 105 -59 -101 82 156 68 -122 -24 58 158 -23 -79 18 148 105 -29 -56 42 138 0
3242 0 -117 -86 54 84 -84 -152 4 112 100 -68 -55 71 57 -23 -86 -70 74 43 -77 -97 -8 76 -2 -104 -49 59
3268 59 69 -21 -125 11 114 72 -43 -71 61 107 -32 -140 -103 107 115 -48 -75 -52 74 20 -100 -55 75 118 -23
3293 -23 -151 -69 37 26 -87 -109 5 101 43 -48 -100 58 80 -56 -116 9 137 49 -60 -54 94 144 -8 -89 -40
3318 -40 42 123 -1 -98 -19 123 14 -86 -65 82 82 -46 -155 -56 106 61 -59 -100 19 44 8 -63 -34 101 61
3343 61 -63 -103 -1 94 8 -57 -95 11 44 10 -46 -40 74 45 -23 -55 94 97 46 -103 -73 121 83 -6 -65 -22 64 -24
3371 -24 -87 -93 27 71 -9 -157 -18 96 74 29 -148 -55 51 112 -82 -93 26 50 -27 -113 -5 93 86 -78 -59 33
3397 33 63 72 -45 -54 -13 91 15 -56 22 88 73 -71 -81 48 92 -5 -68 -84 67 92 8 -116 -40 64 10 -48 -41 9
3425 9 97 -49 -88 -54 119 46 -86 -23 19 38 56 -96 -37 75 71 49 -41 -12 97 32 -81 -136 21 69 31 -87 -32
3452 -32 -9 73 -39 -101 0 62 19 -128 -102 52 72 -22 -111 -102 89 55 -38 -39 -35 49 -23 -83 -53 67 84 -53 -56 -8 117
3481 117 -8 -92 -56 4 23 52 -61 25 39 82 -36 -123 -29 125 2 -98 -88 6 54 75 -66 -55 55 38 7 -64
3507 -64 26 63 -46 -25 -18 86 65 -60 -85 5 68 -2 -47 -23 42 51 15 -51 18 139 101 -18 -82 27 50 -4 -112 -88
3535 -88 -3 32 -30 -86 -30 41 -18 -46 -94 28 58 15 -36 -33 68 22 -28 -32 53 49 -13 -115 -22 49 75 18 -40 22 67 70 2
3566 2 -69 34 62 87 -51 -1 -1 78 10 -51 35 64 126 -79 -111 6 51 21 -108 -66 17 50 -45 -37 27 -10 -18 -60 -66 41
3596 41 86 25 -45 8 43 42 -10 8 7 27 7 -67 -46 73 34 -36 -86 -27 58 32 -1 -65 -14 48 -45 -41 -16 -5 46 -38 -63
3627 -63 7 83 -9 -90 -74 -36 77 -44 -31 15 128 74 -21 -13 50 133 23 -52 -30 18 28 30 -44 33 39 59 -19 -22 24 34
3657 34 14 -48 -16 64 39 -104 -103 -62 26 -3 -52 -70 52 100 -21 -107 -49 16 79 -19 -73 -26 39 -12 -45 -8 -4 83 -2 -27
3687 -27 11 50 38 20 -35 21 72 -19 -50 -40 66 92 26 -23 39 70 9 34 4 77 -22 -16 -79 -5 44 1 -25 -145 -26
3716 -26 45 -4 -60 -62 17 38 -7 -50 48 34 57 -26 -32 25 80 30 -18 -19 83 50 -20 -22 38 49 -14 -72 -50 35 65 -10 -72 -40
3748 -40 16 19 -45 -32 -40 14 23 -82 -12 40 55 -4 8 20 63 66 -75 -85 -6 55 60 -46 2 62 59 -30 -68 24 62 27 -46 -43
3780 -43 40 20 2 0 -4 51 56 -21 -71 43 56 -35 -3 -4 12 60 -35 0 21 33 61 -50 -80 6 31 -35 2 -21 22 19 -2 -65
3812 -65 -14 79 7 5 -13 -12 15 28 -36 48 57 78 -9 -32 59 39 -19 -101 -8 56 70 -41 -41 -13 -2 -29 -67 -77 -22 32 -35 -66
3844 -66 -42 6 34 -57 -57 1 36 -6 -30 -2 66 22 16 -6 23 108 36 -31 -15 -38 71 13 -38 -22 49 72 11 -50 -10 35 -11
3875 -11 -51 -46 -34 33 -25 -65 27 21 59 -33 -18 2 58 -7 -41 27 65 97 -27 -59 45 26 27 -28 22 40 35 41 35 -15 20 20 7
3908 7 -49 58 16 52 23 -25 10 40 -51 -53 9 16 29 4 -19 104 52 -47 -34 -15 2 23 -38 -20 -31 1 116 -4 -35 21
3938 21 -2 -22 13 18 50 -8 -1 -5 -3 37 21 -24 -35 68 56 -22 -10 9 -9 5 0 -72 18 55 -52 -30 -49 -53 50 42 -28 -5
3970 -5 107 6 -13 -37 31 -38 -73 -30 25 63 41 35 -8 20 31 24 4 35 24 30 -38 -16 33 52 26 -22 -50 -49 80 9 -57
4001 -57 -37 8 0 -12 -106 40 17 -25 -37 -28 1 17 43 -36 17 58 -35 -36 17 6 10 20 12 -5 -14 21 -34 1 33 59 0 31 22
4034 22 18 28 -14 -28 -16 -7 -4 -42 9 7 21 -8 54 22 47 71 14 -53 -38 22 3 -27 7 -3 69 -72 1 -38 18 100 27 11
4066 11 -8 4 28 26 -53 -10 16 -32 -32 30 2 -42 -20 -4 -99 78 -3 -11 -2 34 14 44 -21 23 4 15 13 -34 20 -4 -20 -2
4098 -2 -51 -23 53 -60 10 -48 89 -12 26 -20 56 17 33 -20 18 11 -36 -19 -62 23 11 -53 -22 16 13 16 -25 25 11 44 -17
4129 -17 -21 12 -20 7 26 -36 -41 -43 -10 -13 -18 -18 11 -23 -27 -41 -16 -25 -28 -33 23 22 19 41 -44 55 52 21 39 -12 64 49 41 -49 -7 57 34
4166 34 -15 -62 -28 4 26 -54 16 41 -14 -12 5 6 -9 -23 -23 -24 -17 -5 36 24 -69 19 39 22 20 44 51 -16 -20 -1 1 48 18 -40 -51
4201 -51 -13 56 -35 13 41 9 -7 -39 -19 -17 -14 -23 -61 -15 -22 54 9 7 43 -21 44 9 -40 35 -3 -21 7 9 39 45 -3 -28 0 57
4235 57 -20 49 83 5 14 -19 -29 3 35 26 -32 -2 5 -11 3 -43 9 -13 15 -36 26 16 -17 6 36 -16 -35 14 52 -52 -24
4266 -24 15 -1 34 83 15 13 0 -14 -40 23 20 31 5 5 -2 18 31 -13 10 15 -24 73 -11 30 17 18 9 37 -11 0 16 -3 8 -24
4300 -24 -8 -45 -51 18 5 2 15 -1 -3 69 -41 -25 -66 45 -32 3 20 2 45 22 50 -1 -48 9 -12 2 -15 5 37 -23 7
4331 7 28 -2 24 -4 -29 5 12 -8 8 -4 53 -28 -37 51 3 -6 -69 -34 -18 -1 44 -68 24 45 16 -2 -23 22 43 39 -3 -2 10
4364 10 50 22 33 35 21 -22 31 -18 -10 -8 1 2 14 -5 17 -26 -7 -26 -10 -13 -22 -35 -12 -15 0 6 3 -1 16 29 -2 18 20 -9 42 -5
4400 -5 -18 -24 31 23 53 2 45 23 56 -3 3 37 -33 19 6 -15 -8 -17 -61 -4 -14 -8 -31 35 56 23 5 3 5 24 -41 45 -19 26 11
4435 11 -36 -19 -1 29 -7 -14 12 29 69 3 22 26 41 41 -15 -8 32 -9 6 -36 -13 -15 -22 11 -48 -18 -3 -13 23 -29 -13 19 -5
4468 -5 16 -47 -17 27 -22 -24 25 40 -15 -7 12 13 92 3 22 23 1 21 -36 -34 19 -4 6 -24 -5 66 54 20 -20 3 -10 -11 -24 -14
4502 -14 -24 -27 -17 -81 -15 -27 31 13 -55 -60 -6 34 -2 -10 38 13 8 35 -12 -28 -30 -21 -40 2 91 -12 6 7 -1 -11 33 -11 -27 1
4536 1 16 27 -3 42 21 9 -23 8 -26 -14 12 -16 -18 -18 9 12 -37 18 26 23 9 -4 -19 18 -15 -10 3 34 34 -44 -56 41 -17 11
4570 11 6 -11 -14 21 13 -6 36 10 21 30 15 -21 52 -6 -16 -23 -32 -28 -4 -46 6 40 -42 -58 7 43 -18 -15 27 25 40 2 -55 4 -7
4605 -7 16 26 0 -9 38 1 40 -29 30 13 50 -39 -8 27 20 2 -60 46 -11 6 -48 -12 -18 1 -26 -25 33 -9 -16 -21 -14 26 61 31
4639 31 -38 -4 17 10 -17 -10 41 3 27 -14 -6 27 34 49 42 11 33 68 -16 -32 6 7 11 -8 16 52 53 36 -63 31 65 -9 -22 -3
4673 -3 12 27 3 -8 -13 11 -19 -27 -21 -37 12 -3 -13 -24 -38 62 -13 -67 -31 34 18 54 -22 49 43 31 39 29 15 -10 -1 28 10
4706 10 41 -20 -45 -69 -32 47 -45 -50 -5 24 -3 -27 -50 5 -3 27 -15 9 -6 24 67 -37 26 49 -16 11 -11 0 4 -5 30 0
4738 0 5 27 2 -31 71 12 16 -6 2 26 38 28 -37 -26 28 3 -45 1 4 -16 -16 -63 30 30 36 38 9 16 10 5 -53 -18 -21 37 21 -11
4774 -11 -9 53 36 6 -49 -10 -19 87 23 -7 10 9 31 -57 -19 -2 17 -59 -17 -41 9 29 -10 -15 -5 4 -33 -88 -35 -65 0 -61
4806 -61 47 -4 5 -9 9 -3 -13 4 -40 -2 -4 65 38 17 -21 -8 53 -19 -30 -40 26 29 -15 -36 6 52 -21 -1 28 -31 -33 -1
4838 -1 -20 11 -33 15 -8 -30 -20 26 -6 38 14 -46 -1 -13 -33 60 4 65 8 -36 40 9 -28 42 -7 20 51 6 0 29 8
4869 8 18 -18 5 30 -6 38 12 -4 43 39 -40 -53 30 -17 8 -14 17 -50 16 -12 -22 -34 19 6 -15 -17 10 40 68 -2 1 48
4901 48 33 15 31 38 -3 76 -1 -35 -43 87 46 -42 -2 70 13 -27 -3 50 62 -3 -31 4 24 -12 -29 -32 -36 52 19 -39 -27 -27
4933 -27 26 27 22 7 -44 43 9 17 18 -12 41 -15 28 13 62 8 47 19 72 13 -9 21 27 15 26 28 -21 -25 34 -27 -73 37 29 6
4967 6 -6 34 -12 18 -50 -20 -7 12 -1 -17 -44 25 -8 -5 -28 -30 35 34 23 7 -4 14 4 7 -34 43 73 6 8 -48 -20 30 3
5000 3 -68 23 34 2 -9 -13 -13 -36 -46 3 57 12 -11 -34 12 30 2 -10 -25 30 73 29 -8 -20 27 92 -14 -8 10 58 5 -1
5032 -1 -34 21 95 -18 11 2 10 10 -50 -31 34 17 6 -53 -29 -37 -18 32 19 13 21 23 -13 16 18 -18 27 -50 -30 6 -13 37 14 3
5066 3 101 85 56 15 10 70 43 -58 9 -17 -3 -3 -4 40 -38 -8 -57 -19 -47 25 -10 -17 -11 24 -20 5 3 3 -5 -37 23 -22 55 9
5100 9 -14 -4 -38 24 45 -23 18 10 49 12 -49 11 51 28 37 38 34 -9 33 1 -26 -26 11 1 -81 50 14 21 7 -57 -32 -12 52
5133 52 -16 -62 39 61 -12 -38 -19 -42 23 21 -19 3 0 26 -16 -81 -12 11 8 -32 12 8 -7 0 -14 42 -1 -36 12 -19 -5 40
5165 40 15 -26 18 16 -13 3 -96 33 -3 -17 15 -64 -41 28 -98 -75 -60 29 -7 -50 8 21 56 10 -51 -12 31 17 -17 -48
5195 -48 81 32 22 17 2 69 55 -45 -30 51 39 11 5 8 42 8 -4 -15 11 0 74 -5 -57 8 29 11 -26 -44 28 25 4
5226 4 -58 46 33 61 45 -22 13 28 15 1 16 13 39 -42 -7 42 11 12 20 -15 -23 -10 77 -81 -29 -3 7 0 -6 -16 -12 -35 45
5259 45 -30 35 -12 27 -37 -3 36 -27 -20 11 -17 -36 -43 -5 28 2 31 17 -4 -30 4 -45 17 27 32 41 -18 -9 11 57 87 -6 -2
5292 -2 -62 32 -41 -27 4 -12 35 -75 -67 -76 11 9 -37 -15 7 6 2 -16 57 19 34 87 -43 45 59 -21 -50 14 71 -1 -3 -7 35
5325 35 -14 27 24 -59 9 -8 11 -18 38 11 50 -36 -38 -33 50 -4 -4 -39 -15 -6 -5 -60 -60 -12 -9 -53 -52 9 -43 -5 -5 54 39 42 -5 -36
5361 -36 12 29 44 -46 -49 31 27 -9 3 -27 75 -16 28 -30 -45 10 70 5 -25 -39 14 14 -16 -19 4 18 19 -24 14 -23 -6 -85
5393 -85 -3 13 -42 55 -15 48 12 7 21 -9 -17 -7 -21 -38 18 55 -32 -6 -71 20 3 15 -26 19 11 13 -18 -29 52 -13 -52 -18
5425 -18 -31 34 -3 -46 -40 -3 -2 -33 1 -48 -47 18 39 -3 -15 -20 -4 0 16 11 57 21 18 -1 67 53 -11 15 15 39 1 -7 -30 17 37
5460 37 -35 0 -61 -18 -18 -2 -21 -47 8 26 -19 -16 28 -30 -16 -1 -13 -21 -39 -4 16 0 5 1 11 -10 39 14 43 51 34 -13 39
5493 39 23 11 22 -15 -1 7 17 -23 -10 -10 46 29 8 28 10 -44 6 -11 -31 -8 20 -25 6 5 -54 -9 62 24 -3 -54 19 20
5525 20 13 33 -66 49 56 6 -13 15 -14 -14 20 4 15 20 9 15 -32 -3 11 3 -23 -22 -11 46 -56 -48 -26 43 10 -15 -7 49 -3 7
5559 7 32 14 36 -7 -75 -14 3 -33 48 -46 13 8 45 57 2 39 65 10 11 -7 73 33 13 -25 44 49 66 -28 -21 33 -27 -40 -40
5592 -40 -23 11 48 -53 -21 16 -4 14 23 -33 35 -27 20 -14 -21 5 -6 -38 -12 54 9 6 -45 63 -12 39 8 -30 -22 9 -52
5623 -52 -28 -8 57 14 2 -44 -39 25 -25 -43 17 20 11 -7 -29 -69 -37 -2 -1 -24 -2 -20 -51 33 -19 -35 14 -66 -19 -5 46 27
5655 27 15 14 33 56 0 1 0 -9 47 59 -9 14 24 40 -2 8 1 12 73 21 -2 31 -10 10 -28 -12 -16 -9 33 -73 -2 12 2
5688 2 -24 -51 18 -18 -11 -10 -4 60 13 26 -29 -30 39 -10 -9 42 27 -45 -10 12 10 -31 47 -6 -2 -9 3 -20 -55 23 -13 -16 -71 -16 -47
5723 -47 -12 -53 -36 -65 32 -12 21 -11 -13 -4 26 -16 91 8 17 19 -25 -23 -33 -29 -18 -59 -36 4 34 -25 43 32 5 24 -16 47 -20
5756 -20 -14 -79 -23 17 -11 14 -57 41 -22 13 15 -76 38 -69 1 43 -17 50 16 72 -64 11 6 17 -7 -1 45 8 -5 -25 30
5787 30 55 44 -8 -34 52 49 48 29 15 -42 51 -17 6 28 -36 18 -44 -11 -14 -17 -13 -1 -31 34 6 -23 5 14 83 -5 56 -19 8
5820 8 39 -11 -5 5 -4 38 -7 -37 10 16 7 30 -37 -22 25 -4 -36 -8 33 -15 -52 -8 -3 -57 -32 -27 41 34 -44 9 -21 -25 13 27 15
5855 15 -35 -25 -10 -17 -75 -17 55 48 0 1 10 70 49 -1 42 12 10 -35 -29 -65 58 -49 -1 -12 -9 -22 -3 -23 -32 -5 -28 -69 -77 0
5889 0 28 6 -65 -6 -14 30 -26 -77 -61 16 -5 14 -31 -60 7 32 -8 74 68 19 -13 31 11 24 -25 7 0 -15 0 28 -29 -2
5921 -2 38 -12 -35 14 2 35 -20 -15 -55 24 32 -45 23 16 1 -30 -65 -22 15 84 46 9 30 52 66 22 -33 16 -6 81 5 -12
5953 -12 35 24 28 3 40 -24 43 13 -44 -5 27 18 41 66 -13 -6 0 -40 -1 30 -15 -51 -59 40 18 45 -24 25 23 -26 4 -16 -4
5986 -4 -7 -14 -4 -27 2 22 9 1 43 36 8 41 24 -3 20 13 -46 14 46 12 -8 1 9 27 70 20 -10 7 -25 0 -28 8 -61 31
6020 31 51 -54 17 16 -33 -26 21 -17 -18 -21 -6 32 -34 8 14 36 88 15 -16 15 6 39 -11 -17 -43 -19 -9 29 -8 -20 -23 -33 8 -40
6054 -40 20 1 12 -59 11 -1 6 36 -19 28 2 28 2 21 -12 63 39 -51 -21 17 -10 1 -24 40 64 14 34 30 -12 58 -33
6085 -33 -28 -28 20 60 -10 -64 4 15 28 0 -7 2 -51 -5 7 -15 -38 -14 -53 13 -22 38 20 -15 -2 -5 24 -9 -21 -35 -80 50
6117 50 22 32 -26 18 -8 -13 4 -15 -1 -15 -6 16 -45 12 -19 9 -51 -35 -49 -25 -65 38 -19 -37 -11 -12 -30 -84 -15 -38 7
6148 7 -23 -44 -45 49 14 -41 -45 -23 -30 -11 33 14 13 -32 -51 42 32 -13 -20 39 8 6 -19 61 -7 -18 -12 17 29 -6 -29 39 -13 -26
6182 -26 -23 -22 17 9 -35 38 9 -20 2 -22 -18 -23 5 -27 17 10 -31 34 -10 14 7 60 44 -20 11 -22 3 -28 -31 -34 12 -20 -27 -20 -13 -30
6218 -30 -76 29 -47 -14 39 -47 -30 -21 -46 -7 -20 -14 -20 4 -36 46 34 -2 -4 47 24 44 32 5 17 48 18 22 20 -74 -19 28 12
6251 12 -23 -28 22 -7 -29 -36 -11 33 -59 -11 -10 27 21 -24 -6 -44 -12 -6 -47 -48 16 10 -49 14 -23 -49 -27 10 -1 0 -27 20 47 56 -3
6286 -3 0 41 42 -10 -13 15 42 -22 -8 11 18 -43 -25 18 -6 -6 -2 14 -9 11 -55 -75 26 -33 -29 -10 32 -11 -34 -20 -8 -21 -24 -19 -3
6321 -3 21 9 54 25 -7 9 5 19 47 26 -12 46 -4 -6 22 -52 46 6 -15 -1 -1 18 -1 26 -37 -3 13 -43 5 -7 -25 -35
6353 -35 -6 12 2 -1 -74 5 -2 18 -50 -31 39 -40 7 -10 -2 43 3 -11 24 7 57 20 21 48 -35 63 -13 28 13 6 -39 -6 40
6386 40 14 3 51 10 10 -42 3 -43 5 18 -17 -8 2 -4 -26 35 6 -9 -2 -2 54 3 21 18 -18 28 41 5 7 17 0 24 8 -24
6420 -24 10 21 31 -8 -2 -12 -23 -57 -13 -12 -14 -20 37 -40 8 2 -14 73 32 -15 46 -66 81 11 -19 -14 32 -43 -2 -4 45 96 -21
6453 -21 67 22 10 7 13 19 -45 41 -43 44 4 0 15 31 36 -1 56 7 -45 8 28 -8 27 -57 -6 -14 -20 17 13 -6 27 -5 35 25
6487 25 -23 -12 45 8 46 32 3 49 -33 13 14 31 -17 -24 19 -14 -40 37 -8 -20 -21 15 -67 -30 5 26 -6 -13 -1 -27 17 -54
6519 -54 26 -11 -53 7 1 -14 -18 54 -2 -21 -1 -50 -5 48 30 -25 32 2 -15 -4 -5 -3 21 -6 13 20 26 35 18 24 1 0 2 -52 -5
6554 -5 -28 -8 0 -3 -31 24 -26 -19 -48 40 -22 24 -27 -30 37 20 30 -8 -12 32 30 36 -8 21 -2 17 8 72 -6 -17 14 -15 15 -14 14
6589 14 -14 -8 -36 23 18 -46 -4 -10 -39 -11 -7 33 -36 -46 -55 -30 18 -10 8 -10 -4 4 35 28 -11 4 37 18 24 -13 6 0 -44 -5 -32
6624 -32 56 42 -14 -13 7 -9 2 -1 5 47 -26 -50 30 6 -14 -11 -13 -22 -44 -3 7 -6 -23 18 -1 26 20 35 -5 5 -15 -13 11 -24
6658 -24 13 71 -1 15 50 13 23 -28 20 -8 26 -20 12 -23 24 -2 62 11 12 -32 16 -19 7 15 -8 26 -73 -4 -1 1 44 58
6690 58 -19 7 7 -24 52 11 10 19 -41 7 -39 24 -31 19 42 46 31 33 -29 29 -2 15 -18 -5 4 -9 -58 -23 30 50 35 11 5 -20
6724 -20 23 -9 -10 -54 -17 30 48 -40 -5 -43 -39 -9 -11 -23 6 62 14 10 -3 -4 -13 9 -3 27 38 10 -13 -22 10 -8 17 -5 -9 4
6758 4 -41 -13 42 -12 -1 -11 37 -49 -14 -43 -27 3 -10 -19 5 -32 -8 -28 -2 6 -20 -6 -18 23 29 11 20 -13 23 -4 -9 11 -1
6791 -1 3 -7 5 -17 -25 10 7 -8 -3 21 1 25 17 -17 -54 12 -81 16 1 35 -4 -29 -16 -43 18 4 -18 -26 -18 -60 86 9 -7 -18
6825 -18 -12 -24 -10 4 3 -25 27 67 17 35 7 -20 59 -17 -6 3 -36 -37 -31 6 -7 -5 -81 6 -5 12 -5 -26 52 -18 -58 -18 32
6858 32 -25 -26 32 -18 3 2 -7 -16 -34 -3 -28 -32 28 10 29 25 6 -7 15 3 -45 2 4 22 -22 -27 -7 -72 -81 -11 32 24 -59 -2 -15
6893 -15 6 -8 51 6 -13 14 -38 -7 19 -52 -23 -30 -61 14 15 15 -11 52 -12 24 -9 1 -11 16 33 9 -17 36 -16 8 -52 21
6925 21 0 26 4 2 0 -1 1 -33 40 -34 -1 -10 12 -21 -7 -12 6 -28 -1 26 -13 -4 -14 -5 -3 -3 5 -7 9 33 -9 -10 9 60 -6 -4 10
6962 10 7 10 21 -11 29 9 -40 -31 5 -10 3 11 -40 -27 -19 19 21 17 5 46 21 -34 -2 -49 -17 -40 22 -22 -61 13 -6 -13 -18 -13 -34
6997 -34 18 -24 52 14 6 15 29 5 -7 29 -1 6 -24 17 -79 4 27 -4 -7 -31 9 -14 -66 6 13 -16 -10 19 35 14 23 -17 7 28
7031 28 -39 16 -35 -11 6 46 -19 -9 36 12 40 -56 -14 1 57 17 -6 40 -46 4 -47 -15 -7 -22 -14 -27 1 3 -11 -51 -38 7
7063 7 30 -17 28 -68 31 -7 -9 40 14 -38 -14 -19 9 52 36 47 16 2 19 32 38 2 41 38 -3 -8 25 34 -60 47 43 -65 29
7096 29 -18 18 29 25 -12 -23 -32 -66 -17 -1 10 -22 -67 19 -2 6 25 -30 -40 29 -6 -39 20 -21 45 -17 10 -18 18 18 30 -4
7128 -4 -1 19 37 15 -11 19 -8 44 26 5 1 -22 72 4 -30 20 -16 16 -76 -7 -29 -12 -14 -2 -16 -7 -13 63 -12 -17 -19 19 31 -4
7162 -4 47 -1 49 5 -18 9 -5 50 53 67 -17 -33 -1 24 26 4 17 16 49 -20 30 -16 18 -15 -15 -13 12 -29 -8 -63 14 -35 -11
7195 -11 51 -9 -2 26 -34 28 -12 16 16 3 54 14 17 30 1 8 -16 -23 45 27 3 -55 25 17 -32 21 39 29 -6 -19 -44 -38 14 15
7229 15 -66 -4 -38 1 9 -1 -2 -41 17 40 13 15 -12 22 34 42 35 -12 32 0 -5 43 41 -4 -2 11 49 -2 24 25 56 -40 -2 31 -60
7264 -60 -24 -53 -37 -46 -17 -23 -5 42 -17 -6 -31 -28 -5 45 47 -10 -19 -38 -24 41 3 -42 5 62 17 -22 23 4 17 2 -2 19 9
7297 9 19 -27 -18 -12 -45 4 21 -16 23 37 33 18 -41 40 -20 -19 18 -11 -22 17 4 -20 -11 -49 -34 14 -1 16 42 8 -17 -2 27
7330 27 23 34 -6 30 69 -22 -10 -23 3 -9 22 49 -12 5 1 2 -15 -7 8 -40 -27 9 -54 -43 -5 30 7 14 17 -31 6 32 -14
7363 -14 -30 -9 25 -28 -32 -14 -10 7 12 68 -12 2 29 -4 -48 32 -4 26 15 -6 52 -3 -28 18 -58 22 19 23 -8 -20 -69 -21 7
7396 7 -42 -17 -53 -27 14 36 -66 -11 4 -29 -28 -28 -20 9 42 -37 9 11 6 4 -2 -61 7 -11 5 2 26 46 -6 -10 11 -43 45 54 -23
7431 -23 -57 39 -17 -41 24 -20 -23 -46 -13 -28 8 -42 3 -21 -24 -64 17 -4 -8 13 18 -49 -25 -11 -31 -15 -18 2 -3 12 53 -5 1 11
7465 11 46 54 -19 2 -3 29 -56 -21 15 -42 -42 -14 -25 -34 10 8 3 29 -45 -50 3 -46 34 0 -63 -24 1 6 50 3 40 6 -23 0
7499 0 29 4 -18 7 -28 -4 -50 56 -47 -27 3 -71 16 -25 -18 -1 -25 30 -40 2 15 -52 9 44 -42 44 -11 -7 0 -17 -30
7530 -30 -34 6 18 -49 19 13 -51 -18 -26 -47 -4 6 -22 6 6 35 -24 31 -11 -49 24 18 47 -41 -12 14 81 48 -37 -13 25 0 -42
7563 -42 8 10 15 50 -13 -3 -26 32 41 17 -20 8 32 3 40 -46 25 2 26 36 64 -18 11 14 20 32 60 -15 -45 27 11 66 60
7596 60 -19 16 18 38 -10 -87 -27 35 -16 -3 0 10 -56 -82 -32 1 21 -70 10 22 13 12 4 -30 5 -16 9 -30 -41 -28 -34 10 13 9
7630 9 44 42 69 -29 14 -10 -35 49 34 18 17 -37 10 51 -2 -4 -33 2 35 -14 -21 12 -11 -16 -63 6 -23 -23 54 6 -14 -12 -13 7 -10
7665 -10 37 -6 -7 25 -52 18 20 17 31 64 -17 -12 -36 -8 2 33 4 4 41 52 -27 -30 -4 44 -22 24 -15 -23 34 33 19 -9 0 12 7
7700 7 17 30 68 68 0 23 10 54 -8 2 34 38 -29 -5 20 26 -5 -43 3 -12 -9 24 1 -74 -8 50 -25 2 34 3 27 -48 12
7733 12 -24 24 -60 8 14 23 -6 47 7 -8 71 21 25 -21 -15 41 4 22 24 -3 22 53 30 -16 25 -20 -38 -16 7 -67 50 -5
7765 -5 13 -32 -10 -5 3 -2 -28 -38 -24 -17 -19 -9 -21 3 -16 13 -34 -2 -9 14 -13 10 6 -9 7 5 28 5 -15 4 -8 7 -29 1 34
7800 34 -3 -42 -10 -6 -45 -14 42 12 -31 -16 1 -12 -37 1 -13 45 33 -27 12 -81 5 54 25 7 28 -11 -12 -91 -31 -45 12
7831 12 -52 -8 -16 -52 -9 27 6 -4 -15 -23 17 -29 21 9 -42 -29 -12 49 53 27 -6 44 -35 -4 -21 -32 -5 39 17 -21 22 -2
7863 -2 -11 -28 -52 5 26 10 31 -3 -42 27 34 21 5 26 5 -6 0 -15 -6 8 20 6 -6 44 -41 20 3 -14 12 -8 21 6 -3
7896 -3 -22 14 -29 28 -31 -26 17 -29 -7 36 0 -62 25 -21 75 -22 -8 19 19 31 11 -3 -1 13 35 25 28 -25 11 0 10 27 -23
7929 -23 -12 39 42 33 -7 -7 -57 -35 -42 -20 29 -81 3 16 -14 -26 -5 25 -34 -18 -5 -9 17 8 -1 -14 -12 29 -24 0 -7 63 -18 -11 32
7964 32 4 14 34 49 2 22 1 -50 -7 0 -18 19 -58 10 8 8 6 -33 -41 -1 6 -35 33 51 7 13 -22 -40 -12 0 11 9 3 -36 10
7999 10 12 35 -21 6 23 41 34 -32 -11 23 16 -13 45 52 13 5 34 22 0 -19 -44 44 -13 -18 42 21 8 20 -44 -11 -8 -12 0 5 7
8034 7 29 -45 33 -25 -30 49 3 33 20 35 19 -41 14 -10 -41 36 22 33 50 -29 -11 4 30 -52 2 31 -71 -27 -27 -7 22
8065 22 34 -64 19 -13 -38 -32 16 8 -17 1 -3 11 27 -34 9 57 -39 -10 36 -1 29 -1 -31 47 -42 21 31 4 16 -7 32 -34
8097 -34 41 10 -46 9 8 -48 -22 2 32 19 -37 -2 39 0 -3 25 -49 -14 -21 11 -42 -10 -2 -5 -11 -9 -3 4 34 77 69 -8 38 -5 -18
8132 -18 -100 -1 -35 -30 8 29 29 29 8 40 23 -25 -18 18 -44 -55 -10 1 -13 13 -40 -22 -19 -14 -9 -54 3 -23 -66 57 -62 46
8164 46 -43 -37 -2 -25 20 48 6 -8 -32 -36 -24 24 32 45 24 30 -18 40 19 33 19 -43 41 36 -14 7 -40
8191d0
$$ Imaginary data points
##PAGE= N=2
##DATA TABLE= (X++(I..I)), XYDATA
0 0 0 0 0 0 0 0 0 0 0 0 0 8 -8 8 -8 10 -16 16 -24 24 -32 40 -48 56 -64 73 -86 98 -113 130 -148 170 -193
33 -193 219 -244 277 -310 349 -390 435 -486 536 -598 660 -730 808 -890 982 -1081 1192 -1312
51 -1312 1447 -1596 1759 -1945 2154 -2392 2665 -2983 3362 -3814 4370 -5074 5998 -7269 9134
66 9134 -12154 17860 -32539 155043 272270 -18344 -89602 -43931 -14924 -151574 -242415 -192774
78 -192774 -38709 13051 -40452 -64818 65140 180698 116075 -47445 -52106 85321 143210
89 143210 33062 -53606 861 93184 62547 -56829 -120988 -69429 -23848 -90253 -183166 -124996
101 -124996 50539 132960 59716 16074 109757 201242 137198 -8509 -71277 -33975 -23213
112 -23213 -100795 -167896 -106088 27978 65511 -17256 -49422 54177 141334 69592 -57617
123 -57617 -63898 27133 57238 -10896 -57204 -97 81747 62966 -39766 -79987 -5678 45435
135 45435 -34108 -131850 -89737 38682 80895 18108 -10607 55552 115734 72839 -24485 -56264
147 -56264 -5238 16341 -56928 -123564 -65951 49750 67926 -9263 -35352 35215 84788 31737
159 31737 -49246 -51831 8078 28081 -23481 -56176 4449 85812 67748 -23520 -49665 16127
171 16127 48114 -20993 -93045 -66067 11794 31351 -11847 -24102 35999 89518 52299 -29293
183 -29293 -39676 24397 42743 -31627 -89267 -40548 41295 42625 -16110 -29250 23693 55166
195 55166 8650 -54167 -44172 19402 33841 -24708 -55351 7137 79876 59490 -14825 -31127
207 -31127 17508 34697 -19615 -70760 -47965 10889 19760 -24558 -35452 26208 79473 43894
219 43894 -28063 -31089 25584 38849 -18980 -60379 -25864 28373 23939 -21843 -28696 20800 49731
232 49731 5218 -51924 -35429 27777 37500 -18473 -45382 3896 55930 36602 -16799 -22595
244 -22595 18403 30065 -17843 -59313 -31404 25109 24668 -27200 -39482 17752 62436 30475
256 30475 -25005 -22137 22768 29691 -16578 -46043 -13710 30176 17656 -30126 -33480 19503 48657
269 48657 6974 -42547 -25650 26854 31805 -14256 -34989 2341 38803 18339 -25257 -22672
281 -22672 22060 34964 -11206 -49392 -20750 30607 26207 -22733 -35547 8899 41666 15299
293 15299 -24784 -15303 25513 28863 -15279 -40228 -6002 34578 17060 -31921 -35073 13299 38751
306 38751 5063 -31679 -14372 26455 25180 -15386 -30189 4842 33818 8902 -32904 -25315
318 -25315 21949 36396 -3824 -35717 -11267 28785 21212 -20213 -29791 5730 28449 1788
330 1788 -30466 -13898 29173 32418 -10306 -33457 -2120 33063 15913 -27501 -31014 8235 27556
343 27556 -670 -27310 -6411 30464 23981 -17794 -30942 4072 30816 5604 -33551 -25786
355 -25786 17859 32685 978 -23057 -789 30062 16710 -23087 -29261 5031 22851 -5697
367 -5697 -35161 -15954 27432 33310 -2792 -22853 2461 29230 11633 -25399 -25865 8215 20746
380 20746 -7559 -28266 -3558 32170 24842 -14856 -28240 1379 24233 2930 -29442 -21333
392 -21333 16188 27226 -405 -16999 7427 33257 14799 -25638 -31104 1388 18137 -7269
404 -7269 -33368 -15817 23734 30778 1109 -14155 9051 29168 7069 -28364 -25136 8571 18486
417 18486 -9489 -28372 -4906 29107 25052 -9207 -22642 958 18912 -1190 -28326 -17134
429 -17134 17764 24590 -2389 -15189 9314 32939 15946 -21398 -29834 -4221 11311 -8200
441 -8200 -29314 -13078 21589 25789 -699 -10298 13680 29859 6353 -26729 -24190 5892 16624
454 16624 -6141 -23784 -5141 24371 20713 -9566 -19306 3308 16011 -6861 -30203 -15029
466 -15029 18979 24814 501 -10980 10183 31454 17301 -16663 -26145 -5259 5195 -15399
478 -15399 -32320 -12169 20169 21011 -2996 -8172 15713 31134 11633 -17845 -18670 5309 14418
491 14418 -5704 -21285 -4289 19441 11443 -16423 -20621 2462 12610 -7877 -26708 -12423
503 -12423 18524 27091 8392 -2825 13693 30672 15230 -16714 -23518 -4798 -785 -23729 -36925
516 -36925 -15100 15454 17890 -1023 -4880 16566 32361 16746 -9898 -10781 9716 12980 -9998
529 -9998 -22612 -3890 15670 4376 -20746 -22488 -646 10395 -4849 -20847 -9038 18689
541 18689 26341 9109 669 17496 29583 10080 -18816 -21318 -4203 -2761 -23152 -34358 -15980
554 -15980 11211 16150 1447 -1858 17470 30311 13812 -9257 -6294 11814 9678 -13271 -22753
567 -22753 -4938 12477 4296 -16530 -19180 -334 10961 -2159 -16777 -5229 18781 20922 2362
580 2362 -2644 15327 25189 6697 -17958 -19500 -3596 450 -15496 -26631 -11927 11912 14473
593 14473 -733 -2126 16830 25319 6809 -12750 -7527 9107 7897 -10804 -19296 -4747 12028
606 12028 7214 -10635 -12768 4002 11328 -3929 -16510 -4025 15509 13406 -3780 -6737 9553
619 9553 19765 6865 -12983 -14304 486 4693 -10181 -19795 -5351 13437 9868 -5932 -4818
632 -4818 12989 19096 2463 -13942 -8935 6719 7908 -7325 -14773 -1071 13696 6957 -9580
645 -9580 -8311 7974 10745 -6079 -16775 -5011 11476 9669 -5014 -8303 5807 16450 6585
658 6585 -9881 -8850 5246 6422 -9406 -16673 -2408 12250 6381 -8173 -7448 7909 14697 2383
672 2383 -11394 -6994 7438 8321 -5999 -11151 2706 13888 4196 -10834 -7776 7081 9225 -5526
686 -5526 -15514 -6081 8848 8236 -4731 -7596 6135 15248 4423 -9547 -5093 8662 7311 -8662
700 -8662 -15135 -2719 9960 5147 -8068 -8617 4999 12093 1560 -9828 -3857 9557 7880 -6509
714 -6509 -9977 3493 12540 3274 -10163 -8250 4824 8531 -3103 -12297 -4564 8494 6768 -5752
728 -5752 -6970 6432 13187 1892 -10049 -4867 7934 7684 -5800 -12495 -2731 8609 4719 -7353
742 -7353 -7410 5547 10697 -435 -9866 -1965 10390 7190 -6773 -10043 1655 10227 2869 -9083
756 -9083 -7548 4651 8303 -2530 -9875 -1036 10064 5474 -7252 -7476 5193 10738 659 -9880
770 -9880 -5575 6208 7322 -3880 -9624 -802 8715 3465 -7675 -6025 6362 9718 -1430 -9505
784 -9505 -2226 8943 6672 -5429 -9349 215 7916 1616 -8545 -5651 6083 8086 -2745 -8381
798 -8381 870 10501 5253 -7026 -8086 2695 8228 73 -9121 -5024 6095 6601 -3815 -7822
812 -7822 1687 9448 2622 -8218 -6108 5437 8595 -1187 -8593 -2540 7428 5886 -4723 -7685
826 -7685 1294 7274 58 -8632 -4223 6932 7779 -2547 -7563 404 8840 4561 -6275 -7696 1568
841 1568 6159 -1172 -8237 -2773 7357 6529 -3598 -6399 2745 9238 2404 -7867 -6630 3396
855 3396 6365 -1938 -8013 -1765 7073 4563 -5052 -6010 3233 7797 -10 -8159 -3736 6561 7335
870 7335 -1981 -6693 132 7246 2860 -6569 -6656 2091 5204 -2472 -7973 -1506 8007 6627 -2788 -5428
886 -5428 2513 8114 2035 -6889 -5738 2747 4563 -3030 -7102 -347 7243 3822 -5002 -5445 3213
901 3213 7206 48 -7365 -3611 5383 5889 -2133 -5474 1244 6798 1765 -6581 -5461 2985 5159
916 5159 -2496 -7723 -1656 7137 6014 -2529 -4717 2368 6721 752 -6576 -4129 3573 4082 -3482
931 -3482 -6714 232 7317 3866 -4709 -5242 2527 5989 -454 -6438 -2547 4938 4490 -2571 -4437 2212
947 2212 6825 1519 -6337 -5207 2614 4596 -2506 -7063 -1591 5873 4478 -2496 -3252 3350 6436
962 6436 398 -5953 -3167 4089 4198 -3397 -6775 -403 5904 2529 -4815 -4620 2488 4816 -977 -5315
978 -5315 -794 5872 4682 -2327 -4024 2322 6565 1246 -6365 -5362 1673 2924 -3250 -6361 -898
993 -898 5260 3486 -2387 -2182 4251 6917 1016 -5193 -2696 3857 3600 -3429 -6318 -763 4137 798
1009 798 -4847 -3597 2751 4428 -933 -4530 71 6425 5055 -1960 -3817 1958 5437 195 -6087
1024 -6087 -4448 1417 1740 -3609 -5565 41 5543 3366 -2515 -2258 4226 6684 733 -4958 -2286
1039 -2286 3426 2464 -3708 -5217 -6 3748 361 -4597 -3023 3302 4828 -615 -4456 -162 5689
1054 5689 4024 -2374 -3545 1518 3862 -749 -5320 -3175 2152 2428 -2676 -4629 523 5815 3394
1069 3394 -2594 -2614 2981 4743 -403 -4676 -1960 2776 1701 -3396 -4280 724 4385 1072 -4026 -2697
1085 -2697 3331 4682 -690 -4109 -184 4296 2274 -2896 -3221 1390 3307 -809 -4847 -2464 2946
1100 2946 3287 -2006 -4108 579 4956 2301 -2812 -2440 2271 3329 -1096 -4134 -1144 3212 2219 -2635
1116 -2635 -3719 1162 4527 1032 -3833 -2537 2499 3066 -1520 -3651 7 3610 1751 -2703 -2667 1991
1132 1991 4042 -31 -4165 -1878 3155 2966 -2042 -3739 399 3591 711 -3292 -2283 2192 2983
1147 2983 -1109 -3750 -573 3916 2799 -2110 -3087 1331 3838 259 -3694 -2134 1980 1878 -2041
1162 -2041 -3448 149 3642 1758 -2446 -2277 2139 3950 72 -3556 -1358 2665 1899 -2255 -3047 642
1178 642 2987 350 -3128 -2025 2283 3193 -824 -3320 -319 3613 2323 -2097 -2525 1297 2755 -535
1194 -535 -3506 -1697 2010 1930 -1785 -3149 500 3892 1962 -2165 -1962 2115 3029 -733 -3264 -956
1210 -956 2255 1227 -2380 -2790 858 3249 699 -2861 -1739 2369 2984 -763 -2895 -106 2855 1241
1226 1241 -2216 -2072 1224 2423 -491 -3142 -1387 2324 2351 -1318 -2773 536 3279 1190 -2295 -1679
1242 -1679 1598 2037 -1140 -2981 -659 2414 1495 -1894 -2382 1184 3360 745 -2504 -1383 2048 1976
1258 1976 -1402 -2772 -116 2254 687 -2368 -1956 1498 2892 68 -2482 -729 2675 2178 -1387
1273 -1387 -2374 485 2244 82 -2601 -1690 1356 1804 -979 -2684 -248 2825 1895 -1446 -1782 1414
1289 1414 2815 240 -2246 -1041 1564 1116 -1884 -2801 -152 2137 556 -2209 -1565 1884 2996 204
1305 204 -1902 -90 2470 1436 -1722 -2164 327 1697 -504 -2856 -1689 1520 1989 -758 -2117 339
1321 339 2813 1617 -1233 -1307 1324 2093 -457 -2421 -1029 1487 1003 -1780 -2592 31 2230 743
1337 743 -1776 -1082 1844 2517 -10 -1475 135 2097 922 -1905 -2255 155 1527 -386 -2577 -1376
1353 -1376 1619 1994 -471 -1505 586 2465 974 -1445 -1255 1111 1662 -687 -2408 -915 1652 1292
1369 1292 -1391 -2080 350 2024 428 -1672 -822 1622 1807 -434 -1519 224 2066 955 -1739 -2025
1385 -2025 370 1560 -349 -2152 -935 1515 1565 -619 -1292 606 2063 614 -1674 -1372 938 1597
1401 1597 -483 -2008 -501 1654 1218 -1024 -1525 471 1549 -82 -1835 -1008 1355 1549 -543 -1507
1417 -1507 280 2119 1117 -1241 -1419 554 1352 -432 -1975 -762 1368 1116 -858 -1329 552 1970
1433 1970 482 -1535 -1148 1028 1524 -323 -1532 -158 1558 1017 -1033 -1385 452 1250 -359 -1999
1449 -1999 -1096 1117 1443 -339 -1137 506 2043 1088 -974 -1109 532 982 -715 -2057 -821 1057
1465 1057 912 -860 -1261 578 1889 678 -1086 -826 913 1229 -429 -1411 -133 1337 668 -1250
1481 -1250 -1454 299 1150 -288 -1750 -891 1092 1364 -138 -787 639 1891 879 -1032 -1058 464 783
1498 783 -917 -2131 -907 971 896 -539 -829 694 1779 794 -802 -568 919 1042 -564 -1531 -231
1515 -231 1160 525 -1127 -1209 324 1053 -136 -1352 -561 1054 1153 -225 -710 658 1688 652 -1118
1532 -1118 -1036 406 602 -813 -1753 -725 811 808 -460 -555 903 1627 505 -882 -493 831 711 -777
1550 -777 -1474 -299 967 504 -848 -754 551 1041 -74 -1087 -408 862 807 -549 -830 434 1314 392
1568 392 -958 -776 447 629 -595 -1332 -376 836 603 -513 -525 827 1397 235 -965 -551 679
1585 679 559 -760 -1217 -147 934 411 -599 -455 740 1035 -162 -1071 -338 752 463 -732 -846
1602 -846 338 1120 377 -652 -413 665 696 -464 -1149 -343 758 309 -823 -655 546 1171 108 -865
1620 -865 -396 642 550 -532 -950 79 962 351 -614 -362 765 899 -313 -1125 -441 462 223 -793
1638 -793 -844 347 1074 424 -431 -88 965 780 -475 -1076 -248 592 29 -963 -807 298 872 100 -675
1657 -675 -192 687 554 -488 -729 236 1007 341 -635 -311 727 757 -346 -979 -371 375 131 -810 -785 333
1677 333 992 312 -398 69 994 808 -304 -870 -210 462 -36 -867 -723 264 717 27 -683 -104 790 533
1697 533 -534 -708 192 816 150 -579 -213 622 764 -176 -793 -250 417 91 -883 -751 281 891 148
1716 148 -415 37 889 741 -262 -715 -147 417 -81 -812 -571 379 715 -45 -568 37 745 379 -552 -647
1736 -647 109 583 118 -465 -172 686 691 -120 -567 -166 452 38 -878 -724 121 603 28 -383 57 787 657
1757 657 -147 -540 56 464 -16 -732 -507 435 559 -131 -585 -67 523 245 -488 -615 64 468 14 -437
1777 -437 -77 727 650 -83 -502 49 490 -30 -805 -767 21 331 -98 -484 29 725 655 -149 -357 238 591
1798 591 1 -642 -390 365 494 -113 -475 -54 418 183 -543 -589 75 410 -35 -474 -36 746 700 -42 -265
1819 -265 112 486 -29 -688 -654 -14 215 -324 -532 -13 694 502 -178 -302 273 563 52 -515 -238 308
1839 308 402 -117 -493 45 390 152 -547 -578 119 396 -97 -470 2 638 559 -69 -244 199 425 -37 -659
1860 -659 -570 54 182 -363 -535 53 582 472 -120 -199 241 495 28 -485 -297 314 354 -278 -419 91 467
1881 467 40 -442 -402 187 364 -136 -393 -86 523 490 -38 -189 250 441 6 -589 -486 150 180 -259 -444
1902 -444 2 534 410 -92 -201 288 496 -14 -433 -245 283 233 -259 -393 27 451 92 -373 -325 171 368
1923 368 -94 -367 -24 474 419 -127 -182 242 465 0 -503 -360 83 165 -279 -505 -48 406 262 -205 -134
1944 -134 342 437 -17 -455 -148 324 177 -351 -399 18 370 117 -342 -271 204 327 -117 -323 33 421 343
1965 343 -157 -203 280 432 13 -421 -304 130 100 -322 -445 -37 380 175 -151 -30 416 481 -63 -356 -204
1986 -204 214 101 -415 -459 -27 264 26 -328 -157 347 337 -40 -303 95 432 198 -237 -220 201 322 -46
2007 -46 -398 -255 169 81 -308 -373 44 407 202 -155 -46 465 513 74 -274 -181 176 25 -442 -492 -12 229
2029 229 -31 -299 -15 447 416 -73 -260 86 417 152 -311 -266 148 314 -119 -379 -143 271 121 -356 -368
2050 -368 97 447 106 -224 13 338 444 -2 -251 -46 236 20 -438 -422 50 272 -19 -358 -30 361
2070 361 386 -42 -255 5 222 61 -380 -267 233 305 -83 -328 2 381 254 -247 -355 32 229 14 -254
2091 -254 -118 269 333 -16 -252 89 313 73 -342 -371 85 302 -43 -256 2 394 269 -143 -232 31 178
2112 178 -45 -368 -244 211 357 40 -196 108 444 224 -261 -346 -28 120 -105 -387 -112 305 328 37 -143
2133 -143 171 433 165 -297 -307 53 190 -93 -282 -13 294 167 -156 -261 43 252 -96 -360 -224 253
2153 253 376 20 -160 156 373 115 -236 -379 -18 24 -223 -423 -130 314 336 52 -131 194 430 147 -191
2174 -191 -186 96 158 -184 -315 -15 294 181 -185 -258 11 208 -35 -405 -221 239 273 -28 -79 153 367 124
2196 124 -202 -255 14 97 -230 -439 -164 238 254 -54 -146 194 394 63 -204 -164 104 171 -159 -364 11 350
2218 350 226 -152 -203 44 199 -60 -376 -150 180 191 -117 -114 165 390 191 -161 -284 72 114 -218 -400 -135
2240 -135 239 223 -44 -37 193 327 72 -314 -233 113 180 -98 -236 -26 316 226 -129 -124 193 158 -168 -319 -140
2263 -140 175 206 -110 -150 68 429 165 -168 -216 65 132 -224 -320 -93 247 186 -102 -134 158 366 39 -338
2285 -338 -211 86 153 -108 -281 56 347 172 -83 -102 168 153 -153 -294 -206 160 134 -147 -191 125 347 172
2307 172 -159 -95 209 127 -128 -227 -81 261 156 -193 -122 63 283 -4 -304 -240 116 122 -100 -136 130 373 151
2330 151 -77 -87 189 203 -82 -388 -217 94 82 -106 -188 121 267 59 -146 -86 143 256 -108 -315 -72 204
2352 204 183 -151 -229 27 139 -41 -294 -147 117 76 -101 -207 82 363 140 -145 -170 78 135 -100 -267 -155
2374 -155 143 87 -89 -149 158 348 104 -137 -118 175 216 -91 -311 -29 225 100 -242 -151 107 142 -11 -225
2396 -225 -123 162 133 -94 -194 29 263 109 -160 -143 94 117 -81 -253 -34 128 102 -139 -192 89 291 133
2418 133 -155 -148 174 155 -47 -220 -15 188 47 -117 -199 80 156 -14 -201 -103 185 190 -67 -150 51 224 120
2441 120 -185 -106 68 159 -105 -205 -64 136 94 -128 -245 54 250 81 -130 -91 143 148 -58 -175 -28 155
2463 155 59 -158 -132 82 165 14 -113 -15 193 204 -25 -76 57 153 -2 -249 -122 60 164 -84 -209 -37
2485 -37 174 148 -54 -116 63 197 65 -158 -115 182 57 -149 -242 -39 143 27 -206 -212 45 196 20 -111
2507 -111 26 179 210 -39 -239 55 172 -17 -303 -199 53 157 -46 -183 7 157 99 -107 -68 117 184
2528 184 -28 -164 -116 104 117 -76 -220 -89 151 86 -167 -131 51 155 1 -117 71 238 226 -22 -110 -1
2550 -1 137 -33 -207 -147 72 136 1 -163 41 145 126 -107 -126 67 151 -24 -173 -66 89 191 -1 -93 32
2573 32 140 1 -173 -160 59 144 -26 -117 -32 191 144 -61 -178 38 113 29 -133 -45 104 188 -40 -96 5 180
2597 180 97 -152 -181 61 90 -23 -219 -63 155 123 31 -124 62 146 10 -249 -189 23 88 -74 -196 -62 159
2620 159 189 -56 -78 57 195 -23 -144 -104 166 103 -79 -156 34 180 49 -100 -222 -17 91 -15 -120 -29
2642 -29 174 171 32 -129 71 186 -37 -221 -212 -18 35 -109 -168 -42 199 188 -12 -69 163 203 -26 -182 -116 124
2666 124 141 -62 -180 -18 129 67 -144 -151 6 156 -43 -64 -18 269 225 -30 -91 52 206 14 -221 -155 21
2689 21 64 -96 -166 -18 220 157 -76 -101 120 225 2 -236 -136 49 149 -68 -150 4 187 76 -101 -145
2711 -145 67 154 -77 -159 -36 220 148 -4 -52 45 146 15 -197 -159 67 143 -28 -110 61 258 171 -52 -109
2734 -109 67 157 16 -213 -103 32 81 -67 -87 50 207 79 -122 -132 99 156 -6 -180 -47 185 226 -52
2756 -52 -114 64 74 -44 -221 -217 83 101 -54 -161 3 222 158 -73 -95 54 84 -14 -199 -121 67 113 -56 -144
2780 -144 -47 198 101 -147 -132 56 98 25 -169 -45 164 149 -84 -129 63 150 33 -204 -211 99 114 -15 -107 24
2804 24 138 156 -76 -101 32 114 -20 -178 -146 133 162 -36 -133 27 203 85 18 -125 46 117 37 -153 -49
2827 -49 113 125 -73 -130 27 128 63 -135 -89 79 130 -6 -62 29 139 111 -50 -129 27 100 14 -210 -108 68
2851 68 110 -44 -73 -11 128 66 -39 -107 74 107 -39 -116 -75 83 121 -102 -153 31 48 58 -124 -109 37 123 -27
2876 -27 -137 6 144 117 -58 -102 -15 178 -13 -126 -94 101 85 -13 -91 -2 124 83 -146 -61 100 99 39 -208 -61
2901 -61 63 90 -39 -60 23 33 39 -162 -83 82 103 -43 -108 -22 117 95 -139 -104 48 121 77 -106 -47 94 101 -69
2927 -69 -138 20 143 57 -105 -17 92 171 18 -131 -91 73 62 -93 -144 -7 94 30 -125 -106 46 144 -40 -107
2951 -107 1 122 3 -116 -102 39 113 -1 -156 -61 96 150 -48 -105 -24 143 90 -85 -96 92 161 4 -119
2974 -119 -54 129 70 -111 -116 53 132 48 -90 -68 151 197 14 -122 -53 138 34 -160 -111 66 155 7 -96 -60
2998 -60 135 126 -17 -124 4 98 47 -96 -86 141 154 -34 -205 -47 102 108 -119 -124 83 200 87 -113 -89 65
3022 65 98 -66 -114 -29 73 35 -136 -137 41 145 44 -145 32 85 94 -28 -70 47 112 -8 -100 -98 89 156 -9
3047 -9 -146 -52 176 72 -95 -111 6 102 70 -26 -47 118 111 -31 -155 -26 124 36 -101 -119 78 149 -26 -65 10
3072 10 69 59 -111 -87 21 103 41 -128 -125 102 98 33 -124 -36 73 28 -76 -117 71 143 -1 -75 19 116 160 -22
3098 -22 -125 20 68 71 -38 -93 24 55 -10 -87 -17 75 50 -97 -172 6 166 80 -59 -66 88 99 5 -135 -15 58
3124 58 5 -100 -102 77 195 40 -30 15 155 162 17 -109 -19 107 59 -110 -118 45 122 -17 -80 -12 116 105 -100
3149 -100 -77 9 125 5 0 -44 63 57 -26 -126 -57 71 20 -158 -97 41 165 85 -89 19 105 146 -54 -118 26
3174 26 9 4 -99 -98 88 81 42 -99 -41 153 90 -77 -100 -31 108 57 -94 -71 57 35 -51 -196 -35 65 -3 -92
3200 -92 -92 84 138 96 -76 34 69 61 -25 -189 30 106 -4 -135 -91 73 134 63 -56 -12 109 56 -3 -34 83 89
3226 89 -2 -44 -45 101 82 -42 -154 -20 46 55 -102 -80 48 96 55 -94 -3 76 37 -104 -100 -44 51 73 -81 -108 75
3253 75 94 30 -56 -6 97 67 -37 -40 62 125 30 -152 -114 68 88 -91 -103 3 126 32 -40 -42 119 90 -56 -66
3279 -66 12 58 109 -36 -141 10 58 -22 -106 -28 39 52 -49 -88 17 119 69 -51 -55 39 81 -18 -86 -61 67 89 -70
3306 -70 -79 -9 113 5 -62 -65 58 125 -25 -106 -22 22 52 -53 -100 -52 107 -10 -55 -10 109 116 -64 -119 29 134
3332 134 42 -118 -95 28 114 50 -74 -28 105 19 -79 -135 76 144 -30 -34 -41 73 69 -15 -98 -25 102 77 -90 -70 40
3359 40 20 -9 -104 -78 84 64 -56 -61 -62 81 11 -125 -118 39 108 -8 -108 -9 74 84 -64 -129 24 103 8 -22 -47
3386 -47 71 83 1 -66 20 91 62 -53 -69 57 97 -13 -162 -28 64 36 -33 -145 81 135 -6 -19 8 87 133 -81
3412 -81 -121 -3 70 71 11 -54 28 55 52 -64 -20 110 96 -51 -84 -1 135 10 -72 -39 28 100 15 -79 -68 8 74 -14
3440 -14 -101 76 75 55 -114 -47 85 50 -49 -146 -63 104 31 -41 -88 1 104 70 -12 -19 23 82 -77 -153 2 63 12 -80
3468 -80 -96 11 80 33 -3 14 110 17 -37 -95 47 155 63 -22 -77 25 63 -33 -108 -60 51 52 -81 -45 56 131 66
3495 66 -113 -58 66 74 -10 -128 -59 106 -3 -58 -122 55 127 34 -99 -42 69 149 -27 -60 19 63 15 -53 -32 76
3521 76 60 -47 -119 -16 72 62 -45 -48 70 97 61 -48 -14 0 51 -79 -44 -15 32 52 -56 -56 79 136 13 -105
3547 -105 -24 74 62 -19 -90 65 59 47 -24 -41 0 46 -43 -82 18 107 86 -1 -23 37 82 64 -58 -43 11 -1 -53 -100 18
3576 18 76 20 -62 -54 68 61 54 -4 -57 65 34 -18 -29 89 56 64 -62 9 87 69 -81 -87 5 25 86 -10 8 38 144 -36
3606 -36 -73 -7 31 59 -80 -20 -1 21 51 -26 -43 14 28 -15 -82 -1 13 -10 -40 -59 41 75 47 -75 -52 84 47 -13
3634 -13 -90 -17 47 49 -5 10 100 166 72 -89 16 83 -3 -53 -96 35 34 12 -67 8 21 46 -32 -115 10 55 -19 -69 -61 10
3664 10 142 52 -52 -63 36 -48 3 -68 -12 72 37 -39 -3 79 98 43 -56 -21 69 31 -14 -70 -18 76 19 -30 26 55 23
3693 23 16 -105 -33 91 47 6 -36 107 13 9 -59 -7 18 25 -41 -42 -23 76 14 -26 -28 19 64 47 14 -29 3 44 -36 -1 -52
3724 -52 6 59 -59 -13 18 89 -29 -94 -12 43 103 -47 -60 -3 -1 -23 -34 -62 23 60 -12 -84 -82 23 70 -24 -37 79 65
3753 65 14 -66 -24 -5 49 31 -22 14 124 32 -51 -29 12 32 -23 -48 -10 18 75 -28 8 34 49 -88 -58 -8 11 44 -67
3782 -67 -54 1 78 60 -17 -53 26 42 -44 -54 -13 35 12 -19 -77 25 50 -5 -6 -40 21 43 -1 -44 28 75 8 -35 -81 10
3812 10 111 23 -52 -23 47 2 23 -99 -35 21 34 -7 -29 -11 28 -45 -38 19 -33 1 -10 -84 -24 62 -9 -66 42 34 -20 -39
3842 -39 0 15 59 -22 -32 4 21 77 7 -13 -14 10 45 -22 -41 -25 38 -21 -28 -39 26 33 12 -84 26 20 7 -86 -65 -22 64 31
3874 31 -51 48 15 70 -17 2 40 74 47 -9 -45 -17 41 -58 -46 33 45 -7 -23 -12 38 59 -44 -11 3 56 16 8 -54 -18
3904 -18 35 -4 24 17 14 57 44 -10 -27 45 24 42 -38 -30 13 -3 -33 0 -7 72 50 -53 23 47 46 -35 -72 50 38 18 0 13
3936 13 -10 7 2 -20 37 25 42 -17 -6 -4 44 43 25 -48 33 12 12 28 -16 23 42 -50 -26 0 45 32 -12 -75 92 45 2 -23
3968 -23 37 -15 -16 -17 -5 49 29 -24 -24 -32 50 12 -25 -45 18 37 -32 -36 -13 46 9 -21 -11 81 39 -79 10 -32 35 80 23 -10
4000 -10 -38 22 31 9 -6 56 94 40 13 -60 18 76 1 31 18 22 -18 33 -43 15 36 -44 -6 -1 43 -14 8 -46 -15 -11 -22 -6
4032 -6 -14 -16 24 15 -12 10 31 6 -38 -23 5 63 16 -62 -43 -23 10 11 -7 12 74 47 2 5 20 13 -5 29 -26 68 9 -9 -25 48
4066 48 1 62 -1 -35 62 19 -31 -62 11 60 18 28 -21 -32 61 -19 -12 -29 -56 10 -24 -38 -7 38 -22 -32 6 6 36 39 -67
4097 -67 -12 -12 40 -20 -3 -16 -1 -5 -16 -74 -21 -21 -81 -29 -38 16 5 1 -94 -12 -12 -11 -55 37 -13 10 7 -66 -5 -6 10 -40 -48 14 27
4132 27 37 -3 32 -45 -22 47 -26 -21 28 -12 12 -6 -23 14 31 -6 52 1 62 15 9 -17 19 -21 -16 3 -9 13 2 -17 -58 25
4164 25 34 -1 -36 20 -38 -6 -10 -5 -44 -35 -4 -49 -18 -19 10 -11 4 17 -4 40 18 -52 34 49 -5 6 -13 -32 13 -2 -2 -6 -24 -8
4198 -8 -71 -26 -11 -11 12 45 -9 35 -3 -6 8 53 -18 -53 -1 17 39 21 -43 -9 -2 40 -10 -51 -10 -1 -20 22 -39 13 29 -32 -22
4231 -22 27 -45 13 39 -7 -15 -26 17 19 36 18 11 -37 5 -24 8 55 -28 -19 61 -30 -5 -12 -22 -12 7 -19 26 -8 1 -16 -55 32
4264 32 -3 -19 32 9 -20 8 -1 -18 12 -4 37 12 -6 -45 -12 40 -13 -20 -31 -39 6 -2 7 -27 -31 -23 -11 -43 15 -15 1 28 -15 -51
4298 -51 -26 -1 -70 26 17 19 -46 -43 19 -6 35 22 22 21 22 15 -23 -23 -2 -4 -33 16 -1 -27 -44 34 -21 -2 -30 -44 -22 -48 75 -12
4332 -12 11 1 -2 -11 4 -23 -16 -43 92 -37 -62 27 -2 -13 -10 -19 -48 -26 9 41 -41 -9 -25 33 -58 -22 -10 -23 6 -66 -32 24
4364 24 -53 -2 -34 30 2 -39 0 14 -52 3 16 68 67 13 16 -33 20 -7 30 55 -18 3 30 48 1 -33 -57 76 -21 -22 47
4395 47 -21 37 -40 34 27 2 37 -5 -23 3 15 -19 -19 -45 28 -34 -35 -22 -31 -51 -65 29 14 38 7 -27 -37 -22 7 8 21 26 8
4428 8 -30 -33 -102 -52 -3 1 8 -16 4 21 -31 -19 8 -10 1 -71 -26 27 -45 -6 11 -28 85 11 -56 -24 18 49 3 35 7 10
4460 10 7 -40 -23 -45 34 24 0 -62 9 -19 -16 29 -33 94 -10 -16 -57 17 5 21 -3 6 -12 -5 -13 8 17 -27 76 2 -26 -7
4492 -7 17 34 -25 -15 -17 -26 23 -9 -37 -20 -21 -19 14 -9 -47 53 -12 20 8 15 32 -45 10 -12 47 16 11 -7 -5 18 52 -16 2 7
4526 7 -27 -25 -16 63 13 -15 -53 -25 13 -49 -84 21 -18 -53 19 -65 -21 44 66 32 -12 6 28 30 -16 -41 24 27 -77 -64 -7 30
4558 30 5 42 -15 16 59 10 43 3 -28 8 37 -50 7 50 -26 -28 -55 -14 30 -49 -27 -15 -31 -29 14 4 -66 -8 1 -32 -25 5
4590 5 -9 -4 -10 16 41 1 29 -51 57 3 29 15 13 -52 11 -32 -46 28 -33 48 -25 -18 -16 -1 12 -79 36 -1 3 13 -4 13 -7
4623 -7 -19 -48 -34 28 -10 5 -24 25 -16 17 2 3 -8 -19 10 -12 19 -35 33 18 -1 -2 53 -26 -50 -18 -14 -3 -48 -5 15 12 43
4656 43 -34 4 -7 17 23 -14 -47 -30 25 1 -20 -5 66 20 -19 17 35 35 36 -28 22 38 44 -1 -3 6 -17 -78 -28 9 4 25 -51 13
4690 13 20 24 -14 -8 -32 11 36 21 35 8 13 -27 -7 11 24 3 -24 -31 -22 59 13 -2 -1 1 9 51 20 -5 -24 1 47 -38 -34 26 45
4725 45 -40 -46 -25 5 -18 -79 -64 45 -15 -7 -14 -52 -49 -31 -5 -93 -19 -107 -32 -22 -53 77 -7 -61 -30 18 -27 -28 -55 -54 9 -2
4757 -2 14 -38 4 46 18 -2 -18 -24 -31 -50 -22 8 -30 40 -46 12 3 -26 14 -27 35 48 5 1 42 -3 6 22 -29 18 0 -7 -4 -9 30
4792 30 23 63 9 -58 -4 9 15 3 -8 -29 -1 -30 56 12 30 -38 -66 -28 8 2 -10 -41 27 -6 -11 -7 -8 -47 5 11 -13 13 72 27
4826 27 11 1 -50 -25 18 20 -6 -43 8 -6 -30 -16 52 32 9 21 -18 -21 42 26 -5 11 -14 -21 -24 32 33 49 -29 -14 -32 -3 -19
4859 -19 4 -5 -1 2 52 25 -17 -23 22 19 -23 -49 -59 16 -59 -70 54 38 48 -36 -10 11 24 8 -7 -31 18 7 24 -6 31 16
4891 16 22 -40 5 30 -5 52 -21 19 22 11 -18 4 -34 -24 3 -61 8 44 27 -3 -22 13 -16 -19 -40 11 46 -29 3 -45 12 42
4923 42 35 -16 -28 -8 55 -43 2 -78 -22 65 14 24 44 10 -23 -36 -10 -19 22 9 6 -5 -5 36 -26 4 28 12 21 -4 11 3 20
4956 20 25 -20 26 -33 64 42 42 -10 14 -7 -7 -15 -8 20 10 14 64 40 64 6 -61 26 48 -4 -22 -33 36 58 1 -17 43 -2 -21
4989 -21 -5 -28 39 -41 38 -9 -55 -7 2 8 6 -2 -7 20 -47 -38 -10 4 24 -58 32 65 6 56 -66 16 34 33 -45 -29 2 26 -42
5022 -42 4 32 -2 -3 -38 8 22 -19 3 -52 56 41 47 -24 -32 16 -8 -3 -70 -36 10 -16 -18 24 -40 9 67 -4 -13 18 21 21 -10 55
5056 55 -5 75 -2 -5 54 31 -5 -78 -17 -40 39 32 21 -11 24 17 -38 -31 70 50 20 -42 -32 3 42 -19 -6 15 -43 4 -11 9
5088 9 32 -3 -51 -26 24 28 3 -12 2 -39 -7 2 -31 22 7 -15 -27 26 24 47 13 -71 11 2 14 -4 2 2 0 5 0 4 -21 29 2 -19
5124 -19 1 45 -14 4 11 -38 -37 17 2 -28 10 47 -11 -13 32 55 37 11 -1 -28 44 19 -14 -40 8 4 -55 14 25 14 79 -72
5156 -72 -23 81 22 5 -63 -26 33 26 -27 -42 -32 33 3 -57 -5 55 38 30 21 -37 18 -17 -43 12 -27 -38 -11 13 6 24 21 -43
5188 -43 26 -54 15 27 -56 25 5 26 22 39 -10 43 -1 28 15 -5 -5 28 -15 -36 -34 5 -12 -40 -18 -21 21 -23 -52 -15 47 -47
5220 -47 -42 -53 -5 -3 2 -53 5 -33 -10 37 -10 -24 -2 -24 -50 -41 52 0 -20 -9 0 62 32 -70 -70 6 19 37 -67 19 4 20
5252 20 16 24 30 19 -33 -42 -20 -8 33 -7 -22 -50 -1 -27 -36 -25 20 18 -9 19 -10 35 14 -47 -77 -36 50 11 12 -53 -23 20 6 -35
5286 -35 53 0 -69 22 -22 33 20 10 -76 -19 10 -1 -63 36 -34 -20 25 5 1 52 -2 -37 -27 -29 65 45 51 24 -10 14 53 -9
5318 -9 7 18 20 -35 -21 26 -2 -2 -27 -50 -25 11 30 -47 40 7 47 -30 -44 1 28 -4 42 -9 -8 1 52 -50 -41 17 73 -78
5350 -78 16 25 -17 54 -39 8 39 -9 14 -3 -12 76 -43 35 -35 -18 6 35 -13 48 34 -28 -60 -39 48 54 27 -16 30 13 -13
5381 -13 27 12 18 -17 -28 9 -17 34 16 -26 -12 31 4 -4 3 -27 42 39 48 15 9 -20 12 23 3 2 36 23 5 7 -9 51 -5 9
5415 9 27 3 -27 11 -23 -48 9 4 -76 -32 -11 -7 0 -72 1 42 -10 32 -6 3 62 18 -11 -11 -9 7 4 12 -15 50 20 -12 -38 15 -1
5450 -1 -19 1 -15 1 -33 38 -19 -24 45 -8 -25 -19 -12 48 -20 25 -14 41 -13 -28 -37 50 -2 1 42 -45 1 22 -49 -7 28 88 46
5483 46 -12 24 -4 -39 35 -22 45 37 41 -67 -81 6 56 26 18 -9 32 5 13 22 -2 -51 -8 -21 -6 6 6 -9 -7 21 -1 18 3
5516 3 -19 29 22 -31 -23 -37 25 12 6 -24 -20 18 14 18 30 20 13 -7 -22 13 -48 -7 21 -35 -63 15 37 21 -27 -39 9 -12 0 3 -2
5551 -2 -37 26 -11 -12 -9 32 1 20 39 59 -4 -45 30 37 -24 0 82 21 -35 -39 0 24 32 48 -5 27 8 -1 24 -11 -27 -32 -36 37 -59
5586 -59 -50 34 -8 79 -7 1 14 -37 -25 4 56 14 21 -14 53 0 22 -75 8 56 51 -23 -5 -19 -10 43 20 0 23 20 15 19 -49 79
5620 79 34 77 -41 37 18 -13 18 10 -36 -43 2 -46 -14 -27 -13 -16 -28 -17 0 50 -49 2 57 30 21 33 22 18 48 -30 -47 -35
5652 -35 17 49 24 -20 -50 39 20 -46 38 11 18 0 2 -20 34 31 -4 -6 -6 -1 8 -43 -23 61 31 -20 -24 18 0 7 -12 -5 17 27 -6
5687 -6 14 -13 15 -18 -15 -35 -25 58 -4 -9 -61 39 3 -16 11 26 31 -15 -16 -1 31 49 -56 10 -6 30 58 -28 -3 34 -44 26
5719 26 20 -21 -16 24 -4 5 -56 20 3 -50 12 16 -5 16 -6 -14 -26 -2 -15 25 -12 38 16 -13 -35 28 17 -20 -98 18 17 -26 5
5752 5 -13 -52 42 36 -41 -44 21 2 -11 -36 -24 6 1 -2 -50 28 19 -5 24 5 29 34 4 -19 1 31 -10 42 -20 53 52 29 -5 20
5786 20 -34 5 41 -2 8 41 39 -10 20 77 -26 -4 55 40 24 -5 -24 28 -11 26 39 -1 10 61 -5 -28 -33 38 -11 -8 -23
5817 -23 6 -17 52 -22 -19 -61 4 8 29 2 -1 28 24 -57 4 36 -13 6 -30 32 67 9 -75 10 -27 -7 -24 -39 29 -14 52 23
5849 23 -3 26 36 29 9 -22 -37 -22 -50 3 -23 22 -20 -42 -18 20 -5 42 -25 -19 -15 20 7 16 38 3 -14 -32 -21 9 3 53 -11
5882 -11 -11 65 -4 4 57 -5 46 35 -39 -20 41 39 -47 -24 7 32 3 -33 -53 19 10 -1 -2 18 -5 16 21 32 39 -26 23 9 -6 4
5916 4 25 13 -2 8 -2 2 -20 -41 12 43 -12 -15 -32 -22 -6 28 -47 54 40 19 -42 -4 17 21 -7 4 21 -30 -1 -16 -40 -20
5948 -20 -29 -10 -45 7 9 1 26 7 -21 -2 -71 7 4 9 -32 11 17 -28 -36 4 -33 -25 3 -33 51 -4 1 -16 28 47 0 -28 -7 -10 9
5983 9 -22 -12 61 17 -34 73 -34 33 10 -49 8 8 8 -38 2 38 -7 42 -34 -6 -41 8 -23 -15 26 22 27 -70 9 -58 12 -9
6015 -9 32 33 43 4 -2 -45 36 39 4 21 15 27 37 37 -32 47 31 -20 10 -50 -49 14 -8 33 12 17 -2 -33 -49 -12 -10 -61 19 7 -53
6050 -53 -37 -8 -10 34 23 26 -45 3 -1 -21 -13 -12 -72 5 -31 18 -79 47 27 4 3 -25 -6 -18 37 20 35 37 19 -7 32 -15 -6 -17
6084 -17 -8 -14 -6 16 60 13 -3 32 1 -37 -29 29 8 -19 10 -18 27 7 -35 -30 -16 -4 10 4 -3 -29 -17 -5 -20 52 31 48 28 -1
6118 -1 30 -36 4 -15 1 -25 -3 -24 15 19 -5 1 -16 3 -4 13 4 -25 42 3 53 14 -17 33 18 49 -45 74 -18 -7 -3 52 -22
6151 -22 16 -25 4 51 -4 -4 -21 17 -8 -2 0 27 0 4 27 24 21 -10 39 0 -22 7 -54 31 2 -8 -1 -43 44 15 18 13 12 9 -2 11
6187 11 -53 33 -31 7 -7 -38 -7 58 -20 -38 3 -10 10 -35 -15 -20 42 22 51 82 16 73 4 35 -11 4 -11 -11 -4 24 1 -12
6219 -12 47 -62 61 -26 -50 -17 -13 -12 -12 -29 -42 -49 -57 20 13 -40 30 8 6 4 10 18 -51 1 31 35 10 8 -75 -17 21 11 -4 43 35 16
6255 16 17 24 -30 7 41 7 -33 5 24 -5 33 17 18 -73 2 33 0 -16 -39 45 -2 17 18 -21 -2 1 -18 -41 -8 0 -24 36 -32
6288 -32 -13 31 6 -18 -2 6 15 -39 -45 -7 4 21 -4 -49 -15 18 35 39 -44 28 -7 -4 -21 -28 -9 12 -17 11 -9 42 9 -20 10
6321 10 -4 -3 24 28 -16 8 54 1 10 -3 6 24 -18 25 16 -36 -51 27 6 -53 5 17 -33 37 -20 41 17 -16 16 21 -18 -60 -24
6354 -24 -12 23 -36 -37 -48 55 11 1 14 11 41 -28 -28 -18 9 -18 -21 44 -2 -1 25 1 12 10 -9 -28 -6 16 45 -15 -17 45 -20
6387 -20 -4 22 -8 -7 9 -16 12 -1 26 22 20 31 25 11 7 6 3 -8 -57 36 32 -20 -6 14 14 20 13 -10 16 -3 -19 -22 28 -20 52 10
6423 10 35 -14 -4 -22 4 -16 12 4 -27 -9 -13 -14 -27 -46 -32 -9 -5 4 -16 23 -5 6 -9 82 60 -26 -16 -15 4 -16 -4 -4 -27 6
6457 6 -15 -52 5 -5 -25 -21 23 38 -39 2 17 -30 12 -18 5 -18 -33 58 31 -83 -2 -9 -32 33 -4 -19 -17 -32 -37 -75 -31 84
6489 84 -22 -12 16 -22 -24 38 -30 12 14 40 14 1 64 20 -51 -1 -18 -18 -5 23 -16 18 -32 -21 -14 -17 -12 -14 -9 -24 3 17 11 1
6523 1 -8 -9 64 -44 -7 7 -23 -21 -15 12 -31 5 -34 -15 -34 -28 7 35 24 -5 13 31 0 38 -20 56 52 20 -25 -64 23 -41 -9
6556 -9 -15 -83 33 -25 -19 -67 -40 -39 -7 -2 56 -3 -24 5 -58 11 46 10 -11 -16 -4 12 -6 18 -29 20 58 -43 -44 15 9 -4 11
6589 11 14 -20 -11 -6 30 3 -54 -34 7 -22 22 40 -22 18 -47 34 -38 5 17 29 40 5 -9 -47 -21 17 -7 -26 -38 -16 -29 -1
6621 -1 3 42 19 -99 -31 11 -11 9 -18 -53 17 -14 7 -10 32 -15 42 -9 -44 -36 -15 10 6 -18 -12 -3 -8 -28 40 22 -20 -19 -4 5
6655 5 20 -35 31 18 12 -58 18 -66 15 11 -5 14 -30 -19 -42 -22 13 10 26 57 -10 -10 -40 -1 -63 2 -22 -8 -24 8 16 52 -38
6688 -38 -20 -23 23 20 4 -1 -3 -31 18 55 -24 -8 -6 -22 4 19 1 9 31 64 -8 -53 -18 29 -10 -49 -12 -29 -1 4 7 -3 24 11
6722 11 30 13 17 -23 4 -21 14 0 -99 -30 2 30 6 -12 -14 12 -6 -52 -25 -13 -25 20 -14 -16 7 39 15 -72 18 40 -29 -25
6754 -25 -8 23 7 -16 1 -13 -6 -43 -13 -12 20 -7 14 -16 -27 2 46 -7 -55 -50 10 -18 2 -10 25 -27 15 24 -13 -3 20 4
6786 4 39 -1 3 26 -4 -80 4 -7 -25 30 14 -27 -10 -37 -2 61 -14 -12 -26 -19 56 -86 -55 31 -20 64 -6 20 -14 31 32 -15
6818 -15 -23 3 -39 -34 52 -4 -24 -25 8 -32 -23 9 -13 -13 -1 -21 -38 19 -4 -9 -13 -21 4 21 19 28 39 3 26 3 69 0 4 45 -17 -38
6854 -38 -18 -6 2 -7 63 -30 39 -32 5 -8 -1 -36 -6 17 42 4 37 27 -16 -15 37 52 2 33 -8 -19 -11 50 -2 -9 4 -15 15
6887 15 13 0 -25 21 22 41 -68 12 1 52 -8 0 -28 34 -23 -49 -14 -10 20 31 -1 11 13 11 -15 34 37 -23 26 1 -3 36 -44 35
6921 35 16 -4 -68 14 43 21 7 -44 -7 -33 -35 8 9 -2 63 3 -10 0 -16 43 -71 -5 30 -53 15 -35 18 26 -52 -19 -25 26
6953 26 -16 -37 60 -20 0 -20 -29 12 2 2 33 -103 5 1 -7 52 -27 3 25 19 -33 -10 -18 -6 14 -31 -59 29 -14 12 14 25 -74
6986 -74 21 -58 56 0 -15 23 -4 47 -46 29 -42 12 -17 19 -77 8 -2 -74 -20 10 3 -3 -7 -24 24 22 -14 6 21 -28 -56 24
7018 24 -12 1 -63 -30 -35 35 -3 -15 -37 -32 -6 44 -62 -1 -34 23 -18 3 -7 -41 -17 -13 3 -42 -15 -18 11 -8 -10 34 31 12 -20
7051 -20 -51 1 56 -6 -55 -47 11 -37 -1 -49 -17 3 -29 -1 -7 -25 -29 -27 -20 26 37 3 -55 16 -20 -14 13 25 10 -19 -6 35 -37
7084 -37 25 27 13 -46 -10 70 -68 -67 -44 34 -1 7 30 38 34 -16 -33 -18 52 -26 -21 7 10 10 -12 39 13 54 -4 -18 -43 38 -2 -47
7118 -47 -9 40 -21 74 -11 -59 -3 45 31 -1 -51 -5 21 -7 -36 7 -40 -9 21 -7 24 32 23 -38 -35 11 3 44 -17 11 38 42 28
7151 28 -15 -37 -35 59 -29 -33 -6 18 17 22 -7 -2 -19 7 -29 23 14 38 -25 -16 -24 33 26 27 -10 -24 15 21 18 -17 -36 14 17 -41 -17 -15 -45
7188 -45 -23 -6 14 51 -51 7 32 -32 -2 34 -7 -7 -23 -4 3 -28 8 10 0 36 15 -3 -27 8 -44 -38 16 -10 -7 2 18 37 40
7221 40 29 -42 -30 -22 -4 -33 36 48 -14 -10 3 17 -51 -16 -1 17 19 -22 33 13 41 -8 10 -5 32 -34 17 -13 -12 0 -12 -14 -31
7254 -31 30 -6 26 2 6 -99 38 18 -23 -12 14 -16 -18 -20 -9 17 -61 5 8 28 -16 31 -33 11 18 -34 -22 21 17 34 -3 -38
7286 -38 12 2 -20 -48 2 -17 3 53 -22 27 26 -31 -25 -9 -5 -3 -23 -9 -53 -5 -55 22 -31 22 18 -3 -1 6 -29 42 43 -60 -40 -12
7320 -12 5 32 -51 30 43 7 18 -21 -5 -24 7 -1 -54 -41 -51 -29 19 -7 39 -31 -5 34 -34 -19 -12 -27 -7 8 2 -12 19 2
7352 2 -51 -29 -9 -21 -3 -43 19 6 3 8 16 13 -49 0 2 -31 1 35 47 -10 27 9 -9 -42 -15 -42 -6 17 -9 -17 15 -35 -30 13
7386 13 -7 4 31 -17 41 51 4 -51 -15 -8 -14 8 -15 12 27 -15 -33 29 -3 -11 43 45 -35 -7 -9 -24 -4 -48 25 -10 20 39 -16
7419 -16 -16 -9 -3 13 11 -4 54 64 -23 18 -17 3 -59 -6 -66 14 -37 -22 14 -38 19 -19 7 11 27 9 -36 22 18 12 14 8 35 -16 6
7454 6 24 -17 1 38 -4 43 -16 -27 -35 33 9 14 27 8 53 42 -21 -46 42 -13 -4 23 -44 -6 -36 -21 16 -3 -35 36 -23 2
7486 2 -22 16 31 21 31 -14 -29 0 30 -7 19 -57 -24 19 16 24 -29 -52 23 38 45 -14 67 25 -42 58 -2 10 -46 20 -6 8
7518 8 -16 -16 10 -13 33 -33 20 -3 -30 23 4 -19 48 -48 -31 -15 15 -1 -12 -23 11 -30 52 0 -6 45 6 55 -3 24 31 -11
7550 -11 -21 30 17 0 52 -28 -17 17 3 -8 -26 -16 10 -9 47 -4 -35 13 -7 -6 -45 -10 34 3 -32 -9 -4 -16 -18 4 -20 -10
7582 -10 -13 1 4 -9 -1 12 35 -7 -17 14 -38 49 -24 -12 -9 12 30 28 -3 -7 -16 -26 -67 -10 13 -15 -40 26 -12 -38 -3 8 21 -20
7616 -20 -39 23 -3 -33 22 10 -14 -46 44 -76 -29 -19 16 12 -25 22 -12 4 15 3 29 3 13 14 34 -23 -30 -8 -25 12 11 -16
7648 -16 -44 0 -20 -20 21 -5 37 -5 5 19 29 -18 -13 -13 19 -26 -32 18 6 -16 -9 37 -93 25 -75 -7 -10 50 9 9 7 -23 11
7681 11 -35 40 -27 21 -8 -1 -10 -26 -36 -29 12 6 12 -9 24 -12 4 36 -12 -60 21 24 -2 -45 77 56 -22 6 -19 26 -18 -35 -39
7714 -39 0 12 29 8 21 24 13 -7 -6 -24 -51 86 8 -8 -25 25 -22 -28 39 -24 -22 13 -31 46 51 -9 -4 45 16 51 -24 -13 -23
7747 -23 -34 -4 33 29 8 -16 -8 -14 19 38 13 -24 -14 19 -1 13 -25 -25 -5 -22 12 -21 -35 -20 4 -22 -13 -6 -22 -5 -17 -12 -56 1
7781 1 70 -47 -33 6 11 -16 23 53 -11 -17 -23 58 -5 7 11 13 -34 21 7 -15 47 3 -17 31 -11 -1 13 -20 27 58 6 -17 -25
7814 -25 39 -1 42 -56 28 21 -44 41 -18 30 51 67 37 -16 -25 -40 15 -34 16 -48 8 14 24 -13 40 10 -47 47 32 4 -1 74
7846 74 -8 4 13 50 -20 -49 0 36 28 -42 1 6 3 -42 29 -12 -48 -1 -9 25 45 5 36 13 7 -5 9 10 -45 22 2 -5 -8 3 -10
7881 -10 75 -27 32 39 -1 -28 -58 24 2 36 20 -16 -28 25 -19 -27 -23 32 -23 -26 -16 -22 -43 6 -24 2 15 27 5 2 -8 32 38
7914 38 -29 -23 -6 -14 -2 -14 -57 -17 -31 -11 -32 -17 31 -7 -44 -24 31 36 -38 23 -39 -26 -26 49 -28 -73 16 -27 -12 -11 26 44 22
7947 22 23 4 -8 -19 -8 13 9 -7 47 -19 -2 23 23 14 -17 -17 18 57 -15 -26 -9 -29 -9 20 12 5 -5 7 17 -18 13 30 -34 2
7981 2 70 -29 -35 -18 -44 -2 7 9 40 43 -45 -6 19 -10 7 -8 11 -3 -61 -19 -23 27 -35 24 -19 -43 24 5 -13 61 -8 -39 2
8014 2 30 -11 -14 -49 -33 6 -18 32 -38 10 -3 -47 12 -2 -15 5 1 -2 -69 25 47 15 -16 -7 -2 5 44 21 -17 -10 20 -46 -11 17
8048 17 15 25 -12 -2 11 3 -38 41 49 -17 -16 -18 -49 -47 25 -20 15 -2 5 28 -10 -3 12 5 -23 -42 21 26 13 5 7 46 57 -31 42 11
8084 11 -10 -19 37 1 -11 -23 11 -20 -11 0 1 2 15 35 1 -11 -62 34 -28 7 3 -8 48 14 -28 57 -53 -13 12 6 6 -9 26
8117 26 30 -30 -13 51 13 -36 1 43 1 -24 8 68 5 -39 0 -30 44 -36 -28 -15 -25 14 -6 8 -24 12 0 -1 27 -4 10 -16
8149 -16 40 -31 -8 13 19 27 9 -24 -15 0 22 -19 -31 27 -16 -4 -9 36 -14 -23 25 53 42 -7 0 5 -30 -12 -30 10 -11 5 9 46
8183 46 3 -26 -16 11 -8 29 -12 24
8191B4
##END NTUPLES=NMR FID
##END=
