##TITLE=1H_AM_NV138
 CDCl3
 8 sc, 
 6.3.2024
##JCAMPDX= 6.0         $$ Bruker NMR JCAMP-DX V2.0
##DATA TYPE= NMR FID
##DATA CLASS= NTUPLES
##ORIGIN= UXNMR, Bruker Analytische Messtechnik GmbH
##OWNER= root
$$ XWIN-NMR		Version 3.5
$$ Wed Mar  6 14:16:02 2024 Russian Standard Time (UT+4h)  she@DPX200
##.OBSERVE FREQUENCY= 200.1313
##.OBSERVE NUCLEUS= ^1H
##.DELAY= (6, 6)
##.ACQUISITION MODE= SIMULTANEOUS
##.ACQUISITION SCHEME= undefined
##.AVERAGES= 8
##.DIGITISER RES= 18
##SPECTROMETER/DATA SYSTEM= spect
##.PULSE SEQUENCE= zg30
##.SOLVENT NAME= CDCl3
##.SHIFT REFERENCE= (INTERNAL, CDCl3, 0, 15.7039)
##AUDIT TRAIL= $$ (NUMBER, WHEN, WHO, WHERE, WHAT)
$$ ##TITLE= Audit trail, XWIN-NMR		Version 3.5
$$ ##JCAMPDX= 5.01
$$ ##ORIGIN= Bruker BioSpin GmbH
$$ ##OWNER= she
$$ F:/spectra/data/she/nmr/H-F/1/audita.txt
$$ ##AUDIT TRAIL=  $$ (NUMBER, WHEN, WHO, WHERE, WHAT)
(   1,<2024-03-06 14:15:11.15 +0400>,<she>,<DPX200>,
      <created by zg, POWCHK disabled, PULCHK disabled
       configuration hash MD5:
       00 E9 B6 7A A2 85 ED C7 34 08 36 98 17 FE 4E 26
       data hash MD5: 16K
       22 CC CA B7 1B A5 04 0C 35 2D 50 FA AF 3F EF AB>)
$$ ##END=
$$ 
$$ hash MD5
$$ F6 F0 58 8C AE 17 B6 CC 65 07 E7 D8 E8 AB 17 0F
##$RELAX= 
##$RELAX= 
##$RELAX= 
##$RELAX= 
##$RELAX= 
##$RELAX= 
$$ Bruker specific parameters
$$ --------------------------
##$DU= <F:/spectra>
##$EXPNO= 1
##$NAME= <H-F>
##$PROCNO= 1
##$TYPE= <nmr>
##$USER= <she>
##$AMP= (0..31)
100 100 100 100 100 100 100 100 100 100 100 100 100 100 100 100 100 100 
100 100 100 100 100 100 100 100 100 100 100 100 100 100 
##$AQSEQ= 0
##$AQ_mod= 1
##$AUNM= <au_zg>
##$AUTOPOS= <>
##$BF1= 200.13
##$BF2= 200.13
##$BF3= 200.13
##$BF4= 200.13
##$BF5= 200.13
##$BF6= 200.13
##$BF7= 200.13
##$BF8= 200.13
##$BYTORDA= 1
##$CFDGTYP= 0
##$CFRGTYP= 5
##$CHEMSTR= <none>
##$CNST= (0..31)
1 1 145 1 1 1 1 1 1 1 1 1 1 1 1 1 1 1 1 1 1 1 1 1 1 1 1 1 1 1 1 1 
##$CPDPRG= <>
##$CPDPRG1= <>
##$CPDPRG2= <>
##$CPDPRG3= <>
##$CPDPRG4= <mlev>
##$CPDPRG5= <mlev>
##$CPDPRG6= <mlev>
##$CPDPRG7= <mlev>
##$CPDPRG8= <mlev>
##$CPDPRGB= <>
##$CPDPRGT= <>
##$D= (0..31)
0 1.2 0 0 0 0 0 0 0 0.06 0 0.03 0 0 0 0 0.0002 0 0 0 0 0 0 0 0 0 0 0 0 
0 0 0 
##$DATE= 1709720110
##$DBL= (0..7)
120 120 120 120 120 120 120 120 
##$DBP= (0..7)
150 150 150 150 150 150 150 150 
##$DBP07= 0
##$DBPNAM0= <>
##$DBPNAM1= <>
##$DBPNAM2= <>
##$DBPNAM3= <>
##$DBPNAM4= <>
##$DBPNAM5= <>
##$DBPNAM6= <>
##$DBPNAM7= <>
##$DBPOAL= (0..7)
0.5 0.5 0.5 0.5 0.5 0.5 0.5 0.5 
##$DBPOFFS= (0..7)
0 0 0 0 0 0 0 0 
##$DE= 6
##$DECBNUC= <off>
##$DECIM= 32
##$DECNUC= <off>
##$DECSTAT= 4
##$DIGMOD= 1
##$DIGTYP= 9
##$DL= (0..7)
0 120 120 120 120 120 120 120 
##$DP= (0..7)
150 150 150 150 150 150 150 150 
##$DP07= 0
##$DPNAME0= <>
##$DPNAME1= <>
##$DPNAME2= <>
##$DPNAME3= <>
##$DPNAME4= <>
##$DPNAME5= <>
##$DPNAME6= <>
##$DPNAME7= <>
##$DPOAL= (0..7)
0.5 0.5 0.5 0.5 0.5 0.5 0.5 0.5 
##$DPOFFS= (0..7)
0 0 0 0 0 0 0 0 
##$DQDMODE= 0
##$DR= 18
##$DS= 0
##$DSLIST= <SSSSSSSSSSSSSSS>
$$ [...]
##$SUBNAM2= <"">
##$SUBNAM3= <"">
##$SUBNAM4= <"">
##$SUBNAM5= <"">
##$SUBNAM6= <"">
##$SUBNAM7= <"">
##$SUBNAM8= <"">
##$SUBNAM9= <"">
##$SW= 18.0517328524113
##$SWIBOX= (0..15)
0 0 2 0 0 0 0 0 0 0 0 0 0 0 0 0 
##$SW_h= 3612.71676300578
##$TD= 16384
##$TD0= 1
##$TE= 0
##$TE2= 300
##$TE3= 300
##$TEG= 300
##$TL= (0..7)
0 120 120 120 120 120 120 120 
##$TP= (0..7)
150 150 150 150 150 150 150 150 
##$TP07= 0
##$TPNAME0= <>
##$TPNAME1= <>
##$TPNAME2= <>
##$TPNAME3= <>
##$TPNAME4= <>
##$TPNAME5= <>
##$TPNAME6= <>
##$TPNAME7= <>
##$TPOAL= (0..7)
0.5 0.5 0.5 0.5 0.5 0.5 0.5 0.5 
##$TPOFFS= (0..7)
0 0 0 0 0 0 0 0 
##$TUNHIN= 0
##$TUNHOUT= 0
##$TUNXOUT= 0
##$USERA1= <user>
##$USERA2= <user>
##$USERA3= <user>
##$USERA4= <user>
##$USERA5= <user>
##$V9= 5
##$VALIST= <valist>
##$VCLIST= <CCCCCCCCCCCCCCC>
##$VD= 0
##$VDLIST= <DDDDDDDDDDDDDDD>
##$VPLIST= <PPPPPPPPPPPPPPP>
##$VTLIST= <TTTTTTTTTTTTTTT>
##$WBST= 1024
##$WBSW= 4
##$XGAIN= (0..3)
0 0 0 0 
##$XL= 0
##$YL= 0
##$YMAX_a= 103303
##$YMIN_a= -118819
##$ZGOPTNS= <>
##$ZL1= 120
##$ZL2= 120
##$ZL3= 120
##$ZL4= 120
##$ABSF1= 10
##$ABSF2= 0
##$ABSG= 5
##$ABSL= 3
##$ALPHA= 0
##$AQORDER= 0
##$ASSFAC= 0
##$ASSFACI= 0
##$ASSFACX= 0
##$ASSWID= 0
##$AUNMP= <proc_1d>
##$AZFE= 0.1
##$AZFW= 0.1
##$BCFW= 1
##$BC_mod= 2
##$BYTORDP= 1
##$COROFFS= 0
##$CY= 11.3945322036743
##$DATMOD= 1
##$DC= 2
##$DFILT= <>
##$DTYPP= 0
##$F1P= 15.7292609196834
##$F2P= 12.9074282941183
##$FCOR= 0.5
##$FTSIZE= 0
##$FT_mod= 4
##$GAMMA= 1
##$GB= 0.15
##$INTBC= 1
##$INTSCL= 1
##$ISEN= 128
##$LB= 0.24
##$LEV0= 0
##$LPBIN= 0
##$MAXI= 10000
##$MC2= 0
##$MEAN= 0
##$ME_mod= 0
##$MI= 1.114404
##$NCOEF= 0
##$NC_proc= 0
##$NLEV= 6
##$NOISF1= 3.799351
##$NOISF2= 2.8
##$NSP= 1
##$NTH_PI= 0
##$NZP= 0
##$OFFSET= 15.70392
##$PC= 1
##$PHC0= -24856.72
##$PHC1= 15.98731
##$PH_mod= 1
##$PKNL= yes
##$PPARMOD= 0
##$PSCAL= 0
##$PSIGN= 0
##$REVERSE= no
##$SF= 200.130013532006
##$SI= 16384
##$SIGF1= 3
##$SIGF2= 2
##$SINO= 400
##$SIOLD= 16384
##$SREGLST= <1H.CDCl3>
##$SSB= 0
##$STSI= 0
##$STSR= 0
##$SW_p= 3612.71676300578
##$SYMM= 0
##$S_DEV= 0
##$TDeff= 0
##$TDoff= 0
##$TI= <>
##$TILT= no
##$TM1= 0
##$TM2= 0
##$TOPLEV= 0
##$USERP1= <user>
##$USERP2= <user>
##$USERP3= <user>
##$USERP4= <user>
##$USERP5= <user>
##$WDW= 1
##$XDIM= 8192
##$YMAX_p= 0
##$YMIN_p= 0
$$ End of Bruker specific parameters
$$ ---------------------------------
##NTUPLES= NMR FID
##VAR_NAME=  TIME,          FID/REAL,        FID/IMAG
##SYMBOL=    X,             R,               I
##VAR_TYPE=  INDEPENDENT,   DEPENDENT,       DEPENDENT
##VAR_FORM=  AFFN,          ASDF,            ASDF
##VAR_DIM=   8192,          8192,            8192
##UNITS=     SECONDS,       ARBITRARY UNITS, ARBITRARY UNITS
##FACTOR=    0.0002768,     1,               1
##FIRST=     0,             0,               0
##LAST=      2.2672688,     0,               0
##MIN=       0,             -118819,         0
##MAX=       2.2672688,     103303,          0
$$ Real data points
##PAGE= N=1
##DATA TABLE= (X++(R..R)), XYDATA
0@%%%%%%%%%%%%%%oJ4j6J6j6J7k5L2l6M4n0N8p2Q2r1J06j22J39j62J85k10K35
36A22k60K93l32L72m13M60n09N64o23O90p62Q37r24J019j124J239j363J501j657
55h70J835k035K261k525K834l201L646m198M910n862P204r255J2799k0575O6546
70E3514n0304j22029J55803N0041j34731j9107J32346l1498r5786N2942O1206
81E2397p7451r382Q2175k9123q3529O5351O5422q4801m2584J01027J3253j02998
93e0243Q349R6010k7952p4811M1400N0125n3385k5436N6311O245n1910J1021M0840
106B6564k4776l0433L4042K2341l4071j5635K7716P595j8822J10J1895m791n899
119d164N107j956n164J1512P716j9711j2858K3987J6693k5551j7270K8184J6798
$$ y = [0, 0, 0, 0, 0, 0, 0, 0, 0, 0, 0, 0, 0, 0, 0, -6, 8, -8, 8, -8, 9, -16, 16, -20, 24, -26, 32, -40, 42, -49, 57, -65, 74, -88, 97, -113, 122, -138, 155, -177, 195, -218, 242, -267, 297, -326, 364, -398, 439, -485, 534, -590, 649, -714, 787, -870, 965, -1070, 1191, -1334, 1500, -1701, 1945, -2253, 2657, -3205, 3999, -5256, 7543, -13032, 53514, 3210, -118819, 36984, 87025, -47706, -66813, 65533, 34035, -61751, -8809, 52397, -25054, -34436, 47739, 18616, -64913, 438, 65860, -18941, -61525, 39502, 52755, -50243, -41894, 54116, 26164, -48647, -7247, 42878, -10507, -35943, 20368, 26613, -25297, -14276, 26564, 1788, -28645, 5397, 27738, -6333, -21968, 5748, 13343, -5479, -5369, 6526, 1735, -4164, 943, -1013, -6177, 5335, 13051, -6660, -19518, 4469, 21162, -4389, -21659, 6525, 23323]
132B3323l1734j7528L3529J9618l0340j9732K3398J6264j6371j1782J0303R380
144H328l994j0118n062J1137J4886j0343k1815R247K4108j0216k2973J3499K2016
157A8700j5826k0616J4500J6969j0495j0258O668K883m730J276K381j978J644
170A118J550o470k024Q679K652p028n60L999l633k009P441J834q379r94P504j634
186B046p755L720R743l185j1936l21J1806L822j0563n162J0617N490j2542o754
200a0974J4608R457j3726j0865J0339R502o676o716M014N171j341o278l563P658
214F10R853p718j4791O990J6366p554j5470J0343J4830j2761j4462J2679J2729
227A1644j0118q285P344K680o067J069M394k294r22K404m174l234Q065M199r068
$$ y = [23323, -8411, -25939, 7590, 27208, -3132, -22864, 534, 16798, 427, -11355, -1052, 8328, 4334, -5784, -10846, 291, 15177, 4834, -16981, -7734, 16374, 6158, -16815, -3316, 18700, 2874, -17742, -3242, 13727, 3232, -7026, -358, 2525, -2205, -929, 1452, -526, 1118, 2668, -3802, -5826, 2853, 5505, -1523, -2083, 1916, -1717, -3726, 3715, 5549, -2830, -3824, 3680, 2046, -5709, -1989, 7754, 4569, -7367, -7688, 4118, 7940, -2623, -7785, 2832, 8322, -4220, -10974, 3634, 13091, -635, -11500, -1161, 8341, 1665, -5051, -1037, 4134, 2793, -3485, -7048, 610, 10463, 2745, -12046, -5056, 11310, 3756, -11714, -1371, 13459, 698, -13764, -1085, 11644, 1526, -6759, 585, 3265, -2802, -1733, 2661, 367, -555, 1849, -2325, -5559, 2506, 6705, -2363]
242b363k884Q591p88q370N204R043p666q469Q378N371r380j328J1324j528j3017
257g882J987J2061k143q997L530N884n040m176M825L128j942k48j644l851L998
272e10P103n338p906P422O939j1229o615J4576O968j5494o532J3961L920j1891
286d626j35J0713k117r059K338N510j666j71J797m507k352O706J211p486J967
301a877Q315n695r652P527R750p630p296P938L479q931n30R822m84q498J110N332
317B680k655k507M510J206m825j056K759j36k79K298r95l653J007L174j511j365
333a348L541P04n517j451N901K334m767j779L934J63m662L52N701O33n640j825
349c726L969J515k513K5K580p38l168k2K636J456n76j457j406L77J761m4j100
$$ y = [-2363, -5247, 3344, 2556, -5814, -610, 8433, 767, -7702, 676, 6047, -3333, -4661, 6663, 5135, -7882, -5895, 6166, 4023, -4974, -1444, 4440, -600, -4776, 49, 3177, 1235, 987, -657, -4508, -510, 6593, 1255, -6651, 771, 7710, -3519, -10134, 4442, 11410, -4084, -10616, 3345, 7265, -4626, -4761, 5952, 3835, -5224, -2886, 2624, 958, 787, 2584, -1923, -4275, 2431, 3642, -3844, -1877, 6438, 743, -8909, -1382, 8368, 738, -6558, 1380, 4859, -4072, -4602, 5220, 4736, -3762, -2652, 2680, 25, -2482, 2028, 3234, -1591, -2647, 112, -24, -303, 1995, 1000, -2653, -1646, 1528, 17, -1348, 2193, 2897, -2620, -4071, 1830, 4164, -603, -2382, 1552, 1715, -2947, -2595, 3106, 3739, -1901, -3726, 243, 1758, -755, -730, 1850, 1112, -2056, -2078, 558, 2014, 1438, -19, -1425, -1048, 713, 669, -431]
366d31J166J118l045k492L450L833k539l636J939K274k632j504M100K329m256
381c26l376L157L058k129j436K466K7l607k74L591O79j982O5m2j984R29L422r32
399A306k883J929J313m108k24O338J13o771M79N462k732m069N456L357o989k750
415d773O461N38n177K914M449n456l945O114K339n259J067M539m384m148N902
430A181K887n750N5N173l924n148O277M761o751k746O317n82o158L360O163m069
446A046m746L692J688l397J550L622l192l090L140P95l121K060L692l810m080
461d151L644K986k912o40L019j056l371J186K773l60o93K27j309r67J662J174
477A212q26j08J47j590o38J998J222q50o82l46p51N37J605J94p51j27o58r26J126
$$ y = [-431, 735, 1853, -1192, -3684, -234, 3599, 1060, -2576, -637, 1637, -995, -2499, 1601, 3930, -326, -3702, -545, 2513, 384, -1052, 1414, 1441, -2166, -2440, 1151, 1830, -152, -87, -129, -2113, -1184, 2238, 1306, -1577, 352, 1665, -2443, -2667, 3671, 3784, -2987, -2508, 2954, 222, -3847, 1609, 4966, -2023, -4773, 1688, 2226, -2951, -37, 4412, -1044, -4989, 1125, 3464, -1795, -728, 3811, -573, -4721, 1181, 4068, -1682, -1627, 3546, -378, -5526, 751, 5512, -1239, -3985, 2332, 1750, -4408, -1048, 5115, 1046, -3700, -8, 1680, -1717, -167, 3455, 263, -2827, 313, 1108, -2013, 47, 3739, -71, -4151, -507, 2479, -433, -1073, 1946, 890, -2481, -1295, 1478, 1118, 425, 652, -657, -1624, 38, 1212, 386, 278, 425, -1165, -1803, 195, 1417, 567, -115, -461, -1212, -675, 930, 1124, 373, 246, -412, -1338, -212]
496b12J749m43j180j03n96o44J686J504j379j382O44j08p71J549J724j514j761
513a237O67M67l02J276R76j870j388J136L87n80J315R72k441j733K009J334j151
530a63L16J118j647j686J719J671q29j45N27j558j120K033J488j319o76O22j047
547f96r93J776J694j228j389L18N8k64J037J107o47j326l43M06O72O86J56o57
565C67j058m78O71J166K62p03m54l86n62O60J618J27j449m86M93l39K08J700K36
584A593k058q35J180K96l29J131K68k112q90J623O43o10P19L52j954p90K032Q71
602A130r05K06L13j706n62K133Q54j276j53J81j378j67K203N05j668j63M78j124
620a099L2K266K91j871k47P20q40K53K149j23k445m9J329p57k54K102l4k855k13
$$ y = [-212, 1537, 1094, -86, -189, -785, -1429, 257, 1761, 382, -1000, -356, -464, -1235, 314, 2038, 524, -1237, -570, -103, -405, 871, 1847, -23, -1411, -275, 112, -468, 847, 1819, -622, -2355, -346, 988, -163, 153, 1271, -376, -2062, -343, 1328, 499, 354, 881, -677, -1797, 236, 1724, 405, -271, 351, -696, -1689, 87, 1781, 553, -836, -518, -460, -724, 313, 1420, 773, -553, -896, -490, 182, 868, 1024, 367, -691, -1169, -498, 668, 930, 227, -227, -613, -1175, -515, 1103, 1230, -219, -705, -212, -551, -343, 1357, 1593, -465, -1300, -120, 176, -153, 978, 1246, -866, -1756, -133, 510, -100, 619, 971, -983, -1773, 259, 1130, 225, 431, 744, -962, -1524, 609, 1463, 187, 34, 215, -1163, -1330, 873, 1378, -290, -453, 25, -1099, -1067, 1199, 1490, -381, -628, 92, -748, -495, 1654, 1531, -914, -963, 366, -391, -645, 1457, 1423, -1432, -1645]
639a645K122k68q21J665K65k709l46K540J34j292J150M72k603n42K936N94k145
656d93K80J055j784j045K586J267k047p28J090o47q63J999J333j978j260J217
672a8K07q75J191J379j695j837R96J248n82M7R12q56j684O30J574n0m29L74n57
691b5j278N85J805J6j111q8R0q05J31J567L61j298p41K21J04K67R64J52j152o62
711h97M34L98K90O62J7j205p73O63R25J55j29l03p09n14N41Q91K84l74n81n63
731g88j1P13Q17Q1o70o30j51L89N36M64O2o96r15n2R00O06j00l49n26n23R2R03
753A52N70k38m64m39m12M47J141L28p82o25o3k2K73P78K51p33q48j07L91O26M94
774G18k37p94m37J77M88N94L29m52q00k58L48O02N04j0p83p81J54O12L24K07l3
$$ y = [-1645, 477, 209, -612, 1053, 1318, -1391, -1737, 803, 937, -355, 795, 1267, -1336, -1878, 1058, 1652, -493, -213, 842, -942, -1987, 599, 1866, -181, -909, 181, -466, -1329, 670, 2003, 25, -1235, -18, 189, -686, 505, 1884, 189, -1648, -652, 596, 14, 61, 973, 117, -1567, -937, 637, 587, 158, 532, -25, -1303, -718, 1087, 1103, -8, -96, -6, -811, -680, 887, 1248, -50, -791, -570, -466, -199, 765, 917, -235, -897, -463, -65, 225, 887, 904, -301, -1074, -411, 514, 669, 540, 237, -472, -986, -445, 446, 730, 356, -225, -788, -799, -86, 731, 812, 142, -488, -639, -250, 286, 750, 812, 116, -799, -851, 49, 655, 555, 206, -320, -843, -751, 152, 722, 484, 20, -419, -831, -384, 757, 1085, 303, -322, -385, -407, -134, 644, 895, 162, -686, -793, -402, 224, 718, 481, -313, -750, -573, -85, 509, 838, 386, -414, -672, -324, 278, 782, 772, -11, -792, -638, -26, 298, 505, 472]
795D72p61p12L15R17M23j18l71o50k78O17Q05L5l24l47n29k16O16Q77K2p97o61
816f65p5M57N00K01L2l31p38l55Q98R94k51o23j64l27k07Q81Q92o88q40K07j80
837c82m55R93J234j051j532O16Q22n82K53J355o32j821L77J444k77l91J003l92
855E82j928L10J958j70j221O85L27j676k55K097N86j519k68O40o45k79J571N31
873A326j443n16P07k67l81J258O64j542j079R21O39m36L48N85q09j067M82R61
891C51J85n8r4o90n24O70P81o9l13q4n18n19O02J004m9p24m31j06R1N73N96j76
913D98o03l06K2J21O39O43m75j055j57N59K49J30K87k28j020k51Q27N14j18R4
933C70k38r42n8J271M90p28j97L64p30n38J251J049j078r74M83L6m93Q00R59r39
$$ y = [472, -289, -1001, -686, 231, 654, 536, 165, -485, -763, -146, 659, 694, 370, 23, -506, -722, -106, 771, 793, -4, -665, -740, -283, 217, 418, 450, 119, -619, -974, -76, 918, 667, 44, -120, -447, -654, 227, 1119, 431, -409, -202, -382, -837, 156, 1390, 339, -1193, -577, 245, -337, -84, 1271, 639, -1182, -805, 639, 362, -29, 974, 582, -1346, -1036, 922, 752, -469, 216, 543, -1133, -1388, 709, 1295, -224, -492, 148, -497, -776, 795, 1326, -117, -633, 74, -193, -574, 684, 1348, -194, -1273, -352, 287, -149, 199, 784, -25, -1092, -610, 351, 536, 478, 384, -306, -830, -160, 621, 552, 239, 155, -363, -882, -280, 724, 675, -49, -480, -586, -495, 78, 674, 498, -105, -411, -389, -268, 371, 1014, 539, -516, -673, -114, 135, 265, 552, 324, -696, -947, -120, 394, 276, 370, 132, -810, -868, 403, 893, 165, -32, 332, -398, -936, 315, 1364, 286, -688, -205, -169, -662, 138, 1097, 158]
953A58j126N64N12m87N29J085r38j554P16J283m61m04R17k84j618J71J596N7q61
972a45K62m1j075J96J558J07j159M1M28p30r6J440M69j378o03O24N4j53O74L83
992H56j009p01M69L60J5M87J64r99o32P29P14r7r8P6n03n23M19P72J71l35m51
1013a16m65N5N98M16j54k93l35k96J29O34M85k78n10l32J7M24O16jn05k85r1j55
1035d42L21P87M4r89n19M39L52N1L56J00p55n14M92N60K1J81rp83n74Q44P93m07
1057C49l77K10l81o81N54J085k04q39j36J61j86L84P82j67q35j76L29PK44O34
1077G57j76j030l67O92M41p5j7o4n51l82M39P06J38l00m14k13N3L82N21J01n27
1098A14m96M6K08J94L73J65o98p48L34P52O0j77P2k29o52R5R42L11m19k93j07
$$ y = [158, -968, -404, 108, -379, 150, 1235, 297, -1257, -541, 742, 281, -123, 794, 510, -1108, -937, 659, 716, -145, 117, 76, -999, -803, 755, 862, -297, -256, 172, -558, -654, 786, 1255, -123, -726, -102, -48, -201, 473, 856, -153, -854, -385, -25, -10, 477, 641, -358, -990, -261, 453, 356, 258, 334, -169, -692, -273, 499, 670, 335, -116, -581, -526, 72, 488, 334, 41, -294, -590, -461, 173, 658, 380, -130, -462, -445, -21, 595, 594, 89, -196, -287, -442, -121, 666, 710, -279, -798, -359, -7, 44, 400, 500, -255, -769, -277, 283, 304, 485, 476, -307, -881, -37, 756, 349, -28, 182, -199, -880, -326, 759, 555, -284, -420, -259, -445, -61, 721, 554, -281, -457, -128, -121, 123, 757, 581, -449, -816, -124, 317, 242, 225, 161, -390, -772, -333, 373, 511, 211, -203, -416, -363, 19, 540, 641, 114, -382, -336, -128, 66, 439, 604, -94, -842, -508, 244, 304, 127, 199, -30, -682, -587, 355, 666, 247, -46, -153]
1119a53l06J72P75K28o32m13O5q2J31O06K57p20o30K09M35J96K15N2m14m97J22
1140c84M58M05L8l35m65j70K38L82L19p5n50m11J28L74K17K13j7o29m61M69O52
1161C96k4j47O0m40n18M48Q11n1n68j12p7l37L23Q14k3q06k14K73q6J90O73O9
1183F54r48l29N39K58m7L13J04p96n09N86N24p5j15n6m75l38N59N86p5k69j78
1204h7k81l0N03N34j55n00k78k2J44L57K96j30n20l22Q2M24L47j3l22k83j48J19
1226b85M45M07j21n18k93R5K22L44K23k85n61j31K85K47J29J90k87o21j08N94
1246b9L80p7p4j74m13n2N69M61k26l22j76k31%N72M23m03o01J9J61l4L30M68k79
1269B92p69m4N28J76P0K02k29p29NP23J56k32R2j33p07m6Q86L93o29k25K29l14
$$ y = [-153, -459, -287, 488, 716, 84, -329, -264, -346, -215, 391, 648, -72, -702, -493, -58, 138, 353, 405, -9, -506, -384, 74, 479, 517, 182, -283, -453, -215, 167, 486, 411, -139, -550, -422, -48, 169, 382, 365, -264, -725, -256, 396, 372, 225, 285, -155, -673, -225, 586, 535, -33, -145, -222, -559, -236, 578, 555, -251, -465, -192, -278, -88, 585, 654, -294, -623, -84, 174, 127, 440, 544, -252, -761, -175, 349, 274, 159, 103, -372, -710, -151, 435, 360, 91, -87, -368, -398, 105, 639, 484, -16, -294, -316, -172, 185, 481, 351, -169, -491, -409, 15, 362, 349, 27, -256, -404, -285, 160, 567, 446, -72, -365, -270, -48, 296, 519, 234, -327, -458, -173, 74, 203, 393, 106, -515, -623, -29, 351, 274, 200, 26, -387, -439, 130, 591, 365, 43, -133, -364, -364, 208, 631, 228, -373, -354, -193, -227, 103, 571, 292, -477, -521, 7, 183, 253, 455, 226, -503, -498, 225, 381, 149, 241, 108, -599, -645, 241, 634, 5, -220, 9, -305]
1291c05j92O97N77n57n61J34J15n2M53L96n73o65K15L63l1J66L17m41p28J41O84
1312A53J72j41k5j97l73Q8N53K92k10l40k34p7J78M01K40k85m87j76K58K32J29
1333A51J06k9n51l19M91O23j05l22j6j23l21K81O88l9n80j80M1q0J85O06p0p82
1355c45j93M81Q3j41M77K72q54n59P02N79l19j18K51m02n95N02P08k08m31R3j62
1376a79m47M46Q26k36p04L5K53k46J38P07m2p83k53M43J08M6L20j03p05j68M87
1397e7K19q2J46m6o15j62O01M02j15j60j24l23J7M61K26j05j65k89l10K49O01
1418C69pl88j48l7j94K33N47O8m85k25M7J5K89M33j38n66j22J94J9J58L73j35
1440C00o38k15M39K16K6J35j43n02q7M83L05p1m8j33l93r0N49L81k46l03j49j49
$$ y = [-305, -497, 200, 777, 220, -341, -207, -92, -144, 309, 705, 132, -533, -318, 45, 14, 180, 497, 56, -672, -531, 153, 325, 184, 159, -38, -411, -323, 230, 522, 312, -28, -262, -339, -161, 240, 480, 195, -292, -468, -210, 22, 151, 257, 228, -323, -642, -151, 472, 367, 45, 29, -94, -415, -134, 554, 515, -65, -245, -204, -284, -99, 507, 437, -345, -538, -57, 26, -115, 362, 634, -220, -779, -77, 502, 183, 65, 316, -86, -681, -179, 529, 321, -110, -17, -179, -626, -180, 646, 410, -294, -259, -6, -252, -114, 593, 551, -232, -485, -42, 66, 112, 432, 329, -376, -544, -57, 162, 80, 226, 180, -435, -597, 4, 406, 291, 131, 7, -316, -299, 162, 388, 283, 118, -171, -481, -232, 369, 362, -26, -174, -211, -405, -172, 375, 443, -42, -267, -220, -205, 84, 517, 379, -187, -309, -115, -96, 62, 435, 300, -338, -553, -114, 102, 128, 263, 120, -382, -469, 14, 319, 248, 200, 67, -326, -416, 133, 514, 268, -35, -184, -333]
1462c33O8M07K14j76l38j45l2K27M58O8m01k67O6N7J59L41Q3m69l50J07K21K32
1484A97J10j12m56k40L37K52L7J29m7n15k30N26M39j82j84N4k95l25M75N96k81
1505B85m78O8j1k57L46N96k69o34L7K83j06J42N49k09o99l8N20J0p0L18j08p43
1527d68n8O92J94l88J02R4n64k34P60M78n11k84K04j79k02M98M94m20m72J06N0
1548a08q5L77L35m43n42K18K50r2K06L09l90n79K67M80M8q9J20k38m20J07N05
1569B36J09j71j39k68j42K57L26%j31r0l16r9M79M11k88k69P0j42j41M48M56l97
1591A99m17M6Q1j28M06L32m83m92K66J90j93L52M11n62o39M68N16l47j4N38l50
1612A80q42L15Q63k16n08L46j6p26J99Q69q0o02J24J53n05J53Q98j25p92R2M03
$$ y = [-333, -265, 142, 356, 180, -158, -303, -335, -108, 350, 418, 17, -250, -184, -127, 32, 373, 456, -13, -363, -256, -35, 197, 307, 195, -261, -501, -164, 88, 125, 254, 207, -308, -538, -12, 427, 245, 61, 115, -180, -505, -30, 566, 285, -193, -125, -136, -393, -47, 549, 280, -354, -317, -34, -140, 2, 551, 342, -357, -395, 125, 135, 65, 383, 275, -468, -526, 166, 360, -28, 74, 168, -396, -630, 130, 608, 97, -187, 17, -162, -364, 134, 628, 208, -264, -158, -108, -193, 184, 519, 76, -466, -248, 2, -90, 116, 425, 35, -544, -277, 203, 251, 162, 282, 44, -376, -269, 236, 345, 174, 35, -233, -375, -118, 208, 208, 77, -13, -329, -428, 51, 462, 174, -95, -25, -167, -308, 140, 596, 199, -218, -172, -91, -219, 187, 519, 36, -456, -190, 0, -193, 159, 570, 8, -631, -163, 353, 6, -8, 530, 180, -662, -347, 516, 300, -208, 138, 122, -604, -405, 464, 384, -218, -94, 59, -446, -293, 605, 480, -312, -220, 183]
1633A83m09m5Q68j6j001j06P01j22l05N37K10q71k57O85J80k72K55J02o27k04
1653e14O92J87l46J56Q9o16j63Q05K13n96l5K79m47k39P33L79n91l13K99j12j12
1674b52N10K46n25k78K70m7k6M94O8o64k56M41N7j98L92J85o66l44N43L01j82
1695F9Q3J17m40k47L93L42j04j03k7l76j02N54J96l30p6O8l02j33N70L44m21l38
1717b63K09j4j68L95L39m01l92J65J22m6K50J92m56l54K54J64o0K21K00m94m05
1738e42M10M32j69p3K09k69m75L05N85j17l21K8q2k40J80M73n3l80n9L3j61K68
1760a8M44j64m79L5K01j08R3M27j43n55o1L57P8n2J93j34m25m5L47J53RL2k24
1783c9l37J68L50P3q6L1k29k87J96M51J1k84p5m9j94J60M13j0l66n2qq6K49L87
$$ y = [183, -226, -271, 597, 581, -420, -526, 175, 53, -252, 285, 495, -376, -633, 52, 232, -40, 215, 317, -310, -514, 178, 365, 19, 175, 264, -352, -515, 290, 503, -93, -128, 151, -296, -535, 198, 577, -14, -327, -28, -140, -252, 258, 504, -21, -299, -29, -76, -102, 392, 460, -204, -460, -19, 38, -160, 232, 417, -249, -593, -50, 251, 69, 152, 269, -171, -418, -25, 317, 213, 110, 83, -293, -395, 159, 355, 25, -51, 17, -285, -418, 152, 496, 75, -263, -54, -68, -236, 159, 498, 97, -295, -130, -8, -54, 196, 388, -68, -422, -168, -4, -64, 157, 357, -137, -542, -132, 300, 131, 58, 267, -2, -477, -172, 413, 296, -25, 3, -79, -319, -139, 334, 281, -99, -158, -125, -286, -18, 426, 262, -217, -182, 19, -89, 4, 431, 288, -267, -328, 29, 107, 55, 248, 114, -311, -356, -9, 144, 153, 185, -39, -376, -208, 142, 215, 129, 160, -69, -356, -160, 291, 302, 18, -57, -106, -300, -140, 273, 263, -103, -155, -163, -249, 0, 387]
1807C87j29l96l7J52q2J12M12j06o00n0L77Om4K24l2n09j13M52K06j60L6k4l13
1830b31j11M43K89k63j40N4k10j18M04K94l14l17P3L8o7J91L62k28m47K4K94O2
1852H2L3J60j20m35jL77J30j09Pr1l08l0M16J66k02j45J0j77OL69J97k74k21O4
1876i6J6l3K75J88k91k73M6J19O7J81J3k72k29J04J33J19J40l7l20j30K13J81
1898A14N1L6r7k78q9K64J67k9j9j24k57j1L56J43j54p3m6k53N7M01J76k66j74
1921a05J1m9L3L13J36l10k21O6L3O6K21M3l28j81J18J00P5J97J2l65j24K08J29
1944G8N9Q0n2l48p7K86J42l4kj12l35K8L69J37j83Okl53N1N28P3l76k2J28k25
1969a56j05N44J93n61k34L33j0k54M15L04n71m03M79J98l36K46L52m65n24N24
$$ y = [387, 258, -138, -175, -23, -105, 7, 419, 313, -287, -337, 40, 46, 2, 226, 194, -315, -428, 24, 230, 70, 106, 82, -231, -342, 101, 390, 127, -13, 41, -169, -287, 117, 411, 97, -220, -147, -109, -176, 15, 377, 149, -298, -274, 20, 82, 115, 275, 155, -280, -281, 96, 226, 117, 124, 33, -275, -305, 111, 277, 75, -70, -60, -237, -231, 138, 335, 61, -160, -96, -80, -113, 162, 350, 59, -214, -168, -49, 18, 199, 212, -60, -289, -185, -52, 67, 207, 170, -150, -280, -67, 114, 165, 201, 104, -174, -263, 1, 168, 139, 120, -4, -261, -272, 84, 227, 73, 0, -46, -299, -242, 159, 335, 69, -105, -94, -143, -110, 203, 339, 29, -192, -126, -93, -27, 194, 237, -91, -272, -154, -54, 21, 218, 230, -135, -259, -51, 78, 137, 217, 165, -183, -260, 26, 168, 134, 132, 20, -315, -287, 82, 219, 36, 42, 40, -313, -262, 266, 339, -37, -59, 69, -156, -261, 283, 476, -85, -319, 14, 4, -250, 165, 469, -102, -505, -26, 172, -164, 82, 434, -31, -555, -31]
1989c1M31m16n9M49l09o48M20O78l76m06L63J0n82J55Q04j95o15K11K80m14K7
2010b23O63m9p04M1M86k54j70N49N9p36j05N88k6k86L12J78o03k27O18K15l68
2031d2O1K24l96k42M98L20l56j54J59k31j57M18K67l41k53J69n2j33L45K58l26
2052C6k96J67J13p5J94J99k74l52J67K33m8L8P5k47k24J83J74M1j3J3k62j15K31
2075d2K35m0o6m6j79q4K48K22q2j62q0j01J3K20J69r8j75j06p3J48K52K0k06p7
2099i0K0q2J18L20k6l18r5J09jL6K42o9l18r1J73Q0L1J83o9m18L5L12M0j05J66
2124A83lm60m5M92J00l28P9J21l62j53N16J97l90j12K20j75j70M30K85m42k15
2145b32K65k9j94L64K84n06l16L73J20k64J77L25l96m75L77L88k36j07K66j35
$$ y = [-31, 400, -16, -75, 374, 65, -583, -163, 515, 139, -267, 96, 106, -476, -321, 483, 288, -327, -116, 164, -250, -223, 440, 391, -313, -272, 214, -40, -210, 339, 398, -338, -443, 145, 119, -167, 145, 323, -280, -507, 111, 326, -42, 19, 243, -153, -395, 103, 423, 67, -87, 72, -159, -316, 102, 369, 28, -225, -56, -108, -241, 104, 362, 36, -260, -93, 20, -55, 139, 338, 64, -288, -121, 112, 64, 102, 177, -70, -294, -111, 63, 104, 91, 104, -158, -273, -42, 193, 153, 87, 41, -138, -222, 26, 248, 166, 4, -76, -177, -164, 56, 225, 127, -48, -154, -227, -79, 173, 193, -13, -90, -70, -152, -34, 286, 260, -58, -153, -44, -45, -9, 233, 164, -154, -245, -72, 8, 39, 222, 153, -265, -230, 82, 122, 17, 183, 180, -280, -325, 167, 267, -61, 18, 139, -223, -376, 140, 337, -53, -165, 55, -120, -290, 140, 425, -17, -232, 33, 4, -190, 174, 458, -48, -364, 9, 129, -135, 42, 367, -29, -504, -127, 261, 25, -82, 184, 49]
2165D9l91J88M29p2k21O5n7k28J74L39r8k60K7Mj72J35L71j02l29l7J84j5J3K21
2189B17rk98j47K13J24L9Nj08j48o4Q5J38Q7j8j95j57J07K01J5j6N3j67j80J08
2213a15K68P4j52j03q2n0Q6K04Ko8r8j68KK54J60j35j54j1L8n5J09K71n0l43j06
2238b22K08Q1LK9J3k31j22J30K14K4l8j49j50Q3J52N9L5rj23k07Q5K55J09j55
2262G4j36K9q0l4K23J62j44k54mQ0J04R1L7j16j37NK3J74J29q3j99r5J08J15l
2287F9L1K8j91k16J20L19K3k03p9N9m3m3K43J25j31k40k0J23R4N7Nj19j59nQ7
2312f6J08J40o8k28j38J88J40jJ2rj21j80J39K64J4j66n6j8o5J6J82R5j41j99
2336a58m6J33J23O7n0q6p0n0L5K14J14j41k06QJ10O2K1O4j04j62q7J11J90R6j32
$$ y = [49, -342, -154, 275, 203, -18, 47, -10, -238, -64, 275, 177, -83, -56, -52, -224, -89, 282, 180, -149, -186, -2, -17, -4, 217, 208, -90, -237, -24, 100, 139, 144, 36, -112, -176, -91, 47, 134, 116, -79, -236, -129, 72, 87, 71, 124, -43, -223, -115, 153, 227, 75, -28, -110, -160, -74, 130, 132, 64, -34, -202, -200, 54, 214, 79, -75, -86, -48, -103, 6, 277, 227, -116, -222, -14, 67, 70, 99, 112, -119, -241, -111, 103, 127, 89, -60, -210, -127, 25, 84, 119, 110, -13, -220, -135, 120, 229, 74, -62, -33, -113, -147, 76, 238, 94, -160, -164, -84, 20, 111, 148, 32, -105, -100, -77, 97, 226, 143, -56, -151, -43, 72, 69, 100, 128, -63, -279, -159, 160, 183, -20, -99, -40, -83, -126, 117, 242, 111, -129, -149, -26, 68, 125, 130, 11, -148, -153, -66, 42, 182, 114, -114, -252, -64, 76, 75, 87, 78, -43, -223, -84, 180, 194, 28, -28, -46, -111, -95, 87, 182, 41, -158, -204, -71, 52, 119, 69, -17, -87, -137, -102, 112, 226, 85, -121, -113, -3, 59, 80, 144, 40, -122, -209, -98, 92, 188, 56]
2361E6j73k6J29L5j4J83m0k75j29K59K05j22n9K1j06j56J51K23n4j28l6j07K0
2384a43J81J72j56j16Q0j20l9K52J90k75k06J65L7j05J09K39j87l19O3K40Rk5
2406D6M0n2k14M8K04M7qJ0j42j77J43K18k5j40K3k3j73N0K66N5k44j10J04j1k4
2431h9J80J01j53j55j8J66P3J4j2j32r1N3O9Q5O4j23j71j7Q1J56L3n4r4o1k3R6
2457b2J43P2j12k00rJ50N1qK4j2j77j35K10K16r9j68M2j8j20J21K54m9k29j0O9
2482a6n2R0J92r6k48J5J07k8O0J87j04l17RK61K2r3J19Pk41p2K56J59j70l9J8
2507B6j42m3J92J62j36j10po4jJ88J04j76p6Oj3M9J62Q3k09j06N5L3O6O4K3j96
2533f6p1N5M1J11P1j23j76K5J25K3J1J23q9k26RK37M8r4P1q4j99M0K34M4j24J
$$ y = [56, -117, -143, -14, 21, 7, 190, 150, -125, -254, 5, 210, 88, 29, 50, -56, -212, -61, 162, 108, -20, -56, -163, -143, 38, 210, 54, -62, 18, -102, -141, 111, 301, 26, -180, -15, 22, -83, 26, 265, 78, -241, -178, 62, 71, 46, 86, 34, -180, -132, 72, 119, 111, 121, -21, -198, -55, 163, 138, -2, 21, -2, -175, -125, 141, 196, -48, -158, -54, -65, -89, 91, 192, 39, -116, -134, 32, 105, 119, 107, -25, -116, -63, 6, 91, 155, 32, -139, -156, -75, 81, 114, 60, -34, -95, -118, -22, 121, 193, 81, -119, -128, 22, 73, 65, 89, 77, -100, -235, -25, 191, 92, -76, -34, -52, -172, -51, 203, 154, -75, -85, -16, -68, 22, 214, 118, -130, -115, -8, -36, 24, 211, 107, -210, -201, 60, 82, -11, 108, 115, -126, -198, 58, 217, 47, 8, 26, -116, -159, 33, 195, 59, -51, -58, -122, -123, 65, 169, -7, -83, -77, -90, -41, 121, 204, -5, -111, -56, -23, 43, 107, 130, -66, -137, -82, -41, 70, 141, 18, -158, -133, -8, 15, 26, 149, 60, -166, -157, 80, 128, 34, 105, 21, -178, -138, 96, 140, 16, 17]
2559A7k9j68N8K69N2k57K9J8j22MK93Q4l13r8K03l2o4J93N4k39j74K01R0j03Q5
2584E1J07k25j86K18J83o7n5O9j39j87J75K51p6j76Q9p0j32J23K88q6k99K3J52
2607C1r0L1J99Mk92k8J83qJ5J06k9k36n3K07P9p2J5k4j77l0J98J24j03p2K0q9
2633i1lJ21J44n8j40m2J2j3J33O5o8j49k4N3N1R5Pn0j45m8J21J09Joo8r4j1J32
2661C4R8k7o5j19nK3J13O4k3j32m1j3O6P4P5p3j09l5J4J17L6M2p7j27NJ11M7K5
2689I8j2j18r5K7J28M5J7m7q2o8O6J42om8o0m6n8J02J70%j38n7Lm0O8J36m6j44
2717f3n8M6M2N8P7j2j62o4J10O5M1J5m7j53k1J00J05Nm6p4o4j2J05R4K5r8r4m
2745h4M6Q1M8Mq5q1kQ6Q3J3m6j04o9L0J31O1q7l9l3o2N0J33N4p8q0l1K5PJ19M5
$$ y = [17, -12, -180, -122, 147, 199, -58, -29, -11, -133, -129, 164, 248, -65, -163, 40, 8, -56, 137, 191, -48, -222, -21, 69, -34, 51, 158, -67, -253, -35, 148, 81, 26, 95, -44, -231, -56, 195, 119, -57, 32, -38, -170, -47, 241, 155, -144, -121, 31, -59, -28, 171, 175, -117, -145, 38, 30, 45, 151, 122, -114, -167, 40, 119, 47, 62, 38, -139, -169, 29, 153, 50, -22, -2, -91, -94, 27, 171, 113, -27, -69, -57, -70, 63, 128, 60, -89, -113, -60, -9, 86, 93, 43, -102, -150, -29, 80, 81, 75, 7, -87, -98, 34, 132, 105, 40, -79, -84, -61, 52, 116, 93, -39, -80, -93, -27, 47, 122, 49, -60, -95, -81, 36, 72, 114, 37, -90, -85, 26, 73, 98, 86, -32, -127, -100, 28, 73, 90, 43, -39, -107, -41, 101, 95, 47, -13, -59, -117, -15, 155, 155, 17, -40, -37, -77, -9, 127, 81, -63, -121, -75, -33, 25, 102, 90, -72, -136, -26, 39, 80, 95, 48, -105, -126, -26, 79, 84, 38, -36, -100, -112, -7, 87, 112, 14, -80, -84, -38, 43, 91, 95, 10, -71, -73, 13, 96, 109, 63, -41, -110, -80, 51, 112, 25, -14, -47, -109, -59, 74, 128, 50, -30, -61, -36, -29, 90, 135]
2775A35j23j09L5N2J0P3L7j25j46P1J12K6nL7r1j02N0J56L2o0n2n1k9JJ43N3j26
2802Do4j9K7J2J04J6j05r3N6M3O7L0K6j14j08M5J31M7o0J2j03n7M6J02O7j18m2
2829d8%o1P8J14K5p4j17l2R4O2M1J9p5j35NR7R0j4m7o0q3L7R4R1o7m6m8jQP3J12
2860A32p5j26RL8pO7R0r0j34j8J17j1M0L9m3j33j0J54J1nj3j7j23M0J38L1q5p
2888Ik9q5N2J04Q2j21o1j0l5O2J28J4j18o8LN8O7M7lj23o2N1L3Q1Ok3j13j9L1
2917d2M8L8N8j03q1k1J26K9J4Mr6n0K2R0O1k4m6r1l8O2O5N1m5o3m0k1R0P8J8j19
2947b6k0nJ7N6Q6j8r6p6PR0M0K8m1j01n1P1Q9J7j7n1q2pQ8O1Ql1o8qNJ4J01L6
2979A16j32o8L3J4K5Q8J6j24o2K8R4J2K6j1r5o1K9J17K8j9m4o6p2Q4J31Mp3p9
$$ y = [135, 12, -97, -62, -10, 0, 73, 110, -15, -161, -90, 22, 48, 43, 80, -11, -113, -63, 93, 125, 65, 13, -38, -67, -66, 77, 130, 4, -60, -79, -52, -40, 64, 80, -25, -118, -62, -19, 48, 78, 104, -10, -118, -73, 58, 105, 45, 57, -46, -103, -57, 45, 112, -6, -48, -48, -109, -31, 83, 108, 34, -83, -115, -21, 41, 82, 101, 26, -109, -104, -7, 83, 69, 22, -38, -121, -84, 10, 101, 34, -12, -60, -61, -53, 20, 132, 57, -69, -60, -22, -29, 38, 128, 38, -96, -114, 3, -8, 32, 71, 28, -105, -115, 39, 50, 45, 32, 15, -108, -68, 70, 101, 16, 9, -20, -105, -53, 51, 133, 12, -49, -59, -94, -32, 96, 110, -8, -76, -73, -15, 52, 99, 96, -27, -89, -38, -5, 76, 82, 59, -54, -73, -42, 6, 44, 102, -1, -82, -103, 23, 52, 66, 70, -26, -76, -54, 36, 97, 73, 27, -64, -102, -40, 25, 76, 31, -32, -72, -93, -3, 75, 93, -26, -46, -51, -34, 22, 108, 90, -6, -82, -75, 15, 55, 83, 42, -59, -110, -39, 50, 67, 50, -1, -83, -90, -2, 59, 67, 36, -32, -40, -35, -21, 80, 116, -16, -84, -51, -37, -12, 76, 92, -32, -94, -66, 28, 40, 66, 55, -40, -101, -72, 45, 73, 54, 10, -56, -128, -44, 87, 91, 18, -61]
3007f1j0J5L2J12J6j18p2M9K0O1M8mj10p6K6J06L2Jm4o6n2N6P6Nkm8n0j9P2P3
3037F8L8r2k6j6j9N1R1pj07k4oQP2L9k3q2j8rP1K4N7o1r1lQ0PM0K0o1p9n6J18
3069DP5k7l9n2n7M1R1L7m1l0l4k4K3J22J7j06l2Rl2L8J26mj74k0M8L6j9O7M0j04
3099b1o8M0P3j7N9Oj07r1P5J69p0m3K1n4o8Q6J30m9r3k3K1n5Q7J20o1j08J5L4
3127Hl6P2M8qj47kM7K8j2M6oj14lQ1K4QQk4q5k4J42L6m1m7rj4l2P1R6r6l7%rl3
3161f4J08O6q5o5J0mL1O6J3o4q5O6M3k0L7M2j29n4N5O5NkK6j16o1R6P7l4j0Pm2
3192b2p5J07J01o5p1K3Jo9Q3P7l2j17J2J6rM7R3l4j62mQ2L5J8M9k2j34LQ9K4l2
3222A2N3o1r5J5J00N3n8k8Nq0lJ15O2o1p2K2J4m2J10M9q9q5K8M0pP8J9j09o0L6
$$ y = [-61, -71, -56, -24, 88, 104, -14, -86, -37, -17, 44, 92, 88, -22, -98, -72, 34, 66, 67, 23, -43, -95, -39, 37, 42, 40, -8, -58, -77, -5, 68, 106, 14, -12, -28, -47, 4, 95, 88, -19, -43, -49, -41, 31, 70, 47, -35, -53, -62, 9, 33, 90, 29, -62, -65, 15, 22, 62, 82, 21, -58, -114, 4, 79, 52, 13, -39, -96, -55, 36, 73, 32, 2, -32, -56, -33, 89, 106, 0, -32, -23, -55, -17, 109, 105, -69, -89, -41, -5, -24, 43, 83, -21, -89, -49, 24, 7, 66, 72, -35, -126, -51, 118, 48, 5, 26, -28, -96, -10, 120, 71, -22, -45, -24, -79, 8, 128, 67, -41, -26, 8, -28, 44, 92, 84, -63, -65, -18, 10, -2, 44, 38, -76, -79, 2, 26, 34, 42, 18, -67, -91, 51, 87, 46, -1, -10, -24, -56, 15, 111, 15, -22, -22, -31, -64, 44, 110, 25, -40, -30, -34, -3, 63, 76, 12, -73, -7, 36, 16, 53, 95, -34, -88, -33, 32, 37, 35, 61, -55, -116, -20, 57, 23, 13, 20, -22, -97, 10, 111, 46, -25, -2, -1, -70, 13, 90, 58, -59, -47, -31, -40, 7, 100, 66, -96, -100, -18, 17, 35, 84, 62, -72, -69, 20, 44, 12, 65, 4, -91, -76, 24, 77, 19, -9, -4, -84, -87, 28, 90, 29, -43, -21, -7, -49, 61, 110, 21, -64, -36, 4, -3, 75, 94, -15, -75, -39]
3252c9L0K5M2J3j10p2Q5P0kJ3k3n0n2O1P1k6l5lm1n0N5R3po2n5L8j8M8O4j6p6
3283b9oK3pP2J0l8o8k6M5J7N1Mn2n4j9L9N1K9l2j7n3K4M2L9j4pl8m9N1M4L5m8
3315A9p0qJ3N1L6K5o5n8KK1L7O6L3q6m9j0N4K2K6jq7l9N1M5Qj1J6q6kK8O4rl1
3348Ej4n5kO5R1l3m7k1l8J8M2N0j3n9j9qJL9P1o6m3K5j3J4O4Qn4n5L0L1J3L6j8
3381D5o6k8J9N5J4k8K2p0o4N9P3Qk4jm5k6O4P2l7m4j3k1j4O1O6j9j06qM0k9O5
3412B0L8k0r8j0P7kJ5N4l0q3j3N8M5Pl4l7m2j0Q7L3k3m9K4m5J7M1N2n3m3Qj8L4
3444@N2j6k3n3KkP5J9k5po3j4K9N7K4j8o3j4K5L3M8m0k9k9j1J6O0J1%p0l5oN8
3477iN5j0n8j3j6LQ3L4m5k7j4NjM8J7m1o0NJ6N6RRl3n4pN7L0K5%m7o0L1K6L4N
$$ y = [-39, -9, 16, 58, 71, -39, -111, -26, 44, 42, 55, 32, -18, -70, -9, 62, 36, 1, -2, -43, -93, -38, 55, 48, -14, -69, -31, -49, -1, 63, 47, -29, -35, -12, -19, 53, 63, 25, -43, -69, -24, -7, 44, 48, -4, -58, -77, -38, 13, 42, 10, -7, -60, -36, 6, 45, 31, 24, -14, -63, -12, 32, 67, 19, -51, -59, -46, 5, 41, 66, 1, -57, -55, -34, 3, 69, 102, 16, -33, -43, 11, 33, 59, 58, -29, -68, -17, 28, 36, 25, 41, -45, -47, -19, 45, 36, 5, -9, -64, -66, -1, 90, 57, 10, -11, -49, -31, 11, 61, 48, -11, -30, -38, -37, 2, 73, 7, -36, -11, -24, -10, 54, 62, 8, -47, -17, 14, 27, 63, 45, -21, -49, -30, 25, 39, 11, 33, -37, -101, -42, 31, 39, 15, 14, -31, -57, 7, 79, 42, -2, -15, -36, -50, 11, 77, 58, -48, -56, -16, -45, 20, 58, 38, -60, -70, 7, 5, 20, 74, 44, -39, -52, 6, 51, 58, 24, -13, -55, -65, 22, 55, 32, -17, 7, -38, -21, 20, 72, 19, -24, -16, -34, 0, 52, 36, 13, -40, -38, -40, 35, 54, 29, 22, -41, -55, -26, 31, 55, 37, -26, -40, -15, 18, 66, 26, -3, -32, -43, -27, 33, 44, 44, -26, -61, -67, -9, 46, 36, -22, -35, -51, -48, 35, 69, 24, -3, -17, -12, -13, 35, 52, 11, -49, -44, -28, 28, 37, 46, 13, -41, -48, 9, 39, 64, 64, 17, -43, -12, 14, 48, 53]
3512E3l2m5k5N0K1J3J1o0j7l9N0M2pqol7oN6N7l2o2k2M5oJ7N1k7p6K0J5mM9Ll9
3546Co4RL8N1NQm3o0j0R3K7l2j7k1m8K9M8L8o7k3L0l1NR2Kp7k5J7KMO8j7m8l4
3580d8K6MQN7%o0n0M8M9j2RJ3n9o1P3L8j0k1J3j8m6N2O6n3l7jj2k1M8L1jm4k6
3613d5L2J3RN4j8r3JO4k0jL9j2n0kM7J1J3n0Jl0l3P1M4k6l1J8m8J1L7K1rp3L1
3646b4J3pN8Pl4n2kL7qL7Qk7n3J5N9j5K2Pm5m5M5L8K7n8Qj7n0K8N3J2pl8k4LJ4
3681a5O2K5n7m1PNL8K7k1m6l2N2%N2k0k3m1l5N3pL3Om7k0K7J1M9j0j3j2m0K1K0
3714HJ3L9m2p1KL5K8J0ok7l1KN8J4%k9j2k0j1O7M3n0l1J0j9J0M7pmn6mL6J5J7
3748C4J3j8l7KK1L4nj8m5j7ML8J9K5l8l6j9lQ4J6m8Ll9LK2K8J9m6NKk2L3K7km3
$$ y = [53, 21, -24, -49, 1, 22, 35, 46, -14, -31, -70, -20, 22, 15, 7, 1, -36, -42, 14, 71, 39, -23, -45, 0, -6, 11, 62, 35, -41, -21, -6, -10, 39, 42, 3, -61, -52, -14, 37, 42, 50, 7, -53, -63, 30, 57, 25, 8, -13, -61, -32, 16, 54, -13, -36, -6, -37, -32, 60, 62, -15, -40, -23, -21, -17, 51, 34, -14, -48, -22, -18, -10, 47, 47, -13, -63, -15, 34, 22, 31, 44, -15, -76, -3, 35, 25, 4, 17, -1, -47, 5, 71, 18, -19, -20, -32, -53, -5, 26, 25, -19, -45, -13, 0, 9, 63, 45, -48, -47, 17, -3, -4, 35, 23, -27, -29, 18, 29, 42, -8, -7, -37, -70, 1, 45, 19, -12, 6, -42, -31, 6, 27, 18, -55, -24, -11, -18, 40, 47, 13, -39, -41, -4, -12, 25, 33, 6, -47, -32, 27, 12, 34, 41, -4, -49, -4, 34, 61, 3, 11, -6, -56, -28, 25, 37, 30, -8, -32, -29, -15, 47, 72, 15, -26, -19, -14, 24, 51, 30, -16, -48, 4, 4, 56, 36, 13, -28, -63, -10, -17, 16, 22, -25, -45, -18, -7, 42, 32, 19, 7, -33, -12, 8, 21, 60, 18, -53, -51, -16, 12, 22, 16, -11, -42, -40, 18, 32, 32, 3, -9, -29, -40, 27, 70, 20, -11, -1, -20, -10, 37, 30, 26, -30, -34, 2, 17, 34, 47, 29, -8, -6, 15, 49, 44, 26, -19, -36, -32, 6, 25, 50, 12, -24, -43, -46, 38, 54, 6, 9, -30, -27, -5, 23, 42, -4, 1, 3, -19, 14, 41, 39, -4]
3783dj0qL7olK1l7l6J5Q3qj6k9K9l4l5Q6J0ol0j8j6j3N5L1q1kpKJ9M9J9p4lmJ3
3819a1L3qL0m2n1M0QK3k3J7k1k8L0L8Qn6k4%J2L5RL2k7j6l4pQ1l0J6l9j1J0J1
3852EoN8m2o5J6K0J9K4J5k5n1j2L6L0L0m3k0J3l0M6pK3k1rm5MN5J2Ln0J1l1L5
3885bL3Jk2k5nOML3K2l9l1lK2J5L7m6n0j9N0ON8j2l2j8rK4M5mk1j0l4J8J4LJ9
3920B8j9m1K3NK2J6rk6j0K3j4J5K7j1l8j5QK6Qj9Pol3J5N0J0o2pJ2j9J5M2ljm9
3955c0Qj6O2J7l2k9nJ5KNJ1ml4j1L5J8mL%l0RRL4K1m2k0l5J5K6JQok2nJ4K2L6
3992D6%o1j9RL5Rj6Kml2KL9QJl2j7JK5K6j0lj5oj2pM6Pj6k8PJ3J5QPn1kJ2J5J5
4031A7qPl6l0M8RJ1Nk8jl0jQ0k1k2J1jk1K4J4k1j1k8J3OJ6kmqj4K5K2j7J1K4l0
$$ y = [-4, -14, -22, 15, 9, 6, 27, -10, -46, -31, 52, 44, 28, -1, 28, -6, -41, 45, 55, 49, 19, 1, -15, -28, 27, 58, -23, -25, -32, -30, -11, 38, 57, -17, -20, -24, -11, 22, 14, 44, 2, -49, -9, -1, 22, -1, 16, -5, -33, -3, 35, 43, -13, -37, -37, -25, 10, 19, 51, 24, 8, -26, -33, 48, 18, 34, -5, -16, -6, 5, -1, 57, 15, -50, -34, -14, 5, 29, 44, 19, -32, -44, -8, 22, 52, 9, -11, 2, -28, 18, 11, 34, 13, 4, -41, -37, 18, 30, 33, -17, -6, -37, -2, 31, 32, 10, -15, -20, -14, -10, 23, 45, 6, -25, -28, -6, 9, 46, 0, -50, -69, -19, -13, 45, 33, 1, -17, -26, -2, 43, 39, 18, 8, -26, -8, 6, 9, 28, 9, -32, -9, -4, 18, 34, 25, -1, -11, 12, -2, 13, 40, 29, -9, -24, -16, 10, 18, -1, 6, 0, -33, -18, 32, 42, -20, -27, -15, -34, -19, 23, 20, 19, -30, -22, -38, 24, 41, 9, -20, -25, -10, -8, -3, 8, 4, -30, -41, -6, 12, 8, 11, 11, -19, -10, -1, 33, 54, 12, -8, -43, -28, -2, -1, 7, 1, -21, -26, -12, 10, 46, 46, -15, -34, -25, 10, 19, 3, 5, 1, -31, -29, 10, 18, 19, -13, -30, -29, -4, 22, 12, 9, -6, -12, -24, -31, 15, 22, 6, -22, -15, -2, 13, 21, 28, -23, -25, -13, 2, 17, 9, 16, -20, -50, -2, 7, 18, 23, -5, -6, -36, -37, 43, 22, 0, 11, 10, -11, 13, 27, 6, -5, -33, -20, -14, 2, 0, -4, -12, -26, -1, 21, 4, 15, 39, 9]
4067Ik7L6N%Lk7j1l6J8L9J5m3k3M2J7k1K8J5m3Jj9M2k6K2qk9K1Lj6K9jj0k9LM1
4102B0RPj5k9l6kM2J4j2K4l9k0J3O1Om2nm2L8j0JL7l8k9M2j4%P0k4o1K6J7j8J1
4136Bk5L7k8JJ0jNJ4k4J3j7J5J8Lk1j2j3K4LQlj3kRk2J9K1Kk4mk0K1QJ1k2J8k5
4173a4lPJ6K8k9l4RJ3O7m6J9m3j6K7j0K7%k1%j2jL1qMrj2kj4L9Jk4jk4RJ0M%J4
4211Bl0JM0J3Lj3k8k3K7KJ6kl7K8j6OkMK0k7jJ0JJL5l3%l2J0L2Ql9J5k4oL3K6
4248B0j4j2K0l2pK7Jmj0j9L4l6M8J5No9K5qML4j1Mk5k0L6nJ6jj7%l3K0J3Rj0L
4284Aj1rM5k0mj2LM%NL4k2j4OmlK0Rmj8k2K3j3M2k7j3%Jj6L0J4nk7j1J8QJ3K7
4322D8n7Oj3JL9nj2l7pK9K0J5oj9%j0j7M9Ml7kmNJ1J2K4k5j7nK1lJKk5%JLM7m3
$$ y = [9, -18, 18, 23, 23, 26, -1, -12, -48, -30, 9, 24, -19, -42, 0, 17, -4, 24, 39, -4, -3, -22, 20, -6, 16, 8, -21, 0, 3, -13, 16, 15, 5, -24, -21, 20, 29, 36, 21, -8, -44, -46, -4, 10, -2, 22, -17, -37, -24, 37, 43, 1, -4, -46, -8, -18, -17, 20, -18, -47, -5, -19, -19, 51, 27, -34, -8, 9, -9, 2, -23, 14, -14, -13, -3, -4, 1, 15, -9, 4, -13, 2, 20, 23, 2, -10, -23, 1, 4, 12, 9, -4, -6, 3, -19, 0, 21, 23, -1, -5, -25, -4, 4, 15, -7, 11, -14, -17, -10, 6, 34, 5, -29, -20, -7, 60, 14, 33, -10, -26, 1, -9, 18, 18, -3, -3, -15, -16, 15, 7, 11, 2, -10, -12, -26, 13, 14, -10, -11, -35, -26, -16, -12, -12, 2, -28, -27, 13, 26, 29, 16, -12, -35, -8, -6, 10, 8, -29, -1, -17, -11, -13, -9, 11, -16, -17, -7, -6, -5, 30, -3, -3, -35, -25, 7, 15, -24, -9, -33, -39, -6, 20, 6, -6, 14, -18, -25, 2, 3, -1, -11, -30, 4, -32, 16, 31, 36, -33, -8, -16, -12, 22, 11, 15, -10, -30, 6, 1, 17, 16, -1, -1, -34, -14, -1, 8, -2, 1, -10, -19, 26, 6, 2, -10, -7, -3, -3, 2, 36, 14, 0, 6, 2, -1, 19, 28, 24, 6, -16, 7, -6, 36, 9, -4, -4, -3, -19, 11, 25, 20, -7, -18, 0, 8, 21, 48, -9, -3, -16, -15, 24, 19, 7, -30, -37, -8, 12, 27, 21, 2, 2, -8, -25, 24, 28, -9, -11, -15, -10, 1, 13, 37, 12, -5, -10, 11, 8, 9, 11, -14, -14, -13, -10, 37, -6]
4361fK4k1qlJ5qJ3oJ2k0J7Rrk7mL7k1jL0j5j1NPRj0pL5k7Ml7J4K2j7J7on%K1m
4400A8pjPl5J4Qj2Qk5JNjM7j4Nl8K5rRPJ4l6rOK3mj7Rrj1J8K8ok0%l9K7J4J4N
4440A9k0Nl8M4kK1j3l0J5oj1M1Jl9Lk7K3J4K4Lj9j0JlK2J7k8J4k5Qj6J1M8l4j6
4475cKJ1Oj2Qj6j5K0J6K6k5k0J9m1J2J2J8Rk8J9l5M1l8K3J1k1qJ2J3kkJ1k7K8
4509B4l6MK3Qoj7Nk8J7K5mj1Nl2L7MKrrj8J6J1kmj2mj5M0nj2J6k3KMK2qolmk6
4549b9M3kk3mKMMRJ7oj2k3J1lK4K0k7pj9K7NlqJ3kk2NJ5pJJ0l9K9j5J8j9M0m3
4587a6KJ1MJ9Mk6K1j8k1J4J3omJ3j3J4K6rk4%j3L1k9J5k7J3j0pL5%K1k8Ql9K0
4622fPJ1qj3k0J6J5J7j1K2l4lLj5N3k0%J7l2j8J7L9l0PnJ3lLMm0lj3K5pJ9jjJ5
$$ y = [-6, 18, -3, -11, -14, 1, -7, 6, 0, 12, -8, 9, 18, 9, -18, -22, 15, -6, -7, 23, 8, -3, 2, 9, 18, 8, 1, 36, 9, 13, -24, -10, 12, -5, 12, 6, 1, 1, 22, 18, 11, 10, 17, -18, -4, 4, -8, 0, -25, -24, -19, -20, 27, 13, 18, -20, 5, -4, 5, 12, 26, -10, -19, -13, 10, 6, -11, -2, -11, -22, -4, 24, 18, -2, -2, -41, -14, 0, 14, 19, -1, 4, -34, 10, 8, 29, 16, -14, 1, -5, -16, 25, 26, -13, -10, -37, -14, 0, 24, 27, 8, -2, -1, -4, 18, 35, 7, 21, -4, 4, -12, -1, 47, 13, -3, -1, 10, 16, 4, 12, -4, -19, 1, 17, 43, 18, -2, 17, -24, -12, 0, 18, 27, -1, 18, -17, 24, -14, 9, 20, -1, -9, 3, 16, 14, 12, 23, -4, 24, -12, -8, 15, 23, 17, 0, 5, -23, -6, 19, 15, 4, 9, -23, 14, 18, 20, 11, 2, -16, 0, 11, 9, 5, -7, -11, -26, 14, 9, -3, 13, -10, -8, -4, 18, 10, 4, 1, -3, -29, 14, 12, -11, -15, -13, -9, -5, 4, 21, 15, 3, -20, -9, -12, 12, 32, 5, -2, -21, 6, 11, 8, 0, 13, 11, -11, -6, 9, 2, 3, 13, -26, 3, -12, 6, -13, 27, -16, -14, -3, 1, 20, 24, -2, 19, 1, -20, -6, 7, 1, -3, 10, -3, 11, 37, 28, 4, 4, -9, 22, -7, 8, -19, -6, -16, -23, 12, 12, 33, 5, 13, -26, -6, 1, 12, 4, -9, -29, -13, 2, 19, 8, 30, -4, -7, -4, -19, 34, 14, 14, 31, -1, -19, -2, 37, 7, 14, 9, 22, 19, 22, 26, -14, -17, -30, -5, -12, 7, 6, 5, 20]
4660B0m0j8O2qPl7J2mL9rk9K2l4PJM5lk5k2J3K8k2M3l7J1l4J0K1k1qL8j4j8pK6
4695A5nOqlmnK4J0n0K6J7j4n8N2Mm2K5K3k8J6J6k1J3l2jJ6K0mOn6L9J6Pj3J1P
4731B5j9LjmKl2J0oJ8qL1m1K4j4OPMJ4l2J4Rmk1L3k9M2n0J4j0L5pl0J9lOj7LJ4
4769EK0l2KJ0m0M3OQj9nQk1K0J4k6%Kj1J7j3pM0m7K8J5j8RkJ5m0L2oL1l7j6L2
4805A7oRl1Qj6PlK3j6J2J3Pk3j1K3j8LJ2Om7N1l1K6Qk0k2KMkRj6RJ2j2k2M1Kk4
4843a6K3k1K1j3jJ6J2j1Jlj1NjJ7l5K9j0lj5L0kj0j9J4K7m0J1MpK5mpLl0M7n1
4879b5L2%J1k6K3k0Njk3J4Pk2Qj0M0pPj3Mj2Lqj0J2rK3j3Nj1K5l1K6qJ6k5J9j6
4916a0L3l2J8j4K6Ok2m4K1N0kl6j9K3j0oL8pk8J1MJ8j9K8k4j1kmK2j2KJ1jl0J5
$$ y = [20, -20, -38, 24, 16, 23, -14, -2, -6, 33, 24, -5, 17, -17, -10, -9, 36, 33, 8, -14, -1, 27, 5, 48, 11, 22, -12, -2, 19, -2, -10, 28, 14, -4, -11, 15, 10, 16, 8, 5, 1, -4, 20, 30, -20, 6, 23, 9, -49, 3, 7, -35, -10, 13, -15, 1, 17, -4, 9, -23, -24, -8, 12, 8, 14, -42, -3, 13, 20, 7, 18, 25, 6, 9, 8, 4, 6, -26, -16, -22, -4, -12, 19, -22, 2, -12, -6, 1, 5, 19, -13, 1, 10, 6, -15, 18, -11, 31, -19, -5, -15, 20, 13, -17, 2, -1, 5, -12, -9, 5, 25, -7, -5, 5, -35, 8, 14, 22, 3, -2, 6, -15, 5, 19, -7, -7, -5, -16, 1, -12, -19, 21, -26, 2, 17, -1, 8, 6, 21, -19, 13, 7, 38, 1, -15, 17, 11, 20, -11, -3, -19, -12, -15, 8, -8, 4, 17, 24, 1, -10, 13, -5, -2, 10, 16, -31, 20, -11, 15, 23, 3, -19, -17, -13, -15, -6, -22, -13, -1, -13, -35, 6, 8, -16, 7, -14, 7, -6, -7, 9, 21, 10, 11, 8, -3, 2, 1, 18, -17, 12, 2, -1, -16, 14, 12, 2, -17, -3, 24, -16, -5, -1, -8, 17, 13, 6, 9, -21, 26, -25, 7, 7, 18, -8, 15, -5, 0, -1, -24, -10, -3, -25, -17, -27, 13, 6, 13, 0, 4, -8, -5, -13, -23, -11, -20, 3, -10, -5, -16, 9, -22, 4, -4, 12, -13, 6, -10, 23, -9, 9, -5, 21, 27, 5, -39, -18, 32, 30, -6, -25, -2, -12, -18, 20, 13, -15, -4, 0, 18, -1, 27, 3, -8, -10, -14, 8, -4, -2, 9, 8, -22, -7]
4951gMrK1j0mk2N2k3j4NrJ1J5jrOJ5j5l3K1RKj3mRk0L6j3j08J43j70J29j40J81
4985C5qm1m3J6L6L8Lk2oj2j7rK0J9kk2J5J0qNJ6nj3oJ7m2L3k4L3j6Kmjj5K9l6
5021b5N3m3N6n9J8l3m2J26j8j58R1K0q1O8l6R4j22O3L2K0n3M5j9K4j3%j7KL0N
5051B8k0Nj4qrL3j2qK4k2J2kJ1nkj0k4J8j3OK9j8K1j6k9K2kK1j1qpk7J1L0mNk8
5088b3K8l1J5L3oJ5l7LnK7j6J5l4J8kl5K9MJ1k8K6pM3k8rJ6k9%J6kJ2j9RjjRK
5125A8l8J8LjJ4k5K1j6o%J9MK4j9k6Qj3kK5j4j1lL2lj1qL8k2m0O5m2K5qJ7l3q
5161a8J7Jj4K0j7OlJ5j4lK6Kj1j7KLL1l0J2j2Lj5J8kj5j0L2j7K1J1k9J2J3k2K4
5196B0jKl2NPk2J4KL3k7kj0J7J2ok7j5J5RpK5lLj7j8L7j0%J1k3J2j5mR%K6k5N
$$ y = [-7, -3, -12, 9, -1, -5, -27, 25, 2, -12, -7, -16, -5, 10, 9, 0, 6, 21, 6, -27, -6, 3, 5, -8, -12, -3, -23, 13, 0, -108, 35, -135, -6, -146, 35, 27, -14, -57, -41, -5, 33, 36, 14, 8, -4, -21, -30, -10, 9, 7, -15, 0, 10, 2, 7, 23, 18, 5, -1, 16, -26, 7, -17, 16, 0, 2, -2, -3, -18, 11, -25, 28, -15, 41, -18, 0, -33, -75, 51, 33, -125, -34, -14, -95, -27, -63, 31, -91, -28, 4, 24, -29, 16, -3, 21, 8, 8, -9, -7, 23, 28, 8, 13, -1, -9, -18, 15, 3, -5, 19, -3, 9, 7, 18, 13, 11, 1, -23, -5, -18, -12, 17, -1, 20, 4, -25, -3, -5, 16, 5, -3, -10, -37, -26, 4, 0, 5, -23, 5, -26, -11, 22, 16, 31, -6, -3, -8, 19, 3, 18, -16, 2, 0, -35, -6, -2, 9, -19, 7, 0, 43, 15, 6, 22, -7, -7, 9, 7, 19, 0, 9, 8, 7, 16, 18, -20, -2, 1, 0, 14, -11, 10, -6, -12, -12, 7, 11, 35, 16, -10, -2, -15, -17, 8, -6, -17, -20, 12, 9, -2, -10, 28, 6, -34, 31, -11, 14, 6, 23, -10, -18, -1, 0, -14, 6, -11, -5, -8, 7, -7, -10, 16, 18, 7, -10, -8, -5, 26, -4, 8, -4, -1, -16, 2, 0, -15, -25, 7, -10, 11, 22, -7, 5, 18, -4, 20, 19, 21, -11, -6, 1, -21, -7, -5, 28, 1, -1, -11, 6, 18, 12, -15, -30, -15, -6, -13, 12, 9, 12, -5, -23, 14, 4, 4, 15, -8, 4, -11, -15, -6, -6, 20, -5, 0]
5234@J5Nk9JJ3K3n3L4j9K1l9J7kJ7J2j6pJ4J8k4%j5J0K8k2nj0J5j0qKJ5KJ6j9
5269@oK2ml0M4l2M0j9J1k0j9LLM3k7KLj5JKj5J1qj2QK7jl3K7k8NQK4qrJ5k6OJ2
5308EL1k0j3j3mM2k2qOJ0k9J2kK6qj8Mk6L9j3j8J2JJ5l0K8J7k7mJ2lK0qk1J7j8
5344hj4mK4k1M6k4j7K8j0pK1J6l2kJ1k3J6J9mk6QJ1jpqRjm%LJ4lkj3oJ2j3K4k
5383A0m1J1L1j2L6k5l2L9j4nJMQpRk2K3k1KJ3k3j3L9k2L6k0oQj6QLK3l3J0NJ4
5419B1qJ1pk9OLJ7Pl5J0k5J2J2J8NLk4%qK4Kl1J0K2k9J1NmL1mk6jLoK6q%poK1
5459B2k3pK2j1j9RK5j1oKk0nL0koKK3lj5j8J5k1K9j3ML5j1j9kj0j5L9k8J6MPk4
5496eloJL6j6j3PRPmj6j0K6ll5L6Pk4KnNQkqK6m0K8j8PqK8j8j9J4J4ok3L5j1K2
$$ y = [0, 15, 20, -9, -8, 5, 28, -25, 9, -10, 11, -28, -11, -13, 4, 16, 0, -7, 7, 25, 1, 1, -14, -4, 24, 2, -3, -13, 2, -8, -16, -14, 1, 3, 19, 0, -6, 16, 12, -18, 26, -6, 34, 15, 26, 6, -13, -10, -7, 36, 9, 11, 14, -1, 0, 2, -13, -2, -10, -22, -14, 13, 12, -21, 6, -22, -17, -9, 15, 7, -2, 13, -13, -7, 5, 36, 16, 3, -10, -14, 28, 6, -2, 4, 14, -15, -3, -5, 21, 13, -5, -1, -27, 12, -1, -19, -7, -6, 9, -21, 7, 24, -3, -7, 5, 2, 22, 14, -7, 10, -8, -22, -26, -2, -23, 23, -1, -18, 10, 0, -7, 14, 30, -2, -4, 7, -16, 0, 19, 15, -11, -3, 8, 7, 0, -8, 1, 0, -4, -4, -1, 13, 10, 8, -5, -11, 1, -12, 12, 10, -31, -20, 11, -1, 35, 10, -22, 17, 3, -2, -1, 3, 11, 4, 13, -9, 14, -7, -5, 8, -15, -28, 11, -11, 25, 5, -1, 7, -9, -1, 2, 25, -8, 2, 7, 21, 13, 24, 17, -12, -6, -3, 14, 21, -14, -4, -29, -17, -5, 13, 18, 21, -3, -3, -11, 13, 15, -16, -6, 16, -13, -2, 3, -1, 30, 26, 0, -1, 2, -4, 22, 14, 14, 7, 1, 22, -1, -8, 14, 3, -16, -7, 18, 7, 1, 3, -17, -22, 8, 6, 0, 2, 25, 22, 7, -11, 4, -17, 12, -1, 3, 38, 27, 8, 6, -4, -19, 20, -8, 8, 12, 19, -5, -8, -14, -13, 23, 7, -6, 1, 10, 17, 13, -3, -13, 13, 10, -25, 11, 18, -6, -4, -9, -4, 4, 2, -6, 20, -20, 8, -10, -3, -11, 17, -1, -20, -6, 8, 2, -21, 14, 3, 25]
5536B5l5jJ2J3lk3K1j2j5M2k7j0J7J2ook0KNLj3J5J3Jl2Rj1K4Mk9K0j5RRj3KL3
5573B0m0NLM1k7nJ6l3K3k4LM4j7okk9K2K%kJ1rj1RL1j2Qj0j4j0J6j4K9j6K1k6
5609cK6oLk5j0J2j0K1jqK7m6K2pk4N7oj6qj3J7rkj6M5j9Kl6K9J1p%Ok6K3mK0P
5647B6j1k5kj0J0L1j1J6k0Loj3L1oj1kJ6ll3J0LKL2k5pqPNk4K0Kk2K4%J6pRk3
5685fjJ3J4jk0ppK8kqklM0j5j3l0J7JJ6Jl4M4k7K0k9K6l0QOJ4j8KK9Ll8J3J5k8
5723iK6kk4J5j4J4qPmj5L7m9L1%J8j2nPnJ2l0jJ4j4PK1prqPqQJNJ8j5j3JONnJ4
5765A7k8NK4k0J2rppJ2MJ5pnoJMJ4l6J7kJ%pMJ0k1K0j5K3k8J1Pk3J7J3qRK3j7
5804A7k1K6k7j5K4pNrj5K0PkK1n8M9j8J6K6l4K9l7pL7j6rj0J3Kk0lO1l6J9k2j2
$$ y = [25, -10, -11, 1, 14, 11, -12, 9, -3, -18, 24, -3, -13, 4, 16, 10, 4, -16, -14, -9, -6, -19, -4, 9, 10, -22, -13, -24, 0, 4, -25, -5, -20, -11, -2, -15, -13, 20, -20, -15, -12, 29, 2, -3, 13, -20, 3, -21, -18, 26, 9, 3, 1, -28, -6, -4, -4, -6, 5, -4, -15, -6, 25, 13, 21, 11, -3, -13, 3, -11, 18, 2, 23, -3, 23, 17, 20, -5, -15, -3, -13, 8, 7, -1, 26, -20, 2, -5, -29, 28, 22, 6, -2, -15, 2, -7, -9, -25, 20, 1, 3, -33, -4, 7, 0, 0, 6, -20, 3, -1, 19, 26, 15, -10, -12, -22, -12, 19, 8, 24, 4, 7, 1, -12, 19, 13, 2, 0, 16, 13, -20, -10, -7, -5, 27, 2, -5, -13, -6, -1, -25, -5, -3, -25, -1, -1, 15, 8, 17, -6, -7, 6, 20, 19, -1, -8, -15, 13, 11, 3, 1, -2, 38, 23, 10, -20, -3, -2, 14, 15, -19, 25, -2, 18, -11, 15, -15, -7, -1, 13, -5, -3, 26, 29, -9, 4, 19, -9, 17, 15, -9, 6, -8, 6, -2, 5, 1, -14, 23, -26, 5, 5, 23, 11, 6, 13, 8, 20, -10, -11, 3, -11, -4, 17, 10, 1, -7, 0, -8, 0, 1, 6, 24, 9, -4, -3, 3, 8, 3, 17, -11, -6, 18, -2, 10, 1, -6, -13, -1, 3, 18, 11, 6, 0, 1, 5, 19, -17, 0, -2, -1, -1, -8, -4, 6, -15, 5, -10, 13, -15, -4, 3, -20, -3, 10, 2, 11, 34, 17, -4, 22, -5, -20, 4, -3, 2, -7, -22, -2, 5, 3, 24, -34, 15, -3, 13, 39, 5, 34, -3, -10, 27, 11, 2, -8, 5, 7, -13, -16, 45, 9, 28, 6, -6]
5839fJk1J5L8j7l2PJ0NnJ8j2MK0k0J1j5%MqmL0l8L9l3KJ6NJk7J1KJ4j2K8k0K7
5876C8n1L7l9L6k3J2rpKJ5j2J8k2j0J4lJ1J1j5rJ4nlJ6%ORl0NpJ9jqMoj8K2Lj6
5915bJ6l1J4j9KL0J4l3J5Oj9J2ql7L8l0N0j9J1jj2K3j8J8J8n0M1k6L1k9nJ3mq
5949AQk5LL3j0Rj0rJ7k5J0K6j3J5m7K4j0K1mj4j8J4j1J6J2mj3mK2j8LJ5oMPKk
5986A9%j8J1j9M1k4oK9l9jj1K5kJ3j9Lj0j6N0m3J4LKLljj3K7J2m0J7k0M3ojjl0
6023a1K1j8L5k3J9jk3K2k4Qj2M9n7L9l5j2J7J7lk7K8l0L2J2k9L2jj3j4NJ5l0J8
6056Fo%Oj9J9Rl8L8K5k5kj2j9K5oK3j4Qk6MnJ4j3J2j2J1%j1JK4k2pk1M8j1j5J
6093a0j2Ok2K1QRk9K2JJ4j4J2pK2K0n3K4J4l5J9rLj3K4pRJ0k9RJ0k0lJ7Mlj2m
$$ y = [-6, -5, -26, -11, 27, 10, -22, -15, -5, 0, -5, 13, 1, 5, 25, 5, 16, 1, 1, 5, -3, -7, 23, -15, 24, -9, -7, 9, 14, 15, -12, -1, 1, 15, 3, 31, 11, 38, -13, 24, -15, 21, -2, 10, 1, -6, -4, 11, -1, 17, -5, -15, -1, -4, 7, 18, 3, -6, 8, 3, 0, 16, 16, 22, 31, 1, 6, -1, 18, 17, 9, 13, 7, -11, 11, 14, -2, 14, -17, -3, -22, -20, 10, 24, -9, 6, 12, -7, 5, -3, -40, -2, -32, 18, -1, 10, 9, -3, 20, 2, 20, 38, -12, 29, 3, 34, 5, 0, 13, 9, 1, 9, -16, -13, 20, 10, 19, 9, 0, 17, -8, 2, 28, 15, 30, -17, 7, -3, 18, 14, 0, -18, -4, -15, 1, 13, 9, -4, -8, 14, -4, -1, 14, 8, 12, 19, 21, 19, 19, 1, 12, -7, 34, 10, 4, 33, -6, -7, -18, 7, 5, 18, -1, 2, -8, -24, 26, -17, -3, 0, 2, 5, 2, 1, -12, 15, 27, -13, 4, -16, 27, 21, 20, 19, -11, 10, -8, 27, 4, 23, 22, -1, 21, -3, 5, -7, 42, -15, 24, -11, -23, -6, 11, 8, -19, 9, -21, 11, 23, -6, 26, 25, 12, -2, 3, 18, -12, 6, 0, 0, 6, -13, 6, 15, -23, 15, 40, 15, 13, 1, -18, 7, 1, 24, 10, 18, -8, -4, -9, 5, -8, 4, -8, 3, 3, -8, -7, 17, -5, -12, -33, 15, 4, -11, -10, -22, -16, -38, -17, -9, 0, -29, -7, -6, 8, -6, 6, -1, 21, 41, -12, 12, 26, -9, 10, 1, 4, -9, 15, 8, 17, 27, -2, 7, 17, -3, -6, 11, 15, 12, 0, -4]
6130dMj8L4j1Jk0J2Pk6J8%J8m4M7njl0MJ4qQK1rj1pK0oNm3N2qPk8L7k1J6K0k8
6168A7k9kK1%L1l1j6j7K9K4k4PjL1o7J8J7K2m1LPJ5KQlok1qL4l1K1k1L3l6K9L
6204A8polJ2rRJ9m6O0l5j0mK4k8Qk9L3j4J7k5J7QOj7j5K0nj9L2j8K0k5L5k0jJ4
6240A6k5L1l9K8J6n6O0k7j1J1QJ1qorK0k0K0l3J7l6K0K0J1j1j6qMk2L3Pj4K0j8
6274fRnN0n0j2RkL1j1nM%lNNlqj5K3Mm0L9oj8jMKk4K0K5j0k5j7M3J2j9j5K5l2
6313a7L0j5KOQP%l7L8jj4Rk1L1j0j9L2k1JqlJ5KqK2k8j1K6k4M2k2lPj8K8l7Oj4
6351a9L0j1j1K5k1J3k7K6j7J2J3j0mMkKJ1Qpj6qJ0RNmk2K9k6J1JMJOLk5J3Lmj
6390D%Rl3M3l8M4k6Kj7L4j8PNnJ3%l4QK4l8L7k9J1LLlk3JJ9LJj3K4jk1MJ9prl
$$ y = [-4, 0, -18, 16, 5, 6, -14, -2, 5, -21, -3, -3, 15, -29, 18, 13, 12, -18, -14, 0, -8, 0, 21, 12, 1, -6, 14, 8, 13, -30, 22, 14, 21, -7, 30, 9, 25, 45, 17, -12, -14, 7, 7, 38, 7, -9, -26, 3, 27, 3, 10, 9, 40, -27, -9, 8, 30, -11, -8, -1, 14, 16, 24, 21, 15, -6, -14, 20, -11, 10, -11, 22, -14, 15, 18, 11, 5, 2, 14, 5, 14, 33, -13, 47, 12, 2, -2, 22, -6, 2, -27, 6, -8, 9, -16, 1, 9, 15, -2, -17, 3, -2, -21, 11, -7, 13, -12, 23, 3, 2, 16, -9, 22, -17, 11, 27, -29, 31, 4, -7, 4, 12, 23, 15, 9, 0, 20, 0, 20, -13, 4, -32, -12, 8, 19, 8, -8, -16, -12, -34, -1, 6, -8, 12, -6, 3, -2, 48, -2, -14, -5, -7, 24, 13, 8, 12, 12, 9, 14, 19, 16, 8, -7, 16, 20, -20, 19, 13, -5, -6, -2, 0, -24, -4, 21, 11, -14, -31, 12, 24, 5, -10, 15, -17, 13, -2, 0, 6, 14, 21, 21, -16, 22, 21, 7, 16, -5, 26, 16, -3, 29, 8, 9, 1, -2, 13, 15, 7, 29, 1, -10, 16, -8, 34, 12, 9, 16, -2, 26, -11, -5, -19, 11, 0, -11, 14, -7, 6, -21, 5, -12, 0, 13, 3, -1, 3, 1, 3, 14, 22, 15, -1, -9, 1, 10, 15, 11, -11, 18, -8, 3, 4, 8, 9, 15, 18, -7, 6, 9, 5, 4, 4, 13, -20, 23, -15, 29, 3, 5, -12, 22, 4, 11, 16, 11, 24, 24, -10, -2, 22, -16, 21, -8, 3, 6, 9, 6, -17, -16, 3, 6, 7, -6, 18, 17, -4, 0, 19, 12, 3, 0]
6430@j8J6j0K3j6l4M0MJ9l3J7K1k1ok6L0Lj5L8kl8j5L8oMj9K2rmnK4Kk6Pk0L7
6466B2k2KJ6k1J3j2qL7k9mK3l4L7Kj1j5K1k9j1J7J1K5m1mK4j2QLPpjk5K1K3l3
6501gJ4qJ7rKj8J4m4M5KqQNJ8m2K6rj0K7l6J5kLNjNj4J3NnmJ3jl3ML1j9nK8Ml1
6542b%PL4l6J8j5j0L5l7L1j1kj5jJ0j8L8k7ookj1K7JJ3Nk8J7Rk1jK0l1J7RnJ2
6579A8j4MNooJ9jj9J3rMkJ0kk6J0%j0NMlj4K5Oj6J2QJm0J6j2L2%k8J9j4J6J1N
6618B1j5J1j9j8K9mJ3m8L7Rk6L0j3Qj3J1q%J3l1J8pL4m0L5k9J2kk5K2k6K7j1J1
6652FM%plJ2j6j6M4k1Rk1L5k4k%knJ4J3j2j0K4pOj3QKqj9K6Pl2K3j1kK7j4lj9
6691gJ5%m8M1j7J5j0L9k2J2%ojoRj0Ln0LN9k4oJ9j6j9PK2Mj7L2l2PKL7j4l4lM9
$$ y = [0, -18, -2, -12, 11, -5, -39, 1, 5, 24, -9, 8, 29, 8, 2, -24, 6, 9, -6, 32, 30, -8, -23, 15, 9, 13, -6, 16, 7, 3, -2, 22, 24, -2, 5, -15, 22, 0, 2, 18, -3, 10, -2, -10, 27, -2, -6, 17, -17, 20, 22, 11, -4, 17, -12, -23, -6, 5, 30, -11, -15, 9, -3, 5, 8, 15, 8, 7, -18, 3, 26, -7, 7, -1, 16, 7, 9, -9, 5, -39, 6, 8, 0, 8, 13, 31, -11, 15, 6, -4, 23, -13, 2, 0, 3, 8, 7, 12, -2, 11, 16, 11, 7, 20, 19, -14, -10, 21, 2, -3, 25, 29, -2, -2, 5, 39, 3, 21, 6, -4, 31, -6, 25, 14, 12, -3, -4, 6, -12, 26, -1, -7, -13, -15, -26, 1, 2, 15, 20, -8, 9, 18, -3, -4, 16, -15, 2, 11, 6, 18, 4, 8, 13, 7, 1, 20, 19, 0, 13, 4, 8, 6, 16, 14, -12, -2, -2, -12, -7, -3, -6, -20, 5, 11, -5, 7, 15, 16, -24, -8, -20, 12, 12, -16, 3, -11, 5, 16, 21, 6, 17, -2, -20, 9, 5, 18, -30, 7, 16, -10, 20, 7, 15, 2, 13, 5, 5, 18, -13, 5, -2, 32, -8, 27, -2, 10, 8, -17, 5, -21, 6, -5, 6, 10, 10, 3, 0, 12, -4, -20, 24, 3, 12, -9, 26, 2, 0, 0, -2, -7, 7, 20, 8, -2, 22, 15, 21, 8, 16, 18, 10, -9, 17, 24, -8, 15, 4, 2, 29, 15, 12, -7, 8, 8, -40, 1, -16, -1, -11, 28, 6, 18, 18, 12, 11, 5, 14, 4, 7, -43, -40, 19, -5, -11, 8, -8, -27, -20, 2, 6, -11, 21, -11, -4, -2, 35, 21, -13, -16, 33]
6729C3l0oPjkj8J2J2K3j2qk1MJjJ2%qkJ0J4l2K1r%nLj2K3qMj0j0J4JL1m4K2l8
6768c0K8J9j1Nk6J4%NJ4Kk7lj6J5L6rmK0k2lm%J9m0L6k8RMMJ5l6K0lj4NK9rj3
6806AJ7m3L3j7K3k8NKL1j5k1J3oJ9k4jK8j8j8J8L4l3JjMNj5J1J0qkLPj1l3M5j2
6843Dj2O%J8j5J5%k3j0j2N0Ml8nK9kl7RJ3omPlK0Nmkj0K1ok2L0j3j6K7k1j1PQ
6882AlK1k7J8rk2K7J2m2RJK6j8RJJ9l8J3J4j7J0rQj6Nk1L1j1NKj0M4k9Kk8J3P
6919bNJK5k8On%KKQoKoJ6j6J1j6J0J2l6%K4j9QMK4pj4K0l0J1j5J0k6J4L3j0J0
6957B2qjJ3j1mj4j2J9pJ8MrqlJ3j6lNjNLk5K3j9K4J0j1l5L7k2L5l5LoMJ8j6L6
6995B6j8Om2L8J1jOj1oj9OmL2l5oJ8J5oPK9o0K7Nm5K5oK7j4k1L6k7pNL6m2J5o
$$ y = [33, 3, -3, 4, 3, 1, -17, -5, 7, 30, 18, 10, -11, -7, -6, -7, 5, 5, -3, -5, 5, 19, -13, 8, -1, -1, -6, -3, -15, 8, 0, 4, -6, -16, -2, -1, 30, -14, 8, -30, -2, 17, 6, 11, -15, -1, -1, 4, 18, 20, -7, -10, -26, -11, 25, 16, 12, 32, 10, 7, 3, 3, 22, -18, 18, -10, -1, 3, 7, 22, -14, 6, 3, -11, -6, 23, 14, 1, 18, -25, 8, -9, 14, -14, -9, -7, 24, 9, -12, 1, -5, 14, -10, -11, 17, -1, -19, -1, 33, 0, 1, 0, 4, 9, -6, 5, 15, 7, 5, 8, 15, 4, -29, 16, 4, -8, -2, -2, 16, 1, 16, 16, -7, -17, -29, 21, 25, -13, -18, 11, 9, -28, -19, -6, -12, -16, -9, -12, 8, 13, 9, 7, -3, 18, 12, -10, 20, 7, -9, 18, -3, -14, -7, 1, -2, 19, -8, 10, 1, -21, 6, 18, -24, -15, -14, 12, -6, 3, 4, 23, -15, -2, 12, -5, 5, -4, 4, -12, -7, -28, 3, -8, -3, -1, -11, 33, 4, 6, -22, -9, -2, 3, 4, 29, 1, 7, 2, 2, 4, 6, 14, 8, 10, 4, 20, 4, 15, -1, 9, 21, -15, -15, 9, -10, -2, 2, 26, 19, 5, 25, -5, 6, -9, 1, -25, -11, 22, 12, 22, 14, 13, 26, 15, 11, -3, -15, 4, -3, 15, 19, 10, 2, -1, 12, -4, -7, -2, -3, 2, 5, -20, 3, -16, 8, 18, 7, -28, 9, -13, 22, -13, -10, -16, -12, 6, -10, 26, 8, 14, -28, 10, 21, 20, 26, 15, 9, -10, -4, -8, 24, -11, -17, 1, 16, 10, 17, 46, -14, 13, 18, -27, -2, -8, 19, 5, -16, 20, -7, -14, -9, 27, -15, 0, -6]
7032fj0kK4j0J4J8l3J4Oj4knJ6j9KJ2Jln%K3k5nj0lK9l2J5NLk4K1OJMqmQLk0J2
7073clpK4k5RjJ4J3l7MJ2jL2j4k3J0JJj1K5k8Ok5L1%j0rkRqQNJJ5nj5j5L6l5J7
7113dmJ2J9k1k2K1RmnnJ9j9K3j6MjNp%K9l5K0j7J7p%j6J9Lnrro%Pk0K1K1l2K2
7153Gqj2K8j9J1j2nJ8j3J8l2K6J8j4k1J4K3k2j2K3k5M3k3k5K7o%j2K4k5RoJ0K
7187IqnJ8j2J2j2k1J5J0j8M8l4j4J0jOlK0k0k0K3j1j0N1m0RJ5ppj3J0J6l5K6k0
7222a3Rlj4K4K4m2J3L6n0NjQMMm1L0%K2m6K2QMol2M6l1K3jpJ0jkJ6j0Lj1jj1K2
7261A0k3jRM3k0km9N3j1Oonj3QK8Lj5l7KK5j0J5noK0k7j6NJ9jMJ9k4j5L6k5J9
7298A3j0nJ1K0k8rJ4J0j1MJl0L0j1K4m0K7Lj8K6l4j0L4qJK0m2K9l7N4k6J0mk6
$$ y = [-6, -16, -18, 6, -4, 10, 28, -5, 9, 15, 1, -1, -6, 10, -9, -7, 5, 6, 3, -2, -2, 21, -4, -9, -19, -22, 7, -25, -10, -5, -2, -26, -5, 1, 2, 6, -2, -6, 2, 5, -15, -3, -6, -13, 11, -14, -5, -6, 8, 21, -16, -12, 0, -1, 31, 17, -6, 4, 5, 6, -5, 20, -8, -2, -27, 4, 4, -6, -15, -17, -8, -16, -8, -3, -2, 13, 8, -7, -22, 14, -21, -4, -8, 4, 23, 2, -20, 1, 10, 6, 1, -4, 15, -4, 19, 3, 7, 6, 11, 4, 4, 33, -2, 18, 1, 18, 11, 11, -5, 14, 17, 12, 3, -6, -12, -12, -5, -25, -4, 17, -15, 7, -1, -13, 15, -4, 7, -5, -10, 8, -5, 13, -19, 7, 25, 11, -10, 4, 27, 5, -7, 16, -9, 34, 11, -14, 13, 7, 7, -5, 19, -6, 3, -3, 7, 9, 1, -4, 14, 2, 14, 2, -19, -4, 6, -12, 36, 2, -12, -2, -3, 3, 0, 20, 0, -20, 3, -8, -18, 33, -7, 2, 17, 10, 3, -10, 0, 16, -19, 7, -13, -4, -7, -21, 3, 27, -15, -2, 34, -16, -11, -12, -4, 0, 4, -37, -7, -7, 15, -31, -9, -1, 3, -3, -35, 11, -20, 3, 2, -5, 5, 4, 2, 18, 8, 11, 0, -1, -12, 10, -13, -14, -5, 38, 18, 16, -33, 20, 9, 15, 9, 4, -9, -1, 27, 30, 15, -22, -20, 5, -5, 10, 5, -1, 19, -8, -24, -19, 0, -1, 3, 22, -2, -17, 19, -6, 13, 3, -2, 9, 29, 1, -8, 6, 16, 5, 9, 10, -20, 10, -1, 23, -17, 10, 13, -5, 21, -13, -23, 11, 3, 4, 24, -18, 11, -26, 28, 2, 12, 8, -18]
7332a8M1l2N3m3%MJ1mNm4L2J6k1RnJ%rK6Om1PJ5l0J5Qkj2lL3J7l2j5mK8j9K1j0
7370Dj8mL3qk1QK0j0j1K7j7K0j7LQJNj4K4l7K1qlRk2Lk6J5L9j9Mk7J9RJK7k8l2
7408b2K5j6L6l3MNjJ4j2j6L3qJ2k0Ok1K8k2NK7j2Jk3K1j3L5l1PPKnk1NPNRoj7
7446eJJ5Kj1m2K9KK8Mj4l3L6j1Pjj3K6l7J4PK8k6j8K2Kj2qK7J5pk8JK2j8K3k6
7482AJ8j7nj9J6K9l4J4j2J7j5L5pj7l0K8pK2oj0L2l5MJ2qOQm2PK1QKjJ9k9J0j6
7519akkJ7nk4M0j7J2%l0J1Rj3J0rK1j1l4JL1pj1J8MlK0rj4nL1l1qQLkLJ3j4KJ7
7559A9pj7J1J7j5l3M3jm%noJ8k3j3L3j7rJ5j5L8k8K0pQJ7m5K2K4n2j1K4J3J5j9
7594A0LJj7mK4oml0K5j5j1J4J1%J4m0J1K3j1J0j1l0L8j2Qnj4K9j8pL2roK0k9P
$$ y = [-18, 23, -9, 44, 1, 1, 5, 16, 12, 17, -27, 5, 21, 0, 9, 4, 5, 5, -4, 22, 28, -13, -6, 9, -21, -6, 2, 0, -12, -15, 18, 35, 3, -12, -16, 12, -7, 14, 4, -14, -18, 15, 7, -14, -6, 14, 4, -7, 20, 3, 23, 6, 9, 17, 18, 23, 9, 33, -4, 17, 9, 6, 15, -7, -4, -30, -15, 24, 5, 9, -18, 1, 10, 11, 38, 10, -22, 3, -13, 23, -10, -6, -1, -2, 12, 0, -16, 17, 9, 21, 1, 7, -14, 14, -8, -3, 24, 12, 13, -10, 11, -2, 33, 2, 9, 16, 18, 13, -8, -3, 4, 9, 18, 12, -5, -4, 11, 13, 2, -40, -11, -9, 19, 23, 9, -24, 12, 1, 8, 7, -6, 20, -17, -3, 4, 32, 6, -12, 10, 12, 0, -8, 19, 34, 27, -1, 0, 22, 4, 27, 1, 19, 2, -3, -22, -6, 23, -11, 3, -9, 8, -7, 28, 21, 4, -26, 2, -5, 17, 11, 1, 33, -2, 2, 14, 6, 12, 20, -22, -15, 6, 14, 16, 15, 34, 5, 15, -1, -3, -5, 12, 7, -17, 23, 6, 18, 18, -12, -1, 8, -5, 5, -4, 17, 6, -28, -27, 4, -3, -14, 4, 8, 5, 25, 16, 2, -3, 28, -3, -11, -3, 0, -2, 1, 14, 0, 2, 19, 12, -5, 6, 23, 8, -25, 18, 17, 13, 13, 8, 2, 20, -3, -16, 17, 0, -9, 6, -9, 29, 1, 21, 14, 22, 39, -6, 16, 40, -12, -23, 1, 14, 29, 10, 13, 14, -3, -7, 17, 11, 7, -23, 2, -13, -24, -10, 1, 1, 15, -25, -14, 9, -2, 8, -3, -33, 5, -7, 1, -4, -18, 11, -7, -14, 18, 9, 3, 23, -6, 1]
7630Aj4jJ3j6M3J0l3QL0n2J8Jj0J5k4J6k3L8k0j5K5J8Jl4mQMOj4J0mrMJ9k7J5
7666CLmPj6J5j7JkmM7l0L6k6k7K6k4OJ2Qmk5j3J0OM2J0m3KL7n2J6k1K9J0kk6J3
7703CJ5k8K6j9RpK3rj0qK5Ll9L0pKk7K1J3Lj2LpnK3Jj1j4qj1J5K2k0%J7j4J0J0
7741A8j7%mJ4k1J0j4qL4rkjPk3K8ok5J4M0m6J7%K7k8K7j7jk2K3J4j2oj7PJ0rJ
7778CJ5rqNmmJ9lj0nj5K5Pj6rNRj1oK8njL5ok4l8K8j3J5ojJ1J8rrK5l6J6Ol2K
7819hMJ8jj5omLML2j6jMKj7K1j2Ok2J0j4OL6k2Lj6Lj8L1J7j6Kj2j8L2Jj2J7lj3
7858FK7m1K9j0j2L1n0K5j0oM2m7ROK0k8j0J4Oj3rK3Qk9L7k6K3Ok0oL0j3k1%PP
7894EqMJ1npJ3j5NL1m3NpK6nj3ljOJ2jqnqk0M4k1K9k4pK0j4LpMnQoj1QMJ0k9L8
$$ y = [1, -13, -14, -1, -17, 26, 36, 3, 11, 41, -11, 7, 8, -2, 13, -11, 5, -18, 20, 0, -15, 10, 28, 29, -5, -9, -1, 3, 9, -5, 5, 1, -8, -4, 15, -12, 3, 6, 2, 9, -7, 8, -9, -8, -10, -14, 33, 3, 39, 13, -14, 12, -12, -6, 6, 14, 10, -15, -28, -18, -12, 30, 40, -3, -1, 36, -16, 0, -21, 8, 18, 16, -10, 3, 18, -10, 16, -3, 6, -1, 22, 13, 3, -5, 20, 23, -16, 14, 7, 9, -18, 3, 16, 19, 7, 10, 3, -2, 21, 22, 11, -3, -11, -22, -7, 15, -5, -5, 12, -2, 8, 18, 1, 1, -3, 11, -10, 0, -14, -22, 12, 3, 1, 0, 7, -16, 12, 6, -19, -5, 35, -11, 6, 6, 33, 5, 32, 15, 14, -8, 15, 29, 17, 11, -6, 1, 11, 2, 3, 18, 9, 1, 6, 2, -2, 17, 14, 4, -1, -16, 9, 16, 0, -9, -4, 5, -6, -12, 16, 11, 10, 45, 39, 15, -23, 5, -8, 7, 1, 0, 11, 29, 20, 11, 36, 0, 16, 22, -10, -8, -4, 14, 13, -2, -8, -12, -9, -5, 27, 11, 10, 14, 16, -1, 20, 8, 14, -8, 2, -12, -6, 30, 8, 11, -5, -2, -20, 11, 28, 12, 14, 2, -16, 16, 17, 5, 22, 19, 6, 33, -8, 21, 11, -1, 30, -20, 5, -5, -11, 31, -16, -7, -1, 19, -9, -19, -5, 1, -12, -21, 2, 10, -19, 18, -8, 15, 21, 1, -5, 25, 12, -9, -9, -2, 5, -3, 1, 12, 7, 0, 13, -2, 3, 34, -9, -4, -11, 15, 10, -3, -6, -7, -1, 11, 10, 2, -3, -11, -31, 13, -8, 21, -3, -10, 10, -4, -1, -8, -4, -9, -1, -7, -18, -10, -6, 4, -25, 13]
7937A3j8j0NJ1J8k6NjRJ1l6K4LonK6j7j3j0jK4k4K2K6j5pMk2mK7j8J1pkj1QJ9
7974A3oNk0J8jK0k1k7JJ5MoJ0k0J1K3kj0j2jJ0jmJ9k3J5rj7L9k2NLj6K5Jj9oj
8012gPJ7Ok4J4qpL6l1K6rk7L4l0lJ9kQok9L8j4l1J0PPJ7k0J3k0lK7koJ8k7QP%
8051A3j4L0rmJJ6k5JL8l6pNkPj4Pj4K2j8nL%QK6k0MrL2k7lj6k4L6Pj8J7QPmjl
8092A5Jj6j5K0Rnk1M7l8L0k5j1L9j8Njj1lRk1J3k9L6Jj5J9k5K2l7J2k5J3L7k3
8126a1j1K5OnRj3QlJ3kk4MqL5Nk3M6n6K0Oj3M1n5J1J3j0Jj3MmpJ6J4j5l4J8J1
8163ak3K2kRpJ5j5mK1pl7M8j5jnK1k5L1j2jk9K7J1qqoQK2
$$ y = [13, -5, -15, -10, 1, 19, -7, -2, -3, 6, 17, -19, 5, 8, 2, -3, 23, 6, -7, -17, -18, 6, -18, 4, 30, 15, 8, 12, -10, -14, 13, -5, 6, -1, -3, -14, -6, 13, 7, 12, -8, 10, 9, 29, 8, -19, -18, -3, 1, -5, 5, -15, -4, 19, 17, 7, -5, -6, 4, 3, -1, 18, -5, 10, 1, -16, 23, 1, 6, 9, -7, 18, 19, 0, -6, -7, 0, 17, 23, -1, 13, 5, -2, 34, 3, 29, 20, -7, 27, -3, -6, 13, 11, 19, 13, -16, 22, 8, -23, -13, -6, 1, 18, -2, 11, -9, -12, 15, 13, 7, 25, -2, 6, 13, 13, -1, 29, 20, 16, 17, 33, 8, 9, 47, 11, 4, 9, 7, 14, 0, 7, -7, 15, -3, -8, -5, -5, 3, 29, 9, 13, 4, 36, 9, 6, -10, -34, 2, 9, -9, 8, 16, 23, 19, 18, 15, 16, 0, -15, 5, 14, 9, -12, 35, -3, 27, 2, -9, 30, 12, 17, 16, 5, 2, 11, -10, 3, -26, 10, 11, -4, 15, -10, 12, -25, -13, -38, -25, 12, -11, -22, 3, 9, 4, 13, 0, 8, 5, 18, 16, -8, -4, -12, 23, 28, 5, 51, -5, 15, 21, 8, 49, -6, 5, 18, 8, 9, -4, 0, -4, -11, 5, 19, 4, -30, -12, -1, -24, -2, -4, 5, -2, 13, -2, -6, 15, 8, -29, 19, 4, 3, -2, 19, -6, 25, 13, 12, -17, 10, 21, 13, 5, -1, 7, 29]
8191B9
$$ Imaginary data points
##PAGE= N=2
##DATA TABLE= (X++(I..I)), XYDATA
0@%%%%%%%%%%%%%%%%%%%%%%%%%%%%Mj0J2j4J6j6J6j6J6j6J9k3K6k8K9l1L6m1M3
47B2m4M9n7O3o7P5q4R3j06J20j36J56j83K19k66L30m25N70q10J252k213N020k6073
70b2495r2220J34301Q3717j45044l5323J35893p956j15492M3278P9909o6731l5293
82d3456Q0735j0896q4689M8665P5887p6192n4817R4078K7719j03303j706J01347
94E3372j8670q6416L5090O2722m8048l7284N5888J5289n5207K609M6604j8389
106G560l5426L0278K6048l5108j9067L1527J1879k3125l479J5163k936q918N345
119b59K327m960O639N959j6094j0265K2230J5082k4951j7380K6638J6935k9996
132h095j6815L3171J8626l2464k0017K7189J8479j9650j3890J3300J0159p453
$$ y = [0, 0, 0, 0, 0, 0, 0, 0, 0, 0, 0, 0, 0, 0, 0, 0, 0, 0, 0, 0, 0, 0, 0, 0, 0, 0, 0, 0, 0, 4, -6, 6, -8, 8, -8, 8, -8, 8, -8, 11, -12, 14, -14, 15, -16, 20, -21, 22, -22, 27, -30, 33, -34, 41, -43, 50, -56, 64, -72, 84, -99, 120, -146, 184, -241, 329, -481, 771, -1442, 3578, -22495, -114715, 19586, 103303, -41741, -77064, 58829, 50873, -64619, -21341, 58568, -8163, -43456, 37279, 26383, -58306, -9641, 66246, -9946, -64763, 29315, 57034, -46269, -47975, 53372, 34702, -51714, -16624, 46098, -1950, -39234, 16654, 31943, -23264, -20655, 25949, 7560, -27866, 2412, 28460, -6648, -25715, 5812, 17691, -5434, -8913, 6250, 3314, -5604, -259, 2068, -2892, 3747, 9706, -6388, -16653, 5577, 20659, -4292, -21672, 4966, 21901, -8095, -24910, 8261, 26887, -5577, -25594, 1595, 20074, 424, -13466, -166, 9993, 2540]
144B540r588k71J0712J0007j1067j9000R604K3505r381k3713J1758K2453j4947
157B612k1396J5734J9330j2571j3882Q453O399n519l64L751k076o67J627m248
171b817j789Q001K466q291j994N485j317k709N904J922q188j583Q078j04p296
186d232K868Q607l925j1034J566J2097K177j1267m815J0226N278j1437n910J3823
200D022Q082j4529j0396J2283J0590q305q062N231N709k876n470q68O986O650
214I047p904j2779P263J5949p021j6107Q821J5035j1723j4639J3205J3947j1470
227A624j0788Q606N506o509m74N363k005k962K262j668k736O335L822q982l935
242f541Q849J297q269L170Q757o699q940Q181P225q661l240J0222l75j2414J931
$$ y = [2540, -7048, -7319, 3393, 13400, 2333, -16667, -7063, 16442, 7061, -16652, -4894, 17559, 2612, -18784, -3050, 16280, 3709, -10173, -1720, 4679, -840, -1204, 2547, 471, -196, 1431, -2817, -4606, 3395, 5861, -2430, -4424, 1061, -256, -2965, 2939, 4861, -3327, -4910, 3168, 3064, -4232, -1364, 7243, 3318, -7716, -6150, 5947, 8124, -3143, -7958, 2268, 7546, -3891, -9801, 4022, 12104, -2425, -12821, -538, 10052, 1747, -6315, -1084, 4625, 1749, -3721, -4589, 2397, 9047, 1143, -11636, -4373, 11576, 4555, -11552, -2731, 12304, 581, -14058, -853, 13094, 1624, -9164, -558, 4948, -1561, -2035, 3328, 1323, -1639, 623, -1045, -3781, 2554, 6376, -2606, -6541, 2308, 3605, -4664, -1494, 7263, 564, -8376, -195, 7030, -1631, -4871, 5351, 4976, -7438, -5507]
257e507J2879k046j0758K615P225m430m899N292L707l654j863Q0j657L050N817
272E851m613p773O239P518r202o654J3098O691j5473p002J4866N444j2943k014
286e967J1193j305j0055K499P627j879k913J669k364k126N909K136p150J38P798
301E210l978r075O867R909p749q907P678N348q349j739R569j33r388P58P095j658
317A458l695L662J682m907j170L991O02j492J106o44l272R88L628j093k265K369
333I48Q24m611r22N999K112n384k197M248J026m155L01N293n0n903j433M872J842
350B810l157q41K327n94k890N24L128Q39j655j597n47J031J849j8j412M16R42
367A155k202j731L473L219l129m015K050K968k130j740L414J794m379k904L875
$$ y = [-5507, 7372, 5326, -5432, -2817, 4408, -22, -4921, 371, 4078, 424, -1439, -1359, -3016, 34, 5851, 1238, -6535, -296, 7222, -1980, -8634, 4464, 11155, -4318, -11320, 3546, 8990, -3953, -5967, 5226, 3921, -6134, -3635, 3992, 2113, -800, 869, -1495, -3621, 2288, 4424, -2726, -2588, 5210, 1232, -7843, -976, 8933, 1184, -7723, -45, 5303, -3046, -4785, 4784, 4651, -4737, -3979, 3116, 1458, -2237, 1425, 3107, -1800, -2970, 1021, 1623, 131, 1237, 593, -2679, -1691, 1937, 844, -1421, 948, 1772, -2839, -3761, 2238, 4350, -1034, -3231, 1017, 2043, -2112, -1811, 3482, 3432, -2471, -3904, 968, 2810, -347, -1188, 1139, 545, -2345, -1821, 1307, 2146, 491, -1106, -1653, -622, 1227, 1209, -203, 213, 1155, -1047, -2778, 695, 3914, 785, -3230, -1180, 1788, -342, -2082, 1332, 3126, -1253, -4157, -282]
382b82L473k445k250K129O16l046m0L817N31k950o04Q18j016O59K860r86l371
399b087J213K149k882n74N382J90o762P6O284j406m669M145L626o487l220O868
415A846J791n806J064M701m441m287O040L369n730p71M910k812m322N458L774
430D784n943j592N419k067n107N350N056o783m040O489J111o167K110O250l972
445H98n666L988L372l428Q6L592k592l538L318K146l061O81L304l195m038L822
461c11L707l254j915K821m02l223J326L275p43j813K17l83n29J782J215j303p93
478c26L41p99l39J974R55j569j168J22o4N86J369j43j310l01M0k52J108J536q27
497I33j658Q1L10j01J266J083j691j719R12O93n94R08J192j720j902J120J317
$$ y = [-282, 3191, 746, -1504, 625, 1241, -1805, -1845, 1972, 2503, -447, -1051, -233, -1249, -590, 2270, 1284, -2087, -874, 1275, -1607, -2181, 3201, 3391, -3371, -3295, 2989, 1583, -3086, 1059, 4685, -1802, -5022, 1846, 3637, -2169, -1105, 3596, -845, -5132, 908, 4277, -1453, -2224, 2686, -126, -4448, 1010, 4784, -1159, -2751, 2668, 601, -4506, 844, 5900, -883, -4923, 1566, 2677, -3490, -1380, 4870, 898, -4768, -780, 2592, -836, -750, 2842, 250, -3288, 30, 2176, -885, -204, 3100, -95, -4133, -311, 3396, 142, -1773, 1048, 646, -2577, -1251, 2024, 1281, -532, -315, -698, -1227, 555, 1770, 467, -326, 15, -784, -1123, 851, 1806, 237, -931, -809, -873, -287, 1082, 939, -371, -672, -632, -884, 224, 1760, 933, -725, -644, -334, -435, 831, 1914, 223, -1496, -584, 109, -485, 423, 1615, -105, -2007, -887, 430]
514D30l62N18O27j714j273J639J119p32M43O63k141j408K369J669j583o29R64
531E99j187j388J866J876j291r92N29p61o74K026J459j738j234Q56j93p10J593
548F36J359j696j750O69P75j88O28O53j020j340J88J012O98K81l19q50o44J73
566g35J020R41k31j113n28J01%O27J133l29j727m55J035K46k4J116n0k049n81
585a603J793P46o41L62J36j751o01J981Q83j152j08L22j470n58K163R73j500m37
603d62N19r57l22K171Q21j812o02O68n88p2J930L23k112m91R67m28j35J755J18
622A291k260l91J335j51r0J634k54k498K9K036k18p10J437lk715j41K612J07j524
641d74Q86L82k332k83K822L97j913M05P73j914l56L006O65k611l25J538j024r67
$$ y = [430, 68, 586, 1213, -501, -1774, -135, 984, 252, 695, 1358, -783, -2191, 178, 1847, 264, -365, 599, -588, -1976, -110, 1766, 475, -517, 12, -749, -1423, 603, 2062, 324, -910, -54, -247, -957, 636, 1995, 299, -1451, -782, -7, -195, 433, 1086, 66, -1274, -1086, -74, 624, 905, 586, -264, -908, -735, 285, 1226, 995, -118, -646, -545, -545, 82, 1215, 886, -841, -1296, -261, -15, -39, 1077, 1027, -1022, -1603, 190, 936, 295, 657, 793, -958, -1559, 422, 1305, 153, 45, 367, -1103, -1661, 502, 1475, -25, -462, 57, -900, -1222, 949, 1770, -42, -644, 24, -564, -636, 1294, 1617, -495, -986, -19, -447, -582, 1173, 1291, -969, -1360, -25, -176, -266, 1368, 1114, -1384, -1355, 681, 463, -247, 1190, 1187, -1528, -1669, 943, 1050, -474, 412, 794, -1538, -1821, 1001, 1398, -515, -110, 663, -1251, -1607, 1399, 2064, -547, -872, 666, -358, -1325]
659a325K282J169k498j155J497O2q74J463J031k126j402J625Q92q75N47J095j572
676a64j675J421J745p34o20N79o09j355Q21J749l40j077P7j93q22P68J709k58
694A022j558j61O05k42J86J289J8j518p10P86N04J02M31k12j239m61Q43O85JJ08
714D79k22j039l96J106R76j62n80l15m02o6P53Q12j95p65n94j65L62P63M88m43
734C95q53m35L02O36N02J07l39o53n07M03J048M37n63o20l41j09M01P76K31o89
754A29o53j73O5N52Q70j5j068n54L93M20L44M51p0q87o28L63P22M50j0n75p57
775f31j85N32N98K57j24o12o63J36P16N82J22l47p80m42N64Q13J78k78l37n56
795d57l81N78R34M2o30m92l36O3P83O65k67o67k67o7J42O87O78l52j003m23L71
$$ y = [-1325, 957, 2126, -372, -1527, -30, 32, -842, 621, 1652, -474, -1876, -251, 641, -234, 313, 1408, -164, -1839, -418, 1327, 593, -27, 552, -57, -1412, -591, 1158, 818, -259, -182, -375, -1197, -429, 1280, 1022, -536, -697, -92, -334, -148, 1141, 1159, -359, -1069, -283, 221, 323, 754, 542, -697, -1158, -315, 370, 371, 479, 257, -782, -1178, -72, 904, 742, 162, -153, -555, -621, 132, 944, 749, -16, -610, -775, -413, 350, 838, 395, -458, -893, -591, 45, 547, 654, 315, -338, -845, -442, 606, 1043, 480, -140, -481, -590, -189, 587, 818, 129, -524, -697, -632, -80, 790, 775, -293, -847, -454, -34, 310, 761, 691, -196, -824, -461, 261, 711, 701, 126, -631, -816, -284, 314, 571, 447, -165, -828, -692, 24, 606, 728, 381, -399, -841, -277, 536, 714, 436, 99, -457, -838, -260, 674, 716, 86, -406, -742, -679, 104, 769, 502, -165, -432, -499, -357, 330, 1008, 656, -347, -770, -399]
816c99O53L36j12m17l63m25K5R41P60o23q89l3J68J25P56N68q24r77L77M12k62
837b03O60Q12j159j535P88J298n46k89Q84n04j661N33J807k07r18N78p2j494M58
856g70K096j88j662K61P19j179k28J983M01j983n22J049j36l64J204L99j599o07
874a126J145K43m15Q45M29j545r18J300R05n88k16L82o92q65P25J081j07n59k30
893b06l80j57Q07Q03l74o44r1q2j45O61P95l65r97l22L12L38M32K11m45p27q5
914f61L96L15M02K62o17r07J47R45L09j80m4l00p29j2J004M30m90l22j75n69J34
935f62J224L70j077m45N25k35l00J119P98j210j113P33N71l65L98O77j011j148
953a151P48R08n06N2P17q56j361Q91J581n34q32O01j5j195L13J696m2j289ML16
$$ y = [-399, 254, 590, 478, 61, -302, -727, -702, 239, 999, 376, -513, -546, -378, -253, 503, 1071, 247, -730, -353, 59, -203, 457, 1269, 110, -1425, -637, 661, 115, -174, 710, 206, -1455, -922, 885, 678, -240, 338, 266, -1228, -770, 1326, 1138, -524, -263, 456, -723, -951, 1032, 1433, -550, -1072, -23, -159, -523, 681, 1080, -519, -1126, 19, 262, -153, 692, 1121, -424, -1342, -42, 863, 275, 59, 441, -251, -1116, -391, 690, 583, 24, -206, -586, -743, 64, 867, 493, -151, -242, -324, -469, 192, 987, 622, -375, -697, -385, -47, 385, 596, 151, -576, -661, -265, 50, 452, 714, 97, -810, -663, 282, 591, 411, 367, 67, -662, -674, 330, 760, 270, -52, -227, -796, -662, 562, 932, -145, -590, -65, -300, -600, 519, 1317, 107, -1006, -273, 298, -67, 331, 1008, -3, -1151, -403, 505, -1, 51, 768, -88, -1449, -558, 1023, 489, -343, 258, 243, -952, -639, 1057, 1015, -274, -270, 46]
973D6o75J66J403r7j426j52P64l21j57J122L20j501n69J022M64k91L34K14r82
992c16n52P71O20k09L5n4q38m02R22P44m09m30Lk51k28N58P75j41o26l96m0L01
1014a63O17K42m73m79j59l1L10N74J57n84n55o9L34N12L77k10o58k10K52J83K89
1035B56M78j65j021l33P27N25j77l3n6o59l63O84O60k22k22q4n04k20R16P60n88
1056C59o80K39Jm03N14R55m17j149n7N20L3J52M98l08r22l1O94K09j8L52k62r11
1078f32q6R59M85m03k53o9l36j64N40N75j32o38l84M7K83M06L09k04n89k95L33
1099b48M28J64J13r9o10m96N49Q19q7n25j06j11l98K57Q44J44p14m09J43P2K69
1120aN84J7p55l79L25K86R5L62lp77n02M62O21nj41r8m10l17L51O10J79k61l84
$$ y = [46, -629, -463, 940, 843, -583, -735, 29, -292, -449, 673, 993, -508, -1077, -55, 409, 118, 452, 666, -316, -868, -97, 523, 314, 349, 295, -543, -945, -23, 721, 312, -118, -115, -366, -594, -36, 739, 598, -28, -424, -464, -163, 454, 696, 223, -256, -415, -446, -136, 438, 595, 11, -544, -613, -279, 233, 610, 400, -258, -468, -216, -33, 256, 734, 569, -452, -785, -58, 467, 290, 257, 201, -458, -821, -137, 523, 301, 79, -5, -509, -729, 187, 947, 359, -321, -82, -81, -484, 30, 985, 568, -581, -638, -118, -85, 67, 565, 257, -665, -696, -2, 207, 189, 541, 279, -632, -718, 241, 726, 323, 70, 1, -335, -499, 41, 616, 484, -154, -538, -491, -208, 198, 507, 303, -286, -581, -248, 180, 344, 457, 358, -252, -748, -199, 620, 533, 8, -98, -209, -607, -350, 494, 638, -76, -485, -342, -270, -1, 583, 600, -155, -534, -209, 77, 172, 534, 531, -246, -748, -286, 335, 330, 189, 91, -319, -636, -285, 325, 504, 243, -141]
1143a41l23J17M18L86K3k96m85k13L52M42J00j50j99n14j99O11O29k33m05l0j73
1164b83j85N16P24k30q07n6K10n8K79N78k40q93j57N16J14NL85j11q79k21Q20
1185B7M05k65J5L6n97k77P58N85l39l53j02k57j06N97M99l48n08j38J2J07M78
1206B29L39l59n62j09L26K72K62Q8l80m27j25L24M48J50k49m57k17J21K48L24
1226B46J53l29m97j01L69L62J90Pl84m65P0N18K39o1q9k89m82J35O62K63l66l18
1248a67r9j39Q4O37K62m10m78K7Q5J86M45K07n65n78J65M38J9R1K11m20o90J43
1270e46P46J52k33l8j60n00J98P76J54m72j06J0m27R9R02K08q46l66L46qj89N69
1292B69M24p38o72L91M21l7K30K26n82n70L96O26j17r8J48m28n59L27P89Qm79
$$ y = [-141, -464, -347, 71, 457, 480, 184, -301, -514, -162, 280, 380, 230, 31, -483, -682, -71, 558, 325, -80, -110, -283, -468, 48, 772, 542, -265, -321, -111, -169, 110, 688, 448, -445, -602, -86, 28, 33, 418, 307, -572, -793, 27, 432, 167, 182, 218, -379, -656, 102, 687, 348, -5, -107, -364, -470, 127, 626, 278, -230, -368, -356, -249, 229, 568, 209, -353, -462, -136, 136, 398, 486, 106, -321, -446, -122, 326, 476, 227, -230, -447, -326, -78, 246, 399, 70, -427, -528, -159, 203, 393, 400, 16, -449, -379, 139, 378, 317, 228, -61, -543, -408, 254, 517, 151, -167, -266, -405, -321, 316, 578, 168, -310, -283, -198, -12, 433, 640, 75, -503, -338, 100, 119, 210, 421, 1, -689, -546, 200, 352, 119, 81, -79, -579, -381, 395, 549, 77, -29, -19, -446, -347, 555, 763, -83, -449, -103, -111, -300, 269, 693, -45, -717, -326, 95, 58, 288, 514, -68, -638, -242, 384, 267, 169, 317, -111, -670, -343, 446, 454, -25]
1313b5j36j05j70K21N31J76m41l54n3K09K94K85mm04m09J0M55K26o4j19j29m13
1335d19j25N83N39k92n32k5R8p4K64N58j62o83j32L43Q9J11L84k16p97j15O92
1356H9J86k97J54J69p27l87Q39O23m80l51K43j78m00N33P01l56o24J29M4k25L49
1377C4O56l81q46R9M46l9j5M90q2q75o1O56K57j72J11j11n49o1O46K15k91q3n6
1400a2m41k9O88L05m05l10o9m5J38M75J36l06k34j32o1L51N25j46n61j42J15J3
1422a47J79L78j08n79j79K64J62K12K50k84n39J8M55J03rJ74k14n77qN97K25k08
1444A65r9j45l64O8N24K48k86j98o7k11J02N89K11m04l99M0J17J23L33M9l33l56
1466b93l1J72K47K74j11m99j95K55K05J25J52r1m43k21L43L56P4r7j54l83o9M28
$$ y = [-25, -161, -266, -436, -215, 316, 492, 51, -303, -356, -147, 147, 432, 428, 24, -385, -375, 80, 306, 242, 123, -6, -419, -544, 39, 578, 286, -246, -271, -173, -247, 17, 575, 413, -270, -402, -59, 30, 141, 525, 309, -488, -603, 89, 275, -22, 132, 301, -426, -813, 26, 649, 169, -182, 61, -117, -517, 16, 717, 361, -263, -134, -90, -315, 34, 690, 309, -537, -438, 8, -31, -46, 444, 362, -513, -574, 82, 339, 167, 278, 167, -382, -443, 203, 418, 127, 44, -12, -453, -482, 206, 511, 106, -204, -273, -318, -180, 295, 431, 125, -109, -241, -302, 49, 574, 428, -133, -275, -160, -147, 32, 410, 302, -277, -456, -192, -30, 182, 432, 148, -391, -373, 82, 185, 176, 350, 136, -441, -449, 148, 373, 165, 66, -79, -443, -375, 149, 397, 111, -87, -154, -365, -263, 326, 537, 133, -266, -226, -109, 14, 347, 396, 63, -293, -324, -152, 95, 369, 258, -241, -436, -181, 24, 149, 301, 210, -233, -454, -111, 245, 319, 222, 68, -315, -384, 44]
1488D4K56j20q8j27l59n3N66L95l98l17Q2m1j43M66M86m09n66J17K42j18K34L60
1510E09l38p00J32M85%q2K86k05o48Q8O98P9l01J51l9n69M5Q12J47n68j12J92
1532F2l23j56P06L39o86m09L18J21j74L79L85n38n12K95L24n7J72K06m79m75L37
1553a65M05q6j8J25l68m85L54N67p0k90J3j19k80K76M89J4l21j75n3k6L08L08
1575D03j69k96r7j01KM56K50l89l80J36N6rL45L15m41m97K31L06o6J91K21n04
1597c7m77L68L58j84O3K59m85n89N40O32l38k71L57j69o70M32Q83k22p24K29J63
1618A18m75J11Q39j20q30M8L74k94M1P37j58r00P7O43k26j70O85j0r90n5R18k9
1640C34m72L32K08p92k58Q36K53n00j3J54m59j20P28K27n31l7K08m00r0Q09K06
$$ y = [44, 300, 180, 92, -35, -394, -447, 119, 514, 116, -201, -119, -160, -303, 163, 649, 240, -326, -209, 33, -85, 149, 509, 171, -529, -397, 88, 88, 6, 292, 87, -561, -473, 225, 304, 3, 154, 115, -454, -409, 403, 550, -18, -130, 62, -261, -417, 289, 628, -58, -467, -149, -28, -202, 177, 562, 24, -488, -193, 131, 74, 246, 452, -27, -502, -165, 240, 154, 136, 261, -107, -592, -238, 329, 259, -31, -18, -137, -417, -141, 348, 362, 41, -134, -187, -213, 95, 403, 234, -62, -159, -260, -258, 198, 448, 59, -321, -185, -129, -138, 207, 522, 81, -416, -185, 121, 55, 246, 467, -37, -514, -146, 212, 28, 91, 350, -135, -724, -184, 448, 110, -161, 196, 27, -643, -211, 672, 450, -274, -45, 118, -357, -246, 593, 473, -357, -309, 65, -229, -188, 549, 391, -509, -432, 211, -15, -185, 500, 490, -500, -555, 363, 334, -138, 194, 402, -390, -648, 188, 441, -59, -72, 82, -377, -497, 231, 458, -73, -110, 98, -302, -392, 417, 623]
1661F23p35j69L85j99k43O16L39p30m01M45J11j87L69J65n63k99M38J45q4K90
1681C16Po23j78N92J70k71J40J14n59k86O36L59l42j96J24k61j40M60L74l20k04
1702h8N2j60k4M92J90m40k20J86j35q8M92K12n57l53L07J64j13K57K27m83l53
1723d35K55L00K1O6P3l97l27M06K89j63K6J11m56l14M78M75k74k76J64j28l17
1744d23L34N69j72n02O2J07j26J90M11j72m83qJ74n0J65K90k23n44R6L49LnK66
1767C08j85m98K8N25J02j78Op5l19L9M01J40k19j05j41j84K15L70Lk58l4r0j43
1790b92K54M38j12l64n4R1n4J22L78j55m57m6J71KJ25K69j80m84N4L38j2PK89
1813C28k08n04O3N18R4k23R5o2m03m3N19J81l30j07K6j88j0M39K05l79k14J31
$$ y = [623, -112, -281, 104, -95, -338, 278, 617, -113, -514, -69, 42, -145, 224, 389, -174, -473, -35, 110, 26, 316, 323, -300, -478, 114, 284, 13, 153, 267, -292, -578, 58, 417, 75, -121, 3, -258, -398, 62, 436, 116, -88, -36, -196, -220, 272, 462, 22, -198, -12, -147, -235, 257, 469, -88, -441, -134, 30, -83, 174, 401, -82, -435, -180, 120, 141, 207, 280, -117, -444, -38, 251, 88, 114, 225, -231, -545, -67, 408, 134, -142, 22, -106, -423, -89, 480, 308, -194, -132, -25, -151, 39, 450, 278, -205, -213, -39, -89, 76, 366, 143, -401, -305, 44, 47, 42, 308, 123, -375, -347, 178, 280, 102, 108, 33, -286, -247, 154, 294, 75, -30, -171, -355, -140, 230, 233, -25, -59, -149, -292, -38, 400, 288, -76, -130, -39, -93, 29, 407, 252, -205, -251, -80, -78, 47, 316, 136, -348, -294, 44, 32, 39, 328, 120, -384, -321, 197, 291, 68, 163, 101, -302, -345, 174, 355, 25, -82, -56, -244, -254, 185, 390, 11, -203, -72]
1835g2j0m0L47K16l46m28K02K34q5J06K04k81m58J44L96Oj11J24j73k84P8M33
1857B02J25k78m9n3j71O5M04J24l68j92P3l0%L41J22l92k41J21J91K2J68Q5l15
1880d6k58J77K33Q8L3o1l03j39K32J86J1j2j23k59k7K71J97p9n8j45j67M1L18
1903A10J84j64j18j05j31J09L49M5k57j14j7r9P9L23R5l89j89J70Q3K4K35M7l47
1926g7k01J95J59N0J28n7l21j67K54J30KM7p6l35m5L12J73p7l6n0k56J3L54J43
1950B62j53r6o5j71Q2L49M6k81r2O4j74N6M66L8m64j26K90r8q7M32J83o00k37
1973c76M24J31k33J93K54n21l59M91K76l41mL25l75m76N48N15m46k66M32j31n64
1994e03M18P10l72o11L23K09m67J26O82k17p54J90M55k54j21N65n2p61P7O40j18
$$ y = [-72, -82, -122, 225, 441, 95, -333, -131, 103, 18, 124, 328, 47, -411, -267, 129, 135, 24, 148, -25, -309, -231, 202, 327, 49, 0, -53, -224, -159, 245, 369, 1, -191, -118, -148, -148, 193, 315, -77, -318, -197, -6, 16, 184, 269, -46, -304, -127, 106, 194, 227, 166, -137, -276, -44, 142, 153, 141, 18, -241, -268, 3, 200, 121, 63, -82, -249, -208, 110, 294, 130, 12, -93, -224, -115, 234, 279, 22, -92, -109, -208, -129, 194, 289, -100, -289, -119, -36, -12, 223, 270, -77, -278, -83, 76, 126, 254, 197, -124, -291, -37, 93, 95, 142, 66, -269, -314, -2, 171, 94, 58, 8, -248, -235, 119, 262, 109, 13, -52, -223, -141, 208, 254, -27, -119, -55, -229, -173, 293, 331, -133, -259, 31, -67, -154, 278, 461, -139, -376, 48, 179, -54, 139, 393, -128, -487, 4, 280, -61, -65, 260, -115, -591, -43, 472, 26, -240, 192, 61, -503, -85, 625, 253, -358, -35, 174, -293, -167, 515, 298, -456, -266, 189, -65, -186, 379, 327, -434, -357, 283, 165]
2015A65k91M12N9p17n8O79P8m58J31K26m90k26O86K26n18j04K71k34j97N24K50
2036D14m25k37K48k6j41L42K39m36k89K77O3r3J82J91m09k98L07K14j04P7J03
2057A99k77k19K30K82o2l7l9k04j53K66K47n9j62m5j46r3L00K14j32j87l8k8m
2080a47K58J70j77k07l0M8P2J92K8j64j64j6M9J39J64p4k78o6J16M5Q7K26r3l41
2104a63m1K13P1J9Q8r9k83l4K84P1p2M0p4l06L0M15L1k13M0L8l21M2M92Q1l89
2129d0q8K04j72j28M73J44m88j89L06m0j72L26K28m74k88L97R3j89K11K39m52
2150i9k92M14K74l29mL10l18m25M11M16k71k62J93j8l19J66M49j16l23M8Q8j40
2172a47J67L08j39l50L6J57j18Q5K92j48l80lK64K3m3J26n3k71o0K29K14n7p3
$$ y = [165, -126, 286, 345, -372, -430, 249, 327, -131, 0, 226, -264, -490, 196, 422, -96, -200, 71, -163, -360, 164, 414, -11, -248, 0, -26, -167, 175, 414, -22, -311, -34, 29, -64, 118, 309, -100, -398, -91, 123, 19, 96, 199, -78, -297, -67, 215, 153, 116, 77, -127, -280, -14, 233, 174, 12, -33, -179, -272, 28, 242, 110, -77, -115, -143, -147, 111, 281, 104, -103, -133, -85, -13, 179, 207, 43, -121, -137, -88, 51, 215, 141, -137, -203, -87, -42, 45, 271, 178, -163, -204, 9, 80, 99, 187, 88, -195, -229, 55, 126, 54, 94, 20, -286, -256, 159, 190, -23, 17, 55, -266, -224, 268, 349, -40, -128, 76, -96, -224, 249, 393, -95, -284, 22, -18, -190, 136, 364, -110, -398, -1, 92, -97, 114, 353, -99, -391, 23, 297, -32, -36, 274, -44, -469, -58, 358, 87, -175, 18, 0, -319, -153, 296, 180, -143, -95, -7, -147, 20, 328, 189, -161, -125, 32, -86, -1, 291, 143, -237, -240, 24, 47, 4, 130, 77, -194, -254, -25, 189, 132, 59]
2195E9j18p1K5J70P8kj11k06o5J74K03j1j41j3j03q3J65K34%j97j22O0M7J06R8
2220A76m6j10j37j2R8K03O4k20k09O3J08k0P0J83j32l23K3K73J34j28%l7j35m6
2244a60J87J59l0j87r8p7J28J82M8j48m3m4j15J44K54K8k52j20J09J9KJ83N6k26
2268aj99M4K03J8Jk2j04j12K9J82R4J7j37j60l5J89J42n6l2Pj58j21J77K91o6
2293A91l00r0J42K5J0J27R8k31k26Q4K03J09j4n6j10q2O0J18P4K7j21j64p7K29
2317B6J36r5j06L4j05r6J59K83l7l03p0J22M4L1J36J1k12j76P9J70R4j2j17j03
2341a07n5Q3P2J40K9j98j61R3J77K0J5k2q1j16%J43J29Qj84j79M3K03Ok7L4j1
2367E4k54n9L41J42j57j45P3k5j18J70K29j16k35qJ0J9J97N6j76j54Q6J8l1K10
$$ y = [59, -59, -130, -105, 65, 143, 141, 30, -176, -241, -67, 136, 125, -16, -29, -132, -215, -50, 184, 184, -13, -135, -75, -28, 78, 176, 130, 20, -117, -129, -31, 172, 236, 16, -193, -130, -22, -42, 28, 211, 79, -244, -221, 52, 186, 58, 58, 21, -114, -160, 27, 186, 156, -31, -129, -206, -78, 104, 152, 4, -39, -83, -198, -54, 200, 228, -24, -144, -35, -16, -14, 169, 225, -1, -200, -156, 47, 65, 66, 44, -60, -172, -143, 39, 133, 150, 13, -147, -182, 7, 149, 93, 61, 68, -90, -211, -34, 257, 191, -109, -199, -57, -32, -22, 105, 203, -28, -254, -170, 33, 142, 128, 72, -38, -120, -60, 58, 132, 159, 38, -126, -203, 26, 162, 67, -39, -5, -110, -206, -47, 236, 199, -104, -174, -52, -8, 23, 159, 170, -42, -218, -139, 31, 125, 113, -4, -107, -162, -79, -7, 133, 162, -36, -197, -104, 73, 93, 108, 86, 5, -111, -111, 32, 161, 169, -15, -194, -151, 52, 58, 31, 65, 54, -200, -259, 82, 224, 67, -78, -5, -30, -148, 22, 251, 135, -100, -108, -98, -79, 118, 174, -2, -156, -70, -52, -83, 127]
2391A27J41k92k20K13J54r8J0J73j58l07J28K68Oj52J1l5j73O6K42J8j02p2n6
2414a08o5J42K30q0j77nM8j01J11K18J5l12j20J76R1q8Q8P2k15j23Q8K12L8n6
2438G9q4p9j3Q6J06M4n5r1j47M6J38R8p2o8r0m9P5J04Q8Kj64j13K6J98P9r0k7
2465B7j4j22l5J98J97j58k21L4N1m7R4J71p1k56qJ42M6K5J19p6k37K6J76J2m2
2490C1R8r8k61M9L13L0j99K6L4k12l1L15J25k18q8O2n7K3K08M9j69j61O8K3M2
2515BJ26M4j92j33Q1O4L1J14k6k00q9J23R7O6J2p3j39n7J30J21Joj32j33N1J70
2541E3Pl7M7j27j43O0L04pj73Ojj16N8K85m0k01k3K8q4N5K38kl07j5J31k9j4K27
2569A80nl18o7K61O1j33J31O8k84j24K38J54j38j8N2j66j32K23K38j88j16R6m7
$$ y = [127, 268, -24, -244, -31, 123, 25, 35, 208, 50, -257, -129, 139, 145, -7, 4, -31, -204, -138, 104, 122, 20, -52, -108, -173, -31, 199, 119, -58, -63, -15, -116, -5, 213, 228, -84, -204, -28, 63, -25, 63, 135, -80, -203, -115, 97, 135, 79, -5, -84, -97, -11, 95, 139, 84, -7, -154, -108, 30, 128, 56, -12, -102, -151, -76, 28, 116, 118, -46, -159, -133, 65, 144, 54, 27, 13, -109, -144, 54, 251, 93, -128, -94, -43, -90, 4, 175, 104, -152, -160, -18, 28, 53, 172, 96, -141, -115, 61, 73, 31, 129, 31, -230, -181, 132, 162, -37, -11, 23, -189, -220, 95, 220, 2, -86, -24, -81, -58, 150, 199, 30, -131, -63, -40, 2, 128, 172, -20, -153, -72, -8, 23, 137, 111, -89, -178, -55, 42, 108, 120, 47, -92, -149, -19, 102, 103, 97, -35, -168, -117, 53, 60, 23, 70, -57, -200, -140, 164, 157, -16, -10, -11, -127, -69, 216, 176, -25, -48, -20, -104, -49, 189, 187, -120, -135, -4, -33, -47, 180, 175, -143, -210, 51, 112, -21, 110, 178, -106, -230, 8, 162, 24, 6, 58, -108, -240, -17, 221, 33, -83, 13, -34]
2592c4j52J99K41j61k05Q7P2j17R6K24j47k61L7J65k5l8J67n1k78KK14N3q6O1
2616F3nk20lK52R0j53j6Jj20j6J94R9j45j27K5J4J0Q1J14p9j60QQ9K3J05Rr3j23
2644h3jJ14N5K8m0r7q9NJ35P1l7o9r8lN5J10O2o8j00m7OP9Q3K9m8j37l7P4R5O1
2674A08l3r5j03K7Q8R9j5l0q1o6K6J43N4k8m0j10m6O9J41K5p9j09l5MQ0J14Kj42
2702c2n1Rj8J10R7j8j68m1N3N8N8P4m8j96m6J46L9L8mo4j25%J54N5J7l8p0o9Q
2731g2J44M1l6q3k2l7J6J20O6q1j34m7P5K8R2om9j15m1O7J17P3o9p4l3n9J02J22
2759A05jr4q0pL4L5R6jj36p0O6M2K2Q4J2j44q6Q9R8k7M0oj01r3P0J43k5o3k8n6
2789h2o5J30J17nj36n7K4j1Q3J00L8j76r9R8O1L4K1J9j76m8Q7R2M0l8lr0o2O2
$$ y = [-34, -186, 13, 254, 93, -112, -25, 47, -70, 26, 250, 103, -158, -121, 44, 19, -19, 148, 97, -181, -179, 35, 88, 2, 63, 58, -162, -165, 87, 177, 24, 8, 9, -111, -127, 67, 166, 21, -106, -81, -67, -57, 24, 138, 59, -101, -93, -4, 19, 124, 133, 40, -83, -84, 30, 85, 113, 73, -24, -113, -108, 27, 98, 61, -8, -106, -109, -54, 56, 118, 50, -50, -97, -91, -12, 71, 100, 52, -85, -122, -48, 47, 108, 75, -20, -123, -96, -8, 91, 76, 46, -35, -101, -75, 68, 122, 94, 54, -56, -102, -33, 108, 133, 54, -55, -90, -86, -6, 108, 110, -32, -83, -74, -92, 18, 115, 97, -71, -112, -59, -1, 57, 131, 83, -113, -159, -13, 26, 64, 60, -4, -129, -129, 25, 80, 97, 59, -11, -80, -72, 72, 113, 77, -6, -28, -65, -49, 71, 137, 56, -78, -125, -50, -22, 70, 64, 15, -100, -141, -74, 43, 116, 47, -27, -60, -119, -17, 105, 104, 10, -70, -77, -43, -8, 88, 87, -49, -119, -53, -11, 11, 95, 107, -37, -123, -34, 64, 37, 77, 71, -30, -123, -53, 90, 65, 2, -26, -82, -147, -17, 100, 95, -41, -98, -74, -85, -2, 98, 136, -40, -139, -41, 20, 54, 75, 94, -82, -130, -43, 49, 89, 51, 48, -42, -104, -42]
2817d2J58j6o5m4l3j4N6J14oj16o5lK2O3Q3k9j09p8M1J02K5oK0j02m2L8J06N4
2845A12n4n6l3k4K5Q8M0q9q9jO5pR8O7j20j41M8P5J8O5J9r4j07lJ69Pm6Ko0j12
2875a38L5J57K6q5l0k1o0P0J47jj04m5L4j8RJ51%j67o1M9N1L1P5k6j22o1N9P5
2903C0L5mk2j24K2J8J03kK9j08n9MQ8P3k9j8q1o9N1R4N1n0n7m1k6P0J24pq1j8
2933dn7J5P5J01m6q7j5m9M2O2O5n0j13J2j5P8L8J7l1j00KK6P5N0l5m9p4k7R0O4
2963F0jo6o4j6L4O7O4j4j02m6K5L6P0M7j4j42kJ1R9P%k3p5p1O6J09Lm0l1n2l2
2994i3Q1Q1k0o6k0l5K3O7J28r5r2l4L6K4M8K1k3j10m1P1P6K8j3k7p6j3N8R1J5
3023I0n1l0n1LL3R7mr7j9l3J8N9P3k5p8p3L5M3K8N9m6j07k1P3O0K0J2n7j19M6
$$ y = [-42, 116, 100, 35, -9, -42, -56, 0, 114, 108, -8, -73, -76, -54, 9, 92, 63, -46, -124, -83, 19, 44, 38, 58, -44, -86, -48, 58, 112, 58, 2, -31, -55, -30, 58, 98, 9, -80, -81, -16, -23, 75, 142, 22, -119, -71, 4, 22, 87, 106, 12, -95, -98, 71, 78, 32, 34, -26, -138, -103, 54, 80, -5, -35, -56, -116, -46, 101, 100, -4, -49, -15, -33, -24, 127, 127, -40, -101, -52, -1, 30, 105, 79, -43, -104, -45, 30, 65, 61, 39, -85, -63, -45, 58, 56, 85, -23, -82, -78, 10, 83, 54, 36, -45, -114, -63, 31, 82, 32, -25, -66, -92, -22, 102, 95, 14, -4, -61, -46, 29, 130, 84, -3, -18, -67, -25, 37, 102, 52, -61, -49, -64, 14, 52, 69, 38, -62, -60, -34, 41, 91, 56, 7, -67, -94, -4, 60, 59, -7, -71, -87, -53, 14, 78, 64, -38, -84, -59, -23, 47, 94, 80, -62, -64, -53, 46, 53, 53, 30, -45, -116, -50, 59, 62, 22, -9, -61, -93, -12, 69, 49, -17, -37, -72, -49, 18, 146, 51, -41, -75, -39, -15, 33, 54, 31, -79, -120, -49, 27, 55, 42, 15, -61, -74, -16, 75, 90, 39, 9, -42, -39, -6, 91, 87, -10, -29, -62, -44, 15, 88, 63, -15, -88, -53, -10, 18, 77, 31, -76, -97, -24, 36, 56, 68, 11, -108, -62]
3053f2N3N6jj2n0q3L2J08Jj6J6p8mOJ30L3j10k6m1j1O3Q4np3o5k0mP4Q4k2j04
3084d7j6N4nL1P2j4j10p9J29Qj1J6qp6o4J08J00m7m2J8p5k1J10R8q9k6j0j9k3
3113c8R1R2r6j03J4K2KK5J03p0j76N4N9J0N5Pj9j27J0J00O8l7l6pq6kJ35N0q9
3142A1j1k1o1K3J26M2j01n2J3J6qJ04K0q0o6J4M4jO8rj04l0J8M6pO5j4j11m9R9
3172a6N9k6J0k0p3k0P9O8k4m2Km6k7N6J12k8q4Ol8k6Q3J30j00q7LO8l5M8J07r0
3202D9j45M4O9j4L7M2n2j40J8J32Mm5J3k6q6L7J29j6m6j5Op5L1J24L7j01n3L0
3230a2m1%J01O5j25n0M7koP6M4j07q6Q8N4k3L9K7j19o7P2Q9m2kj0n1o7Q0Q3Jm0
3261A6k4l1l3Q3P2l2o3lj0RL9P1n2q6oN5J4K1Mlq5QJ5M2Q0n7l7q6K7M0O3pj6o5
$$ y = [-62, -9, 47, 46, 34, -16, -99, -67, 41, 42, 26, 42, -36, -40, -34, 96, 129, 19, -7, -48, -59, 4, 88, 83, 10, -55, -75, -79, -5, 79, 57, -47, -63, -9, -14, 17, 89, 75, -35, -114, 15, 23, 12, 28, 20, -56, -120, -12, 88, 41, -1, 17, -58, -79, 31, 129, 40, 14, 4, -15, -38, 53, 145, 49, -54, -40, -18, -16, 9, 112, 42, -134, -80, -21, -11, 44, 51, 32, -95, -85, 15, 83, 46, 10, 3, -83, -85, 50, 100, 11, 0, -21, -82, -59, 67, 109, 8, -44, -31, -15, -23, 81, 101, 21, -45, -31, 13, 12, 80, 71, -33, -63, -45, 1, -6, 59, 45, -66, -115, -16, 43, 17, 27, 7, -66, -86, -7, 61, 37, -5, -3, -49, -76, -20, 92, 64, -20, -14, -52, -78, 5, 135, 35, -52, -49, 19, -16, 32, 139, 49, -96, -52, 17, 3, 40, 82, 30, -110, -92, 40, 44, -1, 12, -14, -100, -63, 66, 50, 4, -11, -5, -80, -49, 75, 112, 11, -42, -12, -53, -53, 48, 113, -12, -62, -15, -17, -23, 53, 97, -10, -96, -8, 46, 23, 62, 89, -30, -97, -25, 64, 22, 20, 10, -41, -108, -28, 55, 56, 16, -8, -39, -72, 11, 83, 51, -12, -15, -25, -16, 23, 94, 42, -44, -50, 5, 19, 40, 44, 41, -44, -36, -21, 21, 101, 44, 7, -79, -52, -12, 51, 44, 28, -37]
3295c7Nk0N2L5j4m1m7J0M3L9Ll3nm8kP8L7L3q8k9L9k1L0K7K0n6n0j9P5L1Qm9k3
3328a7m2M4L7RQl6k8m8Q4J2K7l2m7l6K7N7J3J4n9n3J0K9P6J7l5p0pJ7L6L9L0l3
3360D3r8K9L8M1PPo3q8O5M2j0M2k1r3j7M8P0J5jm3n2l6P3M2j1k1j2m2m4R5N7j3
3392D9m3l7k7K8L1R2p3n8J6K7RJ0N6l9q5j0O4J5J2M5n4r5J2N8K5j4J9m0o2NJ07
3423D3L0o6j9Ml9LO3L9m8m6m1L8L7L2Ql1o3LN5L2J4Jl3n7K7J7O1Nm8l3m7O2L5
3456C8kqj7n9l5P4L7J3l0l8rj3Q2K4j6l8n5oJ0Q6K5l5p1k2K4M0M2mmn4k5K5K4
3489CM8K8o5p7J0P6L0nl1k8m3K3M6J1J6n8l9JM1L4j0pm4j0KO7J8oo4mk5J6P3K8
3523E5m0n4PLj2P5N0n4o6K3OK2K5M0p3p4N5M8J6l8Nk5o2RR7k0Rl4j9m6jR9J9o0
$$ y = [-37, -32, -52, 0, 35, 21, -20, -67, -57, -14, 25, 28, -5, -10, -58, -60, 18, 55, 88, 0, -29, 10, -11, 19, 46, 66, 10, -40, -59, 16, 47, 55, 6, -17, -59, -15, 22, 31, 39, 3, -25, -73, 11, 23, 50, 18, -29, -65, -38, 19, 32, 46, -13, -66, -56, -27, 49, 66, 31, -39, -46, -29, 7, 46, 76, 43, -55, -26, 12, 53, 60, 67, 4, -84, -19, 23, 13, 55, 34, -59, -76, -28, 42, 57, 56, 13, -39, -75, -2, 40, 29, 8, -4, -46, -90, 5, 62, 49, 6, -31, -58, -30, 1, 93, 20, -38, -22, 5, 14, 24, 80, 41, -44, -54, 10, 25, 37, 82, 28, -67, -55, 3, 28, 14, 33, -7, -69, -64, 43, 73, 7, -12, -8, -47, -44, 19, 58, 10, -36, -77, -39, -2, 30, 38, 7, -56, -53, 2, 34, 48, 49, 16, -41, -14, 3, 64, 69, 21, -12, -59, 3, 38, 36, 28, 11, -48, -83, -9, 28, 41, 11, -27, -36, -49, 33, 57, 41, 3, -52, -58, -48, 38, 63, 28, -43, -65, -41, -1, 41, 37, 33, -21, -46, -21, 3, 51, 79, 14, -63, -53, 23, 53, 48, 17, -11, -54, -31, 15, 26, 42, -16, -55, -54, -13, 21, 11, 4, -40, -50, -48, 19, 37, 31, -33, -37, -62, -46, 27, 55, 15, -39, -32, -29, -41, 34, 84, 30, -36, -13, -7, 15, 40, 80, 7, -67, -12, 36, 52, 14, 19, -6, -68, -59, 38, 18, 27, -7, -26, -72, -73, 26, 45, -15]
3557a5kKm1J2Q9J3q3Jj4K7j2Q1Lj00j0M2J7j1O0j4n4l8N9K0J%J7p7l2P8K4k0l5
3590a2ok6m9Q6Q1m8n6Pkk4N7N0k1p4M2rj0K6P4o8n9j1O5kNL6l4p4j4J25j8k9J
3623IJ6n9KP6RPq5K8m0k2R8Nn3n0L2lrN1L1k8n0QrM6K1K0m1o5K7L5K5KmKq9M4
3659a3L3K0Om5k9pK3O4rl3j7j9lJ6P1j1m7l4k3K7K0J7J7l4m0J2M8mK4mm7j7J6
3692b2M0K7k9k6pnM1J3qMm9%J3QL7J5m5k7j7K1M7j0Lm1j4MK9L8k6l5j8LjN4J0
3727B7mm7j4K5QO2Mn3n4L3K1K2M5k6l6k7j7M2JK9Qn8m9L1N8k8J0J4n7OL0M2J3
3760F1m6l8j4j6K8K7J0l2j9j9K7L6J4J5l9l6M7L%L9l0k0k4J6L8ML0n4l8K8pL0
3792B1J8l3j0k2kJ7N6%n4l4K9OL8nmk4k7L8j5K0J8k0l8J1LN0j4k1jj0l3O8K7k9
$$ y = [-15, -17, -15, -56, -44, 45, 58, -25, -24, -38, -11, -23, 58, 61, -39, -49, -7, 10, -1, 59, 45, -9, -47, 12, 32, 33, 33, 50, -27, -59, 19, 43, 23, -12, -18, -44, -93, -7, 74, 26, -30, -23, -25, -49, 8, 58, 37, -37, 5, -4, -14, 12, 86, 18, -41, -52, 13, 11, 16, 52, 18, -56, -70, 55, 37, 8, 9, 25, -34, -32, 44, 53, 60, -25, 3, -37, -59, 39, 44, -9, -59, -27, -30, -39, 12, 43, 15, -35, -27, -36, 10, 31, 51, 10, -55, -28, 7, 32, 34, 30, 32, -57, -13, 20, 40, 46, 1, -28, -35, -12, 52, 43, 10, -7, -26, -29, -13, 58, 47, 0, -34, -57, -30, -10, 7, 24, -10, -50, -38, 10, 6, 30, 26, -21, -38, -22, 18, 45, 16, -10, -17, -22, 19, 32, 24, 28, -21, -21, -8, 0, 37, 52, 7, -20, -37, -16, 31, 21, 24, -17, -31, -27, 2, 40, 14, -21, -39, -36, -37, 17, 27, 23, -24, -38, -13, -5, 57, 61, 8, -46, -13, 8, 30, 75, 49, 13, -14, -31, 11, 12, 41, 49, -9, -58, -27, 31, 3, 13, 27, -30, -24, 6, 48, 61, 15, -23, -37, -53, -25, 2, 12, -20, -39, -58, -31, 5, 19, 34, -5, -41, 6, 9, 9, 48, 18, -2, -26, -10, 28, 32, 62, 8, -30, -2, -9, 21, 39, 6, -4, -26, -28, -11, 45, 45, -9, -43, -14, -8, 30, 25, 21, -3, -30, 8, -7, 13, 31, 11, -27, -16, -13, 37, 23, 2, 1, -9, -42, 26, 53, 24]
3826B4%jl6J3K8J9Ll7k9NOL9j9nk3k2L9j0J6L4j9p3J3L0J2RM2p0l7K9L5J1J1m0
3860crl3J9M1L4rj5j6j1rM5K3m1lj8LQM5l9l3J0k7mP8k4Ml7jqK0J0N4o0j1rNL5
3897A4J7J7n1m4KL6K9J0lm3j0k1M8N4l0j5k9JK7K4j1J6j8l5l1N1K1pj6k7nL3o
3930bK2l3j7mk4M0L5K1ln0l7N1NRNqm3J7K7K0Lj4k2rj6K7K9Mj7j6k0L2L9Jj7m5
3966a0j5J6jM2k8nl1NNJ9K1J3m8j7KK9K7j2Lk8KK7jK8j7k6kJK0jK0j8j8nK2K2
4002D1jk7Rl5M1k3j6K7J5j1m0nL2pJ6ml1l4RN6J9pk8Kk1M8oJ4j5lk3MK2K0%k3
4038A5k9OkM1J7k6rj9j4L0nM4l7l5NOK3rMqll7L8LJ0kj6k7K4K8K8k1j2k7J9pL9
4075C5kRn1j3J9J4QL8m8l7K8j2K6NJ3n9K0pL6kj0K2o8J4mK9J4pmNm4K2L2lm5K2
$$ y = [24, 24, 23, -13, 0, 28, 47, 50, 13, -16, -11, -5, 34, 15, 10, -13, -35, 4, -6, 10, 44, 25, -48, -35, -5, 7, 16, 58, -12, -49, -20, 15, 26, 37, -3, -12, -45, -26, 15, 49, 40, 25, 9, -2, -11, 34, 57, 16, 13, -5, -2, 6, 51, 12, -21, -11, -38, -42, 36, 12, 16, -21, -22, -30, -10, 0, 54, -6, -17, -26, -21, 14, 31, 48, -3, -47, -45, -9, 20, 30, 27, -16, -26, -47, 1, 55, 25, 10, -19, -18, 9, 33, 22, 38, 20, -15, -46, 5, 26, 19, 3, -24, -29, 4, -2, 20, -13, -30, -34, -58, -18, 17, 38, 35, -15, -52, -1, 4, 13, 18, 10, -33, -16, 11, 31, 34, 20, -2, -11, -27, 0, 29, 33, 16, 0, -20, 12, 51, 52, 35, -10, -25, -9, -10, 32, 4, -1, -32, -27, -22, -3, 18, 31, -17, -34, -32, -3, 24, 12, 15, -13, -11, 16, 15, 43, 26, 0, -2, -1, 19, 18, 38, 20, 2, -3, 19, 41, 40, 13, 22, -13, 28, 5, -11, 16, 31, 20, -20, -25, 7, 0, 16, 12, -19, -53, -44, 12, 31, 24, -4, -2, -23, 25, 19, 33, 18, 15, -8, -4, 18, 38, 38, 15, -14, -8, -10, 31, 48, 22, 13, -6, -20, 10, 5, 49, 12, -23, -18, -12, 11, 2, 6, -2, -5, -42, -4, -1, 9, 7, -9, -36, -12, 16, 44, 23, 11, -16, 3, -4, 35, 33, 42, -9, -22, -3, 11, 19, 57, 9, -28, 0, -12, 14, 19, 32, -27, -7, -14, 22, 20, 10, 32, -36, -22, -26, 3, 17, 10, 6, 11, -33, -11, 21, 18, -27, -5]
4111ek9J6jN0Pm5kK1l2NP3j3m6rMK1QJ5m4m5M6lKK4Kj3l5J4K1OJml1j8J5L9J1
4148B6Rn5k3K8OK6Rk0j9K7l2K8NJ2j5j5l1RL5mJ4k4Kj3J6pJ9lqnj3J6K3k0j6n
4184a8J2k2M5j2j5j1KlJLL1Qm2J7%K5j4K8l1LKJ3J8ol3j3k1M5K0qj3Kk3j7JM0
4220A4j8K1k3l1J0M5KJ4qm4K0k5L7Qj6Ml0J4J3%mj2j1JL0NMjj0nKJ5J8nl5K2k7
4257fK1j7N1k0rl0j0K9mK0rk8j3j6L5J9Rm5RkMjNJ4j3J0kj2O0j8k4k1J5J3J3L
4293C0j6Lo2M1PMkKj5JRLj0L4k3n1J6MK0J2nKl6j8L9L2j5rK5l2J2K3qJ4k2j3L
4330aJ2NJ3l1J2kj7L8mJ6k6k7MK6Oj6L0k7n4K3K6loQk6J0j0L4j1j7j7K8nj0O1
4365D2j5m3L3k1kJ7oJ7j2l1K6J5j3J2mj5j7M7qoK0k5j2j1J6qL1j8J0l8rM7j8K
$$ y = [-5, -34, -18, -19, 31, 38, -7, -9, 12, -20, -15, 58, 45, -1, -10, -6, 15, 23, 38, -6, -51, -5, -8, -6, 18, 20, 7, -28, -14, 7, 13, 14, 10, -21, -39, -24, 15, 26, 35, -20, -43, -15, -9, 17, 26, 6, -13, 14, -18, 10, 15, 27, 12, -3, -34, -25, 10, 6, 20, -4, -2, -15, 1, -6, 13, 10, 2, -3, -16, 0, 23, 3, -13, -18, -6, -28, 17, 5, -10, -21, -19, -22, -21, -18, 13, 21, -21, -4, -4, 21, 7, 35, 4, 7, 9, 22, 40, 34, 1, -12, -33, 12, 32, 24, 11, 13, -10, -27, -26, 14, -4, 17, -6, -37, -27, 18, 20, 34, 26, -18, 2, -23, 14, 22, 6, 10, -20, -6, 7, 7, 3, -9, -20, -19, 11, 16, 20, 19, 9, 4, 6, 21, 39, 34, -1, 21, -6, 15, -2, 49, 29, 20, -10, -20, 9, 5, 25, 16, -12, -25, -41, -6, 13, 22, -23, -14, -16, -12, -13, -8, 6, -7, 3, 1, -11, 49, 31, 7, -14, 1, 14, 27, 30, 14, 17, -45, -4, 3, 7, 5, 7, -8, -7, 2, 5, -5, 29, 6, -45, -29, -25, -5, 7, 2, 4, -32, -50, -11, 21, 6, -3, 22, -10, 2, 25, 17, 31, 9, -4, -1, 11, 16, 29, -2, 10, 8, -9, 29, 25, 41, 15, -12, -8, 18, 24, 8, 38, 11, -43, -20, 6, 3, -3, 5, -21, -11, -21, 13, 2, -15, -32, -4, -9, -19, 42, 27, -16, 17, -4, -6, 11, 5, 22, 10, -21, 5, 20, 7, 19, 15, 0, -17, 30, 22, 16, 36, 11, -1, -12, 4, -4, 27, 9, 19, -19, -28, 19, 1, 3]
4399Cjn3M3nj0M9j4om0K0K4j7L3jl7nL0J0qj9RnPL1k9KJ0Pl9QK2J8l3Nk1mK3j6
4437iPK5l5rJ5LK1k2kj0J2KQL7l7K1m0qK0KJ0NQm1K6QoJ4k0k1J2mM1m5K6j0pP
4475DLK0Nl2j9j6L5oNk2RQj6K8qM5n3j%JRJ8j8K2j1j4PJ6j6Kpmj3K1K2j3l0L0
4513A1QqpJ4j3Nj4Rk5K1K5j3k1j3OJ8Rj4kl6J4k3O5J6m5jJ2j7M6j2J7Kl2j0J6
4548HJ6k8J0MkJ3k8K0%J6l7%MJ1lj1k5J0K0k6M4%l4MK5k0J2j8J9j4J1qlK2J5j3
4584A4j4k5M9%K3Rl8j5j4M9k4K2nm4ORj8J0%J9j5j1J2J7kpkk1J2pkLNk4J6MK0
4621A1l6K6j2L8j2oJ1K3k0k8J1J0Krj1L9m8J0j2j2J9K7j6pmj0mL4k6j2LK0orj5
4656c1L2ok6K2rM1j2j7J0lj1J2M4n4R%K0j6RJ1j9j5J4J4nMKk8l4N9j0K4j3j6P
$$ y = [3, 2, -51, -8, -13, -23, 26, 12, 6, -34, -14, 10, -7, 26, 25, -12, -17, 13, 23, 15, -4, 5, 0, 7, 38, 9, 11, 21, 28, -11, -3, 19, 37, 4, 9, -12, -16, 7, -9, -2, 23, -12, -21, -6, -3, 18, -4, -6, -16, -4, -2, 6, 43, 6, 27, -13, -21, -1, 1, 11, 16, 24, -17, 9, 17, 11, 25, 5, -16, -4, -8, 33, -12, 14, 4, -3, 4, 7, 27, 32, 0, -19, -35, 0, -6, -1, -23, -14, -6, -22, 6, -2, 43, -10, -11, -11, -10, -1, 17, -1, 21, 10, -4, 3, 19, 3, 5, -2, -6, -19, 2, 24, 11, -19, 11, 19, 11, 4, 18, 5, 10, -4, 5, -20, 1, 26, 13, -8, -21, -15, 3, 12, -2, -4, -40, -26, -49, 16, 32, -13, -14, -2, -19, 27, 15, 32, 34, 2, -8, 8, 24, -4, 6, 10, 8, 21, -7, 13, 13, 29, -8, -8, -4, 7, 4, -7, -32, -22, -2, -28, 16, 16, -18, -14, 11, -9, 3, -15, 4, -10, 1, -7, -10, 12, 27, 14, 0, -25, 24, 24, 47, 56, 18, 3, -11, 38, 14, 36, 31, -13, -7, 2, -16, -6, -6, 13, -2, -13, -1, 16, 14, 7, 5, -16, -4, -11, -13, -10, -5, -29, -13, -9, 11, -25, 1, -11, 27, 15, 9, 20, 43, 23, -5, 6, 16, 18, 9, -2, 37, -11, -1, -13, -25, -6, 21, 5, -2, -6, -16, -20, 14, -12, -24, -21, -1, -7, -16, -31, 1, -5, -31, -9, -18, 23, 11, -6, 4, 1, -10, 2, 46, -8, 1, 1, 21, 5, 14, 25, 6, -9, 5, 19, 14, 18, 20, -8, -42, 17, 7, 31, 18, 2, 9]
4691Il7J0L7k4K4Nk9lJ0J0j5Ll2M0k3JJ3j7L4k5RrL2nlj9J2jK5k9L0Pk4k2MJ0
4727HJ7j7%j9j5K3MRj0l3RJK1qJ0j1L2m7J9L0j5Ol8M2k2J1J8ll1M0k5MkN5l4p
4763B2k9L6J3m7MoK4orJ5j1Jk9PJ1pkQpJ2l1K0K2j6krk2L9kK5j0mj3NJ0Nj3K4
4801B8k4%kML7j8j1k5jL0J6k3l0K5Ml3OlN3l2K1k1mj3K5Kj8K1k4j1oK0K8j4j0
4836ckJ0lKJ7j1%OkjnJk2J5NJ6jj4rJ4Nl4J5J3pm0J1OJ5K0k3k6K0pJ5nK5k1K0
4875A5j1kPj6J0kj8K4lJ8jKj9jJ4k7K2Mj3lQl4M3qJ6l6K3kpk2J9mjj3J9q%Qnr
4915a3J0j0L7k6mKkRJ0LJ3lk5J3J3l5mM6l1Mj7J6j5N1m5R%k2K5J0m0K3j7l2L7
4950a0K7j8J2k5j4nK4J5nrjoK0jLj1K9lkJj3Ppj1nj1M5k3L7j07K4j0N3j7m1J56
$$ y = [9, -28, -18, 19, -5, 19, 24, -5, -8, 2, 12, -3, 0, -32, 8, -15, -14, -1, -18, 16, -9, 0, -9, 23, 18, 15, -4, 8, 7, 32, 3, 33, 40, 16, -6, -2, 8, 25, 8, 8, -11, -26, -3, 1, 10, 0, -33, -24, -23, -2, -10, 0, -11, 21, -26, -7, 23, 8, 14, -24, 18, -4, 7, 25, 22, -9, 31, 6, 10, 8, 63, 29, 22, -7, 29, 42, -5, -1, -7, 17, 11, 2, 17, 6, 7, -22, -15, -4, -11, -13, -5, -12, 0, -31, -11, 11, -5, -7, -16, -38, 1, -1, 24, 14, 10, -3, 2, 12, 17, 4, 28, 4, 4, 2, 6, 43, 25, 14, -11, -12, 18, 34, 11, -19, 6, 10, -23, -17, -20, 33, 1, 22, 1, -3, -16, 9, 11, -7, 14, -10, -21, -27, -7, 21, 7, -3, -5, 5, 2, 4, 21, 10, 10, 16, 14, 13, 8, 9, -13, 2, 7, 23, 22, 8, -1, 13, 18, -16, -1, 12, 5, -35, -24, -18, -3, 17, -6, -32, -12, -19, -4, -9, 16, -5, 15, 4, 2, 9, -7, 3, 1, -17, 7, 4, 22, 21, 23, 4, 3, 17, -10, 12, 16, 3, 0, 8, -26, 17, 9, 25, -11, 12, 10, 3, -19, 0, -4, -5, -18, 1, -7, -7, 1, -4, -13, -3, -13, 24, -2, -6, -4, -6, 3, 13, 16, 29, 26, 1, 14, 27, -8, -12, 34, 3, 7, -10, 6, -9, 42, -3, 6, 6, -16, 9, 19, -21, 2, -15, -47, -10, 17, -1, 11, -14, -28, -33, -9, 6, 1, -8, -9, -15, 5, 4, 7, -4, 25, 22, 20, 21, 8, 15, 8, -3, -8, -19, 26, 3, 40, -67, -43, -53, 0, -17, -58, 98]
4986I8j09Nj7L7Jm5J7j7J3J6j0K9l8L5k3oJ8L9k2k7L4k5LnMnKj5K3lJ4k2J9k6
5020hL5k0J7p8oL5M6Q4j34p9O8Rm8J27k0j90J63JK5j0o9Q1l4j8L1Pk9K2Qj3L7
5051D0m1J7oJ6k2KL4l6j3oJ0PJ9kj4j2J3m8N2ml1J6j1j4O1k0k4QK2jj1PqJ1j8
5086gpJ3J0oKjJ4rmj0M3k6j7K5k7J2J5j9j2M1k2%j3J1JKk3K2J6l2Rj1J3l5J0J9
5122cMLk9J6K4j0OjlK8k9j3J7JKJ1j8MLj3K1m5K0K8k5j3K1K1m1MPNj2QNpMPmq
5162dPl8K8j6RK4j3Lj2J3j9J8J3j2J0j9rLL6k8K4Pj7Oj6K4k1Nrj3KK5koK1k6k1
5199b3J4j0J7Qjj1Rj1kRPqj4J5j0L8j0jPk6%j3L6j5j6K7j7mOL0k8rjJ1K7l6qK4
5237A1l0K5j2%K0j9k2J8J3Jj6QjOrJ0QK1k6qK5k7J3K2k2oPj2K2Nk0jK6k5j0J3
$$ y = [98, -11, -6, -23, 14, 15, -30, -13, -30, -17, -1, -11, 18, -20, 15, -8, -14, 4, 43, 21, -6, 28, 3, 6, 1, 5, 0, 2, -13, 10, 7, 21, -1, 18, -8, 27, 7, 24, -54, -60, -25, 21, 105, -29, -108, -40, -31, -79, 48, 28, -162, 1, 2, 27, 17, -52, 29, -5, -23, 8, 15, -14, 8, 16, 3, 40, -1, 16, 10, 26, 4, 6, 40, 4, -9, -15, -5, 2, 21, 19, 5, -7, 6, -42, 10, 6, -25, -9, -20, -34, 27, 7, -17, -9, 13, 12, 1, 8, 0, 11, -7, -14, -1, 9, 3, 5, 4, 18, 9, 5, -5, 38, 12, -5, 20, -7, 5, 20, 1, -11, 30, 8, 8, -5, 6, 7, 9, -14, 8, 24, -8, 1, -10, 3, -32, -22, -3, 1, 4, -25, -9, 15, 5, 11, 10, 7, 35, 6, -7, 10, 11, 13, 24, 6, 10, 13, 0, 21, -24, -4, 24, -1, -14, 7, 28, -13, -9, -2, 3, -9, -1, 4, -3, 1, 8, 4, -4, 3, -35, -7, -23, -14, 10, -3, 0, -12, 1, -18, 0, 13, 1, 11, -8, -17, -14, 22, -6, 18, 25, 8, 14, -2, 22, 1, 6, -3, -16, -14, 11, 9, 3, 24, -2, -23, -9, -19, -2, 6, 5, -6, 3, -8, -10, -1, 6, -2, -16, -1, -11, 27, 17, 16, 23, -3, -3, -16, 20, 5, -11, 16, -1, -5, 1, 31, 3, -6, -7, 4, 31, -5, -13, 11, -19, 6, -6, -6, 14, -5, -27, -9, 4, 5, -11, -3, -4, 2, -7, 3, 11, 32, 6, -2, 23, -4, 9, 31, 9, 3, 10, -2, 20, 25, 5, 4, 30, 5, -5, 8]
5273HJ0k0J3l4L7j7J0qj0J3rRj1KLj2J1j9J5J8qj8Q%kQJ5J9k8lPnmK2mJ3k6%Q
5312A1Lj3J9Rk6j9K3Jj6M2j3m9J0ljK2l1L7l7kJ9JpM0k5jrL2k2kmJ3J3j6j2K9
5348A6j6L1Pl6K0j8J5j9J6MqOj2l3K6Om0N0l5J0j8J9oJ3l1L6k7J0K7j2Roqj7L0
5383Ij0OqK4Nj9j5K3mk3K3qmJ9rJJ6j4pj2NrK0k2K0k3J3Rj3o%K1lk0QJ0l4PL1
5422GoOMlk5JK2j2j8P3l3mj6j5RL0Qm1K8%j3Pmk3L7k9j1N4m9K1pPl0PJ1NRj6K2
5461A3k2j%J0qL2nk1nQQJ0krj3kL8Nk0Okk0kpJ2oJ1k5K9k5J2J4k1KJKJ8k1j2l8
5501e6M2OJ7J2l2Pj1J0J4Qk5K3m3L5JNk1N1m1K3j3mJjmMPj2%J6j2Jj1j4J2J9J5
5538B9m3j8RkJ8Ok1M2l3KjLJ4qjNj3RPJ4j1j4K5m5L0M5lj2ol4K0Olj3J5nj9ML3
$$ y = [8, 18, -2, 11, -23, 14, -3, 7, -1, -11, 2, -7, 2, -9, -7, -4, -16, -5, -24, -9, 9, 1, -17, -9, -9, -11, -3, 12, 31, 3, 0, 7, 2, -2, 20, 16, 29, 3, 3, 11, 14, 1, 20, 29, 3, -16, 7, 8, -8, 34, 21, -28, -18, -21, -22, 0, -31, 6, -31, -33, -14, -13, -20, 20, -5, -6, -15, 17, -5, -7, -11, 2, 15, -1, -13, 16, 0, 31, 38, 2, 22, 4, 19, 0, 16, 20, 12, 18, 6, -27, -1, 5, -35, 15, -20, -10, -28, -9, -15, -2, -33, 3, -24, -14, 13, 1, 10, 4, -4, -21, 9, -1, 5, -3, 21, 26, 7, -8, 15, 11, -12, 11, 3, -1, 18, 9, 10, 26, 12, 5, -7, -2, -11, 9, -13, 7, -16, -3, 6, -7, -13, -13, 8, 5, -15, -7, 3, -31, -24, 7, 1, 7, 11, 8, -17, -16, 6, -6, -24, 49, 16, 12, -4, -19, -10, 20, 28, -13, 15, 15, 2, 9, 5, -18, 19, -10, -21, 33, -16, 5, -2, 5, -25, -18, -7, -2, 7, -9, 13, -9, -10, -10, 0, -8, 24, 19, -2, -7, 1, 9, 19, 17, 8, -5, -7, 31, 36, 16, 22, 20, 0, -2, -9, 3, -3, 8, -17, 12, -13, -1, 13, -8, -6, -5, -3, 15, -6, -18, -56, -14, -8, 9, 21, -11, -4, -15, -5, 9, 17, -8, 15, -28, 7, 8, 13, -8, 43, 2, 25, 12, 8, 9, 8, 4, 8, 15, 3, 3, 19, 7, 8, -3, -17, -5, 14, 29, -14, -32, -23, -25, -7, -1, -22, 20, -13, -11, -12, -9, 5, -3, -4, 1, -12, -3, 4, 18, 7, -7, 18, -27, 3, 48, 45, 33, 27, -7, 13, 19, 16, 3, 18, 13, -6, -2, 31]
5577C1l2Qj2j0L4j8j6K2k6L1k5%mJ1l0J8K0j1J2nK7rpPjoJ6l0nJ7rkK1J0l0JK1
5614A9Rj9oj9JK5k8J4jJ5j8Mj7k1L4J7J6m1lK1LkK6k9j2J5J1Lk9J4oJ4J0j6mK2
5650B2J8ql3JjK0mK7n4%lQJ6J0j4k0Lj1K3J0l0QOmnRJ8j8Rk1J0L0J2k3Mj9L0j
5688B5Rj2j6jMkLJ7l8J2JJ2jj0nk5N8m3J2j1rK7Mj8j9M3j8K7k2j3pJ7J0KNj6k
5725@j1KL1j3J9l8K3P%j1Mj8J1Qk1L8qk4jj0J2jj9K8Kj6j5K6k2%J8Mj4Oj7L1J0
5762B1m1K6K4l1J4j9J8J9k1j3%kJ6NJ7k7j5K5l2K3j3j3J1rJ4J6j7%j7kJ2j1K0
5795bj0K7k7QKMoj1L4rnMkQj2MoPJ0Jrj6mK9kk0J0j1qJ5jJ9j8J9j3qj8jK8l2M
5836a8J1J1nJ6j7j8Pk4J7QJ0J6j9OrJ8k1KL5j5J3Qjj5J6j7oNk6K5J6m1kJ1K3j
$$ y = [31, -1, 7, -5, -15, 19, 1, -15, 7, -19, 12, -13, -13, -17, -6, -36, -18, 2, -9, 3, -2, 25, 16, 9, 16, 15, 9, 25, -5, -10, 7, -2, -4, 17, 27, -3, -2, 19, 28, 9, 3, -16, -15, 10, -18, -4, -5, 10, -8, -4, -21, -42, -8, 9, 25, -16, -19, 2, 5, 3, 29, 0, -12, 3, 14, 17, -12, 2, -4, 10, 20, 4, 0, 22, 40, 32, -1, 0, -1, 19, 15, 42, -12, -12, -15, -7, 9, 19, 5, -15, -12, -23, 0, 10, -20, -12, -6, -10, -15, -6, 12, -6, 3, -18, -8, 22, 34, 11, 15, -4, 26, 25, 34, 22, 6, 5, 9, 7, 10, 27, -11, 1, 2, 14, 13, 3, -2, -27, 31, -12, 0, -11, -20, 7, 11, -7, -26, 17, -1, 26, 4, -9, -16, 1, 11, 13, 18, 2, 0, -11, -9, 22, 9, 28, -10, 13, 20, 20, 9, 13, -5, 6, 14, -7, 31, 23, -1, -2, -12, 0, -1, -20, 8, 10, -6, -21, 5, -17, -17, 1, 5, -9, -3, -20, 11, 21, -20, 6, 30, -1, 13, -6, 12, 31, 10, -3, -3, -5, 11, 16, 33, 6, -9, 16, -16, 7, -6, -19, -8, -17, -3, 13, -4, -4, -21, -23, -11, -22, -2, -12, 15, -12, -4, -2, 2, -4, -15, 19, 10, 5, 9, 7, 15, 3, 7, 1, 8, 18, 19, 10, -6, -10, 19, 17, -3, 7, -4, -12, 3, 2, 21, 3, 22, 9, 1, -17, -18, 10, -22, -18, -7, 4, -1, 15, -2, -20, -13, -37, -20, -12, -2, 14, -5, 1, -8, 10, -11, -9, 26, 11, 24, 32, 31, 16, 32, 15, 9, 14, -12, 13, 29, -12, -14, -3, 20, 19]
5872A9Nk1rQj0Lj4K6k0Qj8mmPL3j8J2qmNkK0j8K5k8K0j8KN0j4Nl9K6j5plL3ml
5911B6k4k2J2Kk2L7j0j5K5k5Rn%lM2m4J1j0oJ4J7J3k4%J2l7L7Ok7K9j1ko%J4j2
5947Aj4qL3j5J9lQMk3k5M4l2j3K6Oj7OKpjNJ5l3K8Qk5J2lk2N4oj4k3J4L1k9Lo
5985@J0rK6m7LL3k7QK1k4K1j8J0mNk2J1k1K6k5KNrj4M3j8K4k9K1k9OK4m9N2J1
6020A7k2lL3l9M0Qk1mRj2OJ2nKj0k1pK8j6k2NK5qJ4j5j0J5J3j9orK6rK4j4nj4
6057a4O5l2l3J7QJ5j5j2RmJ7j0rJ5mJ1l0J0Lj8%L7Rl5l5J9J7J0Ql5JMMJ7rj0k
6094a1OrJJ1j0K4Mm5K2j8K7J7l0K6%k3K6KMJ2m8K6PJj4j6K2Pj1j9J0j6Rj3J9J0
6130A0Rk1lnOplJ2J9lm1K7j1oNj7J3L4j7J2lPj7QL2l2J6l0OJ6k0K5j9%J7k7rj4
$$ y = [19, 24, 3, -6, 2, -8, -5, -19, 7, -13, -5, -23, -27, -31, -24, 9, -9, 3, -5, -9, -4, -6, 14, -4, 21, -7, 13, -5, -3, 47, 33, 38, -1, 25, 10, 3, 0, 33, 29, 26, 2, -20, -8, -6, -28, 9, -1, -16, 9, -16, -7, -12, -12, -15, 27, -17, -6, -16, -22, -8, 9, 22, -2, -2, 10, -27, 10, 16, -11, 18, 7, 5, -1, -1, 13, 1, -13, -21, 12, -3, 16, 13, 21, 25, 2, -23, 21, -11, -24, 2, 8, -9, -3, -1, -8, -9, -4, 11, -22, 6, 14, -11, 1, -2, -24, 30, 24, 10, -13, 1, 32, 3, 6, 0, 10, 1, 27, -20, -17, 16, -11, -3, 18, -6, 15, -3, 7, 3, 8, -14, -3, -24, 2, -23, -21, -16, -25, -39, 4, -14, 10, -19, 2, -27, -21, 3, -46, 6, 17, -5, -8, 25, -14, 26, 34, 13, 9, 18, 6, 12, 24, 19, 21, 11, -10, -17, 11, -5, -27, -22, 3, -5, 9, -6, -16, -1, 12, -7, -13, -22, 4, -5, 19, 5, 0, -14, 51, 19, -14, 3, 11, 26, 11, -1, 8, 4, 21, 11, 2, 17, 13, 24, -6, 4, 7, -11, -11, 26, 35, 0, -35, -16, 1, 11, 19, -16, -15, -11, -7, 10, 1, -9, -11, -5, -14, -13, -2, -12, 12, 16, -29, -7, -25, 2, 19, -11, 15, 15, -8, 18, 20, 24, 36, -12, 14, 21, 22, 8, -8, 14, 21, 10, -9, 1, -15, -6, -19, 0, 10, 19, -2, -5, -10, -4, -11, -14, -2, 17, 14, -27, 0, -11, -17, -12, -29, -16, 18, 1, 13, 10, 17, 0, 8, 40, 8, 24, -6, 0, 16, -4, 21, 2, 2, 19, -8, -17, -31]
6168c1N2k4Nj5j3J1%qK8kj3k6M0Ll0PJ0Nj0J9nJ6j6mrJ8lj6K4njL1j4j0rj7RP
6206DJ1j9k0L3J5l6lJ5N%k5j4J7j1K3nL0j3j0l6L4J0JjKl0J8OJ7Oj7J2l5M7k2
6241ImMj9j3MK9ppLlj2J2L1k6Pk2K1l4RjPJ4j9J4pk0L5J9l1J8j5Opj7L3OLjk0
6280aJ9j9K2j5Qk0QK4k3J2k9OqJ3LJ9j6ork7J6M1pj2Mj7oJ5Mk1J7qj9L3K2j5j5
6317gJ4JJ0l0K7NrpJ5lK0n1OK5j7pM1l7Jmj3J0NKj5Ojj9K5PPK9k5m2J9J7mK2k6
6356cj6j5M0Lrj0L1k2J7k7K7oj2plL0Lj3lk3J5lJ1j0J3k2K0j5J5qrPoJ2LL0m6
6393a1K0lpj0J4L1k6k0K0j8pJ3K0LLjk4pK2Lj1K5k2j2J3j5nJ2Kj7j3M3m5M2l3
6428b1L0k1%J5k7J9j8LL2n1L8MpJ5rj2NJ0J0oj7K3kk4K8Kj5Pj6LK1kj8Lj4Rmj
$$ y = [-31, 21, -3, 2, -13, -26, -15, -15, -23, 5, 3, -10, -36, 4, 7, -23, -16, -6, -1, -11, 8, 3, 19, 3, -1, -10, 8, 5, -11, 13, 8, 7, 38, 24, 14, 5, -12, -3, 4, 15, -4, -24, 9, 24, -12, -15, 0, 5, 5, -20, -34, -17, -28, -5, -10, 20, 7, -3, -39, -5, 5, 6, 5, 7, -23, -5, 1, 18, 24, 7, 19, -16, 31, 9, 5, 9, -10, -23, -19, 10, 3, -4, -1, -4, -16, -4, 27, 1, 8, -14, 7, -27, -18, -19, -12, 2, -17, -3, -10, -30, 5, 24, -7, 11, -4, 2, -5, -22, 11, 17, 20, 19, -1, 18, -1, 21, 6, 14, -6, 2, 26, 3, 15, -14, -8, -16, -3, 0, 19, 3, -3, -12, -39, -23, 18, 11, -1, 3, -14, -20, -5, -1, -22, -5, -13, -32, 1, 23, 8, -7, 7, 8, 18, -12, 15, 20, 11, 4, 19, 16, 36, -15, -9, 16, -1, -8, 33, -4, -3, -7, -20, -10, -5, -3, -18, -12, -13, -32, -7, 0, 7, 36, 11, -31, -12, 5, 1, 23, -3, -19, -34, 6, 9, 0, -10, 21, -1, 16, -11, 16, 10, -2, -9, -12, 18, 21, 8, 5, -18, -3, -6, 5, -5, 8, -14, 6, -9, 6, -2, -11, -4, -10, 2, 5, 35, -11, 9, 6, -1, -11, 3, 34, 8, -12, 8, -10, -17, -4, 16, 19, 22, 21, -3, -10, 12, 15, 4, 29, 7, -5, 8, -7, -12, 0, 2, -15, -28, 15, -30, 12, -21, 9, -12, -12, 3, -24, -5, -23, -20, 12, -39, -1, 3, -4, 11, 2, -10, -5, 5, 15, 9, -8, 15, 13, -11, 17, 19, 4, 11, -5, -2, 19, 17, -1, 2, -12, -3, -7, -8]
6466hRj6J3Jj7Lj1J9pL%kPj0OJ8k2nJ5Pq%j7M9l8L9Ml0kj3JK0Noj1RJ0rJ5kKl8
6508a7j6M6k8RNok0J2L0l1NJlOoL2j8nR%J7pj6K1k4J2%k9KK5ojPj1J0Oj3KqLK8
6549B3l2J3rK2k0j9j4K4J4j5Qj6MQJ1pK1nk2J6olJ5Rl7RMK8j6j0j2J4Oj7J5OK8
6586C8n2K5k2j0J7Lj1Rl0K4k0K2k4M5j5j1K3j8nmNk1L5mj9L0j3j6K5PloOOoj6
6622fPkJ4m6K2J6mj9K8m3K3OnL7n1K3j4j5J5jK3j5L2l1kLoJ6Qj0j4J6oNKjlK4
6660B6oj0MqQm3QJ7K6mk3K1j4kJ6qpJ3l9J9l9L6J6j9j6kPJK5JPl3J7j0K2jLl0
6698b1M1k2J2rJ6qmqKoKL0k9j0K1nJ1k8LK8l3J4K7j9k6%lLL3k1K4j1Ok5J1J3k2
$$ y = [-8, 1, -15, -2, -1, -18, -15, -26, -7, -14, -11, -11, -13, -6, -16, -10, 8, -14, -19, -4, 3, -5, -5, -22, 27, -11, 28, 32, 2, 0, -13, -12, 8, 13, 7, -4, 5, 15, 6, 21, 19, 21, -17, -33, 13, -15, -6, -1, -7, -27, -15, 15, -16, -11, -10, -13, -7, -13, 19, 1, -4, 5, 5, 22, 15, -1, 20, -4, 8, 8, -21, -19, 6, 0, -1, 6, -5, 5, 11, -2, 0, -8, -5, 23, -9, 4, -5, 17, -3, -22, -36, -12, 2, -13, -5, -21, -17, -9, 2, -5, 16, 11, -11, 5, -1, -4, 11, 20, -17, -8, -4, 24, 8, -2, -14, 0, 6, -11, 4, 10, 38, -14, 11, -11, -21, -4, -1, -12, -3, -33, -9, -29, -7, -31, 14, -1, -12, 11, -7, -12, -16, -11, -32, 3, -1, -20, 10, -3, -19, 6, 13, 10, 4, 10, 16, 10, -6, 1, -1, 13, -33, -11, 5, 1, -18, 10, -33, -10, -4, -9, 28, -23, 0, -14, -29, -14, -15, 8, -7, 25, -6, -8, -5, -11, 5, 13, 3, -11, 5, -1, 4, 6, 5, 2, 26, 20, 10, 14, 6, 14, -29, -21, -4, 22, 18, -5, 16, 2, 0, 16, 8, 1, 14, -25, -6, -45, -9, 7, -12, -28, -30, -23, -22, 3, 4, 11, -22, -5, -15, 7, 6, 9, -21, 20, -2, 10, 1, 17, 9, 5, -3, -1, -7, -5, 25, -4, -14, 7, 2, 13, -15, -12, 16, -17, -3, 24, 5, -21, -21, -24, -21, 12, -9, 15, 4, 10, -15, -4, 9, -13]
$$ [...]
8191a0
##END NTUPLES=NMR FID
##END=
