##TITLE=1H_AM_NV135
 
 8sc, 
 16.2.2024
##JCAMPDX= 6.0         $$ Bruker NMR JCAMP-DX V2.0
##DATA TYPE= NMR FID
##DATA CLASS= NTUPLES
##ORIGIN= UXNMR, Bruker Analytische Messtechnik GmbH
##OWNER= root
$$ XWIN-NMR		Version 3.5
$$ Fri Feb 16 15:59:42 2024 Russian Standard Time (UT+4h)  she@DPX200
##.OBSERVE FREQUENCY= 200.1313
##.OBSERVE NUCLEUS= ^1H
##.DELAY= (6, 6)
##.ACQUISITION MODE= SIMULTANEOUS
##.ACQUISITION SCHEME= undefined
##.AVERAGES= 8
##.DIGITISER RES= 18
##SPECTROMETER/DATA SYSTEM= spect
##.PULSE SEQUENCE= zg30
##.SOLVENT NAME= DMSO
##.SHIFT REFERENCE= (INTERNAL, DMSO, 0, 15.7039)
##AUDIT TRAIL= $$ (NUMBER, WHEN, WHO, WHERE, WHAT)
$$ ##TITLE= Audit trail, XWIN-NMR		Version 3.5
$$ ##JCAMPDX= 5.01
$$ ##ORIGIN= Bruker BioSpin GmbH
$$ ##OWNER= she
$$ F:/spectra/data/she/nmr/H-F/1/audita.txt
$$ ##AUDIT TRAIL=  $$ (NUMBER, WHEN, WHO, WHERE, WHAT)
(   1,<2024-02-16 15:57:53.29 +0400>,<she>,<DPX200>,
      <created by zg, POWCHK disabled, PULCHK disabled
       configuration hash MD5:
       00 E9 B6 7A A2 85 ED C7 34 08 36 98 17 FE 4E 26
       data hash MD5: 16K
       D1 12 1C 07 21 DC 83 77 B1 38 BB CA 29 1C 8B 6F>)
$$ ##END=
$$ 
$$ hash MD5
$$ 52 94 27 6D 97 EB E4 17 C4 7F 08 02 48 E9 65 CA
##$RELAX= 
##$RELAX= 
##$RELAX= 
##$RELAX= 
##$RELAX= 
##$RELAX= 
$$ Bruker specific parameters
$$ --------------------------
##$DU= <F:/spectra>
##$EXPNO= 1
##$NAME= <H-F>
##$PROCNO= 1
##$TYPE= <nmr>
##$USER= <she>
##$AMP= (0..31)
100 100 100 100 100 100 100 100 100 100 100 100 100 100 100 100 100 100 
100 100 100 100 100 100 100 100 100 100 100 100 100 100 
##$AQSEQ= 0
##$AQ_mod= 1
##$AUNM= <au_zg>
##$AUTOPOS= <>
##$BF1= 200.13
##$BF2= 200.13
##$BF3= 200.13
##$BF4= 200.13
##$BF5= 200.13
##$BF6= 200.13
##$BF7= 200.13
##$BF8= 200.13
##$BYTORDA= 1
##$CFDGTYP= 0
##$CFRGTYP= 5
##$CHEMSTR= <none>
##$CNST= (0..31)
1 1 145 1 1 1 1 1 1 1 1 1 1 1 1 1 1 1 1 1 1 1 1 1 1 1 1 1 1 1 1 1 
##$CPDPRG= <>
##$CPDPRG1= <>
##$CPDPRG2= <>
##$CPDPRG3= <>
##$CPDPRG4= <mlev>
##$CPDPRG5= <mlev>
##$CPDPRG6= <mlev>
##$CPDPRG7= <mlev>
##$CPDPRG8= <mlev>
##$CPDPRGB= <>
##$CPDPRGT= <>
##$D= (0..31)
0 1.2 0 0 0 0 0 0 0 0.06 0 0.03 0 0 0 0 0.0002 0 0 0 0 0 0 0 0 0 0 0 0 
0 0 0 
##$DATE= 1708084672
##$DBL= (0..7)
120 120 120 120 120 120 120 120 
##$DBP= (0..7)
150 150 150 150 150 150 150 150 
##$DBP07= 0
##$DBPNAM0= <>
##$DBPNAM1= <>
##$DBPNAM2= <>
##$DBPNAM3= <>
##$DBPNAM4= <>
##$DBPNAM5= <>
##$DBPNAM6= <>
##$DBPNAM7= <>
##$DBPOAL= (0..7)
0.5 0.5 0.5 0.5 0.5 0.5 0.5 0.5 
##$DBPOFFS= (0..7)
0 0 0 0 0 0 0 0 
##$DE= 6
##$DECBNUC= <off>
##$DECIM= 32
##$DECNUC= <off>
##$DECSTAT= 4
##$DIGMOD= 1
##$DIGTYP= 9
##$DL= (0..7)
0 120 120 120 120 120 120 120 
##$DP= (0..7)
150 150 150 150 150 150 150 150 
##$DP07= 0
##$DPNAME0= <>
##$DPNAME1= <>
##$DPNAME2= <>
##$DPNAME3= <>
##$DPNAME4= <>
##$DPNAME5= <>
##$DPNAME6= <>
##$DPNAME7= <>
##$DPOAL= (0..7)
0.5 0.5 0.5 0.5 0.5 0.5 0.5 0.5 
##$DPOFFS= (0..7)
0 0 0 0 0 0 0 0 
##$DQDMODE= 0
##$DR= 18
##$DS= 0
##$DSLIST= <SSSSSSSSSSSSSSS>
##$DSPFIRM= 0
$$ [...]
##$SUBNAM2= <"">
##$SUBNAM3= <"">
##$SUBNAM4= <"">
##$SUBNAM5= <"">
##$SUBNAM6= <"">
##$SUBNAM7= <"">
##$SUBNAM8= <"">
##$SUBNAM9= <"">
##$SW= 18.0517328524113
##$SWIBOX= (0..15)
0 0 2 0 0 0 0 0 0 0 0 0 0 0 0 0 
##$SW_h= 3612.71676300578
##$TD= 16384
##$TD0= 1
##$TE= 0
##$TE2= 300
##$TE3= 300
##$TEG= 300
##$TL= (0..7)
0 120 120 120 120 120 120 120 
##$TP= (0..7)
150 150 150 150 150 150 150 150 
##$TP07= 0
##$TPNAME0= <>
##$TPNAME1= <>
##$TPNAME2= <>
##$TPNAME3= <>
##$TPNAME4= <>
##$TPNAME5= <>
##$TPNAME6= <>
##$TPNAME7= <>
##$TPOAL= (0..7)
0.5 0.5 0.5 0.5 0.5 0.5 0.5 0.5 
##$TPOFFS= (0..7)
0 0 0 0 0 0 0 0 
##$TUNHIN= 0
##$TUNHOUT= 0
##$TUNXOUT= 0
##$USERA1= <user>
##$USERA2= <user>
##$USERA3= <user>
##$USERA4= <user>
##$USERA5= <user>
##$V9= 5
##$VALIST= <valist>
##$VCLIST= <CCCCCCCCCCCCCCC>
##$VD= 0
##$VDLIST= <DDDDDDDDDDDDDDD>
##$VPLIST= <PPPPPPPPPPPPPPP>
##$VTLIST= <TTTTTTTTTTTTTTT>
##$WBST= 1024
##$WBSW= 4
##$XGAIN= (0..3)
0 0 0 0 
##$XL= 0
##$YL= 0
##$YMAX_a= 285945
##$YMIN_a= -259518
##$ZGOPTNS= <>
##$ZL1= 120
##$ZL2= 120
##$ZL3= 120
##$ZL4= 120
##$ABSF1= 10
##$ABSF2= 0
##$ABSG= 5
##$ABSL= 3
##$ALPHA= 0
##$AQORDER= 0
##$ASSFAC= 0
##$ASSFACI= 0
##$ASSFACX= 0
##$ASSWID= 0
##$AUNMP= <proc_1d>
##$AZFE= 0.1
##$AZFW= 0.1
##$BCFW= 1
##$BC_mod= 2
##$BYTORDP= 1
##$COROFFS= 0
##$CY= 11.3945322036743
##$DATMOD= 1
##$DC= 2
##$DFILT= <>
##$DTYPP= 0
##$F1P= 15.7292609196834
##$F2P= 12.9074282941183
##$FCOR= 0.5
##$FTSIZE= 0
##$FT_mod= 4
##$GAMMA= 1
##$GB= 0.15
##$INTBC= 1
##$INTSCL= 1
##$ISEN= 128
##$LB= 0.24
##$LEV0= 0
##$LPBIN= 0
##$MAXI= 10000
##$MC2= 0
##$MEAN= 0
##$ME_mod= 0
##$MI= 1.114404
##$NCOEF= 0
##$NC_proc= 0
##$NLEV= 6
##$NOISF1= 3.799351
##$NOISF2= 2.8
##$NSP= 1
##$NTH_PI= 0
##$NZP= 0
##$OFFSET= 15.70392
##$PC= 1
##$PHC0= -25040.42
##$PHC1= 16.45264
##$PH_mod= 1
##$PKNL= yes
##$PPARMOD= 0
##$PSCAL= 0
##$PSIGN= 0
##$REVERSE= no
##$SF= 200.130013532006
##$SI= 16384
##$SIGF1= 3
##$SIGF2= 2
##$SINO= 400
##$SIOLD= 16384
##$SREGLST= <1H.CDCl3>
##$SSB= 0
##$STSI= 0
##$STSR= 0
##$SW_p= 3612.71676300578
##$SYMM= 0
##$S_DEV= 0
##$TDeff= 0
##$TDoff= 0
##$TI= <>
##$TILT= no
##$TM1= 0
##$TM2= 0
##$TOPLEV= 0
##$USERP1= <user>
##$USERP2= <user>
##$USERP3= <user>
##$USERP4= <user>
##$USERP5= <user>
##$WDW= 1
##$XDIM= 8192
##$YMAX_p= 0
##$YMIN_p= 0
$$ End of Bruker specific parameters
$$ ---------------------------------
##NTUPLES= NMR FID
##VAR_NAME=  TIME,          FID/REAL,        FID/IMAG
##SYMBOL=    X,             R,               I
##VAR_TYPE=  INDEPENDENT,   DEPENDENT,       DEPENDENT
##VAR_FORM=  AFFN,          ASDF,            ASDF
##VAR_DIM=   8192,          8192,            8192
##UNITS=     SECONDS,       ARBITRARY UNITS, ARBITRARY UNITS
##FACTOR=    0.0002768,     1,               1
##FIRST=     0,             0,               0
##LAST=      2.2672688,     0,               0
##MIN=       0,             -259518,         0
##MAX=       2.2672688,     285945,          0
$$ Real data points
##PAGE= N=1
##DATA TABLE= (X++(R..R)), XYDATA
0 0 0 0 0 0 0 0 0 0 0 0 0 -8 8 -8 8 -16 16 -16 24 -30 32 -40 48 -56 65 -77 88 -104 120 -137 154 -177 201
33 201 -228 257 -290 327 -367 408 -456 510 -564 626 -692 768 -848 934 -1031 1137 -1252 1380
51 1380 -1519 1676 -1846 2040 -2259 2508 -2795 3125 -3516 3983 -4559 5281 -6222 7502 -9357
66 -9357 12287 -17618 30404 -124146 -2669 285945 -89027 -249898 99065 250563 -130569
77 -130569 -204752 162743 204662 -181481 -162697 202559 137526 -229242 -110266 223553 68623
88 68623 -242492 -45277 233055 15861 -230641 21088 232697 -39628 -214622 81841
98 81841 207798 -104792 -189518 128046 164071 -153357 -151145 162894 123644 -180101 -102172
109 -102172 193338 78475 -196902 -43770 206081 18369 -200520 12284 195855 -39001
119 -39001 -190766 59169 178620 -85049 -170428 104306 153593 -124254 -133283 140731 111625
130 111625 -150350 -86790 158812 64817 -163919 -42360 168720 20050 -170748 3824
140 3824 169692 -27079 -163874 47717 152159 -68151 -142086 81424 126320 -98436 -113593
151 -113593 112714 98067 -125059 -77240 139205 59966 -143358 -37015 147618 18097
161 18097 -148367 -2317 143386 -19275 -143813 34334 134902 -55210 -125570 74813
171 74813 115602 -86292 -96683 102671 86424 -108598 -70405 116694 54750 -125139 -41436
182 -41436 125552 19549 -129206 -2638 125217 -15043 -118208 33528 115344 -44001
192 -44001 -105156 60878 100131 -72959 -90519 83743 75531 -96511 -64508 99152 46012
203 46012 -105342 -32697 107444 18923 -107991 -1862 111695 -11362 -108374 28925 105065
214 105065 -43135 -98345 53843 87428 -65847 -80195 72076 67934 -82024 -57272 89893
225 89893 44465 -94993 -27917 100577 15341 -99063 -317 98680 -10768 -96017 21327
236 21327 91572 -34132 -88082 44396 78981 -57078 -70082 66147 59181 -72612 -47204
247 -47204 79584 39118 -82174 -27428 87511 17410 -89733 -5481 88685 -8842 -87559
258 -87559 19224 80901 -31489 -76249 40695 70867 -49191 -63684 60072 58278 -66579
269 -66579 -47326 74222 37280 -77744 -26751 77752 14375 -79811 -6237 77774 -5608
280 -5608 -77993 16644 76637 -26835 -70978 38915 66741 -45450 -58342 52265 51112 -57718
292 -57718 -44745 60961 34689 -67554 -26679 69852 14719 -71990 -3245 72658 -5355 -69201
304 -69201 15799 68654 -22154 -65103 30324 61059 -39354 -56565 45739 47217 -53648 -39432
316 -39432 57507 30239 -60623 -21545 64280 15054 -65291 -5566 67869 -2604 -66941 11930
328 11930 63531 -21550 -59958 27721 53279 -35240 -48786 40979 43524 -46912 -36873 53683
340 53683 30534 -57213 -21365 60152 13373 -60170 -5599 58986 -2136 -58496 8842 56508
352 56508 -17598 -54792 25903 51063 -33573 -45381 40415 40100 -44135 -33567 47902 28208
364 28208 -50614 -21935 53298 14262 -55650 -6026 55655 -3417 -54969 11059 52343 -18018
376 -18018 -49820 24069 47594 -29219 -43757 35631 39646 -40643 -33025 44874 25291 -47967
388 -47967 -18385 48757 10793 -50627 -5095 51303 -1701 -52035 8947 51776 -15528 -48396
400 -48396 22882 44810 -27731 -39650 31910 34327 -36689 -30473 39984 24246 -45016 -18508
412 -18508 48111 11675 -49140 -3994 49756 -1230 -47511 7416 46439 -12516 -44652 18252
424 18252 41688 -25359 -38664 30886 33258 -36032 -27783 39702 23196 -41161 -17591 43873
436 43873 13435 -45032 -7406 46071 381 -46185 6352 43943 -13437 -41595 18772 38677
448 38677 -23461 -36015 27996 33292 -32416 -29489 36435 24105 -39709 -18175 40873 11482
460 11482 -41608 -5929 41509 550 -41680 4964 42037 -10607 -41174 16577 38825 -22052
472 -22052 -35428 25823 30840 -29055 -26670 31663 22572 -34370 -17793 37667 12601 -39936 -6339
485 -6339 41211 472 -40782 4859 39575 -9135 -37858 13284 36210 -17627 -33795 22664
497 22664 30413 -27424 -25863 31241 20754 -33996 -16146 35513 11948 -36718 -7891 38080
509 38080 3751 -38346 1884 38051 -7358 -36032 12636 33113 -17225 -30328 20755 27620
521 27620 -24301 -25200 27845 22098 -31256 -18060 33494 12893 -34724 -7975 34402 3034 -34045
534 -34045 1237 33716 -5566 -33340 10611 32825 -15418 -30819 19912 27616 -23705 -24621 25170
547 25170 20142 -27776 -17413 29076 13412 -30931 -8361 33448 4230 -32993 2146 33523
559 33523 -5899 -31858 9503 30033 -13242 -29377 15445 26457 -19873 -24177 23259 20426
571 20426 -25559 -14979 28676 12081 -28512 -7325 30200 4438 -31138 -1497 30811 -3658
583 -3658 -31576 7063 28995 -11792 -26554 15406 24190 -17578 -20806 21122 19219 -23436 -16382
596 -16382 26154 12613 -28878 -9422 28697 4302 -29213 -1114 28088 -2264 -26941 6303
608 6303 27101 -9285 -25441 14027 24075 -17733 -21660 20168 18072 -22580 -15748 23155 12524
621 12524 -24496 -9712 25796 6364 -26506 -1652 27297 -2340 -26285 6535 25225 -9534
633 -9534 -23972 11827 22509 -14442 -21230 16966 18936 -19643 -15689 21832 11858 -23115 -8101
646 -8101 23753 4891 -24152 -1939 24981 -577 -25095 4166 25157 -7418 -23679 10690
658 10690 21241 -13582 -18972 15237 16141 -17521 -14252 19492 11924 -21546 -8770 23712 5928
671 5928 -23945 -2086 23863 -909 -23185 2989 21488 -6364 -21520 8420 19842 -12004
683 -12004 -18236 15440 16505 -16992 -12883 19349 11223 -19523 -8764 20079 6186 -21453 -4400
696 -4400 20971 68 -21847 2931 20748 -6120 -18929 9523 18683 -10302 -16396 13190 15939
709 15939 -14886 -14329 16396 11038 -18945 -8927 18728 4876 -19434 -2252 19573 238 -19114
722 -19114 2955 20190 -4790 -19322 7995 18391 -10658 -16850 11964 13800 -13988 -12264 14553
735 14553 9966 -15908 -7758 17750 5841 -18458 -2535 19403 34 -18914 2310 17850
747 17850 -4376 -17134 5766 15956 -7982 -15118 10207 13525 -12642 -11374 14647 9117 -15690
760 -15690 -6759 16397 5051 -16700 -3286 17214 1314 -17445 1269 17181 -4201 -16348
772 -16348 6698 14612 -9140 -13439 10454 12006 -11950 -10857 13666 9866 -14587 -7350 16076
785 16076 5278 -16061 -2581 15585 -27 -15544 1350 14616 -3781 -15016 5484 14587
797 14587 -7544 -13361 10035 12489 -10669 -9876 12029 8428 -12442 -6974 12693 4599 -14460
810 -14460 -3384 14605 379 -15287 2074 15263 -3623 -13746 5956 13615 -6488 -12236
822 -12236 8133 11269 -10033 -10298 11130 7575 -13235 -5976 13545 3650 -13768 -1721 14369
835 14369 1050 -13770 1035 14338 -2460 -13817 4363 12414 -6810 -11546 7676 9432 -9214
848 -9214 -8475 10078 7583 -10919 -6164 12476 5130 -12857 -2886 13218 899 -12888 697
861 697 11899 -2641 -11790 3797 11241 -5666 -10871 7689 10259 -9173 -8646 10622 7216 -11060
875 -11060 -5569 11262 4129 -11552 -2808 11876 1044 -12331 956 12307 -3071 -11846 4787
888 4787 11005 -5944 -10080 6753 9344 -7471 -8514 8507 7460 -9479 -5711 10484 3943 -10830
902 -10830 -2076 10887 540 -11036 332 10870 -1681 -11165 2934 10911 -4415 -9892 6207
915 6207 8887 -7089 -7152 8119 5975 -8881 -5113 9479 3741 -10825 -2890 11078 938 -11423
929 -11423 627 11017 -1802 -9852 3379 9579 -3969 -8706 5355 8175 -6950 -7714 7871
942 7871 6068 -9260 -5111 9374 3790 -9329 -2572 9616 2011 -9271 -366 9799 -933
955 -933 -9585 2681 8960 -4472 -8550 5207 7470 -6184 -6959 6830 6519 -7353 -5343 8526
969 8526 4328 -8951 -2566 9173 768 -9295 327 8817 -1656 -8972 2481 8956 -3517 -8639
983 -8639 4899 8168 -5798 -6853 6701 5594 -7140 -4515 7302 3363 -7986 -2689 8502
996 8502 1588 -9017 -214 9284 -937 -8814 2074 8144 -2934 -7573 3479 6896 -4448 -6453
1010 -6453 5566 5787 -6605 -4601 7660 3550 -7983 -2391 8031 1451 -8145 -926 7914 -246
1024 -246 -8182 1315 7920 -2681 -7206 4247 6765 -4834 -5595 5737 5183 -6146 -4801 6480
1038 6480 3882 -7413 -3276 7517 1797 -7638 -418 7550 -474 -6896 1701 7050 -2206 -6828
1052 -6828 3185 6716 -4320 -6491 4932 5309 -5879 -4542 5931 3412 -6083 -2470 6519 1917
1066 1917 -6705 -721 7330 -275 -7440 1408 7109 -2493 -6739 2922 5958 -3550 -5598 3961 5013
1081 5013 -4723 -4324 5674 3520 -6171 -2231 6704 1412 -6622 -628 6558 16 -6666 428 6472
1096 6472 -1473 -6461 2363 5788 -3484 -5044 4284 4352 -4640 -3545 5274 3348 -5523 -2761 6061
1111 6061 2009 -6530 -1243 6271 -84 -6193 814 5650 -1577 -5273 2344 5333 -2833 -4957 3882
1126 3882 4822 -4486 -4085 4975 3214 -5277 -2608 5029 1699 -5269 -1235 5367 449 -5580 635
1141 635 5856 -1471 -5472 2445 5153 -2937 -4676 3200 4166 -3642 -3919 3961 3181 -4711 -2486 5120
1157 5120 1433 -5353 -457 5457 -52 -5168 715 5317 -996 -5215 1578 4992 -2444 -4728 2917
1172 2917 3759 -3696 -3243 3857 2547 -4115 -2058 4616 1975 -4670 -1131 5300 711 -5147 130
1187 130 4777 -1032 -4687 1154 3877 -2057 -3987 2422 3734 -3049 -3195 4082 3102 -4110 -1974 4618
1203 4618 1572 -4427 -1084 4164 267 -4586 -122 4231 -1010 -4448 1778 4289 -2258 -3508 3128
1218 3128 3552 -2903 -2911 3224 2670 -3587 -2560 3538 1547 -4239 -1129 4036 200 -3982 478 4100
1234 4100 -534 -3693 1249 4061 -1373 -3837 1941 3410 -2707 -3155 2731 2121 -3299 -1771 3308
1249 3308 1307 -3466 -716 4009 559 -3961 314 4234 -777 -3885 1317 3402 -1809 -3168 1874
1264 1874 2626 -2441 -2551 2769 2169 -3249 -1643 3720 1283 -3617 -598 3687 441 -3416 -108 3364
1280 3364 -274 -3409 646 3165 -1477 -3134 1878 2616 -2384 -2285 2621 2144 -2555 -1718 3009 1710
1296 1710 -3003 -1091 3270 439 -3379 93 3015 -945 -3077 1087 2744 -1543 -2757 1936 2840
1311 2840 -2070 -2273 2783 2148 -2712 -1380 2840 797 -2986 -714 2642 -5 -3176 51 3120
1326 3120 -560 -3088 1214 3225 -1175 -2474 1786 2470 -1638 -2070 1779 1659 -2403 -1773 2323 921
1342 921 -3010 -684 3042 297 -2758 382 3080 -136 -2545 733 2684 -1052 -2631 1328 2000
1357 2000 -2224 -2016 2171 1268 -2563 -1040 2707 1053 -2475 -471 3026 558 -2743 105 2755
1372 2755 -652 -2697 797 2079 -1453 -2204 1420 1972 -1687 -1859 2146 1926 -2140 -1319 2576 1146
1388 1146 -2371 -617 2319 233 -2379 -144 2219 -447 -2553 668 2416 -1200 -2299 1583 2125
1403 2125 -1639 -1645 1889 1553 -1793 -1195 2045 929 -2300 -604 2359 -44 -2637 244 2344 -722
1419 -722 -2337 821 2253 -847 -1991 1291 2114 -1326 -1601 1815 1322 -2024 -1005 1976 478 -2285
1435 -2285 -575 2098 245 -2321 -59 2465 -71 -2119 761 2242 -770 -1712 1147 1491 -1423
1450 -1423 -1570 1346 1136 -1933 -1276 1984 927 -2100 -450 2331 442 -1839 176 2013 -194 -1846
1466 -1846 450 1704 -1020 -1998 1036 1508 -1642 -1483 1688 1274 -1580 -817 1897 972 -1606 -489
1482 -489 1870 238 -2024 1 1786 -679 -2029 641 1635 -961 -1635 1041 1675 -988 -1357 1441
1498 1441 1413 -1414 -934 1621 580 -1746 -433 1574 30 -1807 -62 1790 -138 -1835 456 1931
1514 1931 -573 -1580 962 1471 -1000 -1133 1155 928 -1344 -883 1435 598 -1773 -486 1818 160
1530 160 -1825 129 1758 -256 -1508 475 1459 -571 -1369 829 1264 -1159 -1189 1308 884 -1552 -794
1547 -794 1465 567 -1482 -500 1475 430 -1454 -147 1570 -43 -1463 391 1391 -644 -1311 731
1563 731 1185 -888 -1232 920 1127 -1109 -1019 1246 794 -1300 -416 1385 219 -1278 75 1318 -224
1580 -224 -1370 361 1386 -611 -1402 775 1254 -943 -1021 1049 817 -1039 -593 1130 523 -1163 -327
1597 -327 1331 184 -1441 -34 1400 -194 -1398 222 1220 -304 -1169 376 1148 -454 -1026 725
1613 725 967 -885 -771 1059 602 -1161 -526 1078 337 -1213 -358 1159 132 -1202 124 1204 -298
1630 -298 -959 662 951 -707 -749 864 691 -982 -713 975 517 -1161 -447 1142 224 -1073 28
1647 28 1078 -61 -882 289 1014 -300 -997 426 986 -631 -1057 596 825 -756 -773 708 661 -682
1665 -682 -494 844 496 -866 -243 1019 76 -1081 77 994 -302 -1030 274 843 -425 -835 505
1682 505 747 -614 -534 851 426 -879 -172 949 36 -980 -2 905 -100 -984 86 924 -237 -888
1700 -888 371 811 -448 -627 584 607 -581 -520 664 535 -761 -549 813 439 -907 -335 876 216
1718 216 -797 -56 792 -15 -727 184 790 -311 -756 501 707 -653 -616 695 426 -755 -355 683
1736 683 209 -716 -96 746 -47 -772 217 776 -381 -718 476 668 -505 -618 497 578 -509 -575 519
1755 519 469 -654 -394 673 236 -699 -127 739 89 -728 -25 801 16 -797 97 804 -195 -723 324
1774 324 588 -426 -477 480 376 -548 -294 670 245 -720 -120 786 -3 -769 119 677 -221 -582 293 513
1794 513 -354 -439 457 429 -544 -378 648 309 -671 -243 657 171 -645 -180 569 90 -619 -57 597 -75
1814 -75 -613 211 591 -291 -538 371 524 -391 -489 427 448 -490 -396 498 233 -592 -125 536 -63 -540 172
1835 172 548 -210 -487 353 574 -324 -463 443 427 -489 -291 484 163 -527 -125 485 11 -536 28 585
1855 585 -38 -558 186 642 -158 -523 250 473 -263 -439 241 329 -357 -364 381 265 -492 -179 554 124 -529
1876 -529 -17 561 19 -497 55 467 -141 -475 201 386 -347 -358 421 249 -477 -159 524 166 -502 -83
1896 -83 513 54 -513 6 495 -112 -470 190 397 -286 -362 312 348 -345 -335 416 353 -399 -273 459 230 -438
1918 -438 -117 435 40 -404 17 418 -72 -413 167 458 -221 -427 324 400 -324 -298 385 261 -352 -178 377
1939 377 103 -423 -58 431 -74 -494 120 460 -200 -440 221 416 -215 -353 271 343 -279 -268 327 193 -423
1960 -423 -147 411 29 -464 -19 440 9 -424 69 487 -36 -382 178 409 -197 -297 269 249 -343 -229
1980 -229 315 160 -408 -158 421 126 -423 -29 473 26 -374 95 370 -139 -344 161 284 -264 -315 285
2000 285 253 -368 -239 402 200 -374 -113 407 108 -337 -23 365 -27 -373 79 344 -206 -374 222 321 -271
2021 -271 -281 307 289 -267 -223 327 208 -323 -121 368 45 -387 1 356 -96 -393 108 369 -136 -363 187
2042 187 365 -194 -294 260 259 -284 -189 305 119 -336 -79 355 58 -367 3 398 -31 -384 96 365 -130
2063 -130 -321 161 275 -214 -246 233 210 -304 -172 338 133 -377 -84 383 59 -376 -29 341 -32 -330 46
2084 46 324 -104 -293 181 293 -229 -239 271 219 -291 -193 296 179 -305 -132 323 118 -290 -2 353 -12
2105 -12 -269 134 320 -128 -284 168 264 -222 -289 196 216 -265 -196 278 147 -253 -35 314 51 -277 19 308
2127 308 -55 -344 54 281 -163 -337 122 256 -180 -219 214 221 -178 -104 265 144 -274 -72 293 -2 -342
2148 -342 -36 272 -60 -309 41 282 -53 -220 143 263 -112 -172 223 166 -235 -146 234 70 -309 -110 245
2169 245 57 -256 -19 290 39 -215 90 264 -80 -179 145 182 -179 -177 179 154 -227 -154 221 122 -221 -75
2191 -75 255 55 -202 27 219 -39 -213 56 201 -135 -240 111 189 -163 -187 163 167 -155 -112 170 93 -168
2213 -168 -72 190 21 -221 -13 197 -42 -216 56 216 -47 -177 88 195 -69 -139 132 130 -151 -103 157 57
2235 57 -185 -37 201 25 -181 16 219 3 -170 56 186 -64 -141 93 116 -123 -101 128 72 -145 -83 163
2257 163 83 -145 -44 198 59 -157 -23 146 0 -139 3 124 -33 -123 63 127 -81 -118 100 122 -101 -103
2279 -103 101 80 -107 -84 100 46 -121 -27 110 -11 -109 56 128 -40 -99 84 103 -85 -99 57 58 -81 -59 80
2303 80 43 -85 13 104 18 -71 42 110 17 -84 31 106 4 -82 7 95 -16 -82 0 53 -28 -48 36 67 -39 -49 65
2330 65 50 -88 -43 70 32 -70 -23 47 -6 -42 6 35 -35 -22 55 11 -67 -12 79 7 -71 24 63 1 -38 18 46 -1 -25
2359 -25 28 22 -30 -36 34 33 -22 -34 26 59 2 -59 16 76 2 -56 4 55 -12 -50 15 29 -30 -26 31 29 -37 14 61 27 -19 41 62
2392 62 10 7 29 7 -23 25 32 -23 -26 37 44 -16 -24 59 66 -6 -8 24 22 -12 -12 -10 20 -12 -41 -3 19 -25 -52 20 55 -16 -64 43 84
2427 84 -15 -83 34 72 -47 -65 33 36 -43 -20 44 13 -42 25 66 3 -19 45 53 3 2 27 0 -16 3 -2 -41 -29 12 6 -28 -32
2459 -32 16 51 -6 -38 16 56 -6 -53 -9 45 -4 -71 -9 56 -38 -74 45 77 -48 -51 87 82 -59 -51 100 75 -73 -38 81
2488 81 36 -58 -1 51 -17 -43 36 38 -25 -29 40 39 -16 -9 29 18 -10 -4 17 -6 -32 -8 4 -12 -32 24 48 -12 -45 36 84 -4 -61
2521 -61 51 96 -15 -72 52 77 -62 -65 81 53 -83 -34 97 24 -81 -3 92 16 -68 1 74 -3 -61 22 33 -25 -30
2548 -30 18 16 -31 -4 30 19 -27 6 33 25 -13 -1 27 16 -15 16 34 3 -34 30 67 -29 -48 57 79 -39 -51 83 64 -60
2578 -60 -36 80 38 -65 -23 62 -1 -85 -11 71 -27 -92 26 72 -25 -49 41 64 -8 -22 45 46 -7 -10 31 3 -38 -18 27 -6
2608 -6 -42 7 51 15 -31 20 73 7 -26 39 67 -13 -36 41 41 -73 -65 60 31 -99 -38 98 33 -81 -5 116 25 -68 19
2637 19 89 -20 -70 19 47 -54 -87 40 53 -50 -41 82 79 -35 -8 83 58 -28 -7 60 4 -72 -20 45 -35 -79 9 67
2665 67 -26 -75 49 93 -17 -49 72 74 -60 -55 71 21 -104 -28 93 -2 -111 -11 113 -6 -95 40 125 -9 -75
2690 -75 64 113 -37 -73 70 63 -71 -55 76 51 -87 -31 107 49 -75 -6 115 24 -80 5 92 -10 -109 29 78
2715 78 -55 -95 51 86 -87 -79 90 72 -96 -58 114 48 -103 -33 113 22 -110 12 119 -22 -114 46 118 -48
2739 -48 -102 72 116 -73 -88 93 86 -87 -56 106 56 -102 -26 113 7 -134 -14 134 -24 -146 33 125 -33
2762 -33 -121 64 120 -58 -89 95 99 -97 -73 126 70 -135 -47 139 44 -144 -11 153 20 -122 34 154 -10
2785 -10 -108 57 127 -80 -113 92 93 -118 -108 123 81 -137 -64 141 44 -136 -11 166 11 -147 38 155 -58
2808 -58 -153 61 131 -98 -144 100 133 -120 -93 148 107 -127 -41 166 63 -139 -9 165 5 -159 17 166 -34
2831 -34 -154 66 161 -67 -133 104 144 -99 -116 114 93 -139 -92 139 52 -178 -35 179 14 -188 18 189 -18
2854 -18 -170 71 171 -84 -142 106 147 -129 -115 161 112 -154 -76 199 85 -177 -37 194 24 -180 11 190
2876 190 -37 -187 50 175 -73 -167 94 161 -121 -139 125 125 -151 -113 162 91 -175 -69 180 33 -193 -4
2898 -4 190 -27 -183 66 207 -67 -174 123 191 -122 -147 157 142 -162 -109 191 85 -184 -51 223 53 -203
2920 -203 5 227 -30 -217 51 210 -74 -211 90 184 -112 -183 132 146 -144 -119 192 115 -186 -79 210 67
2942 67 -196 -30 225 12 -216 23 224 -46 -197 97 199 -107 -167 171 170 -167 -136 202 130 -207 -93 226
2964 226 54 -235 -28 237 -5 -227 34 229 -77 -213 98 210 -116 -187 154 184 -165 -144 190 151 -190
2985 -190 -96 216 90 -194 -36 240 30 -226 24 255 -32 -205 97 243 -86 -193 151 196 -160 -159 196
3006 196 141 -212 -101 230 63 -240 -27 257 10 -252 32 252 -63 -250 97 234 -133 -204 157 191 -181
3027 -181 -149 209 139 -210 -92 251 98 -228 -37 271 26 -251 23 255 -44 -233 85 235 -111 -214 159
3048 159 221 -177 -175 216 146 -223 -113 243 84 -259 -64 254 -2 -278 27 262 -66 -258 116 259 -134
3069 -134 -219 178 222 -186 -157 233 158 -246 -104 275 83 -263 -29 288 17 -268 46 289 -54 -248 118
3090 118 264 -140 -243 170 216 -198 -177 215 154 -250 -128 257 89 -278 -47 296 17 -278 49 301 -53
3111 -53 -258 135 278 -145 -235 177 219 -207 -175 245 154 -264 -98 303 87 -281 -29 312 10 -287 55 291
3133 291 -76 -287 115 265 -154 -242 187 225 -221 -195 241 164 -251 -123 283 99 -275 -51 305 19 -296
3154 -296 33 302 -77 -281 120 279 -139 -250 201 244 -199 -186 261 184 -254 -118 292 93 -291 -55 305
3175 305 1 -311 45 300 -85 -287 117 272 -148 -241 195 234 -219 -198 237 153 -273 -139 285 85 -299
3196 -299 -33 318 23 -303 57 318 -57 -277 127 277 -138 -247 186 234 -214 -199 252 176 -259 -122 290
3217 290 110 -278 -40 315 9 -300 35 302 -75 -300 126 265 -163 -262 193 225 -223 -196 268 186 -261
3238 -261 -120 299 96 -282 -36 324 23 -295 37 307 -62 -278 124 293 -127 -245 192 246 -193 -195 247
3259 247 179 -251 -142 276 93 -292 -59 299 7 -302 25 300 -63 -289 111 291 -134 -248 185 236 -207
3280 -207 -198 248 176 -259 -119 294 100 -294 -50 313 34 -287 29 311 -50 -278 115 302 -132 -241 177
3301 177 239 -199 -214 229 184 -262 -155 268 115 -283 -75 294 48 -293 8 309 -43 -300 79 290 -127
3322 -127 -266 157 246 -193 -204 236 203 -237 -123 289 131 -274 -61 310 47 -290 20 310 -46 -298 91
3343 91 290 -123 -262 169 255 -180 -219 215 192 -246 -167 261 125 -270 -86 278 43 -289 -8 304 -22 -286
3365 -286 58 285 -95 -248 153 244 -166 -218 220 196 -223 -154 260 129 -261 -81 295 59 -295 -7 291
3386 291 -26 -277 73 279 -109 -258 148 239 -182 -210 207 183 -228 -159 255 123 -269 -87 283 47 -293
3407 -293 -21 296 -13 -279 78 290 -89 -252 148 259 -159 -209 206 206 -221 -153 252 127 -260 -80 291
3428 291 55 -289 -7 288 -31 -284 75 271 -105 -264 136 243 -169 -215 199 200 -225 -156 264 126 -262
3449 -262 -94 289 66 -274 2 303 -22 -274 66 294 -95 -260 141 258 -157 -220 216 211 -217 -162 275
3470 275 145 -264 -102 294 64 -287 -29 295 -30 -290 59 276 -98 -275 144 249 -176 -227 208 205 -236
3491 -236 -161 257 142 -268 -97 297 70 -285 -18 310 -16 -277 71 287 -94 -263 151 255 -169 -235 212
3512 212 211 -219 -164 260 135 -275 -100 290 54 -307 -24 299 -25 -303 55 290 -93 -286 138 266 -176
3533 -176 -226 207 201 -235 -177 274 147 -276 -103 306 75 -294 -16 322 -8 -296 60 299 -100 -272 142
3554 142 259 -179 -237 208 205 -243 -170 266 139 -290 -100 289 55 -310 -22 313 -34 -314 63 296 -107
3575 -107 -278 141 256 -170 -230 222 207 -243 -172 267 149 -274 -89 300 68 -300 -5 306 -25 -303 73
3596 73 293 -97 -275 150 264 -188 -232 216 201 -239 -169 266 132 -293 -107 307 47 -305 -16 300 -23
3617 -23 -300 85 300 -106 -281 162 271 -167 -222 222 212 -226 -159 280 144 -282 -85 302 68 -293 2
3638 2 316 -29 -316 82 301 -115 -278 156 264 -185 -239 212 193 -256 -173 262 123 -295 -100 303 46 -302
3660 -302 -7 313 -30 -296 77 292 -97 -276 165 261 -181 -227 228 203 -247 -162 286 148 -280 -82 313
3681 313 50 -302 -13 311 -39 -315 84 297 -113 -278 160 255 -194 -242 218 212 -251 -166 265 134 -290 -93
3703 -93 294 45 -305 -4 306 -37 -303 87 305 -96 -263 154 275 -168 -230 229 210 -236 -151 275 144
3724 144 -276 -87 300 44 -317 -12 300 -35 -305 76 294 -116 -284 147 248 -187 -235 226 188 -247 -160
3745 -160 273 131 -285 -90 302 55 -300 -8 308 -30 -290 90 304 -102 -266 170 258 -181 -220 229 196
3766 196 -239 -159 269 127 -280 -82 294 38 -310 -2 297 -42 -305 85 283 -127 -277 147 241 -197 -222
3787 -222 229 193 -241 -161 271 118 -281 -71 304 47 -297 5 316 -41 -288 89 294 -113 -260 159 250
3808 250 -182 -205 232 181 -253 -146 269 104 -289 -78 290 29 -302 1 298 -61 -301 90 267 -129 -254
3829 -254 171 241 -195 -213 234 176 -250 -140 281 110 -283 -65 298 30 -295 22 304 -50 -279 100 291
3850 291 -127 -249 173 240 -202 -214 222 176 -259 -137 268 94 -290 -69 285 27 -305 22 283 -65 -290
3871 -290 104 271 -143 -253 175 238 -192 -197 244 176 -242 -119 279 99 -281 -56 305 27 -288 24 300
3892 300 -65 -273 101 271 -123 -265 174 223 -199 -210 232 163 -261 -143 263 98 -291 -62 288 14 -286
3913 -286 28 281 -66 -278 106 266 -132 -242 178 231 -190 -193 237 168 -243 -128 278 105 -281 -51 294
3934 294 20 -285 35 295 -56 -268 112 265 -131 -245 165 222 -206 -199 224 147 -248 -126 271 84 -283
3955 -283 -44 280 16 -286 28 286 -66 -269 102 255 -130 -223 180 222 -185 -178 228 166 -230 -108 267 92
3977 92 -266 -41 286 22 -271 26 279 -68 -263 101 246 -123 -235 167 205 -203 -195 215 146 -240 -133 261
3999 261 90 -274 -39 282 13 -278 38 281 -51 -261 108 268 -130 -228 187 215 -194 -194 222 164 -240 -119
4021 -119 252 89 -268 -53 273 14 -282 27 272 -63 -273 89 246 -132 -249 162 210 -202 -182 214 160
4042 160 -236 -124 254 99 -270 -50 289 24 -273 25 291 -53 -251 103 258 -122 -235 174 217 -185
4062 -185 -187 220 161 -236 -124 250 90 -266 -66 269 27 -288 -2 266 -59 -263 80 255 -126 -240 146
4083 146 212 -184 -201 206 169 -228 -130 246 107 -248 -63 274 27 -271 10 277 -31 -259 89 260 -111
4104 -111 -233 157 230 -174 -191 210 170 -224 -145 244 97 -260 -71 263 27 -274 0 264 -39 -265 84
4125 84 256 -106 -251 137 227 -175 -195 205 176 -221 -128 247 119 -249 -59 275 37 -260 4 272 -32 -273
4147 -273 73 261 -111 -245 155 223 -179 -200 200 160 -228 -147 249 105 -261 -77 277 47 -274 0 268
4168 268 -54 -281 74 260 -111 -241 152 229 -163 -198 211 182 -227 -127 257 132 -250 -76 264 39 -263
4189 -263 4 280 -37 -269 78 253 -103 -249 153 222 -181 -204 205 168 -242 -143 238 95 -268 -70 281
4210 281 29 -272 9 288 -40 -272 89 264 -115 -251 156 229 -162 -187 221 177 -223 -129 258 103 -255
4231 -255 -55 273 37 -267 20 279 -49 -266 88 259 -127 -240 152 222 -178 -194 214 169 -242 -134 256
4252 256 99 -269 -58 284 32 -292 11 283 -43 -260 107 263 -123 -242 163 227 -177 -185 219 167 -233
4273 -233 -133 261 110 -260 -55 273 29 -287 24 271 -54 -275 88 253 -131 -247 160 221 -199 -194 221
4294 221 171 -237 -129 260 93 -275 -59 279 20 -286 21 298 -43 -276 107 276 -112 -232 183 233 -187
4315 -187 -200 230 163 -249 -124 260 97 -277 -61 285 22 -281 25 283 -59 -275 108 246 -142 -243 163
4336 163 216 -192 -188 217 168 -243 -118 258 102 -265 -52 283 10 -276 37 295 -58 -264 112 265 -128
4357 -128 -238 177 217 -198 -181 230 159 -249 -115 267 92 -266 -58 277 2 -293 32 286 -71 -274 101
4378 101 256 -150 -242 181 217 -207 -188 243 163 -248 -129 276 105 -265 -45 298 18 -279 39 281 -64
4399 -64 -259 118 269 -145 -235 177 221 -208 -193 223 163 -257 -128 279 73 -283 -55 278 5 -295 23 281
4421 281 -70 -279 111 271 -148 -238 176 223 -203 -189 244 169 -253 -117 292 98 -277 -32 302 19 -282
4442 -282 34 294 -71 -279 117 269 -144 -248 182 213 -216 -205 232 162 -256 -125 272 77 -288 -55 290
4463 290 8 -302 28 282 -72 -284 118 277 -140 -237 191 230 -198 -187 241 178 -249 -123 285 93 -271
4484 -271 -42 301 17 -291 36 299 -82 -284 119 265 -138 -243 170 214 -205 -198 247 156 -259 -126 268
4505 268 95 -283 -50 286 11 -284 24 288 -54 -274 114 262 -140 -231 183 231 -197 -192 249 181 -242 -117
4527 -117 281 103 -274 -43 290 8 -282 28 292 -69 -282 100 259 -142 -244 169 218 -193 -190 215 157
4548 157 -255 -138 254 93 -275 -59 283 14 -278 36 288 -48 -254 109 257 -132 -231 181 214 -193 -177
4569 -177 231 160 -238 -113 262 93 -269 -48 274 3 -276 15 275 -66 -269 95 258 -142 -237 160 213
4590 213 -193 -190 215 151 -235 -124 258 93 -260 -49 285 17 -268 38 277 -51 -257 99 247 -127 -225
4611 -225 169 212 -170 -179 221 147 -226 -125 261 95 -268 -49 259 22 -264 18 258 -65 -261 98 241
4632 241 -126 -226 161 214 -180 -176 217 158 -227 -110 248 95 -253 -41 262 22 -250 31 271 -41 -245
4653 -245 93 241 -113 -209 163 199 -175 -164 198 153 -220 -118 227 84 -247 -52 264 20 -255 13 247
4674 247 -67 -244 84 235 -117 -211 152 191 -168 -162 203 150 -217 -103 233 94 -240 -40 254 26 -242 17
4696 17 265 -40 -240 98 220 -107 -204 153 192 -174 -172 184 147 -208 -114 234 84 -236 -53 232 13 -240
4718 -240 18 241 -47 -233 80 223 -115 -197 144 193 -159 -159 196 146 -197 -100 233 89 -218 -44 239 20
4740 20 -236 24 243 -44 -223 86 215 -101 -210 131 185 -156 -160 187 133 -207 -113 221 69 -230 -51 231
4762 231 1 -242 18 233 -36 -224 100 222 -103 -197 149 191 -157 -146 190 134 -192 -100 220 76 -207 -39
4784 -39 235 20 -232 26 235 -47 -224 73 211 -105 -215 126 188 -166 -166 177 124 -198 -104 216 75 -231
4806 -231 -37 227 16 -234 19 235 -40 -215 78 219 -97 -191 146 189 -151 -140 188 152 -194 -97 221 76
4828 76 -208 -37 226 13 -228 17 221 -51 -228 74 216 -102 -194 136 176 -160 -161 188 128 -195 -100 211
4850 211 74 -234 -31 237 23 -227 26 248 -46 -219 99 219 -105 -184 136 183 -151 -150 189 131 -203 -99
4872 -99 216 89 -218 -40 235 17 -231 18 228 -63 -215 77 202 -114 -193 140 181 -163 -152 178 127 -198
4894 -198 -108 210 79 -223 -34 243 15 -224 24 235 -39 -211 87 222 -107 -190 140 187 -155 -146 185 131
4916 131 -214 -99 215 79 -219 -34 227 -5 -238 23 221 -56 -218 91 211 -115 -185 148 169 -161 -144
4937 -144 198 126 -188 -84 222 70 -221 -26 243 15 -229 27 233 -47 -213 105 216 -112 -181 161 179
4958 179 -165 -134 179 118 -202 -100 215 58 -241 -44 230 -4 -241 30 223 -53 -205 88 206 -115 -186
4979 -186 136 174 -158 -142 186 124 -200 -84 223 68 -220 -25 237 1 -234 28 234 -56 -211 103 214
5000 214 -123 -183 147 163 -163 -141 179 104 -202 -83 213 56 -226 -22 219 -21 -218 36 212 -73 -206
5021 -206 100 204 -108 -173 156 169 -161 -136 181 113 -185 -60 216 62 -218 -22 228 1 -217 35 227
5042 227 -73 -196 96 187 -112 -172 148 153 -167 -126 187 104 -202 -73 204 44 -228 -22 214 -12 -216 48
5064 48 210 -67 -196 98 190 -124 -155 165 174 -167 -116 196 104 -176 -67 208 50 -203 -9 225 -4 -204
5086 -204 46 207 -61 -191 111 180 -125 -158 152 137 -163 -122 173 94 -189 -66 196 55 -206 -8 215 -3
5108 -3 -200 57 207 -59 -178 103 185 -100 -146 143 142 -154 -99 169 90 -177 -55 202 41 -195 -9 203 -22
5131 -22 -202 43 177 -73 -184 119 167 -119 -164 140 118 -171 -98 166 82 -184 -55 195 24 -195 -1 199
5153 199 -12 -186 60 192 -78 -159 110 176 -107 -138 145 133 -152 -90 171 76 -170 -50 186 15 -195 5
5175 5 189 -28 -186 40 181 -80 -169 102 160 -119 -135 145 113 -158 -101 164 60 -178 -41 194 18 -176
5197 -176 6 185 -27 -175 66 189 -68 -149 120 154 -110 -129 160 109 -153 -80 165 64 -168 -40 181 8
5219 8 -183 2 179 -35 -181 61 172 -83 -160 102 145 -128 -118 145 107 -153 -77 165 70 -158 -38 187 18
5242 18 -176 20 183 -37 -158 72 173 -67 -153 109 140 -129 -118 144 104 -156 -73 173 52 -171 -25 167
5264 167 6 -170 16 166 -50 -167 70 161 -94 -140 116 132 -129 -109 147 104 -144 -71 175 62 -165 -11
5286 -11 176 10 -158 26 169 -38 -152 78 166 -83 -135 119 141 -119 -108 151 100 -156 -59 167 42 -173
5308 -173 -20 173 9 -176 20 171 -32 -154 80 154 -90 -126 114 133 -119 -94 148 103 -147 -49 170 40
5330 40 -151 -4 177 8 -157 43 178 -46 -148 82 147 -87 -145 116 124 -133 -90 145 80 -148 -68 158 39
5353 39 -165 -23 160 -4 -176 29 175 -58 -134 83 156 -95 -133 121 122 -118 -82 153 95 -137 -49 172 41
5376 41 -162 -1 173 0 -156 33 165 -52 -150 87 147 -99 -128 115 105 -122 -91 141 69 -156 -56 165
5398 165 31 -168 -10 171 -11 -169 43 163 -50 -142 83 150 -89 -122 124 114 -126 -90 152 80 -155 -43
5420 -43 167 39 -152 -11 174 -6 -164 39 151 -68 -140 73 121 -108 -126 111 113 -127 -99 143 57 -149 -47
5443 -47 158 36 -154 -7 159 -12 -151 48 160 -52 -127 77 143 -89 -104 131 121 -115 -83 143 73 -132
5465 -132 -42 158 26 -147 4 158 -6 -151 35 144 -57 -139 78 136 -90 -117 109 98 -129 -80 144 68
5487 68 -145 -32 163 27 -152 4 162 -11 -150 42 151 -47 -132 86 127 -90 -102 127 110 -124 -71 146
5509 146 71 -142 -36 148 27 -160 3 141 -29 -152 34 138 -66 -140 86 130 -101 -108 108 95 -129 -72
5531 -72 140 57 -136 -36 150 19 -152 13 144 -21 -138 45 156 -51 -123 87 120 -98 -97 118 96 -127
5553 -127 -80 139 60 -160 -43 150 9 -152 -1 149 -29 -143 52 146 -66 -123 89 108 -104 -109 106 90 -128
5576 -128 -59 142 57 -139 -27 146 20 -151 17 157 -19 -142 57 145 -69 -126 82 111 -100 -99 124 82 -135
5599 -135 -60 134 48 -144 -26 156 -1 -160 3 148 -32 -143 59 132 -73 -136 92 123 -94 -91 131 93 -122
5622 -122 -67 139 50 -142 -18 154 4 -144 23 146 -31 -142 72 135 -71 -131 93 109 -119 -96 125 84
5644 84 -146 -72 135 32 -156 -29 140 -6 -157 4 153 -60 -150 65 136 -85 -122 102 107 -120 -100 134 76
5667 76 -129 -54 154 53 -137 -12 171 13 -148 37 147 -52 -140 62 137 -82 -119 102 111 -127 -98 131 66
5690 66 -145 -60 144 24 -147 -9 159 -4 -154 32 142 -59 -138 82 131 -96 -110 121 115 -115 -89 149 81
5713 81 -142 -33 173 34 -151 -5 158 -28 -161 41 145 -69 -145 77 129 -103 -120 110 102 -136 -90 137
5735 137 55 -147 -48 151 7 -169 -2 157 -19 -146 51 161 -55 -130 89 131 -108 -107 131 107 -140 -71 142
5758 142 68 -156 -35 164 18 -163 7 163 -38 -154 59 148 -73 -151 85 118 -126 -113 125 96 -151 -79
5780 -79 159 61 -160 -38 165 12 -157 23 170 -39 -157 66 160 -79 -139 103 133 -111 -108 135 97 -138 -58
5803 -58 166 62 -153 -31 174 9 -170 19 165 -35 -163 69 148 -85 -142 104 134 -123 -110 125 91 -149
5825 -149 -69 160 58 -162 -32 169 5 -166 31 171 -27 -151 75 157 -77 -132 112 131 -125 -107 141 90
5847 90 -155 -65 164 39 -165 -23 168 -3 -164 22 177 -48 -157 74 148 -99 -136 102 118 -122 -105 141
5869 141 71 -154 -56 160 44 -160 -13 169 -2 -164 43 167 -59 -154 77 158 -89 -123 122 116 -124 -98 142
5892 142 79 -158 -68 160 38 -171 -14 169 -2 -174 33 163 -50 -157 73 143 -100 -135 112 114 -130 -95
5914 -95 141 78 -156 -45 169 46 -165 -7 177 -5 -165 38 173 -57 -147 86 162 -97 -131 117 117 -135
5936 -135 -103 148 80 -152 -61 168 29 -169 -19 164 -17 -174 33 157 -64 -169 69 140 -106 -138 123 120
5958 120 -134 -93 141 84 -150 -44 169 41 -173 -1 179 -6 -158 39 174 -47 -155 88 145 -104 -126
5979 -126 117 114 -143 -95 134 72 -169 -63 158 20 -179 -13 163 -21 -168 29 171 -56 -154 88 151 -101
6001 -101 -125 116 112 -132 -98 142 85 -149 -47 176 37 -161 -1 181 -20 -158 54 170 -60 -161 90 149
6023 149 -108 -128 115 104 -141 -89 152 78 -158 -59 168 23 -169 -7 173 -25 -168 56 172 -68 -148 93
6045 93 151 -95 -121 138 117 -137 -85 155 81 -156 -32 174 27 -178 0 179 -18 -169 49 164 -68 -160
6067 -160 96 149 -108 -131 124 110 -150 -97 156 71 -158 -55 168 24 -162 10 175 -29 -174 60 165 -70
6089 -70 -148 91 143 -96 -132 135 123 -137 -85 162 78 -159 -36 181 27 -170 -4 167 -24 -166 43 166
6111 166 -68 -166 82 132 -109 -127 128 119 -147 -88 164 69 -170 -44 178 28 -171 7 193 -23 -159 60
6133 60 179 -61 -146 94 160 -114 -112 142 109 -137 -87 167 72 -154 -36 180 26 -179 -1 180 -35 -176 48
6156 48 154 -72 -161 93 135 -126 -138 122 112 -156 -91 179 66 -168 -47 172 27 -166 9 178 -25 -162
6178 -162 54 167 -69 -154 100 146 -117 -124 137 119 -145 -85 161 69 -167 -53 177 18 -188 6 176 -31
6200 -31 -188 47 166 -68 -155 102 148 -121 -123 136 114 -152 -91 161 73 -178 -39 186 24 -174 6 192 -30
6223 -30 -178 55 183 -73 -151 105 155 -101 -134 132 119 -151 -97 154 72 -181 -48 174 11 -192 -5 177
6245 177 -35 -179 46 169 -85 -171 100 145 -103 -138 140 116 -145 -95 177 84 -176 -41 186 31 -192 2
6267 2 204 -17 -182 60 183 -70 -163 108 151 -122 -139 139 116 -154 -91 173 72 -192 -57 185 7 -190
6289 -190 2 189 -27 -187 59 181 -84 -175 105 166 -115 -142 143 125 -149 -96 182 83 -182 -41 207 31
6311 31 -180 15 204 -30 -182 64 177 -79 -172 90 156 -123 -149 150 125 -159 -99 169 78 -197 -55 199
6333 199 29 -185 -1 193 -26 -188 57 181 -76 -173 108 167 -120 -138 137 124 -160 -83 178 76 -186 -54
6355 -54 212 35 -192 1 208 -37 -203 68 188 -75 -190 105 159 -135 -144 147 120 -171 -95 177 67 -188
6377 -188 -58 194 24 -205 15 203 -25 -201 57 189 -88 -178 112 167 -124 -139 161 127 -160 -101 186 83
6399 83 -193 -48 200 22 -198 10 206 -39 -203 56 190 -82 -177 115 170 -142 -150 148 125 -179 -104 190
6421 190 84 -200 -45 209 33 -201 8 213 -19 -189 61 201 -79 -181 113 175 -131 -143 154 132 -170
6442 -170 -98 191 76 -199 -62 204 26 -214 0 208 -29 -200 61 201 -97 -184 114 173 -137 -146 162 129
6464 129 -175 -112 199 85 -196 -39 217 32 -209 19 211 -33 -201 66 206 -81 -180 126 175 -133 -150
6485 -150 160 123 -174 -110 196 70 -207 -46 207 25 -216 1 204 -32 -212 62 198 -92 -184 108 169
6506 169 -143 -155 165 140 -183 -109 199 78 -198 -45 214 14 -203 12 219 -35 -215 64 205 -89 -181
6527 -181 122 172 -138 -155 162 131 -182 -106 189 73 -201 -49 211 9 -221 11 201 -36 -204 51 191
6548 191 -100 -185 117 172 -137 -153 162 130 -182 -95 194 80 -195 -42 217 23 -213 16 219 -35 -205 68
6570 68 208 -94 -187 115 165 -150 -154 157 130 -178 -105 188 67 -197 -59 213 9 -217 16 203 -44 -205
6592 -205 66 194 -88 -182 125 174 -129 -144 157 136 -178 -109 198 78 -192 -54 210 30 -212 12 211 -24
6614 -24 -205 71 197 -97 -185 114 162 -138 -161 150 126 -180 -104 187 70 -210 -62 206 21 -224 6 210
6636 210 -29 -206 61 194 -86 -185 113 177 -128 -144 160 142 -175 -112 197 79 -197 -45 215 13 -217 5
6658 5 209 -40 -207 60 194 -98 -186 100 167 -137 -153 150 113 -175 -108 180 74 -194 -46 209 33 -205
6680 -205 6 207 -30 -192 62 194 -72 -171 119 173 -131 -151 156 131 -174 -110 188 80 -187 -53 201 24
6702 24 -212 -4 218 -28 -209 61 184 -84 -192 101 159 -132 -150 143 127 -168 -110 186 80 -189 -57 204
6724 204 34 -202 3 206 -10 -197 64 207 -72 -172 114 174 -131 -148 158 137 -163 -110 179 79 -198
6745 -198 -56 207 29 -206 3 208 -27 -189 44 194 -74 -183 112 172 -119 -144 153 139 -163 -109 191
6766 191 78 -185 -50 205 42 -190 15 212 -18 -201 58 195 -83 -169 110 174 -134 -154 148 133 -152
6787 -152 -118 184 87 -191 -58 201 31 -199 7 204 -24 -198 48 197 -83 -196 96 169 -125 -155 149
6808 149 133 -161 -110 181 91 -173 -50 208 41 -197 2 214 -11 -204 55 208 -70 -187 101 177 -126
6829 -126 -151 143 130 -175 -118 181 86 -184 -63 201 45 -208 -12 202 -21 -205 45 195 -64 -190 95
6850 95 178 -125 -152 147 146 -166 -109 183 91 -181 -61 205 51 -193 -7 213 -22 -203 47 202 -66 -177
6872 -177 100 166 -122 -156 141 137 -152 -127 178 101 -186 -68 202 33 -213 -8 218 -20 -198 34 196 -54
6894 -54 -184 108 186 -105 -156 132 143 -155 -114 182 93 -181 -72 192 55 -189 -15 201 -10 -205 55 194
6916 194 -72 -187 93 177 -120 -157 127 150 -157 -129 157 102 -181 -75 202 39 -202 -14 203 -5 -201 49
6938 49 217 -56 -183 102 184 -112 -162 137 150 -151 -118 180 105 -190 -67 206 49 -192 -25 209 -8 -200
6960 -200 32 199 -65 -194 96 183 -117 -163 136 149 -153 -124 167 102 -183 -73 208 55 -205 -24 207 -2
6982 -2 -189 43 205 -57 -186 84 179 -102 -156 142 158 -150 -120 172 106 -177 -77 207 49 -208 -17 207
7004 207 -3 -202 36 202 -71 -194 78 179 -108 -165 134 160 -153 -126 175 104 -181 -66 202 56 -194
7025 -194 -20 212 5 -202 45 217 -61 -190 91 192 -114 -156 137 151 -153 -129 174 107 -188 -68 195
7046 195 45 -195 -23 201 -5 -212 27 200 -57 -185 81 179 -112 -156 140 156 -150 -122 175 110 -177 -71
7068 -71 196 53 -194 -20 216 2 -198 32 194 -62 -182 85 177 -107 -168 124 146 -153 -126 169 99 -180
7090 -180 -93 189 42 -197 -31 198 1 -202 29 196 -54 -204 86 180 -111 -166 133 159 -148 -129 170 102
7112 102 -168 -74 204 57 -190 -23 201 -1 -194 33 204 -54 -182 87 181 -105 -178 120 141 -156 -131 163
7134 163 101 -182 -77 186 51 -196 -26 201 -4 -201 32 189 -53 -188 87 176 -98 -157 129 152 -136
7155 -136 -121 162 115 -170 -69 191 57 -194 -28 208 5 -205 19 196 -46 -188 78 177 -106 -175 127
7176 127 149 -151 -121 164 100 -173 -88 189 56 -199 -31 199 -4 -198 23 203 -54 -191 81 187 -91
7197 -91 -160 138 145 -149 -115 164 103 -174 -73 191 48 -184 -20 195 -5 -191 25 201 -54 -186 80 165
7219 165 -109 -159 126 146 -140 -118 156 90 -184 -79 183 51 -186 -11 200 2 -194 42 199 -56 -177
7240 -177 99 177 -97 -156 130 135 -140 -122 166 98 -175 -79 193 53 -191 -25 192 -4 -193 37 203 -54
7262 -54 -181 80 166 -102 -162 135 139 -139 -126 170 103 -169 -68 187 52 -185 -15 192 12 -194 32 207
7284 207 -44 -171 83 177 -101 -158 129 148 -149 -119 167 89 -169 -80 181 43 -196 -27 192 -3 -191 27
7306 27 180 -57 -182 72 165 -107 -143 120 134 -137 -120 164 100 -166 -75 185 50 -178 -16 192 10 -184
7328 -184 42 186 -42 -178 81 173 -104 -150 125 142 -129 -123 144 92 -177 -77 173 50 -194 -25 181 -4
7350 -4 -191 20 178 -67 -185 70 169 -101 -160 109 150 -121 -110 158 106 -161 -69 176 53 -176 -25 193 14
7373 14 -184 25 188 -39 -176 72 164 -102 -156 117 147 -129 -124 140 99 -168 -88 168 52 -189 -34 189 11
7396 11 -200 19 180 -46 -170 62 169 -77 -147 114 156 -127 -121 149 107 -162 -79 180 61 -172 -38 187
7418 187 16 -188 5 176 -28 -175 61 164 -80 -150 103 125 -132 -132 139 99 -162 -93 162 56 -177 -42
7440 -42 168 13 -184 18 183 -37 -179 63 162 -71 -145 109 148 -107 -116 143 112 -141 -82 177 66 -164 -43
7463 -43 180 22 -181 13 176 -19 -175 52 159 -90 -166 102 148 -120 -128 130 99 -153 -79 164 62 -171
7485 -171 -47 169 29 -173 4 182 -22 -164 55 170 -68 -144 105 154 -108 -120 134 105 -139 -88 163 70
7507 70 -156 -43 170 19 -175 -2 174 -34 -168 45 160 -67 -158 99 146 -120 -128 126 110 -144 -90 160
7529 160 72 -160 -51 175 28 -170 7 186 -14 -155 62 175 -51 -144 98 157 -105 -119 131 115 -139 -98
7551 -98 158 63 -165 -41 160 27 -170 -2 171 -23 -167 36 164 -56 -155 82 146 -110 -131 128 119 -130
7573 -130 -92 158 84 -151 -44 179 43 -158 5 179 -7 -160 53 180 -63 -145 90 148 -102 -117 124 110
7595 110 -138 -105 151 66 -167 -54 167 31 -173 3 170 -17 -161 37 170 -61 -152 77 152 -102 -132 129
7617 129 128 -132 -91 160 88 -160 -45 164 38 -170 4 178 -14 -170 32 162 -60 -152 85 144 -115 -125
7639 -125 114 109 -141 -96 145 75 -162 -50 155 26 -174 -17 158 -18 -161 31 145 -59 -147 88 148 -104
7661 -104 -134 118 114 -136 -90 142 81 -157 -54 168 30 -158 -1 175 -18 -172 31 162 -64 -157 90 136
7683 136 -101 -128 114 114 -136 -101 138 67 -161 -57 162 31 -166 -14 168 -4 -163 30 161 -57 -145 89
7705 89 157 -91 -122 117 117 -128 -91 148 86 -144 -55 153 35 -168 -8 166 -15 -171 32 161 -64 -164 78
7728 78 140 -103 -136 112 112 -139 -102 142 75 -150 -59 164 33 -162 -16 178 7 -151 34 157 -52 -162 73
7751 73 146 -93 -125 129 116 -127 -88 142 81 -160 -58 163 42 -162 -11 165 -12 -158 35 161 -58 -151
7773 -151 66 143 -102 -130 113 100 -134 -93 150 79 -139 -52 161 28 -157 -8 167 -8 -156 38 162 -60
7795 -60 -158 78 145 -90 -124 117 110 -127 -94 140 78 -148 -60 157 41 -164 -15 154 -13 -176 31 149 -59
7818 -59 -158 72 138 -95 -132 99 111 -115 -97 137 81 -137 -50 150 48 -146 -5 169 2 -153 34 167 -44
7841 -44 -151 73 148 -89 -132 108 114 -124 -79 151 74 -144 -61 146 28 -159 -18 156 -12 -148 33 161 -44
7864 -44 -150 68 141 -92 -121 108 113 -127 -79 140 78 -146 -58 149 39 -157 -17 166 -7 -151 40 148 -51
7887 -51 -154 77 138 -87 -124 95 101 -117 -96 130 71 -145 -61 149 36 -155 -10 151 -10 -163 34 157 -51
7910 -51 -147 69 133 -79 -118 109 117 -116 -84 142 86 -136 -58 153 46 -143 -10 155 -7 -145 38 152 -42
7933 -42 -135 67 133 -82 -121 99 110 -115 -93 126 72 -132 -59 139 35 -146 -16 158 -1 -143 27 160 -37
7956 -37 -135 70 139 -77 -109 94 115 -102 -83 121 81 -130 -50 142 32 -142 -11 149 -10 -142 26 147 -41
7979 -41 -137 68 122 -82 -119 89 102 -109 -97 118 71 -126 -55 131 43 -142 -12 144 14 -131 32 147 -28
8002 -28 -126 58 130 -62 -112 89 114 -92 -82 119 74 -113 -52 133 29 -132 -10 142 -2 -141 12 144 -40
8025 -40 -139 53 116 -72 -117 81 100 -101 -82 111 72 -120 -56 139 45 -124 -26 135 10 -127 22 148 -30
8048 -30 -132 50 121 -64 -106 88 100 -95 -85 110 86 -112 -53 124 40 -131 -22 141 6 -137 7 134 -31
8071 -31 -123 43 116 -61 -122 76 104 -96 -83 117 82 -108 -56 128 56 -122 -26 134 21 -121 12 128 -9
8094 -9 -131 43 130 -56 -98 90 109 -74 -78 107 82 -109 -56 112 33 -129 -31 121 4 -135 7 127 -19 -123
8118 -123 34 112 -70 -121 71 96 -82 -88 98 86 -99 -59 118 56 -118 -32 125 15 -123 14 121 -11 -120
8141 -120 38 111 -53 -111 76 101 -84 -90 94 80 -104 -66 105 53 -117 -27 119 7 -122 -9 122 -12 -118
8164 -118 46 119 -51 -118 72 100 -84 -83 96 86 -102 -56 117 44 -110 -20 125 10 -124 12 123 -14 -123
8187 -123 36 115 -45 -106
8191a06
$$ Imaginary data points
##PAGE= N=2
##DATA TABLE= (X++(I..I)), XYDATA
0 0 0 0 0 0 0 0 0 0 0 0 0 0 0 0 0 0 0 0 -6 8 -8 8 -8 8 -8 8 -14 16 -16 16 -21 24 -28 29 -34 37 -44 45 -52 58 -63
41 -63 67 -75 84 -93 102 -110 122 -136 148 -165 182 -201 222 -246 275 -309 347 -395 457 -533 630
62 630 -763 953 -1240 1706 -2567 4456 -10250 61552 278933 -46774 -259518 98377 257769
75 257769 -111383 -223569 147784 205270 -174971 -187267 187580 146085 -221417 -127177 225082
86 225082 89219 -232489 -53769 241779 34901 -228042 6241 234540 -28702 -224204
96 -224204 59848 209714 -96403 -202089 114282 174548 -142844 -158442 158664 138483 -170024
107 -170024 -111233 189178 92624 -194297 -60685 202150 30221 -205208 -4439 196721
117 196721 -27717 -194863 48347 184463 -72188 -174603 95420 163301 -113964 -143310
127 -143310 133571 123040 -145864 -99039 154958 75630 -161647 -53784 166219 30965
137 30965 -170521 -8648 170305 -16077 -167885 37297 158052 -58593 -147366 75130
147 75130 134636 -89344 -119267 106643 107226 -118065 -87117 133083 68831 -142224 -49173
158 -49173 144884 26100 -149454 -11077 145460 -8525 -143452 27536 140991 -43289
168 -43289 -129124 66745 122149 -80133 -105797 94836 90962 -106806 -79645 111404 61376
179 61376 -122314 -49204 125296 30771 -127288 -10085 128849 -5140 -120722 25436
189 25436 117283 -38908 -110786 51569 101649 -68368 -97065 77334 82345 -91220 -70528
200 -70528 98284 55641 -101786 -38370 107504 26837 -106857 -9819 110412 -4620 -110705
211 -110705 19620 106322 -37200 -102904 48064 92489 -60320 -83819 69358 74725 -76336
222 -76336 -62019 86897 51861 -92082 -35771 98507 21655 -100224 -7891 98587 -6003
233 -6003 -98123 15354 93331 -28078 -90309 39278 84130 -50417 -74161 62579 65348
244 65348 -69091 -52653 76527 43154 -81046 -33622 84533 22060 -89483 -12215 88977
255 88977 -2165 -88749 14087 84536 -25174 -78045 36875 74275 -44293 -66870 54953
266 54953 61240 -63726 -53481 70109 41730 -77024 -32616 77479 20142 -78999 -10225
277 -10225 79081 822 -77423 11673 78195 -21208 -73649 33317 69062 -42728 -63076 48436
289 48436 54000 -55757 -48558 58931 39737 -64206 -30551 69401 21417 -70558 -8300 73086
301 73086 -881 -70849 10763 68804 -19345 -67419 25648 62711 -35379 -59528 42382 52026
313 52026 -49790 -43073 56284 35336 -58621 -25301 62865 18497 -64848 -10587 66450 1177
325 1177 -68147 6873 65181 -17153 -62082 24732 56688 -31401 -50738 38450 46597 -43536
337 -43536 -39967 50706 34048 -55649 -26118 58763 17010 -60712 -9721 59380 1518 -58814
349 -58814 5449 57656 -12975 -55624 21948 53334 -29712 -48225 37357 42867 -42422 -36814
361 -36814 46027 30729 -49485 -25455 51719 18014 -54828 -10357 55849 1302 -55374 7548
373 7548 53922 -14522 -50932 21231 48828 -26571 -45786 32410 41861 -38362 -36730 42712 28965
386 28965 -46874 -22013 48298 14448 -49633 -7751 51251 2068 -51467 5537 52317 -12167
398 -12167 -50341 19227 46589 -25691 -42477 29671 36743 -34424 -32490 38314 27563 -42375
410 -42375 -21217 47099 15531 -48482 -7447 49873 1375 -48741 4211 46725 -10239 -45895
422 -45895 15050 43145 -21813 -40296 28385 36288 -33413 -30299 38232 25563 -40470 -20367
434 -20367 42465 15457 -44685 -10797 45413 3734 -46573 2774 45088 -10079 -42834 16296
446 16296 40209 -21083 -37265 25751 34698 -30304 -31689 34378 26852 -38327 -21235 40509 14874
459 14874 -41222 -8513 41659 3296 -41533 2195 41936 -7719 -41760 13627 40214 -19425
471 -19425 -37245 24120 33196 -27490 -28654 30460 24760 -32815 -20127 36156 15395 -38908 -9537
484 -9537 40715 3286 -41214 2275 40245 -7049 -38697 11243 37089 -15391 -35167 20040
496 20040 32159 -25213 -28324 29455 23346 -32733 -18309 34914 14050 -36088 -9923 37420
508 37420 5905 -38353 -1068 38315 -4669 -37271 9980 34517 -15185 -31825 18954 28831
520 28831 -22566 -26440 26071 23782 -29636 -20242 32475 15473 -34351 -10455 34649 5461 -34154
533 -34154 -753 33956 -3264 -33482 8016 33129 -13163 -32150 17594 29176 -22093 -26189
545 -26189 24584 22476 -26288 -18514 28716 15846 -29635 -10625 32604 6588 -33242 -995
557 -995 33248 -4411 -33098 7394 30561 -11706 -29919 14265 28120 -17348 -25092 22019 22811
570 22811 -24186 -17473 27336 13415 -28828 -9916 28989 5443 -31100 -3428 30707 -1236
582 -1236 -31460 5377 30591 -9248 -27527 14041 25669 -16327 -22356 19313 19830 -22543 -18215
595 -18215 24471 14293 -27876 -11190 28960 6954 -28844 -2371 28966 -317 -27231 4447
607 4447 27137 -7689 -26375 11534 24701 -16198 -23189 18853 19696 -21606 -16896 23004 14303
620 14303 -23582 -10903 25397 8350 -26064 -3996 27038 -410 -26958 4455 25725 -8202
632 -8202 -24649 10694 23213 -13138 -21951 15653 20201 -18315 -17395 20896 13885 -22499 -9859
645 -9859 23526 6462 -23921 -3387 24543 703 -25093 2289 25178 -5887 -24689 8971
657 8971 22373 -12391 -20253 14376 17506 -16299 -15068 18640 13309 -20386 -10325 22760 7333
670 7333 -24106 -4160 23799 300 -23758 1821 22226 -4661 -21440 7488 20950 -9904
682 -9904 -18820 14084 17725 -16133 -14601 18271 11878 -19745 -10309 19420 7156 -21047 -5535
695 -5535 21250 2452 -21230 1794 21792 -4195 -19513 8173 18921 -9931 -17628 11528
707 11528 15909 -14376 -15599 15310 12499 -17950 -10116 18988 7055 -18853 -3156 19851 1538
720 1538 -19077 1472 19691 -3949 -20070 6116 18681 -9653 -17923 11254 15289 -13013 -12904
733 -12904 14399 11268 -15025 -8727 16978 6965 -18098 -4203 19003 1156 -19400 1056
745 1056 18261 -3546 -17583 5017 16561 -6763 -15491 9163 14491 -11362 -12482 13755 10266
758 10266 -15270 -7880 16111 5881 -16526 -4174 16942 2318 -17450 -177 17302 -2828
770 -2828 -16925 5467 15539 -7960 -13925 9950 12797 -11081 -11319 12905 10503 -14108 -8677
783 -8677 15380 6266 -16307 -4094 15677 1035 -15721 618 15032 -2464 -14641 4840
795 4840 15118 -6244 -13834 8998 13060 -10467 -11334 11215 8887 -12484 -7920 12330 5679 -13624
809 -13624 -4029 14678 2091 -14792 1142 15625 -2670 -14370 4931 13650 -6374 -13157 6977
822 6977 11475 -9335 -11091 10457 8964 -12185 -6624 13681 5000 -13468 -2431 14212 1452
835 1452 -14048 -107 13966 -1882 -14365 3191 12999 -5787 -12111 7267 10516 -8356 -8727
848 -8727 9870 8239 -10300 -6775 11785 5699 -12808 -4182 12965 1728 -13249 -165 12343
861 12343 -1707 -11789 3244 11559 -4614 -11006 6767 10715 -8406 -9449 10010 7935 -10949
874 -10949 -6429 11109 4753 -11453 -3534 11676 1987 -12097 -30 12417 -2000 -12116 3995
887 3995 11445 -5443 -10512 6394 9744 -7043 -8900 8015 8068 -9009 -6681 9976 4772 -10792
901 -10792 -3050 10815 1209 -10986 -81 10943 -971 -10998 2312 11166 -3587 -10402 5411
914 5411 9472 -6712 -8060 7539 6386 -8651 -5694 9020 4360 -10173 -3323 11103 2100 -11156
928 -11156 21 11438 -1138 -10369 2657 9688 -3727 -9208 4515 8338 -6263 -8109 7363
941 7363 6900 -8621 -5519 9508 4588 -9170 -2980 9598 2399 -9400 -1275 9447 -382 -9901
955 -9901 1673 9215 -3684 -8787 4915 8044 -5640 -7109 6591 6843 -7019 -5950 7942 4872
969 4872 -8837 -3545 9014 1540 -9356 -249 9026 -1017 -8834 2155 9084 -2859 -8758 4245
983 4245 8498 -5414 -7620 6206 6133 -7026 -5080 7190 3911 -7598 -3000 8248 2188 -8765
997 -8765 -899 9233 -373 -9094 1542 8491 -2552 -7864 3198 7222 -3927 -6656 5031 6217
1011 6217 -6044 -5171 7209 4074 -7920 -3024 7949 1807 -8148 -1222 8036 439 -7965 858
1025 858 8216 -1879 -7509 3545 7015 -4624 -6210 5224 5257 -6043 -5099 6202 4316 -6995
1039 -6995 -3636 7549 2639 -7519 -970 7759 52 -7155 1127 6919 -2032 -7058 2550 6671
1053 6671 -3868 -6732 4621 5948 -5405 -4858 6028 4042 -5924 -2851 6348 2254 -6568 -1347
1067 -1347 7020 194 -7502 780 7223 -2065 -7008 2699 6342 -3205 -5687 3810 5400 -4242 -4648
1082 -4648 5259 3971 -5949 -2869 6475 1776 -6726 -1032 6559 259 -6665 117 6540 -916 -6488
1097 -6488 1950 6255 -2845 -5328 4022 4772 -4456 -3912 4946 3381 -5433 -3145 5717 2361 -6398
1112 -6398 -1703 6413 561 -6237 516 5986 -1122 -5340 2054 5367 -2511 -5142 3327 4869 -4302
1127 -4302 -4598 4688 3575 -5227 -2913 5166 2158 -5091 -1417 5357 923 -5429 122 5789 -1029
1142 -1029 -5688 1980 5296 -2780 -4980 3005 4337 -3471 -4083 3786 3599 -4287 -2803 5015 2043
1157 2043 -5200 -880 5456 189 -5305 399 5217 -883 -5321 1198 5065 -2071 -4967 2654 4255
1172 4255 -3313 -3425 3898 2991 -3852 -2166 4439 2087 -4618 -1613 4939 845 -5386 -414 4878
1187 4878 -708 -4813 1064 4263 -1561 -3833 2347 4015 -2565 -3341 3702 3245 -4125 -2596 4286
1202 4286 1602 -4720 -1490 4139 579 -4405 -202 4471 -306 -4214 1540 4538 -1918 -3819 2779
1217 2779 3523 -3073 -3312 2942 2645 -3537 -2757 3459 2020 -3900 -1281 4284 810 -3863 323 4161
1233 4161 -457 -3863 857 3800 -1406 -4094 1509 3547 -2423 -3384 2702 2634 -3001 -1857 3393 1637
1249 1637 -3251 -912 3815 714 -3980 -153 4082 -641 -4201 970 3566 -1660 -3319 1825 2908
1264 2908 -2107 -2558 2631 2447 -2954 -1863 3577 1512 -3667 -907 3666 472 -3590 -343 3292
1279 3292 -146 -3454 380 3269 -1053 -3154 1738 2942 -2103 -2369 2577 2257 -2539 -1896 2792 1719
1295 1719 -3037 -1478 3077 680 -3448 -265 3146 -576 -3030 1083 2993 -1199 -2621 1857 2918
1310 2918 -1934 -2553 2430 2197 -2860 -1876 2675 946 -3017 -824 2749 331 -2868 101 3260 -152
1326 -152 -2978 1021 3293 -1153 -2862 1452 2354 -1849 -2414 1533 1737 -2181 -1781 2383 1425 -2593
1342 -2593 -675 3190 610 -2785 170 2979 -251 -2841 333 2503 -1026 -2840 1038 2230 -1841
1357 -1841 -2023 2287 1747 -2226 -977 2794 1172 -2498 -742 2742 483 -2984 -365 2645 -503
1372 -503 -2841 668 2343 -1154 -2101 1491 2180 -1425 -1786 2045 2007 -2092 -1625 2366 1186 -2581 -986
1389 -986 2253 312 -2404 -223 2257 -143 -2361 577 2542 -896 -2330 1463 2291 -1570 -1858 1784
1405 1784 1582 -1863 -1442 1837 1001 -2251 -848 2286 253 -2518 178 2543 -446 -2265 867 2378
1421 2378 -748 -2054 1104 2086 -1300 -1898 1524 1386 -2031 -1253 1947 661 -2158 -486 2244 508
1437 508 -2093 -41 2512 97 -2254 439 2173 -823 -2069 871 1484 -1404 -1607 1316 1321 -1633
1453 -1633 -1185 2044 1213 -1955 -571 2324 499 -2084 -153 1845 -295 -2057 171 1660 -805
1468 -805 -1904 1032 1810 -1275 -1393 1809 1485 -1541 -939 1791 906 -1756 -796 1653 271 -2071 -224
1485 -224 1826 -409 -1917 708 1895 -713 -1523 1113 1766 -932 -1488 1223 1379 -1466 -1252 1451
1501 1451 683 -1764 -554 1628 210 -1676 -15 1841 38 -1743 360 1959 -459 -1743 758
1516 758 1509 -1036 -1360 1016 958 -1286 -933 1371 738 -1597 -526 1828 341 -1810 4 1825 -177
1533 -177 -1625 358 1461 -546 -1451 645 1264 -1037 -1290 1211 1021 -1450 -818 1539 703 -1435 -504
1550 -504 1509 491 -1449 -291 1515 73 -1522 207 1423 -553 -1386 662 1219 -816 -1200 915
1566 915 1217 -968 -1055 1229 943 -1259 -605 1352 309 -1345 -80 1295 -167 -1357 274 1354
1582 1354 -496 -1414 691 1337 -862 -1130 1036 936 -1024 -694 1060 533 -1161 -451 1224 245 -1416
1599 -1416 -132 1419 -106 -1414 214 1325 -262 -1180 358 1170 -376 -1074 596 1014 -809 -892
1615 -892 939 643 -1149 -581 1101 423 -1137 -327 1230 300 -1136 21 1242 -175 -1076 497 956
1632 956 -700 -860 764 680 -957 -724 951 607 -1069 -459 1200 398 -1049 -40 1114 -35 -973
1649 -973 170 916 -314 -1037 314 966 -561 -1060 614 942 -679 -781 760 749 -661 -555 769
1666 769 503 -859 -409 903 102 -1123 -52 1004 -216 -1023 302 968 -320 -802 491 822 -511
1683 -511 -634 752 500 -866 -309 925 89 -991 -38 928 -53 -937 113 989 -115 -870 347 879
1701 879 -404 -718 525 615 -597 -580 615 519 -726 -564 773 500 -874 -400 908 292 -836 -127
1719 -127 811 30 -746 87 743 -264 -789 386 720 -601 -677 679 525 -734 -397 719 267 -703
1737 -703 -149 727 39 -750 148 788 -302 -758 429 682 -510 -667 488 585 -509 -575 524 525 -584
1756 -584 -437 666 320 -680 -161 744 131 -709 -35 772 25 -807 34 807 -148 -782 264 678 -350
1775 -350 -524 469 442 -516 -318 617 271 -682 -172 759 56 -790 56 710 -176 -640 247 539 -318 -469
1795 -469 401 444 -509 -414 584 329 -686 -293 655 198 -657 -173 605 138 -587 -70 616 11 -583 172
1815 172 637 -229 -549 366 533 -383 -500 399 461 -460 -437 497 330 -533 -162 586 55 -528 139 563 -169
1836 -169 -492 289 545 -329 -507 379 423 -499 -393 460 207 -515 -135 508 74 -480 41 594 -13 -551
1856 -551 123 602 -186 -585 197 478 -277 -478 233 378 -307 -337 379 316 -418 -204 549 177 -541 -65 534
1877 534 -10 -553 -14 466 -119 -487 155 431 -277 -356 399 309 -443 -179 517 175 -488 -118 522 82 -516
1898 -516 -33 500 -59 -472 173 449 -224 -349 321 362 -315 -311 380 342 -404 -305 441 257 -456 -178 425 78
1920 78 -427 -23 386 -63 -420 122 443 -190 -443 273 417 -332 -371 344 265 -369 -229 354 130 -401 -92
1941 -92 417 1 -453 101 498 -143 -431 241 448 -203 -373 244 343 -280 -323 301 220 -382 -165 403 88
1962 88 -430 -1 465 29 -412 55 475 -45 -435 95 384 -205 -382 201 248 -317 -248 324 189 -353 -135
1983 -135 440 174 -410 -66 455 34 -427 37 361 -129 -366 132 293 -227 -318 272 292 -316 -225 416 246
2004 246 -376 -145 382 105 -370 -84 336 -15 -385 57 358 -143 -355 225 366 -231 -283 309 313 -266 -253
2025 -253 306 220 -332 -181 328 71 -379 -5 371 -45 -355 127 397 -100 -344 167 372 -186 -330 224
2045 224 275 -276 -219 282 133 -327 -102 341 62 -350 -23 389 -11 -410 53 375 -117 -365 135 290 -187
2066 -187 -253 239 232 -241 -170 328 162 -359 -115 381 78 -367 -25 359 0 -332 31 334 -80 -296 149
2087 149 293 -207 -262 257 228 -281 -216 299 187 -292 -131 330 145 -297 -36 340 8 -321 59 281 -159
2108 -159 -315 132 259 -196 -289 212 269 -222 -190 303 198 -246 -78 296 51 -292 -26 271 -70 -348 36
2129 36 299 -118 -308 154 305 -135 -216 222 231 -188 -162 211 115 -268 -131 263 24 -321 -17 315 7 -273
2151 -273 79 333 -7 -221 137 269 -114 -217 150 156 -244 -164 226 110 -256 -72 287 105 -230 -13 301
2172 301 49 -224 42 236 -93 -231 92 162 -188 -201 165 158 -197 -142 235 158 -207 -82 241 66 -234 -25
2194 -25 198 -50 -229 40 211 -98 -216 127 228 -130 -176 186 188 -149 -124 170 109 -184 -101 171 33 -215
2216 -215 -13 215 -5 -199 62 240 -38 -186 78 194 -77 -174 98 140 -131 -120 153 82 -170 -32 202
2237 202 42 -167 12 214 17 -191 36 177 -59 -168 68 118 -103 -114 122 92 -123 -70 159 88 -161 -67
2259 -67 167 48 -176 -58 140 -7 -164 -14 108 -27 -124 40 124 -67 -126 90 128 -99 -119 101 91 -108
2281 -108 -78 97 73 -93 -13 130 15 -91 40 125 -49 -99 71 105 -81 -91 79 83 -87 -57 99 48 -60 -2
2305 -2 114 12 -69 27 90 -23 -103 0 79 -21 -107 -6 88 -6 -78 18 79 -5 -57 27 63 -29 -39 65 53 -65 -48
2332 -48 78 30 -68 -27 49 14 -41 1 31 -17 -35 35 25 -64 -9 66 -1 -74 7 70 -13 -50 16 28 -9 -33 14 21 -21 -22 26
2363 26 33 -21 -23 35 56 3 -32 21 72 2 -59 -9 58 -4 -58 5 52 -14 -20 50 31 -23 6 60 5 -53 -3 35 -17 -41 -6 -17
2395 -17 -34 2 8 -33 -36 26 48 -26 -29 55 52 -13 -34 12 14 -22 -34 -20 5 3 -24 11 38 -3 -18 24 71 10 -45 33 85 -33 -102
2428 -102 25 70 -53 -69 24 48 -40 -12 55 31 -29 15 51 1 -34 10 28 -22 -31 4 -16 -24 4 12 -22 -6 32 26 7 0 41
2459 41 35 0 -32 10 44 0 -55 -17 49 -7 -66 1 61 -10 -72 46 84 -44 -65 79 68 -81 -60 78 53 -90 -63 50
2487 50 21 -85 -22 54 -7 -44 20 42 -16 -23 32 39 -22 -29 26 9 -28 -19 0 -3 -16 -7 17 -7 -15 11 42 -5 -43 18 67 -17 -76
2520 -76 10 70 -26 -84 38 67 -50 -59 63 53 -74 -35 101 43 -85 -13 94 19 -90 -2 76 -6 -63 -1 49 -13 -22
2547 -22 21 23 -26 -4 35 12 -31 -20 26 19 -30 -17 31 1 -27 -11 15 -6 -29 17 46 -14 -42 28 56 -41 -58 64 62 -71 -65
2578 -65 70 39 -82 -47 71 13 -89 -3 80 -11 -81 30 80 1 -57 37 51 -20 -55 12 29 -40 -47 14 -8 -39 -17 27
2606 27 4 -19 16 58 22 -19 16 60 14 -47 11 45 -42 -69 23 26 -59 -47 72 45 -54 -17 113 47 -76 -3 98 16 -87
2635 -87 -17 60 -34 -107 8 45 -49 -80 45 63 -31 -50 68 67 -51 -42 55 28 -65 -58 41 4 -82 -27 51 -6 -61 21 85 -9
2665 -9 -59 50 89 -23 -66 51 59 -71 -67 56 26 -92 -43 86 26 -89 9 125 12 -94 24 114 -17 -96 23
2690 23 75 -54 -93 39 58 -69 -59 80 63 -74 -46 104 55 -72 -21 105 19 -91 -22 82 -11 -110 11 75 -48
2715 -48 -97 73 98 -55 -78 100 90 -96 -64 98 46 -107 -45 95 18 -124 -7 106 -16 -107 34 119 -42 -110
2739 -110 66 117 -63 -86 88 98 -83 -85 94 60 -101 -47 126 33 -123 -16 135 -6 -128 25 134 -22 -121
2762 -121 54 126 -66 -115 84 83 -109 -95 104 52 -128 -61 136 46 -147 -26 158 24 -143 17 134 -28 -136
2785 -136 36 105 -80 -132 70 102 -107 -91 115 95 -118 -64 152 66 -136 -29 143 18 -169 4 141 -44
2807 -44 -167 58 152 -87 -147 104 142 -113 -102 135 109 -137 -84 146 52 -169 -39 156 7 -178 9 172 -17
2830 -17 -145 59 170 -52 -144 80 145 -92 -134 99 107 -127 -99 136 62 -173 -60 171 26 -170 6 195 -17
2853 -17 -192 38 163 -78 -163 90 136 -129 -137 140 118 -150 -91 189 74 -185 -54 189 36 -186 -16 194
2875 194 -16 -197 37 187 -58 -160 100 173 -101 -150 134 131 -140 -123 146 92 -169 -90 174 50 -182 -29
2897 -29 190 -2 -194 38 185 -67 -189 87 179 -125 -175 131 144 -165 -121 182 103 -195 -67 212 54 -215
2919 -215 -10 218 -15 -223 27 203 -69 -212 67 189 -95 -174 121 159 -138 -147 171 127 -184 -92 185 83
2941 83 -220 -58 201 19 -219 9 214 -40 -206 77 190 -102 -186 125 167 -168 -160 177 123 -213 -112 212
2963 212 70 -228 -41 226 3 -226 34 235 -56 -223 88 220 -114 -209 137 184 -161 -166 179 135 -193 -115
2985 -115 201 97 -218 -49 235 48 -221 7 235 -27 -228 60 232 -93 -217 124 189 -152 -174 178 150
3006 150 -203 -115 234 90 -236 -48 255 23 -258 12 245 -53 -248 81 233 -112 -228 139 198 -166 -164
3027 -164 192 155 -218 -117 234 97 -243 -63 260 33 -259 -6 253 -31 -247 67 238 -106 -219 143
3047 143 220 -163 -190 195 161 -226 -145 231 88 -254 -63 246 31 -265 8 260 -50 -262 98 264 -120
3068 -120 -234 163 218 -201 -195 211 157 -232 -139 247 111 -259 -63 287 30 -272 22 287 -39 -267 88 260
3090 260 -117 -245 147 235 -180 -205 204 163 -229 -132 264 111 -278 -68 291 40 -290 8 292 -54 -288
3111 -288 87 266 -121 -244 160 230 -193 -202 225 179 -245 -138 282 112 -282 -58 300 23 -301 11 284
3132 284 -65 -286 101 267 -132 -249 181 236 -196 -208 223 183 -250 -144 269 118 -298 -80 288 26 -309
3153 -309 12 293 -52 -295 102 288 -121 -249 164 250 -197 -212 230 187 -251 -145 282 97 -288 -57 305
3174 305 25 -313 24 304 -52 -293 110 284 -137 -272 165 236 -212 -224 225 170 -265 -148 282 109 -287
3195 -287 -51 318 42 -296 20 311 -54 -302 83 286 -134 -269 163 242 -202 -217 231 195 -250 -144 294
3216 294 121 -285 -65 307 30 -307 9 304 -63 -303 88 270 -138 -255 187 238 -214 -209 243 181 -266
3237 -266 -152 284 104 -309 -74 295 25 -317 18 301 -54 -303 98 288 -129 -270 162 262 -188 -215
3257 -215 226 189 -241 -150 271 123 -283 -78 297 44 -300 12 306 -42 -294 84 291 -116 -262 167 240
3278 240 -199 -232 228 187 -274 -155 275 111 -299 -75 306 42 -302 9 305 -42 -300 83 296 -114 -273
3299 -273 157 239 -189 -222 217 198 -241 -159 266 133 -269 -73 303 62 -291 -18 297 -26 -301 61 275
3320 275 -116 -270 149 261 -183 -221 215 210 -229 -162 263 134 -284 -89 290 50 -307 -25 291 -43 -302
3341 -302 67 288 -105 -268 142 262 -176 -236 193 217 -228 -182 245 129 -275 -112 280 60 -286 -24 292
3362 292 -3 -301 34 278 -90 -273 118 262 -161 -245 190 189 -225 -177 243 139 -248 -98 287 66 -293
3383 -293 -28 285 -9 -289 58 284 -89 -259 127 251 -156 -226 198 204 -208 -182 228 144 -265 -113 268 70
3405 70 -286 -37 286 -4 -276 36 284 -71 -261 121 260 -150 -234 186 212 -199 -185 244 153 -241 -111 281
3427 281 80 -280 -12 285 -4 -287 54 298 -89 -260 128 249 -144 -239 184 208 -221 -176 238 143 -258
3448 -258 -105 271 75 -297 -36 292 -7 -289 41 285 -79 -271 119 263 -150 -229 192 215 -201 -181 249
3469 249 158 -261 -103 279 82 -291 -31 294 2 -292 34 286 -77 -281 120 256 -170 -244 198 206 -223
3490 -223 -185 251 151 -264 -125 285 73 -296 -43 295 -2 -288 50 292 -81 -288 122 269 -158 -246 184
3511 184 229 -214 -188 247 160 -272 -111 288 85 -290 -43 304 0 -301 39 295 -81 -283 129 269 -154
3532 -154 -250 186 212 -217 -196 249 152 -273 -122 284 80 -300 -41 295 -1 -307 41 297 -79 -282 124
3553 124 278 -157 -243 193 230 -221 -195 260 152 -270 -109 283 84 -297 -33 309 -7 -309 42 297 -90
3574 -90 -286 130 267 -165 -252 198 216 -228 -189 250 149 -276 -117 292 83 -293 -27 311 -7 -308 49
3595 49 306 -96 -284 131 273 -162 -246 199 219 -227 -191 248 166 -281 -117 285 64 -304 -38 304 -12 -299
3617 -299 47 298 -85 -286 128 272 -167 -241 210 216 -229 -179 257 151 -282 -105 294 79 -306 -30 310
3638 310 -8 -299 65 298 -82 -285 132 273 -175 -239 191 220 -230 -190 255 151 -278 -108 287 66 -309
3659 -309 -32 311 -14 -324 38 295 -103 -295 126 273 -178 -239 204 227 -235 -193 268 141 -281 -112 294
3680 294 78 -315 -37 308 -9 -313 53 307 -100 -286 139 264 -167 -243 194 213 -236 -196 256 144 -289
3701 -289 -118 285 61 -317 -34 297 -14 -309 63 296 -102 -289 133 268 -171 -247 207 216 -232 -180 256
3722 256 145 -279 -103 303 68 -302 -23 309 -9 -308 56 298 -91 -282 136 260 -173 -252 199 203 -247
3743 -247 -183 263 156 -283 -113 282 64 -293 -40 305 -29 -309 61 290 -101 -282 135 258 -163 -230 208
3764 208 208 -222 -180 253 140 -272 -92 294 63 -295 -20 307 -22 -303 61 288 -118 -285 137 260 -179
3785 -179 -248 210 208 -235 -170 253 121 -283 -112 283 57 -307 -15 302 -34 -295 57 290 -95 -268 155
3806 155 254 -174 -230 219 198 -231 -165 255 127 -279 -103 288 47 -309 -11 312 -32 -294 71 286 -110
3827 -110 -256 157 245 -190 -225 213 190 -247 -159 263 126 -277 -89 283 44 -296 -4 301 -32 -291 82
3848 82 282 -119 -265 150 241 -174 -219 220 195 -242 -149 266 122 -283 -74 293 39 -295 -2 295 -38 -304
3870 -304 81 268 -111 -271 149 231 -189 -225 210 187 -247 -159 263 108 -286 -84 279 37 -297 4 300
3891 300 -38 -290 87 279 -123 -265 165 249 -191 -204 203 183 -243 -149 254 116 -281 -90 281 32 -305
3912 -305 -7 282 -52 -284 74 270 -137 -260 148 234 -184 -205 214 179 -242 -155 263 115 -272 -75 281
3933 281 23 -282 0 291 -60 -284 98 273 -128 -254 158 230 -185 -200 218 177 -247 -144 260 89 -278
3954 -278 -64 276 25 -287 6 283 -51 -287 85 263 -115 -246 157 236 -179 -200 220 172 -231 -130 250
3975 250 93 -269 -68 283 40 -278 15 280 -36 -275 84 270 -122 -237 158 216 -183 -201 215 164 -243
3996 -243 -154 252 95 -269 -69 270 34 -280 14 275 -47 -274 82 260 -118 -244 144 220 -181 -194 200
4017 200 173 -226 -140 251 114 -254 -71 268 34 -283 -5 280 -49 -275 79 257 -114 -253 136 220 -192
4038 -192 -200 202 166 -223 -150 239 105 -259 -81 266 32 -277 -2 269 -30 -274 72 262 -121 -248 141
4059 141 232 -174 -210 212 183 -219 -141 248 119 -263 -80 266 50 -279 -9 273 -34 -270 72 252 -104
4080 -104 -247 132 221 -166 -209 190 184 -219 -151 224 129 -258 -89 261 47 -280 -7 274 -20 -273 62 263
4102 263 -93 -247 142 230 -155 -210 195 180 -221 -147 240 122 -263 -86 261 50 -276 -4 278 -20 -267
4123 -267 55 266 -96 -248 117 208 -166 -219 177 173 -216 -157 230 116 -247 -87 262 46 -273 -17 276 -23
4145 -23 -260 58 263 -89 -261 132 229 -154 -208 193 189 -217 -153 237 125 -257 -93 261 45 -286 -29 269
4167 269 -34 -276 51 256 -101 -245 126 230 -160 -205 195 176 -219 -165 234 122 -251 -87 267 56 -269
4188 -269 -16 294 -16 -266 64 270 -97 -245 131 230 -165 -206 196 184 -217 -154 235 115 -265 -77 263
4209 263 50 -274 -15 270 -34 -274 62 260 -117 -259 126 235 -171 -209 196 191 -212 -153 243 126 -254
4230 -254 -79 276 49 -274 -2 283 -27 -281 71 271 -99 -253 128 230 -172 -220 186 177 -225 -159 243
4251 243 118 -259 -95 276 53 -284 -8 275 -29 -285 72 268 -100 -250 147 242 -176 -216 218 181 -210
4272 -210 -146 255 116 -260 -76 277 45 -282 -9 278 -27 -271 72 258 -106 -256 154 227 -175 -215 204
4293 204 170 -230 -152 242 110 -266 -81 275 32 -278 5 287 -45 -281 81 274 -111 -247 149 227 -172
4314 -172 -212 216 185 -225 -132 261 111 -266 -65 281 39 -285 10 285 -48 -281 73 257 -118 -258 154
4335 154 223 -192 -206 215 175 -238 -138 259 106 -272 -68 281 43 -286 5 279 -46 -280 90 265 -124
4356 -124 -253 167 229 -188 -201 213 178 -245 -145 269 99 -274 -71 268 16 -288 10 285 -49 -282 82
4377 82 258 -127 -259 154 232 -194 -208 216 170 -238 -137 272 111 -267 -74 279 37 -293 16 287 -50
4398 -50 -276 79 262 -124 -244 162 229 -193 -198 225 167 -250 -133 268 98 -279 -68 285 19 -293 5 276
4420 276 -65 -291 86 269 -137 -259 157 222 -204 -204 219 173 -254 -148 257 104 -289 -61 297 29 -288
4441 -288 18 304 -55 -278 113 272 -130 -250 169 239 -195 -207 235 183 -242 -126 277 114 -293 -63 293
4462 293 29 -302 21 280 -49 -281 93 269 -135 -253 164 234 -196 -205 226 178 -249 -141 268 116 -290
4483 -290 -65 299 37 -285 13 290 -41 -278 96 275 -124 -260 159 234 -197 -214 212 186 -248 -148 270
4504 270 100 -274 -72 284 23 -293 13 289 -48 -292 92 265 -120 -254 169 250 -183 -208 213 179 -232
4525 -232 -140 265 117 -275 -71 291 34 -279 15 290 -38 -269 90 281 -112 -255 162 231 -196 -207 220
4546 220 180 -237 -159 248 98 -278 -80 282 32 -294 4 280 -47 -278 84 265 -124 -256 155 231 -187
4567 -187 -204 221 184 -232 -140 257 103 -257 -65 279 26 -278 6 275 -43 -283 81 258 -122 -249 148
4588 148 227 -176 -207 213 166 -232 -145 238 94 -267 -58 271 31 -279 -2 273 -45 -272 80 258 -112
4609 -112 -239 146 222 -175 -191 200 174 -222 -134 245 109 -263 -65 266 28 -272 5 272 -41 -267 78
4630 78 254 -101 -231 137 209 -175 -191 204 161 -235 -152 230 107 -250 -64 260 32 -270 0 265 -34 -243
4652 -243 87 250 -99 -222 139 214 -168 -177 192 167 -201 -129 230 108 -241 -62 258 36 -254 8 257 -44
4674 -44 -244 72 228 -102 -229 132 199 -165 -184 190 157 -206 -122 225 112 -229 -55 253 31 -254 10 262
4696 262 -29 -239 76 240 -100 -212 134 209 -157 -179 175 159 -187 -122 222 90 -230 -74 229 21 -241
4717 -241 -6 230 -37 -244 60 217 -103 -221 120 195 -156 -168 175 155 -195 -125 219 87 -231 -74 236
4738 236 26 -233 -1 242 -32 -227 78 220 -94 -205 134 186 -141 -171 169 149 -200 -123 203 75 -229
4759 -229 -67 219 20 -234 -8 233 -34 -228 65 218 -88 -213 124 181 -140 -161 177 147 -179 -106 210
4780 210 99 -210 -53 235 43 -232 12 234 -38 -224 66 218 -95 -204 122 181 -155 -171 169 150 -190
4801 -190 -128 216 90 -227 -76 218 27 -236 -7 220 -42 -233 74 212 -95 -205 120 193 -146 -165 175
4822 175 150 -186 -113 204 93 -211 -58 224 32 -227 3 239 -38 -224 61 217 -95 -206 112 183 -157
4843 -157 -175 154 135 -196 -132 197 78 -222 -68 222 34 -240 -7 237 -30 -222 70 213 -89 -201 127
4864 127 193 -148 -169 175 159 -179 -116 206 98 -208 -48 229 34 -231 6 229 -46 -230 67 210 -107
4885 -107 -204 122 171 -149 -166 164 135 -198 -111 202 84 -216 -57 227 27 -234 15 241 -40 -234 77 214
4907 214 -96 -194 119 184 -150 -166 188 146 -192 -107 213 83 -220 -60 223 15 -238 14 224 -49 -226 80
4929 80 217 -93 -191 134 182 -147 -159 176 132 -204 -111 206 77 -218 -55 236 26 -220 16 222 -38 -219
4951 -219 80 215 -91 -196 122 174 -163 -156 176 129 -199 -109 212 85 -223 -56 219 21 -220 11 218 -52
4973 -52 -231 73 214 -111 -194 131 173 -154 -158 174 131 -192 -98 220 85 -216 -38 238 24 -223 26 226
4995 226 -46 -204 84 217 -101 -183 132 178 -154 -148 181 122 -198 -104 213 68 -221 -52 227 5 -241 12
5017 12 220 -61 -217 83 196 -106 -191 138 174 -159 -149 166 125 -186 -83 209 65 -212 -39 224 2 -219
5039 -219 29 226 -54 -194 90 194 -107 -182 131 156 -155 -139 172 118 -189 -102 204 60 -212 -34 216 8
5061 8 -215 28 210 -48 -202 78 197 -114 -171 143 158 -155 -132 179 127 -187 -72 209 60 -202 -28 223
5083 223 7 -204 34 217 -59 -192 92 187 -112 -170 136 144 -144 -125 169 107 -197 -92 192 45 -196 -25
5105 -25 190 1 -212 27 200 -59 -188 88 176 -110 -148 141 145 -140 -120 177 106 -175 -67 193 49 -189
5127 -189 -19 208 -5 -198 37 191 -60 -189 87 179 -111 -154 133 135 -160 -127 160 88 -188 -72 191 38
5149 38 -192 -16 194 -9 -193 33 193 -61 -174 93 165 -114 -146 132 131 -149 -108 161 93 -177 -59 185
5171 185 32 -191 -8 196 -9 -175 47 180 -66 -172 84 143 -122 -146 113 114 -159 -111 151 72 -171 -65
5193 -65 187 33 -189 -2 186 -18 -185 37 180 -70 -167 95 160 -118 -136 135 128 -141 -94 161 78 -168 -38
5216 -38 180 27 -186 -3 176 -23 -186 47 169 -83 -168 84 139 -119 -132 129 104 -162 -100 153 64 -177
5238 -177 -51 178 20 -184 -2 183 -32 -167 57 175 -67 -152 95 148 -113 -131 136 110 -150 -86 163 64
5260 64 -175 -40 172 21 -184 1 174 -32 -176 53 163 -79 -159 85 133 -123 -118 125 107 -142 -85 164
5282 164 59 -171 -35 177 10 -175 5 183 -32 -159 62 169 -68 -140 100 140 -114 -124 130 90 -151
5303 -151 -79 168 47 -172 -35 175 7 -174 14 173 -48 -168 54 151 -89 -155 105 122 -126 -119 134 94
5325 94 -145 -86 165 46 -170 -34 168 15 -165 22 166 -48 -159 60 156 -80 -140 108 137 -127 -104 130
5347 130 91 -150 -72 165 47 -166 -38 167 -2 -179 19 156 -45 -163 66 154 -92 -145 102 119 -124 -108
5369 -108 141 101 -148 -59 170 56 -160 -11 170 -7 -164 18 160 -37 -163 61 145 -91 -134 109 112 -122
5391 -122 -103 129 76 -150 -73 149 39 -175 -37 162 -8 -159 17 156 -53 -141 70 151 -88 -130 111 125
5413 125 -123 -105 146 69 -143 -73 153 47 -155 -7 168 1 -153 24 163 -38 -155 68 143 -93 -130 101
5435 101 113 -114 -111 127 70 -147 -55 155 34 -170 -19 156 0 -158 34 160 -46 -146 65 140 -87 -126
5457 -126 100 116 -122 -100 136 87 -135 -45 168 49 -149 -14 153 2 -152 29 152 -40 -151 63 129 -101
5479 -101 -133 93 110 -126 -92 120 65 -145 -65 150 39 -155 -10 154 -9 -149 39 158 -46 -137 78 140
5501 140 -80 -118 109 112 -120 -86 132 78 -136 -41 157 31 -162 -9 152 -20 -144 32 143 -47 -142 73
5523 73 122 -88 -123 97 95 -130 -89 123 56 -137 -52 140 36 -148 -4 159 -7 -136 43 146 -39 -129 77
5546 77 142 -81 -108 115 108 -125 -79 128 73 -149 -43 146 24 -156 -4 154 -10 -150 25 145 -61 -144 71
5569 71 121 -101 -125 100 88 -122 -87 132 59 -135 -37 160 18 -154 5 158 -12 -143 29 139 -58 -134 101
5592 101 129 -90 -99 119 103 -116 -81 137 51 -145 -35 148 16 -162 3 139 -17 -167 38 145 -63 -140
5614 -140 79 135 -105 -108 120 99 -129 -66 138 70 -136 -34 142 16 -149 10 153 -26 -140 52 144 -69
5636 -69 -132 86 122 -104 -103 117 92 -135 -73 135 46 -154 -35 154 8 -149 6 142 -36 -151 36 142 -81
5659 -81 -136 86 113 -117 -109 117 70 -139 -65 145 42 -150 -22 154 11 -144 16 157 -42 -146 54 141 -70
5682 -70 -138 106 107 -113 -99 118 68 -147 -74 141 39 -152 -36 141 2 -167 23 144 -52 -161 68 137 -84
5705 -84 -133 113 113 -119 -107 138 68 -134 -66 152 42 -169 -11 149 -5 -148 34 144 -45 -140 74 145 -94
5728 -94 -128 101 103 -126 -106 124 68 -166 -67 152 25 -170 -11 162 -20 -160 30 150 -57 -145 69 133 -100
5751 -100 -112 117 106 -128 -100 150 76 -153 -46 158 36 -169 -8 163 -12 -162 38 151 -62 -155 78 131
5773 131 -107 -130 117 92 -145 -101 145 59 -162 -51 164 16 -157 -1 167 -32 -177 38 157 -66 -158 83
5795 83 131 -107 -118 131 108 -140 -76 152 71 -154 -35 165 11 -165 12 165 -36 -154 56 151 -82 -154 97
5818 97 133 -116 -117 127 89 -150 -88 148 56 -173 -46 165 5 -174 24 168 -36 -157 56 169 -66 -132 96
5841 96 134 -106 -105 138 101 -145 -80 151 58 -156 -34 165 16 -174 14 164 -39 -163 55 144 -97 -146 91
5864 91 117 -122 -119 125 91 -153 -77 149 50 -166 -43 166 0 -170 22 172 -32 -159 71 161 -80 -135 107
5887 107 135 -123 -109 137 91 -142 -70 154 44 -171 -23 152 5 -169 12 153 -47 -168 55 143 -91 -151
5909 -151 105 122 -125 -116 130 89 -160 -79 155 47 -166 -31 162 4 -157 25 171 -49 -153 76 147 -81
5931 -81 -134 115 123 -121 -110 138 84 -150 -71 160 45 -169 -25 173 -12 -179 28 156 -52 -172 62 133 -92
5954 -92 -143 100 107 -136 -116 137 86 -158 -63 164 42 -160 -16 162 1 -161 38 178 -37 -153 79 152 -94
5977 -94 -142 110 128 -129 -102 146 86 -153 -72 156 37 -175 -26 157 -16 -174 9 158 -66 -164 68 141 -87
6000 -87 -141 110 120 -135 -103 134 85 -152 -58 158 41 -167 -10 177 -1 -177 36 176 -47 -154 88 150
6022 150 -101 -146 110 115 -127 -107 146 76 -161 -63 162 29 -176 -16 176 -8 -181 24 162 -50 -155 76
6044 76 150 -86 -135 115 131 -128 -96 144 88 -147 -50 155 38 -157 -14 168 -12 -160 40 176 -56 -164
6066 -164 75 149 -101 -140 117 111 -144 -111 134 81 -170 -60 172 26 -182 -21 175 -18 -177 40 160 -56
6088 -56 -157 85 143 -98 -136 112 115 -126 -98 154 83 -164 -49 182 33 -178 -4 170 -17 -182 34 159
6110 159 -64 -165 75 148 -97 -140 125 120 -156 -104 157 80 -170 -52 169 28 -174 -8 177 -11 -172 38
6132 38 167 -60 -158 93 160 -103 -140 124 114 -134 -92 155 88 -165 -55 164 31 -187 -18 168 -14 -186
6154 -186 33 163 -73 -175 74 150 -123 -150 121 110 -150 -102 148 70 -175 -63 166 26 -186 -14 179 -23
6176 -23 -180 40 169 -62 -157 92 157 -109 -133 123 117 -140 -98 155 88 -165 -48 172 27 -175 -19 183 -14
6199 -14 -184 34 165 -90 -171 79 147 -111 -134 121 112 -150 -111 153 69 -174 -53 167 27 -187 -15 183 -5
6222 -5 -177 53 187 -61 -164 90 162 -99 -140 129 128 -153 -111 158 84 -177 -66 177 27 -198 -21 174 -20
6245 -20 -186 30 172 -67 -192 89 156 -113 -145 122 125 -146 -108 157 71 -177 -60 188 39 -186 2 189
6267 189 -17 -178 49 193 -62 -169 88 162 -111 -144 128 118 -150 -113 159 78 -194 -63 187 31 -196 -14
6289 -14 181 -29 -189 41 186 -74 -176 91 167 -112 -152 134 133 -143 -110 166 81 -174 -59 199 41 -187
6311 -187 -11 191 -11 -189 51 186 -67 -162 95 161 -114 -158 134 122 -164 -115 162 71 -193 -75 180 23
6333 23 -206 -16 183 -23 -191 36 182 -71 -177 92 171 -116 -145 131 131 -168 -106 182 90 -182 -60 188
6355 188 29 -193 1 203 -10 -200 42 196 -74 -189 85 164 -120 -158 137 128 -164 -117 161 85 -196 -68
6377 -68 193 33 -202 -8 192 -26 -205 46 202 -76 -186 96 151 -112 -148 148 134 -163 -120 184 95 -191
6399 -191 -64 193 34 -203 -17 192 -25 -199 38 189 -78 -193 94 163 -131 -172 130 135 -165 -127 171 84
6421 84 -202 -68 198 39 -205 -18 202 -22 -203 48 197 -78 -181 97 180 -121 -143 149 139 -158 -124 172
6443 172 89 -197 -68 199 21 -224 -9 203 -26 -207 40 187 -77 -198 100 179 -130 -168 139 129 -171
6464 -171 -114 175 76 -194 -64 208 33 -200 -6 212 -26 -202 43 209 -75 -180 107 173 -127 -146 160
6485 160 132 -172 -121 177 83 -195 -59 207 30 -214 -20 204 -33 -219 41 194 -96 -189 90 159 -128 -170
6507 -170 144 134 -167 -107 178 83 -197 -59 201 27 -226 -4 209 -13 -206 58 191 -79 -188 114 180
6528 180 -129 -155 147 130 -166 -118 175 82 -214 -78 201 22 -221 -17 186 -25 -222 46 199 -78 -189
6549 -189 108 174 -133 -167 143 133 -172 -110 179 90 -204 -55 204 35 -199 -9 208 -21 -204 58 204 -79
6571 -79 -195 104 174 -141 -162 140 133 -180 -118 173 88 -203 -80 190 18 -221 -17 203 -46 -217 50 197
6593 197 -98 -201 100 166 -139 -167 154 134 -171 -114 185 87 -194 -55 218 38 -218 -11 213 -26 -217 48
6615 48 201 -69 -194 94 176 -129 -161 141 133 -170 -118 173 89 -198 -76 198 27 -225 -10 193 -30 -215
6637 -215 46 192 -83 -187 111 173 -132 -147 145 128 -169 -106 184 96 -191 -65 203 37 -204 -3 205 -23
6659 -23 -207 48 196 -70 -203 101 176 -126 -161 148 123 -170 -114 171 87 -190 -77 202 34 -210 -8 208
6681 208 -24 -209 33 188 -74 -196 98 179 -121 -153 150 140 -158 -108 184 88 -191 -60 203 37 -197 -8
6703 -8 210 -19 -194 43 194 -81 -191 95 171 -117 -158 135 127 -168 -132 166 89 -191 -75 197 32 -204 -19
6726 -19 205 -12 -201 36 200 -64 -179 100 186 -116 -148 150 142 -160 -125 181 85 -183 -65 190 39 -209
6748 -209 -18 195 -16 -204 43 201 -69 -195 88 172 -117 -163 143 134 -169 -135 168 95 -185 -69 191 45
6770 45 -200 0 206 -8 -197 48 190 -64 -180 93 173 -119 -150 144 138 -155 -122 171 92 -191 -74 188
6792 188 39 -211 -19 198 -17 -218 27 184 -70 -202 78 167 -123 -160 127 137 -161 -129 160 94 -183 -80
6814 -80 195 49 -193 -24 211 -7 -193 42 199 -62 -182 92 173 -110 -171 133 137 -151 -130 169 92 -182
6836 -182 -86 188 43 -218 -33 197 -11 -208 20 192 -57 -194 93 168 -117 -152 131 147 -155 -126 177 98
6858 98 -182 -71 196 48 -189 -29 200 -9 -200 34 204 -52 -181 82 179 -108 -169 129 138 -154 -129 161
6880 161 98 -196 -81 186 48 -203 -29 196 -2 -213 31 209 -45 -192 90 189 -111 -164 127 145 -140
6901 -140 -123 181 108 -176 -74 186 62 -193 -17 206 -5 -198 28 199 -55 -200 80 169 -107 -169 119
6922 119 144 -159 -138 152 88 -184 -88 182 54 -215 -35 193 4 -207 17 200 -62 -186 78 183 -100
6943 -100 -170 133 148 -149 -133 161 110 -165 -88 191 51 -187 -29 209 -2 -217 19 196 -56 -198 82 176
6965 176 -112 -180 116 148 -155 -134 156 94 -186 -85 180 56 -202 -38 208 10 -197 26 197 -61 -189
6986 -189 76 183 -95 -171 129 149 -151 -139 158 114 -184 -95 190 54 -200 -21 204 -1 -199 15 181 -63
7008 -63 -210 67 172 -114 -165 111 146 -150 -141 158 103 -179 -93 194 66 -202 -46 198 9 -204 22 217
7030 217 -56 -199 72 192 -97 -166 121 159 -132 -130 158 118 -191 -102 181 54 -214 -43 203 -1 -210 1
7052 1 186 -52 -194 66 182 -107 -187 117 146 -146 -135 152 103 -179 -95 179 66 -189 -44 212 6 -204
7074 -204 14 202 -47 -195 81 195 -89 -166 128 151 -129 -129 161 106 -182 -100 177 53 -198 -37 205 6
7096 6 -208 16 194 -55 -200 76 182 -96 -176 112 152 -144 -139 156 106 -174 -101 189 59 -196 -27 203 8
7119 8 -209 13 195 -38 -193 71 185 -89 -175 109 144 -136 -141 151 115 -179 -86 188 57 -194 -52 193 1
7142 1 -208 13 190 -55 -192 63 185 -92 -169 118 154 -138 -139 163 118 -161 -84 182 64 -188 -27 202 10
7165 10 -200 15 193 -43 -196 68 181 -101 -178 108 140 -148 -136 151 117 -181 -89 169 63 -191 -34 192
7187 192 15 -206 25 188 -48 -180 71 176 -87 -164 116 160 -140 -127 160 113 -171 -86 198 67 -180 -32
7209 -32 201 9 -193 12 182 -53 -188 62 176 -95 -179 120 152 -149 -132 150 101 -174 -98 166 53 -197
7231 -197 -34 192 4 -194 18 195 -42 -187 68 171 -86 -165 118 163 -135 -123 149 117 -168 -85 184 57
7253 57 -190 -32 183 0 -203 13 181 -51 -193 64 171 -107 -156 118 138 -144 -135 146 95 -178 -89 171
7275 171 64 -185 -33 188 6 -192 23 185 -43 -174 75 183 -90 -164 115 141 -129 -121 161 106 -166 -91
7297 -91 169 52 -186 -47 186 -3 -193 18 183 -51 -180 61 164 -93 -159 98 134 -129 -133 138 96 -163
7319 -163 -85 180 63 -174 -25 198 14 -178 15 195 -42 -179 60 176 -84 -150 110 137 -130 -132 153 95
7341 95 -168 -92 171 54 -184 -45 184 15 -188 17 168 -47 -179 53 164 -93 -155 107 148 -127 -119 149
7363 149 99 -166 -84 170 63 -171 -40 181 21 -181 8 178 -34 -177 56 173 -84 -161 107 140 -134
7384 -134 -135 137 108 -154 -89 164 65 -176 -41 175 15 -193 8 186 -36 -180 52 158 -79 -155 93 142
7406 142 -121 -133 139 117 -151 -93 173 60 -165 -40 187 26 -171 1 183 -29 -176 63 166 -73 -161
7427 -161 97 139 -123 -132 128 105 -150 -100 155 69 -178 -58 160 14 -183 -3 177 -27 -177 48 159 -69
7449 -69 -154 88 144 -110 -133 131 111 -150 -90 163 77 -162 -49 179 31 -173 1 172 -29 -169 34 171
7471 171 -75 -160 84 138 -115 -139 109 110 -144 -107 151 64 -171 -64 156 32 -171 -4 178 -19 -165 47
7493 47 162 -60 -164 88 142 -89 -126 125 123 -140 -99 157 78 -156 -51 170 36 -171 -14 174 -20 -176
7515 -176 33 159 -63 -173 78 142 -113 -138 111 117 -143 -97 151 72 -169 -52 169 34 -177 -12 179 -20
7537 -20 -168 38 158 -47 -150 74 151 -94 -135 117 126 -142 -94 141 78 -159 -55 158 20 -178 -26 167
7559 167 -21 -174 29 157 -68 -159 65 139 -110 -146 118 108 -122 -101 146 78 -154 -60 165 51 -167 -14
7581 -14 169 -8 -165 28 164 -37 -150 76 144 -96 -131 118 118 -133 -107 140 75 -158 -74 150 34 -173 -35
7604 -35 164 -6 -178 26 158 -55 -162 65 142 -96 -142 105 123 -133 -94 149 83 -150 -67 181 44 -160
7626 -160 -6 172 -7 -161 34 170 -40 -161 68 141 -100 -131 116 122 -130 -103 133 69 -166 -67 155 35
7648 35 -176 -26 155 -11 -169 12 160 -58 -161 68 139 -96 -127 117 125 -118 -105 147 95 -153 -59 162 45
7671 45 -146 -19 166 8 -160 29 159 -56 -154 66 136 -93 -139 104 105 -132 -99 126 85 -157 -67 153 37
7694 37 -166 -19 159 -4 -166 19 159 -49 -159 72 143 -94 -136 109 120 -128 -103 137 79 -141 -56 159
7716 159 43 -169 -10 164 -2 -167 23 159 -50 -160 66 135 -97 -133 100 113 -134 -112 123 71 -159 -71
7738 -71 148 36 -170 -28 164 -12 -161 29 160 -52 -154 74 147 -91 -133 109 116 -116 -98 141 93 -142
7760 -142 -57 167 36 -160 -14 155 4 -169 25 159 -45 -152 58 137 -96 -152 93 112 -115 -102 135 84
7782 84 -157 -68 149 33 -156 -24 168 8 -162 24 157 -44 -150 67 143 -76 -123 103 114 -111 -91 133
7804 133 81 -150 -62 153 42 -168 -26 156 -13 -165 18 156 -49 -160 48 139 -100 -136 95 108 -130 -113
7826 -113 124 83 -151 -53 147 32 -165 -14 167 3 -157 22 172 -41 -147 69 140 -80 -129 109 115 -114
7848 -114 -95 130 82 -148 -67 148 36 -166 -40 146 0 -170 12 154 -45 -162 51 128 -86 -129 91 106
7870 106 -117 -107 118 88 -138 -59 149 40 -149 -28 160 4 -165 25 158 -37 -156 63 138 -78 -118 92
7892 92 102 -101 -98 127 81 -152 -74 135 37 -148 -32 142 1 -167 11 151 -37 -152 57 139 -82 -126 98
7915 98 112 -112 -97 119 84 -129 -66 142 50 -143 -16 155 5 -152 30 146 -33 -143 53 129 -73 -121 89
7938 89 107 -107 -95 114 72 -124 -74 125 42 -159 -25 132 6 -153 11 137 -40 -133 49 128 -68 -113 90
7961 90 102 -90 -81 120 82 -123 -59 130 41 -132 -21 136 11 -143 11 144 -32 -136 48 121 -70 -119 74
7984 74 97 -107 -102 107 87 -123 -77 126 32 -142 -29 127 -1 -149 8 139 -36 -134 42 111 -62 -125 87
8007 87 114 -97 -83 108 70 -112 -52 134 43 -131 -18 128 -3 -132 9 127 -39 -136 40 119 -57 -117 66
8030 66 95 -98 -96 95 70 -123 -79 116 43 -116 -28 135 10 -128 7 140 -19 -120 45 122 -54 -103 78
8053 78 103 -87 -98 103 80 -119 -54 119 50 -119 -35 127 10 -134 -6 129 -40 -131 45 114 -68 -124 65
8076 65 96 -99 -94 97 78 -123 -63 119 47 -126 -40 128 20 -122 7 130 -26 -115 38 123 -47 -106 77 112
8100 112 -76 -88 88 78 -112 -66 113 45 -131 -38 110 -7 -121 -11 124 -30 -135 27 103 -68 -119 58
8122 58 101 -84 -94 94 78 -106 -63 111 53 -110 -41 115 12 -123 -3 129 -14 -117 29 114 -51 -115 63
8145 63 96 -84 -85 87 70 -105 -69 96 38 -120 -44 108 9 -126 -4 115 -27 -124 22 104 -50 -109 60 101
8169 101 -73 -90 84 85 -96 -66 105 50 -115 -38 122 13 -124 -14 125 -4 -110 31 117 -44 -112 53
8191E3
##END NTUPLES=NMR FID
##END=
