##TITLE=1H_AM_NV134
 CDCl3
 8sc, 
 16.2.2024
##JCAMPDX= 6.0         $$ Bruker NMR JCAMP-DX V2.0
##DATA TYPE= NMR FID
##DATA CLASS= NTUPLES
##ORIGIN= UXNMR, Bruker Analytische Messtechnik GmbH
##OWNER= root
$$ XWIN-NMR		Version 3.5
$$ Fri Feb 16 15:54:21 2024 Russian Standard Time (UT+4h)  she@DPX200
##.OBSERVE FREQUENCY= 200.1313
##.OBSERVE NUCLEUS= ^1H
##.DELAY= (6, 6)
##.ACQUISITION MODE= SIMULTANEOUS
##.ACQUISITION SCHEME= undefined
##.AVERAGES= 8
##.DIGITISER RES= 18
##SPECTROMETER/DATA SYSTEM= spect
##.PULSE SEQUENCE= zg30
##.SOLVENT NAME= DMSO
##.SHIFT REFERENCE= (INTERNAL, DMSO, 0, 15.7039)
##AUDIT TRAIL= $$ (NUMBER, WHEN, WHO, WHERE, WHAT)
$$ ##TITLE= Audit trail, XWIN-NMR		Version 3.5
$$ ##JCAMPDX= 5.01
$$ ##ORIGIN= Bruker BioSpin GmbH
$$ ##OWNER= she
$$ F:/spectra/data/she/nmr/H-F/1/audita.txt
$$ ##AUDIT TRAIL=  $$ (NUMBER, WHEN, WHO, WHERE, WHAT)
(   1,<2024-02-16 15:53:22.15 +0400>,<she>,<DPX200>,
      <created by zg, POWCHK disabled, PULCHK disabled
       configuration hash MD5:
       00 E9 B6 7A A2 85 ED C7 34 08 36 98 17 FE 4E 26
       data hash MD5: 16K
       7B 4B 58 ED 49 2E 8B A1 9F 75 13 FF 86 9B C5 67>)
$$ ##END=
$$ 
$$ hash MD5
$$ 47 D6 BB 60 B8 32 85 EC F2 12 F7 4E 7F 3F CB 04
##$RELAX= 
##$RELAX= 
##$RELAX= 
##$RELAX= 
##$RELAX= 
##$RELAX= 
$$ Bruker specific parameters
$$ --------------------------
##$DU= <F:/spectra>
##$EXPNO= 1
##$NAME= <H-F>
##$PROCNO= 1
##$TYPE= <nmr>
##$USER= <she>
##$AMP= (0..31)
100 100 100 100 100 100 100 100 100 100 100 100 100 100 100 100 100 100 
100 100 100 100 100 100 100 100 100 100 100 100 100 100 
##$AQSEQ= 0
##$AQ_mod= 1
##$AUNM= <au_zg>
##$AUTOPOS= <>
##$BF1= 200.13
##$BF2= 200.13
##$BF3= 200.13
##$BF4= 200.13
##$BF5= 200.13
##$BF6= 200.13
##$BF7= 200.13
##$BF8= 200.13
##$BYTORDA= 1
##$CFDGTYP= 0
##$CFRGTYP= 5
##$CHEMSTR= <none>
##$CNST= (0..31)
1 1 145 1 1 1 1 1 1 1 1 1 1 1 1 1 1 1 1 1 1 1 1 1 1 1 1 1 1 1 1 1 
##$CPDPRG= <>
##$CPDPRG1= <>
##$CPDPRG2= <>
##$CPDPRG3= <>
##$CPDPRG4= <mlev>
##$CPDPRG5= <mlev>
##$CPDPRG6= <mlev>
##$CPDPRG7= <mlev>
##$CPDPRG8= <mlev>
##$CPDPRGB= <>
##$CPDPRGT= <>
##$D= (0..31)
0 1.2 0 0 0 0 0 0 0 0.06 0 0.03 0 0 0 0 0.0002 0 0 0 0 0 0 0 0 0 0 0 0 
0 0 0 
##$DATE= 1708084401
##$DBL= (0..7)
120 120 120 120 120 120 120 120 
##$DBP= (0..7)
150 150 150 150 150 150 150 150 
##$DBP07= 0
##$DBPNAM0= <>
##$DBPNAM1= <>
##$DBPNAM2= <>
##$DBPNAM3= <>
##$DBPNAM4= <>
##$DBPNAM5= <>
##$DBPNAM6= <>
##$DBPNAM7= <>
##$DBPOAL= (0..7)
0.5 0.5 0.5 0.5 0.5 0.5 0.5 0.5 
##$DBPOFFS= (0..7)
0 0 0 0 0 0 0 0 
##$DE= 6
##$DECBNUC= <off>
##$DECIM= 32
##$DECNUC= <off>
##$DECSTAT= 4
##$DIGMOD= 1
##$DIGTYP= 9
##$DL= (0..7)
0 120 120 120 120 120 120 120 
##$DP= (0..7)
150 150 150 150 150 150 150 150 
##$DP07= 0
##$DPNAME0= <>
##$DPNAME1= <>
##$DPNAME2= <>
##$DPNAME3= <>
##$DPNAME4= <>
##$DPNAME5= <>
##$DPNAME6= <>
##$DPNAME7= <>
##$DPOAL= (0..7)
0.5 0.5 0.5 0.5 0.5 0.5 0.5 0.5 
##$DPOFFS= (0..7)
0 0 0 0 0 0 0 0 
##$DQDMODE= 0
##$DR= 18
##$DS= 0
##$DSLIST= <SSSSSSSSSSSSSSS>
$$ [...]
##$SUBNAM2= <"">
##$SUBNAM3= <"">
##$SUBNAM4= <"">
##$SUBNAM5= <"">
##$SUBNAM6= <"">
##$SUBNAM7= <"">
##$SUBNAM8= <"">
##$SUBNAM9= <"">
##$SW= 18.0517328524113
##$SWIBOX= (0..15)
0 0 2 0 0 0 0 0 0 0 0 0 0 0 0 0 
##$SW_h= 3612.71676300578
##$TD= 16384
##$TD0= 1
##$TE= 0
##$TE2= 300
##$TE3= 300
##$TEG= 300
##$TL= (0..7)
0 120 120 120 120 120 120 120 
##$TP= (0..7)
150 150 150 150 150 150 150 150 
##$TP07= 0
##$TPNAME0= <>
##$TPNAME1= <>
##$TPNAME2= <>
##$TPNAME3= <>
##$TPNAME4= <>
##$TPNAME5= <>
##$TPNAME6= <>
##$TPNAME7= <>
##$TPOAL= (0..7)
0.5 0.5 0.5 0.5 0.5 0.5 0.5 0.5 
##$TPOFFS= (0..7)
0 0 0 0 0 0 0 0 
##$TUNHIN= 0
##$TUNHOUT= 0
##$TUNXOUT= 0
##$USERA1= <user>
##$USERA2= <user>
##$USERA3= <user>
##$USERA4= <user>
##$USERA5= <user>
##$V9= 5
##$VALIST= <valist>
##$VCLIST= <CCCCCCCCCCCCCCC>
##$VD= 0
##$VDLIST= <DDDDDDDDDDDDDDD>
##$VPLIST= <PPPPPPPPPPPPPPP>
##$VTLIST= <TTTTTTTTTTTTTTT>
##$WBST= 1024
##$WBSW= 4
##$XGAIN= (0..3)
0 0 0 0 
##$XL= 0
##$YL= 0
##$YMAX_a= 27988
##$YMIN_a= -18860
##$ZGOPTNS= <>
##$ZL1= 120
##$ZL2= 120
##$ZL3= 120
##$ZL4= 120
##$ABSF1= 10
##$ABSF2= 0
##$ABSG= 5
##$ABSL= 3
##$ALPHA= 0
##$AQORDER= 0
##$ASSFAC= 0
##$ASSFACI= 0
##$ASSFACX= 0
##$ASSWID= 0
##$AUNMP= <proc_1d>
##$AZFE= 0.1
##$AZFW= 0.1
##$BCFW= 1
##$BC_mod= 2
##$BYTORDP= 1
##$COROFFS= 0
##$CY= 11.3945322036743
##$DATMOD= 1
##$DC= 2
##$DFILT= <>
##$DTYPP= 0
##$F1P= 15.7292609196834
##$F2P= 12.9074282941183
##$FCOR= 0.5
##$FTSIZE= 0
##$FT_mod= 4
##$GAMMA= 1
##$GB= 0.15
##$INTBC= 1
##$INTSCL= 1
##$ISEN= 128
##$LB= 0.24
##$LEV0= 0
##$LPBIN= 0
##$MAXI= 10000
##$MC2= 0
##$MEAN= 0
##$ME_mod= 0
##$MI= 1.114404
##$NCOEF= 0
##$NC_proc= 0
##$NLEV= 6
##$NOISF1= 3.799351
##$NOISF2= 2.8
##$NSP= 1
##$NTH_PI= 0
##$NZP= 0
##$OFFSET= 15.70392
##$PC= 1
##$PHC0= -25039.86
##$PHC1= 14.05264
##$PH_mod= 1
##$PKNL= yes
##$PPARMOD= 0
##$PSCAL= 0
##$PSIGN= 0
##$REVERSE= no
##$SF= 200.130013532006
##$SI= 16384
##$SIGF1= 3
##$SIGF2= 2
##$SINO= 400
##$SIOLD= 16384
##$SREGLST= <1H.CDCl3>
##$SSB= 0
##$STSI= 0
##$STSR= 0
##$SW_p= 3612.71676300578
##$SYMM= 0
##$S_DEV= 0
##$TDeff= 0
##$TDoff= 0
##$TI= <>
##$TILT= no
##$TM1= 0
##$TM2= 0
##$TOPLEV= 0
##$USERP1= <user>
##$USERP2= <user>
##$USERP3= <user>
##$USERP4= <user>
##$USERP5= <user>
##$WDW= 1
##$XDIM= 8192
##$YMAX_p= 0
##$YMIN_p= 0
$$ End of Bruker specific parameters
$$ ---------------------------------
##NTUPLES= NMR FID
##VAR_NAME=  TIME,          FID/REAL,        FID/IMAG
##SYMBOL=    X,             R,               I
##VAR_TYPE=  INDEPENDENT,   DEPENDENT,       DEPENDENT
##VAR_FORM=  AFFN,          ASDF,            ASDF
##VAR_DIM=   8192,          8192,            8192
##UNITS=     SECONDS,       ARBITRARY UNITS, ARBITRARY UNITS
##FACTOR=    0.0002768,     1,               1
##FIRST=     0,             0,               0
##LAST=      2.2672688,     0,               0
##MIN=       0,             -18860,          0
##MAX=       2.2672688,     27988,           0
$$ Real data points
##PAGE= N=1
##DATA TABLE= (X++(R..R)), XYDATA
0@%%%%%%%%%%%%%%%%%%%%%qJ6j6J6j6J6j6K2l0L2l2M0m8M9n7O5p3Q1q9J02j11
42e7J22j38J54j70J86k05K27k50K74l02L34l69M07m48M98n55O18o94P84q93J028
63E51j202J436j765K270l140N066j6813Q798K7857k9735j0241K1477O355j5145
77d231N926O226o781J892P698j3158n388J6422m24k1478N516J8406j2110j7376
91a8860J5731J4133j2614p636J0069K531k941M144L27n509L090K788o801J65Q088
106F705n713j0118P172P614r826n740R976M826o463l051K093L495N172j232q517
121c607J215R408l136q589N530N919q604m662P457J117n210K163J553m457K791
136a112N350o365l224J0890J629j2781L55J1593k562p471N177J747q216K397Q696
$$ y = [0, 0, 0, 0, 0, 0, 0, 0, 0, 0, 0, 0, 0, 0, 0, 0, 0, 0, 0, 0, 0, 0, -8, 8, -8, 8, -8, 8, -8, 14, -16, 16, -16, 24, -24, 25, -32, 33, -40, 41, -48, 54, -57, 65, -73, 81, -89, 97, -108, 119, -131, 143, -159, 175, -194, 213, -235, 263, -292, 326, -368, 416, -477, 551, -651, 785, -980, 1290, -1850, 3216, -13597, -4799, 23058, -6677, -16918, 4559, 10914, -4231, 1695, 7921, 1140, 3032, 10730, -2428, -7816, 8606, 8182, -13296, -7780, 10626, -1484, -18860, -3129, 11004, -1610, -9246, 823, 3354, 413, 4557, 4884, -625, 2465, 5253, -1548, -1383, 6705, 992, -9126, -1954, 5660, -4166, -9906, 70, 4896, -1567, -4618, -2525, 970, 6142, 4910, -3607, -2392, 7016, 3880, -4709, 821, 6740, -1864, -6526, 931, 2048, -3162, -999, 554, -3903, -1112, 4238, -2127, -5351, 5539, 7168, -5613, -5258, 6335, 3773, -3698, 1479, 3226, -4990, -2593, 6103]
151F103n544o621P600K539q778J764Q558m911n928P296J948q805J625Q525l905
166A466n740N328J289o172L264O528n634m818O326J266o226K648N427n689m379
181e116O024J548n674J224M387k895k182L391l73k036M157J626n893o99N828o22
197B695m297K136J888m112j089L262m79j778J592m63k312K411K486k695l1M063
213C277j583m168L049L598l358j860K794j336l316K415K069l081n94K195j926
228a825j160M289P53m054J581L882l281k463N158J489n363n04L591j995k406L037
244G29M08l738O48K233k245K2M201j201m037K977L437l710j099M989n34n430J049
261a301L804k053j956K110o61k592J661J481k086Q19K788k516k546M026K354l801
$$ y = [6103, 559, -6062, 1538, 4077, -4701, -2937, 5621, 710, -5218, 2078, 4026, -4779, -3154, 5371, 1466, -4274, 1054, 2343, -3829, -565, 5963, 329, -4489, 1837, 3103, -3123, -475, 4952, -737, -5116, 908, 2456, -3218, -1994, 2393, -502, -2684, 707, 334, -1702, 2455, 4081, -1812, -2511, 3317, 2695, -1602, 534, 2422, -1690, -2779, 483, 4, -1774, -182, -645, -2957, -546, 1940, -755, -786, 3277, 1694, -2474, 575, 4173, 815, -1045, 1749, 413, -2903, -488, 1581, -1500, -2094, 101, -1825, -2985, 1304, 2057, -1997, -416, 3466, 185, -2278, 2880, 4369, -994, -1498, 2093, 98, -2308, 729, 1137, -2601, -1953, 280, -1965, -1943, 2258, 1057, -2980, -3, 3434, -276, -1375, 3614, 3080, -2350, -1301, 2503, 450, -1506, 604, -57, -2649, -988, 493, -1593, -774, 2014, -502, -3048, 978, 3332, -469]
277d69n13L730j220l635J748K570j694j259N09j100j86K238l82k110J577J462
293A266k711l87L895K12l343N42K195j456j037J813R5j459K74l47j370J742K033
310A957k504j811K715O42k639J169K981j917k476K053J184j709N27J343j829q98
326a212J855o20j637K298J297l513r65L592J59k635J452J860k610j140K818L46
342A345j871Q81O27k188J51K416r59j733J847N30k810L19L053p20k028J337O27
359H24k044N85K377r94j676J152J40j549J092J671j686j152J656k01j665J500
375C0J765j950j235J784J17j403J205J306j765r60J379q4q04J320L64k130j55
392a216J868m66j093J482N60k077k66J889n8r50Q75J86j569J35J419l92o30Q54
$$ y = [-469, -982, 2748, 1528, -2107, -359, 2211, 517, -742, -233, -1333, -1519, 719, 337, -1773, -196, 1266, -1445, -1832, 2063, 2275, -1068, -526, 1669, 213, -824, 989, 1084, -375, -101, -448, -1818, -76, 1957, -547, -2358, 357, 999, -1640, -471, 2510, 593, -1883, 170, 1354, -355, 172, 1515, -314, -1212, 643, 23, -1614, 684, 1981, -1532, -2497, 1095, 1254, -1381, 71, 1931, -679, -1819, 999, 1345, -526, 355, 982, -1206, -1055, 1361, 402, -1331, 516, 1046, -1764, -1445, 1608, 888, -1140, 197, 824, -1220, -635, 1742, 748, -928, 224, 364, -1185, -93, 1578, -108, -1260, 396, 195, -1470, 30, 1795, -155, -1390, 394, 511, -892, 313, 1619, -146, -1106, 273, 189, -615, 705, 1069, -1061, -1216, 652, 186, -907, 575, 1135, -942, -1208, 681, 623, -327, 548, 734, -835, -700, 719, 327, -303, 551]
410E51l42j546O45J642n74r36P34Q3j060L61J238j59o18J2l02k20P96L82o60j76
430a49J85n83j50J013L38p14k11M7k83M45P92m21n89M68j65q63Q32J323r68j289
450i42P63M53q60M39J152q25j070P57L39o98P46R51j397j022J406M75j276N36
468g3J347j277j473J326J087j037r4R34q70j025J237Q40j052p9Q89r34j062J406
486I0J122j297o34J065j93j121Q29J314p68j017N12K66n47M91Q42p21r84M55M49
505A53m60J68P90m68j086L42R15j16k79M75o9q85L8R79J38n80M1M2o87q9R35K53
527E50p72k18K87k62n7Q70L23q19k66N10q1k23P20L48r96n81O31K06m02L37L41
548D46q29o08P57N54l64Q9L86n34n74P43P14l93l06K14l74n10N64O67n20n56K48
$$ y = [551, 209, -1337, -692, 950, 376, -560, 174, 257, -803, -442, 796, 637, 19, 31, -271, -491, 305, 687, 27, -149, 36, -547, -697, 316, 654, -60, -271, -224, -507, -62, 730, 309, -280, 188, 23, -840, -8, 1315, 347, -942, -179, 274, -586, -147, 1005, 180, -890, -133, 206, -492, 254, 1205, -192, -1214, 192, 667, -609, -73, 1274, -3, -1476, -150, 937, -100, -194, 740, -130, -1155, 82, 922, -130, -209, 680, -254, -1316, 90, 1212, -85, -719, 346, 153, -968, -139, 1175, 407, -610, -98, 168, -379, 112, 954, 233, -751, -296, 153, -307, -139, 651, 183, -903, -561, 354, 238, -41, 434, 365, -520, -482, 497, 635, 55, 96, 138, -549, -638, 297, 550, -222, -440, -153, -415, -472, 398, 721, -98, -364, 146, 65, -158, 562, 910, -86, -667, -36, 170, -232, 105, 446, -383, -991, -234, 320, -44, 45, 431, -103, -677, 66, 780, 387, 81, 295, -79, -589, -25, 642, 122, -434, -186]
569a86o4m32M85Q18l26p54J61L64r6K32N02l07o97P1L74q0J8L57l22p92N1O46
591B3J30j61J31j14n01J06O90J75l03rn0m37K3P00J87n83k92R9j37k7N22K63n36
614a01l66K49J48J6L81K05n12m35K86K96jJ80K5n92l97M82M23k37r0K17l06m93
636f22L40O94J4l58j57j50m6M41K93k96k28J05k00l08M72O21l43o77K2K93L3J74
658A17K59k58m10N0J98M1K11K32l34n56R9M49J38k0l2l01l16J99M64K0j99K3j02
681b8l59N0N74K79l66m17l8J56K10J96j7k35j35l0o9J63M45O9n86m20L21M26R
704A98r8K7k07k36J38K89J11L5r5m16j98M17M62j59l31k6o5j46K55L57p8k86j11
727a63p4m1M00L73k80m93jK39N0Q8J93j41l86r6K14J75J49Q3k99l80O1M31J60
$$ y = [-186, -250, -682, -197, 621, 295, -459, -298, 66, -30, 202, 704, 397, -300, -229, 145, 65, 83, 440, 118, -674, -623, 23, 153, -8, 123, 9, -492, -386, 304, 479, 176, 167, 117, -320, -297, 403, 590, 7, -285, -186, -323, -350, 172, 435, -101, -467, -218, -70, -54, 327, 532, 20, -415, -129, 167, 166, 346, 371, -221, -618, -136, 287, 50, -40, 177, -129, -622, -282, 412, 426, 68, -89, -239, -285, 156, 449, 153, -75, 30, -170, -478, -6, 615, 272, -405, -383, -90, -57, 117, 376, 118, -292, -242, -44, -3, 208, 440, 106, -450, -351, 98, 236, 216, 184, -117, -433, -234, 230, 250, 51, 74, -28, -387, -337, 237, 516, 150, -267, -305, -149, 61, 257, 240, 5, -130, -160, -229, -66, 379, 448, -138, -558, -237, 189, 198, 100, 127, -80, -316, -178, 111, 222, 257, 162, -254, -452, -35, 427, 268, -63, -89, -154, -300, -45, 312, 234, -52, -163, -237, -278, 122, 495, 215, -278, -279, -40, 10, 98, 291, 150, -236, -332, -118, 57, 206, 289, -10, -390, -329, 102, 262]
750B62j08n3r9k61LL81K30j43k20j70j20J53L86R8l17k11K1k0Q3L39J43l53l18
773b94P0J81J37K06k1m05j98K01J59K6J79j0m61k32L75L18o3n7k8k79j39L36K83
796B84p1r4r9l10k7M77K46l04k34K1q1l1L29K23k22k42o6l9J64L81O2l90k79J39
820a63J45Q3J41J2k45k22K5J37K32J84j92m02j09L15K46qp3q4j32j05R4K43J85
843C07p8l55k50J71L68J13j60k05q2J4L9J19K04O1k89l08O0L52K05n1k08k21k3
866b17J79J54J3J4p2k71j51K71L39Ok23k10r4J29K79R3j29j09n0j42OL23K15k01
890A52l21r9R0K11K14n1k83j14Q1PQ0K73M2l53k41J39K30J29M6j32k88o1K11J30
914I2J9M7q9k87j00K65K84j2j53j63j31P0K49J56o3j67j56n9J09K33J11j32k30
$$ y = [262, 154, 101, 2, -259, -256, 125, 355, 212, -8, -178, -298, -145, 241, 339, 22, -189, -168, -188, -105, 234, 377, 24, -294, -224, -43, 94, 300, 279, -126, -324, -123, 36, 62, 241, 231, -230, -462, -87, 231, 168, 111, 83, -196, -335, 1, 284, 213, 119, 20, -290, -317, 160, 406, 102, -132, -111, -192, -223, 106, 329, 107, -135, -201, -240, -76, 305, 367, -23, -302, -163, -18, 65, 206, 218, -27, -249, -224, -87, 145, 329, 137, -265, -374, -59, 187, 179, 106, 22, -110, -215, -121, 122, 307, 229, -126, -376, -205, 163, 276, 116, -89, -171, -157, -118, 1, 205, 266, -23, -331, -271, 81, 286, 235, 27, -194, -217, -38, 116, 129, 143, 71, -200, -351, -80, 259, 265, 42, -168, -262, -133, 146, 239, 110, 1, -49, -191, -185, 138, 353, 152, -169, -268, -178, 33, 247, 196, -87, -201, -120, -113, -33, 240, 282, -71, -312, -173, 57, 186, 232, 100, -188, -249, -38, 92, 111, 158, 69, -218, -318, -53, 231, 219, 66, -97, -228, -158, 91, 247, 184, 17, -139, -198, -89, 144, 255, 123, -107]
937a07j25N4J92J61J1j71j95n6J35K20J02p9j82j46J2J70J92L8j41k06j15R4K37
960I5J37q9j94j32rJ31K03O8j05j73j29K8K06K17k7k49j68K5J29J34R1o6j90j17
984a84mJ42J99Q9j88k72l3K01J78N0n7j31j40j5J29J62J04q2k59j60J21K67Q8
1007B05j00j52j08pJ13J49Q4l8j83j70K5K28J95k7k08j86nJ56J46K3p1q8j40o3
1031b22J53K42N8j93k21m0J42K19P6j17j42m0l0J8J92J72j30l05r6J52K06Q0o0
1054A14j41j26OR8J27J09j8k16j92P0K50J18m2j40j39o0J03J81O5o2j54j33k1
1077b03J67J85L7j20j81r8J03K24J05r7j49o2n0O7J85J20j30k17r8O3K08J23n3
1100A29j74j01K2M6J12J74k3k50j55J05J80J07j2j21j62m4P8J20J19Kj94j86M6
$$ y = [-107, -232, -178, 14, 175, 186, 15, -180, -236, -101, 119, 221, 142, -40, -186, -174, -4, 188, 226, 85, -121, -236, -142, 95, 232, 143, -51, -183, -192, -61, 142, 210, 105, -68, -197, -169, 37, 254, 227, -22, -190, -165, -36, 98, 189, 123, -67, -184, -188, -46, 153, 242, 54, -218, -251, -50, 128, 178, 121, -10, -150, -165, -36, 126, 230, 148, -111, -271, -150, 117, 205, 105, -47, -155, -162, -49, 100, 184, 146, -37, -207, -182, 46, 241, 214, 6, -180, -185, -29, 117, 140, 69, -19, -159, -222, -69, 173, 231, 38, -183, -223, -81, 138, 214, 97, -45, -85, -115, -97, 95, 267, 137, -168, -264, -112, 94, 174, 114, -27, -153, -147, -49, 78, 187, 169, -47, -239, -169, 81, 199, 157, 17, -122, -182, -79, 102, 167, 105, -49, -182, -203, -36, 149, 186, 66, -115, -213, -110, 114, 219, 122, -27, -89, -139, -72, 113, 233, 103, -114, -212, -149, 59, 182, 129, -45, -146, -124, -78, 34, 208, 185, -65, -220, -115, 65, 172, 160, 39, -123, -167, -89, 31, 150, 152, -42, -228, -182]
1123a82K15R5Qo1j35j10O2J95J02pj62j65l1J68J41Op8j04j30lK04J63m6j55j03
1148a13l7Q9J75Q2q6j45j02j1J42J71%j57j56MN1J06J33Oj91j42L3J54J41K1r4
1173G4j53p4O3J32J01%j31j72j7J36J56M2r1j29q4K9J18J48J9j31j83m0J25J51
1197H9M4n7j21j13J8J35J42K8j04j47p6R7J48P6m9j28j12l2J03J44P2r8j59p6
1221a76Q3J42J08k2r8j13m6Q2J60O6q4j73j10M3J19J04pq6j12o4P0J87J29o9j62
1246b9q0N2J04Q3L7r4j52q9L0J54J03m4j78q5M6J00J02P8Mj52j07L1J97J07n3
1271A65j52j21lO3M8P7Kj64j72M5K22J18n0n9n3n3N3J26J06j6j53j62l0J67J37
1296A41p8j29l7k9m6J19J84M0j81j31N9J35J07Ko2p8q2o1J02J76J7k13j72N8J28
$$ y = [-182, 33, 128, 136, 75, -60, -170, -108, 87, 189, 182, 20, -145, -176, -8, 133, 139, 61, -43, -173, -176, 28, 191, 145, -10, -113, -150, -61, 114, 196, 110, -35, -137, -148, -6, 165, 165, 8, -148, -144, -93, 13, 146, 152, -39, -181, -148, 6, 147, 168, 74, -79, -153, -90, 42, 143, 143, 12, -160, -177, -41, 115, 157, 66, -63, -147, -118, 0, 148, 167, 36, -147, -187, -62, 89, 133, 76, -45, -158, -140, -5, 137, 165, 61, -86, -162, -65, 83, 159, 110, -18, -130, -162, -59, 85, 157, 59, -100, -176, -93, 49, 157, 135, 37, -76, -122, -40, 120, 186, 102, -71, -181, -138, -19, 85, 78, -8, -120, -184, -114, 73, 202, 133, -29, -109, -57, 47, 130, 167, 73, -79, -168, -138, 16, 119, 75, -103, -188, -142, -42, 60, 138, 142, -10, -117, -86, 111, 218, 165, 13, -108, -111, -48, 0, 77, 79, -85, -257, -212, 10, 128, 78, 19, -34, -87, -34, 92, 198, 182, 29, -133, -163, 4, 141, 63, -66, -103, -132, -178, -59, 125, 165, -16, -147, -88, 47, 154, 156, 94, 16, -66, -127, -25, 151, 168, -45, -217, -159, -31]
1321c1O2J3J6m9j21m0J31J87M1j80j57J9J02M7QM9o6j84n8J72J98j7j43j01J6
1346h6P8L2L6O4j8k16j16J68K18k2j45p4mJ3N3J17O9q9j71p9J18J96Pj65p4J8
1372g2m8nJ45J25j13j66j7J03J27Q2k6q9p4k4K1J38J08j51k56j9J69L7n2N1M6
1397D0j30j13J20K15J07j00j61m5J07Q3n1J5L5j60k26L1K76R4j94j62M7J14O3
1420EM4N4M7o3j35JJ94J05j09j63q1pK0O3Q1n8j64p9J04J73P6l9l9Jl1j6J36J56
1448B76r5k47o7J10L7n2pM1q4j40k4K07K48m5k60r1K30J80r8p4J01j8k03q7J49
1473a3J79p5j87j31O7J50J6k7N6L2j52p5K00K17p0j69q7K1L8Q3L8p5j15o1J5P0
1499e5R9J6q4m2Kl1P7J82O1k34j77J08J86kp7k2ro5n5O8J50O3j46j91L6J99O7
$$ y = [-31, 31, 44, 60, 11, -110, -150, -19, 168, 209, 29, -128, -109, -7, 40, 48, 97, 31, -153, -211, -39, 159, 142, -1, -102, -86, -8, 24, 60, 124, 106, -110, -226, -58, 160, 138, -7, -81, -85, -72, -19, 98, 167, 78, -93, -172, -54, 142, 149, -16, -90, -72, -120, -125, 20, 145, 32, -134, -151, -48, 79, 161, 135, 46, -28, -52, -31, 107, 215, 64, -192, -211, -42, -5, -57, -6, 40, -90, -203, -83, 132, 239, 139, -22, -67, 40, 123, 72, 87, 122, -38, -264, -233, 43, 137, -57, -219, -172, -58, 5, 49, 103, 150, 87, -48, -47, 147, 252, 143, -20, -101, -108, -88, -25, 56, -2, -166, -245, -141, 32, 108, 69, 30, 31, 0, -16, 120, 276, 181, -66, -133, -23, 14, -38, -45, -4, -88, -228, -252, -45, 203, 158, -102, -193, 37, 217, 119, 45, 146, 128, -75, -162, -13, 166, 91, -96, -227, -160, -10, 6, -21, 35, 67, -85, -160, 40, 257, 187, 18, -69, -48, -10, 73, 111, 36, -79, -140, -125, -55, 44, 60, -24, -66, -64, -95, -18, 164, 225, -9, -186, -78, 108, 106, 29, 7, -2, -67, -122, -54, 96, 159, 13, -178, -142, 57, 124]
1526A24r7n1N4l0j28L7J94Q3j52j88J0J51R1j1o2o2k9jPR6Q1n8j54o6J08R3QR
1554E7k8j02m5J12J30J1q9o8m5nR2R3l5r6p8m0N3J35M8j09r1N9J5j5R2J02o7j72
1582h6k6J05Q9K8o1j06p3N6N1K0N6J7j26j18R8J66L0o1k6m1n5N0J08K0p6p0p1
1609a02j8J00J09m8j00l7J7%Q9J24n2j36k5O9N2K7M6m4j35n2O2P2L0J3j03j05
1635a47J7J48N0k4%l5r1kJ58R0q1q7k6k2J5Q5N6q6r5j9lM4J17L2j15r4O3O2J5
1664B5P1L4j19j29P3Q5J6k0qr2p9O1J03K1j0k7r5m5J54J28n7p0Pm2n1Q8J17n9
1692H0r6p0k0M0R9M4j02n4J1NRJ21Q5r9j38K1R1M7Rj7r4o5JM4N0M7l0j29n0J15
1722d5J16pj8Kn8m5N3J08L4p9j11m4L9O3L1l1k9q6k1N8R5P1l1r5l5O6P6K5lj9
$$ y = [124, 27, -24, 30, 0, -128, -91, 103, 186, 34, -154, -144, 7, 98, 87, 25, -37, -66, -67, -60, 36, 117, 59, -95, -161, -53, 40, 48, 57, 29, -73, -118, -6, 124, 135, 46, -22, -67, -72, 20, 113, 78, -18, -96, -136, -83, 52, 100, -9, -100, -41, -26, -41, 51, 153, 86, -86, -112, -7, 82, 110, 49, -57, -130, -74, -23, -3, 53, 70, -56, -174, -76, 90, 120, 59, 33, -8, -63, -13, 95, 115, 39, -31, -102, -120, -20, 89, 41, -59, -96, -79, -79, 10, 134, 82, -54, -79, -10, 42, 69, 115, 71, -64, -116, -54, 18, 48, 61, -42, -147, -130, 18, 68, 44, 44, 9, -82, -84, 74, 164, 83, -4, -30, -52, -37, 48, 104, 18, -77, -96, -99, -55, 62, 94, -21, -115, -52, 10, 25, 96, 130, 11, -118, -45, 40, 56, 36, 28, -64, -143, -82, 21, 42, 32, 5, -90, -135, 19, 147, 90, 20, 27, -15, -66, 22, 139, 80, -16, -86, -106, -66, 33, 77, -25, -79, -68, -63, -54, 67, 152, 53, -85, -64, 27, 74, 83, 66, -28, -93, -92, -48, 2, 49, 19, -110, -160, -45, 71, 64, 46, 48, -10, -55, -2, 106, 140, 61, -50, -94, -55, 8, 39, 8, -21, -107, -128, -70, 25, 96, 65, -30, -65, 1, 77, 102, 99, 80]
1752H0r8r3M4J18K0q5p7k2LM8Q4L3l8l2n0J8J27R1p9j04mJ8k9L2Q4l1j53n3N7
1781i1Q2N9oq9l5L7L5J9Q3M6j29j22N5J32On2l4n2n0K7P7M2rn0p5oJ08R3l1l7
1811C3qn9l3R6R7n3j07l0PK0P0K9l8o1m1JO3R1Lj01o3K2M9K3M1K6o9q7QQ6Q2k1
1843G6q0n3kK5K6N6Ro7q6j2R5P3Lm9n1kK9M2M5L9o6j05k4R6M4k0l5l4o6j4O5O8
1875B5Qn3n0j8Q5Q6J2m5j4l4n8M9J09pj17n6oJ9K5N5Po5m1J2M6J01N7o7q9J7M3
1906C6J7NL7m7j32k9O9N1mk1m9l6K5O1M9L5po4o5P9J01%p6k8k6m3J1Q3J6o8p0
1937i0j6K6P5O8j9n6jjK3N8N9m6j04k6M5L1lNl9o5m9N4R3J1k5l8l8J9Q7M1rl6
1969C4k8n0kQ8L9o2p6OJlN7N8m8r4J4N7J1O5K9p3q5M1M7kL2J7r6q6O4Q2j8k9L4
$$ y = [80, -18, -111, -67, 51, 71, -14, -91, -113, -110, -62, 22, 55, 17, -15, -65, -47, 80, 171, 92, -12, -16, 2, -27, 5, 89, 58, -95, -148, -91, -9, 50, 44, -45, -80, -43, -8, 11, 94, 140, 11, -111, -56, 76, 82, 30, -4, -56, -106, -79, -2, 40, 31, -19, -94, -100, 8, 101, 70, 33, 25, -34, -67, 29, 126, 73, -34, -64, -57, -37, 33, 62, 24, -37, -78, -77, -14, 77, 80, -21, -84, -62, -13, 10, 51, 77, 8, -79, -71, 15, 97, 76, -4, -57, -59, -34, -8, 48, 57, -10, -96, -108, -13, 60, 63, 14, -37, -39, -10, 32, 77, 116, 50, -55, -79, 17, 61, 41, 6, -28, -94, -108, -43, 25, 33, -20, -70, -88, -3, 83, 95, 50, 36, 2, -56, -7, 102, 95, -22, -78, -84, -65, -40, 15, 22, -43, -84, -72, -26, 75, 132, 65, -24, -7, 36, 53, 58, 95, 48, -84, -113, -44, 7, 3, -18, -67, -103, -78, -17, 32, 67, 60, -4, -69, 10, 111, 111, 35, 7, -19, -62, -51, 32, 48, -20, -90, -106, -80, -5, 63, 44, -12, -13, -14, 9, 67, 126, 80, -24, -50, -5, 26, 23, 28, -11, -76, -125, -71, 22, 33, 8, -30, -68, -49, 38, 79, 70, 34, 6, -44, -46, 42, 81, 19, -57, -51, -50, -53, 4, 62, 14, -80, -66, -9, 2, 67, 96, 23, -62, -21, 26, 24, 56, 73, -23, -109, -45, 37, 19, -10, 24]
2002B4o9o2N9J13j4m7ml0k9O3Q3k9n9mk7l2P3Q8n2j08J4L6k2L5P7l2j14qP0L0
2032B3J7K4m5p8PO6K1MOl6r6J4J12K2o0k3Nn8oR7O8o2n3lJ3J1O8L3q4m9J8QLO0
2066D7K6q9q9O7P2l4OO2p7r4O0J13j5k6Nn2n1N6P3k4l6J5o7n8R2J20p1q4J6K2
2096a5l0L6J07m8q5PJ7nM4O4p1q4K7L8j6L8N7q5q0K8R0nrJ4k7o2J7O1L7k8k9k3
2128b0m4M5N4Rl9k0k6m0N2Q6J5p7l8K2J6KN0J5n9p1K5N3L9qj6m9m3L3O6Kj0j0
2160A4n1l0N6P7k0n1Qj0n4N2P7rq0k3OML7N9l5n3j3J5J4M2N2n6q1J2N3J1lK5k1
2193B4p6LP4K0pj5l8l5K5N6J3j0mm1n1L9P8ln5j6pj0J4O0Nm5n5NL9K9J6j8l4q
2227b8OJ3M9J6j4p6l0N4M9qrj3k7m7M6O7Ol5m5OqM8K2rl0l1rNN4M6m8p4JM1J0
$$ y = [24, -45, -107, -48, 65, 51, 4, 0, -30, -59, 4, 87, 58, -1, -5, -32, -64, 9, 97, 45, -63, -49, -13, -35, 0, 77, 45, -69, -77, -7, 23, 40, 64, 19, -59, -52, 14, 35, 39, 45, 9, -87, -73, 39, 61, 1, -22, -17, -75, -81, 16, 84, 22, -31, -34, -21, -10, 58, 91, 7, -42, -24, -16, -13, 47, 73, -16, -105, -38, 34, 0, 6, 68, -9, -103, -43, 70, 55, 29, 34, -18, -69, -13, 60, 36, 0, 15, -52, -110, -18, 102, 31, -53, -37, -15, -45, -9, 98, 50, -35, -28, -11, -16, 28, 92, 21, -63, -36, 2, -14, 24, 81, -4, -84, -56, 34, 29, 20, 34, 7, -55, -38, 23, 60, 32, 3, -20, -64, -19, 35, 44, 5, -15, -41, -81, -29, 57, 72, -5, -43, -21, -5, -3, 47, 62, 3, -68, -43, 10, 49, 41, 25, -24, -67, -34, 32, 34, 24, 14, -37, -67, -11, 66, 46, -5, 3, -7, -61, -9, 68, 59, -21, -44, -38, -34, 3, 62, 27, -26, -39, -24, -10, 32, 84, 28, -53, -41, 12, 23, 20, 45, 24, -52, -49, 25, 45, 38, 23, -15, -50, -25, 31, 44, 34, 30, -11, -62, -23, 55, 52, -3, -19, -26, -36, -22, 38, 43, -2, -57, -52, -13, 16, 32, 14, -20, -28, -22, -9, 40, 56, 42, -34, -64, -10, 39, 31, 22, 9, -18, -65, -19, 48, 54, 19, -26, -20, -28, 20, 42, 33, 3, -28, -37, -32, 22, 68, 20, -54, -53, -12, -2]
2262bMM4j1p3k5N8M6Kj2l1l3J1L6NPLl4o2J7Q5J4m0j9j3kj0O9J2k5m3k0J3L7L7
2296D5j7l9k5PlK7M0ko5l1K0O0J1j3Kl4k8K0L4M3j1n1k2qM4L6jk7k8j5pL5N4j2
2330C9o7j6L4J3J5J7kn7j8J8L3L3Jn2l6OM2J4nK1k4o7K7N2J5j0nk2l6J2N8J4j2
2363C5l7k7k2M4M5ol7nj0oL2L5mm2k8j0K7K8L2l0l9qK5J2J8K1m2l5j2L1K2K8j0
2396B5l4l2J4M5J7Oj2m4j6K1L0Njj9l0qL9K5%k2k0k1QL0K4j3k0j8j8L2L3J9k4
2429B1l9kpK8K9Jk1m5j0K2L0K7j4k3k1pL2M9k2k0j8j7lM8K7j4m5j7nJ9M8Rl3l8
2463c1kJ8PK9J7k8n6J6J7K0J7qk7k7J7J6J5J6rl8k2L4M1qmk0j5k3L6L7nk0j1k1
2497b2j0L9K1Rm8k4OJ2L4J7k2m1j5L2J1J9J6l2k8mK0K5Qok5l9J5L0K9jj5k2k5
$$ y = [-2, 2, 46, 35, -38, -63, -5, 41, 43, 31, 0, -33, -22, 14, 19, 26, 29, -5, -67, -50, 35, 49, 9, -10, -23, -25, -35, 34, 46, 21, -22, -42, -29, 8, 45, 28, -11, -36, -29, -32, -5, 35, 33, -32, -63, -43, 17, 28, 15, 17, -17, -45, -25, 9, 52, 41, -10, -32, -40, 4, 40, 39, 12, -16, -31, -38, -3, 51, 39, -28, -44, -10, 3, 18, 35, 33, -24, -42, -24, 9, 42, 43, -9, -45, -39, 3, 17, 12, 33, 9, -58, -31, 21, 36, 26, 21, -1, -37, -25, 33, 47, 35, -2, -29, -51, -7, 38, 32, -5, -10, -20, -26, 6, 41, 37, -5, -33, -43, -16, 12, 44, 14, -25, -33, -8, 4, 22, 43, 1, -34, -46, -15, 7, 35, 25, -9, -41, -27, 18, 35, 41, 29, -15, -31, -10, 20, 25, 24, 5, -25, -33, 6, 31, 31, 9, -11, -32, -24, 6, 30, 17, -3, -21, -39, -7, 26, 45, 21, -18, -20, -27, 1, 30, 31, 10, -35, -45, -23, 7, 34, 20, -3, -24, -31, 1, 50, 28, 8, -10, -27, -30, 18, 45, 31, -14, -31, -36, -17, 31, 40, 7, -31, -33, -15, -8, 21, 38, 10, -46, -30, -13, 7, 24, 16, -11, -38, -21, -5, 10, 26, 17, -21, -43, -9, 32, 24, 20, 0, -15, -38, -2, 35, 30, 10, -1, -22, -32, 7, 28, 37, -11, -35, -29, -17, 17, 34, 12, -29, -44, -12, -1, 18, 34, 2, -26, -30, -10, 15, 23, 17, -8, -47, -32, -2, 27, 26, 11, -11, -36]
2530c6J5L8J8k1j9j4kJ7K8J0k3l2mJ4J2K5Nm8j6jL9lK5j3l2k2K2K5J6Rj8l5j0
2563c1K3K9LJj9m5RK8L6Ok5l1nJ4L2Pml8j1qK4L0j0ml0j6QK5K8qk4k8oJ4M6%k1
2600aj4prL9K7j1k0j2j7QL3J8j9k0rrJ9K6J8l1k6JJ0QL2j2l3j9KK2J8Rj3k3k2
2635c7J8K5J1Jj8j9k6K8L4Qpk6k2J7J9J1Jj5k2pJ4K7J1j6j3k0kK8J7Oj4l4rJ2
2669a9K8J6j5j0k3JJ4K3J6k2k4j3J0J6K9pk9j8mJ6L0Roj9k4J2J2K0Qk0k8LJ4K1
2703A7%Ok6k3NK0K8j0lk8j4J0K4K3j3qk7KRK4npj8j0NK1K3qj5j1k0J0L1J9j5p
2739Ik9QK5J0lj6rj8J9J7J9j3j7k0OJ1J6J2k5k3MjK2J5%k9npJ9%ORl7j2J0K5J7
2776A5j2j0j2j2J2K7ROl4k2J7J4L0j4kj0j9qK6K2Kl3j4jK5J9rnk1mKK2K0j2j0
$$ y = [-36, -21, 17, 35, 14, -5, -19, -21, -4, 24, 34, 11, -21, -25, -11, 1, 26, 31, -17, -33, -34, 5, 2, 27, 14, -18, -40, -18, 7, 23, 32, 14, -21, -31, -8, 21, 24, 25, 6, -39, -30, -2, 34, 40, 15, -16, -21, -7, 25, 32, 28, -10, -21, -29, -5, 25, 15, 11, -19, -35, -27, -2, 26, 18, -6, -34, -40, -26, 20, 20, -1, -15, -22, -31, 8, 35, 24, 4, -8, -25, -17, 16, 34, 15, -5, -14, -23, -4, 22, 40, 9, -17, -16, -6, 2, 34, 22, -11, -30, -28, -6, 12, 21, 8, -15, -37, -19, 6, 17, 18, 0, -19, -45, -17, 17, 25, 18, -8, -30, -13, 6, 17, 18, 3, -19, -26, -12, 15, 26, 10, -3, -23, -25, 3, 20, 26, 12, -22, -31, -19, 9, 25, 10, 0, -23, -22, -8, 15, 31, 9, -15, -28, -18, -2, 27, 20, -9, -27, -31, -15, 15, 24, 18, -1, -25, -13, -1, 19, 27, 7, -21, -18, -4, 17, 17, 23, -3, -26, -21, -1, 27, 17, 14, -14, -28, -18, 6, 29, 16, 8, -19, -17, -8, 16, 11, 4, -14, -24, -19, 2, 25, 17, 2, -9, -29, -19, 12, 31, 16, 9, -20, -12, 13, 23, 20, 4, -5, -23, -4, 13, 32, 19, 2, -18, -12, -1, 15, 27, 2, -21, -17, -18, 4, 19, 19, -10, -15, -22, -3, -3, 3, 12, -25, -37, -27, -2, 15, 3, -7, -19, -31, -19, 8, 17, 23, -11, -33, -16, -2, 28, 14, 12, 2, -17, -25, 1, 23, 25, -8, -22, -23, 2, 21, 12, 7, -14, -18, -16, 6, 26, 14, 4]
2811Dk7NJ0K4jpj1k1j1M1J5j5jj8jJ4J4J2jl2k5J3L2%Pj1l0JJ0MK2mj0l6J8J8
2847BJ4qqjl0PJ3K9j3j5j7kK5J7mnmj0j3K6K4nk7j4NMK9jkk0rlK3J9%k5k1KRO
2887cJ1J5k8k1kJ7J9%j2j5oNJK3J0j4k9JL4QJ0k0%j3JJ1RJ5j9k4j3K7L0j3lqj8
2924a4%RK4mj6j9kQJ3Pjj2pKOJ1J3pk5pK1jLJ5j5j1k1K3J0J9k0j9pJ7jRK9j3k7
2963a0k5M5J0knj1j1mKK6qj3qj4J1J6R%k1jj6PM0mj3j3njK2J8mj3j6j0oM3J1p
3001A9l7L%J8ROj2j0pOQK4j7j9lJ1m%K2j8j2lKJ7K6k4j3mkQJ2J0Kl2j3J2J5J3
3039A3qrk%mJ8Ooj2rOPJ2kj5mj0kJ3J8Mk6j5PQK3Nk2qomK1J1Mk2j3OPJ3J2Jk6
3081a0NlJ6lPml2NjJ7J1Nj4j0mJ6J3j2mj4lRJ1J6j7j2rOJ5NKrj8LjJ3J7mJj7J
$$ y = [4, -23, -18, -8, 16, 15, 8, -3, -24, -35, 6, 21, 6, 5, -13, -14, 0, 14, 26, 25, -7, -32, -19, 13, 13, 20, 9, -21, -20, -10, -6, 16, 12, 2, -34, -16, 2, 16, 8, 0, -1, -31, -24, -11, 18, 5, -10, -27, -29, -4, 13, 9, 4, 0, -10, -23, 3, 27, 22, -5, -19, -14, -10, 19, 18, 16, -4, -13, -16, 7, 26, 26, 1, -20, -18, -9, -3, 8, 23, -5, -26, -28, -11, 8, 8, -4, -19, -25, -20, -19, 4, 14, 0, -29, -28, 6, 14, 24, 4, 4, -9, -8, 3, 12, 27, 8, -16, -29, -2, 28, 15, 12, 4, -14, -14, -5, 19, 15, -1, -20, -22, -14, -1, 6, 5, -7, -14, -12, -6, 5, 18, 11, -14, -21, 0, -1, 2, 17, 2, -9, -30, -7, 3, 22, 2, -17, -24, -7, -8, 1, 30, 17, -10, -35, 10, 20, 18, 13, 2, -9, -13, -11, 15, 7, -6, -14, -28, -17, -1, 8, 8, -13, -14, -30, -23, 17, 13, 0, -13, -18, -19, 3, 21, 17, 4, -12, -22, -28, 15, 26, 19, -18, -15, -15, 3, 12, 18, 6, -4, -11, -5, 3, 27, 10, -9, -12, -1, -5, -5, 17, -1, -13, -16, -14, 3, 29, 5, -8, -12, -14, -6, 6, 16, 18, -14, -27, -15, 0, 13, 5, -4, -6, -6, -10, 8, 14, 8, -4, -13, -7, 0, 12, 10, -5, -9, -19, -21, -8, 10, 14, -12, -27, -20, -12, 11, 16, -6, -14, -20, -24, -3, 8, 12, -10, -23, -17, -10, 3, 15, 16, -10, -5, -8, 8, 5, 12, 8, -24, -19, -20, -3, 8, 13, -1, -11, -15, 1, 14, 2, -2, -16, -19, -10, 1, 17, 0, -12, -21, -15, 0, 5, 7, -2, -20, -17, -18, -5, 12, 8, 9, -8, -7]
3122gPJ1J2j7%k5PJK9j2j2lj5J0K3Qnk3pORJ2Ork6%jJ7%Lrj3J0QPOjj3oMJ8jJ
3165A0j7qRMJ1nOk8j3PK2J6pj3JmnJ2K2%l3qjJ9Kj3kkj1RK2J2j2%j6NJ0J5Jpn
3206Ej3kJ1Q%j7LpJ3nK1j2ok0J2J6LJ0j4j5MkPjPj9nj0J8J5Jj2ljRRNlpj5JLJ2
3249DQrj0l%K0J2Jok5mJ7J0rQj9kkRlKj3rJ3KLlJ9j3j7MK1NQj7j3QnjJ5jrrj1
3293b4J9J4J5j8j8J1LJ5%Mpj8j1K1jj1Kj7MoJ5J5rJj4j4K8PnLj0nj3J7J6moj4
3331a5oPJ2RJj6KJLJ6jqJj2nQLQj3j1NJ4KkLj5%j1MJ9mknnkMK1Lj2j9RMK3jj1
3376Fqj3RJ3LQj5Mj9NJ5j0J1lj8KJ4oJ0j6Oj5K1oOj0nl%NK2j7kqMNnK1Lj0k0M
3418a2KK2Qk5PNj7RJ2Pj1k6RJJ0J5j4j3jOJ0PLj5j3J0pJ3Noklj2J2J7%j6MoLJ6
$$ y = [-7, 0, 11, 23, 6, 6, -19, -12, -11, 18, 6, -6, -9, -24, -14, 9, 17, 12, -11, -18, -12, -3, 9, 15, 6, -20, -20, -21, -4, -4, -1, -10, -23, -13, -5, 2, 8, 7, -6, -12, -8, 10, 9, 10, -7, -15, -6, -2, 9, 4, 10, -18, -31, -24, -2, 14, 7, -6, -5, -9, -14, -2, 20, 20, -13, -21, -22, -3, -1, -14, -16, -18, -29, -20, 2, 14, 2, 2, -14, -9, 1, 16, 17, 10, 5, -8, -10, 1, 9, 9, -8, -5, -12, 1, -4, 17, 5, -1, -21, -9, 7, 10, 20, 6, -9, -5, -7, 0, -1, 6, -13, -18, -28, -10, 5, 6, -6, -9, -10, -1, 8, 13, 10, 3, -12, -11, -8, 4, 12, 3, -7, -10, -10, 10, 22, 23, 17, -8, -12, 5, 15, 6, 14, -5, -7, -9, 0, -3, -1, -14, -23, -10, -8, -5, -8, 11, -2, -19, -15, 6, 11, 19, 2, -11, -3, -8, -9, 6, 5, -4, -13, -24, -5, 9, 24, 6, -12, -1, 2, 17, 17, 21, 14, -4, -15, 6, 5, -6, -4, -21, -17, -23, -8, 7, -2, -1, -15, -29, -1, 6, 1, 4, -6, -11, -24, -7, 9, 5, -1, -15, -21, -14, -2, 7, 8, -8, -6, -5, -2, 14, 13, 5, 6, -6, -11, -3, 0, 8, -5, -16, -11, 3, 5, 3, 6, -9, -9, -20, -16, 3, -1, -3, -8, -13, -15, -11, 10, 13, 1, -18, -9, -5, 18, 17, 6, -2, -15, -6, 7, 10, 18, 3, 7, -12, -7, 8, -2, 9, 6, -12, -10, 4, -2, 8, -8, -2, -17, 4, -2, 4, -6, -11, -14, -14, -9, 13, -4, -6, -14, -10, -5, -10, 11, 14, 4, -16, -12, -10, 12, 20, -5, 2, 7, -10, -1, 11, 18, 7, -19, -10, -9, 1, 16, 2, -11, -12, -6, 4, 11, 14, -1, -14, -4, -11, 2, 7, 1, -1, -4, -16, -4, 13, 13, -3, 1, -5, -2, 14]
3459A4nmLj7j3K2OJ5j4oj4J5jRLpj2j5J2J3Oonj6OJ0lMnp%J1J4kk1nJQnJ6J0k
3501A3k3PPnPmJj0%ORnKj1lJJ6Pnlrj2QJQjj9NN%LkKprJ4MJ5Kk3nRjNJ1Mj7j5
3549a7J2PMKj8J1mmLKMqj5J1QJ0npqnNJ1NMk3OqPQMMk1lKMK7lj4jJ2j0LL%j1%
3595fPKJQj4%pJ8qNJ3k1orJ1OJ0qj4MlJ4MKj1j6kJ6KJ5j8%NoMOrJnOJ0NpPrLq
3642bNPkJj7J6j2J0jj6OnKpJ2jnKqJ1LlMkopJ3kK0j4j0Nj0J5J0%pj7OJ5Ljkmj7
3687a2J6LMqj3j3MRQKj5NOLj%J2k0KoNJ7mlkonPJ6Oqj6PKKJkJj1pJ7MJ0j9jmN
3734bkMPoj2MON%j0kmlNLLlKj1OMJJ4j1LLjMJ3j2qkN%Qk0J5rMlMNj0njpJ4jjJ8
3784A4j9%oJ2LmllnOJ1JnrN%J0%Moj4QkJ0MmopJ3Jo%okjJ2j0RKk0mKK0lnqJk%
$$ y = [14, 9, 5, 8, -9, -22, 0, 6, 21, 7, 1, -13, 2, 1, 10, 13, 6, -6, -21, -9, 4, 10, 4, -1, -17, -11, -1, -4, 0, -5, -12, -12, -1, 13, 11, -10, -15, -14, -6, -11, 5, 15, 13, -10, -3, 4, -1, 6, 2, 3, -7, -7, -1, 8, 3, 5, -6, -9, -8, 8, 15, 10, 7, -2, -14, -6, -5, 3, 2, -17, -12, -7, -7, -4, -6, -4, -11, -20, -6, -2, 13, 15, -8, -13, -4, -5, 0, 11, 15, -2, -17, -5, 2, 6, 8, -10, 1, -3, -7, -4, -2, 2, -6, -21, -10, -2, 8, 3, -4, -12, -17, -12, -1, 4, 8, -15, -9, -17, -10, -2, 2, 6, -15, -18, -16, -12, 15, 12, -2, -3, 9, -1, 2, 5, 5, -6, -6, 1, 3, 4, 12, -2, -2, -9, 9, 1, 6, 19, -2, -8, -17, -6, 0, 10, 2, -12, -8, -11, 3, 7, 9, -2, -18, -20, -4, -2, 13, -5, -5, 0, -6, -2, 4, -5, -4, -9, -3, 7, 12, 5, 12, 3, 6, -2, 3, 10, 8, 9, -8, 8, -4, 6, 5, -11, -5, -10, -8, -15, -3, -4, -9, -7, -15, -4, -1, -4, 0, -2, -8, -15, -2, -4, 16, 2, -8, -3, -13, 2, 12, 12, 5, -12, -6, 9, 12, 11, 9, 5, -12, 4, 7, 11, 3, -10, -23, -19, -10, -2, 0, -15, -10, -4, -1, -2, -2, 10, -10, -8, -14, -9, 8, 4, 1, -1, -7, -12, -5, 11, 17, 9, -7, 0, 2, 4, 5, 3, 4, -7, -14, 3, 7, 17, -2, -3, -7, -2, -4, 0, 7, 1, -11, -7, -1, 4, 4, -6, -8, -12, -15, -10, -7, -4, -7, -5, -16, -10, -6, -5, 9, -2, 1, 4, 3, 7, 20, 8, 0, -2, 3, 3, 11, -9, 6, -3, 1, -2, 2, 7, -3, -8, -9, -16, -2, -3, -4, 14, -5, -5, -11, 1, 4, 0, -3, -6, -11, -5, 6, 7, 2, -7, -2, -2, 8, 8, 12, 6, -8, 0, -2, 8, 12, 8, 2, -5, 8, 9, 3, 3, -3, -5, -6, 6, -4, 5, 7, -13, -17, -15, 5, 2, -3, -11, -10, -12, -12]
3833a2KOLkKpJ0JKk%mmJ7moojOJONj3loLKkONk1J0LLLmj1KjQjJPqj0KJ4lQj1Q
3884DqJ2KLj2NnKLRqqjMpJ4pKlj8J1J2Qj4kjpNNklLPj3PkJ5j7nJRMJMlMk0K0k
3933Hj0Qkj1J3%Ok4K0j0KLMoqP%j0KJ4j8R%ppJ0J3j5M%%LRol%mPNJNj8JNONkj9
3981a0RppJ6kLj2JJ0kmPmJqkJ4KnqnONNpjOplO%J0k0J5%LJ5j3LMj8OPKlonqJ0
4030aLnjKoPJnJ5j2mjkRm%mMk%K1pj1PlLmJ1%okj4J9j%oLjj2J3kjloOj2J3JMp
4080clkjJ4pKolnNJ3Oj3j0NLJ0%oRj3kJ4nNKj8NOjkNrJRj2J1mLmM%pNjk0J0PJ
4129bkRlLrJM%nJ1j1jJ0Oj3kJ8pnJ0pLkj7OKMRj3KnQk0RJ3j0%kQPpMMj2%kQpP
4178BnKLjmJ5rnRj1J9LrolOj1J4nkmqRLnLOj8JJQj1MpJ0JjLMlKj5J1J3lmjqK5
$$ y = [-12, -10, -4, -1, -3, -1, -8, 2, 3, 5, 3, 3, -1, -5, 12, 8, 2, -4, -5, 1, 2, 8, 13, 0, -3, -9, -6, -4, -6, 0, 5, -16, -6, -3, 0, 3, -1, -12, -10, -11, -3, -4, -3, 4, -4, -14, -12, 2, -1, 7, -4, 4, -4, 8, 10, 13, 1, 6, 1, 3, 6, 15, 7, -1, -2, 2, -5, 9, 2, 4, 1, -17, -6, 6, 14, 0, -2, -3, -10, -5, 0, -2, -5, -2, 5, -8, -1, -3, 12, -5, -10, -9, 0, 4, 5, 9, 6, 10, -10, 10, 8, -2, 6, 4, -7, 6, 6, 12, -12, 8, -2, 0, 3, 7, 1, -7, 0, 0, -10, -8, 6, -12, -3, -3, -10, -17, -7, 6, -9, -5, -5, -5, -2, 7, 1, -2, -2, -6, 1, 6, 7, 12, -6, -5, 0, 6, 11, 9, -10, -1, -8, -15, 1, -1, 2, -10, -9, 1, -1, -5, 2, -2, -1, -9, -11, 3, 5, 0, -8, -13, -7, -2, 3, -4, -5, 1, -6, -9, -3, -3, 7, -13, 2, 2, 5, 20, 7, 10, 14, -4, 2, 9, 11, 8, 2, -3, -11, -1, 2, -3, -4, -2, -8, -1, 0, -5, 10, -2, -6, -7, -9, 0, -4, -4, -8, -4, -6, -6, 15, 8, -3, 4, 1, 4, 0, 11, 11, 5, 3, -11, 8, 7, 7, 1, 4, 3, -9, 4, 2, 1, -2, -8, -2, -14, -1, 0, 4, -3, -6, -8, -9, 5, -2, 0, -6, -9, -14, -9, 4, 10, -3, -13, -8, -5, 5, 5, -1, 8, -5, -7, 7, 2, 7, 9, -9, -4, 2, 1, -1, 4, -5, -4, 5, -7, 4, 0, 3, -1, 3, 3, -4, 1, 0, -20, -10, -3, -2, -4, 5, 2, 5, -4, -3, 1, 1, -4, 7, -4, -5, 5, 11, -2, -4, 14, 7, 2, 12, 5, 8, 6, -11, -5, -3, 1, 10, -3, -1, -6, 2, -18, -9, 4, -6, -6, -8, 0, 7, 0, 4, 8, -4, -4, -6, 2, -5, 2, -3, -1, 2, 1, -3, 12, 3, -2, 7, -4, 15, 18, 9, 3, 0, 6, -5, 9, 4, 2, -2, -10, -1, 2, -3, 0, 6, -12, -11, -10, -2, -13, -9, -16, -6, -5, -6, -3, 1, -2, 0, -15, -4, 9, 6, 2, 1, -7, 18]
4227A8j8kRj7Qk%J4mj2J0jJmLMlj1pJ4j1NLJmJNKqKrJJJ1KjjmMMmQqnJJRPlj5
4277eJ0oKJkKJjpLJMj3MPoRkNMk7PKROlj3KNpJ3mnMnJ2NNj0%Kj0JKLpoJ0Pj3l
4328gLkLjoJ1rNLjmOkJkrJ0oJ5KrRrjOkj%lqJ3NqLlj4J7%%Nj1nqJ0OJj1lPj2J1
4379eMNloKj2%J3J1j6jJ2j0J7momRjj0J4J%olKJK%nmJ%J4k0nQjJj0J4lolJ0%l
4426fJKklJ2LMj2rJ3lRMlmmpQlLJ1k4mJ4rJ0%Lj4jJKNmN%qJJ7k0J6om%KQmlMr
4476hQ%QqkmJJ1OlqJjoLO%jqnMNMpJrNQNj5lj1J0MMRj3J5oJj0RNjrkPNlQOj5j
4529@Qj2kJ8j3joPPpnkJ3mJmkKjnNJ7j1j3lPMKJj2QJ%Pj0NNlj4J2PPj5KjlRpP
4578Fj4nJ2m%PnNj3LJjJ1j3jqK7j0NJmQj2NlRoMlPnKpj%J0%oKoJjlJ2j2KJNj3
$$ y = [18, 0, -2, 7, -10, -2, -4, -4, 10, 6, -6, 4, 3, 4, 0, 3, 7, 4, -7, -14, 0, -11, -6, -3, -2, -6, -5, 0, 2, -6, -4, -13, -12, -11, 0, 2, 1, 0, -4, 0, 4, 0, 8, 0, -5, -4, -3, 6, 13, 10, -5, 5, -1, 1, 2, 0, 2, 3, 2, -5, -2, -1, 3, -10, -6, 1, -5, 4, 2, 7, 11, -16, -9, -7, 2, 8, 5, -8, -6, -1, -8, 5, 1, -4, 0, -5, 7, 12, 17, 7, 7, 9, -1, 0, 2, 5, -2, -8, 2, 9, -4, -7, -4, -6, -3, -4, -10, 1, -8, -3, 0, -1, -5, 1, -1, 0, -2, -11, -1, -7, 8, 10, 1, 10, 1, 0, 6, 4, 3, 3, 0, -8, 5, 10, 2, 5, 2, -12, 5, 5, 5, 10, -1, -6, -14, -4, 2, 3, -8, -11, -4, -16, -5, -1, 4, 1, -5, -3, -15, -15, -2, 9, -7, -8, 4, -6, 11, 7, 1, -3, 6, 5, -5, 9, 10, 10, 4, 1, 3, 4, 6, 6, 1, -3, -2, -2, 12, -8, -13, -5, -6, -5, -15, -1, -4, -10, -13, -3, -3, -6, -5, -3, -5, -8, 4, 7, 11, -1, -10, 3, 0, 9, 13, 10, 6, 2, -5, 3, 0, 3, 14, -10, -14, 0, -9, 1, 1, 4, -10, -11, -10, -8, -3, -7, -2, -2, -10, -9, 8, -12, 4, -2, -6, -6, -4, 4, 0, -3, 1, -8, 0, 0, 8, 0, -2, -6, -5, 6, 12, 9, 1, 2, 1, -5, -2, 4, 4, 3, -5, -10, -6, -1, 3, -4, -3, -12, -7, 1, 6, -9, -12, -23, -13, -9, -5, 4, -9, 6, 0, 1, -9, 0, 5, 4, -5, -7, 0, 5, 2, 10, 16, 1, 0, 8, -4, -6, 12, -1, -2, -8, -1, 6, -1, -6, -8, 5, 1, 2, -2, -4, -2, -3, -8, -3, 14, 3, -10, -13, -6, -2, 0, 1, -11, -3, -2, -2, 5, -5, 0, 5, 2, -12, 0, 7, 14, -1, 1, 0, -3, 6, -1, 6, -8, -13, -1, -5, -5, 2, -3, 2, -11, -8, -7, -8, 3, -10, -11, -19, 8, -2, 3, 4, 0, 8, -4, 1, -2, 7, 1, 5, 2, 9, 4, 6, -1, -2, -2, 8, 8, 2, 4, -2, -1, -2, -5, 7, -5, -3, -2, 3, -10]
4627a0PNpPj3OmJ8j3MJMj2OQjJrLnJ2oJ4j2mkNJ9r%%j1kJ3j5QmOnljRKj3JlJ%
4675dlkM%OKj0R%Lj2j1K1qkKK%jkJ2j3J5lNmnJ3rj6J4nJ0kj0Nj1mQj6K2nlj1K5
4720FnKjlj3LLKJ7j2joJ5%nkjmLJJ1qkmK%MpMkJoNLj3RJoOnPLql%J3%mnjKJ1K
4773Ij2J4mmrJ1kKkKoMoJ2mMj1JJlKjmMmJ2nlKj1MjJ4nllmlK1qPnOjmjpJ5lj4
4823fJQmPLjj0NOj1OqJkjkPJmnnKLOljoRoRjLoNJjJ0j7K2k0J3%J0j1nNJqPjPj1
4875BmOnjJ1j3kLKoJ1nj2KNMJlNJj2%P%L%Rpj7J9l%J4k6OJ2j5P%J2j7qJ6Njj2
4921fQj8PKkK0k3oLJ1ll%QqoJ9nQj3LNjRlKpoLRqJ2j0nLPK%%qqRqJKRj2jQqJ6
4972Hj1Nj1lNjlJ4j0OoJ2Lj3RmJ1lL%oLloJ0Oj2kJQj%j9J6j3j0J1J1%j0KLqJ3
$$ y = [-10, -3, 2, -5, 2, -11, -5, -9, 9, -4, 0, 1, 5, -7, -1, 7, 6, 7, -2, 1, -4, 8, 2, 16, 4, 0, -2, 3, 22, 13, 13, 13, 2, 0, 13, -2, 6, 2, 8, 3, 0, -1, 8, 10, -3, -2, -5, -4, -4, -7, -9, -5, -5, 1, 3, -7, 2, 2, 5, -7, -18, 3, -5, -7, -5, -3, -3, -4, -6, 6, -7, 8, 5, 10, 6, 1, 14, 5, -11, 3, -2, 8, 6, -4, 1, -10, -14, -6, -22, 0, -5, -8, -19, 6, 1, 3, 2, -1, -14, -11, -8, -6, 11, -1, -2, -8, 7, 7, 2, 0, -1, -5, -2, -1, 10, 2, 0, -4, -2, -2, 2, -5, -1, -3, -2, -8, -3, 0, -13, -4, -3, -9, -3, -8, -1, 2, -6, -9, -9, 4, 4, 0, -5, -6, -4, 7, 9, -3, 11, 7, 3, -6, 5, 3, 5, 3, 5, -1, 3, -3, 9, 5, 9, -2, -1, 0, -3, -1, -2, -6, -2, -6, 6, 1, -2, 0, -11, -7, -8, 6, 1, -2, -5, -9, -12, 9, 1, 8, 3, 9, 8, 4, 3, -4, 11, 8, -6, -5, 3, -1, 6, 9, 8, -2, 3, 9, -2, 4, -4, -3, -5, -6, -8, -1, 0, -4, -9, -14, -12, -9, -3, -6, -7, -13, -4, -10, -1, -2, 1, -5, 0, 1, 0, 10, -7, 15, -5, 8, 8, 18, 7, 2, 7, 8, 0, 7, 6, 13, 2, -2, 4, -1, -2, 9, -4, -6, -3, -1, -7, 4, -1, -13, -11, -6, -2, -1, -4, 1, 2, -10, -10, -3, -3, 0, 0, 9, 2, -15, 4, 1, 1, 15, -11, -5, 7, -8, -1, -1, 11, -6, -14, 2, 7, 6, -6, 2, -16, -9, -7, -9, 11, -12, -18, -15, -4, -7, -10, -10, -2, -10, -16, 3, -2, 6, -7, -4, 1, 0, 9, 6, 8, 1, -5, -2, 7, -1, 11, 1, -4, -1, 6, 8, 8, 8, 0, -8, 1, -7, -6, -4, 5, -7, -8, 0, -8, 8, -3, 2, -9, -12, -7, -8, -11, 3, -7, -1, -7, 5, 8, -5, 4, 0, 11, 8, 11, 11, 5, 8, 5, -1, 9, 15, 3, 1, 2, 10, 9, 9, -10, 6, -7, -17, -6, 5, 5, -5, -3, 0, -8, 5]
5016EnnRj0KNnMJ3j3MqJLQLpnJNj%KoqJ3Qpj1PLkpNPj6Rj2JjLJ0nKkjkJ1Nj4j4
5067a8J2%J0lJ0j0jlJ1lm%kpQKMkmMj9J4J2%j5lm%J0MooQqkJ3lJnlRj3J3jLJk
5114BLpJKLKnmJ3Mj1qqJ4J%Mj1N%LoLlkmOLJ1j1j1%NLNJ3k7J1rJJ4%nk%LjJ5m
5163A1Mk3PJ%Qj4OkKPrJkjQqjLQj6J0rlPORj0pMkJ1%kkJpJ3%Nj8MRMjqLjPp%o
5215@Okj0MnJ2k%%opJ0KnOklJ%J1Kj5oJ4oJ3j0Oj5J5mkO%jj5JJ5nknjMPjkLJj8
5264a1NjKNOj3KmQLooJjPLMJj5J2J2j%opM%l%Pj0%RnkjPqkoRJ1mjorKKkJ0rqj
5317a6J6l%nOLPrPjjKoMoJ0Kkjj6QLJRj5LoJ0OlnrMjKJj0MRj1lJ9mlRj4jJ7k3
5366a2QPqPRNj2kjoPMJ1mj2Oj1%RnqRplQml%PrNRkjrKPnLOj2J0j0lLKRKj2jOm
$$ y = [5, 0, -5, 4, -6, -4, 1, -4, 0, 13, 0, 4, -4, -3, 0, 8, 11, 4, -1, 0, 5, 4, 4, 6, 0, -8, 5, 13, 6, -5, 2, 5, 3, -4, 1, 8, -8, 1, -11, -10, -11, -8, 2, -3, -1, -3, -4, -6, 5, 10, -4, -18, -6, -6, 4, 1, 11, 1, 0, -3, 8, 5, 1, 1, -1, -8, 0, 2, 6, 4, 0, 4, -15, -1, 11, 11, -4, -7, -11, -11, -1, 3, -3, -9, -1, -9, -11, 2, -1, 0, -5, -8, 1, -12, 1, 0, 3, 4, 2, 5, -2, -1, 1, 4, 6, 1, -3, 10, 14, 3, -5, -13, 1, 2, 2, 6, -5, 0, 0, 3, -3, 0, -3, -5, -9, -3, 0, 11, 0, -11, -11, -6, -3, 2, 15, -12, -1, -10, -9, 5, 5, 0, -2, -2, 1, 0, 15, 11, 15, -8, -1, 0, 0, 8, -6, 0, -2, 0, 7, -2, -1, -3, -4, 4, -4, -5, -2, 6, -10, 0, -9, -12, -5, 1, 10, 0, -7, -3, -5, 6, 6, 4, 2, 3, -4, 9, 9, 14, -4, 0, 9, 13, 12, 4, 7, 6, 13, 6, 6, 0, 6, 4, -6, -2, -7, 5, 3, 3, 3, -3, -10, 0, 2, -3, 3, 1, -2, -1, -1, 10, 12, -3, -9, 5, -1, 12, 2, 8, -7, 8, 4, 2, 8, 8, 7, -8, -7, 8, 3, 1, -4, -5, -1, 6, 5, 3, 6, 7, -11, -6, -7, -5, 0, 6, -7, -5, -9, -1, 2, -4, -10, -9, -10, -3, 0, 4, 5, -10, 2, 14, 13, 13, 7, 0, 4, 4, 1, 1, 8, -2, -2, 7, 2, 0, -1, 6, -2, -4, -10, -1, 10, 6, 5, -1, -10, -8, -6, -8, 2, -7, -15, -16, 0, -3, -3, -8, -2, 1, 8, -1, 6, 5, 4, 6, 0, 4, -2, 8, 10, 8, 7, -9, -1, 2, 3, 12, -3, 0, -6, 4, 10, 7, 2, -7, -3, -4, -2, -1, -11, -7, 2, -9, -12, 7, 3, 0, 9, -5, -6, 11, -12, -4, 3, -5, 2, 11, 16, 4, 2, 1, -5, 2, 6, 17, 13, 1, 7, -4, -4, 5, 0, -8, 1, -6, -9, -1, -5, -8, -8, -1, -10, -5, 4, 2, 1, -8, -6, 1, -4, -1, 5, -7, 3, -7, -10, -7, -5, 4, 6, -6, -7, -1, -5]
5418eRkp%NqJ3onmmMOnjlpJ4rJ0MlLrLmJ2qKQqnOJ5mk4RJ0mMQj3j2K1plOOj6P
5468aPj6K2oj5LjojRJrOnOMjr%J8j4KJ0Nj3J2llNmLmlNm%QmnpjJJ8%lrkKllkN
5520eJoJ1mMkpJPmQmoj0J9%J2j4Kmj0J3J0kj0njPpJ1Opj1J3rNrJ1roMPj6J2kk
5566hMoQL%nOj2LJ0J8j5mJqNJQj4ONmOkkk%j%J0lKnj2MN%k0QMKnJ0kk%nM%%nO
5618clRllMJ3kqKpRKnllP%lpJ3j5NKkNKj9PRk0RJ0j2QkPpRnJ1k0J4lQoj1MPrK
5668cJ5jnj1J0Qj4LJj3J7j4J8lj1KrJ%%OKJlj1NJ4qkoKJ2OpLrMQJN%rqJ1L%lK
5716A0qMrJ3kj2NNj0MKoQqkPj4J2%%jjOl%mLpRkNmNj4J3qMLJ0nNj0JkPlmOj8R
5766anJ0Pj2lmLJQkj0kMRmjkJ0jpLNnKnMRlnmJPpJ1JrJLpkJ5mj2OlJ6j9J0qj1
$$ y = [-5, 4, 2, -5, -5, 0, -8, 5, -1, -6, -10, -14, -10, -4, -9, -10, -13, -20, -6, -15, -5, -1, -4, -1, -10, -7, -11, 1, -7, -5, 3, -5, -10, -4, 11, 7, -17, -8, 2, -2, 2, 10, -3, -15, 6, -1, -4, 2, 8, -8, -1, 6, -10, 12, 6, -9, -6, -7, -13, -14, -5, -4, -13, -7, -12, -6, -2, -3, -12, -12, 6, -8, -6, 4, 9, -4, 8, 5, 2, 7, 3, 6, 2, -1, 4, 0, 0, 8, 4, -1, -8, -9, -8, 10, 10, 7, -2, -4, -2, -5, -8, -10, -5, -4, -10, 1, -3, 1, -1, -8, -7, 0, -4, 4, 0, -6, -16, 3, 3, 15, 1, 3, -1, -11, 2, 12, 10, 0, -5, -6, 1, -6, 5, 11, 4, -7, 6, -3, 2, -7, 4, -5, -11, -7, 0, -16, -4, -6, -8, -4, -10, -2, 1, 1, -4, 2, -10, -7, 3, 21, 6, 2, 3, -5, 0, 1, 9, -5, 1, 6, 2, 8, 6, 4, 2, 2, 1, 1, 11, 8, 10, 5, -7, -3, 2, 2, -18, -10, -6, -4, -9, 1, -1, -3, -3, -8, -4, -4, -4, -9, -3, -6, 3, 0, -3, 1, 14, 12, 4, 6, -1, 8, 10, 5, 2, -1, 6, 6, 3, -4, 9, -6, -1, 1, -1, 4, 6, -13, -6, 3, -17, -8, 2, -10, -2, -4, 3, -4, 5, 0, 11, -9, 5, 2, 10, 4, -7, -3, 4, -5, -3, 12, 11, 6, -5, 5, 13, -1, 2, 3, -10, 7, -7, 11, 8, -3, -1, -10, -9, -9, -9, -3, -1, 0, -3, -14, -9, 5, -3, -5, -11, -9, 3, 9, 2, 5, -4, 0, 8, 9, 14, 14, 5, -3, 8, 11, 11, 8, 10, 2, 6, -3, 10, 8, -4, 1, 6, -4, 0, 2, -4, 4, -4, -6, 1, -13, -1, -1, -1, -2, -3, 3, 0, 0, -4, -1, -8, 1, -1, 4, 0, 5, -9, 4, -4, 0, 3, 13, 8, 13, 3, 4, 2, 9, 6, 2, 8, -10, -1, -6, 4, 11, -1, -4, -8, -5, -4, 4, 2, -8, -10, -6, 3, -1, -2, -4, 6, 5, -2, 1, 6, 1, 3, -2, 2, 11, 8, 3, -1, 0, 7, 0, 11, 12, 3, 4, 7, 0, -2, 13, 9, -3, 3, 0, 16, -3, 7, -1, -12]
5816a2%J8k0J6j3QkoJ2nOooOKj0J4ljoJ5pMPlPj0%MrJjrkONNj0PJj4J1j%pkLL
5864dlJ0kNj5PNjMoMJoQR%rKkJ0mj4J0pjlJ3km%pj0RjOmKnkpJ2Nj8J2%QnkJk%
5915coQRkoOmjPLmNjrKNjlqlQrRmNnpPjRpj1mRMkKNNq%nJ4%rLL%%lMrJ0j2MJ2
5971A1j0O%j1%J3rkRj6QojJ9oj3NLj0QLkrNOmQrJ2nJJ1j3mjJQK%N%pJkQqLj4J3
6020Gj5J0mMRrmKoLKKj1MJjMRj9QJLRMlmrJOMLj2Po%QLoklPmj2J5Jj2pKQJKj0
6072iJNJKOopQLnPj6NJML%Rj2%lQj2J7j0jOrJ0kpNkpNqJ5j0Kj0J9j4J2mmkj0J1
6120enJ4Moq%L%j%MmlJ4j5NKJ2j7J3qOJ3k0kPLj5J2oKj5J3lJ2lmMrJnJ%OqQNj7
6168a5J1kJ3KrMnKJ1j2kmJ1pmPokJ2j2ORk0J5j1MJKpkOkROk8J9pL%klJ2j2J1J
$$ y = [-12, -12, 6, -14, 2, -11, -3, -5, -11, 1, -4, 2, -4, -10, -4, -2, -12, 2, -1, -2, -8, 7, 0, 4, 11, 8, 15, 5, 5, 9, 0, 1, 0, -9, -11, -5, 0, 5, -5, 2, 3, -11, 0, -1, -1, -8, -10, -7, -4, -7, 3, 1, 6, -9, -2, 3, 2, 6, 0, 4, 5, -1, 7, 16, 16, 7, 9, 7, 17, 13, -1, 9, 2, 1, -2, 11, 9, 5, 5, -2, -12, -3, -4, 2, -2, 0, -5, -7, -14, -2, 3, -15, -3, -3, 5, 0, -2, -1, -3, -3, -9, -1, 8, 6, 0, 6, 2, 1, 8, 11, 7, 12, 11, 2, 4, 9, 8, 5, -3, -6, 2, -7, 2, -2, 3, -2, -9, -2, -3, 6, -1, -12, -16, -7, -3, -5, -3, 2, 7, -1, -1, -6, 8, 8, -1, 2, 5, 5, 5, 2, 6, -3, 7, -5, -1, 11, 1, 7, 7, -4, -4, 9, 0, -2, 7, -9, -1, -7, -8, 11, 5, -8, -3, 0, -10, -2, 1, -1, -10, -5, 1, -3, 5, -4, 8, 3, 4, 15, 2, -2, -3, -2, 6, 8, 8, 13, 13, 6, 7, 5, 13, 5, 8, -6, 7, -8, 2, -2, 2, 11, 2, -2, 0, -6, -3, -1, 1, -10, -6, -5, -6, -2, 7, -12, -4, -3, 0, 9, 13, 10, 6, -3, -2, 4, 8, 11, -1, 6, 0, 0, 8, 11, 5, 3, 0, 7, 3, -9, 6, 7, -5, -12, -10, -2, -1, 1, -9, -8, -3, -2, 0, 6, 0, -7, 1, 4, -1, 6, -10, -5, -4, 0, 3, 3, 12, 0, 0, -3, 5, -7, 10, 0, -1, 5, -4, 6, 4, -3, 2, 0, -7, -2, -10, 5, -5, -3, -13, 6, -8, 4, 0, -4, -6, -16, -5, -10, 4, 8, 2, -6, -6, -3, -3, -4, -4, 0, -4, -7, 7, -8, -3, -1, 11, -6, 7, -1, 5, 18, -2, -4, 3, 6, -9, 3, -3, -1, -16, -3, -6, 6, 3, -1, 3, -6, -5, -10, -9, -9, -3, -11, -3, 2, -15, -4, -6, 7, 9, 0, 4, -1, 1, 12, 0, -2, -6, 5, -2, -6, 1, -5, -7, 5, -7, -1, 8, -12, 3, -8, -4, -3, -1, -8, -10, -4, -6, 3, 9, -19, 0, -7, -4, -4, -6, -9, 3, -9, 2, 3]
6213CnQLlnQLrQoNj1P%Rj5lKoJJ1Pj1k2K1jJrLMj0N%QKoRj0%RpQqJJ6j5JPm%j2
6264hJ6%mLkqNkJ2j6Rj1J1jj2MKj0j1POPpjjPqJ4l%okPpJ3lJ0rJqJ4NrJkJjPq
6313BOjpkMJ%Kj1nNQJj5J4ojMlQj2NknOlJ6j3Mj0J3JQo%j1J9rmLkNj1J0j0J0j1
6360eJ6j6J1j0jPpMlqOJ2oPj1mkQOljMpPMK%njKMmlJ3qj4lJ9j1kQj0OnJ5pqMo
6409fKqJ1%jqJMqJ7qNJrJ1mj%KL%O%%pJKM%pjmMOj%kMj0jmJ1r%mJ0pNJl%MLj6
6463a1K0j7MRrLpJ4nQrmjJ7j%krRklKkKlmOjlJlpRnpJ3rLkMJKJn%OLkJOj5JJ2
6516ImKmOrLMKlMj7QpKPqJ1okKoJlj2J2lR%oJ0rpJ2%KQLj4PLmNm%mJ0Jjjlj4R
6568AJ%NqMpJ6j2KrjLQj5J0Nj4jJ7Lj4O%MJj9J9nQk%jNlkRj6J5rKJ0j1KrMlRK
$$ y = [3, -2, 6, 9, 6, 1, 9, 12, 3, 11, 5, 10, -1, 6, 6, 15, 0, -3, -1, -7, -6, 5, 12, 1, -21, 0, -1, 0, -9, -6, -2, -12, -7, -7, 1, 3, -3, 6, -4, -4, 5, -2, 6, -2, -1, 15, 0, 1, 8, 4, 4, -8, 8, 8, 4, 7, 5, -3, 2, 0, 12, -4, 5, -6, 5, 4, -8, -4, -2, -12, -23, -16, -10, -3, -10, -11, -12, -5, -13, 1, -2, -2, -8, -10, -3, -10, 3, 0, 10, 1, 2, -6, 8, 13, 4, 5, 3, 4, 3, 10, 2, 8, 7, 0, -2, 2, 3, 3, 5, -6, -11, -6, 2, 3, -12, 2, -4, -5, -1, -4, 4, -8, -3, -5, -10, -4, -7, 9, -4, 0, -10, 3, 4, 12, 6, 6, -5, 14, 5, 1, 4, 2, 7, -4, 6, -4, 6, -5, 11, -5, 6, -4, -5, 2, -5, -1, -4, -12, -6, 6, 0, 7, -4, -8, -10, -2, 4, 1, 0, 4, -3, 4, 8, 10, 10, 5, 4, 6, 10, 6, 3, 16, 8, -6, -9, 10, -1, -3, 5, -5, 1, -4, 11, 4, -4, 0, -6, -4, -12, -1, -1, -2, -10, -9, -5, -13, 4, -4, 1, 2, -7, 4, 0, -1, -1, 1, 4, 4, 10, 10, 10, 3, 4, 6, 10, 10, 3, 2, -2, 2, 8, 7, 7, 5, 9, -1, -2, -6, 5, -4, -4, -8, 2, -5, 0, 1, -2, -2, 2, 5, -11, 9, -8, -4, 5, -4, -1, -8, 6, 1, 9, 0, -4, -5, 12, 11, 11, 9, 0, 9, 7, 4, 6, 4, 6, 3, -1, 5, 4, 1, 2, -1, -8, 1, -4, -11, 2, -7, -4, -6, -2, -1, 1, 2, -3, -3, 3, 6, 4, 5, 11, -4, -3, 9, 5, 7, 3, 9, 0, 3, 7, 9, 6, 10, -7, 1, -6, -4, 3, -5, 6, 0, -2, 0, -6, -5, -8, -20, -8, -11, -2, -2, -8, 2, -7, -14, -2, -2, 0, 8, 11, -3, 4, 7, 3, 8, 4, 4, 0, 10, 11, 10, 9, 6, -8, 1, 2, 2, 7, -1, 3, -4, 12, 0, 2, -7, -8, -5, 3, -12, -2, 3, -11, -12, 5, 8, -6, 0, 0, 4, 5, -14, 5, 0, 8, 6, 6, 5, 10, 7, 5, 14, -2, 13, 4, 6, 16, 5, 7, -2, 2, -1, 8, 10]
6616A0j6LKjmJ7rKNk2J7lJK%nnlPjR%JkpJ4jmlNj1OjKRppPjMqlJjN%ppMRj0J0
6668Cj2J3rnJ1qJ6j1NoOlJ3kqKJ2rnJ3rkOnqJ1mKllJ%LpNj2JjQpPRqkqK%J2j0
6717fJJ2MqNKoJOLj0MmpJJ0Qj4J4j6kRpJJ3k2MRp%rJ0rJ1%oNmnmJJ4j3RJMnkJ7
6766A3j5J1jj0KNM%lm%OjQqnjkMk%jnKJ1jppOpJ0Knj2%J2kNnJJ1%nQnlOPnoj2
6817fJ2rJ1%Pj6JLNrPLj2KLLlJ0j1mJ0Nkj4MQqPpJnjJ6lOmj3J3JoLjM%j0NKlQ
6866A3nj5J4j0J3plMrpJ6%mJ1j1koJ3nJMkLKojPRrj1J1oQoNPj4Pkjk%mJ3j3jL
6913BMlNj2jK2j9nLLJJLMJj4NKlmjRMjKKjLpLPqOnJjmJ0j1NqlNoKqMoMJ2kKJj0
6967eLmJ7j3NPj0pP%kJ5lnOnJLKpLKJ0mLj0jnKjjOj2nJOm%OmMjk%KjM%MKOnmK
$$ y = [10, -6, -3, -1, -2, -6, 11, 2, 4, 9, -13, 4, 1, 2, 4, 4, -1, -6, -9, -2, -3, 6, 6, 7, 5, -2, 12, 11, 7, 4, 9, -2, 4, 3, 5, 14, 7, 0, 7, 6, 10, 2, -1, 0, -1, 4, 4, -3, -10, -6, 3, -7, 3, -9, 4, -5, -10, 1, -7, 9, -2, 3, -3, 3, 0, 13, 11, 3, 5, 17, 8, 3, 16, 7, 5, 11, 6, -2, 9, 5, 7, 4, 1, 2, 2, 5, -2, 3, -9, -8, -9, -1, -8, -1, 8, 0, -2, -10, -8, -8, 4, -6, -5, 7, 11, 3, 8, 10, 4, 5, 11, 14, 4, 8, 4, -3, -2, 8, 16, 2, 16, 0, -2, 7, 0, 1, 14, -8, -4, 5, -2, -2, -11, -1, -10, 1, 1, -5, 0, -4, -9, -13, -12, 2, -11, -2, -1, 3, -2, -4, 13, -2, 9, 8, -2, 0, 5, 9, 9, 6, 2, 2, 8, 7, 15, 7, 2, 1, -1, 3, 1, 1, 0, -5, -3, 8, 7, 0, -7, -1, -8, 2, 4, -1, -13, -13, -1, -3, 2, -3, -2, 9, 9, 4, 12, 7, 4, 10, 17, 12, 6, -6, 6, -3, 8, 8, 15, -1, 0, 3, 8, -1, 6, 9, -3, -1, 2, 5, 2, 12, 1, -3, 7, 12, 10, -4, 0, 8, 0, 7, 0, 1, -4, -5, 11, 8, 14, 10, -3, 10, 11, 5, 8, 7, 11, 11, 1, 6, 8, 5, 13, 8, -7, 7, -3, 10, 3, 0, 4, -5, -12, 4, 4, 0, 11, 0, -2, -8, 5, 0, 1, 5, 3, 6, 8, 2, 1, 8, 17, 8, -3, 8, 2, 10, 4, 9, 16, 2, 9, 7, 6, 4, 4, 0, 13, 0, -1, 2, 6, 3, 8, -4, -5, 17, -2, -7, -4, -1, 0, 1, 4, 8, 9, -5, 0, 2, -1, -5, -6, 3, 7, 6, 8, 10, 9, 12, 5, 8, 15, 7, 13, 8, 9, 8, 4, 14, 3, 8, 0, -3, 2, -4, -2, -10, -6, -12, -8, 4, 2, 4, 5, -5, -2, -6, 11, -2, 3, 10, 0, -7, 0, 0, -2, 13, 10, 5, 11, 6, 7, 10, 12, 5, 8, 10, 20, 16, 19, 9, 8, 3, 5, 4, 3, 9, -3, -8, -7, -1, -5, -5, 1, -3, 1, 0, -2, -2, 0, -1, 3, 3, 7, 9, 15, 10, 6, 8]
7021HnJ0nJLjkNnONk2J5%jKnJ4j3j0ONnJoJ4k0LNJ2j3jKpJ4qM%%kRNoj0J0Pml
7069A2PKlrRqPrLj0LJ1rJkOj5J8Lj7QoJMj8MJ0PnoKKkJ2j0olJ2pNQ%lpKJ0KrK
7118IqJ3j1MkJ4k9J3%j0O%mKRj0QnNo%PnKKj2J0KJJMj9K7rkJOpO%j4RnKkMonO
7167Bl%KrNrJ6kLrKJlNLNj2kJ5j5LKNOj3NKMMljqMOmnLjj5J7LNppJjMmKrmNJ4
7220Hnj0J4j6MMNRj3JJ0omJ2j4PkPJJ1j0qOlqPo%KOmp%KMnplNNKjmNqlJ0JqKR
7271DKKlj5RLJk%J1KqkkQoJq%MmKJ0oplJ2rLPllj2lK9j3lRnklJ2Kp%j5K0qJ6n
7321A2nM%koJ0J4k0%RqJ4k8J2ppMkJ3lpRj7J0rJ1jmOnJJ0onN%QoLMnpPjQqKlj0
7370fJ1OqklKKk%Rj0pNnkLJ0rl%OOJrQJmJJ0nj2J6%j2K%J%KKLOmnmjRrJ1pOj0
$$ y = [8, 3, 13, 8, 9, 12, 11, 9, 14, 9, 15, 20, -2, 13, 13, 12, 14, 9, 23, 10, 0, 6, 11, 6, 7, 1, 15, -5, -2, 3, 15, 2, 1, 3, -4, 10, 2, 6, 6, 6, 4, 13, 18, 12, 2, 12, 19, 15, 12, 19, 21, 18, 9, 18, 10, 17, 8, 11, 1, 4, 15, 6, 7, 5, 11, -4, 14, 17, 0, 8, 2, 3, 7, -11, -7, 3, 10, 5, -1, 1, 3, 1, 13, 3, -3, -6, 6, -1, 4, 12, 12, 9, 2, 4, 14, 16, 7, 9, 1, 14, 3, 7, 5, 19, -10, 3, 3, -7, -1, -1, -5, -3, 6, -4, 4, -1, 4, -2, -2, 5, 0, 2, 4, -8, 2, 4, 5, 6, 10, -9, 18, 9, 7, 8, 14, 7, 13, 13, -1, 8, 3, 5, 3, 7, 1, -4, 2, -1, -1, 1, -8, -3, -12, 4, 2, 5, -4, -2, -1, -4, 1, 4, 9, -3, -5, 10, -5, -2, 0, 5, 11, -2, 3, 5, 9, 13, 10, 9, 1, 5, 11, 7, 2, 5, 4, -11, 6, 9, 14, 7, 0, 1, 0, 4, 0, 2, -7, -11, -6, 8, 3, -7, 7, -9, -5, -1, 4, 13, 0, 1, 11, 5, 1, 13, -1, 6, 4, 11, 12, 23, 13, 5, 11, 8, 0, 7, 1, 1, 3, 9, 5, -2, -2, 0, 4, -1, -8, -11, -6, -1, 1, 0, -4, 1, -7, -10, 0, 1, -7, -5, 4, 6, 8, 5, -10, -1, 2, 3, 1, 1, 12, 14, 6, 4, 2, 10, 4, 5, -3, -3, 1, -3, -1, 9, 3, -4, -7, 5, -4, -1, 6, 3, 0, -12, -15, 14, 1, -2, 7, 2, 0, -3, 9, 11, 4, 4, -11, 9, 1, 17, 12, 7, 11, 11, 9, 3, 13, 27, 7, 7, 16, 8, 22, -6, 6, -1, -8, -4, -6, 7, 4, -3, 6, -11, -1, -10, 1, 0, -4, 2, -3, -2, 8, 2, -3, 2, 2, 10, 4, 7, 11, 6, -1, 6, 5, 13, 5, 7, 4, -6, 5, 11, 3, 1, -2, 0, 2, 0, 0, 9, -1, -8, -3, -8, -10, -7, 3, -6, -9, -9, -3, 3, 4, -5, 3, 4, 0, 1, 11, 6, -6, 10, 10, -2, 0, 0, 1, 1, 3, 5, 8, 14, 10, 5, 1, 0, 9, 0, 11, 4, 10, 0]
7422@J3j0Lpj1J1L%jNloJ0Mj8kJ1J%mMKpJ2k%ljKKpJ1qMKlLlj0J1j1JjQrMLj1
7470hJ1oLjOj2QkMknKOkmKkQkkJ9j5NPj3MLj0K%kNOrOj6J3Kj2RqNnJNoJPjj0P
7521BnjpK1j1nJ2KJmPj2JKoJ1rLO%oJRp%pJ1j1mJ1j2NkjlM%jjPKJ1j6KKPj4J3
7569HmRonlJ7j7ORJmnMKmrQmmKJ3rqMnNRnp%L%J%kPJomJ0j4J2Kj%QqMkqPlmLJ9
7624B3qj0%LN%Nj4Oj0OJnoMjMnkK%JnNkJ3j2PjK%kjPj0%QPlKoQqLJ1j2noR%J1
7675A9j5kkKJOkq%NJj5PMJ3lmoOoJ0jmnOk%KNj4PKj1J1Nj2J3j4PNKj2kO%olKk
7724dP%Jl%Mo%mjJ9j4nlRpJ9pkLmLJ1qpOj1LJ2pLJqnJ2%Nj6KmnPMJOj2kjLNLp
7776dMJj6K1qO%j%KOjj2J3KlPjj1J0j0LLmkkKj3PJ2pnm%JkPnlLmJ0qJJ3j2NKL
$$ y = [0, 13, 3, 6, -1, -12, -1, 2, 2, 1, 6, 3, -3, 7, 11, -7, -9, 2, 3, 3, -1, 3, 5, -2, 10, 8, 8, 5, 4, 6, 8, 1, 12, 4, 8, 10, 7, 10, 7, -3, 8, -3, -2, -3, 5, -4, 0, 3, -8, 3, -3, 0, -1, 5, -7, 1, -1, 3, 1, -4, -2, 4, 2, -2, 0, -2, 6, 4, 2, 21, 6, 11, 18, 5, 9, 12, 2, 4, 4, 2, 7, 13, 4, 10, -6, 7, 9, -3, 6, -2, 3, -2, -1, 4, -2, -1, 6, 5, -5, 2, -3, -4, -11, 10, -1, -6, 6, 8, 9, 5, 12, 0, 1, 3, -3, 8, -1, 2, 8, 8, 2, 3, 12, 5, 5, -2, 9, -2, -6, 5, -7, -2, -4, -5, -8, -4, -4, -5, -6, 1, 3, 14, -2, 0, 2, 9, -5, 8, 4, 13, 7, 2, -1, 16, -1, 5, 14, 15, 11, 6, 10, 12, 8, -1, 7, 3, -1, 1, 14, 5, -3, 1, -4, 1, 10, 5, -2, -2, 1, 1, 2, 2, 0, 7, 8, 2, -2, 8, -6, 6, 8, 7, 7, 15, 7, 11, 9, 1, 8, 5, 1, 4, 23, 15, 5, 5, 8, 13, 13, 18, 4, 10, 0, 6, 7, 2, -4, 0, -1, 3, -2, -4, -2, -2, -1, -6, -1, -3, 10, -2, 5, 4, 6, 6, 4, 3, 10, 0, 0, 8, 15, 12, 14, 8, 16, 8, 11, 22, 10, 5, -1, 8, 8, 19, 4, 2, 0, 2, 3, 9, 7, -1, -1, 4, 5, -10, -3, 1, 14, 11, 7, 1, 7, 1, 11, 10, 6, 1, 7, 5, 5, 7, 12, -2, 5, 7, -4, 7, 12, 0, 13, -1, 6, 11, 13, 1, -1, 5, 5, -1, -4, -2, -4, 3, 3, 4, 1, 1, 5, -1, -1, -5, -6, 13, -1, -6, -9, 0, -7, 12, 5, 3, 6, 2, 5, 16, 8, 1, 7, -4, -1, 11, 4, 7, 8, 0, -5, 7, 7, 12, -4, -2, -6, -11, -4, 0, 1, 7, -5, -7, -8, -5, 0, 3, -4, 0, 1, -15, 6, -2, 4, 4, 3, 3, 5, 11, 10, -2, 11, 13, 10, 17, 16, 5, 15, 5, 8, 11, 7, 5, 3, 5, -8, -1, 11, 4, -1, -5, -5, -4, -6, 1, -4, -7, -4, -8, 2, -6, -5, 8, -4, 1, 3, 6]
7825FpLJ%nJ1Mj3J3j0Pj2J6rknPjlpKLOrkoJ2ok%KJ0JrJ2j7KMnP%QKj4%MNkKn
7875aMKmNOj5jJ2j8J7qKpRJoLlmnJJ1J%kNkKjnQlloJ7Lj0pjM%QkpJ4r%mRj1Om
7927ALplJ6j0Rj6j%MLPLj7NPJmm%kPOmKJ0j3kMLjjnmmJ0J1j4N%pNRrpJ%J0%pO
7978F%qkJpNKoJ4rN%MlPj2KOM%l%nJ1kkj3J6lLj6RKpJ1j0JmNMj0J0lj0mJ4Lnj5
8027a4OpJ1lLOJRoj3OQm%OMoJJj2NJMJ0j3J0j7j2J1LJ0rMrrK5j2j0kJ4jjnkJ1
8072ClMJLrJ1pJoqJ2%P%pQ%oMmo%RjojNOj2lRj0lNLNnlJ3r%pMQjj3KJ2nJ5j8J2
8124IlqQMj5J0Noj0KOKKJjj1RRoj0NnJnJ3%j1JjMMLomMrJ8qJ0rNnM%Qj1%jJ2j1
8174CjJ0j2MJ1krJ3j5Kj1QQrQj3J3
$$ y = [6, -1, 2, 3, 3, -2, 9, 13, 0, 13, 3, 10, -2, 14, 5, 3, -2, 5, 4, 1, -6, -4, -1, 5, -4, -6, -12, 0, -6, -8, -8, -6, 4, 5, -4, 8, -9, -7, -3, -8, -1, -1, 7, 9, -5, -5, -1, 4, 2, 4, -1, 3, 5, 1, 6, 12, -3, -4, 8, -10, 7, -1, 1, -6, 3, 4, -2, 1, -2, -6, -11, -10, 1, 2, 2, 0, 5, 3, 5, 4, -1, 7, 4, 1, -5, 12, 15, 5, -2, -3, 1, 1, 9, 7, 0, 14, 5, 5, 1, 10, -1, 5, 1, 4, -3, -6, 10, 0, 9, -7, -8, -8, -4, -1, 6, 9, -8, -3, 4, 5, 1, -3, -3, -5, 2, 8, 4, 6, 16, 3, 1, 5, 8, 7, 6, 1, -3, -7, 3, 14, 0, 5, 5, -2, 3, 12, 3, -4, -3, -3, 7, 7, 0, 6, 6, -2, -4, -3, -10, -5, -3, -9, 5, -4, 1, 1, 5, 2, 9, -3, -1, 5, 9, 9, 6, 6, 1, 12, 10, 8, -5, 11, 8, 11, -5, 4, 6, -1, 10, 0, 1, -3, 2, 6, -4, 6, 3, -7, -11, 3, 6, 1, -14, -8, -15, -4, -7, -4, 2, 3, 12, 6, -7, -1, 7, 3, 3, 9, 13, 7, 8, 9, -3, 2, 3, 7, 17, 4, 14, -3, -15, -4, -1, 9, 0, 4, -5, -14, 11, -1, -11, -13, 1, 0, -1, -6, -8, 3, 0, 4, 5, 8, -1, 10, 3, 4, -2, -10, 2, 2, 9, 9, 2, 10, 10, 4, 8, 4, -2, -2, 7, 6, 0, -1, 4, 10, -2, -5, 4, -6, -9, -4, -1, 4, -1, -4, 9, 0, 0, -7, -3, 5, 4, -9, -7, 5, 0, 15, -3, 9, 6, -2, 6, 10, -5, 5, 10, 4, -6, -4, 2, 4, 6, 7, 6, -5, 4, 13, 7, -3, 2, -3, -2, -7, 6, 6, -5, -4, -5, -1, 3, 6, 0, -4, 0, -9, 9, 1, 11, 2, 7, 2, 6, 6, 14, 3, 3, 2, 14, 3, 2, 12, 0, 4, 15, 13, 4, 17, 2, 4, -7, 1, 9, 0, 8, -5, 8]
8191H
$$ Imaginary data points
##PAGE= N=2
##DATA TABLE= (X++(I..I)), XYDATA
0@%%%%%%%%%%%%%%%%%%%%%%%%%%%%%%%%%KoJ0j4J6j6J6j6J6j6J8k0K2k6L0l4L6
50A8l8M0m6N3n7O4p2Q0q8J00j17J37j64K01k52L34m79P67j560P482K1585k7736
72B52j7676K5457Q746j8990P2J0040p455l182O979q525p247J4832K669j9413L171
87a0270K0637q374j7366J5203J6568j4140j0792J1780N095o563P58R95n970Q38
101a601M022n421j772P362l143r325O803R430q193o166J0683N581q250l677M684
116A017L328J483k593p566O47Q960k272r426M054P130p341n312Q510L230o283
131b434P75L732l333P78N321m495m461Q629K284j2335p82J2469j500r945L719
146a578M571o838N63Q872m031p907O730M772q278k69Q940l494p535O158L978q224
$$ y = [0, 0, 0, 0, 0, 0, 0, 0, 0, 0, 0, 0, 0, 0, 0, 0, 0, 0, 0, 0, 0, 0, 0, 0, 0, 0, 0, 0, 0, 0, 0, 0, 0, 0, 2, -4, 6, -8, 8, -8, 8, -8, 8, -8, 10, -10, 12, -14, 16, -18, 18, -20, 20, -26, 27, -30, 34, -38, 42, -46, 54, -63, 74, -90, 111, -141, 193, -286, 481, -1079, 6403, 27988, 252, -17424, 8033, 16779, -2211, -2139, 7901, 446, -2736, 4243, -4282, -11529, 3303, 5972, -13441, -10270, 10367, 1993, -15373, -170, 16398, 2258, -8534, 3246, 8341, 1778, 2536, 3531, -2439, -1601, 2421, -3000, -4772, 2590, -553, -9878, -3075, 6355, -1838, -8004, 2679, 8260, 10, -3667, 1017, 4345, 5828, 3235, -4331, -3684, 5276, 3004, -6422, -2368, 4762, -2579, -7891, 619, 3849, -2434, -1659, 2073, -1260, -482, 4839, 344, -4117, 4512, 6796, -5539, -6321, 6148, 4648, -5297, -1578, 2993, -3845, -3282, 5590, 1559, -6348, 382, 5154, -3124, -3393, 5547, 2053, -5482, 676, 4654, -3570]
162c570l8Q969k911p402M710L675n784J165O504m760n981O080L163o400O55N803
178C878m460n061O095L151n861MN245k123l294L445J093k742K299J720n379j330
194c320N953j7n370J213K954l321j404L976M31k501J217Q19j862J736K740k526
210G18j395L317r37m379K284L879l526l085K946J33l105K091K906k772j297K908
226F86m56j461L458J105m288K97L971k524l342M173J770n676j240M445p79k984
242b845K644J452l454K96L354j220r23L440n80m273K103L815l436k455M221k3
258B116n545P47M675j597k941K137O39k309J431K367j750k80K538j679k697L385
274A237K489m090j633L611n50l842J547L148j880k000J151J35k08J941O0k199
$$ y = [-3570, -3608, 5361, 2450, -4952, -242, 3433, -2351, -1186, 5318, 558, -5423, 657, 3820, -2580, -1925, 3878, -582, -5643, 452, 3603, -2258, -2254, 2991, 868, -2426, 1019, 2112, -630, 1669, 3389, -1990, -3320, 2633, 2616, -2754, -1541, 1413, -1908, -3312, 664, 1095, -1406, -189, 630, -1232, 504, 3244, 718, -677, 2640, 1703, -2676, -392, 3487, -39, -3124, -178, -45, -3150, -1059, 1847, -925, -2222, 686, 230, -1231, 2227, 3332, -956, -659, 3312, 788, -2554, 1619, 3389, -2287, -3527, 918, 139, -2845, -201, 1251, -2203, -1907, 1447, 227, -696, 2744, 2164, -2109, -6, 3809, 373, -2082, 2139, 2116, -3429, -2682, 1993, 396, -2545, -408, 231, -2078, -647, 1720, -30, -310, 2228, 549, -2148, 1237, 3726, -364, -1997, 1614, 1064, -2778, -1231, 1917, 37, -1963, -812, -677, -885, 1056, 1116, -1083]
290a083R88J890k095q74L392K35l857L1K715j095j641J656M70j811P3O72p30J193
308A29J853k143k006K701J394k635K87K816j724k894K017J862j945l82J475j319
324e14j200J950K84j723J505J523k985j112L754O90l165O20K195k169j533K828
340I48P50k493J75J196j616k06K462n14k157J411J174k320LL107n24k650R83J339
358A068j742L6K278r03k202J024R34j353N50J679j484j498J739N90j601R46J768
375A829j813j572J919P33j596N70J297j665j227J620M83j102P13N37j827k33K132
392G98m4j459R96Q11j846l94K125J20j470M22M71j315j5J563k53j093N48J03j203
411a135N98J721n84j337O44N11q72K49J234l19j029L0J39j12N86L25q34l84L93
$$ y = [-1083, -95, 1795, -300, -1174, 2218, 2453, -1404, -1373, 1342, 247, -1394, 262, 732, -1079, -1006, -334, -1064, 129, 1982, -161, -2167, 534, 1928, -707, -420, 2396, 672, -2222, -205, 1657, -288, -670, 805, -514, -1714, 236, 520, -1203, 302, 1825, -1160, -2272, 1482, 2172, -993, -373, 1822, -347, -1880, 948, 1698, -795, -620, 576, -1040, -1246, 1216, 702, -1455, -44, 1130, -1190, -1187, 1920, 1396, -1254, -271, 1068, -674, -638, 1640, 737, -1465, -441, 493, -860, -310, 1369, -115, -1613, 126, 716, -885, 61, 1829, 16, -1556, 363, 1096, -500, 70, 1367, -298, -1525, 95, 578, -524, 189, 726, -1101, -1334, 798, 754, -705, 291, 1102, -744, -1138, 987, 1107, -363, 59, 530, -785, -800, 763, 510, -583, -35, 68, -1135, -537, 1184, 600, -737, -93, 418, -454, -205, 1029, 710, -319, -289, -150, -262, 324, 649, -185, -569, -176]
430a76j79j08R00K65r44l09M21K6K79O03m70p87M04K48o40N41J103r88j421Q49
450c83R13p64K9J014p07j190Q37P98o88K28Q21j143j041J485Q47j324j6J292r79
469B9j478J366J362j191o57R29m51r91J136J009j171n27R43m34r42J286J155j372
487Ar34J172K37j056N71J241q88j278O18O53m99J32O58o86r77N97Q04l85r0O18
507E09l54r31M64J098j76o20K26K2p20P0R50L3q45j36K31l65OQ88J97q78k44N77
529BP2r3O44J87r10l59O46J30l56L49K13r91n26Q21M63m87N5L46n87m39R10O89
551G79n08k43L47l49m79O92O67o29o17K09r7l70N15O05n92o46L65L07k59L83O87
572G67m28q16K54O15p8n0K55l61o97J57N62n8j97J65k46o04K39Q18J19l98j5K0
$$ y = [-176, -355, -463, 437, 702, -242, -551, -130, -104, 175, 778, 308, -479, -75, 173, -467, 74, 1177, 189, -1232, -383, 530, -234, -205, 809, 102, -1088, -251, 547, -141, 87, 908, -235, -1276, 209, 1056, -268, -284, 1008, 29, -1449, -83, 1279, 88, -569, 360, -91, -1082, 54, 1063, -108, -635, 308, -126, -1068, 218, 1373, 1, -933, 239, 476, -580, -9, 1232, 344, -934, -316, 337, -162, -30, 628, -58, -1035, -438, 366, -19, -109, 509, 155, -776, -312, 786, 610, -10, 216, 238, -482, -412, 538, 571, -274, -410, -179, -544, -538, 350, 547, -331, -575, 2, 74, -19, 625, 812, -98, -457, 189, 319, -37, 312, 525, -466, -992, -171, 292, -195, -140, 206, -381, -820, 90, 779, 271, 28, 375, 26, -453, 239, 906, 277, -340, -131, -228, -598, -83, 522, -70, -716, -351, -44, -303, 80, 767, 339, -477, -223, 392, 314, 264, 519, 158, -539, -382, 180, 122, -75, 90, -156, -760, -521, 297, 416, 18, 3, 23]
594B3l00J72O72M8n42j73Q6k45O1N85N5p16l21L22J25PL87J34n72l15M28L36n5
617B02J19O3n05l57M18M21j25j18l3m40k36N83M52l50k96J96j27l30M03O46j63
638D23n72j27J12J00L43J88m06l40J64J6j64L78M66m69p20J83N39M7j1R2k73l68
660c99J74L72M1K0Q2l48m09K48N53M4k55j38j94j78K97M41q5l63n0J3j78J51N19
683C58J16n07l80J50L43J78L8j37k82r9J01O9J33K44q5n74k86M96M88j38k65k6
705f5p4j22K33L19Qj57j68k41n3M78L65l21m66QJ13nK00K74k02l68k5J30R9K68
729B28K26l82m85J40M15O6n2L4j81l22J8L31J83l3r8k63k59K15M86P0k88j42j0
752a03r0R2L57J33k93k79m1N4K06K83n3l97j93J48J44P5K03J0m04k48K43K93P7
$$ y = [23, -277, -105, 567, 615, 73, -100, -14, -259, -198, 387, 442, -274, -595, -273, -148, -141, 246, 380, -192, -507, -79, 257, 202, 321, 384, -121, -478, -60, 361, 236, 118, 85, -355, -591, -8, 444, 94, -202, -6, -133, -463, -60, 586, 423, -149, -276, -164, -64, 279, 467, 61, -279, -115, -99, -263, 115, 581, 112, -608, -425, 114, 161, 150, 242, -31, -399, -225, 147, 188, 208, 290, -58, -467, -219, 334, 378, 123, -15, -209, -387, -90, 351, 266, -97, -147, -134, -312, -161, 358, 474, -33, -413, -263, 80, 258, 296, 159, -123, -222, -121, -52, 81, 325, 240, -334, -620, -124, 364, 226, -39, -65, -139, -261, -28, 291, 299, 142, -26, -267, -320, 158, 523, 202, -264, -256, -143, -148, 52, 326, 124, -244, -269, -139, -40, 228, 454, 72, -413, -273, 142, 208, 156, 190, 9, -313, -295, 36, 219, 186, 88, -175, -434, -219, 267, 337, 49, -93, -103, -193, -101, 256, 389, 96, -183, -224, -170, 36, 319, 266, -131, -324, -176, -32, 43, 246, 256, -148, -396, -153, 140, 217]
775B17K2j20l61q4L30K20n7k2o9l56j19M60L08k26k09l1j18l2L69K32k14k22l8
798a20j03O2M54J52m22l10J53R3JK34J11l19k72O1J38J62K14m6m46j84K94K48
820A55JQn5k49j27J63K27J12Kk59l31M2M07K00j66j88o4n2RJ94J93M5j96l18p2
845c19K92L43j4k83k01rJ22R1Q4Q1p1k91j98K11L79R6k15k58j11J35K33J19o2
868A54j08q7j70j9L05K76j50l22j54Q4J89K23Rk40j46K8PQ3K56R9l01k91N7K19
892AJ92Q1j59l05n5J93Q9K0J36m9l51j60K73L07%j03j80j72M3K90J35r0q1q2j92
917b19J6L25J83j49k66j00K7J30K32N8j90j92n2O5J73J91%k09k23kJ79J90N9j18
941A08k14j35O9K01J57j5j75j78m1J25J99J26p6j95j56K5J95K05K6k02k03n3J13
$$ y = [217, 239, 119, -242, -326, 4, 224, 167, 145, 76, -280, -399, 61, 369, 143, -66, -97, -215, -247, 122, 354, 140, -82, -120, -223, -161, 293, 445, 23, -287, -134, -41, -40, 194, 305, -14, -286, -225, -87, 75, 289, 243, -203, -387, -93, 155, 156, 164, 109, -140, -267, -104, 123, 235, 237, -22, -353, -311, 96, 296, 130, -58, -122, -174, -165, 29, 222, 267, 71, -247, -319, -27, 316, 302, 19, -182, -191, -69, 22, 106, 187, 116, -175, -373, -162, 217, 313, 98, -160, -271, -136, 97, 216, 154, 46, -41, -211, -230, 75, 351, 201, -121, -275, -191, -2, 221, 230, -10, -156, -128, -121, -38, 218, 317, 16, -275, -218, 1, 193, 274, 115, -190, -245, -52, 37, 57, 193, 144, -207, -367, -94, 213, 213, 110, -70, -242, -199, 91, 226, 136, 55, -27, -219, -203, 122, 305, 156, -110, -210, -183, -53, 179, 237, 47, -145, -197, -132, 41, 232, 232, 23, -200, -202, -23, 167, 226, 108, -106, -241, -172, 29, 186, 171, -4, -182, -223, -98, 101, 227, 151, -44, -200, -175, 20, 225, 251, 49, -154, -207, -94]
964i4J63J23l5j86j69qJ35K12J18j45k74r6J62K00P8k7j27j70n4J26J63J07m2
987A60k32k18P4K77J39o3j57j16m7R5J60J18k2j55k05l2K19K50rk23j58k6Q1J51
1011F1R5k5j30j51o2J30K30J03j35k46r2J16K08J06p8j35r0m8K4J63J90p3k62
1034a01j58P2K09J60j1j98j31K6Q6O6J37P0j95k62RK70J69m3j45j52n5Q1J42R2
1058A38%q9j95q6J52K63M5j62j59p1N2J57J40k9j43j49m2Q0J85J16q8j82j39L4
1082a72J71J90pj85j31NO9J06J32Mj74j91QJ72J71L3j43k01l1J09Q4Q1P4j03k33
1107a62o7K13J90Nj00j52q7M9J42J03Rq1j83j07J38K17M3j06j24o8k2J27J73L6
1131A86j31j59p1P4J95J08j05j26q3l3Q1J87R2j42j94m3O4J21J21kj53j28j8Q4
$$ y = [-94, 69, 192, 157, -29, -198, -206, -71, 141, 259, 114, -160, -256, -94, 106, 184, 157, 30, -140, -194, -68, 95, 202, 160, -72, -290, -216, 61, 200, 137, -20, -136, -183, -88, 72, 190, 168, 13, -192, -224, -5, 245, 236, 13, -145, -171, -90, 61, 156, 131, 1, -150, -212, -82, 148, 251, 116, -130, -222, -106, 102, 208, 130, -5, -95, -143, -119, 44, 234, 161, -101, -259, -187, 22, 182, 171, -27, -158, -132, -46, 20, 157, 227, 32, -230, -221, 49, 218, 175, 30, -122, -177, -96, 46, 138, 138, 49, -146, -232, -80, 183, 228, 66, -93, -164, -112, 45, 185, 156, 13, -136, -178, -98, 87, 203, 115, -67, -206, -172, -1, 189, 182, -3, -134, -129, -60, 46, 178, 182, 8, -183, -175, -3, 168, 201, 58, -143, -174, -65, 19, 100, 174, 71, -162, -229, -16, 174, 179, 79, -73, -160, -111, 31, 134, 143, 62, -121, -228, -90, 127, 170, 64, -60, -128, -150, -23, 150, 186, 55, -104, -175, -101, 94, 202, 97, -29, -112, -145, -64, 123, 215, 73, -121, -164, -100, 21, 142, 140, -13, -141, -159, -75]
1155g5J57J07p7j99r2R3J24Q1L2o5j97r9J35J74O1o1j55r9JJ50J24J6o5j45r7
1180a71Q0J82J06n8j45j20MR4J13N7p2j47j23M4J81J23l8j22r7l5R7J59P7o6j43
1205b0j18J7J33J32qj30j43m6P1J42J10k6j55j05QJ60J46K3r9j33n9K6J27R3j8
1230A28j52j41j4J06J42M3o6j24o5N0J13J47M5j52j75j0J15J25K2o1j24j16j7
1253a81J24J46L3j09j54l0J40J39N1k5o9j27o4J20J64L0j38j72o0Q3J04M8lm8
1277Bj29p5J34K07O4j31j20j8K0P5R8K4j06j51j00O9J96R5j41j46J0N0K5J07J37
1302A96n9k12q5J31J62L9q6j14p4JK8R5J16m4k12j01J47J80K4o7l7o1o9K5J32
1327E5J11m7k12j16J04J64Oj5j4n6j30K3K08J44r6k07o0Q8R2L8k9om6j69j3K10
$$ y = [-75, 82, 189, 112, -87, -179, -86, 38, 119, 151, 86, -111, -210, -75, 99, 160, 99, -56, -155, -154, -4, 120, 136, 71, -74, -171, -91, 91, 197, 139, -6, -126, -122, -28, 85, 142, 70, -77, -200, -156, 25, 148, 110, -12, -109, -144, -47, 112, 189, 123, -20, -138, -121, 12, 144, 136, 6, -137, -183, -112, 30, 140, 114, -41, -146, -138, 22, 168, 191, 92, -41, -100, -74, 53, 146, 128, -24, -165, -179, -73, 69, 112, 46, -78, -143, -93, 20, 167, 212, 60, -115, -125, -10, 115, 137, 76, -48, -164, -181, -57, 89, 122, 13, -141, -171, -31, 108, 159, 134, 65, -62, -126, -6, 158, 188, 50, -122, -182, -99, 5, 53, 50, 2, -127, -202, -68, 139, 203, 72, -48, -66, -46, 29, 127, 151, 45, -106, -206, -137, 59, 154, 13, -133, -123, -73, -48, 59, 196, 137, -75, -160, -29, 133, 172, 86, -28, -102, -101, -73, 22, 138, 94, -118, -219, -72, 108, 132, 65, 28, -33, -102, -77, 55, 166, 119, -93, -209, -105, 59, 65, 50, 36, -20, -150, -127, 81, 225, 129, -78, -138, -50, 42, 80, 51, 45, -1, -170, -183, 27]
1353B7J83q9j92l5P6N9N2N7j3j26j37k2J65J57p9j99n9Q0L5J8J25N5j31j47O2
1378g8J77R3qj15j10l6J8O2R2J4j83j96Q1K30M6r3PN3r4m2J46J76qj61j64lJ44
1405D8O1q7o6Lj00j30J15K84L1k26j34J39J73L6k7Pj4q0j04L2J63L7j77j77nQ9
1431a09N4O2M6o8j32J4J76J52or6q7JK1kQ2N7j65k09JJ81Q2r4l5L2k6o9N2K18
1459A33J43j38k68l6K70J41j65j44O8J0j52l9J92J19j18j80l9J60J64np9PRr4
1483d1l9J83J49j51k27k0J01O5L2pq7q1PP4P7O3l3r0m2L3K6N1J10k4k28j31J79
1510e1K13n6j44k4L3l2JR5J05k8j52j47J07K12J8j57q0O2Lp2N1J81Pj98j37R2
1536i8J88N4p0j20m5L2K9L5L5L2r1j26J1J54R4n8m8l6m1lJ27R2m3j33n0RL5J04
$$ y = [27, 210, 121, -71, -106, -30, 29, 81, 138, 125, -1, -138, -160, 5, 162, 83, -116, -175, -95, -60, -42, 83, 138, 7, -140, -78, 99, 192, 184, 69, -41, -77, -59, 3, 95, 109, -74, -270, -189, 41, 87, -6, 1, 54, -40, -82, 64, 240, 232, 71, -93, -96, 48, 109, 22, -44, -41, -141, -271, -156, 128, 159, -67, -201, -62, 111, 147, 120, 127, 113, 33, -71, -39, 124, 161, -16, -193, -198, -109, -55, 7, 53, -15, -147, -133, 43, 195, 189, 93, 6, 7, 28, 26, 108, 165, 0, -209, -208, -27, 55, -39, -74, -42, -68, -137, -85, 133, 276, 138, -130, -166, 104, 245, 80, -64, 4, 14, -138, -177, 15, 134, 16, -164, -203, -43, 121, 116, 37, 44, 53, -41, -80, 103, 252, 101, -126, -146, -45, 20, 52, 45, -42, -123, -116, -42, 35, 98, 65, -25, -67, -34, -8, 43, 153, 129, -99, -230, -51, 162, 106, -38, -62, -29, -61, -60, 35, 140, 112, -40, -187, -80, 132, 150, -7, -87, -25, -22, -94, -43, 138, 145, -53, -190, -98, 90, 144, 74, -46, -91, -59, -30, 5, 40, 72, -19, -145, -134, 20, 114, 56, 8, -28, -69, -72, 55, 147, 104, -29, -79, -70, -35, 69]
1564F9L9q3j20k4K9Q4R3J0j39p5R8O2j8N5N3j05j59J7J47P3n3q5q9j3J08O9nm
1592C4pj00n8J31J64l9j12m6%oO7P9l0j12o2rM2J07P0q6j32K0O2M2N3M2p8j31
1620i5oJ18M2j5Mn7j06oJ10Q0j2o2o9n6P7J44J7p4m0j1n7L5J36M6j26j13K4L4
1648c8K4P2K4j08q8M2O8L9O3j2j36p2J02R0j3Okj20r9J13J08j5n9j9m9l9J16J02
1676A00k9n7l3m4NJ43Q6j23j20J9RmO0Q3q6j20lN3O3Q0Nj06n4N6M5J4N1K9j43
1705b1j16O2J22km1n1m1m5N7R7J8J0m1r4J4J44P9m3q9k1k7j6M4Q9l2j15r1J1R1
1734d8Q6nl5k5k9J8P6Q6J3q4r0j3P9O2l3o3l8p2l6P3J19Lj19l7L5O1P3N5pp5m0
1765a0lM0P9M1j37j19K0N5rNP4n4j17J2J23R1J1m5o9l5P3N4lQj0j25r5Q5J40m5
$$ y = [69, 108, 25, -95, -119, -90, -6, 87, 97, -42, -117, -19, 43, 25, 80, 133, 28, -131, -114, 33, 106, 53, -32, -121, -134, -26, 43, 38, 34, 27, -73, -131, 0, 164, 125, 13, -33, -33, -39, 28, 107, 77, -35, -97, -106, -64, 43, 113, 27, -105, -85, -23, 19, 72, 114, 36, -95, -101, 17, 59, 44, 48, -9, -115, -121, -11, 69, 57, -5, -74, -130, -53, 91, 108, 34, -6, -17, -74, -39, 97, 143, 17, -96, -72, -38, -14, 58, 82, -26, -114, -72, -4, 35, 98, 86, -50, -122, -20, 70, 57, 63, 61, -59, -158, -45, 63, 48, -11, -30, -79, -118, -2, 100, 71, 14, -19, -63, -58, 85, 171, 48, -72, -53, -44, -48, 12, 95, 9, -111, -114, -61, 2, 82, 87, -19, -73, -17, 28, 42, 93, 122, -21, -137, -75, 47, 45, 4, -47, -88, -133, -76, 21, 39, 49, 8, -86, -72, 72, 151, 108, 19, -2, -29, -45, -1, 88, 56, -59, -150, -139, -48, 38, 33, -2, -27, -56, -38, 38, 124, 137, 53, -37, -50, 29, 91, 58, -5, -43, -115, -151, -78, 41, 44, -75, -112, -77, -16, 57, 112, 105, 30, -10, -13, 27, 106, 147, 10, -109, -89, -34, -43, -38, 36, -18, -135, -123, 0, 91, 102, 57, -12, -47, 26, 80, 77, 85, 75, -50, -145, -60, 80, 35]
1795C5r9j7j3rP0Q5J9m8l9m4L3J26M5r4o8J2k3j6Q1P0q1j29qP5M8K5Rn0o6RM4
1826a8O9N8k5j36l2Q1N1%Lk6p1n2M6Q6M8o6q5k8N2M2L5J0qo4m5N0R2N5m3q4l2
1857c7J2M5K8J3j7q2p9J7J24L5o6m5j2j1L3R5M6l2o8l3J0P9O8m0r6j9k3rL8P5
1887D9l0j26l8P8M9M3M3l5m0j5L7N5N4Mr0j06K6P6j2k7jm9q8J4J23M7k2m0l0J3
1917c8O2P5%k8k3o5l7P6P7m9j21k3J7nL3P0Lo9m2L5P3O5L1n4o7lL4QL8Lp0j20
1949a14kQ7M5l2j4rn0QR8O8j6n6k0j4M0N4K9o7n8k1j0OP8L0j12o2M0N4PN2L1o2
1981Hp1M1P4K1%rp4n2M6O0j3k4np4n0Q0J05l7o3K1j6m7P8R8k8r3kJ2k1O2O6o0
2013C3r2J3J0rN7O4p3j07L0P4QQM8k6j09J3J04K2k2j4m8n5L1Q1J8n7j2l4o5M7
$$ y = [35, -64, -81, -94, -103, -33, 52, 71, 23, -16, -60, -27, 99, 144, 50, -18, -6, -29, -45, 36, 106, 25, -104, -112, -37, 11, 36, 45, -5, -71, -62, -18, 51, 109, 84, -52, -84, -3, 48, 48, 51, 25, -46, -98, -52, 34, 82, 16, -69, -97, -45, -3, 32, 42, 34, -30, -75, -25, 67, 122, 79, -5, -37, -25, 20, 48, 61, 44, -38, -117, -100, 24, 59, -7, -52, -64, -75, -42, 53, 99, 67, -1, -34, -24, 55, 123, 83, -13, -32, -55, -64, -26, 49, 19, -107, -145, -67, -18, 25, 68, 33, -7, -22, 15, 70, 124, 128, 38, -68, -42, 34, 22, -5, -6, -55, -143, -129, -6, 41, 19, -21, -51, -38, 24, 99, 99, 71, 48, -17, -54, 22, 99, 50, -71, -94, -77, -82, -49, 21, 24, -45, -87, -52, 21, 86, 117, 63, -4, -7, 27, 35, 73, 76, 6, -114, -116, -29, 16, -16, -30, -39, -89, -81, 17, 85, 69, 13, -7, -21, 19, 73, 102, 35, -23, -44, -54, -48, 30, 60, -52, -114, -74, -20, -13, 39, 70, 8, -63, -22, 52, 73, 73, 64, -10, -62, -16, 44, 31, 7, 2, -72, -122, -42, 63, 26, -37, -16, -32, -79, -1, 97, 69, -24, -26, -14, -35, 27, 93, 33, -59, -46, -36, -45, 12, 76, 3, -104, -74, 0, 8, 16, 64, 38, -71, -58, 46, 68, 46, 32, -16, -71, -40, 41, 59, 2, -10, -44, -109, -62]
2043f2J17J6r9j9K2j2J1Q6L9q4p9L7L4J8J9Np4o3M8M1KJ9J0q9n5J02R1m5l1M3
2073D8n1o6P3J03l3q1%k6k8N9P2o2o7K5lm7Q7R4o6j04L1O3k7K8O4m6j13K1P2J0
2103C0JJ6o2p7M5O7j8lN0p6o0N0J13k4l7%j7m1K5Q5mo1l2j4j1M2O0k2n4j6jRM9
2136A2M6k4o9k0M6M2kRmp2l1M0O0J4l5l4k4lL6N8ml3l1j9J0N8N4l1p7qJ6j1L4
2169CO8l6q7k0M6L2QL2l8q0J5N3K8RJ9o8o0L6Q4%l9J0k5n7J8R2Ll1m2qj4L6N5
2202D2Nl0k7l0mO2N7l3p3JJ3OJ2L7j8m8m3K9N6K5j6l2l0LK7J7K1jl3m4NO2L9k2
2236C5l6j5pj1M2M7Jp5l9L2K6K5J2l1l3j2K0J7L4J9n7o2J3O7LOLrp2kP4L2j7l9
2270ij4j9L3M6Pl0j5j5l7L5P2%o7k7K5LJ7L1J0n1l7RL4L4K2l6m6j5M3KJ8J4k0
$$ y = [-62, 55, 71, -28, -47, -25, -37, -26, 60, 99, 15, -64, -27, 7, 25, 44, 49, -25, -88, -40, 1, 3, 22, 32, -57, -112, -10, 81, 36, 5, 48, -3, -69, 4, 107, 74, -7, -7, -33, -61, -2, 70, 8, -59, -34, -37, -84, 3, 97, 31, -73, -42, 21, -6, 22, 86, 40, -73, -52, 20, 30, 31, 47, -15, -92, -47, 20, 2, -1, 49, -27, -87, -37, 76, 52, 15, 15, -2, -43, -18, 67, 63, 2, -30, -44, -55, -13, 47, 25, -29, -45, -46, -37, 12, 58, 34, -35, -55, -9, 33, 31, 40, 36, -36, -67, -27, 33, 47, 12, -22, -46, -49, -13, 45, 41, 8, -23, -42, -32, 26, 80, 49, -28, -36, -20, -31, 3, 71, 35, -52, -72, -26, 6, 14, 46, 8, -72, -57, -4, 24, 33, 52, -16, -76, -40, 44, 44, 5, 15, -10, -67, -49, 43, 46, 15, -27, -35, -49, -13, 42, 47, 17, -10, -40, -44, 18, 75, 42, -31, -30, -17, -11, 1, 38, 20, -28, -71, -42, 14, 39, 23, -9, -39, -36, -9, 8, 29, 28, -5, -49, -44, 18, 57, 35, -1, -16, -23, -34, 8, 55, 56, -19, -58, -26, 0, 25, 37, 6, -27, -39, -19, -2, 32, 51, -6, -68, -55, 12, 15, 21, 24, 15, -57, -59, 15, 47, 30, -9, -23, -42, -9, 37, 44, 14, -1, -16, -53, -18, 54, 54, -13, -40, -15, -12, 5, 36, 46, -5, -42, -33, 1, 35, 57, 21, -25, -40, 3, 5, 23, 37, 17]
2303A7o3j8N4M0Kk4j9k0nK9M0Kk2m5j1K3M2J8j8m1qOJ6K9K2k4o0pL8L0kOk3l8
2337c4j0M6K7Lj6l6l4K4O7j1j4nk4m0K3O0K1l9k4j5KL0L6km9j0nLM3L7j6o2pJ8
2371a3QK3J9j7m9j9L3K0J3J3l5l7KL3K0Njl9l4L6M1LKj9l8rL2L3J5k5k1l2JN0
2405A4K8ok4k2k4L0K7J1k4k2ppJ9L1Jj9l7mNL0K4Jl6k8LL2L2Mj6l4qmL0L1j1k5
2441ek5qL4L4J3k3l2j5NJ8L0J7k6l4rOK7J7Ll5l6J7K8MQnk7l7L1M4lqj5k2k2L8
2477a3M0rqk7j7lM1L3j3l6oj0J3L2J5j4l5okK8K1K0k8l9pJ5J9K4%l4k4LK4K0n
2512A2j3k2k2J0M2K9k4j1k4oK2L3Oj7k8q%K0K9Nl3l2J0J3J6J8Jm3k0J5K8K4Mj7
2546A7m2j1K7K5ljj8k6OJ4K8%j2j5k1LL0K4Ll2j0j7J1L7J6k5k1j5J5J6K5j4qk6
$$ y = [17, -46, -64, -10, 30, 32, 8, -11, -31, -36, -7, 33, 35, 13, -32, -43, -20, 22, 40, 22, -19, -27, -21, -5, 24, 46, 22, -38, -45, -7, 23, 21, 27, 4, -34, -44, 2, 29, 32, 16, -20, -54, -30, 37, 26, 12, 7, -17, -57, -34, 26, 47, 8, -16, -31, -29, 1, 37, 35, -14, -24, -29, -26, 17, 54, 38, -24, -31, -13, -5, 18, 37, 20, -29, -48, -15, 5, 18, 31, -4, -41, -39, -6, 14, 19, 18, -21, -55, -19, 22, 25, 27, 8, -30, -39, -7, 26, 41, 16, -5, -37, -36, 14, 42, 36, 12, -10, -34, -4, 23, 34, 10, -12, -19, -26, -7, 24, 25, 6, -31, -35, -30, 0, 24, 25, -11, -39, -36, -4, 28, 32, 16, -18, -26, -30, 0, 31, 20, -5, -30, -38, -4, 30, 43, 20, -12, -27, -22, -4, 26, 43, 17, -17, -26, -20, 7, 24, 27, -8, -44, -27, 1, 5, 13, 8, -19, -56, -25, 19, 16, 8, -7, -29, -51, -13, 27, 18, 10, -17, -34, -37, 4, 37, 24, -12, -18, -28, -15, 17, 32, 18, -17, -23, -25, 3, 24, 44, 16, -23, -30, -15, 4, 28, 28, -6, -30, -27, -3, 17, 12, -1, -23, -45, -35, 7, 36, 12, 1, -23, -29, -7, 26, 32, 15, -13, -21, -21, -1, 28, 33, 0, -32, -22, -9, 7, 25, 26, -17, -37, -22, 6, 30, 34, 17, -25, -36, -9, 16, 13, 12, -6, -32, -26, -12, 16, 16, 4, -11, -32, -29, 1, 25, 28, -4, -14, -31, -20, 17, 33, 8, -13, -28, -13, 3, 28, 14, 6, -20]
2580b0j5J8L5Lj4k4rkJ6L9Jk6k6KKK9J6j5k7mj1OK7K8k1l3J%K6J8Pk9k3OJ1K0
2616A2QOk6l6J7L6nQqk1k2K1K2J6j3kl0pK3L0lk1qk1NJ3L4j9j5k5jK1L2kjl9q
2653b9LK7L3nl1j8j0K1K8Pj0k3j4LJ6J7Nk4j2qJ7K1J2j7pk7J0K0RJ5k0l2qK0J2
2688AK1Rl7k3oK9K0Llk2k5J9K3J0Kk2rpkK7J7nk3j3k5L1L1Kl2oj1OK1K9qk8j5
2725b1mJ4K3J6j5l6KRJ4K1jk3j7OOJ7J3jk3k1MJ8K7mk3j9JJ0J8Pj3qj6jJ4K6Q
2762B8k6j1k0J5J1K1Ok5k1j5L5J7Lj8j3j6J5J9PJj0j6j5J7L1lJk1j9J2K1J4Qk7
2796Fk4qJ0K4J5qk9j3JJ8K5pml4kJ6K1Lloj8j2J0L6J2j9k9j3J8J2MLqj0j0K2K1
2833B0J7k0k9pJ3J7PLqk2k0PL8Lj4ppj2J2K3Nj9j7j0J7K0MNj8rkPOK0ll3j3OM0
$$ y = [-20, -35, -17, 18, 21, 7, -17, -26, -28, -12, 27, 28, 2, -24, -22, -20, 9, 25, 10, -17, -21, -32, -26, 1, 29, 8, -25, -24, -24, 2, 20, 27, -2, -25, -19, -8, 12, 20, 26, 0, -36, -19, 17, 12, 20, 12, -9, -31, -10, 12, 28, 15, 13, -17, -24, -1, 29, 26, 5, -3, -24, -19, -6, 28, 9, -6, -31, -32, -11, 21, 19, 18, -21, -29, -26, 1, 34, 29, -2, -20, -30, -9, 19, 26, 16, -7, -21, -18, -2, 15, 20, -4, -16, -24, -7, 14, 26, 9, 2, -25, -15, 5, 14, 29, 9, -23, -31, -11, 1, 22, 31, -6, -29, -35, -6, 14, 17, 14, -8, -33, -14, 9, 19, 21, -1, -10, -17, -19, 8, 25, 20, -3, -16, -41, -10, 21, 23, -9, -15, -26, -20, 1, 30, 22, -6, -21, -25, -11, 12, 28, 13, -23, -21, -12, 2, 23, 22, -1, -18, -12, -6, 11, 24, 23, 0, -21, -17, 1, 28, 24, 1, -18, -17, -7, 11, 18, 5, -3, -19, -20, -6, 20, 28, 2, -9, -29, -14, -3, 18, 24, -1, -22, -37, -2, 15, 18, 0, -13, -29, -14, 5, 12, 13, 3, -13, -28, -11, 20, 17, 18, -3, -22, -10, 11, 25, 33, 6, -18, -26, -16, 8, 23, 15, -14, -27, -26, -8, 17, 10, 6, -28, -30, -14, 7, 10, 7, 1, -17, -29, -19, 17, 29, 10, -19, -32, -14, -2, 2, 5, -3, -13, -23, -1, 20, 37, 17, -12, -19, -6, 11, 18, 21, 13, -9, -29, -22, 16, 19, 5, -2, -9, -21, -9, 14, 19, 0, -17, -27, -10, 10, 14, 19, 1, -8, -10, -3, 3, 23, 20, -13, -26, -20, 20]
2872B0Mnqk2j5K2J7J4j0j9j7MJ9NLJl1oQK0J6j3j8j3J4J0QoRk1j6J5L4jj7Mk0
2909a1pLK8lLj4j8J1K1J4j7j6pMnJ5J8Jk9j2NJ4Rkoj7MjJ8J3%k1k1J0K3mOJj0
2948@k4J2RK2j3rj0KJ8Oj0Ppk4J2RK4jk1j4kKJ0J4Qj7j6j7K8K7j8rj4JRKJ2J2
2986B0k5pj1K6J5Jj5j6oRJ3RJ6k1k2jK2kjQj9JKKK2oj4j6JJ6J1Oqj5j3%NL2j4
3025Emk0PrK1Qonj5nJ9K0Pj9nj5%J9J7kk5jqRJ6Oj3j2KPlJ5J3k2j3rJ4J2OJk4
3066a1r%J4J3J0j9kj6J5nJ9Lj3j1qL3%Nmj8j8PJ4J6jk3jnLJ1K8qj9j4PQJ1Jj0
3105Cj5okJ2J5rloj4J5K6lj5%kkK2%Lj4j3oJ3J1J1k0j0nJ2J0RPj8lj9J3QRj2j0
3145hj1lLK4Lkk5NQJ9jn%k6QKK9qqj0rJK5qJ3oj0j4K0Pkj1konK1Mj2kj3j4OL1
$$ y = [20, 24, 19, 11, -11, -26, -4, 13, 27, 17, -2, -19, -15, 4, 9, 12, 13, -18, -24, -16, 4, 20, 7, -11, -24, -10, 0, 8, 2, 11, -10, -26, -11, 23, 22, 5, 9, -11, -18, -15, 13, 10, 13, -1, -19, -8, 13, 27, 10, -6, -13, -9, -14, 1, 19, 20, -9, -21, -16, -2, 7, 5, -1, -18, -14, -15, 3, 16, 16, -5, -26, -16, 7, 3, 9, 10, 0, -24, -12, -3, 19, 6, -3, -13, -11, 7, 13, 3, 10, 3, -21, -9, 0, 24, 23, 2, -12, -14, -12, -2, 12, 20, 3, -13, -30, -2, 25, 7, -2, -16, -15, -6, -4, 8, 20, -5, -12, -23, 3, 18, 19, 4, -12, -18, -9, 4, 13, 29, 8, -14, -15, 7, 5, 4, 12, -7, -6, -4, -2, 20, 14, 0, -16, -15, 1, 12, 18, 10, -5, -18, -18, -13, 19, 5, 1, -19, -12, -21, 0, 8, 2, -3, -18, -23, -4, 16, 23, 4, -1, -16, -16, 3, 20, 18, -7, -8, -16, -7, 9, 15, 2, -10, -8, -1, -4, 11, 24, 2, -11, -20, -6, 6, 12, 13, -11, -20, -20, -6, 7, 17, -2, -4, -20, -5, -10, 9, 12, -1, -12, -20, 13, 13, 18, 14, -4, -22, -15, -1, 15, 14, -9, -10, -15, -12, -1, 27, 19, 0, -14, -7, 1, 12, 13, 3, -12, -18, -20, -8, 7, -2, -5, -11, -25, -10, 16, 13, -2, -2, -4, -6, 16, 16, 19, 5, -8, -14, -1, 10, 21, 1, -9, -14, -2, 8, 17, 24, 6, 3, -16, -3, 5, 14, 2, -8, -19, -22, -19, 5, 8, 6, -19, -14, -6, 13, 12, 7, 7, -19, -11, -9, 20, 12, 4, -6, -15, -14, 11, 3, 16, 10, 0, -14, 6, 13, 11, 0, -2, -8, -13, 8, 12, 0, -2, -15, -29, -23, 8]
3188HPk7KOmPJ9pok2LJ2MJ2j6pkjJ1LQKk6LJ5jLJ3j6pMj4K9mpj0j1J1ML%%j1r
3232a9kK5K3k1kj7J1MjRlk0rMJ7J4j5kk0NJ9LK4j3pj7KJ8J2j1j5lmLkK0rrnnJ0
3273hK4jj1rjrJ0J6%j9rJK4kj2Pj3jJJ5J4jj8knJ4MQj0j8%pRJ1Lj0j2J4J2qJ3
3314A4%j6j0PJ1Qlj4j6kQQMJ1j6jnK2kQprjJ2j0J8j3nj0JPKRpj6KJMJ8Kj3k6J5
3357a0J4JpRj4j4OMRJ2j0opRPJ3lk6LJPJ3nkj2pQJ2lKlj3MOJ4NKj8noLJ4Pj6q
3402a0qQJ6mKj3kMJ3nQj3Kj0J4LKmqNLqJ3%ommj1K6Nlj0nmJP%Lqj3J3PkJ2j7k
3448gOj1J4J3j3opNRLKj8%mmK1QKj4j0J2lK1%j2mqLOJ2krj0j2K0JnJ1k1moJ4J2
3491En%j3PmJ1QmNk3NNPQlj2nOOMjjojlJ3Jq%j1J0LL%moKOPj1Jj1Qj7QK4jprj0
$$ y = [8, 15, -12, -10, -4, -8, -1, 18, 11, 5, -17, -14, -2, 2, 14, -2, -9, -11, -12, -1, 2, 10, 12, -14, -11, 4, 3, 6, 19, 3, -4, 0, -14, 15, 11, 4, -6, -17, -6, -2, 1, 1, 1, -10, -19, -21, 4, 27, 6, 4, -13, -2, 2, 1, 10, 7, -13, -22, -18, -1, 13, -2, -4, -24, -19, 0, 3, 27, 14, 7, -10, -8, 10, 22, 11, -4, -7, -11, -8, -10, 10, 1, -8, -13, -18, -8, 16, 15, 4, -5, -6, -15, -5, 11, 11, -8, -17, -16, 8, 6, -6, 1, -12, -13, -12, 3, 17, 16, -2, -4, -9, 5, 9, 17, 7, -11, -11, -18, -9, 2, 5, -5, -17, -3, 9, 1, 14, 14, -2, -12, -5, 6, 14, 11, -3, -19, -21, -13, -5, -1, 10, -6, -7, -12, 10, 8, 16, 9, 0, -1, 11, 1, 19, 6, 1, -9, -8, -1, 1, 10, 3, -13, -11, -10, -6, 12, 14, 1, -25, -10, 4, 5, -2, 7, -7, -21, -15, -11, -2, 10, 0, -6, -13, -4, 3, 16, 13, -13, -10, -9, -2, 11, 6, 4, -8, -15, -7, 5, 2, 4, 1, -12, -8, -2, 12, 17, 19, 1, -4, -10, -7, 7, 14, -2, -10, -18, -10, 6, 2, 4, -9, -11, -7, 6, 1, 9, -4, -2, -12, 2, 5, 7, 3, -5, 0, 3, -5, 8, 8, 2, -2, -6, -17, 9, 14, 11, 1, -4, -8, -7, 0, 0, 3, -5, -18, -5, 2, 0, 12, -5, -7, -1, -12, 2, 15, 2, -4, -11, -6, 3, 6, 8, -10, -10, -14, -18, 3, 11, 13, -1, -11, 1, -2, 19, 19, 7, 3, -5, -2, 4, 16, 14, 5, -5, -17, 3, 4, -1, 10, -11, -15, -21, -7, 5, 0, 0, -13, -6, -10, 1, 9, 5, 10, -13, -8, -3, 4, 12, 9, -3, -8, -2, 4, 8, 7, 6, 0, -1, -4, 9, 10, 2, 2, -9, 1, 4, 7, 7, 3, -3, -1, 5, 12, 1, 2, -9, -1, -18, -10, 14, 13, 6, -3, -13]
3541a3QK%J9oj8pJ3PQpj4J2KlnJ1pKj0KJ5kq%qkMJ0Olj5nKJ0J1j4Kj1MkJ1Rj5
3585eKoNJ3j0NKj5kJ4%Nmj0j1J9KJlJrj5J2RLlj3Oj0J7kLOpj7nJ7J7k4QlkJ0M
3629Ej0%j2J1mKJ2j3J5j2JNJ1kjj8oJ1kRKoj1%kRJ8j5lj2K2J1j2Pj2%nKJ3jOj1
3671Bj4J8j4J4KqjrPJ5Oj1npM%LJ4j2j1PmlJ7jj0MnmJ6njqLnOQpqPnlPJ2pKrl
3719fOkK0qj1JKRJ%j2%LPnnOj9mQ%POql%kNJ7j6Nj8RJ3kLKk0jNJ0NqlNLmJQpm
3770aNnQOqnj3J4%Mlj0qJ3j0JJ4Jj2%LM%NJ1j5jJj0J9jqj1JJ5Nj5nJ2rO%%nJ0
3815CqrJ2MlJ0j0lpNNJ0j3oKjOJ3pmj%OrQlk%MmKjMj0nJ1%JJ0qj1pRMJ0j0oRr
3864iPJ5qqrJNPNj0KKpJ2kmjnQkLmLpOmPQlpjpNQ%pq%nJ0J1j1J3j4%k%J1rkqJ1
$$ y = [-13, -5, -3, -3, 16, 10, -8, -15, -2, 5, 13, 6, -8, 4, 6, 3, -2, 9, 2, 4, -6, -4, 11, 9, 1, 1, -7, -9, -5, 5, 11, 8, -7, -12, -10, 0, 11, -3, -1, -12, -8, -10, 1, 10, -5, -3, -9, -4, 9, -1, 4, 6, -9, -11, 3, 3, 8, 4, -6, -17, 2, 4, 5, 2, 3, -6, -21, -9, 0, 3, 0, -13, -7, -17, 0, -2, 1, 7, 0, -17, -22, -5, 12, -12, -4, -7, -9, 1, 5, -5, -5, -17, -6, -10, -8, 4, -9, 6, -6, -5, 0, 11, 9, 8, -10, -16, -5, -7, 2, 4, -2, -13, -13, -15, -6, 12, -3, -6, -18, 4, 15, 3, 10, -2, -2, -7, -5, 8, 7, 13, 2, -12, 6, -8, 6, 8, 0, -1, -10, -3, 12, 18, 7, 2, -5, -1, -1, 2, 16, 4, -7, 0, -4, -7, 10, 9, -1, 3, -2, -6, 10, 5, 4, -4, -1, -6, 0, 8, 1, -7, 0, -5, -8, -1, 11, 4, 6, -3, -6, 0, -2, 18, 10, -1, 0, 2, 11, 12, 12, 0, 0, 3, 10, 5, 0, 6, -13, -17, -9, -9, -2, 4, -4, -7, -7, -9, -4, 13, -3, 2, -16, -7, 6, 4, 7, 9, -11, -12, -7, 3, 8, 0, -3, 2, 5, 1, 2, 10, 3, -1, 4, -1, 7, 13, 5, 0, -13, 1, 1, 5, 2, -8, -16, -3, -13, -12, 2, 3, -9, -9, -6, -2, -2, 3, 14, -1, -2, -1, -11, 8, 7, -1, -12, -11, 4, 9, -6, -11, 1, -8, -2, -2, -2, -7, 3, -5, -14, -2, 2, -1, 9, -1, -4, -11, -6, -1, 9, -4, -10, -8, -9, -3, 10, 3, -1, -2, -2, 4, -5, 3, 0, -2, -2, 2, -2, 0, -1, 3, -7, -12, -1, -1, 0, 10, 2, -9, -16, -7, -3, 7, -3, -9, 0, -9, -2, 13, 5, -3, -12, -11, -6, 1, 6, -4, -2, 0, -7, 5, 3, -1, -2, -7, 1, -1, 2, -2, 1, -6, 0, -4, 3, 11, 8, 1, 0, -7, -2, 6, 6, -1, -9, -9, -14, -4, 7, -4, 9, -5, -5, -7, -7, 4, -5, -7, -15, -4]
3916dRKpQnj1MJ3j5RKnqJ2%Kk%poK3oj1%Llj1J9pQj8%J3oOOkpJLpJRj1NLnNk%
3966@pNKjJ1lrnQj0K0moLqqnJ5MoJj1KJ8j4JLJj2J0KLJj4OlK1oLj2mmPPLj0nJ0
4014@j0OJ0Kj1JmNJRnlrRrJ0mJQj8J2lLpjKLkPo%lpOPKOj3KOojQj7J8lj6J3Rp
4064AJpKPnJ2j1o%OlJ1j1%j3PJ0pJk%llRJ4qKj2nPLrJ1pMJP%Qj7pJ5oJjJ9k0L
4112aj1JpJ2Rj2MnMnKMklkNRqJomQOjMJj3KQkOkmjJMjJmjj1J7nJ7j5rjNnJ3Kj5
4164a0j%ORolj1MKK3j7oJ2r%%J5rj0RKrQQj7lJ4%kRomQj6KkJ1JrJnQj4K1j0Jk
4211gjPJ%qMqJ1Mj0J0qLjOQkmNj2j1NJ3jj2jj1J0NQpKonJ2KkMj1rPjMjLrNLJ2
4260Fj1KplRpJ8j1QoLlMLnjkpMOQqnnMJ5Llmj5%QOkJlrJ2oNLj3J4pjjRmJqOMj0
$$ y = [-4, 5, 7, 0, 8, 3, -8, -4, 9, -6, 3, 5, 0, -8, 4, 4, 6, 4, 4, -3, -9, 14, 8, -3, -3, 0, -3, -14, 5, -2, 6, -12, -12, 1, -5, 1, 7, 5, -2, -1, 2, -5, -4, 5, -6, -1, 2, -3, 2, 0, 0, -7, -2, 0, -1, 10, 7, -2, -7, 1, -9, 11, 7, 1, 4, -4, -12, -17, -2, 2, -4, -3, -14, -12, 6, -8, -7, -4, -3, -15, -5, -3, 0, 1, -13, -7, -10, 11, 5, 8, -4, -8, -12, -5, 2, 5, -5, -10, 0, -10, -4, 6, 8, -3, -2, -6, -1, 0, 9, 4, 1, -8, 1, -8, 2, -2, -1, 7, -11, 1, -2, 1, -6, -7, -5, -2, -4, 3, -3, -3, -6, -13, -7, 0, 2, 8, -5, -3, 3, -3, -4, 4, -13, 5, 2, -14, -1, 8, 1, 2, -5, -3, 4, -1, 11, 0, -6, -6, 0, -3, 8, -3, -3, -16, -9, 1, -6, -5, -7, -7, -10, -13, -4, 10, 2, 4, -8, -13, -6, -3, -12, -1, -8, -4, -3, 4, 4, 12, -5, -12, 3, -3, -2, -3, 16, -4, -1, -12, -11, -18, -6, 3, -9, -5, -10, -6, -11, -9, -5, -7, -10, -12, -7, 2, -6, -5, -11, -15, -7, -1, -2, 2, 3, -10, -8, 0, -2, 4, 2, -2, -3, -2, 2, 1, 2, -2, -3, -14, 3, -2, 15, 0, -9, -10, -5, -10, 3, 5, -10, -11, -11, -5, 4, -2, -5, -16, -12, -10, 13, -4, -10, 2, -7, -7, -7, 8, -1, -11, -2, 0, -9, -1, 7, -10, -13, 1, 1, -1, 8, 2, -2, 6, -10, -8, -10, 1, 2, -7, -6, -11, -3, -17, 4, -6, -5, -7, -8, -1, 0, 0, -8, -4, -12, -1, 3, -7, 3, -5, -2, -3, 3, 11, 9, 5, 10, -2, -13, -8, 5, 4, -8, -9, -20, -10, -5, 3, -4, -2, -8, -13, -1, 1, -1, 3, -8, -17, -10, -11, -7, -8, -5, -14, -9, -6, 6, -5, -3, -10, -13, -4, -11, 7, -4, 4, -2, 1, -2, 2, 5, 0, -1, -3, -10, -6, 0, 8, 0, -5, -10, -6, 9, 12, 9, 5, -10, -10, -2, 4, 2, 3, 0, -9, 3, -3, 2, 5, -8, 6, -1, -2, -3, 6, 2, 3, -5, 1, 5, -5]
4313eJ8j0Jn%LKnlOj3J3LnNj1lMNJ4rjj1oJ0J8j3Jpj4J4jJ2mrKNjkJ1j3JNJqM
4359aMjj1MKJ3pJqqNMQj1OlpKMPjrLj%J6j8jOo%RQnj5OJOkKkj0QOkKJmmmJ2kn
4412bn%jnQJpPLKql%K0rlpKJ5j5NrJ1nOOMk1%jJ5O%ppKj0J0LOr%JmJ4Kj3kokJ4
4463BjmLjmKNj6MQOj4PNMj2Qr%P%jpPpjJ7lkjOj6jJ2klM%LPooLj0mJ3rJpJ1M%
4515BmnRlOj1mJ6kPj0j0KJ3j3J8pj1PmK1rplJoJ6rNJoJlJ2rJpkjnK1lpMnMLKM
4564A0oj0KRKmmk%LRj2J3Kj4%MmJ4k1J6rmQQmkrjkRQjj5LjMJ3rPj1LlN%JnKmn
4614gJ2JrjlJ2nLOnlrQNqPlmPj9K1jj0QNj1jJ3lJj2MLKJLk0QRlQoqmORpMjp%r
4666a3J1j%mjlJOKKj3J7j0oJ8nj2KkRNjLnlnNOJpNj2JOJ0njnLjNjj0J3qjnJ7n
$$ y = [-5, 13, 3, 4, -1, -1, 2, 4, -1, -4, 2, -11, 2, 5, 0, 5, -6, -9, -5, 0, 14, 5, 4, -7, -13, -3, 15, 2, 3, -4, -18, -4, -5, 7, 3, -6, -4, 1, 0, -2, 9, -4, -3, 2, 3, -5, -1, 3, 2, -9, -5, -3, 10, 3, 4, -4, -12, -7, -3, 5, -6, 0, -3, -10, -8, -4, 3, 2, -7, -4, -5, -5, 11, -7, -8, -2, -8, -8, 1, 9, 4, -11, -5, -4, 2, 0, 2, 0, -10, -2, 4, 2, 4, 5, 1, -3, -7, 5, 3, -2, -7, -7, -8, -13, -5, -4, -11, -4, -1, 1, -7, -10, -10, 10, 1, -2, -9, -7, 8, -7, -2, -11, 0, -5, 1, 7, 11, -10, -10, -11, 4, 10, 10, 3, -4, -2, -12, -2, 1, 7, -2, -2, -1, -5, 9, 11, -2, -4, -10, -12, 2, 1, -3, 0, -1, -5, -3, 2, -14, -10, -2, 4, -10, -3, 2, 6, -6, 2, -7, -7, 0, 0, -1, -8, -1, -8, -9, 8, 5, 3, 2, 8, -8, -9, 3, 1, -2, 2, 2, 5, 12, 6, 0, 3, -7, -11, 2, -7, -6, -13, -2, 2, 2, -2, -7, 2, -1, 5, -6, -10, 6, 4, 11, 1, -9, -7, 6, -7, 11, 4, -7, 0, -4, 17, 8, 1, -2, -1, -7, 9, 0, 5, 6, 0, 1, -2, 10, 1, 2, -5, -7, -8, -13, 8, 5, -2, 2, -3, 1, 4, 6, 10, 4, -6, -4, 5, 7, 3, -1, -3, -3, 0, 9, -3, 10, 12, -2, -2, 2, -2, 12, -9, 7, -2, -6, 2, 10, 6, 4, -5, -6, -8, 1, 9, 8, -7, -4, -5, -1, 12, 3, 10, -1, 2, -1, 4, 4, 5, 0, 2, -2, -7, 5, 6, -3, -4, -7, 5, 0, 3, 9, 4, 1, -8, 0, 5, -3, 4, 1, -3, 4, -15, 6, 5, -5, 3, 8, -3, -4, 9, 6, 7, -5, -1, 2, 4, 5, 8, -12, -4, 5, 2, 10, 4, -4, -8, -2, 7, 0, 4, 3, -4, -4, -13, -2, -3, -3, -7, -8, -11, -10, -4, -2, 0, -13, 4, -6, -12, 6, 1, -11, -9, -11, -2, 3, 2, 5, 0, -3, -8, -3, 3, 4, -3, 2, -10, -9, -3, 7, 2, 1, -4, -1, -2, 3, 2, -8, 5, -3, -4, -9, 8, 3]
4715Cj1%OnNQlloPKOmmj1QJOKmj0jnJ2mP%qNNKj0QmjMn%LklpRljqOjQRlnmPrO
4771@%jKljnNMKNj0oJ2JkKj0Rj3K0j7JmJ4k3J7%KJ0j9Jj0J5OJm%lj0OKNrjLJ0
4817DoOkOj3PjOjnmoMQoOLj7MKM%Oj5KJ0kkJ6oj9KPjLLnrKMK%J1j3NM%pRkj1R
4869BJKmlk%mRQj4J1k2RQoNjljpNjJ5j9J4qJJ4r%Rj5NNJNqJnjOQo%jj2LLJ2p%
4920Cp%J2j0%nJMJ3qmnNnPj1MPpOj3MjJ3NKj6jPORqmoJLkJPjj3MQnmjkJlQlnN
4973dnJ4n%Qj0lMjNQj2LlrJ4JJ2lj8LMlJ0j0%kJoMoJ1jkJKoKj9QJ0JKmljRLj%
5023CLkj4NPLKjpJ1nOj5L%mkPJ1nMk3jMJ4mOj5JLKKNMj2JqJ2kRokNkkpQjmJOj
5075CjNrk%MoMj2mJ8JmQrjkLKjMj6QqPJ4pJkMj4kJ2olQoJ0Jj2RlJN%Km%q%JRm
$$ y = [3, -8, -8, -2, -7, -2, 6, 3, 0, -6, 1, 3, 9, 5, 1, -10, -2, -1, 5, 7, 3, -7, -8, -13, -1, -5, 2, 2, -6, -1, 4, 6, -4, 4, 0, -1, 3, -2, -2, 1, -1, -4, -11, -2, -5, -6, -14, -8, -9, -1, 8, 5, 0, -4, 3, -6, 0, 0, -1, 1, -2, -3, -8, -3, 1, 3, 8, -2, -8, 4, 5, 3, 5, -5, 4, -9, 11, -6, -5, -9, 5, -18, -1, -1, 1, 11, -8, -7, -17, -2, 4, 5, 1, 1, -2, -12, -6, -4, 1, -8, -9, -6, 4, -2, 4, 2, 8, -5, 2, 1, 7, 6, 1, -3, -9, -5, 3, -3, 3, 6, -11, -7, -5, -1, -1, 5, -10, -8, 2, 0, -2, 14, 8, -11, -9, -2, -3, 0, 3, -2, -11, -9, -5, -3, -3, 8, -5, 0, 4, 4, -3, 6, 4, -7, 2, 3, 5, 1, -2, -4, -4, -8, 1, 9, -5, 6, -16, -7, 1, -5, 0, -1, -4, -5, -12, -7, -8, 7, -12, 2, -6, -5, 9, 0, 0, 9, -6, -1, 4, 5, 10, 2, 3, -2, -3, 3, 11, 5, 5, 4, -8, -5, -2, 10, 3, 3, -4, -4, 8, -2, -2, -7, -6, -2, 11, 3, -1, -6, -1, -6, 1, -10, -6, 1, -6, 0, -13, -9, -10, 3, 8, 10, -6, -7, 0, 6, 15, 7, 3, -3, -2, 1, -1, 0, 7, 6, -7, -3, 5, 0, -4, -5, -7, -6, -9, -1, -4, -9, -4, -9, 5, 0, 0, 8, -2, -5, -1, -2, 3, 11, -1, 2, -1, -10, 4, 5, 17, 14, -4, -1, 3, 0, 10, 0, 0, -2, -1, -7, -3, -9, 2, 1, -1, 0, 2, -4, -2, -21, -13, -3, -2, 0, -4, -7, -8, 1, 4, 3, 3, 6, 4, -10, -5, 2, 5, 7, 6, -1, 10, 5, 11, -4, -1, -1, -5, -7, 0, 11, 6, 10, -13, -14, -10, 4, 0, 6, -9, -8, -5, -3, -1, 4, 8, -4, -3, -11, 1, -1, 8, 2, 0, 5, 3, 1, -6, 2, 1, -3, -2, 4, 3, 2, 7, -2, -4, -4, 0, -6, -2, -14, -18, 0, 1, -3, 5, -4, -5, -7, -4, -2, -3, 1, -15, -7, -15, -8, 6, -1, 0, -2, 2, -12, -14, -2, -8, -11, -3, -9, 1, 2, -10, -1, -4, -3, 2, 2, 4, 0, 0, -8, -8, -7, 2, -2]
5128bjqNKkJ0Rj5kMPppJ3nj5J1%OmKMkn%J7j3%pkJ8qj2J2j6J0j0J9mpJj0JQKj
5174dM%nJ8j0j1J2%j0%NoQNnmoJ3mnJ2qlnJ0lRnnLqJJ1%rJqJ6j1JJ5j1j1MQKk
5221aoJOoJ5qrKj%OLNpj0QPnKj5NkL%%MlmkOpJ2Nj0NnNqPPj8QLmJq%LjOMKrmJ2
5276@nKRj6PpLlkJ3NmnjMJ0pkoQoK%lrRjl%J1j2Oj2NN%J5k1PoOPnN%j0Qj5O%J
5327g%kJ0klJm%KQkj2J4jrKrJ8jj3OoPL%mMj3RlMOojkNpJ5rLpORj0K%Oj2lJ7p
5378BKNj5QLJKj2%joJ0mJ1qmMmJ1qLMnqPRoJkNpJ1qOj4pJ3Mj0QrnJ0ljK0j0oN
5427BoLmPrJ2j0KR%Rj8nOMQkjolNLMKj4JMLqJ2j2kmKLJ0Qk1JmJ2LKpJoJMlRj8
5478a1J6nLlj0RklqQPKMmr%NJ5k1J1lnqJ5Qj1pOLJ1j7qRoqJ3lKJ4j2oMmJ8j7l
$$ y = [-2, -3, -11, -6, -4, -6, 4, 13, -2, -4, 0, 7, 0, -7, 6, 1, -14, -3, -3, 3, -1, 1, 5, 3, -2, -2, 15, 2, 2, -5, -7, 11, 3, -9, 3, -13, -3, -13, 6, 2, -5, -4, -14, -13, -5, -3, -4, 0, 0, -5, 13, 3, -8, 4, 4, -6, -6, -1, -7, 1, 6, 1, -3, -9, 4, 0, -5, 7, -1, -4, -9, 1, -2, 7, 2, -3, 0, -8, -7, 4, 4, -5, -4, -12, 4, -7, -6, 9, -2, -13, -9, -1, 1, -1, -7, -6, 0, -6, 9, 1, -8, -6, -7, -7, -1, 2, 7, 0, -10, -2, 5, 0, 2, -13, -8, -10, -7, -7, -7, -3, -6, -10, -12, -6, -13, -1, 4, -6, -1, -6, -1, -9, -2, 5, -13, -5, -2, -6, -5, -13, -13, -10, -11, -5, -1, 1, -8, -12, 0, -5, -3, 6, -10, -3, -10, -7, -10, -12, 1, 6, 2, -3, -4, 0, 10, 3, 1, -5, 3, -3, -1, -1, -4, -13, -4, -5, -8, -8, 3, -9, -3, -15, -10, -5, -5, 10, -11, -4, -10, -4, 3, -2, 3, 3, -7, 1, -14, -8, -8, -7, -7, -9, 1, -1, -4, -3, -7, -7, -5, 3, 1, -11, 3, 2, -7, -5, -14, 4, 3, -10, -4, -10, -3, 0, 0, -4, 0, -13, -4, -7, -3, 3, -3, -4, -6, -1, -8, 7, -2, 1, -6, 0, 9, -1, 1, 1, 7, -5, -8, 9, 2, 4, 9, -6, 2, 5, 6, 8, -4, -4, -5, -11, -1, -5, 6, -2, -6, -2, -6, 5, -3, 0, 4, -1, -9, -2, 7, 1, 2, 0, 5, -2, 9, 1, 7, -7, -14, -1, 3, -7, 1, -8, -13, -3, -6, -7, 13, 3, -3, 2, -4, -1, -5, 2, -7, 5, -5, -3, 6, 6, 15, -3, -8, -2, 2, 10, 8, 7, 1, -2, 3, 6, 10, 12, -2, -1, 3, 6, -2, 10, -2, -4, -8, -6, -3, 7, 15, -6, -5, -9, 3, 6, 8, 1, 2, -4, -3, 1, -2, 7, -11, 5, 0, 3, 0, -10, -1, -3, -6, -14, -6, 1, 3, 7, 3, -6, -6, -1, 14, -7, 4, 1, -4, -12, 3, 11, 0, -7, -1, 2, 13, -4, -12, -3, -9, -17, -4, -7, -5, 9, -3, -9, -5, -9, 9, -8, -11]
5524a1QlJ7j0pjkJ4j0PKLqjj0J3pJ2KrLj0JRoKLkj3J5LpoLpJ1oOmQj5%RJkRr%
5572eOmlLnLoNJ0KmkklMKPj0nkJ2J4j0o%pmJ1J3kj8oNkJ2NJ1j9lmMLJ4j9NnR%
5620DnRj0kJkJ4Lj2NrjJ3Mk3K0j2PpNmJ2j4Jj%QRj5%j1J0ljNqQrMJ0LooO%lpQ
5668b%jqQJ2Nj3pM%nJ4oj%KnLKj%j5KLJ3NnmNj2J2%njKj0POMj0%pLJ6J2j9Rj3
5716aj1J1Rlo%NjlkRmjJknLMj2OjjKJ1mLj1NRPj4QrrKQJ2j0lKQj4RjmpLPlmqJ3
5768Cj4KJ3pJ3olqOkOMj4kQMMmkmlmKQj3OJJ0Lq%mlMJlMLomJ0lLKkrlJQM%oLo
5822gpRLKnKqJ3lRlpPj4PPoj0J6rLMoRj4jLOPK%j0onJ0L%rnNKLJ3j0qNJkJ0%k
5873Dj1J0jlNqjKNOLj2lqJ6j2NQrPpMMMlj6Q%j1J5M%onJ0kNokNjkOqjOml%kOM
$$ y = [-11, -3, -6, 11, 1, -6, -7, -9, 5, -5, 2, 4, 7, -1, -2, -12, 1, -6, 6, 8, -1, 2, -8, -7, 2, -4, -2, 1, -1, -14, 1, 4, -3, -9, -6, -13, -2, -8, -2, -6, 2, -13, -13, -4, -3, -5, 4, -5, -5, 1, -3, -6, -3, -8, -5, -11, -6, 4, 6, 2, 0, -2, -5, -1, 1, 8, -2, -7, -9, 3, 17, 7, 1, 1, -6, -10, 1, 14, 12, -6, -12, -7, -9, 3, 8, 19, 0, -3, -7, -3, 0, 14, -5, 0, -5, 4, 4, -1, 8, -2, -4, -3, -5, 9, 12, 0, 5, -4, -5, 8, 12, -11, 9, -3, 4, -3, 2, -2, 10, -4, -3, -4, -4, 4, 13, -2, -2, -13, -3, -6, -7, -2, -10, -2, -11, -7, 3, 6, 0, -6, 0, 0, -3, -10, -2, -2, -3, -11, -3, 9, 14, 1, -6, -2, -2, -7, 7, 1, 0, 0, 2, -3, 0, 2, 1, 1, -14, -12, -9, 4, 9, 4, 0, 5, -7, 5, 5, 0, -1, 1, -9, -2, 4, 8, -2, -2, -9, -6, 10, 22, 3, 12, -1, -12, -1, 8, 5, -1, -1, 4, 3, 0, -2, 7, 3, 2, 3, 1, -4, -1, 3, -9, -3, -4, -5, -3, 8, 4, 7, -4, 1, 10, 17, 3, 11, 2, -7, -5, 3, 15, 5, 2, 4, 12, -2, 7, 6, 2, -5, -2, 5, 2, -2, -10, 3, -11, -9, 4, -3, 10, 4, 1, -7, -1, -3, 3, 7, -7, -9, -1, 3, 7, 3, 1, -3, -6, -10, -8, 0, -13, -7, -6, 4, 7, -1, -1, -5, -8, -4, -3, -6, -2, 1, -5, -9, 1, -2, 1, 3, 1, -8, -11, -10, -2, 2, 2, -4, -1, -7, -14, -5, -2, 0, -5, -3, -11, 2, -1, 8, 5, -2, 5, -9, -2, 5, -1, -11, 5, -4, -1, 3, -3, 6, -8, -9, -6, 0, 7, 9, 9, -1, -7, -12, -2, 1, 1, -8, -13, -8, -6, -3, 10, 0, -8, -3, -2, -4, 6, 6, 4, -7, 3, 2, -1, 4, -4, -5, -3, 2, 8, 11, -1, -4, -12, 4, -8, -3, 5, -4, 3, -4, 0, 4, 8, 5, -11, -3, -3, -14, 1, 5, 5, -1, -6, 4, 2, 7, 1, -1, 4, 3, 1, 7, -1, -2, 4, 0, -3, -3, -5, 1, 5]
5925Ep%JJJ5%j3llJ1j2OR%nj7J7rKjMJ1pkJ1j2NmjN%ojjj0J1%JnoJ0lQLJj0jj0
5973a2MnJ4RrpNM%pJ5pmKMllLkjrLMkjL%NnMPokKKlmJ4j5JrlJ5Pjk4OJPrKJQN
6027DpOqN%qPl%J2lj2J1mK%mj1PJ1l%%jnpJ3KMlqNJMj3Mr%oJ7LJKj8J1nNlJ0k1
6077a5J4j1J3NjJ5k5LOj0PLmmRmnPLj2mPmK3j3KoK%lKk%jqJPKoQqjlJKJjLJ1j4
6127hJ5j0kNojPrJ1Kk%%nPqNnnJ5mjpnJ4pPj2lN%JQkn%oO%J4j3pMjPmklQo%LM
6180a%j1MMmJ1JjOk2kJ1NNj0LoOOqj3J3JjQjjjkj1J3koLj1J1qPQ%kJj3NoPNkj1
6229a2NjjJ4nMolkJ3k2J7j2MrJ8Oj5%jPnJ6j1pOlnQjj%lJNmMRj7L%LJjkLj4J3
6277cnLNoKJkMQrPj3J4j3J7j1jlQLJqMr%KKPrPjj4KJ6jj0%J1j3mJ3okqJ5%PrJ
$$ y = [5, -2, -2, -1, 0, 15, 15, 2, -1, -4, 7, -5, 1, 10, 10, 5, -12, 5, -4, -2, -3, 1, 12, 5, 3, 14, 2, 7, 3, 2, 7, 7, 1, 0, -1, -11, 0, 0, 1, -4, -10, 0, -3, 5, 8, 9, -1, -2, -12, -8, -13, 1, 10, 1, -6, -1, 3, 3, -4, 11, 4, 0, 2, 6, 3, 0, 3, 1, 0, -9, -6, -2, -4, -5, -2, -2, 3, -2, 2, 9, 3, 1, 3, 5, 2, -2, 12, -3, -2, -11, -14, 1, 8, 7, -17, -11, -10, -3, -12, -10, -9, -1, 4, -3, 3, -5, 0, 0, -8, -1, -4, -4, 8, 5, -7, 4, 0, 2, 2, -2, -13, -6, 5, 2, 2, 2, 1, -4, -11, 2, 4, 8, 5, -3, 2, 3, 7, -6, -2, -11, -11, -17, 0, 3, 4, 6, -12, -1, -6, -1, -4, 6, -15, -1, -12, 1, 6, 5, 20, -5, -2, 4, -6, 1, 4, 0, -4, 5, 1, -4, 3, 6, -6, -10, -3, -7, 16, 3, 5, -1, 1, 1, -2, 0, -2, -2, -3, -11, -10, -3, -1, -7, 1, -7, -8, -11, -10, -8, -7, -8, -5, 6, -8, 7, -3, -5, 0, -6, -7, 0, -9, 2, 4, 2, 2, 2, -3, 4, -4, 1, -4, -9, 6, 2, 1, -6, -11, 3, -4, 3, -9, -12, -7, -7, -6, 2, 0, -5, -5, -11, -5, -5, 9, -4, -11, -7, -8, -1, -5, -7, -10, -2, -8, -8, -5, -1, -1, -12, -8, -4, -8, 3, 4, 3, 9, -13, -15, -4, 1, 6, -4, -1, -7, -1, 5, -3, -16, -3, -2, -3, 5, 4, 3, 2, 0, -11, 2, 0, -6, -3, -14, -3, -11, -4, 4, 4, 2, 3, -10, -5, -11, -4, 1, -1, -12, -7, -8, -9, 5, 0, 4, -2, -5, -7, 6, -16, 1, -11, -7, -16, 2, 8, -7, -7, -8, -1, -6, 10, -1, -8, -2, -5, -10, -2, -3, -4, -4, -7, -6, -1, -5, -1, 8, -9, -6, -6, -3, -2, -3, -5, -2, -16, -3, -8, -5, 0, -6, -4, -3, -5, -1, 7, -2, 5, -8, 6, -7, 10, -1, -2, -5, 3, 6, 7, -1, 3, -6, -6, -4, -2, 5, -4, 3, 2, -12, -10, 6, 5, -5, -5, 6, -7, -11, 2, -4, -6, -14, 1, 1, 8, -1, 0]
6326@plJ7j2J0J0mQk7OJ5k3R%lQj5ROkKmJKKlLj0J0ljLMj6NJlPMk0RrPJ3mJoJ
6374bmNJ1pjo%mOOlnPj5J0J1j2jlJMoPNj5jQj0J9Jjj3JJNlQjrkKMRqll%J2JqK
6425@jNjMlklrLJ1mPj3J%JjkJ4j6J0Olj9J8kj1J0%nlJ2prJ2j2J8kqM%oJ2lJj6
6471a2KOjKjJRrj1ONk%lNj6J0NJNj5J3jNlJnNj1J6j8RK%mnPNLj4MKOJKrJkj4J2
6521eJ2mLolQmMpNJj2JJ6j1KpJNJLj1QjjN%QJkq%mLKOj3nNOqjJQkpJ7k0J5kj1
6572hJ1nnNrQnJ4%LjrNj5ORpLMj0QNjq%mQjn%JjKnMQlnlkJ1j2kOqJ1pQMqJ5k5
6624a5J1JjOj2J2kKjjNorPjJ0oojOj1J0MnKj0J2m%JKrMlLjQrJ0j7RNj1NNnJMk
6673cnKkNnRlNlmlkQnkk%QnNLLlnpoJ2Nj2M%jJ0%mmjPPolMmj1J8%o%nPRrkO%J
$$ y = [0, -7, -10, 7, -5, 5, 15, 11, 19, -8, -2, 13, -10, -1, -1, -4, 4, -11, -2, 4, 2, 4, 0, 1, 3, 5, 2, 5, -5, 5, 2, 1, 4, 8, -8, -3, -2, -5, 2, 6, -14, -5, -14, -7, 6, 2, 3, -3, -2, -6, -1, 10, 3, 2, -4, -4, -8, -2, 4, 1, -4, 3, -12, -2, 9, -3, -4, -7, -6, -2, -8, -1, 4, -11, -12, -4, -14, 5, 6, 5, -8, -7, -6, -1, -4, 4, 3, -6, -8, -6, -2, 7, -1, -4, -7, -7, 5, 6, -2, 0, -1, 4, 3, 7, 4, 2, -1, -10, -7, 4, 0, 7, -6, -5, -5, -4, -5, -7, 7, -9, 1, 7, 4, -15, 3, 1, -10, 0, 0, -5, -8, 4, -3, -12, 0, -12, 6, 4, -4, 0, 0, -6, 6, 3, 4, -12, -10, -4, -5, -3, -4, -3, 6, -3, -14, -8, -3, -5, -5, -8, -3, -19, -9, -4, -3, 2, -13, 0, -1, 4, 1, 2, -3, 2, -9, 7, -11, -2, 0, 0, -4, -9, -2, 3, 6, -8, -4, -2, 4, 5, 7, -2, -1, -3, -17, -5, 7, 3, 6, 0, -3, 5, 1, 5, -2, 3, 4, -8, -7, 9, -2, 0, -7, -6, -1, 0, 3, -8, 0, -1, -2, 3, 3, 11, 12, 10, 2, 2, -2, 1, 3, 9, -4, -9, -4, 2, -6, -7, -6, 2, 0, -7, 10, -10, 5, 3, -8, 3, -2, -7, -2, -11, -3, -8, 6, 6, 9, 8, -1, 4, -11, -5, 4, -3, 0, 4, -6, 2, 7, 6, -2, -2, -6, 2, 1, -4, -4, -3, -4, -2, -7, -3, 5, 2, -3, -6, -8, 3, -9, -11, -5, -13, -2, -9, -1, 3, -5, 10, -15, -4, -3, -4, 2, -10, 2, 0, 2, 1, 0, 5, -1, -10, -3, -4, 6, 0, -6, -7, -1, -12, -2, 2, -3, -1, -11, 1, -3, -3, -2, 0, -9, -5, -8, -5, -6, 2, -7, 3, -14, -5, 0, -11, -6, -1, -6, -5, -1, -3, -8, -6, -8, -3, -8, 1, -2, 3, 0, -4, -7, -9, -1, -6, -8, -10, -10, -2, -7, -2, 1, 4, 1, -4, -11, -17, -5, 0, -12, -8, -8, -9, 1, 1, -3, -7, -8, -1, 6, 0, -3, 1, -3, -14, 4, 4, -2, -2, -7, 0, 9, 0, -2, 4, 4, 5]
6729EqJ4olnQlj5MQj2QLLOomQj0KLjkNjkPj0PPj2j2K1qMLmJLOj0MlOolpJ1pJ8
6779A5j0ol%NRj1j0PJj%J0qMqjJ4qQoj2J0NjoRNj2KJ2l%nmLojPnNmpRklpJ7j2
6828ekJ6rlmJrJ8mlMKNj7PkPj1JQokPnlLRkQqjLmj0PjLmn%PjLlLomJ2kMpQnNl
6883@jj%Oj0PjKmJmKJ0NqqPr%MlPj3LQLkj%j0jJ1pOjNojokJ1noJ1mMMJnqLJ0p
6936cjJ2j6PJKKlokpMJ2lqQJ2qrMNrkokJ4j0R%KKrJ3mlKMj5J3NppJ1qJJ3pKrN
6986ALklPqOj6jJ2q%J0%j4J4JoKj1PNOJj7J8j2OoRQj9MJ3j5OJ2qmpjqJ1J1j3j
7031gPjoJ5j2okKNj0J0j2LRmMPlNj4J7j5QMmJ4k7P%J7pOj0kpK3j2kOolJrJ7Jj6
7077iKJM%pJ0pNj0QKqJ4j1mORlKrOj5K0oJ2k1K1k0J7rOjqKkKM%nNljLNj2NrjJ1
$$ y = [5, -3, 11, 5, 2, -3, 5, 2, -13, -9, -1, -13, -5, -2, 1, 7, 1, -3, 5, -5, -3, 0, -1, -3, 2, 1, -1, 6, -4, 3, 10, -2, -14, 7, -1, 3, 6, 2, 3, 6, 12, 2, 6, 3, 9, 3, 0, -7, 4, -3, 15, 5, -1, -4, -4, 1, 10, -1, -11, -4, -3, -4, -4, 6, -2, 2, -6, -7, 7, -1, 7, 1, -11, -1, 4, 3, -3, 6, 11, -1, 1, 13, 10, 10, 5, 1, 4, -2, -3, 4, -1, 4, 0, -7, 2, 0, -3, -10, 7, -5, -7, 9, 0, -3, -7, -6, -15, 3, -1, -4, 0, 2, 7, -10, -3, -5, 2, -9, -8, 0, -6, -8, -1, -6, -9, -6, 3, 1, 9, 1, 0, 3, -1, -11, -4, -5, -2, -6, -11, -11, -4, -5, -2, -5, -2, -8, -12, 0, -2, 2, -5, 3, -2, 3, 0, -1, -2, -2, 4, -6, 1, 0, 2, -2, -1, -5, -3, 7, 12, 4, -4, 3, -6, -6, -2, -5, 2, -11, -8, 0, 3, 1, 0, 0, -10, -11, 0, -7, -1, -2, 3, -3, -4, -10, -12, -1, -6, -12, -1, -5, -1, 3, 4, -1, -9, -6, 4, -3, -4, 8, -8, -1, 0, 2, 4, 1, -5, -7, -14, -10, 2, -1, -9, -1, 11, 3, -6, -2, 3, -6, -8, -14, -16, -2, -12, -3, -3, -1, 1, -8, 5, 1, -2, 0, 4, -11, 2, 7, 0, -7, 4, -4, -3, 10, 3, 5, -4, 1, 4, 2, -1, 6, -2, 4, -12, -13, -1, -9, -9, 1, 1, -13, 1, 2, -4, -2, -13, -6, -1, 5, 6, -11, 7, -5, 1, -5, 4, 12, -7, -3, 10, -5, 1, 13, 5, 1, -6, -7, -15, -4, 7, -6, -7, 0, -1, -7, 8, -4, -10, -12, -10, -5, -15, -5, -17, -14, -5, -9, -5, 2, -1, 4, -10, 7, -8, 0, 4, 0, 14, -13, -6, -6, 11, 4, 10, 0, -2, -9, 14, 2, 0, 6, 0, -3, -2, -11, 6, 7, -9, -7, -6, -2, -2, -9, 1, -6, -1, -11, -3, -1, -9, 5, -6, -10, -4, 5, 2, 4, -5, 1, -14, 6, 0, 12, -9, 12, -8, 9, 0, 6, 5, -3, -1, -3, -1, 3, 3, -2, 3, 0, -1, 2, 7, -5, 0, -9, -10, 1]
7126A%pMmoRnNjJ1j0%J0lmnMKJNj0J1lJrOJrJ0j2KRnlJ0nMj0RmjJ1j2pRnQmj0
7175a1OpLON%Oplj7L2%ooJknMLNj1KKmJ6j2nJmRr%LQj5MRkqJ4j4Rj3NJ0Ok3K0
7223Ej1J3MlnRqKn%NnoOJ0kj2NLkj3J1Qj7J0pP%nkRqJJ%j%%K%LkLJK%loK0j8J
7274@rKjJ2kJLpNoJOOj2QpQj2kMj4J3lL%NJpJ5j9RnqJ0oJ2jMmpoQOPj4%LlMlR
7325GJLn%jLoKrrJ7lkJKm%NRpj3JJKRj1J2oJjjnPRmqKNnlRoOmLJlJoJJ3j2nJ2
7379FrjjPpJ3mrLoQLjj0kLJ3%JkqLNqJ4j4NKonJ2kj4J4knQPomjKoQkrRj5J4Nj
7430E%Kp%%LpNKlRj2J0jlk%kQj3LlKJ6j6Qjj5J0j4J6qJ4pmoJJ2mJlLoljJ3oNn
7479dLkKNJnj2KMJ0jLMrlRJnJrJkJ0Nj1NoJOj3kLNlM%mMlJ1j1PnQnkPPk0J1Oj0
$$ y = [1, 1, -6, -2, -6, -12, -3, -8, -3, -4, 7, -3, -3, 7, 4, 0, -5, -1, 1, 2, 7, -3, 8, 5, 6, -3, 3, 4, -5, 5, -7, -5, 4, -1, -4, 6, 1, 5, -5, 4, 0, -1, 10, -2, -9, 0, -5, 3, -1, -11, -5, -12, -9, -3, 2, 2, 8, 1, -2, -19, 13, 13, 7, 1, 2, 0, -5, -1, 2, 7, -4, -2, 0, -4, 12, 0, -5, -4, -8, 1, -8, -8, -5, 3, -12, -8, 1, -1, -9, 5, -9, 0, -13, -8, 2, 8, -15, 5, -6, 7, 11, 8, 3, 12, 4, 6, 1, 1, 6, 1, -5, 1, 11, 9, -3, 2, 5, 3, -10, 1, 9, -8, 2, -5, 2, 2, -3, -5, 4, -4, -3, -2, -2, -3, -3, -3, -1, -1, 2, 0, 3, 4, 6, 6, 3, -3, 17, -1, 0, -9, -7, -8, 4, 2, 3, 6, -1, 4, -2, -1, 5, 11, -1, 7, 0, 8, -4, -6, -2, -16, -3, -6, -3, -3, 2, 3, -4, 11, -8, 1, -4, -12, -2, -8, 4, 3, 7, 3, -4, -10, -2, 4, 11, -3, -3, 0, -3, 1, -2, 7, 8, 11, 6, 6, 5, 8, 2, 4, -5, -14, 3, 0, -2, -1, 1, -3, -3, 2, 11, 4, -9, -8, -7, -5, 4, -7, 5, -1, 0, -1, -2, -7, 0, 9, 5, -3, -1, 4, -1, -4, 5, -1, 5, 1, 4, 5, 2, 3, -3, -2, 11, -1, -6, 6, -3, -4, -5, 2, -5, 8, 4, -5, -2, -8, 0, 3, 2, -8, -10, -7, 6, 6, 7, 5, -3, 0, 5, -3, 11, -3, 2, 4, -2, -7, 5, 3, -11, 3, 1, -4, 4, 11, 5, 1, 0, 2, -4, 4, 2, -7, 2, -13, 1, 6, 5, 5, 7, 0, 0, 0, 3, -4, 1, 3, 0, 9, -3, 7, 6, 3, 1, 1, -1, 7, -6, -3, -6, -4, 12, -4, 4, 3, -12, -2, -16, 0, -8, 6, -1, -5, -11, -10, 2, -2, -1, -4, -1, -7, -10, -11, 2, -4, 1, -4, -1, -3, -1, 4, 5, 0, -12, -10, -6, 4, 3, 6, 10, 1, -2, 7, 8, 3, 4, -5, -4, -6, 4, 9, -2, 3, -3, -2, 4, -9, -11, -8, -3, -6, -2, -2, -6, -2, -5, 6, -5, 2, -3, 5, 0, -2, 5, 12, -8, 3, 9, -1]
7531aLLnMlNmoJ7pKmoNj0LRlmLj6J2PMjj0NpRJj3QqJ2nJ5llpo%RQj4OkpKNoK0
7582A6j5kMjqN%knNlNlNj0lNJ0J0mj1ljNjLkmNmQmNKl%rPoJ3mj5QPkmqMMOJj3
7634gO%j0JOJ0n%oOqJ2j3J7Ooj2KJ0rJmJ1ojKkLpk%QJrMlKKn%KrJ0llMrJ2lMm
7685dLjJ0mJj1J7j0MJ3j1mpJ1Lj1JJMKpMj1NMmM%lmj%NJ4j6NknRpJ0okk%mJ5r
7733aNNoOmMppNrJ8njQrJoMRLj5NJqmPKnJ1j0lOOj3PlPKqlJ2JojKKKj5J8mkMQ
7786A6rnnPpRmoJ2rjLpJ1mlj1J0JLmNj1nJ0JJm%J3qK%LqNOrkJ0qPkKnMnlKpJ2
7837CkljJrR%mLQoKMkJ%krJ0%NqLj4QJJJ0onNkMoJ1j7R%nJ7nj5LNkRkqj%jNNr
7891bllMQj1J0KrlLmJ4j2J0%jOJj0OKj3RNj4MKJoQJj5MjOj3J8oJ1j2lMJNj2J1
$$ y = [-1, 2, 5, 0, 4, 1, 6, 2, -4, 13, 6, 8, 4, -2, 3, -7, -4, 5, 2, -2, 1, -15, -3, 4, 8, 7, -3, 2, -5, 4, 5, -8, 0, -8, 4, -1, 14, 11, 8, 1, -5, -5, 4, 12, -2, 4, 2, -5, -3, 2, -4, 16, 1, -1, 3, 2, -6, -1, -1, -3, -8, -3, -6, -1, -4, 1, -9, -12, -7, 3, 13, 9, -2, -5, -6, -1, -2, 1, -1, -5, 0, -4, 4, 0, 5, 7, 4, 4, -5, 2, -4, 9, 5, -10, -2, 5, 3, -1, -9, -5, -1, 5, 6, -7, -1, -1, -11, -10, -4, 6, 1, 1, -5, 1, -7, 5, -8, 9, 15, 9, -3, -1, 9, 0, 1, -3, 8, 2, 1, 3, 1, 4, -3, -5, -5, 3, 4, -5, -1, -4, -2, 0, -5, -5, -3, -12, -2, -5, -8, -4, -13, -1, -4, 0, -4, -1, -2, 8, 4, 5, -6, 11, 1, 5, 18, 7, 3, -4, 7, 10, -1, 0, 1, 5, 7, 0, 4, -7, -2, 2, -2, 2, 2, -1, -5, -6, -6, -1, 13, -3, 2, 0, -5, 4, -3, 7, 1, -1, -3, -3, -7, 8, -1, 4, 9, 3, 9, 5, 9, 2, -5, 0, -9, 9, 4, 3, 11, 2, 3, -3, 1, 10, 13, -2, 3, 4, -4, -8, -1, 1, -4, 7, -3, -6, 0, 6, -7, 0, -3, 4, 6, -2, -5, 7, 8, 2, 1, 3, 5, 7, -8, 10, 6, 4, 8, 16, 7, 2, -3, 4, -3, 6, 2, -4, 8, -1, -2, 1, -6, 5, 1, -2, -13, -3, -2, 1, -3, 2, -9, -14, -4, -3, -2, -6, -6, 7, -1, 1, 1, 4, -4, 1, 7, -2, -4, 6, -2, 5, 3, 5, 0, 4, -1, -4, -2, -9, 3, 1, -2, -3, -2, -11, -2, -2, -6, -3, 5, -1, 1, 5, 3, 4, 4, 2, -7, 3, 3, 8, 0, 3, -11, -3, -2, -1, 9, 3, -2, 3, 1, 5, -1, 10, -7, 2, 2, -3, 14, 9, -6, -3, 2, 0, 9, 7, -1, -2, -2, -3, 2, 7, -2, -5, -8, -4, 4, -7, 3, 5, -4, -7, -4, -8, 6, -6, 4, 4, 3, 9, 10, 0, 6, 8, -5, 4, 9, -5, -1, 1, 2, -4, 4, 5, -10, -6, -7, -1, -14, 4, -2, 9, -3, -6, -2, -1, 4, -8, 3]
7937CJ2rpkkMJPjpRpKPkkjMj0OjjmqJ4LmmJ0Lk6J3k%PKj0J2k3J7KqOpNKOj2Nl
7987anQJOnmlM%jMoJ4q%lNLj8JNJ5mqKjNj4J0moNJ2npLkKjJ1j1J1j2J7roRj2R
8036FJ%Jkm%KpkJ0j2J2pMprRKoJ5j0%Jj0OONPj1nJ3JpPrlOrNKJPlJMKkkk2J2O
8087EJnOomKJ0rjoPjMlOjmpJ0%Nkk2J4%J6pOj1jnOOnlLlMoJ1%nKjp%Pj5LkOkj
8140eJ4j0pRjKK%Noj2LJ1%Ml%%KJLlmloJ6j1ONk1QNNj7OlPlJJnMmLmKkklMJ4
$$ y = [3, 15, 6, -1, -3, -5, -1, 0, 7, 6, -1, 8, 1, 3, 10, 8, 6, 5, 9, -1, 5, 4, 3, -1, -9, 5, 8, 4, 0, 10, 13, -13, 0, -2, -2, 5, 7, -3, 9, -14, 3, 5, -3, 3, -4, 1, 3, 9, -3, 2, -1, -6, 2, 3, 9, 4, 0, -3, 1, 1, 0, 4, -2, 12, 4, 4, 1, 6, 9, -9, -8, -3, 12, 8, 0, 2, 1, 6, -8, 2, -2, -8, -3, 9, 4, -3, 0, -2, 0, -1, 10, -1, 10, -2, 15, 6, 0, 9, -3, 6, 7, 7, 8, 6, 2, 2, 4, -3, -5, 5, -7, 5, -2, 2, -5, -14, -5, -3, -9, 6, -4, -4, -3, -13, -7, -1, 4, 11, 0, -5, 8, 9, 2, 9, 0, -3, 3, -6, -1, 1, 2, 9, 6, 7, 11, 13, 11, 9, -13, -1, 5, 6, 1, 7, 1, -3, -1, 9, 0, -1, -7, 0, -1, 3, 0, 6, 5, 1, -6, 4, 4, 9, 7, -15, -1, -1, 15, 8, 14, 3, 2, -3, 3, 9, 4, 1, 4, 1, 5, -1, 10, 10, 5, 7, 6, -1, -1, 6, -9, -6, -8, -2, -4, -5, 9, -1, -8, 1, 0, 2, 4, 4, 9, 3, -9, -6, 5, 5, 9, 6, 6, 6, 8, 9, 12, 9, 5, 2, -4, 12, 1, 7, 12, -9, -1, 4, 9, -8, -2, -5, 2, -1, 0, 1, -4, 0, -4, -1, -5, -3, -5, -7, -10, -6, 8]
8191H
##END NTUPLES=NMR FID
##END=
