##TITLE=1H_AM_NV130
 CDCl3
 8 sc, 
 13.2.2024
##JCAMPDX= 6.0         $$ Bruker NMR JCAMP-DX V2.0
##DATA TYPE= NMR FID
##DATA CLASS= NTUPLES
##ORIGIN= UXNMR, Bruker Analytische Messtechnik GmbH
##OWNER= root
$$ XWIN-NMR		Version 3.5
$$ Tue Feb 13 15:50:41 2024 Russian Standard Time (UT+4h)  she@DPX200
##.OBSERVE FREQUENCY= 200.1313
##.OBSERVE NUCLEUS= ^1H
##.DELAY= (6, 6)
##.ACQUISITION MODE= SIMULTANEOUS
##.ACQUISITION SCHEME= undefined
##.AVERAGES= 8
##.DIGITISER RES= 18
##SPECTROMETER/DATA SYSTEM= spect
##.PULSE SEQUENCE= zg30
##.SOLVENT NAME= CDCl3
##.SHIFT REFERENCE= (INTERNAL, CDCl3, 0, 15.7039)
##AUDIT TRAIL= $$ (NUMBER, WHEN, WHO, WHERE, WHAT)
$$ ##TITLE= Audit trail, XWIN-NMR		Version 3.5
$$ ##JCAMPDX= 5.01
$$ ##ORIGIN= Bruker BioSpin GmbH
$$ ##OWNER= she
$$ F:/spectra/data/she/nmr/H-F/1/audita.txt
$$ ##AUDIT TRAIL=  $$ (NUMBER, WHEN, WHO, WHERE, WHAT)
(   1,<2024-02-13 15:49:31.42 +0400>,<she>,<DPX200>,
      <created by zg, POWCHK disabled, PULCHK disabled
       configuration hash MD5:
       00 E9 B6 7A A2 85 ED C7 34 08 36 98 17 FE 4E 26
       data hash MD5: 16K
       07 85 D3 1C 25 47 62 DA 5F 6C AF 1B C5 CF 5B 3E>)
$$ ##END=
$$ 
$$ hash MD5
$$ 57 02 9A C2 F9 98 E6 55 33 58 89 E9 53 69 8F C3
##$RELAX= 
##$RELAX= 
##$RELAX= 
##$RELAX= 
##$RELAX= 
##$RELAX= 
$$ Bruker specific parameters
$$ --------------------------
##$DU= <F:/spectra>
##$EXPNO= 1
##$NAME= <H-F>
##$PROCNO= 1
##$TYPE= <nmr>
##$USER= <she>
##$AMP= (0..31)
100 100 100 100 100 100 100 100 100 100 100 100 100 100 100 100 100 100 
100 100 100 100 100 100 100 100 100 100 100 100 100 100 
##$AQSEQ= 0
##$AQ_mod= 1
##$AUNM= <au_zg>
##$AUTOPOS= <>
##$BF1= 200.13
##$BF2= 200.13
##$BF3= 200.13
##$BF4= 200.13
##$BF5= 200.13
##$BF6= 200.13
##$BF7= 200.13
##$BF8= 200.13
##$BYTORDA= 1
##$CFDGTYP= 0
##$CFRGTYP= 5
##$CHEMSTR= <none>
##$CNST= (0..31)
1 1 145 1 1 1 1 1 1 1 1 1 1 1 1 1 1 1 1 1 1 1 1 1 1 1 1 1 1 1 1 1 
##$CPDPRG= <>
##$CPDPRG1= <>
##$CPDPRG2= <>
##$CPDPRG3= <>
##$CPDPRG4= <mlev>
##$CPDPRG5= <mlev>
##$CPDPRG6= <mlev>
##$CPDPRG7= <mlev>
##$CPDPRG8= <mlev>
##$CPDPRGB= <>
##$CPDPRGT= <>
##$D= (0..31)
0 1.2 0 0 0 0 0 0 0 0.06 0 0.03 0 0 0 0 0.0002 0 0 0 0 0 0 0 0 0 0 0 0 
0 0 0 
##$DATE= 1707824970
##$DBL= (0..7)
120 120 120 120 120 120 120 120 
##$DBP= (0..7)
150 150 150 150 150 150 150 150 
##$DBP07= 0
##$DBPNAM0= <>
##$DBPNAM1= <>
##$DBPNAM2= <>
##$DBPNAM3= <>
##$DBPNAM4= <>
##$DBPNAM5= <>
##$DBPNAM6= <>
##$DBPNAM7= <>
##$DBPOAL= (0..7)
0.5 0.5 0.5 0.5 0.5 0.5 0.5 0.5 
##$DBPOFFS= (0..7)
0 0 0 0 0 0 0 0 
##$DE= 6
##$DECBNUC= <off>
##$DECIM= 32
##$DECNUC= <off>
##$DECSTAT= 4
##$DIGMOD= 1
##$DIGTYP= 9
##$DL= (0..7)
0 120 120 120 120 120 120 120 
##$DP= (0..7)
150 150 150 150 150 150 150 150 
##$DP07= 0
##$DPNAME0= <>
##$DPNAME1= <>
##$DPNAME2= <>
##$DPNAME3= <>
##$DPNAME4= <>
##$DPNAME5= <>
##$DPNAME6= <>
##$DPNAME7= <>
##$DPOAL= (0..7)
0.5 0.5 0.5 0.5 0.5 0.5 0.5 0.5 
##$DPOFFS= (0..7)
0 0 0 0 0 0 0 0 
##$DQDMODE= 0
##$DR= 18
##$DS= 0
##$DSLIST= <SSSSSSSSSSSSSSS>
$$ [...]
##$SUBNAM2= <"">
##$SUBNAM3= <"">
##$SUBNAM4= <"">
##$SUBNAM5= <"">
##$SUBNAM6= <"">
##$SUBNAM7= <"">
##$SUBNAM8= <"">
##$SUBNAM9= <"">
##$SW= 18.0517328524113
##$SWIBOX= (0..15)
0 0 2 0 0 0 0 0 0 0 0 0 0 0 0 0 
##$SW_h= 3612.71676300578
##$TD= 16384
##$TD0= 1
##$TE= 0
##$TE2= 300
##$TE3= 300
##$TEG= 300
##$TL= (0..7)
0 120 120 120 120 120 120 120 
##$TP= (0..7)
150 150 150 150 150 150 150 150 
##$TP07= 0
##$TPNAME0= <>
##$TPNAME1= <>
##$TPNAME2= <>
##$TPNAME3= <>
##$TPNAME4= <>
##$TPNAME5= <>
##$TPNAME6= <>
##$TPNAME7= <>
##$TPOAL= (0..7)
0.5 0.5 0.5 0.5 0.5 0.5 0.5 0.5 
##$TPOFFS= (0..7)
0 0 0 0 0 0 0 0 
##$TUNHIN= 0
##$TUNHOUT= 0
##$TUNXOUT= 0
##$USERA1= <user>
##$USERA2= <user>
##$USERA3= <user>
##$USERA4= <user>
##$USERA5= <user>
##$V9= 5
##$VALIST= <valist>
##$VCLIST= <CCCCCCCCCCCCCCC>
##$VD= 0
##$VDLIST= <DDDDDDDDDDDDDDD>
##$VPLIST= <PPPPPPPPPPPPPPP>
##$VTLIST= <TTTTTTTTTTTTTTT>
##$WBST= 1024
##$WBSW= 4
##$XGAIN= (0..3)
0 0 0 0 
##$XL= 0
##$YL= 0
##$YMAX_a= 59055
##$YMIN_a= -86425
##$ZGOPTNS= <>
##$ZL1= 120
##$ZL2= 120
##$ZL3= 120
##$ZL4= 120
##$ABSF1= 10
##$ABSF2= 0
##$ABSG= 5
##$ABSL= 3
##$ALPHA= 0
##$AQORDER= 0
##$ASSFAC= 0
##$ASSFACI= 0
##$ASSFACX= 0
##$ASSWID= 0
##$AUNMP= <proc_1d>
##$AZFE= 0.1
##$AZFW= 0.1
##$BCFW= 1
##$BC_mod= 2
##$BYTORDP= 1
##$COROFFS= 0
##$CY= 11.3945322036743
##$DATMOD= 1
##$DC= 2
##$DFILT= <>
##$DTYPP= 0
##$F1P= 15.7292609196834
##$F2P= 12.9074282941183
##$FCOR= 0.5
##$FTSIZE= 0
##$FT_mod= 4
##$GAMMA= 1
##$GB= 0.15
##$INTBC= 1
##$INTSCL= 1
##$ISEN= 128
##$LB= 0.24
##$LEV0= 0
##$LPBIN= 0
##$MAXI= 10000
##$MC2= 0
##$MEAN= 0
##$ME_mod= 0
##$MI= 1.114404
##$NCOEF= 0
##$NC_proc= 0
##$NLEV= 6
##$NOISF1= 3.799351
##$NOISF2= 2.8
##$NSP= 1
##$NTH_PI= 0
##$NZP= 0
##$OFFSET= 15.70392
##$PC= 1
##$PHC0= -24860.69
##$PHC1= 14.85265
##$PH_mod= 1
##$PKNL= yes
##$PPARMOD= 0
##$PSCAL= 0
##$PSIGN= 0
##$REVERSE= no
##$SF= 200.130013532006
##$SI= 16384
##$SIGF1= 3
##$SIGF2= 2
##$SINO= 400
##$SIOLD= 16384
##$SREGLST= <1H.CDCl3>
##$SSB= 0
##$STSI= 0
##$STSR= 0
##$SW_p= 3612.71676300578
##$SYMM= 0
##$S_DEV= 0
##$TDeff= 0
##$TDoff= 0
##$TI= <>
##$TILT= no
##$TM1= 0
##$TM2= 0
##$TOPLEV= 0
##$USERP1= <user>
##$USERP2= <user>
##$USERP3= <user>
##$USERP4= <user>
##$USERP5= <user>
##$WDW= 1
##$XDIM= 8192
##$YMAX_p= 0
##$YMIN_p= 0
$$ End of Bruker specific parameters
$$ ---------------------------------
##NTUPLES= NMR FID
##VAR_NAME=  TIME,          FID/REAL,        FID/IMAG
##SYMBOL=    X,             R,               I
##VAR_TYPE=  INDEPENDENT,   DEPENDENT,       DEPENDENT
##VAR_FORM=  AFFN,          ASDF,            ASDF
##VAR_DIM=   8192,          8192,            8192
##UNITS=     SECONDS,       ARBITRARY UNITS, ARBITRARY UNITS
##FACTOR=    0.0002768,     1,               1
##FIRST=     0,             0,               0
##LAST=      2.2672688,     0,               0
##MIN=       0,             -86425,          0
##MAX=       2.2672688,     59055,           0
$$ Real data points
##PAGE= N=1
##DATA TABLE= (X++(R..R)), XYDATA
0@%%%%%%%%%%%%%%%%qJ6j6J6j6J7k5L2l3M1m8N6o5P3q8J04j13J22j42J65j84K02
38A06k27K57k88L20l53L92m32M74n25N81o42P07p79Q59r48J045j151J272j409
57g41J569j753J965k222K533k915L407m069N005o435Q927j4484M8948j8736r3290
72g2291L8520L6124K6016P971k8231m1009J1265J5983J2272J4056J590k0186k6552
85b4472k0976M1539O2964k0924o7907q962K1400K3314L0982o782m5432j5315R212
98b1359J8118L5187M531m2941k5871K352K2183M7948N444o4115k7011L5675K0029
111A0170M282Q816j7239k7025k722J3782K5014J7931j8213l2458j7393R787M9027
124B3759L1435m7641n1201J6043K8412J4878J7167j9109m3601P83K9391J4194
$$ plain form
0 0 0 0 0 0 0 0 0 0 0 0 0 0 0 0 0 0 -8 8 -8 8 -8 9 -16 16 -17 24 -24 32 -33 40 -48 56 -57 65 -77 88 -96 106
38 106 -121 136 -152 168 -185 207 -225 249 -276 305 -337 370 -409 450 -498 547 -604 668 -741
57 -741 828 -925 1040 -1182 1351 -1564 1843 -2226 2779 -3656 5271 -9213 39735 20999 -72291
72 -72291 -33771 2353 28369 36340 8109 -32900 -21635 -5652 6620 20676 22266 2080 -24472
85 -24472 -45448 -3909 59055 38131 -29776 -38738 -17338 5976 36958 30176 -15256 -30571 -21359
98 -21359 -3241 31946 36477 -6464 -32335 -29983 -7800 40148 45592 -18523 -45534 -9859 10170
111 10170 14452 23268 6029 -20996 -23718 -9936 15078 33009 14796 -17662 -35055 -25268 23759
124 23759 55194 7553 -43648 -27605 807 15685 32852 13743 -29858 -29075 316 14510
136A4510P145p639k6768j1890J0640K0206K1933o639l4460j4472J1446J8160K5385
149B7557K128l9436k7131J6815L0986K0616q830l6805j7150J8484K1223J3954
161B2411j040k8090j9835J3041J6263J1564J0235j8282l3423Q07K8774K0159p5
174B2509k0571k4057p21K0016K1444O974j9670k7339k411J8491K1472J2412j8048
187A0501l5830l741K9633K0613j299j6203k1029k750J7576J3849M032m120j7391
200f159j5905O788K3156J7595o776k9708j9438J5754L0480J1534j6238k6226q670
213b3813J5577J9055P262o171j7613j4489N709J9231J4445j611j9886k0817M496
226a8625K5079J5678o977j9105j4918K381J8345J6371j207j6946j7439j915J7146
$$ plain form
136 14510 21655 14016 -12752 -24642 -14002 6204 28137 21498 -12962 -27434 -15988 2172 27557
149 27557 29685 -9751 -36882 -20067 10919 31535 22705 -14100 -31250 -12766 8457 22411
161 22411 21371 -6719 -26554 -13513 2750 14314 24549 6267 -27156 -26349 2425 22584 22509
174 22509 1938 -22119 -22840 -2824 18620 25594 5924 -21415 -23826 -5335 16137 28549 10501
187 10501 -25329 -29070 563 21176 19877 3674 -17355 -20105 -2529 11320 15352 11232 -6159
200 -6159 -22064 -15276 7880 25475 18699 -11009 -30447 -14693 15787 27321 11083 -15143 -23813
213 -23813 -8236 10819 18081 11910 -5703 -20192 -14483 4748 19193 17582 -2304 -23121 -18625
226 -18625 6454 22132 15155 -3950 -18868 -16487 1858 18229 17022 76 -17363 -19278 -2132
239b132K0740K347k0175k0978J003J9967J7301p70j6565j6371r04J4430J5336
252A3229L284j1001j6736p957J0892K0896Q401j3661k0588p311J2390K0929Q340
265B1107j3844k0096n764J1051J7281R276r125j9398r334R013J7732J0811p265
278A1445j9060j1304P421J7994J1606o121j7713j1737M714J6621J3900l663j8252
291d149j3176L908J6044J4488j927j8156j4276L768J5328J3221k06j5396j5292
304a5821J030J4671J4154J485j3858j6221j606J4233J5886K652j3804j6499k504
317a6202J3015J5838M173j2557j6898l715J1764J5347N768j0291j7322n976J1021
330f035J5830O511q750j6740p788R534J6292P295p833j5717q774P240J5970Q874
$$ plain form
239 -2132 18608 20955 780 -20198 -19195 772 18073 17303 738 -15633 -16537 -2107 13229
252 13229 16513 5512 -11224 -19181 -8289 12607 21008 7347 -13241 -20552 -8162 12767 21107
265 21107 7263 -12833 -18597 -7546 9735 19011 9886 -9512 -18846 -9833 7899 18710 11445
278 11445 -7615 -18919 -11498 6496 18102 11981 -5732 -17469 -12755 3866 17766 14103 -4149
291 -4149 -17325 -13417 2627 17115 15188 -2968 -17244 -13476 1852 15073 14867 -529 -15821
304 -15821 -14791 -120 14034 15519 1661 -14560 -16166 -1933 13953 16605 2801 -13698 -16202
317 -16202 -3187 12651 16824 4267 -12631 -16346 -4582 10765 16533 6242 -11080 -17056 -6035
330 -6035 9795 16306 7556 -9184 -16972 -7438 8854 16149 8316 -7401 -16175 -8935 7035 15909
344A5909o577j5485r561N594J5340J0215m923j5265j0653M446J4887J0976l330
357A1573j4535j1864K741J4884J1923k598j3863j2139R81J3934J2976j394j3205
370e86j2054p60J2131J4132J022j2776j3132j957J1330J4906K555j2569j3747
383a1505k301J0589J4154L250j0958j2960l699Q362J3986N371r378j3225n306
396a3620O609J4612P745r014j4443n377O325J3602Q512p385j4420o376N146J2934
410D850R785n772j4698p523M298J2594J0946m568j5232p792M359J1121J0442k097
424A0713j3558r209K021J0367J2005k5j3693j0559R57R573J3262K215j4756j2526
438a3213K332J0202J1135K652j2398j2742J194R960J0196K500j0057j0748o46
$$ plain form
344 15909 9332 -6153 -15714 -10120 5220 15435 10512 -4753 -15406 -10960 3927 14903 11573
357 11573 -2962 -14826 -12085 2799 14722 12124 -1739 -13878 -12897 1037 14013 12619 -586
370 -586 -12640 -13400 -1269 12863 13885 1109 -12023 -13980 -2650 12256 14811 2242 -11505
383 -11505 -13806 -3217 10937 14187 3229 -9731 -13430 -5068 8918 14289 4911 -8314 -13620
396 -13620 -7011 7601 15346 6332 -8111 -13488 -7163 6439 14951 7566 -6854 -13230 -8084 4850
410 4850 14635 8863 -5835 -13358 -9060 3534 14480 9912 -5320 -13112 -8753 2368 12810 10713
424 10713 -2845 -12054 -10033 334 12339 12314 -1379 -11938 -10981 -1408 11854 14069 -687 -13213
438 -13213 -10881 -679 10456 13108 710 -12032 -10838 -878 9318 11818 1761 -8987 -9633
451i633N726R813P544p638j4676l486O992J1154Q950o996j7769n102J0859J2843
465H581M862q755j3623k097P373P900O734k969j3383o326N556Q376Q809J64j4975
480c773j1183O853J2984O885l612j2182p005M210P568Q104K713j1535j2498K518
494i953J0532R781K852j3196j5485M897J5720O071m603r062n851K737M859M087
508C386N540k717j2677n704O724J1560Q878o908k0109n155J6636J3605k106j0983
522c0r684R66Q560N332K003j916r231o379M900Q694O877o91j3647j0626Q730J3978
538G836K629n843q574n462L578Q167O120M70r611j1295K412J2374Q415j468j2271
553b523j1658N860J5145L690o732o678l820J306N664M999K237l896j0147m370
$$ plain form
451 -9633 -3907 5906 13450 5812 -8864 -12350 -5358 5796 14746 7750 -10019 -15121 -4262 8581
465 8581 13443 4688 -8935 -11032 -3659 4241 10975 8006 -5377 -11703 -6147 2229 11038 11202 -3773
480 -3773 -14956 -8103 4881 11766 8154 -4028 -11033 -6823 745 8849 11562 27 -12471 -9953
494 -9953 579 10360 13212 16 -15469 -10572 5148 11219 6616 -2446 -8297 -5560 -701 3386
508 3386 8926 6209 -6468 -12172 -5448 6112 14990 8082 -12027 -17182 -546 13059 10953 -30
522 -30 -9714 -8748 -188 5144 7147 5231 -4000 -10379 -5479 3215 10092 9401 -4246 -14872 -6142 7836
538 7836 10465 4622 -3952 -9414 -5836 2331 8451 8921 -690 -11985 -9573 2801 11216 9748 -2523
553 -2523 -14181 -8321 6824 10514 3782 -2896 -6716 -5410 254 5253 7490 3594 -6553 -10923
567a0923P932J0773L791p565j4198l409J3107J1839j643r536q988r41R119R075
581H433J75p129q328j831P139P548J230l832p064n132L813Q886M699k599q602
596b594q116K773J2313P744n329j2479o347O903J1693L448o172q330l838L733
610d598P744M452k032o909o726O32Q780P695j820r053o886J968Q129O074p09o287
626D54o955j720O145R484L198q390j1989j430J1300J0839j705j1512p733L849
640f165Q740L622k264l760l009j843N03N275P306q19j1277q195N758J2782N451
655A2105p944j2346k316R012Q405M88n555o330k045L146N409M945n10q791p338
670i665L995R674M706l617q445m782L908O754L443o62n272o611o64O346Q082K266
$$ plain form
567 -10923 -2991 7782 11573 4008 -10190 -13599 -492 11347 9704 168 -8820 -9761 -642 8433
581 8433 8608 1479 -6849 -8680 -1541 6007 7237 3405 -3659 -8791 -4978 3908 8607 6008 -2594
596 -2594 -10710 -7937 4376 12120 6791 -5688 -12035 -5132 6561 10009 3837 -4493 -8331 -4598
610 -4598 3146 7598 5566 -1343 -8069 -7437 1343 9038 7218 -1835 -8721 -6753 1376 7450 6741 454
626 454 -6501 -8221 -2076 7408 10606 2216 -9773 -11203 97 10936 9231 -2281 -10014 -6165
640 -6165 2575 6197 3933 173 -2836 -4679 -4176 1099 8405 7586 -3691 -11886 -6128 6654 12105
655 12105 4161 -8185 -10501 -1489 6916 7404 1849 -4481 -6526 -3380 2029 6974 6464 -2327 -9665
670 -9665 -5670 4004 8710 5093 -3352 -8134 -4226 2528 5971 5309 37 -6574 -7238 -892 7190 9456
686I456q844j1270J655J1868O841l395q755n844L336P550K843j400l144m860k084
701f047L691O107L899l405r993m132P720Q857J270n663q303k522O879P558J107
716G023m304p193l660N267P948K380m058p803l984N630P681J152l295n077m325
731f618K111O807M014j081n982p029J100R086N946k482p939o477K865R190L870
746G381l470n512m486P44O549M686j090m555n742j166O533O486m53n402o019j177
762f693O219O445r1m723n767k456N118P576J295n237o777k512N633P927P79n662
778A074n693j633M292O407J436l707m923l128K085O726L859l006o394m319K325
793d599P676M240l657o621l589K405O716M005k799n871l658J324N913M751j652
$$ plain form
686 9456 612 -10658 -9003 2865 9706 6311 -2444 -8288 -4952 2598 5441 4041 897 -3963 -6047
701 -6047 -2356 3751 7650 4245 -5748 -9880 -2160 6697 7967 2304 -5999 -8521 -1642 5916 7023
716 7023 2719 -4474 -8134 -2867 5081 7461 3403 -4400 -8384 -2754 4927 6079 2784 -2293 -6618
731 -6618 -4507 2300 6314 5233 -749 -7778 -6678 2408 8354 5872 -2067 -8544 -5679 3511 7381
746 7381 3911 -1601 -6087 -5343 1206 5892 4802 247 -5495 -6661 -128 6358 5905 503 -5516 -6693
762 -6693 -474 5971 5880 1157 -4610 -7066 -1948 5628 6923 1686 -5091 -7603 -1970 5957 6736 1074
778 1074 -4619 -6252 -1960 4447 5883 2176 -2747 -5875 -3790 2936 6795 3789 -2605 -6924 -4599
793 -4599 3077 7317 3660 -2961 -6550 -4145 2571 6576 3777 -2094 -5752 -4428 1485 6236 4584
808D584n893m372P93N653N228r68n833m743L07N278N581q3n682n319j14N155N906
825E478M69n577n636k81M894N590R82m907n740r01M290N529J677m150n947j661
841e891L876N656K329l556o170k167L580N517K710k789o199k928L235N617K938
856E758k349n995l467K819N575L133j781n718l859K282N384L401r94n329m662
871e802J627N660L754p49n110n002J057N615L934m80m639n139M06N341M062J6
887D551l965n340n20N153M536K75l565n303j226M764M771N92l135n197j993M289
903a313N114R41k791n103k582L800N498J274k685m821k874L232N508J563k197
918B564m460l550K375N855K216k167m406l808J731N980K766k181m301l625J262
$$ plain form
808 4584 -1309 -5681 -4888 765 5993 5025 -808 -5551 -5244 34 5615 5532 -150 -5469 -5583 -428 5478
825 5478 5947 370 -5266 -5547 -653 4937 5919 1012 -4728 -5629 -1339 4190 5867 1717 -4230 -5891
841 -5891 -2015 3641 5970 2414 -3756 -5923 -2343 3174 5884 3095 -3104 -6032 -2797 2820 5758
856 5758 3409 -2586 -6053 -3234 2341 5474 3693 -2025 -5884 -3602 1782 5183 4189 -1140 -5802
871 -5802 -4175 1485 5239 4490 -620 -5622 -4565 1050 4984 4504 -135 -5274 -4868 473 4535 4551
887 4551 586 -4754 -5274 -121 4415 4690 1125 -4178 -5404 -640 4131 4723 1588 -3609 -5602 -1313
903 -1313 3801 4742 1951 -3152 -5734 -1934 3564 4838 2153 -2668 -5542 -2310 3198 4761 2564
918 2564 -1896 -5446 -3071 2784 5000 2833 -1573 -5381 -3650 2330 5096 2915 -1386 -5011 -3749
933c749N481K885j439l538m114j00N478M135j220m021m225m01N414M539j343m235
949d53l606j76M357L873n72k735l561j971L462N384O10l409m318k160L611O056
965D392P12m389m260j052L397M706N52k868l357k313J819N429K102k930m095k533
981d688J673N671K692l261m518j824J800M393K323j761l507k984J41M824M092
996E066j735m647l152O27M960M116k032m935k303J316L597K793p70k999k785q17
1012c700K939M430M53l688l841j008L280N155P41m535m276r7L652M211M16l617
1028E15l782o27K975M159P26l151l369r66J802L763K060k122m079k040J672M304
1044A840K733j966m715k526K135M783K304k418m184j868J610L696K479j228l865
$$ plain form
933 -3749 1732 4617 3178 -360 -4474 -4574 904 5039 3819 -202 -4427 -4828 586 5125 3782 -453
949 -453 -4059 -4235 122 3995 3423 688 -2873 -4844 -1382 4002 4612 1203 -3115 -5275 -1664 4392
965 4392 5104 715 -3545 -4597 -1200 3506 4058 1190 -2167 -4480 -2661 2768 4870 1940 -2155 -4688
981 -4688 -3015 2656 5348 2087 -2431 -4255 -2455 1938 4261 2500 -1007 -3991 -3850 974 5066
996 5066 3331 -1316 -4468 -3841 1119 5235 3203 -1732 -4035 -2719 878 3671 2901 -98 -2883 -3700
1012 -3700 -761 3669 4122 434 -3407 -4415 -1135 4020 4761 226 -4050 -4147 -495 3716 4132 515
1028 515 -3267 -3894 -919 3240 3966 815 -2554 -3520 -1718 2045 4105 1983 -2096 -4136 -2464 1840
1044 1840 4573 2607 -2108 -4634 -2499 2284 4588 2170 -2014 -3882 -2272 1424 3903 2675 -1190
1059a190k744R66L946L049j088m073k860J163L791K538q80k916k582k53K596L525
1075B988J051k948m673j287M285N233j9n067m309J029M752K855j516k999j686
1090b311N2J485K186J442o10l350l272J505N380K650l118n172j666L473M575N43
1106C792k965l079j050J678L245J626j134l074k922Q70M808K797k474m176j618
1121c676J923L434J387j432k141j888m76K495L387N23k936m318r59M848M984j433
1137C722n293k721J708L964K189j621k745j285r5J558K593Q64j656k990k045K027
1153a826M715J200l371l504p22K356L729J103k620l296j271J911M002J559k697
1168A268l640j223K129L904J145k893k767l43J014K188J973o18k698k387m1L404
$$ plain form
1059 -1190 -3934 -2968 978 4027 2939 -1134 -3994 -2831 960 3498 2618 -298 -2880 -3133 -537 2988
1075 2988 4039 1091 -3582 -4869 -584 4649 4630 -437 -4746 -3717 1035 3890 2374 -625 -2311
1090 -2311 -2259 -774 1412 2854 2244 -1106 -4378 -2873 2507 5157 2039 -3133 -4799 -1326 3249 3792
1106 3792 827 -2252 -3302 -1624 1621 3247 2113 -961 -3883 -3013 1795 4592 2118 -2058 -3676
1121 -3676 -1753 1681 3068 1636 -505 -2393 -2869 -374 3013 3536 600 -3718 -4677 171 5155 3722
1137 3722 -1571 -4292 -2584 1380 3569 1948 -797 -2082 -2177 -619 1974 2838 1182 -1808 -3853 -1826
1153 -1826 2889 4089 718 -2786 -3508 -1152 2577 3680 1060 -2236 -3507 -1596 2406 3965 1268
1168 1268 -2372 -3595 -1466 2438 3583 690 -2077 -2420 -1406 782 2755 2137 -561 -2948 -2989 415
1184D15L583q61m251k826J076M138K910j849l971j598J200K600K420m69l088k314
1200b885K77K648K943j01l184k444K37K324K692L57k427k555p43J620L399J681
1216C839k612m156r82K991M068O77l604l515L53K870K437J66k011k191n96R62
1232a304K276K028q43l448k245J388L640K241j732l864j710J878L182J676j286
1247A877l089j888J062K979K249p81l342k369J172L213J917j010k744j861N84
1262b031K274J973J34k025k755o01K544L248N24k943l446j58L417L025m13k903
1278a36k483M6K466K412J42j883k460r66J854L046Q98j920k919j219J980L198
1294B056Q76j811k567j458J309L191J578j559k970j901J339L605J620j910k966
$$ plain form
1184 415 3998 3137 -1114 -3940 -2864 1274 4184 2335 -1636 -3234 -2034 566 2986 2517 -571 -2885
1200 -2885 -2608 40 2983 2882 -302 -2746 -2509 -185 2507 2864 437 -2118 -2861 -1241 2158 3839
1216 3839 1227 -2929 -3911 -920 3148 3825 221 -3294 -2941 -71 2366 2532 521 -1670 -2266 -1304
1232 -1304 972 3000 2157 -1291 -3536 -2148 1492 3733 2001 -1863 -3573 -1695 1487 3163 1877
1247 1877 -1212 -3100 -2038 941 3190 2409 -933 -3302 -2130 1083 3000 1990 -754 -2615 -2031
1262 -2031 243 2216 2350 325 -2430 -3031 -487 2761 3285 342 -3104 -3262 155 3180 2767 -136
1278 -136 -2619 -2573 -107 2305 2447 564 -1896 -2862 -1008 2038 2936 1016 -1903 -3122 -1142 2056
1294 2056 2932 1121 -1446 -2904 -1595 1596 3174 1615 -1355 -3256 -1917 1688 3308 1398 -1568
1309a568j378J323L014J341j441k096j451J37K529K420n76k635k305L2L085K863
1325C294r02l116k084L95K878K460q45k575j692j95K058K894J08k635k300l49
1341b606K137L073K12k708k280l14J823K835N19k275k160p68J157L073J447k218
1357I47k874q68J469L144J388k275k771o40J283K633J437j745k467r22O00K382
1373G21K276j179l097j426Q56K620K279j120l151j401R09K353K162p73k891j467
1389b329N01J916K420n1k934k031M30K005K432J70k792k161K90J897K392M57k519
1406I3k286N3J608K378R81k273k762j60J805K338R48k041k734l42J620K233J218
1423B677j662k812o68J468K207J531j299l081j026J579K340J391j167k860j185
$$ plain form
1309 -1568 -2946 -1623 1391 2732 1291 -805 -2256 -2119 410 2830 2254 -381 -2686 -2654 431 3294
1325 3294 2392 -724 -2808 -2413 465 2925 2080 -495 -2187 -2382 -324 2570 2678 43 -2257 -2606
1341 -2606 -469 2604 2816 108 -2172 -2486 -663 2172 2691 416 -1744 -2512 -1355 1718 3165 947
1357 947 -1927 -2795 -1326 1818 3206 931 -1840 -2480 -1197 1436 2873 1128 -1339 -2261 -1661 721
1373 721 2997 1818 -1279 -2705 -1849 771 3050 1930 -1221 -2622 -1713 640 2802 2029 -862 -2329
1389 -2329 -1828 88 2508 2457 -477 -2508 -2078 -73 2359 2529 -263 -2424 -2134 -237 2155 2612 93
1406 93 -2193 -2140 -532 1846 2827 554 -2208 -2368 -563 1775 2723 682 -2052 -2394 -774 1459 2677
1423 2677 1015 -1797 -2465 -997 1210 2741 1442 -1639 -2665 -1086 1254 2645 1478 -1382 -2567
1438b567J291K176J573p57k788j522J060K158J747l58k742j949R62K396J680l85
1454A975k445j924N99K127J833j1k287k199L01K064J952L11k127k544Q2K299K066
1471B072J60j987k309j62J993K103M39j776k393m41J745K170P48j509k576q45
1487b568J777K404P76j472k423r72J496K424R71j294k350j115J180K240J322r40
1503A456k427j493R79K435J469r10k408j538Q72K414J472q56k158j336M46J899
1519C16J744j73k070j925O5K143K207r4k461k146K55K432K059n02k282j529K83
1536a678J557J781K96j629j890m57J339K274R27j788k570n88J841K456M74j957
1552C88k027l15J211J927J004j251k215q67R79K168J487j152k735j076J478K302
$$ plain form
1438 -2567 -1276 900 2473 1716 -1072 -2594 -1534 624 2371 2013 -729 -2678 -1716 680 2360 1975
1454 1975 -470 -2394 -1795 332 2165 2154 -133 -2332 -2031 33 1985 2296 169 -2375 -2293 6 2072
1471 2072 2232 245 -2064 -2226 -233 1870 2309 533 -1860 -2301 -556 1614 2362 853 -1723 -2568
1487 -2568 -791 1613 2389 917 -1506 -2478 -982 1442 2413 1119 -1231 -2346 -1166 1074 2396 1456
1503 1456 -971 -2464 -1485 950 2419 1509 -899 -2437 -1565 849 2321 1465 -693 -2029 -1583 316
1519 316 2060 1887 -183 -2108 -2043 100 2307 2213 -248 -2394 -2139 293 2352 1850 -432 -1961 -1678
1536 -1678 -121 1660 1956 327 -1563 -2020 -681 1593 2520 732 -1838 -2426 -585 1871 2345 388
1552 388 -1639 -1954 -743 1184 2188 937 -1278 -2145 -1166 1002 2489 1337 -1398 -2474 -996 1306
1568A306R49j315k061p05P69J509J469l32k152j529L79J947K105k12k799j998
1584b670J000K548J534q81k317j196P22J560J398J0j769j710P8J435J784O58j832
1601C52k398o4J948J921K95j715k074k58J555J977P33j632k441l47J709J920O67
1618B148j496k320m25J681J687M79r74j803q90R07J848J285p19k386j331J145
1634a164K178J227q28k432j357J223K152J003p51j972j438P28K092J406o26k109
1650f68j420P89J871J123k96j529j515R7J535J518L55j433k209n15K037K355J18
1667B213k268k162K68K216J642l40j650j419j0J302J402M49r32j785r49J130K235
1684A342Q37j439k180o87J398K027O62j219j861q20R16J959J161r00k164j238
$$ plain form
1568 1306 2255 940 -1121 -1826 -1057 452 1921 1589 -563 -2092 -1713 234 2339 2127 -672 -2670
1584 -2670 -1670 878 2412 1531 -786 -1982 -1260 300 1698 1708 -61 -1771 -1693 -258 1526 2184 352
1601 352 -2046 -2110 -162 1759 2054 339 -1735 -1993 -438 1539 2272 640 -1801 -2148 -439 1481 2148
1618 2148 652 -1668 -2093 -412 1275 1754 780 -1023 -1913 -1006 842 2127 1408 -978 -2309 -1164
1634 -1164 1014 2241 1413 -1019 -2376 -1153 999 2002 1251 -721 -2159 -1431 661 2067 1441 -668
1650 -668 -2088 -1299 572 1695 1399 -130 -1645 -1548 -13 1505 1860 427 -1782 -2297 -260 2095 2213
1667 2213 -55 -2217 -1949 267 1909 1569 -81 -1500 -1510 -208 1194 1643 711 -1074 -2023 -893 1342
1684 1342 2179 740 -1440 -2127 -729 1298 1960 741 -1120 -1940 -1024 935 2096 1196 -968 -2206
1700b206J021K326J146j335k088p15J019J575Q49n65j431j041M4J362J742J46
1716A849j917j939Q5K178K032m81k407j466O80J803J330k99j733j312J60J289
1732a48J585L09j624j778p5J493J756L24j644j674r6J153J542Q05j179k050o67
1749a968J207K040R81j489k407m26J577J820N09j337j786k17J012J104Q88l36
1765A172j746j196O02J680J443m52k274j358R77J861J154o12k041j082Q36J452
1781D16J108l3j768j633N13J835J312k28j830j521O15J585J022nj344j487N5J200
1799a88J254O92j113k238m40J785J832L11j590k011n6J775J369J02j122j578k91
1816a507J185J154N96m58j861j108J182J844P04q22j883r63J181J747O67p09j723
$$ plain form
1700 -2206 -1185 1141 2287 952 -1136 -1851 -832 743 1592 1027 -404 -1445 -1401 -39 1703 1849
1716 1849 -68 -2007 -1922 256 2288 1807 -600 -2066 -1386 417 1747 1448 -285 -1597 -1437 -148
1732 -148 1437 1746 122 -1656 -1731 -238 1518 1842 198 -1476 -1572 -419 1123 1928 749 -1301 -1968
1749 -1968 -761 1279 2260 771 -1636 -2062 -485 1335 1844 507 -1279 -1496 -484 620 1508 1172
1765 1172 -574 -1770 -1168 512 1955 1503 -771 -2129 -1152 709 1863 1251 -790 -1872 -1036 416
1781 416 1524 1491 -277 -1910 -1397 438 1750 1522 -308 -1829 -1214 371 1393 1388 44 -1443 -1388 -188
1799 -188 1066 1758 645 -1593 -2033 -248 1584 1895 305 -1706 -1762 13 1382 1484 362 -1216 -1507
1816 -1507 -322 832 1428 970 -891 -1999 -817 1027 1731 909 -974 -1937 -756 991 1658 949 -774
1833g74j034R55J647P72l97j676j423P80J976Q28o30j531j206N86J660R29l27
1850A135j312j379J96J619J166Nj306j719p3J879J423k41j417j496n4J634J389
1867A449j03j226j457k19J435J390J10r88j506n54J310J672J97j058j493o11J085
1884e67J713M70j042j588p19J075J731M88r47j468p99Q68J734O36q75j364q58
1901a512N69J588R03n94j468j074M43J682J059n58j482j082L22J599J166m72j383
1918b94j116K03J435J253k31j371j247N0J436J324j59j341j246l8J262J369M9
1935A338j265j309j63J163J434K83j214j465k93J171J521K79j148j410l56R93
1951d41J431M73r71j431n38Q39J446O87p61j549p38Q33J527P23p55j470p62O58
$$ plain form
1833 -774 -1808 -853 794 1566 1169 -507 -1930 -1150 826 1654 1024 -507 -1713 -1127 533 1462 1135
1850 1135 -177 -1556 -1360 259 1425 1430 124 -1595 -1668 211 1634 1393 -24 -1520 -1574 60 1449
1867 1449 1346 120 -1337 -1556 -121 1269 1379 391 -1115 -1669 -359 1313 1510 452 -1041 -1652 -567
1884 -567 1146 1616 574 -1014 -1733 -658 1073 1561 614 -854 -1653 -785 949 1585 710 -654 -1512
1901 -1512 -943 645 1548 954 -514 -1588 -1145 537 1596 1038 -444 -1526 -1204 395 1561 1089 -294
1918 -294 -1410 -1207 228 1481 1250 -121 -1368 -1318 118 1442 1283 -58 -1304 -1342 -80 1289 1338
1935 1338 73 -1236 -1399 -236 1198 1481 267 -1198 -1491 -320 1201 1480 332 -1078 -1434 -441
1951 -441 990 1463 492 -939 -1477 -638 808 1495 734 -815 -1553 -720 807 1530 775 -695 -1457 -799
1969g99J436Q62n91j462r16N52J404R29l96j488j043M78J472R41l64j359j026
1986a370K86J330J090j60j292j232J35J349J189n7j316j342J07J375J149m4j139
2003E8j231j02J129J246K01r79j373l68J126J385L15j009j433m08J121J326K86
2020A290q72j271n40Q39J340N16o66j365p40P41J519O73p55j452p28P91J437N85
2038A342o55j208p69M54J333P89m24j208r64K58J402J021l57j314j045K89J390
2055C34R88l14j164j018N0J237J104j05j122j140q2J164J240Lj111j178j28J092
2073a50J228J11j007j141k77R58J267K56r16j171m32Q56J316M39r06j298m63Q26
2091e04J353M88q49j264n36P76J288N06p02j168n46M93J156P26m27j188q49L26
$$ plain form
1969 -799 637 1499 908 -554 -1470 -918 486 1415 1019 -469 -1512 -1034 438 1379 1015 -344 -1370
1986 -1370 -1084 246 1336 1176 -116 -1348 -1213 136 1325 1268 -48 -1390 -1283 92 1241 1197 58
2003 58 -1173 -1275 -146 1100 1301 322 -1051 -1419 -293 1092 1407 398 -1035 -1443 -322 1004 1290
2020 1290 418 -853 -1393 -554 786 1302 636 -729 -1469 -728 791 1464 709 -743 -1471 -680 757 1342
2038 1342 687 -521 -1290 -836 497 1286 862 -346 -1310 -1052 350 1371 1014 -300 -1345 -1056 334
2055 334 1322 1008 -156 -1174 -1124 113 1217 1112 -10 -1150 -1232 -68 1172 1175 64 -1114 -1242 -150
2073 -150 1078 1189 182 -959 -1236 -278 989 1245 329 -842 -1274 -418 898 1337 431 -867 -1330 -504
2091 -504 849 1337 488 -776 -1312 -536 752 1258 556 -612 -1158 -665 491 1217 790 -398 -1247 -921
2109i21J263R90l89j379r48M31J372Q80m48j238p98L35J105Q56j81j021r49K5
2127a015J050J083%j138j122M8J137J034k3j057j011m7R64J020J88q37j184l19
2145a229R35J275L13j014j302k08J051J098J33q09j009l16O83R88M15m14j057
2162d67p51M72J308P56n59j362p37P00J327N34o16j103o74N30J107N82l51r76
2180b80q39K43J185Q20l21j068q27K32J105P76j95q82r08m5J007J009Mr50j135
2199a069j36J209J141j50j064r50J7J009R14o5p19q27l08O93J066L02o54j061
2217f52n35P45J283L13q05j042m39O75J152L83o56r83n69N25J240N72p06j080
2235e79n49N69J193M52o79q45m58K60R16O60k72q40p94JJ119J039k62j190q73
$$ plain form
2109 -921 342 1332 943 -436 -1384 -953 419 1299 851 -387 -1185 -850 255 1111 930 -91 -1040 -1015
2127 -1015 35 1118 1118 -20 -1142 -1094 43 1077 1054 -3 -1014 -1061 -97 923 1111 274 -910 -1229
2145 -1229 -294 981 1294 280 -1022 -1230 -179 919 1052 243 -766 -1082 -399 589 1004 590 -467
2162 -467 -1218 -746 562 1318 759 -603 -1340 -640 687 1221 605 -498 -1172 -642 465 1047 696 -280
2180 -280 -1119 -876 309 1129 808 -260 -1087 -855 250 1026 831 -51 -959 -1004 3 1012 1016 66 -1069
2199 -1069 -1205 4 1145 995 -69 -1019 -1002 7 921 856 137 -690 -998 -305 761 1063 409 -652
2217 -652 -1187 -442 841 1154 349 -693 -1132 -457 695 1078 422 -561 -1130 -605 635 1207 501 -579
2235 -579 -1128 -559 634 1086 407 -438 -896 -636 280 940 668 -172 -966 -965 154 1193 931 -259 -1132
2254a132K31J235Q67m55j041n89J36Q55P99j15q13p32j68P43J052J26r41r17j16
2273i75Q14J018J08q60q16k19O03J071L11p76r92l19O38J155L69q97j026j86O88
2292b91R55K43o33p74l13L34Q69O05m19r84n51L12J018P54m34j145n89M32R72
2311C61O51m03r65n75K65Q65P62k58r63o55K43Q04P36j05r01p16J20P49P79M4
2331H38q17q30r1P82R85J01r44r33L8Q54Q30N4q05p96o2O76P81J84n98q34l00
2352h87N55R05L94o10r81l34O07Q82L72n21q85m23M49R08M91m03r31n33L87R74
2372D16N87m61r65m98M29Q71M40l21p25n51J61P64O60r3q22p34P0R11P99j43r65
2393a70p32K01R00O22j84p29o25j3O63P66N4o78p53j78O89Q76J41p16q26j48O96
$$ plain form
2254 -1132 -901 334 1201 746 -295 -884 -748 107 906 791 -22 -754 -922 -179 873 999 58 -859 -975
2273 -975 -161 857 965 105 -711 -930 -327 744 1055 279 -713 -1032 -394 761 1130 233 -793 -979 -291
2292 -291 664 907 274 -500 -813 -479 390 995 576 -408 -959 -647 371 1125 691 -454 -1043 -611 361
2311 361 1012 609 -356 -931 -666 199 961 703 -260 -915 -672 132 868 763 -138 -854 -734 15 794 838
2331 838 21 -809 -900 -118 867 968 24 -909 -871 -17 813 867 62 -734 -796 -120 661 845 247 -587 -887
2352 -887 -332 573 967 357 -624 -958 -351 531 903 382 -503 -926 -477 431 922 519 -412 -945 -558 416
2372 416 1003 542 -423 -921 -492 379 819 498 -227 -778 -617 147 807 714 -108 -842 -772 139 938 795 -170
2393 -170 -902 -701 199 821 637 -92 -717 -730 -67 699 753 75 -678 -856 -167 709 850 134 -692 -840 -144
2414a44Q20J34o14p18k90M85Q73L42n63q56l41M80R37L59n75q33k98M41Q19L57
2434H15m40p03m15K28Q03N88l25q59n34K58Q34O33l18q94m83K38P75N71k26p30
2454a84n07P4O58P39o5p67o70M1O73P66%p92o66RO19P24J02o78p09j01N59P79
2476F04K44o71q15j24N99P58K10o15p65j34M64O80L43m73p81k89L84P53M60m33
2496C99q64l75M50Q07M17m23q13l34L59O69M80k62p93m41K39O66N60j36q14n75
2516g84K18P47N67j32p55n76J29O61O12j7p35o37Q8O32O40M4o85p21J9O71O38
2537F24L8n96p06l6N70O51J74n43p27j64N53O63K44m77p59k84N41P19K53m43p45
2558d50l24M51P53L20m01p58l32M04O63L78k65p13m83L08P19M46k22p09n36K16
$$ plain form
2414 -144 676 810 196 -522 -812 -327 546 888 325 -531 -872 -392 545 904 329 -504 -802 -361 458 815
2434 815 375 -328 -743 -515 288 876 551 -308 -842 -584 250 883 565 -329 -812 -574 201 772 546 -184
2454 -184 -691 -617 41 780 715 -52 -722 -681 -8 758 758 -34 -700 -691 -72 652 754 76 -633 -734 -175 604
2476 604 848 177 -638 -762 -163 595 805 190 -575 -709 -245 435 778 305 -476 -765 -381 372 832 399
2496 399 -465 -840 -390 417 834 411 -402 -736 -377 292 772 510 -283 -724 -485 181 741 605 -209 -784
2516 -784 -566 181 748 616 -139 -715 -586 75 687 670 -65 -702 -614 18 658 702 17 -704 -685 -14 624
2537 624 662 66 -640 -676 -106 545 719 176 -551 -715 -162 501 745 268 -491 -775 -234 485 738 295 -450
2558 -450 -774 -323 430 750 349 -409 -741 -337 326 704 439 -274 -757 -449 270 716 494 -215 -751 -535
2578e35P58N07k13p36n12J98O91M98j19o25n57P8O39N78l2o03o57kO59O76l6o63
2600ho12PN70N87P6n28o14j43M80O71K11m84p02k52M86P94K32n74p05j84M47O72
2622D27K45m15o41l15L43O90L83l31p16l81L05P45M24l49p31l45K63O42M48k16
2642D75o76m39J43O41N49j84o84n02J20O92N50j51p02m52R1N69N44ln84n69j5
2663e87N31O48N4n73o40o9N29O37J60n92o49q8M84O53J99n09o66j60M52O39K31
2684F84m53o73j77L92N79K75l46o39k73K86N95M25k72p43l63K95O85M18k83p17
2704c05l56K75O08M01j81o29m33J45N84N03q6o32n18J15O09N19q3n87n20N0N32
2725A1N21P5n56n92p1N42O11J06n90o60k6N61N84M0m88n61n6M07N24K11l57o20
$$ plain form
2578 -535 223 730 517 -219 -731 -533 158 656 537 -88 -645 -567 72 650 618 15 -642 -644 15 691 655 -8
2600 -8 -620 -613 -43 544 620 92 -522 -665 -185 486 697 213 -489 -741 -255 539 771 197 -508 -692 -245 427
2622 427 672 257 -384 -699 -356 334 717 386 -330 -711 -406 339 763 414 -317 -662 -399 243 691 475
2642 475 -201 -640 -497 144 693 509 -175 -677 -557 135 685 534 -168 -620 -529 40 584 581 -3 -572 -587
2663 -587 -56 592 646 73 -567 -636 -107 530 690 98 -551 -639 -155 498 697 188 -478 -638 -186 453 684
2684 684 231 -442 -619 -227 352 627 281 -358 -631 -345 250 675 403 -340 -703 -408 277 695 412 -305
2704 -305 -661 -386 222 623 442 -187 -620 -475 109 612 526 -106 -624 -509 100 619 536 -51 -571 -521 11
2725 11 532 607 51 -541 -612 -70 541 647 57 -603 -629 -68 516 556 68 -493 -549 -142 382 593 236 -384
2747c84k39L79O17K99l70p07k77M21O47K84l77o46k75L31O02L31k67o38l89K88
2767c70O34L81k52o26l60J94N81M09j57n59m45P0N58N18l7o22n76R6O18N61p0
2788E46o41m98Q3N70M82l1n06m79l6M54N38J00m72n87j07M70N87J28m83n51j41
2809e74L80N78K39l82o26k31L49O38L05l88o68k48L75O00K52l41n78k38K71M80
2829A93L55j53n88l95J68N92M68j43o98m49K30O19M29j76o30l85J86M75M13j1
2849E00n45n01M9N35M91J4n50n30L0N10M95M1n14n23k3M22N05J82m07o56j65M72
2871a68O22J70m79o23j33M71N32J64l43n72j74L38M76K82k21o08l53L17N90L17
2891F05k48o50l47L24N75L20k11o00l52K49N15L48r5n62m66J80N81L76j04n44
$$ plain form
2747 -384 -623 -244 373 672 302 -405 -682 -261 386 670 293 -353 -628 -297 305 636 369 -269 -658 -370
2767 -370 264 645 393 -233 -593 -399 182 591 434 -125 -570 -500 58 576 539 -83 -659 -563 55 616 546
2788 546 -95 -593 -510 60 542 511 5 -474 -510 -56 482 582 110 -477 -584 -114 473 601 118 -433 -574
2809 -574 -194 384 623 241 -385 -616 -267 371 676 288 -380 -628 -253 347 599 258 -320 -558 -287 193
2829 193 548 395 -193 -588 -420 172 640 497 -201 -650 -420 199 628 452 -178 -563 -377 98 511 500
2849 500 -45 -546 -497 38 529 543 -7 -537 -507 3 498 539 25 -498 -521 -99 406 588 181 -475 -640 -168
2871 -168 454 624 145 -478 -611 -140 392 556 213 -359 -533 -195 281 563 342 -266 -619 -302 288 605
2891 605 357 -293 -640 -316 259 579 368 -232 -584 -335 180 528 433 -129 -595 -415 166 542 438 -106
2911a06m67J20N19M19Jm91n38J9N20M89O1m79n90n1N67N17K6m65n44p1M94M80
2933D30R2l76n43j63L92N25J87l09o12k49M17N78J95l40n77k27L30N82K15k54
2953B93n61l24K94N61K92k10n85l73K60O09K94k11n09l78J65N50L81j13m96m73
2973e34N5N98M52p6n52m87M3N91M71j16m81m56j2N07M61M3m44n01j24M84N32Q7
2995E41m47m98j52M25N56J32m21n20j98L88N66J79l51n58k20L65N92J98l29n46
3015b98k34K57N62K73k51n32l36K04N67L82k25n96l70J99N94L70j87n59l70J39
3035d11N24M04j15m97m21N9N17M64n0n46m60P0M95M81n2m62m47l3M32M88Q2m06
3057A16n40j14M26N68J37m62n75q9M28N18J23l78n25j65L30M96K34k66n58k92
$$ plain form
2911 -106 -573 -453 66 485 486 -5 -543 -524 -4 485 546 67 -523 -574 -7 510 536 71 -473 -544 -50 430
2933 430 522 146 -397 -560 -168 357 544 235 -377 -626 -209 369 564 224 -353 -580 -250 332 547 293
2953 293 -268 -592 -298 263 555 345 -240 -613 -353 256 550 339 -170 -548 -383 167 548 435 -61 -534
2973 -534 -479 119 571 495 -57 -544 -501 90 561 445 -36 -492 -504 3 464 507 63 -438 -562 -78 454 541
2995 541 94 -404 -556 -131 425 557 136 -384 -582 -194 372 551 200 -358 -578 -213 379 577 248 -298
3015 -298 -532 -275 287 560 309 -223 -559 -355 212 594 369 -227 -597 -398 196 566 379 -180 -550 -411
3035 -411 113 517 402 -95 -516 -457 60 524 474 -72 -532 -462 33 514 462 0 -447 -480 -48 440 522 116
3057 116 -424 -538 -112 456 593 131 -444 -533 -105 413 536 158 -367 -532 -202 294 528 262 -296 -588
3077e88K75N87L29k88o22k96L26N64K63k32n40l13K12N24L06j42m94m04J17N42
3097A26M40j23n70m32J54N30L95r5m74m45M4M85M27J6m41n09o0M81N15O1m76n32
3119d83n3M80M88P2m06n05j37M16N18J35l37n44k04L56N63K09l29n84k28L38N62
3140C27K09k62n73k68L01N57K54k60n07l39K44N55L12k20n18l45J55N38L66j30
3160C96n22m21J10N61L95j02n00m31O6N12M68p2m60m69j7M84N02K8m84n28k8M56
3182e6N43L5m43n16p9M29M87J16l85m98j46L41N17K14l73n31k19L68N29K27l40
3203B20n55k21K96N34K60k75m95l00K15N48L63k40n55l37J86N77L31j58n65l68
3223e39J63N22L80j03m91m30M4N19M69m8n42m78O6M88M77j5m85m84QM71M56M0
$$ plain form
3077 -588 -313 274 603 315 -307 -603 -277 287 550 318 -222 -535 -323 201 507 365 -129 -533 -416 126
3097 126 566 443 -127 -559 -405 125 520 425 -49 -494 -450 35 462 478 37 -472 -532 -51 464 525 49 -483
3119 -483 -536 -56 432 504 98 -407 -544 -128 390 525 188 -356 -560 -204 359 568 239 -345 -573 -235 327
3140 327 536 274 -299 -567 -266 291 545 285 -222 -561 -317 238 550 330 -188 -533 -378 160 526 396
3160 396 -126 -547 -437 124 519 417 -83 -514 -448 64 532 460 0 -469 -486 -2 500 528 44 -484 -512 -56
3182 -56 487 522 79 -437 -516 -87 400 516 131 -367 -513 -172 345 559 186 -345 -564 -196 333 560 220
3203 220 -335 -556 -260 274 534 259 -236 -536 -321 227 590 350 -205 -542 -356 221 552 394 -171 -539
3223 -539 -376 146 526 423 -68 -498 -454 65 534 486 -56 -534 -468 20 497 482 -3 -487 -479 -8 448 488
3245D88m32m84j03M51M87J09l99n63q0M04N19J27l63n41j48L49N19K29l20n67
3265c18k57L52N64K37l10n63k69K91N58K64k27n55l29K16N29L51j33n46m38J85
3285c98N70L83j52n41m31J60N31L86j01m88m53Q1N05M22Lm89m82KN18M55Nm47
3307C9n01l7M65M84N2l85n17j47M29N44J20l87n79j65M45N57J00l46n16k18L57
3328b06N47J89l06n06k95K62N97K67k43n69l29K69N74L03k31n27l45J79N94L16
3348E40j79m88m03J21N63L99j51n06m20J01N42L93q7m83m11j1M81M94j8m52m99
3369d74n4M86N45L1m82n20p1M85N23L0m11m67j45L61N57J50l80n24k01L50N94
3390C83J90l54n39k45L36N55K30k82n37k92K44N95K98k77n64k96K17N56L49k52
$$ plain form
3245 488 56 -428 -531 -80 407 516 117 -446 -526 -122 397 524 161 -380 -528 -179 340 569 249 -318
3265 -318 -575 -223 341 578 268 -295 -564 -273 285 549 322 -233 -562 -346 183 534 401 -145 -583 -398
3285 -398 172 555 403 -138 -569 -409 122 508 407 -81 -534 -453 52 474 477 -12 -494 -492 26 481 486 39
3307 39 -462 -499 -34 450 502 117 -400 -547 -118 426 546 159 -420 -585 -140 417 517 171 -345 -563 -206
3328 -206 341 530 224 -282 -577 -315 282 549 306 -263 -592 -323 251 554 323 -204 -549 -370 224 540
3348 540 361 -127 -530 -409 154 553 402 -104 -524 -423 119 512 425 -58 -469 -480 1 495 477 25 -474
3369 -474 -528 -42 503 534 52 -468 -539 -54 469 499 88 -379 -524 -163 394 544 164 -360 -561 -211 383
3390 383 573 219 -320 -565 -229 326 556 274 -263 -555 -311 284 582 305 -259 -555 -338 218 567 315
3410C15n12l27J54N32L62j31n13m08R0N25M90j07n60m63P9N74M49r1n16m50M5
3431d63M97M73Jm96m67k5M37N12P0m53n08p5M08N20J08m21n12j46L67N47J72l79
3453A67n37j92L36N81K17l65n50k38L62N42K08k82n08k51J97N48L20k14n33l52
3473e44J70N69L75j80n61l90J74N60L72j52m98m07Q4N25M36p5n26m48O9N17M44
3494E14m9n05m48NM80M50L1m25m81j05M21N52J23m40n65j00M37N51R6m20n06j22
3516e06L52N21J62l40m94k16K54N75K88l10n98k88L15O07K60l16n21k85K34N51
3536B45K84j88n40l46J66N65L85j96n59l86J72N60L68j46n05l55Q3M56M28m9m77
3557c5m29oM67N13%n08n06jM89N09Mm57m74n0L97N20R7m03n09j44L71N20K01l77
$$ plain form
3410 315 -197 -524 -370 162 524 393 -120 -528 -438 87 577 470 -90 -553 -474 100 549 458 -58 -508 -463
3431 -463 34 507 508 12 -455 -480 -43 469 539 86 -422 -497 -89 431 539 118 -394 -540 -173 374 546 167
3453 167 -370 -562 -226 355 572 207 -343 -581 -219 323 531 249 -259 -510 -313 235 555 341 -192 -544
3473 -544 -374 195 570 390 -171 -561 -387 173 545 393 -105 -512 -428 97 533 458 -68 -516 -447 70 514
3494 514 465 -40 -488 -483 -3 447 478 53 -428 -533 -112 440 563 123 -442 -542 -105 446 542 122 -384 -506
3516 -506 -154 367 529 189 -305 -521 -267 308 596 286 -312 -600 -285 322 582 266 -255 -540 -306 245
3536 245 529 341 -199 -545 -379 186 571 375 -184 -570 -398 162 530 384 -121 -476 -393 63 491 442 -35
3557 -35 -464 -470 -3 510 510 2 -504 -505 -16 493 497 40 -434 -484 -87 433 530 127 -382 -526 -155 365 566 189
3581A89n77j69L44N59K05l39n61k04L02N54K67l12n40k44K36N48L11k59n45k92
3601e27K24N09L47k11m93l41J26M86M02j01n49l84J07N17M12q2n40m06O8M90M42
3622D96l3m84m74J1M79M76K5m76m90qM19M79Q1m18n15n9L82M92J67l64n60j68
3644e42L64N57J89l89n46j58L39N09J98l11n20j96K57M83K87k12n52l32K61N39
3664B25L29k28n33l36J90N08L58j72m99l55J24M99L90p2m90m62Q2N35M24p8m99
3685f0m34P1M84M01jm43m55k5M22M61Q0m05n26q8M31N13O9m24m73j12L99M92J05
3708D82l43m75j69L32M79K06k90n39k19L01N50K17k89n13k56K50N34K69k21n21
3728b15k98J87N29L44j84n22l78J61N47L57j63m92l71J18M79L81p9m73l98K3M58
$$ plain form
3581 189 -388 -557 -213 346 551 212 -349 -553 -251 303 570 258 -282 -526 -290 258 569 310 -235 -527
3601 -527 -303 206 553 342 -151 -492 -366 120 522 421 -128 -512 -405 112 524 442 -98 -504 -436 54 496
3622 496 463 -21 -495 -484 -5 471 496 20 -470 -478 -59 420 501 83 -432 -491 -109 383 550 186 -374 -542
3644 -542 -178 379 568 179 -367 -525 -186 323 521 210 -310 -506 -249 234 521 309 -243 -575 -314 225
3664 225 554 326 -207 -543 -353 155 513 341 -158 -513 -389 110 500 428 -62 -524 -442 93 517 439 -60
3685 -60 -494 -423 61 462 461 18 -437 -462 -40 421 501 96 -430 -518 -87 426 495 71 -402 -514 -115 377 482
3708 482 139 -336 -505 -173 306 512 222 -317 -536 -235 315 532 243 -270 -526 -276 258 527 306 -215
3728 -215 -513 -326 203 547 363 -159 -537 -376 171 528 365 -127 -498 -380 99 480 401 -72 -470 -447 11
3749A1M39j0m58m58PM74M34J1m22m49m2L93M86O1m07m57j18L89N16R5l63m91j27
3772d86L58M76J68l33m97j96L02N24K17k88n27k43K54N44K68k91n32k50K46N17
3792B31K72k09m87l18J80N02L27j32n24l42J19N08L75j14n21l48J04M56L79l1
3812D27m50m25K3M54M24jm47m45rM30M66Jm33m29m2L87M34Q7l42m87j35L74N04
3835C66J37l45n20j63L39N13J66l28m78j91K95M76K08k37m86k49K36M82K81k13
3855B89n11k68J85N07K66j59m72l13J47M55L41r7m60l99R1M74M11r7m72m13R1
3876d04M54L86l1m37l90oM01M45L8m08m77n5M21M86N3m20m41p8L70M57J10l50
3898A24m56j56L34M60J82l16m84j88K94N09J90l07m84j77K42M73K21k33m41k69
$$ plain form
3749 11 450 440 -18 -476 -469 5 439 450 28 -421 -463 -70 416 477 70 -387 -505 -116 400 495 132 -359 -486
3772 -486 -128 348 516 183 -314 -510 -208 316 533 245 -282 -525 -271 273 541 250 -282 -532 -286 231
3792 231 503 294 -193 -511 -331 171 498 366 -158 -500 -381 127 502 388 -133 -481 -377 79 458 427
3812 427 -23 -448 -425 29 453 452 5 -440 -449 -19 447 448 15 -414 -456 -69 365 452 110 -377 -512 -138 366
3835 366 503 158 -362 -525 -186 327 493 165 -313 -504 -209 267 475 238 -248 -497 -261 221 502 289
3855 289 -222 -490 -305 202 468 309 -163 -476 -329 126 467 370 -90 -489 -398 76 487 390 -82 -495 -404
3876 -404 50 436 405 -32 -422 -428 -27 418 456 48 -429 -484 -63 423 476 56 -385 -463 -93 364 474 124
3898 124 -332 -488 -154 306 488 172 -312 -500 -206 303 493 186 -298 -475 -233 240 461 228 -213 -482
3918d82J76M70L08j77n10k98J64N21L20j77m90l10J58M46L43r0m54l64O1M45M06
3939D66p0m57l92M8M29L98j5m05l92j3L54M16P9l67m73p8L76M66R6l91m56o7L36
3962a12M48J11l24m45j01K64M25J91k41m89k17K58M98K36k66m70k22K26M74K53
3982D97k12m98k46J96M34K90j32m62l42J49M72L22j39m80k94J24L91L34o2m14
4002g2l55L9L87M10om21m12J2M32M05J3m51l85LL86L69L9l12m23p2L38M09J25
4025D58l33m45j44L42M40J48l21m51j41K91M37J69k53m59k32K54M79K38k54m71
4045b48k37K16M87K09k03m20k43J62M12K79r9m33l31J28M26L07p9m25l30Q2M18
4066G8L54n1m30l53L7M00L61pl90l92nL94L86J2l78l62n4L32L95P0l12m05j19
$$ plain form
3918 -482 -306 164 472 295 -215 -513 -349 172 492 315 -175 -485 -327 119 462 372 -82 -446 -385 60 466
3939 466 396 -61 -453 -405 24 422 407 2 -390 -403 -49 367 446 79 -394 -472 -96 370 466 75 -381 -448 -112
3962 -112 336 447 123 -322 -423 -159 266 457 216 -273 -490 -232 266 502 236 -234 -456 -230 244 497
3982 497 285 -213 -459 -263 171 461 329 -133 -475 -326 146 468 329 -151 -445 -321 70 404 342 -72
4002 -72 -427 -388 -1 409 403 -18 -430 -418 14 419 432 -19 -404 -401 -15 354 393 81 -342 -414 -76 333 458
4025 458 125 -320 -464 -122 318 466 145 -306 -447 -156 281 450 197 -262 -494 -240 239 477 223 -248
4045 -248 -485 -269 218 427 224 -196 -439 -277 135 414 315 -118 -449 -321 105 412 333 -92 -422 -340 78
4066 78 432 381 -49 -402 -365 35 396 389 -1 -393 -398 -4 382 394 16 -346 -400 -68 327 397 85 -320 -439
4089d39L08M53J38l38m57j22L24M37J30l04m01j44K59M05J68k23l94k25K01M43
4109B19K30j96m54k19J81M15K61j78m13k69J43M00K94j10m03l27Q5M28L42j04
4129C25m25l15P7M05L18m8l99l10K7L35L55L1l21m02o3L47M40N5l89l98l5L41
4151d9L74P7l26l97p5K80M02J10k54m08j51K32M39J64k79l81j67K31L86J77j79
4172B06m17k19K06L94K52j58m33k67J59M41K56j43m38k47J51L81K70j08l57l08
4192c79P2L86K89k3l77l31J2L86L49l4l80l33jL57L48Pl20l63n2L47L57O0l28
4215D9l65p3L08L72Q8l01l47j26K62L99J15k06m22j65K58L99J81k37m04j98K33
4236a80M18J49j94l69j96J56L70K35j37l99k50J58L41K72j00l69k96R2L84K72
$$ plain form
4089 -439 -131 322 460 122 -335 -457 -133 304 434 130 -271 -415 -156 249 417 194 -200 -425 -224 219
4109 219 449 253 -201 -420 -239 176 437 259 -154 -423 -280 120 414 304 -99 -426 -341 87 429 325
4129 325 -100 -415 -338 67 385 337 -62 -372 -345 -10 345 376 55 -347 -410 -63 377 432 43 -355 -390 -49
4151 -49 325 402 76 -321 -396 -116 286 396 142 -266 -417 -185 254 418 139 -242 -409 -178 208 385 206
4172 206 -211 -430 -224 170 422 264 -169 -436 -277 164 420 277 -161 -408 -257 124 394 286 -71 -379
4192 -379 -307 79 368 345 -32 -363 -351 35 384 350 -30 -363 -364 -7 341 348 28 -335 -387 -40 317 377 49
4215 49 -316 -389 -81 291 379 78 -269 -395 -133 266 381 175 -247 -412 -154 245 426 189 -215 -413 -180
4236 -180 238 387 193 -176 -372 -216 154 389 252 -147 -397 -239 102 374 274 -95 -391 -299 85 357
4256C57q7l51k68M7L29L13j2l54l38K5L64L29k6l32l19KL24L21J3k86l35o3K90
4279e7L36J06k92l72j09K88L90J00k63m02j03K48L69J19k25l47j63J94L71J91
4299C79j94l85j98K03L56K12j62l78j95J40L48K38j06l49k75R6L81K54r4l66k64
4320c59Q1L64K67r5l22k60L7L19K78l1k88l01l2K95L63K2l26l29l7L32L10M8k96
4343D0l34m3K46L43J00k58l53r8K41L50J20k23l48j25K32L30J25k02l17j63J63
4364a74L41J90j37l60k33J41L91K05j45l71k21J56L34K18j04l35k16N7L16K58
4384C11l4l31k89N9L39K63m0k92l19K8L22K80j3k67k84m0K62L15P2k88l34n1K91
4407d0L16O0k88k83o6K16K99P8j81l14j34J93L18J46j68l54j66K23L37J52j78
$$ plain form
4256 357 270 -81 -349 -302 27 340 328 -26 -364 -339 25 354 328 -4 -323 -321 3 324 337 51 -284 -347 -57
4279 -57 279 385 93 -279 -388 -100 290 390 127 -275 -378 -130 239 358 133 -214 -377 -183 188 379
4299 379 185 -200 -398 -195 161 373 211 -167 -362 -222 126 364 258 -91 -366 -270 111 365 271 -95 -359
4320 -359 -278 86 353 258 -64 -324 -287 32 310 279 -9 -310 -342 -47 316 338 12 -317 -354 -22 288 336 40
4343 40 -294 -337 -91 252 352 94 -259 -357 -116 234 354 131 -217 -342 -110 220 345 143 -174 -337 -174
4364 -174 167 357 220 -140 -373 -232 159 364 219 -152 -373 -217 117 335 231 -104 -320 -263 53 311
4384 311 277 -54 -343 -284 55 318 278 -14 -333 -305 17 297 284 17 -267 -307 -45 270 342 54 -280 -331 -40
4407 -40 276 336 48 -235 -301 -85 214 292 111 -203 -337 -144 174 320 152 -202 -368 -145 192 344 166
4428A66l42j68J73L11J71j14l35k07J28L38K22j21l41k17J15L33J92o5l00k31
4448b92L9K89K75m4k75k97%L16L01k1k91l07K1K86K81j9k55k47o6K63K76P0k30
4471G3l03j04K40L34J01k47l12r5K20L06J05j78l02j52J77L20J72j82l48j54J61
4492a68L59J49j76l15j36J21K86J71j05k86j93O8K91K35o5l12k53Q1L08K43p5
4513B28k92k22M1K73K46l2k63k43mK80K75jk67k73j2K49K91J8k48k58o7K12K87
4536B18J15k48l10r8K32L14R7k23k88j11K05K63J23j76k67j44J29K97J72j23k87
4557a10k02J26L27J70j25k88j86J15K84J72p8k62k17N9K71K37l2k93k69Q4K80
4578F3K37o2k84k08L9K23K32jk21k49m7K35K64P7k47k93n8K67K68L7k33k66m8
$$ plain form
4428 166 -176 -344 -171 140 311 197 -138 -345 -217 121 343 222 -119 -336 -221 112 304 239 -61 -292
4448 -292 -253 36 311 267 -8 -305 -305 11 312 291 0 -307 -286 0 281 262 7 -240 -306 -43 233 303 73
4471 73 -230 -334 -94 240 341 94 -218 -313 -93 213 318 140 -162 -314 -137 183 355 173 -175 -329 -168
4492 -168 191 340 164 -151 -287 -166 120 291 186 -100 -293 -225 66 301 236 -76 -329 -248 60 303 228
4513 228 -64 -286 -245 28 274 242 -21 -264 -268 12 287 286 19 -254 -266 -17 274 292 44 -214 -281 -69 218
4536 218 333 85 -225 -323 -91 223 320 97 -191 -302 -97 166 289 113 -154 -298 -169 128 300 177 -110
4557 -110 -312 -186 141 311 186 -102 -288 -173 111 283 205 -57 -274 -215 56 293 261 -32 -301 -217 63
4578 63 300 238 -46 -254 -215 8 240 239 18 -231 -278 -43 221 298 51 -242 -300 -33 235 272 39 -227 -275
4601b75K27K45Q5j90k73r6J75K81J22j75k87j26J50K87J35j61k47j46J12K80J59
4622B82j00l01j63J11K69J82r8k89j80P2L09J69r8k48j72M0K58K12l7k47k42L4
4644b37K52K37j1k32k53KK35K38J5k24k42n0K26K66M7k27k55m5K13K43N7j99k48
4667a92o2J66K38Q8j27k73j17J52K68J29j45k97j15J55K57J53j39k66j51J31K62
4688A15J59j15k40j70Q4K65J65p1k51k16Q6K53K02p4k22k15L8K35K10k1k31k45
4710b59K8K29K27j3k20k25J7K16K02K4k23j96n9K04K37O2j84k53r8K13K73O1j76
4733H7k67p4J76K45R6j67k39r7J26K70J07j11k73j24J24K39J37j15k51j52J33
4754a30K14J45o5k56j49M7K34K01m9k40j93M3K51J93n2k39j67K6K26J77j2k01
$$ plain form
4601 -275 -48 197 282 92 -181 -277 -102 179 301 126 -161 -287 -137 150 285 124 -123 -269 -157 123 282
4622 282 182 -119 -282 -171 98 280 182 -107 -287 -215 94 263 165 -83 -255 -215 43 255 218 -29 -271 -237
4644 -237 15 252 241 9 -244 -242 -7 231 246 22 -220 -270 -44 222 269 42 -213 -258 -45 198 255 56 -192
4667 -192 -254 -88 150 238 111 -162 -279 -127 141 270 125 -172 -287 -132 125 278 139 -127 -278 -147 115
4688 115 274 159 -81 -251 -167 98 263 192 -59 -275 -189 64 266 192 -30 -245 -207 28 238 217 -14 -259
4710 -259 -231 -2 225 212 -8 -233 -216 0 202 226 3 -193 -252 -48 189 251 67 -186 -284 -71 202 263 87
4733 87 -180 -254 -78 167 263 96 -143 -240 -114 156 263 152 -121 -245 -121 118 255 140 -111 -263 -130
4754 -130 84 229 164 -92 -241 -194 40 241 192 -48 -241 -198 53 246 194 -45 -212 -186 40 217 205 4
4776Dk03NJ79K35L4k24k35k0K03K51K0k09k41k4J76K26N2j69k35o7J43K63Q6j79
4800G1k33r1J66K17R9j42k07j07R2K43J22r4k25j61J02K43J51p5k59j37O3K39
4822G7J55o1k22j66N5K11J60m6j96j80J0K20J98l9k13j70%K14J85oj82j97k9J82
4846d0K07N2j72k33m2J81K35M7j87k25m0J64J93Q3j48j88q8J13K16R6j10k22j25
4869b33J26K18J28j36k06j32J32K02J17q6k26j20O3K34J46p6k33j50N5K34J50
4890B07n0k22j32J7J81J96j3j80j97NJ76J99L4k06k28KK04K13j1j74j88j8J50
4913c5J88M2j38k02o1J20K17Q7j38k41p3J65J93P7j43j81q9J07K06J14q4k22j35
4936b26J10J98J52j25k20r9J04J89J14q2j81j19M4J79J77m6j89j73K7J96J85l5
$$ plain form
4776 4 -199 -194 -15 220 254 30 -205 -225 -22 229 249 40 -201 -225 -49 177 229 60 -175 -242 -99 164 250 71
4800 71 -162 -253 -87 130 229 87 -120 -227 -135 108 230 136 -89 -250 -148 95 246 171 -88 -225 -162 77
4822 77 232 171 -51 -217 -162 49 209 163 -33 -213 -203 17 215 176 -37 -207 -207 7 192 186 4 -193 -222 -40
4846 -40 167 219 47 -186 -228 -47 188 235 48 -177 -217 -53 140 223 75 -113 -201 -88 128 224 114 -108 -233
4869 -233 -107 111 239 103 -103 -235 -103 99 216 130 -96 -216 -153 81 227 151 -82 -232 -177 57 207
4890 207 157 -65 -197 -180 1 197 184 4 -193 -188 -12 187 221 15 -213 -211 -7 206 195 21 -167 -185 -35
4913 -35 153 195 57 -145 -206 -86 131 218 80 -161 -234 -69 124 201 58 -123 -212 -105 101 215 131 -91 -226
4936 -226 -116 82 234 109 -111 -210 -106 83 197 115 -66 -185 -141 38 215 169 -20 -193 -166 30 215 180
4958A80k14j70L4J89J62k3j45j90lJ74J62L6j77j86k0J57J77N1j55j85k6J39J75
4981A42O4j33j93r3J52J92Q4j16k19j02J46K08R3j41j98p1J02J64J11p0k02j14
5003a94P7J78J37n5k33j20N5K23J33p6j75j24J9J85J51k4j62j81LK13J64j5j78
5026Aj69K3J56J66nj52j52k2J16J94M7j52j80p0J56K04M4j55k02m1J31J91L6r5
5050G0j75q0J01J82R3j11j64j12R0J90J12j09j70r6P3J69J24o6j76j13K4J91J38
5073A85l6j83j42L2J96J23m3j82j24L5J69J21j7j37j46j2J58J35L8j71j72j8J57
5096c4J79K6j61j54k9J32J63P7j47j79o4J50J70O3j35j75l8J10J75N0r1j66q6
5119a64Q0J70Q0l1k10j14Q3J80J33q6j94j09O8J69J07m5j71j15L7J71J41n2j63
$$ plain form
4958 180 -34 -204 -170 19 181 158 13 -177 -180 -6 156 192 15 -171 -191 -34 143 194 39 -146 -172 -33 142
4981 142 206 73 -120 -213 -61 131 215 99 -120 -222 -76 132 225 84 -114 -185 -83 81 192 122 -80 -194
5003 -194 -117 61 198 143 -90 -210 -155 68 201 125 -50 -174 -155 30 181 157 -5 -186 -183 30 194 179 1
5026 1 -168 -145 11 177 172 20 -132 -154 -38 156 203 51 -129 -199 -43 161 205 50 -152 -193 -62 129 165 70
5050 70 -105 -185 -84 98 191 80 -84 -196 -106 84 196 87 -83 -179 -106 63 187 121 -55 -168 -144 47 185
5073 185 149 -34 -176 -144 52 175 132 -50 -174 -139 30 151 134 -3 -149 -161 -3 132 170 -1 -173 -191 -34
5096 -34 145 171 10 -144 -173 -41 122 199 52 -127 -191 -41 129 192 57 -118 -156 -46 129 179 88 -78 -164
5119 -164 -84 86 166 135 -75 -189 -106 74 207 121 -73 -182 -114 55 162 117 -54 -169 -132 39 180 128 -35
5142c5j36L7J66J40k1j71j51M2J34J45Lj33j55k0J50J72J3j68j46l4J52J54L7
5165A75j60j36m3J23J57N0j04j81m8Q1J97P2j07j86o7R8J92O1r6j78p9Q6J75P7
5189A59o6j59j14O7J90R9o2j67j07O6J45J16n6j55j07K1J58J32k4j47j39lJ75
5212B2J33J0j71j66J8J37J55nj15j53j8R9J59L8j22j59l7J31J50M8j01j69n9J39
5236c6J44P4j07j59q3Q8J85Q1j17j52q1Q4J85O3q6j47q6O1J38R6l7j60j20O2J48
5261C8J11l7j48j23K9J69R5nj73j16K8J36J39j2j27j48JJ51J44kj36j39nJ27J28
5286A25K8j22j36l9J17J41M5j12j64n3J02J87L5j23j32o0J09J45N7q8j44o2P1
5309g3J48P2n4j59q7N4J59R9n7j51j05O2J45J11m6j45j01L0J32J13j4j42j15J1
$$ plain form
5142 -35 -171 -134 32 172 151 -20 -171 -129 5 150 153 20 -135 -155 -5 167 180 12 -134 -168 -16 138 175
5165 175 15 -121 -164 -41 116 166 62 -119 -167 -86 111 183 76 -110 -177 -79 113 174 78 -100 -179 -93 82 159
5189 159 93 -66 -180 -113 77 176 114 -53 -160 -94 51 167 111 -44 -151 -130 28 160 136 -11 -150 -153 22
5212 22 155 165 -6 -172 -154 -17 138 133 18 -135 -153 -54 105 143 21 -138 -175 -44 106 154 53 -116 -175 -36
5236 -36 108 182 75 -84 -167 -79 106 187 70 -82 -163 -79 106 169 83 -64 -150 -89 49 145 108 -52 -172 -110 38
5261 38 149 112 -36 -159 -130 39 134 129 -44 -160 -132 4 143 131 4 -144 -143 8 152 150 14 -125 -130 -3 125
5286 125 153 31 -105 -144 -27 114 159 47 -117 -170 -68 119 154 31 -101 -161 -52 93 150 62 -82 -144 -73
5309 -73 75 147 93 -66 -153 -99 60 159 102 -49 -154 -92 53 164 118 -27 -128 -98 34 147 133 -9 -124 -113
5333a13J43J30l7j35j26J6J34J08K1j48j16j4J16J26M2j10j68j2J00J58K9j25
5355A9j23m0J08J39L1p3j38o1O8J45Q0p6j49p4Q1J45N7o2j45o8O6J31P1m3j35
5380d6j06M6J46J09l7j58j17N5J49R1n2j27q7L7J12R6Mj21j07pJ34J16%j31j14
5405a15j5J30J28L1j30j49OQ7J35K8r1j50l2Q7J61M8j32j21k8O6J32N7q4j40m9
5430a40O9J28O8o3j29r3O4J72P6p9j37p6P0J34N5l3j12r4L6J12R0j4j12j13K2
5455i9J19J23l3j29j00J7J02J18Lj12j17kR1J19K4j05j49J0J17J19j1r4j05k0
5479a14Q3J01N2o8j24o0Q3J28Q2j13j35n2R3J43M7q6j19n9O2J11O9k9j40o6K6
5504h5J40P6n3j17r8L9J12R1k1j16p8MJ03J17pj17j06qJ34J07j4j16j06J5R7R5
$$ plain form
5333 -113 30 160 123 -12 -138 -122 12 120 141 -7 -123 -137 -21 105 147 37 -131 -143 -43 115 144 19
5355 19 -104 -144 -36 103 134 61 -77 -138 -70 75 155 79 -70 -144 -63 82 139 77 -68 -136 -70 61 132 89 -46
5380 -46 -152 -106 40 149 112 -46 -163 -108 41 132 80 -47 -134 -97 15 111 115 -6 -113 -120 14 130 130 -1 -115
5405 -115 -130 0 128 159 29 -120 -114 -27 108 136 45 -105 -137 -50 111 159 27 -94 -122 -56 76 133 49 -91 -140
5430 -140 -71 57 125 62 -67 -160 -96 76 152 73 -64 -140 -70 64 119 86 -26 -120 -84 28 118 104 -8 -121 -99
5455 -99 20 143 110 -19 -119 -102 0 118 121 9 -108 -110 -19 100 124 19 -130 -120 -3 116 105 11 -94 -114
5479 -114 -31 70 122 54 -70 -130 -47 81 163 50 -85 -137 -44 99 146 60 -59 -118 -56 55 124 95 -45 -111 -85
5504 -85 55 131 78 -39 -137 -98 14 105 84 -32 -110 -106 -3 114 107 -10 -116 -124 10 117 103 -13 -119 -104 -7 88
5530H8J3q4r7l7J03R2N2r3j13n0Q2J56J0q4j23k2P6J02L5o2j23m7N6J42N1p0j23
5557g0n7N7J25N1n3j14n5L9J16O7k2r2j04nJ59R0j7j36r6L3J21Q5l5r2r9K2Q3
5584AR3Mq1j22rR4J04K1j03r5k7J06R0K0p6r7l0Q0J08K5o2j24n3J05J15L5r3j23
5612i4j8M9J25N8o3r7o1L4J08Q9l9j15q4M4J08Q8o2j09q3M7J11M9oj03o8NQ4R4
5640I1%j06r3NJ08Q9qp9r8j5R8P9L6j25m7l3Q6J04K7q5j09k5Q4R0K5n7j13j7M9
5669c9J15L5n4r9o8P1R6M2o3p9o7N0J11N0m3q1p3K8J00O1l0r0o9J7J09P3k0j22
5697c9p7N7Q8O8j5o7q9%Q8O3L9j17j00pR5J24j6p5r2l3R6Q5K0p7q4l9O6J09K4
5726I5o9j01k2P4O9N5o6r6j9L0R6N6l5j05n0K8J00P9m6j10m6K2J10M8l4p5p1K0
$$ plain form
5530 88 101 17 -80 -117 -14 78 130 37 -76 -126 -44 112 122 38 -85 -107 -31 71 106 44 -79 -126 -70 72 123 53 -70
5557 -70 -127 -70 55 106 53 -61 -116 -77 39 106 84 -8 -112 -117 42 132 115 -21 -117 -84 37 122 87 -5 -104 -82 1
5584 1 94 98 17 -105 -114 -20 84 105 2 -93 -120 -14 76 96 20 -77 -107 -27 81 106 44 -80 -133 -28 87 122 29 -94
5612 -94 -112 -63 62 120 57 -40 -101 -67 41 130 91 -24 -108 -64 44 132 70 -39 -122 -75 36 85 79 -24 -92 -87 -3 91
5640 91 91 -15 -108 -103 5 94 86 7 -91 -106 -8 71 107 -18 -65 -98 -12 92 119 34 -75 -100 -16 74 99 42 -71 -88 -39
5669 -39 76 111 57 -42 -110 -39 57 99 36 -43 -110 -60 51 101 58 -23 -96 -68 32 93 63 -27 -96 -79 30 103 83 -39
5697 -39 -116 -59 29 97 82 15 -74 -74 14 77 116 -1 -101 -108 -13 111 95 20 -72 -105 -9 76 96 19 -65 -104 -38 71 95
5726 95 26 -75 -97 -23 46 101 35 -61 -80 -50 46 102 67 -38 -88 -60 40 119 73 -37 -83 -61 49 97 63 -12 -83 -63
5754f3P5P6j1q4q3PP7R1Jp9j01NQ1Q6pp2p8j7P7R3K0p9r5k6R9P6K7o2q7m4P4R7
5786G4L3o4j01k1L3J07L8l5j03o5O8R6L9n3r4n6O7Q9L5l6o7r6L5R4P1k9r0p0J5
5815h6J06N5Kq4o8j0R0P3Rp3q3k3R5Q3Qo9j07LQ1Q4J3p3q8oO3P9K6o5r0l8N9R5
5847F1L4o7r1l7P4P2N5o1r9l6L1J10O1n4q2p5N9Q3N8k0j05o9O5P3O2l1q2o7J9
5876e9O3R0j5q3r0K8Q8P7j0j06m8kN8R5j6q2o9rP2Q4K3p8r8k3P1J13K0o9p3l0
5906g8N0R7J7l6q4m9N3Q5N3o1q9m5N3Q3N1l6j04m5M2O4P1j7r3p1J9R2P1j9p8j07
5936a11L7R0O0Jp2p7K2P7L7J7q8o6MN4R4Ro3r4jQ9N9Lo3p3l1P3P6K5m5r2k5K5
5968d9R2M9n6r0l3O8O1M6n6o7m7L0P3O1l2q2n8J0J06N0qq8n4L6N9N9j8o4n8J5
$$ plain form
5754 -63 12 88 77 -7 -90 -83 -6 85 86 7 -94 -89 -8 78 71 -1 -79 -96 -19 74 94 15 -80 -106 -7 69 96 34 -53 -97 -23 74
5786 74 107 43 -58 -79 -46 61 99 64 -39 -104 -36 60 99 46 -48 -104 -37 52 87 51 -16 -112 -77 17 88 59 -31 -101 -86
5815 -86 20 75 77 -7 -75 -85 5 78 87 14 -69 -92 3 86 94 25 -82 -79 2 86 99 26 -62 -68 -5 74 100 35 -55 -93 -34 61
5847 61 95 28 -63 -100 -26 46 101 40 -59 -95 -64 46 107 53 -29 -104 -45 38 96 76 -29 -98 -33 40 102 71 -11 -78 -59
5876 -59 4 94 79 -4 -94 -66 22 99 89 -17 -65 -67 -9 86 70 -12 -81 -90 -18 66 89 11 -87 -110 -39 74 94 25 -48 -78
5906 -78 -28 69 86 50 -34 -83 -30 55 108 47 -42 -87 -34 49 100 64 -40 -85 -43 21 92 75 -18 -89 -70 22 93 74 -4 -111
5936 -111 -74 16 76 77 5 -72 -50 27 64 81 -7 -73 -69 -15 79 88 25 -69 -70 19 78 81 18 -55 -86 -13 63 88 43 -49 -74 -49
5968 -49 43 92 36 -54 -87 -19 42 88 32 -35 -82 -52 21 82 50 -32 -90 -80 26 76 68 -20 -74 -38 21 80 62 -2 -60 -45
5998d5N1P0Qp5q0J7P2P7k7p4n1j2N1P5K6n6r2mN4O1M4r0o4j7N1R1J7n4p8j9L5
6029c8R5L3l7r3l2K5R6L7l3r0m6O1M8P1l5q1l7QP4M8j6o9p4J4Q3Q6m0q9m8K2O9
6060A2M5%p3o2LO0Q1J5n2r5j5O7Q7J4o6r3oN4R0Lm2o6k3L3Q4M4m4j04l5O9O4M8
6092I7o3p3l6L7O2L2j4o9m3J7P6M6k1q9n9K8R0M5j4p3l3OP1N0k2l6o7MP5M2J5
6123H1p5p3lR7N4Mo1q4ML1R0J6n6q3j2N8P7K1p5o8l4P0N0M2n7o0j7L5O5N5l5p9
6155b2n2K0R1M1k7p1n6M4P8N5l8o0o6NP6N1j1o2p4K2Q4N3j4p8o4RP6M5J7o9q0
6186g7J0M6P5J7n6p9nP0P5rm6o6MK9O9K9o3p1k2N1P6L3n4p0l2M4Q9J2l4o4l5J7
6218c7Q1M7l6o8o2QR2N4k9q2m0J4Q7M3k0n8n8J3O7O1Op5p0JQ4O1oo1p5J2N1O9
$$ plain form
5998 -45 6 76 84 9 -71 -54 18 95 68 -6 -57 -69 -18 57 83 27 -65 -69 -15 46 90 0 -64 -81 -30 61 78 24 -54 -73 -38
6029 -38 57 90 53 -40 -72 -47 49 86 53 -37 -83 -22 26 97 62 -19 -56 -48 26 74 58 -11 -85 -71 12 98 58 -31 -79 -57 12
6060 12 57 57 -16 -78 -75 -15 66 81 29 -66 -81 -14 73 87 21 -72 -78 -24 66 69 27 -39 -62 -29 55 99 55 -49 -84 -15 49 97
6092 97 34 -39 -75 -38 24 56 42 -27 -70 -53 23 69 48 -41 -100 -72 18 63 49 -24 -57 -51 20 70 48 12 -55 -51 24 66 81
6123 81 6 -67 -70 27 81 85 24 -60 -56 -25 65 81 25 -58 -70 -12 65 86 11 -57 -91 -21 29 71 14 -46 -63 -28 37 92 57 -22
6155 -22 -74 -54 37 78 51 -20 -76 -32 46 101 63 3 -63 -58 18 69 58 -4 -78 -56 28 81 67 -11 -75 -66 10 55 72 3 -77
6186 -77 -67 -21 54 71 15 -64 -69 1 76 67 21 -45 -41 -12 57 86 23 -48 -70 -19 57 90 36 -34 -66 -22 67 79 45 -19 -54 -37
6218 -37 44 91 55 -13 -75 -67 25 79 50 -32 -72 -58 29 72 52 -6 -64 -51 16 77 83 8 -62 -61 23 84 78 17 -58 -46 5 74
6250G4nl7q0mL6R3J1n5q9j1M7Q3K5o5p3k5L5R2K1l2q2l4K7Q1L8k4o9o3M9O8L9
6281G1j1q1o2L5P1O5k3o0n9J4O4P4k8p9n8QP5O8j1o9o1k0O7O9K0q1p6MN7O7K3
6312G3q1n5j5O1O9K2n1q1qM4P0L0n3n1n2L4J09K3m0p5k7K1Q3K3l5o1n4L7Q2L4
6342G6l0o2n5J7Q8N1l2p2m9J1N7O0Jo1o1qO9N2om7q7J7P8P1Kq2n7jN6O8J1n0q0
6375e5nO1O8J4n0p4l5M7J01%l6p1k8L5Q0K7k9q6m3M6O6M3m4q2j6J6Q4M7l4p0m5
6406f8PP6O7j9p4n8PP6P0k5n1p1QO2O7Jp5m5j0N0O4J2p3o1mO0N8J3m5p4k1N5Q2
6439F1Mn1p1j2L7Q6K6n7n3m8M1R7K7o1n8m4M5P1M4m1o2m6L4O0M7k1p5n0PR8L6
6470G1k9o7m9K4N6N4J0q1m1j9O3P0jq9o1L0N2P2ln9p3J2L9P8%l7q0NM5P1K5o4
$$ plain form
6250 74 69 32 -48 -52 -16 77 88 33 -56 -67 -20 63 88 23 -50 -75 -40 52 73 41 -41 -75 -48 33 71 47 -22 -85 -36 32 71
6281 71 60 -21 -83 -48 23 88 65 5 -54 -40 24 98 70 -9 -67 -59 16 84 73 4 -57 -77 -10 59 79 -2 -78 -74 -17 50 73
6312 73 -8 -63 -78 -17 52 74 23 -58 -66 -22 48 78 25 -26 -78 -44 65 88 48 -27 -54 -33 50 73 38 -23 -77 -40 42 76
6342 76 46 -16 -71 -54 34 85 53 -19 -68 -57 0 60 61 0 -61 -69 0 52 46 -1 -88 -71 7 78 80 -2 -59 -60 -4 64 75 25 -55
6375 -55 -60 1 69 83 33 -41 -76 -29 72 72 36 -35 -63 -28 52 79 50 -36 -79 -33 33 76 32 -50 -66 -50 34 81 47 -23 -68
6406 -68 -61 15 82 63 -11 -69 -62 14 84 59 8 -63 -55 7 74 75 0 -45 -55 -5 59 71 -2 -63 -67 -7 51 64 19 -55 -76 -21 61
6439 61 65 14 -57 -69 -32 54 80 23 -30 -78 -37 60 87 26 -32 -76 -31 40 84 43 -19 -65 -31 29 76 55 -20 -70 -63 35 71
6470 71 42 -25 -74 -50 6 60 70 -11 -52 -71 -8 62 61 -28 -89 -59 -7 65 62 3 -70 -58 -19 59 59 22 -58 -53 -8 63 88 24
6502B4o8j7O5M4K4m8n8m0N4O6L0m6p6l6M3O9N2m8p8l7M6O3L1k2p1l1J1P1N1j6
6532E2o1p1L9N8O2k0o3n7K3N9M9j0m6l2k5L5O3K2o1r6K6N2P4qn9q6J2O4O2mm6
6563Gm5k7N5O1K4m9q6j6M0O8K8l2o4lK0O5L8k6r0m0M3O0M1pp8n5L4O1M5l4o2k7
6595e1J6N4O6k4o6n5nP0P0k4o0q0J4P8N0lq0m1J9N0N8Qm0o7j2N5N3K8o5m4k2M3
6627gN9J4k5q3j5L9O6J7k3r3rL1O9L4m7o1l1L9N6L3l8m2m8L4O8L7m4n6l3K4M4
6658IN9po7o1K0P1K6Ro6m1%N1O2%n7o4LQ1M1k3k9m6pM4L6J0n5m3k6M5P1K6n6p4
6692e8jM2M9J6k9o1j7L1Q7J5m0o9k7L6N4N0l6p6l4M0P1L0n0l1m0J0O5M7k2n9o1
6723f8K1O7L3mn9n8KP5M5j2n6m5%O7L1J3n9m8nN5N7lo1l9J0N8K8J2l1o4rK8O4
$$ plain form
6502 24 -44 -61 4 48 72 24 -34 -74 -20 46 76 30 -46 -82 -39 30 82 34 -44 -81 -35 28 59 37 -34 -65 -54 17 68 52
6532 52 -9 -80 -41 17 79 59 -4 -61 -38 21 70 60 14 -18 -43 -8 55 77 16 -80 -54 -2 72 64 5 -81 -69 -5 57 53 7
6563 7 -38 -65 -10 51 75 26 -60 -76 -36 32 60 28 -36 -39 -19 46 84 58 -32 -72 -29 31 72 65 -13 -68 -34 27 72 38 -24 -51
6595 -51 -35 19 85 61 -5 -60 -65 5 75 51 -9 -89 -75 3 53 50 -30 -71 -52 -2 56 64 24 -43 -55 0 53 81 16 -28 -50 -7
6627 -7 52 66 41 -42 -57 -18 48 65 42 -51 -60 -29 40 74 27 -34 -65 -26 30 63 25 -17 -65 -31 37 74 30 -26 -59 -35 9
6658 9 68 61 -6 -67 -47 24 50 59 -7 -48 -48 3 65 65 8 -56 -53 28 69 46 17 -29 -36 8 44 54 -1 -44 -70 -25 46 72 16 -58
6692 -58 -59 -17 32 48 19 -42 -59 -28 59 74 34 -35 -62 -26 28 78 42 -34 -68 -28 43 73 23 -8 -48 -38 27 74 52 -7 -68
6723 -68 -47 20 53 49 -10 -68 -66 9 54 42 -14 -59 -59 8 39 52 -7 -55 -60 -5 52 49 -12 -51 -41 17 45 57 26 -38 -47 -19 45
6756D5M5n8o6k3L2P1Lj3o1l6J9P1M5m0o6l0K0P8J6k3o2l5K4O2L9j7n4n4L3N6L4
6787E5jn0m0k0P3K8On6m1NO3L8kn2o3K4L4M1K1n9m2j2K2O9J9n2o6lL8O9kk7m2
6820b5k9L0O5J1k8o2j9K0O8M5l6o7j5J3O0K1k8l7k9J9M8L5lo3n2J7N4M0j8n5l6
6851e6J3N5M0Jm7o9RM5M8j2l2m0j4O6L1K1n4m8MJ2P7Kl6n4KK8Q0j5k9l7l4K9P0
6884E6Nm0m2k5J5O7L3k7n5m2K6O5J7j6o5l0K9M5K9pn2k3mN9M9k6n5m3K0O6L6k4
6916D1n1m2K1M3M2k6mo8J7L8N4j3l0o4kM2N4J5n4n3oN4J9J8l8m2pL4N3Jl3o4k
6949e3M6L8K3l7m4qJP3J3k3l8k6K0L6L7l0l9m6J6N8N9l1m9m6J0N7M5l2l5n7%P2
6981A0K6J1n6m4J9K2N6Jm0m3OK4M2Rj8o6rM6N2Ll9l6j1K7N1J0k4m6k8M2K5L8n1
$$ plain form
6756 45 90 32 -34 -57 -25 46 49 36 -25 -61 -42 29 74 34 -32 -62 -42 36 52 29 -33 -68 -44 18 57 40 -14 -68 -35 21 55
6787 55 54 4 -36 -56 17 45 51 -5 -46 -41 22 60 58 6 -57 -33 1 42 63 4 -38 -50 -28 41 60 8 -58 -61 -23 46 44 17 -25
6820 -25 -54 -24 41 52 24 -38 -57 -37 31 76 40 -27 -42 -29 31 52 24 -13 -42 -23 25 60 57 -6 -58 -41 13 53 35 -20 -56
6851 -56 -43 12 52 53 6 -63 -54 -9 39 27 -5 -45 -59 7 38 59 5 -43 -39 -27 50 52 16 -38 -36 -8 72 57 28 -9 -43 -14 56
6884 56 61 21 -21 -46 -31 36 69 42 -13 -55 -29 36 53 37 -28 -58 -29 16 45 38 -14 -37 -41 18 67 41 -14 -57 -37 29 65 41
6916 41 -10 -52 -31 12 54 28 24 -44 -27 11 65 52 22 -42 -44 -2 52 67 13 -40 -46 8 27 45 7 -35 -42 -8 45 46 13 -51 -53
6949 -53 -7 31 54 17 -27 -35 -34 39 52 29 -9 -35 -15 21 58 28 -11 -57 -41 17 76 45 -4 -50 -40 17 62 30 -5 -62 -62 10
6981 10 36 47 -9 -53 -34 -12 44 45 5 -38 -32 -8 34 43 25 -41 -50 -4 48 51 12 -24 -35 -8 43 53 29 -17 -45 -3 22 60 9
7014Im2j2K9M2K5k4l0m0J7M2K5k1n7OrN8J8Qo2k8K5K6L6jn0k5J1L9M6k4k3l8n
7047b9L6L7Om2l7mN5K9Om8l8rK9K8K3l5k6k6K8M7Oj5n8jK8L9Jl3j8j6K4K6L1j0
7081C4l8m2L0N2K0k7k4l6J5N9J2qo1k1J9L5J2J2n6l3K8K4L0j3l3k1RJ6M4j2m3
7112a7pnL0L1K7m3n7j3O5N5l2l4k1pM3J4J0k5l3oJ5M1J9j2n6j7L3L7J0m0k9k0
7144d4K8M1J2j6l9j2QL9J1j5j6m2RM3K0j8k5j3KK8N2ln1m1K7J7M7k3j5k4%J6K3
7177B6J6m3j9lM0J9Kl3k2l1M6K5Pk0n3j0M5K8nNo4mL8M0jj1l9mOK7K3j6k4k1K0
7212a0M4mj2j6j7lM0J6kl3l1J5L0J9k1j4j8%L1j0K5l5j4MkO4k9j3l9jM1J2J2j9
7246A0m2RK0NL3j4m1MJ9L9j9Ll0k0J6L8jj0k6j6J5L1J7k3k7k7KN2K2l5j7k9J7
$$ plain form
7014 9 -33 -45 -16 26 51 27 -3 -43 -26 16 41 20 -37 -31 -40 18 36 44 -18 -46 -21 5 41 40 -10 -35 -24 15 61 37 14 -24 -29
7047 -29 7 44 50 8 -29 -33 22 51 57 9 -29 -38 -9 19 42 7 -19 -45 -17 30 36 21 -37 -38 -10 29 30 -3 -21 -37 -13 13 44 34
7081 34 -4 -46 -16 36 56 29 5 -31 -16 43 55 47 -14 -35 -16 19 31 43 -13 -46 -18 6 36 23 -10 -31 -22 -6 38 26 -17
7112 -17 -24 -29 1 32 59 16 -41 -54 11 66 34 0 -21 -28 15 29 39 14 -19 -25 -10 31 50 38 -18 -35 -2 35 45 5 -24 -44
7144 -44 -16 25 37 21 -18 -30 -22 17 28 13 -3 -45 -36 7 27 9 -16 -29 -27 1 53 50 -1 -42 -15 2 49 26 11 -13 -13 3 26
7177 26 42 -1 -20 -23 17 36 38 5 -17 -48 -2 23 30 10 -43 -53 -8 20 15 20 -44 -48 -10 30 29 18 -21 -25 -19 8 31 15 -9 -30 -10
7212 -10 34 30 18 2 -15 -18 22 38 36 3 -28 -13 17 36 15 1 -17 -17 14 4 29 -6 -20 -16 -18 46 17 4 -35 -36 5 17 29 10
7246 10 -32 -23 -3 2 35 21 -20 -16 3 42 23 26 -4 -24 -8 30 29 19 -7 -23 -8 23 40 17 -10 -37 -35 17 39 4 -13 -42 -25
7279b5M1J3j6k9lJ7%K8j4%n5J8L5NPk3k5J5K1J7Kk4nk1L8J5qk5j6j0L1%J3j2k7
7314b2qRM8j0ll3lQJ8J8j2j2j7MK3L2l1j6rRK2J4Om1j5J9K3J0%j4k7J1MNK0j4
7350A6k7j8K0K5K1m1j2oL0PMj7j9JJ0K5j3j1j8J5J2PJ7rl2rJ3K6Knk0O%J9rK1
7386C1l7mJ4K1K1l7j1Pk6L7NJj5k5lJ5K3J1k4rj5L0J6j4j6k4J5J9%J7k0j7j0L8
7420A4NRj5j7mnM4opj4j8K7m%lj9pRJ9KJk7J3kNK1j0k4j3J7rL0Mk9lLK4J1mj9
7460arJK0J2kj1j7qL0mLj8Mj2K9k%Pl8J5J6j2J7k7jj0RJ3POk9k9M9pJ6pl7QJ4
7499eRJ6%j2k0jJ4J4j1j1MKJ1PK4l6j0lPK9k3Qk7j4L1J2j9J1k6qK2j3L4j6j5L
7535a2J3J9k2pL%J5J1kj2k4kKK2K1k2j7JQK0Oj1j6pLJ6K2k2kj2J5J2ljk3lkRJ4
$$ plain form
7279 -25 16 29 13 -16 -19 -2 -2 26 12 12 -43 -25 10 15 22 -1 -26 -11 10 27 29 5 0 -21 17 32 24 -1 -17 -27 4 4 17 5 -22
7314 -22 -30 -21 27 17 14 -19 -22 -14 4 22 10 -2 -19 -15 8 40 9 -7 -16 -7 15 29 35 -6 -21 -2 21 31 31 17 -10 1 5 10 30 16
7350 16 -11 -29 -9 16 37 -4 -16 -22 8 15 19 2 -17 -16 -6 19 6 -5 -23 -8 4 11 28 19 -13 -22 -9 17 19 14 -6 0 0 19 10 31
7386 31 -6 -10 4 25 46 9 -2 5 -21 16 21 22 7 -18 -21 -6 17 28 4 -5 -20 10 26 12 -4 -28 -13 6 6 23 3 -14 -24 14
7420 14 19 28 13 -4 -8 -13 31 25 18 4 -14 13 9 9 6 -13 -20 -11 8 10 11 -16 -3 -5 0 21 11 -13 -26 -9 -18 12 16 -13 -16 -13 11 22 18 -1
7460 -1 -10 -9 11 23 21 10 -7 -15 15 11 14 -4 0 -12 17 15 15 22 -16 -1 15 3 20 -7 -8 -18 -9 4 11 17 -12 -41 8 1 17 10 -27 -19 -5
7499 -5 4 20 20 8 -12 -13 1 15 4 -7 -3 -1 10 17 41 5 -5 -8 -1 28 5 13 -14 -28 3 15 -4 7 -19 -27 -5 -18 16 0 -15 -12
7535 -12 1 20 -2 -9 -6 -6 9 20 18 6 -18 -20 -18 4 25 3 -14 -13 -5 15 21 10 -6 -13 -10 6 28 6 4 -8 7 19 16 15 -8 -11 -13 -4 10
7574A0pj5mj8J8L6mj7nj3K9KJ6j6j0k3K7K3k5J1k3J4j6L4mqj5k6K1K2krj3JMO
7610AJ2J2l4Rj6J3K3j0j7QkkJ8jk1PnPK0j0j2RmJ1J0qjml2K6QQj9nj1RJJ6njk6
7651a8J2K5k5J1ml3RM8k7KnqJ7OJ9oj6mpK0jjj9mJ1qJ7Qj1j8MK0j1J2lqjkJ4l
7691A2kmnpJ7l%j4oJ1MJJpj0K9oLj4Kq%K0Rnqk5J5J3qJ8j8j4J0QJ9kk0lLj7J2
7733APrmJ8rJ3J4l7pJ1K3r%k3J2oqJ8J3k2NqLK0pJ7%l3J5j0RJ6rj5oJ8J6k4jk
7773@JRjoj0Kj4L1j4K0k6K5k1QJ0qnjpJJ8olj2PJ0J0j2Rrj0LRKMp%kLJ2j9loJ
7817gqL6j2roKJ9Nj5nj1OoOJ4J6l7PJ7j7J7rlJKPJ1j5%j5NRJ4rj1j4J0J1K4k7
7857CLoj1J2pJ4j6RJ4jmJ5k4j2LJ0J4k4J3j1nmK9Oj1mJJ0j0J3%k6QnJ7qQk3J2
$$ plain form
7574 10 3 -12 -16 -34 -16 20 16 -1 -6 -19 10 12 28 12 2 -21 6 29 4 15 -8 6 -10 24 20 12 -3 -29 -8 14 12 3 -10 -9 -5 1
7610 1 13 25 -9 0 -16 -3 20 10 -7 1 -1 -3 15 14 -7 0 -5 2 22 12 0 9 5 16 26 18 17 13 -19 7 15 23 4 -1 -12 -3 -2 14 9 8 -18
7651 -18 -6 19 -6 5 1 -32 -23 25 -2 0 -5 -13 4 10 29 23 7 3 -4 16 15 14 -5 -9 2 -6 11 19 8 -10 -6 14 3 15 12 4 3 1 15 12
7691 12 10 6 1 -6 11 8 8 -6 -12 -1 3 4 5 -2 -12 17 11 14 0 2 -6 -6 14 23 18 10 -15 0 13 5 23 5 -9 1 9 28 26 6 3 6 -11 1
7733 1 8 -1 -5 13 4 17 31 -6 -13 -2 21 12 12 -11 1 -5 -13 5 18 -4 1 -7 -4 16 9 26 26 -7 8 -2 7 23 14 -1 -7 11 27 3 2 0
7773 0 1 10 9 3 -7 -5 -19 12 -2 18 -8 17 -4 4 14 6 1 0 -7 -6 12 6 3 -9 -2 8 18 6 15 6 -4 -1 8 10 14 7 7 5 8 20 1 -2 -8 -7
7817 -7 -15 21 9 0 -6 -4 15 20 5 0 -11 -5 -11 -5 9 25 -12 -5 12 -5 12 3 0 1 3 10 21 6 6 -9 -4 5 19 10 -1 -15 -5 6 30 3
7857 3 6 0 -11 1 -6 8 -8 1 15 14 10 25 1 -11 -8 2 16 -8 5 -6 -11 -15 14 20 9 5 6 16 6 19 19 -7 1 -4 13 5 13 -10 2
7896Bkj1J7MrkJMkrJ3j2LJ7Pj6kNj5K4j6J7nk9J9JK3k9J3qmJ6R%j3pJQj3K1k1
7937@j1MJ0MNKj1Rj6K3j4j1KMjNJ5j3J0j8lJ2Qoj6J1j1K6J0j1j8OnLOjKj3oK5
7977A7mJ7l6PRKJ4pj5l1L4nl%knJ5k3K5J2qj8KjJ3QQk3j7J3RJ0pqKQrL4l3j1L
8018dJ2QmOok5J6J1LJk5QLrK9kk4k5J8QJ3j1Lo%J9j6J5nk6K1J3%j6JNj5K5pNj4
8059Cj0j2K3K8j6mj8JLLJ9j1j2qKJ4mJ4j1k2J3J6Qrj4J6j8J4PqNj4jNK6j9omJ4
8098A3mJ2%j0nqP%nK%j8J7OJ6k1qnOJ9KJl4LQJ4LMj6mQOJ2lnj6JJ5Nj4%jKOLj4
8144@pJ3j8K5J1j5Kk5PJ0J7k1J2k6NOJ4Nk1j2LNPJ7j2j1J6mRqNpMlJ7k0jRnjQ
8185A0J5j4k0kK3o
$$ plain form
7896 2 0 -11 6 10 1 -1 0 4 2 -7 6 -6 -3 14 21 5 3 8 -7 17 1 18 13 -16 3 4 27 -2 11 3 -1 15 24 24 11 4 5 13 0 21 0
7937 0 -11 -7 3 7 12 14 3 12 -4 19 5 -6 -4 0 -1 4 19 6 16 -2 -5 7 15 9 -7 4 -7 19 29 18 0 6 1 4 10 9 11 -2 -8 17
7977 17 13 30 -6 1 10 12 26 19 4 -27 7 2 -1 -1 -3 -8 7 -16 9 21 13 -5 -3 -4 9 17 25 2 -15 -2 7 17 10 2 4 12 3 37 4 -7 -4
8018 -4 8 16 12 18 12 -13 3 14 17 18 -7 1 4 -5 24 22 -2 -27 -9 -1 12 1 4 -2 -2 17 1 16 11 -15 6 19 19 3 4 9 -6 19 12 17 3
8059 3 -7 -19 4 32 16 12 -6 -5 -2 1 20 9 -3 -11 -9 5 1 15 4 -18 -5 11 19 10 -4 12 -6 8 15 7 12 -2 -3 2 28 9 3 -1 13
8098 13 9 21 21 11 6 -2 5 5 0 2 2 -16 1 7 23 2 -6 -11 -5 14 16 17 -17 -14 -6 8 11 15 -1 -5 3 9 21 18 13 -3 -2 13 18 4 4 3 5 11 14 0
8144 0 -7 6 -12 13 24 9 11 -14 -7 3 20 -1 11 -15 -10 -4 10 15 -6 -18 -15 -10 -3 14 2 -9 7 3 12 4 9 2 6 3 20 0 -1 8 3 2 10
8185 10 25 11 -9 -11 12 6
8191F
$$ Imaginary data points
##PAGE= N=2
##DATA TABLE= (X++(I..I)), XYDATA
0@%%%%%%%%%%%%%%%%%%%%%%%%%%Qj6J6j6J6j6J6j6K2l0L2l2L3l9M6m8N4o2O8p4
46c8Q0q8R9j07J16j32J48j63J78j96K19k47K79l16L62m22N00o06P61j000J411
67H38k240M501k1438o8086N7723O6043o41j4625l1795l1135K2468L2574L780m4
81A7923q938k3205j3703L154L7890M4423l4525p2447N678M8953K0061P213j7746
94A4731m5093n241L1759K0398J5188q724m5702j7265K6967K7860K4692r860o2193
107c2483j8948N4075K7537j4315o511j5495k1169J0102K4415J6121J943k6207
119i35k9378K428K5495L6035J0898n3254m6277L3973M4756J641n957k0842l5018
132c6435J1335M1360Q888j1460j3640k1067j944K2863J8716N994j5814l2564m695
$$ plain form
0 0 0 0 0 0 0 0 0 0 0 0 0 0 0 0 0 0 0 0 0 0 0 0 0 0 0 0 8 -8 8 -8 8 -8 8 -8 14 -16 16 -16 17 -22 24 -24 30 -32 36 -38
46 -38 42 -46 53 -54 62 -70 78 -85 93 -103 116 -131 148 -168 194 -228 272 -334 427 -573 838
67 838 -1402 3099 -18339 -86425 -28702 37341 36700 22075 -9720 -40855 -18387 14187 17967 17923
81 17923 8985 -14220 -27923 -24769 13121 57544 23019 -49428 -43750 5203 25264 32477 14731
94 14731 -30362 -35603 -3844 16554 31742 23018 -22684 -39949 -12982 14878 39570 29710 -32483
107 -32483 -51431 2644 30181 15866 9355 -6140 -27309 -17207 7208 23329 25272 -935
119 -935 -30313 -27885 -2390 33645 44543 -8711 -54988 -21015 23741 25382 19425 -1417 -36435
132 -36435 -25100 16260 25148 13688 48 -21019 -22963 -100 18616 24610 8796 -23768 -28463
145b8463K6785J9523P632j0398l7053j5913L2059L2702K409k2242l2980n546L1399
158h6K2845j768j3047k4740j1249K3600K1783O0m689j8291k4278J1715L5090J0990
172B7935j6047k3685j4609J1601K5998J2957p807k3854j9920J0039K6933J4023
184B3564m150k2915k6986Q151L6701J4286j6717k1265j2476P212K2702J0570p568
197A1109j1495j3250o056J5118K2372N323j7575k6565o688K5818K8162k173k6128
210b028k1858L472K3748J6794m118j5088j5196m869J4018J9831M915j2572j9958
223a2909j0623J4271K6130O569j8017k0234n140J2543J9658Q294j1541j9586r563
236b0148R037K0223J2797q874k3431j3293J1922K3412R789j1622j9674r464Q953
$$ plain form
145 -28463 -1678 17845 25477 15079 -21974 -37887 -5828 26874 29283 7041 -25939 -31485 -86
158 -86 22759 20991 7944 -16796 -28045 -4445 17338 17398 12709 -5582 -29860 -18145 16945 27935
172 27935 11888 -11797 -26406 -14805 11193 24150 16343 -7511 -27431 -17392 9541 23564
184 23564 19414 -3501 -30487 -22336 14365 28651 11934 -9331 -21807 -14595 8107 18677 11109
197 11109 -386 -13636 -19692 -4574 17798 23121 5546 -21019 -27707 -1889 26273 24100 -2028
210 -2028 -23886 -20414 3334 20128 16010 922 -14274 -19143 -5125 14706 19621 7049 -12909
223 -12909 -23532 -9261 16869 23438 5421 -14813 -19953 -7410 12248 20542 9001 -10585 -20148
236 -20148 -11111 9112 21909 13035 -10396 -23689 -11767 11645 21434 9812 -9862 -19326 -10373
249a0373J8150R915o464j5764j1874K218J6378J6463j782j9966j6690L639J9022
262B872J6290k318k0019j6548M383J8095J3782r61j5536j6685n8J6538J5878J077
276A6790j4624j7386k380J5392J7001K487j3999j7202l425J3144J6573N321j1905
289E787j8607n562J2914J7067O167j0467j8812p217J2608J7258N696r080j6774
302i022q831R568J7381P730p770j6400j0331P230J7686J0158o749j7154j1173
315a7677O581J7203J0779n125j6518j2263N094J6655J1192l523j5015j3463K500
328a3580J6408J2710k566j4366j3579N90J5271J4053j194j4023j3429n41J3420
341h26J4441R78j3102j4227j802J2294J4495K667j1847j4835l391J1435J4854
$$ plain form
249 -10373 7777 17692 11228 -4536 -16410 -14192 2186 18649 16867 -3099 -19789 -16150 2872
262 2872 19162 16844 -3175 -19723 -15340 2755 16537 15576 40 -16645 -16703 -165 15713 16790
276 16790 2166 -15220 -17600 -2208 14793 17280 3281 -13921 -17346 -4202 12371 17692 5787
289 5787 -12820 -18382 -5468 11599 17766 7299 -11513 -18730 -6122 11136 16832 7752 -9022
302 -9022 -17853 -8285 9096 16826 9056 -7344 -17675 -10445 7241 17399 10650 -6504 -17677
315 -17677 -11096 6107 16886 11761 -4757 -17020 -11926 4729 15921 12398 -2617 -16080 -13580
328 -13580 2828 15538 12972 -1394 -14973 -14383 888 14941 13747 -276 -13705 -14246 -826
341 -826 13615 14593 1491 -12736 -14538 -2244 12251 14918 3071 -11764 -15155 -3720 11134
354A1134L861j0663j4847m936J0109J5552N414j0115j5010n598Q695J5190O985
367A5771q891j5254o352P258J4152Q608o537j5671q293O330J4238R803n138j5846
381e822r470N913J4149R708m188j4576r584M185J2485J0359j788j3654j0927K384
395a0826J1626J1529N24j3700j2846K039J2073J1125J290j2202j3298N74J1434
408f58J1320K670j0912j4242j038J1054J1725L778j0015j5121k036J1264J1112
421H901L675p784j4020m166R159J1515N802o124j4887o184Q626J1811P054m451
435H927j6094q517R690J3157N284m441j3701q951P759J3099N462m188j1826p972
449a2312N455R939O310P21j0307j2716K528J2606Q524Q60j0681j5159J213J6179
$$ plain form
354 11134 14995 4332 -10515 -15451 -5342 10210 15624 5509 -9501 -15099 -6404 8786 15771
367 15771 6880 -8374 -14726 -7468 6684 15292 8755 -6916 -15209 -8879 5359 15162 10024 -5822
381 -5822 -15292 -9379 4770 14478 10290 -4286 -13870 -9685 2800 13159 11371 -2283 -13210 -10826
395 -10826 800 12329 12853 -847 -13693 -11654 419 11544 12834 632 -12666 -12092 -658
408 -658 10662 13332 2420 -11822 -12860 -1806 9919 13697 3682 -11439 -13475 -2211 8901
421 8901 12576 4792 -9228 -13394 -4235 7280 13082 6958 -7929 -14113 -5487 6324 13378 8927
435 8927 -7167 -15684 -5994 7163 12447 8006 -5695 -14646 -6887 6212 11674 7486 -4340 -12312
449 -12312 -6857 3082 9392 10113 -194 -12910 -10382 2224 10748 11608 927 -14232 -13019 3160
463C160J0253l180j2256j0939L448J2273O298l50o599j1735j877J1126Q755J807
477A0184n172j3627o217J2447J3629K44r333j1227k435R554Q911K347l272j1461
491e428q555Q274J3335M126m639j3084j0143J0149J7422J062j1012q934j620O675
505b372O948J293k30m641j0378j101J1457R662O44j0593j5930J199K0391J0537
519A6886r984j3711n015O254J0824L273l765m819o832k320Q526Q807P95n838j1531
534h450n312J2615J3853l095j1044o881k10P349Q369J436m915r195o480P121J3484
549H645L251q056j1689n715J0093J5021p79j1991o376R27M738O240K399k477n584
564a353o986K42J0573Q464k731j0556j0009K479J5319Q644q130j2154m596M733
$$ plain form
463 3160 13413 10233 -2023 -12962 -9514 2759 9057 8707 2108 -9627 -11504 -378 8377 10184
477 10184 5012 -8615 -14832 -2385 11244 11488 2155 -9072 -11507 -1953 6958 9305 6033 -5428
491 -5428 -13983 -5709 7626 11752 7113 -5971 -16114 -5965 11457 12519 1507 -7427 -9047 -2372
505 -2372 4576 5869 5639 998 -9380 -10481 976 10638 11282 689 -15241 -14042 6349 16886
519 16886 6902 -6809 -11824 -5570 5254 8527 4762 -57 -6889 -9209 -683 8124 8919 3081 -8450
534 -8450 -13762 -1147 12706 9611 -1433 -8314 -8524 -1175 7194 8630 3715 -5480 -11960 -4839 8645
549 8645 11896 3840 -7849 -13564 -3471 11550 10771 -1220 -7596 -6669 -1931 4309 6708 4231 -1353
564 -1353 -8339 -8097 2476 10940 8209 -2347 -12356 -9877 5442 14086 5956 -6198 -10794 -6061
578f061J0598N985n069r409n084K965R052N726l281o851n065o25O551Q189M02
593H023o941p792k925O797J1577K529j0054j1362o23J0870J0352j636j0087p045
607h317J043P079P034N65n900o824k651M587Q997L901o186r604l011O253Q765
622E731K595n143p444l730K947P909O351k114j0281q342M131J3052O876p190j2499
637g151l748Q283R458M98o009m775j067J215K782M422L220m030j0280l622R712
652a092J1580k61j1499j0001K901J1919O393m465q068m415J748N811M705Q51l890
667B217p882l599P404R623M72p468p610q89P078O896Rm444n397l476L011P707
683C652M754k761r638p382N960J2890L020q411q846j767O661P946K13n060l932
$$ plain form
578 -6061 4537 10522 5453 -3956 -9040 -6075 2977 8703 5422 -1429 -6494 -7119 -568 7621 8023
593 8023 1082 -6710 -9635 -2838 8739 11268 1214 -10148 -10771 99 10451 8815 -1272 -8317
607 -8317 -7274 -195 6839 7404 1504 -5320 -7971 -3384 5613 9514 3328 -6276 -9287 -3034 5731
622 5731 8326 3183 -4261 -7991 -5044 2865 9216 7102 -3179 -11521 -7390 5662 12538 5348 -7151
637 -7151 -10899 -2616 6842 7340 1331 -3444 -4511 -3296 -514 3908 7128 3098 -7182 -10804 -1092
652 -1092 10488 10227 -1272 -11273 -8372 3547 9940 5475 -2593 -7008 -5260 551 5256 6107 2217
667 2217 -5665 -9264 -1860 7763 8235 767 -6843 -7732 -654 6242 6251 1807 -3590 -7066 -4055 3652
683 3652 8406 5645 -3993 -11375 -5415 7475 10495 2084 -6762 -8529 -1868 6078 6291 1231 -2701
698b701k268R06N356M731l02n683p731k21J0003P299l607q270n600J680Q769N948
714H309l233o940m886M03P335O754j670o978n874K6P680O777k366o412l905o74
730e654M353O616J026m814n859l227M249R202K664o618p860k306O105Q980Q01
745G658p160n604q11L664O558K342m508n564k688K109P131M356m084o853l213
760f667K429P151M469l618o542l323J380O426N744k298p424m637J558P137N988
775G773k729p826l867K192N850M813j564n962l830L59M275N790R01n702n899p08
791f134N099O896J019o496o278q4N221N981R90n492n815n82M224N647J997m370
807A823o193j577L883N909K561l862o435k211L536N873L029l175o557l021L192
$$ plain form
698 -2701 -4969 -4063 1293 6024 5722 39 -7692 -7913 2090 9389 5782 -2488 -8088 -6408 2361 8309
714 8309 5076 -1864 -6750 -6347 988 7742 6072 -906 -6780 -6754 926 7703 5337 -1075 -4980 -5654
730 -5654 -1301 5315 6341 1527 -4332 -7559 -3310 5892 8556 1938 -5922 -8228 -2123 6857 7658
745 7658 498 -5106 -5917 -2253 4305 6647 2139 -3425 -6113 -4004 3127 7483 3399 -3454 -6667
760 -6667 -4238 2913 7382 3764 -2778 -6101 -4721 1705 7449 5151 -2273 -6910 -5352 1785 7773
775 7773 5044 -2782 -6649 -4457 1393 6206 4642 -1320 -5150 -4791 -516 5274 6175 473 -5426 -6134
791 -6134 -1035 5861 6880 384 -5894 -5978 -757 5224 6214 722 -5093 -5675 -1451 4196 6193 1823
807 1823 -4370 -5947 -2064 3845 6406 2544 -3891 -6102 -2566 3307 6336 3161 -3396 -6417 -3225
822c225O099L489k735o645l566L062O198L446k244o131l896K302N893L761j533
837D275n670m449J398N743M241r03n395m952P59N699M527n03m855n161o0N480
853A74N010j45m634n220o22N118N236J92m285n181j242M634N400O52l729n152
869c794k070M064N989J275l694n186k427L586O184J696l522n055k682K904O080
884C348K179l093m801l087K010O092K935k787m766l229J375N866L499k348m635
899a442l382O92N524M115j904m684l496J41N125M701j454m798l555j23M693M876
915E029r29m502l536p02L987N457n9m664l872r17L568N655N87m701m159q53L170
932a441N320R82m014l887j493K057N618K419l890m736j692K117N580K834l831
$$ plain form
822 -3225 2874 6363 3628 -3017 -6583 -3521 2677 6123 3879 -2252 -6148 -3846 2047 5808 4275
837 4275 -1395 -5844 -4446 1297 5538 4635 -760 -5712 -4953 746 5273 4770 -85 -5246 -5306 174
853 174 5184 5039 405 -4815 -5437 -319 4917 5109 824 -4357 -5599 -965 4435 5087 1358 -3794
869 -3794 -5864 -1800 4189 5464 1770 -3416 -5843 -2257 3927 5623 2101 -2954 -5636 -2732 3348
884 3348 5527 2434 -2367 -5454 -3444 2648 5583 2796 -1970 -5199 -3824 2042 5541 3193 -1442
899 -1442 -4824 -4132 1392 5507 3603 -1081 -4577 -4436 689 5390 3936 -862 -4417 -4540 153 5029
915 5029 4100 -402 -3938 -4640 -653 4804 4745 81 -3791 -4708 -1140 4515 5102 401 -3758 -4611 -1441
932 -1441 3879 4861 847 -3040 -4533 -2476 3142 5561 1671 -3065 -4757 -2640 2940 5774 1943
947A943n092j352K245M688K421k844m031j793N78M135M213j714n123k812Q17M593
963H72M696j658n945k861J796M436L433j548m515k396L46L131M459Q5m867l615
979d151K51L369M742N76n112m157P71L627L729L83l638l527o17K199M544K157
995E146l788n034q31L001M692J969l960n180k54L470L573R95k521l535j193J397
1011b053L468K960j532m753k414J578M139L470j492n584k861K467M573K541j796
1026B711m605k453J735L949K809j253m226k461J266L066K808R5l493l562P5L363
1042a76L671N45l658m299k68L907M215J40m102l797K77L376L331M97k879l734
1058b954q32K793L904J156k884m149j058K957L898Q27k656l294j057J618L179
$$ plain form
947 1943 -3149 -4501 -2256 2432 4853 2009 -2022 -3815 -3237 898 5111 3397 -1726 -4538 -3721 872
963 872 5568 3910 -2035 -4896 -3100 1336 4769 3221 -1294 -3690 -3344 -213 4246 4331 -536 -4151
979 -4151 -3900 -531 4211 4787 -325 -4482 -3711 -84 3645 4028 390 -3137 -3754 -1555 2989 5146
995 5146 1358 -3676 -4507 -1506 3186 5155 1195 -3985 -4239 -769 2804 3799 1278 -2257 -3450 -2053
1011 -2053 1415 4375 2843 -1910 -4324 -2746 1393 4863 3371 -2213 -5074 -2607 1966 4507 2711
1026 2711 -1894 -4347 -2612 1337 4146 2893 -1333 -3794 -2528 538 3346 3441 -52 -3614 -3539 -176
1042 -176 3495 4040 382 -3917 -4185 -278 3937 4077 -25 -3822 -3545 -169 3162 3659 780 -2954
1058 -2954 -3786 -993 2911 4067 1183 -2966 -4024 -1067 2831 3658 1002 -2292 -3349 -1731 1448
1073A448K171j020l848l124J097N098L589k428n778k445L309N106J191l405l481
1088b520l73J698K087J396j47j892k747j264K913M830N33m809m320P75M823L608
1104D591j489m331k294J007K826K605k6k678k803r10K370M379J028m104l928L91
1120c366L429L043j60k816k248l14J097K704K142j316l761k598J273N119L266
1135E494l542n726q03L798L909M71l099k975J3J560J865J624n05k640k186r8K957
1152A17L746n32m604k695J455L369K623o86l707k593Q29L042L071k28l851k997
1168c641Q68L296K988n36l860k371J328K260J643N28j818k772r16J658L329J958
1184C942k470m429j038L000L973J081l337m004O2K935K516P67j853l242j089J963
$$ plain form
1073 1448 3619 2599 -1249 -4373 -3276 1822 5411 2983 -2795 -5240 -1931 3175 4366 961 -2520
1088 -2520 -2893 -1195 892 2288 2141 249 -2498 -3762 -849 3981 4514 -295 -4615 -3840 983 4591
1104 4591 3102 -1229 -3523 -2516 310 2915 2889 211 -2592 -3502 -1132 3247 4275 171 -3757 -3366
1120 -3366 63 3106 2946 130 -2118 -2432 -1335 1369 3511 2195 -1566 -4164 -2891 2228 5494
1135 5494 1952 -3774 -4577 -779 3130 3601 502 -2473 -2460 -900 965 2589 2084 -556 -2742 -2840 117
1152 117 3863 3331 -1273 -3968 -2513 856 3479 2793 -914 -3507 -2678 364 3435 3207 -644 -3641
1168 -3641 -2773 523 3511 2975 -885 -3256 -1928 332 1975 2503 685 -2087 -3003 -1345 1984 3942
1184 3942 1472 -2957 -3995 -995 2978 4059 722 -3282 -3220 -285 2231 2998 1145 -2097 -3186 -1223
1200a223K900J547j606l557j372J945K818J486j136l031j730J053K554K340m0
1215B948l534l265R84M042K852j321m332k429K130L642J337j456k654j499Q05
1230a750J968J801N20j915l141o70K790L330M53l073l496j4L236K860p7k620k794
1247b592l69K410K886O84k209l219q83K584L243M89k403k745n46J894K504Q46
1263B574j318k442j637Q96L108K148j247l548k218J609L910J836k144l386j255
1278c114J665K913J456j333k571j573N60K575K294n93k916k200M30K798K559o15
1294B335k891k051K33K310K714J26k760k630j51K521L121J77l177k651K51K435
1310h8K575O0k565k097n5J378K360J284j838k920r51J599L100J594k297l420o91
$$ plain form
1200 -1223 1677 3224 1618 -1939 -3311 -1366 1452 2938 1802 -1229 -2959 -1906 648 2988 2948
1215 2948 -586 -3851 -2867 1175 4027 2706 -1626 -4055 -1925 1717 3054 1598 -1056 -2555 -1750
1230 -1750 218 2019 2539 624 -2517 -3187 -397 2933 3386 313 -3183 -3197 39 2899 2822 202 -2592
1247 -2592 -2961 -551 2335 3019 810 -2409 -3292 -708 2535 3024 621 -2124 -2670 -776 1728 2574
1263 2574 1256 -1186 -2823 -1927 1181 3329 2082 -1466 -3684 -2075 1835 3671 1527 -1859 -3114
1278 -3114 -1449 1464 2920 1587 -984 -2557 -1997 578 2872 2279 -637 -2837 -2407 391 2950 2335
1294 2335 -556 -2607 -2374 -64 2650 2776 16 -2614 -2765 -244 2877 3054 -123 -2774 -2523 -88
1310 -88 2487 2547 -18 -2115 -2170 -792 1568 2852 1014 -1906 -2857 -1258 1842 3436 1139 -2281 -2972
1327b972K000K875J214k116k983n73J411K256J752j175l237j353J347K595J984
1342C025j103l344j462J389K384J863p39k994j593Q68J990K218J02l087k488P83
1358b188K513K307m7l101k416R08K379J944J13k545k329M76J856J953R00k103
1374F20l083j44K263K334Q28k168l145j84K325K216P66j811k954m30K003K017
1390A453J107j155l116j138J941K373J157j104l057j352J780K344J231q11k876
1405a223j610J489K323J342l81k702k127J204K659J452m70k534k154R51K529J508
1421B256k35k310k320N57K514J656L0k051k644J51K702J978r6k013k477k6K401
1438G3J998J47j704k563m43K213K160L77j491k611r09K128K532M38j582k427q91
$$ plain form
1327 -2972 -972 1903 3117 1001 -1982 -2555 -1144 1112 2864 1689 -1548 -2901 -1554 1041 3025
1342 3025 1922 -1422 -2884 -1495 889 2752 2013 -981 -2574 -1706 284 2502 2604 -483 -2971 -2188
1358 -2188 325 2632 2585 -516 -2932 -2024 355 2299 2412 -133 -2462 -1986 -130 1823 2723 620
1374 620 -2463 -2607 -344 1990 2818 650 -2495 -2679 -354 1862 2628 817 -2137 -2567 -564 1453
1390 1453 2560 1405 -1711 -2849 -908 1465 2622 1518 -1539 -2891 -1111 1233 2464 1653 -1223
1405 -1223 -2833 -1344 979 2321 1940 -762 -2889 -1685 974 2426 1956 -578 -2732 -1781 748 2256
1421 2256 2021 -289 -2609 -2052 462 2118 2148 97 -2547 -2396 306 2284 2188 175 -2302 -2328 73
1438 73 2071 2218 514 -2049 -2492 -279 1881 2258 767 -1844 -2753 -625 1907 2345 763 -1664 -2555
1455b555J777K393P10j226k402j273J489K500R73j052k417j623J272K790J168
1470B524j229k398j424J070K500J342q88k273j633P75K440J522n83k161j939L87
1486a968K509J887n97k221j902K86K279J974k89k161j944J06K066J975R8j874
1502B24k146l14J953K286K96j961k256l49J860K280L81j893k119l32J520J970
1518A400P23j250k221r73J286K355J209j314k649j177J553K615J002j607k527
1533a575o66J441J860Q85p63k021j265O98J932J583k99k326j977P26K518J732
1549B483p48k531j497Q92J939J347j47j898j902K40J916J743K56j960k373N0K401
1566B11J927k33k048j789L04J660J378L72j123k113o93J505K044R12j288k797
$$ plain form
1455 -2555 -778 1615 2325 1099 -1303 -2576 -1087 1413 2386 1334 -1083 -2706 -1434 1356 2524
1470 2524 1295 -1103 -2527 -1457 1043 2385 1497 -776 -2409 -1634 806 2328 1745 -416 -2355 -1968
1486 -1968 541 2428 1831 -390 -2292 -2006 273 2247 1958 -203 -2147 -2041 25 2000 2098 224
1502 224 -1922 -2236 -283 2003 2299 338 -1918 -2267 -407 1873 2254 361 -1758 -2090 -570 1400
1518 1400 2123 873 -1348 -2321 -1035 1320 2529 1215 -1434 -2611 -1058 1557 2559 952 -1575
1533 -1575 -2241 -800 1060 1945 1182 -839 -2104 -1406 526 2109 1810 -516 -2493 -1767 751 2483
1549 2483 1735 -796 -2293 -1401 538 1885 1738 -160 -2062 -1822 94 1837 2093 133 -2240 -2190 211
1566 211 2138 1905 -143 -1932 -1628 32 1410 1782 659 -1454 -2147 -642 1402 2314 1026 -1771
1582a771r99K174K595L25j908k235k76J770J709L98r18j869j026J126J850R79
1598A924n20k128j711J000K501J146r22k127j402Q55K137J293m60k104j811P31
1614a598K383J345n96j992j713N87K306J235o61j573j401N1J644J599J68j528
1630B56k090k97K044K015M5j747k083k95K062K072q7j686j780m19J585K032L88
1647B015j579k014n07J664J937K46j263j587p25R84J809Q44p07j777j426N88K410
1664I12J582j082k611j329J396K505Q39j433j926o83R29J626Q89m78j464j280
1680a608N9J727J793j92k114j734M22K065J579m16j913j495K29J635J640J00j688
1697H9j876j87J846K052Q5k063j888L07J785J369l3j277j411k77R06J465R17p78
$$ plain form
1582 -1771 -2770 -596 1999 2324 416 -1819 -2095 -325 1384 1782 864 -1005 -2031 -905 945 1924
1598 1924 1404 -724 -2435 -1435 1066 2212 1290 -837 -2239 -1384 753 2046 1586 -518 -2329 -1598
1614 -1598 785 2130 1534 -458 -2171 -1584 722 1957 1296 -277 -1678 -1627 17 1616 1784 256
1630 256 -1834 -2131 -87 1928 1973 226 -1857 -2152 -90 1982 1895 209 -1571 -1990 -405 1627 2015
1647 2015 436 -1578 -2085 -421 1516 1762 499 -1088 -1813 -829 980 1824 1117 -660 -2086 -1498 912
1664 912 2494 1412 -1199 -2528 -1132 1373 2212 779 -1147 -1830 -901 725 1614 1136 -328 -1608
1680 -1608 -1549 178 1971 1779 -335 -2069 -1647 418 1997 1581 -332 -1827 -1598 37 1677 1777 89
1697 89 -1787 -1974 -128 1924 2009 -54 -1942 -1635 150 1519 1486 209 -1202 -1479 -573 892 1809 1031
1715A031k139j128J188K349J075j499k509n95J729J923M46j192j834o20J107J561
1731H93Q12n95j881j210Q95J887J059o84j944j175Q75J674R85k15j622j609K91
1748a564J928J527j55k010j923N79K241J330n90j805j388N93J642Q62o1r41j548
1765a283m04J380J671M35j243k118m81J858J836J02j395j871l23J661J526J53
1781A504q98j704r04J364J980M40j132j843p61J423J798L02r22j437q79Q50J628
1798H09O77l73j421j628M21K287J281q47j929j351Q47K185Q69r22j441j040M67
1815a109J630Q94l29j008j416l28J769J643l06j525j500p1J761J573k94j401j393
1832a410k19J575J565p6j180j472n58J431J958L3j494j390l48J206J664K44j178
$$ plain form
1715 1031 -1108 -2236 -1048 1301 2376 877 -1632 -2227 -498 1425 1871 679 -1155 -1775 -668 893
1731 893 1705 1110 -771 -1981 -1086 801 1860 1176 -768 -1943 -1068 606 1591 1376 -246 -1855 -1564
1748 -1564 364 1891 1736 -274 -2197 -1618 623 1953 1363 -442 -1830 -1237 405 1267 1206 265 -1283
1765 -1283 -1687 -307 1364 1799 556 -1562 -2043 -185 1651 1753 358 -1513 -1836 -175 1351 1504
1781 1504 606 -1098 -2002 -638 1342 1782 650 -1193 -1954 -531 1267 1569 647 -790 -1669 -819 809
1798 809 1486 1113 -308 -1936 -1515 772 2053 1206 -723 -2074 -1227 958 1827 905 -536 -1576 -1109
1815 -1109 521 1415 1086 78 -1338 -1666 103 1746 1440 -85 -1585 -1656 105 1678 1384 -17 -1410
1832 -1410 -1629 -54 1511 1435 255 -1217 -1775 -344 1614 1647 153 -1237 -1585 -379 1285 1529 351
1849C51j325o25R09J738N54r43j437r56P11K075Q71j202j643p38P72J815Q42r96
1867G73j543p95N80J679R47p56j437r24K69J630J290o18j585r91K76J501J356
1884A652l59j612j176J83J519J422l08j592j154P5J375J470j19j500j189kJ146
1901a69J439K14j289j416k44J146J590L24j294j458l32J040J541N03j191j511
1917a107l85R66J461N99r26j542n88Q33J562P38r12j547o19P31J475Q22p18j548
1935g05q12O48J431R31n13j533j005N26J558J035n30j521r78M46J428J032l15
1952A123j382j134K37J350J129r2j306j293L5J343J336l5j323j300k2J269J288
1969A223J21j149j388j87J182J367K13j057j413l66J129J448K74j050j348m19
$$ plain form
1849 351 -974 -1599 -690 1048 1602 659 -778 -1734 -1023 1052 1923 721 -922 -1660 -888 927 1769 773
1867 773 -770 -1565 -985 694 1641 885 -552 -1476 -1207 423 1713 1095 -490 -1481 -1205 296 1652
1884 1652 1293 -319 -1495 -1312 207 1629 1321 -271 -1425 -1350 25 1495 1376 -124 -1313 -1315 -169
1901 -169 1270 1484 195 -1221 -1465 -319 1271 1595 301 -1157 -1489 -449 1092 1595 404 -1107
1917 -1107 -1492 -526 935 1534 608 -934 -1522 -689 873 1611 699 -848 -1467 -736 739 1561 843 -705
1935 -705 -1517 -869 562 1493 980 -553 -1558 -1032 526 1561 1031 -490 -1468 -1022 406 1438 1123
1952 1123 -259 -1393 -1156 194 1323 1231 -75 -1368 -1333 10 1346 1311 -12 -1312 -1334 -65 1223
1969 1223 1344 195 -1193 -1380 -198 1169 1382 325 -1088 -1454 -325 1123 1397 347 -1001 -1420
1985a420R65J392M51q73j368o25Q65J496O17q31j440p42Q01J572O29q39j337o93
2003a380N78J394P80n47j283r30L67J440J031m57j382j020L51J480R96m38j294
2020c14r04J81J223J094j84j206j107k3J229J304n8j289j205j5J296J268r9j208
2038a7j065n5R63J242J78j034j176l19Q74J385M16j031j335m23R38J417M09r63
2056D04j264m27P33J312N94p59j265o06N94J300P82o46j377p04N57J316P84n79
2074G49j295p16M29J219R07m00j278q30K91J197J014k40j294j005K31J249J050
2091A278k14j286j033K06J164J056j33j158r82P3R82J032J28r43j098k33Q80J236
2109I55L62r77j349l24J037J328K69j044j245k15R19J109L14p66j094m27O32J179
$$ plain form
1985 -1420 -455 937 1388 515 -853 -1478 -613 883 1500 669 -771 -1513 -712 860 1489 650 -687 -1380
2003 -1380 -802 592 1372 825 -458 -1388 -1021 419 1450 993 -389 -1409 -1058 422 1418 980 -314
2020 -314 -1218 -1037 186 1280 1096 -110 -1217 -1240 -11 1293 1235 -54 -1259 -1274 22 1290 1191 -17
2038 -17 -1082 -1137 -174 1068 1246 212 -964 -1283 -409 976 1392 361 -974 -1397 -459 958 1367 404
2056 404 -860 -1287 -554 758 1352 593 -672 -1278 -684 616 1398 752 -625 -1329 -772 544 1328 749
2074 749 -546 -1262 -833 386 1293 893 -385 -1215 -924 273 1287 1047 -247 -1252 -1021 228 1278
2091 1278 1064 -222 -1255 -1049 115 1171 1038 -120 -1102 -1029 -47 985 1113 170 -928 -1161 -281 955
2109 955 1317 340 -1009 -1333 -296 1032 1301 257 -988 -1203 -284 825 1139 373 -721 -1148 -516 663
2127F63N86o18j283o55O98J306N73o92j186o15N63J178O35m61j098p64K90J222
2145C42R45l65j337r03M53J347P75m83j133p05K88J001P48j40q58q68j59Q99J180
2164A027J50j108j178j10J199J175o9j108r83l0R58J024P0q66r30k70P25J153
2182H29L12q54j117k85P49J141L05p33r80m06M89J136O02n99j138o23M72J324
2200F24P32p67j301m70O10J143N38o15r48m80K52R09P97k37j008p64Q0J054J041
2219A190k62j192p95K17R81R30j72j065q02N5Q77J056jj101r36P8R58R99m3j063
2239i1p69R3O70P97K38p09q75l15N27J060N93p92j283l43Q18J193L83r44j110
2258h59r0O81Q30M26n51r66l75L98Q82O84l95j135n95M53R93O91m39j074n33L47
$$ plain form
2127 663 1249 631 -652 -1307 -609 697 1270 578 -608 -1223 -660 518 1153 692 -406 -1170 -880 342
2145 342 1287 922 -415 -1318 -865 482 1257 774 -359 -1064 -776 225 973 833 -25 -893 -1052 -153 1027
2164 1027 1177 69 -1109 -1219 -20 1155 1086 -22 -1005 -1035 -77 947 1017 151 -779 -1049 -324 829
2182 829 1141 287 -830 -1115 -366 775 1080 347 -633 -1039 -550 586 1188 589 -549 -1172 -700 624
2200 624 1356 589 -712 -1182 -572 571 1109 494 -454 -934 -682 227 1024 787 -221 -985 -905 149 1190
2219 1190 928 -264 -1059 -842 139 1069 897 -168 -970 -915 -38 1018 1017 -84 -1020 -942 16 1015 972 -91
2239 -91 -860 -767 -97 700 938 229 -646 -961 -434 626 1219 427 -856 -1199 -381 812 1195 251 -859
2258 -859 -949 -268 562 988 437 -529 -904 -506 376 1060 665 -470 -1065 -612 381 1072 633 -441 -974 -627
2278f27Q64P35j62j077p49K72R66Q17j44j180q15L93R87O57k20r35o41J95O88
2297B4O78J41p47r11p8P68Q98K66q51j079r1R21Q86J45q17r49j03P26Q26K85o45
2318B93j011k21O82Q49L28n46r55l33N58Q74M06m31r15n24M40R33N81l70j107
2337d69o06N35J020M94m67r63n07M38Q75M96k87p93n95J80Q28O74q8q94q00J70
2357g59R16P22j34q45p46Q5P92P41K1p57q15p7Q00Q65Q1p89q98n3Q14P88L0o81
2379A01p01j69N41P57K98n12q61l72N26R47M12o03r90l50O67R15K92o11p90k65
2399g68M16P40M54l59q39m87L20Q15N96k99r30n56L23Q93N67l06q52n18K07P31
2419A48O42p6q58o77J19P89P20o4q55p14J45P51O51m2p15o42J9N75O82J92o32
$$ plain form
2278 -627 237 972 810 -267 -1016 -744 222 1039 895 -285 -1100 -707 280 937 717 -218 -859 -664 24
2297 24 702 843 96 -815 -893 -125 773 1039 188 -891 -982 -61 825 970 153 -796 -899 -173 653 938 293
2318 293 -718 -939 -257 592 920 374 -581 -914 -356 518 924 493 -422 -946 -506 427 1008 638 -469
2337 -469 -1075 -540 480 974 507 -456 -963 -525 350 846 559 -234 -829 -649 179 853 765 -129 -929 -759
2357 -759 157 879 745 -100 -846 -761 31 772 793 36 -779 -856 -56 809 890 101 -797 -850 -36 752 782 101
2379 101 -600 -769 -228 529 827 315 -546 -918 -392 555 967 364 -626 -976 -309 606 898 287 -503 -768
2399 -768 -352 388 842 483 -356 -843 -523 292 888 589 -341 -897 -574 319 886 580 -272 -790 -583 148
2419 148 790 714 -144 -821 -702 87 807 743 -112 -826 -681 70 721 679 -36 -678 -659 -84 598 790 158
2440A58q24j06O19Q17K10p09q48j23O72P08K18n86p80j75M80P00L69m16q72l49
2460h37M93P81L99l81q81m12M63P49M21k99q48m57L37P19N26j92q62n82L24P85
2480B46N29j78q20n58K63P27M89p9o97o40J12O77O07K3p07p24J6P44O63ko88p22
2502g19M3O78O17N8n20p62j38O32O58J80m69q16k58O17P53K12n35p68k48N10P45
2523D70K64l79p90l64M84P47L01l15p57m67M05Q33L42l64p30m28K99P50M13k36
2543D78p19n21K50P52M47j56o70n80J26P65N63j61o74n83P8O94N85n5o47o45K4
2564f49O74O07ln82o37j03O13O76Q1n44o61j71N20P59J81n76p14k00N59O86J57
2585F73m72o44k72M18O96L27m12p05l26L44P55M08m12p62l30L68O91L57l20o59
$$ plain form
2440 158 -666 -772 -153 664 874 165 -683 -806 -134 574 792 206 -574 -749 -269 431 800 384 -488 -837
2460 -837 -344 437 836 455 -426 -838 -375 374 795 496 -352 -809 -472 247 773 581 -281 -863 -539 246
2480 246 775 597 -223 -781 -518 209 698 619 -78 -718 -606 71 678 701 -6 -730 -714 30 693 691 3 -719
2502 -719 -676 2 619 677 157 -605 -743 -111 547 727 258 -558 -816 -199 554 766 231 -537 -785 -275 470
2523 470 734 355 -435 -799 -315 432 733 418 -339 -806 -401 432 774 410 -320 -748 -449 301 714 478
2543 478 -241 -762 -512 240 687 531 -139 -719 -593 172 735 574 -100 -683 -605 89 674 619 -28 -673 -649
2564 -649 25 632 629 47 -590 -693 -80 596 677 133 -528 -699 -179 580 761 185 -529 -729 -170 516 673
2585 673 201 -443 -715 -297 399 726 314 -391 -717 -373 382 790 378 -384 -714 -346 345 702 382 -277
2605b77l82K15O35M92j74o94n18J40P00N98j55p63n31J97O73N10r4o51n34O8N62
2626A7N70K4n87o34l9N84O49Q8o33o53k5N77N90J12n21o39j40M86O36K40m82p21
2648e01j87M59O95K31m56p33j97M61O20K48l34o68l05L46O34L62k49p14m00K89
2668c99O73M14k24p25m54K85O42M26j46o85n11K08O74M61j26o52n23J57O41M58
2688E94p1n41n31K8N19N42M7n05o67o8O24N86O8n62o43l0N54N81O4m65o00j52
2710f28M93N80J97m09o59k58M56O34K33l83o39k75L73O14K68k58o23m00L03O80
2730B99L84k84o74m17K87P34L40k92o25l90K58N72L76j50n14m78Q4N84N00p0n79
2751e5n62O8O48N19o6o06n45O1N60N31Kn25n59q0N41N98N3n19n54j00M98N64J09
$$ plain form
2605 -277 -659 -444 191 683 509 -185 -703 -563 137 735 580 -183 -714 -517 156 666 572 -79 -613 -545 17
2626 17 587 611 24 -610 -649 -65 584 672 39 -614 -639 -62 528 640 119 -520 -660 -174 462 702 220 -501
2648 -501 -688 -229 466 697 241 -492 -689 -228 392 640 306 -362 -667 -321 313 675 426 -288 -688 -399
2668 -399 274 688 464 -261 -715 -430 212 638 492 -193 -704 -496 178 639 513 -139 -662 -505 136 594
2688 594 523 -18 -549 -521 -2 540 587 82 -585 -653 -29 557 625 63 -580 -610 -56 525 589 124 -476 -628
2710 -628 -135 445 642 233 -426 -684 -228 406 639 256 -383 -658 -285 329 597 339 -284 -684 -381 299
2730 299 683 399 -275 -692 -405 329 669 377 -248 -638 -380 192 568 418 -96 -574 -490 94 594 524 -55
2751 -55 -617 -549 99 618 552 -54 -599 -538 22 553 555 30 -529 -609 -68 530 583 64 -490 -590 -92 472 581
2774E81m28n46j94L93N80K39l28o74l05M05O80K80m27o59k54M20O30K16l26n92
2794c09k78K86N60L33j97n90l98K02O24L90k02o09m05J71N69L99q6n65m94R3N99
2815I3M87k6o03n57R6N87N07n8n63m96N9N04M13M4l89n20j49M32N80J82m48o48
2837d73j69N08N98J61m86n94j31M77N29J14l16n44k64L44N87K59l02o18l30L61
2857b89N97K63k59n76l37K84N62L09j47n36m78J54O43M42j81o10m89K10O36L86
2877E84j63n53m14J09N40L71l5m13n09o9N43N42J1n04n70m0N57N24J4m65n23j12
2899e75N02N20N9l75n22j89M09O04J33l92n49j94L67N87J76l39n10l06L05O02
2919C13K82k78n68l83K44O98L26l29n64l43K43O02L12k06n09l64J20N52L95j38
$$ plain form
2774 581 153 -393 -587 -194 386 625 297 -377 -682 -277 403 683 256 -403 -657 -237 393 609 283 -309
2794 -309 -587 -301 259 592 395 -195 -593 -391 233 623 421 -188 -593 -422 147 546 460 -105 -599 -506 93
2815 93 580 554 -49 -606 -510 77 584 526 -37 -533 -474 30 443 487 98 -422 -571 -139 441 623 175 -473
2837 -473 -642 -134 464 625 139 -455 -586 -109 420 534 218 -326 -590 -246 341 600 298 -320 -650 -289
2857 -289 308 571 312 -264 -601 -317 245 554 407 -129 -607 -453 190 632 451 -159 -648 -438 198 584
2877 584 421 -132 -546 -437 103 474 439 26 -483 -552 -9 533 544 40 -530 -570 -13 511 525 60 -463 -575
2899 -575 -73 447 506 131 -391 -580 -171 433 566 174 -375 -569 -202 385 561 222 -288 -594 -289 313
2919 313 595 317 -251 -634 -390 308 634 305 -259 -602 -359 243 555 349 -160 -524 -404 148 543 405
2939D05m94m50L8N90M89j41n43m28N1N39M84r2m59m51m6M92N34nm90m65r9M90
2961e1N52L0m50n02j18M03N42J40l88n19k14L47O14K30m05n68k28L29O27K28l58
2982B41n71k19K73N61K76k80n32k92J80N82L60k27n57l51J78N63M09j73n90l63
3002e32J33N24M36j25n40m30Q5N18M63q1n28m54N8M98M48L3m99m78l5M54N10R7
3024E55m57n49j09M53N67J01m60n36j07M04N33J21l33n33j97L39N53K44l47n78
3044c36k30L15N88K47l31n28k80K63N36K78j97n22l49J64N64L97j84n82m05K09
3064c83N81L68j67n48l73J40N02L71n2m65m48mM69M93M0n18n44J0N51M83k4m41
3086D1n09l8M59M80N6l72m92j59L75N67J35l92n55j69L99N52J44l49n15j96K85
$$ plain form
2939 405 -89 -539 -501 89 578 437 -106 -534 -483 56 540 448 -11 -462 -508 -16 518 513 23 -442 -541 -51
2961 -51 501 531 81 -421 -539 -136 406 546 158 -361 -575 -228 386 616 211 -357 -585 -256 371 599 241
2982 241 -330 -549 -276 285 561 281 -251 -543 -363 219 579 352 -205 -556 -378 185 594 421 -169 -532
3002 -532 -399 125 561 436 -104 -534 -449 69 532 451 -77 -531 -473 25 473 506 7 -471 -506 -52 458 555
3024 555 98 -451 -560 -107 460 561 101 -435 -542 -138 395 516 183 -350 -547 -208 345 589 242 -336
3044 -336 -566 -251 337 584 253 -275 -555 -292 244 522 325 -197 -546 -382 182 579 395 -187 -592 -383
3064 -383 198 566 399 -149 -522 -382 120 491 439 -26 -474 -478 -9 484 524 6 -538 -528 23 506 482 41
3086 41 -468 -506 -47 433 489 117 -375 -534 -159 408 543 151 -404 -573 -174 378 522 173 -342 -538 -253
3107b53N63K22k53n42l00K52N73L21k39n97l33K64N74L26k55n09l36J42N59L70
$$ plain form
3107 -253 310 532 279 -263 -563 -311 262 583 344 -253 -586 -322 252 578 323 -186 -522 -380 179 549
$$ [...]
8191E
##END NTUPLES=NMR FID
##END=
