##TITLE=1H_AM_NV128
 C
 8 sc, 
 13.2.2024
##JCAMPDX= 6.0         $$ Bruker NMR JCAMP-DX V2.0
##DATA TYPE= NMR FID
##DATA CLASS= NTUPLES
##ORIGIN= UXNMR, Bruker Analytische Messtechnik GmbH
##OWNER= root
$$ XWIN-NMR		Version 3.5
$$ Tue Feb 13 15:38:57 2024 Russian Standard Time (UT+4h)  she@DPX200
##.OBSERVE FREQUENCY= 200.1308
##.OBSERVE NUCLEUS= ^1H
##.DELAY= (6, 6)
##.ACQUISITION MODE= SIMULTANEOUS
##.ACQUISITION SCHEME= undefined
##.AVERAGES= 8
##.DIGITISER RES= 18
##SPECTROMETER/DATA SYSTEM= spect
##.PULSE SEQUENCE= zg30
##.SOLVENT NAME= CDCl3
##.SHIFT REFERENCE= (INTERNAL, CDCl3, 0, 15.7039)
##AUDIT TRAIL= $$ (NUMBER, WHEN, WHO, WHERE, WHAT)
$$ ##TITLE= Audit trail, XWIN-NMR		Version 3.5
$$ ##JCAMPDX= 5.01
$$ ##ORIGIN= Bruker BioSpin GmbH
$$ ##OWNER= she
$$ F:/spectra/data/she/nmr/H-F/1/audita.txt
$$ ##AUDIT TRAIL=  $$ (NUMBER, WHEN, WHO, WHERE, WHAT)
(   1,<2024-02-13 15:36:59.73 +0400>,<she>,<DPX200>,
      <created by zg, POWCHK disabled, PULCHK disabled
       configuration hash MD5:
       00 E9 B6 7A A2 85 ED C7 34 08 36 98 17 FE 4E 26
       data hash MD5: 16K
       75 3D F7 C0 B2 8C 67 F4 BC 1C FC 55 AC D8 9C D9>)
$$ ##END=
$$ 
$$ hash MD5
$$ 1B C2 20 93 1F 4F F5 8F E8 35 AE 2E 49 FB 42 E8
##$RELAX= 
##$RELAX= 
##$RELAX= 
##$RELAX= 
##$RELAX= 
##$RELAX= 
$$ Bruker specific parameters
$$ --------------------------
##$DU= <F:/spectra>
##$EXPNO= 1
##$NAME= <H-F>
##$PROCNO= 1
##$TYPE= <nmr>
##$USER= <she>
##$AMP= (0..31)
100 100 100 100 100 100 100 100 100 100 100 100 100 100 100 100 100 100 
100 100 100 100 100 100 100 100 100 100 100 100 100 100 
##$AQSEQ= 0
##$AQ_mod= 1
##$AUNM= <au_zg>
##$AUTOPOS= <>
##$BF1= 200.13
##$BF2= 200.13
##$BF3= 200.13
##$BF4= 200.13
##$BF5= 200.13
##$BF6= 200.13
##$BF7= 200.13
##$BF8= 200.13
##$BYTORDA= 1
##$CFDGTYP= 0
##$CFRGTYP= 5
##$CHEMSTR= <none>
##$CNST= (0..31)
1 1 145 1 1 1 1 1 1 1 1 1 1 1 1 1 1 1 1 1 1 1 1 1 1 1 1 1 1 1 1 1 
##$CPDPRG= <>
##$CPDPRG1= <>
##$CPDPRG2= <>
##$CPDPRG3= <>
##$CPDPRG4= <mlev>
##$CPDPRG5= <mlev>
##$CPDPRG6= <mlev>
##$CPDPRG7= <mlev>
##$CPDPRG8= <mlev>
##$CPDPRGB= <>
##$CPDPRGT= <>
##$D= (0..31)
0 1.2 0 0 0 0 0 0 0 0.06 0 0.03 0 0 0 0 0.0002 0 0 0 0 0 0 0 0 0 0 0 0 
0 0 0 
##$DATE= 1707824219
##$DBL= (0..7)
120 120 120 120 120 120 120 120 
##$DBP= (0..7)
150 150 150 150 150 150 150 150 
##$DBP07= 0
##$DBPNAM0= <>
##$DBPNAM1= <>
##$DBPNAM2= <>
##$DBPNAM3= <>
##$DBPNAM4= <>
##$DBPNAM5= <>
##$DBPNAM6= <>
##$DBPNAM7= <>
##$DBPOAL= (0..7)
0.5 0.5 0.5 0.5 0.5 0.5 0.5 0.5 
##$DBPOFFS= (0..7)
0 0 0 0 0 0 0 0 
##$DE= 6
##$DECBNUC= <off>
##$DECIM= 32
##$DECNUC= <off>
##$DECSTAT= 4
##$DIGMOD= 1
##$DIGTYP= 9
##$DL= (0..7)
0 120 120 120 120 120 120 120 
##$DP= (0..7)
150 150 150 150 150 150 150 150 
##$DP07= 0
##$DPNAME0= <>
##$DPNAME1= <>
##$DPNAME2= <>
##$DPNAME3= <>
##$DPNAME4= <>
##$DPNAME5= <>
##$DPNAME6= <>
##$DPNAME7= <>
##$DPOAL= (0..7)
0.5 0.5 0.5 0.5 0.5 0.5 0.5 0.5 
##$DPOFFS= (0..7)
0 0 0 0 0 0 0 0 
##$DQDMODE= 0
##$DR= 18
##$DS= 0
##$DSLIST= <SSSSSSSSSSSSSSS>
##$DSPFIRM= 0
$$ [...]
##$SUBNAM2= <"">
##$SUBNAM3= <"">
##$SUBNAM4= <"">
##$SUBNAM5= <"">
##$SUBNAM6= <"">
##$SUBNAM7= <"">
##$SUBNAM8= <"">
##$SUBNAM9= <"">
##$SW= 18.0517779522481
##$SWIBOX= (0..15)
0 0 2 0 0 0 0 0 0 0 0 0 0 0 0 0 
##$SW_h= 3612.71676300578
##$TD= 16384
##$TD0= 1
##$TE= 0
##$TE2= 300
##$TE3= 300
##$TEG= 300
##$TL= (0..7)
0 120 120 120 120 120 120 120 
##$TP= (0..7)
150 150 150 150 150 150 150 150 
##$TP07= 0
##$TPNAME0= <>
##$TPNAME1= <>
##$TPNAME2= <>
##$TPNAME3= <>
##$TPNAME4= <>
##$TPNAME5= <>
##$TPNAME6= <>
##$TPNAME7= <>
##$TPOAL= (0..7)
0.5 0.5 0.5 0.5 0.5 0.5 0.5 0.5 
##$TPOFFS= (0..7)
0 0 0 0 0 0 0 0 
##$TUNHIN= 0
##$TUNHOUT= 0
##$TUNXOUT= 0
##$USERA1= <user>
##$USERA2= <user>
##$USERA3= <user>
##$USERA4= <user>
##$USERA5= <user>
##$V9= 5
##$VALIST= <valist>
##$VCLIST= <CCCCCCCCCCCCCCC>
##$VD= 0
##$VDLIST= <DDDDDDDDDDDDDDD>
##$VPLIST= <PPPPPPPPPPPPPPP>
##$VTLIST= <TTTTTTTTTTTTTTT>
##$WBST= 1024
##$WBSW= 4
##$XGAIN= (0..3)
0 0 0 0 
##$XL= 0
##$YL= 0
##$YMAX_a= 677743
##$YMIN_a= -712677
##$ZGOPTNS= <>
##$ZL1= 120
##$ZL2= 120
##$ZL3= 120
##$ZL4= 120
##$ABSF1= 10
##$ABSF2= 0
##$ABSG= 5
##$ABSL= 3
##$ALPHA= 0
##$AQORDER= 0
##$ASSFAC= 0
##$ASSFACI= 0
##$ASSFACX= 0
##$ASSWID= 0
##$AUNMP= <proc_1d>
##$AZFE= 0.1
##$AZFW= 0.1
##$BCFW= 1
##$BC_mod= 2
##$BYTORDP= 1
##$COROFFS= 0
##$CY= 11.3945322036743
##$DATMOD= 1
##$DC= 2
##$DFILT= <>
##$DTYPP= 0
##$F1P= 15.7292609196834
##$F2P= 12.9074282941183
##$FCOR= 0.5
##$FTSIZE= 0
##$FT_mod= 4
##$GAMMA= 1
##$GB= 0.15
##$INTBC= 1
##$INTSCL= 1
##$ISEN= 128
##$LB= 0.24
##$LEV0= 0
##$LPBIN= 0
##$MAXI= 10000
##$MC2= 0
##$MEAN= 0
##$ME_mod= 0
##$MI= 1.114404
##$NCOEF= 0
##$NC_proc= 0
##$NLEV= 6
##$NOISF1= 3.799351
##$NOISF2= 2.8
##$NSP= 1
##$NTH_PI= 0
##$NZP= 0
##$OFFSET= 15.70392
##$PC= 1
##$PHC0= -24857.79
##$PHC1= 13.6527
##$PH_mod= 1
##$PKNL= yes
##$PPARMOD= 0
##$PSCAL= 0
##$PSIGN= 0
##$REVERSE= no
##$SF= 200.130013532006
##$SI= 16384
##$SIGF1= 3
##$SIGF2= 2
##$SINO= 400
##$SIOLD= 16384
##$SREGLST= <1H.CDCl3>
##$SSB= 0
##$STSI= 0
##$STSR= 0
##$SW_p= 3612.71676300578
##$SYMM= 0
##$S_DEV= 0
##$TDeff= 0
##$TDoff= 0
##$TI= <>
##$TILT= no
##$TM1= 0
##$TM2= 0
##$TOPLEV= 0
##$USERP1= <user>
##$USERP2= <user>
##$USERP3= <user>
##$USERP4= <user>
##$USERP5= <user>
##$WDW= 1
##$XDIM= 8192
##$YMAX_p= 0
##$YMIN_p= 0
$$ End of Bruker specific parameters
$$ ---------------------------------
##NTUPLES= NMR FID
##VAR_NAME=  TIME,          FID/REAL,        FID/IMAG
##SYMBOL=    X,             R,               I
##VAR_TYPE=  INDEPENDENT,   DEPENDENT,       DEPENDENT
##VAR_FORM=  AFFN,          ASDF,            ASDF
##VAR_DIM=   8192,          8192,            8192
##UNITS=     SECONDS,       ARBITRARY UNITS, ARBITRARY UNITS
##FACTOR=    0.0002768,     1,               1
##FIRST=     0,             0,               0
##LAST=      2.2672688,     0,               0
##MIN=       0,             -712677,         0
##MAX=       2.2672688,     677743,          0
$$ Real data points
##PAGE= N=1
##DATA TABLE= (X++(R..R)), XYDATA
$$ [...]
276I2855q7110q5799m6620J1264O4641R0169P1929J5975m6822q2053p7150m0686
288a19407J2880O4638Q7388O3326O560m7144p4012p0774l8479J6603O7823Q1530
300E0932N1573J945m2732p0635p0260l3098K5031O7524P1901M4533J947m2812
312E5849p2006o5750k3405K9139O2584O5846M2095n84m6276p0761n8241j6327
324i7837L0232N9392O1994L7989n054m8094o7087n0841j0780L0368N5985N8400
336E4667L4301r393m9789o2422m3039p022K9079N4117N6366K8918j5405m8886
348B1492n5108l7822o720K9385N5192N2708K1139j8569m4972n0674l6340m309
360g4598L3123N4118M5752J5635j8277m2495m9185l3579L09L4961N0615M0464
$$ plain form
276 92855 5745 -80054 -126674 -115410 -50769 39400 111329 127304 80482 -1571 -78721 -119407
288 -119407 -106527 -41889 45499 108825 115385 68241 -5771 -76545 -115024 -98421 -30598 50932
300 50932 102505 104450 61718 -8917 -79177 -112275 -87244 -19720 52181 96714 98661 55849
312 55849 -16157 -81907 -105312 -76173 -13589 52257 94352 93768 47492 -23269 -81510 -97837
324 -97837 -67605 -8213 53781 91770 86716 38622 -28465 -79306 -90086 -59718 -3733 54667
336 54667 88968 79575 29786 -32636 -75675 -82697 -53618 499 56865 85783 70378 21492
348 21492 -33616 -71438 -78158 -48773 6419 59127 80266 61697 16725 -33949 -70289 -74598
360 -74598 -41475 12643 58395 74030 55753 13258 -35927 -69506 -69197 -34236 16379 56843
372E6843J2751j8735m1930m7147k9452M410L5604M6937L5615J0242j8826m1296
384E016m5288k5138Q512L5021M2445L2359R382k0186m2391m2000j8909J0817L1948
397a8412L9555L1520P052k3593m1330l6305j5165J0014L0857L9512K9064K326
409E5095k5037l7879l2433j3705J0763L1393L7759K5018n43k4686l5523k9867
421c9645j1744J1871L1285L5987K1675l463k4544l2629k7458j0786J3195L2214
433d042L3498J7066n049k2388l1139k7456q528J6647L1578K8842J4439m180k2297
446A6991l2055k5093m017J7543K8277K6538J4322n323k3968l0621k1232k008J6784
459b3862K7118K5412J2211p129k3570k8511j8956l76J6928K5469K3396J1156p949
$$ plain form
372 56843 69594 50859 8929 -38218 -67670 -63260 -27656 19281 54896 65138 46312 5016
384 5016 -40272 -65410 -56898 -21877 20568 52927 62309 42123 -268 -42268 -61177 -50360 -18412
397 -18412 21143 52663 59715 36122 -5208 -41513 -56678 -46664 -15807 23705 52769 55095
409 55095 30058 -7821 -40254 -53959 -43196 -11803 25956 50974 50431 25745 -9778 -39645
421 -39645 -51389 -39518 -8233 27754 49429 45966 21422 -11207 -38665 -49451 -36256 -4042
433 -4042 29456 46522 41473 19085 -12054 -39510 -48038 -31391 187 29029 43468 39288 16991
446 16991 -15064 -40157 -44174 -26631 1646 28184 42506 37183 13215 -17406 -38638 -40646 -23862
459 -23862 3256 28668 40879 33750 10180 -18331 -37287 -37663 -20735 4734 28130 39286 31337
472C1337k4193k6975j5574J136J5441K4301K3499R422j0966k3731k3028j3713
484c3044j37J5541K5865K1834N339j1688k0768k1820j4502J272J8087K4694J7959
497B8632M023j0267k0481k2085j2594L688J7644K2482J6819L506j1178k0304k0179
510b0294j0867M128J7654K1721J4548J810j0498j8943j9930r932O372J7776J8749
523A2294J2720K660j0436k0427j8771o132P292J5023J7512J3763J576j3155j9610
536e691j5004n059N631J5126J8714J2037j511j2986j7156j4228n298O893J6026
549b506J6998R793j771j2482j7094j3301l387P338J4923J6257R204l313j3131
562G528j5270j1332l585P069J5880J5622O289m377j1033j4013j2274k930R504
$$ plain form
472 31337 7144 -19831 -35405 -34269 -18828 5473 28972 38394 27428 3697 -19331 -33044
484 -33044 -33181 -17640 8225 30059 35398 23710 2942 -18878 -33380 -32108 -14021 10673 28632
497 28632 32655 22388 1907 -20178 -32772 -29084 -11440 11042 27861 31367 20189 -115 -20294
510 -20294 -31161 -27033 -9379 12342 26890 28700 18202 -741 -20671 -30603 -24231 -6455 12294
523 12294 25014 27674 17238 -3189 -21960 -28092 -20800 -5777 11735 25498 27074 13919 -5691
536 -5691 -20695 -25754 -20123 -4997 13717 25754 24243 11257 -5899 -20127 -25425 -18532 -2506
549 -2506 14492 24285 22514 10032 -7062 -20363 -23750 -16412 -1489 14768 23972 20659 7528
562 7528 -7742 -19074 -22659 -15590 290 15912 22201 17824 6791 -7222 -19496 -22426 -12922
575a2922J5528J2340N116k757j0936j5405j0954J53R469J2869J1680O073l761
588A6493j2533j4109q372L37Q394J3099J1773M292n097j1541j2790q130R13R314
602g957J2414J0001L802m745j1974j2758o249K299Q283J1248J0358L390o617j2081
616e86j0189m970J112P980J2509R616P19p021r826r438n926J866R778J1606O930
631A4160K90n620r853j0078m547L601R070R878O747M84o466j0083q617l362L305
646a1091Q774R935N819q14o210q952q427l291M384R117Q419M569k08n861r805
661c642q050j230M938P432P607N423o13p403r321n823p85L625P360Q505M511k379
677A0155p047p570n534j396M149Q042P399L070k169o166p546n445m67M474P122
$$ plain form
575 -12922 2606 14946 20062 17305 6369 -9036 -19990 -19837 -10368 2501 14181 20254 16493
588 16493 3960 -10149 -18521 -18184 -9790 3309 15082 19374 14277 2736 -10054 -18184 -17271 -7957
602 -7957 4457 14458 18260 13515 1541 -11217 -17466 -15167 -6884 4364 14722 18112 11495 -586
616 -586 -10775 -15745 -14633 -6653 5856 15472 16191 9170 -656 -10094 -16020 -14154 -4376 7230 14160
631 14160 14450 8830 -1023 -11101 -15648 -12047 -2977 6901 13648 14132 7666 -2417 -11034 -14396 -11091
646 -11091 -2317 7618 13437 12623 6413 -2539 -10966 -14257 -9873 -756 7663 12232 12024 6163 -3642
661 -3642 -11692 -12922 -7984 -552 7055 12478 11865 4462 -4859 -10682 -11467 -7842 -482 8023 12534 10155
677 10155 3108 -4462 -9996 -11392 -7243 799 8198 11268 9099 2933 -4613 -10058 -10525 -6051 1071
692A071O686L049k412o457o797m375m76M004P281O514J885k935n413o037m805
707i217l93N087P169M921J258k003n203o845m253J161N055N714M554J944k348
722F601o146o230k841J251M196N723M817J234l150n621n275k688J141M408N530
737B950M034Q28k854n391n103k101J534L931M886M049P83l358n276m060j592R06
753e834L656N318L798k37l405m243l739k173J125M494N040K569m77k665m178m206
769e157j711J967M335M193K394k14k900m478l702j051J965L955M081K225n46k944
785B412m063l416r59K119L910L533J801l29k676m181l213l32K160L188L171K103
801E228l20l126l973k375j62J566L027L562J902j055l139l241k122m98J676L482
$$ plain form
692 1071 7757 10806 8394 1937 -4860 -9235 -9711 -5707 1574 8088 9973 7038 1625 -4412 -9217
707 -9217 -9610 -4523 2646 7567 8825 6822 1619 -5226 -9479 -8318 -3263 2451 7005 8949 6601
722 6601 455 -5775 -8616 -7365 -3169 2554 7371 8605 5455 -166 -5441 -8129 -6988 -2580 2950
737 2950 6984 7812 4958 -433 -5536 -7637 -6103 -2172 2714 6763 7546 4188 -1088 -5148 -6740 -5834
753 -5834 -2178 3140 6938 6701 3296 -947 -4686 -6859 -5734 -1240 3800 6369 5892 3227 -951 -5157
769 -5157 -6868 -4901 -566 3627 6021 5807 2907 -1571 -5273 -6324 -4359 -404 3677 5902 5356 2412
785 2412 -1651 -5067 -6026 -3907 3 3536 5337 5008 2332 -1849 -5062 -5394 -3234 -46 3125 5228
801 5228 4908 1782 -2191 -4566 -4728 -3162 -135 3427 5329 4274 1135 -2106 -4228 -4726 -3050 432
817D32L308J177j191k742l153k255j87K060L357K920R83j237k818l028j910j5
833d299K033L279K714O47j344k449k752j982K7K259L111K139M81r12k258k956
849b262j833M75K171K490J912Q35q59k577k796j279N50J757K359K136O89j270
865B498k547k345j091M36J781K462J942L91j370k387k224r62O03J810K321J807
881C125K44j467k348j878p70M49J707K371J655n5j491j892j641r90L78J885K256
898A538J173j47j071j654j837r53P19J812J767J023R9r96j855j743n66P92J577
915c22J635J053j4j169j783j452m58P89J592J525Q89j02j152j773j392j75R12
932a397J359J357R13j08j337j728r88m1N98J208J522Q86m20j296j303q41l26N31
$$ plain form
817 432 3740 4917 3726 984 -2169 -4424 -4611 -2551 806 3726 4709 3472 654 -2374 -4284 -4299
833 -4299 -2266 1013 3727 4374 3030 581 -2171 -4153 -4126 -1867 1244 3383 3864 2952 694 -2262
849 -2262 -4095 -3620 -1449 1041 2953 3788 2929 352 -2444 -3723 -3173 -1416 943 3079 3768 2498
865 2498 -49 -2394 -3485 -3049 -1268 1194 3136 3527 2157 -230 -2454 -3416 -2813 -1003 1318 3125
881 3125 3369 1902 -446 -2324 -3094 -2645 -938 1433 3088 3033 1542 -350 -1991 -2981 -2603 -718 1538
898 1538 2711 2564 1493 -161 -1998 -2951 -2232 -420 1347 2370 2469 1473 -382 -2125 -2691 -1899 -322
915 -322 1313 2366 2352 1183 -600 -2052 -2510 -1721 -129 1396 2285 2183 1031 -742 -2134 -2309 -1397
932 -1397 -38 1319 2232 2124 787 -941 -1929 -1970 -1372 -164 1358 2244 1824 528 -775 -1616 -1942 -1411
950a411J386J440N38m28r73j180j020k76P16J339J183M65k86r89j226r09j17P35
968a013J248J107L99m09r70j106q64j04Q78J281Q96K27l33q84j223q54J80R42
986f02J022P12M23k59j091j228n40K73O22Q98R58M40n07j098r26m60M0O18J059
1005C54R06K30n00q98r31n54J26P30R74P58K71n09r76q92m18J15O65J015Q66R9
1025A431o56q43p54n24N3Q57J106O06n9m27p58r54n77L24R02Q53N18J80m18r56
1045i6r41l08L32O86Q32P06J20n85r30p50l47K13P71R30N65L4m98q86q41l31L83
1066i41P31P64N93J47o16r98o90j71K39O24R23P00j01p36p62n70l45J83Q27R66
1086G67M24j48n21p17p67l24M08Q35P27M34j1n63q80o54j63L65O90P91M78j28
$$ plain form
950 -1411 -25 1415 1953 1525 552 -628 -1648 -1924 -1208 131 1314 1779 1493 504 -722 -1631 -1748 -1013
968 -1013 235 1342 1741 1332 362 -744 -1608 -1712 -834 447 1343 1570 1237 353 -870 -1724 -1544 -602
986 -602 420 1132 1555 1296 205 -1023 -1563 -1290 -668 230 1188 1628 1121 23 -903 -1363 -1323 -705 354
1005 354 1260 1490 990 92 -839 -1393 -1267 -537 437 1195 1466 957 -19 -911 -1329 -1214 -549 466 1332 1431
1025 1431 775 -68 -822 -1346 -1293 -436 670 1276 1217 790 32 -922 -1499 -1175 -273 580 1098 1278 860 -96
1045 -96 -1037 -1345 -1013 -327 505 1211 1331 746 -184 -934 -1281 -1068 -297 633 1198 1232 734 -152 -993 -1324 -941
1066 -941 -210 554 1147 1294 678 -320 -1010 -1181 -942 -318 605 1305 1204 468 -294 -864 -1209 -1026 -199 767
1086 767 1191 1043 522 -195 -962 -1286 -878 -43 684 1118 1107 544 -336 -990 -1153 -788 -98 693 1171 1043
1106A043o11p56o37k24L84Q25P41K99j08m94q22p26n2N00O88N78M27qo83q78m98
1127a012J5L40N86P84M52k49o83o68m15j72L45P46P17K44k08n44o69n34p1M52
1147e44O82N75L02k03o24p03l70mL43O75O41K22l52n37n51m21q3M66P40M98Q4
1168H36k14m36o61m72P4N50N39M21K39j55o21o53l00J15L84N20N45J95l04n59
1188D3n04l08rM39O14M23J08k72m92n54l07J28M60M72M09J34k85n87m64j88J25
1209f15L23N60M64J5l83m68l56k49O4M60N48L06j7k45m13m97k62J77M79M41K74
1230F06P9k41n31m43j52J51L73M50L38K7l17m30l98j97J30M38M59K47Jk58m45
1251a13m22j17K06L82L72K69L1l29m90l21m0J51L41M46K70q5l67l68k74r9J28
$$ plain form
1106 1043 432 -324 -961 -1185 -801 24 765 1064 956 462 -360 -1086 -1138 -638 50 628 1055 1047 364 -514 -1012
1127 -1012 -997 -657 -71 713 1165 916 233 -435 -850 -1022 -677 69 786 1030 822 278 -391 -925 -996 -544
1147 -544 138 713 1015 812 188 -515 -885 -889 -546 129 770 992 640 103 -448 -869 -952 -486 254 752 836
1168 836 622 186 -475 -947 -873 -323 216 637 876 721 100 -553 -853 -738 -354 166 711 906 602 43
1188 43 -461 -769 -778 -339 275 698 806 534 42 -512 -819 -691 -231 241 650 784 499 -88 -552 -740 -615
1209 -615 -292 268 732 747 364 -104 -460 -709 -645 -185 363 669 652 407 -6 -503 -765 -588 -109 332 606
1230 606 685 444 -87 -530 -682 -531 -158 292 630 657 340 -90 -488 -685 -555 -117 342 589 590 332 -113
1251 -113 -535 -652 -446 -64 308 577 608 279 -211 -532 -572 -421 -80 366 636 551 184 -184 -458 -557 -429
1272d29M04M37J83j10k56l93l30j19K33L83L55K05o4l02m23k87o0K03L53M00J94
1293E77j33l00l67k79n0K09M34L04J14q3k81l89k79K2K74L29K79J28o9l55l87
1314c02k01P8J98L14L16J16j57l30l22j71J7K20L20L06O9j57k71l29j99M2K45
1335a98K88K75Q8j42l02k92j54L9J94L26K82M7j84k70k66j37K6K51L41J75Mj56
1357B35k41k58j68J01K68K59J36L0j51k75k56o4J00K13K43J71Jj81k59k05q2J02
1379b81K35K42J41k1j60k53j93p6J38K04K08J41j2j64k70j76j7J07J84K43J33
1400C53p9j95k13j22l6O2K35K15P6o0j67j90j62l7J36K25J84N2m9j75k11j26J
1423b83J48J84J65Q1n9j81j92j21k4J55J97J62M5m9j53k11j38JJ47J98J48O6n5
$$ plain form
1272 -429 -25 412 595 485 229 -164 -494 -613 -380 3 358 563 499 197 -226 -513 -573 -370 -17 383 577
1293 577 444 144 -223 -502 -552 -343 91 395 509 426 145 -244 -523 -501 -227 102 381 509 440 85 -302
1314 -302 -503 -425 -227 87 403 519 362 32 -290 -461 -444 -224 96 402 471 314 43 -286 -485 -443 -198
1335 -198 90 365 453 311 9 -283 -437 -398 -204 122 404 451 267 -3 -269 -406 -380 -129 212 387 391 235
1357 235 -6 -264 -432 -331 -63 196 332 362 211 -64 -320 -384 -284 -71 172 343 344 163 -96 -301 -383 -281
1379 -281 -46 196 337 316 156 -97 -290 -366 -228 -24 184 325 313 149 -121 -297 -314 -207 -23 220 353
1400 353 274 79 -134 -256 -292 -230 5 220 296 236 69 -121 -283 -320 -184 41 225 277 228 53 -158 -284 -283
1423 -283 -135 49 214 295 236 55 -137 -258 -282 -127 70 232 277 228 75 -136 -274 -273 -126 72 220 286 231
1446B31j78k10j30L2J23J57J60J04q0j88j68r4k5J06K03J90O7j06j68j70j14p
1468b65J16K03J78N2p2j69j96j15J7J09K09J68M4q2j55j70j33rJ42K05J38M1n6
1491B00j41k15j36J4J42J95J51O3o6j87k01j01L8J05J80J76Q5r7j90j72r6k2J44
1514a31K11J66L4p0j70j83j30K0J36K00J40P2j02j66j81j05J7J33J76J60M7j20
1536A54j50j53j02NJ28K23J05L3q7j42j88j02M8J45J67J28L5p8j75j65p7L0J18
1559a00J67J50L1q7j46j86p1K7J59J67J05J1p4j56j69q7O5J34J33J36J0q0j77
1582c8j39m3L1J12J74J14qj12j31j02p7L1J42J64J03k9r0j31j43m9P6J42J23Q0
1606B00j2p9j43j26n0N8J25J43J11l8r9j46j04o9Q0J47J29O8k6r1j46j42j8J04
$$ plain form
1446 231 53 -157 -287 -255 -132 25 185 289 209 21 -147 -241 -266 -160 43 233 300 194 26 -144 -258 -265
1468 -265 -149 54 232 284 212 43 -153 -268 -251 -142 67 235 279 197 42 -128 -261 -270 -128 77 215 256 200
1491 200 59 -156 -292 -278 -136 59 210 273 207 20 -181 -282 -244 -139 41 217 302 205 15 -157 -253 -275 -131
1514 -131 80 246 280 210 40 -143 -273 -253 -117 83 223 295 193 27 -154 -259 -242 -109 67 227 274 154
1536 154 4 -149 -251 -246 -118 105 210 243 156 14 -174 -276 -228 -83 84 212 247 169 -6 -171 -248 -218 -100
1559 -100 67 217 248 161 15 -171 -242 -215 -56 111 216 227 153 -3 -172 -259 -194 -60 73 209 219 139 -38
1582 -38 -177 -220 -189 -77 97 211 203 91 -40 -142 -219 -188 -46 118 221 192 102 -29 -172 -221 -145 -3 120 200
1606 200 188 109 -34 -160 -210 -152 -27 116 227 189 90 -56 -160 -229 -149 -2 127 195 169 78 -68 -210 -228 -124
1630a24J27J26P3j4j10j61r9jO6J22J44N8k4j25j33r1k9P8J53J24M4l3r4j52j19
1655a94k6J06J33J26N7l1j13j34j26j6Q2J37J72M4o4j25j33p8l4R7J44J38L7n0
1679A49j04j31j26K5J12J24J07O3n7j20j45q0kR9J26J26N0o3j41j06r2J3R3J20
1703D0J36J7m4j33j48p7J9R2J51J15J6n2j46j12n9J3R3J35J22L0q5j01j19q7J9
1728a65J23J22R4J4n8j09j41p6M5J01J00R6L8p0j42r9m8M5N4J33P6J9p5r5r6o0
1754a74K6J00J05P5K9q2r0j17k0L0P9R6P5K0n8j17q3j5J7P4J08Q4k4o6r2o6m7
1781a33L8R2P6O7k0p3o2q9l0N5O0P2N3jp1q3m4k2K4R1O3L7J6r7m3o2l3N1M7Q9
1811F8M4j2m0r4p0QK5P4O9N0j7p1q3l1k4L5N6P7N2k7n7n9p0l5O1M9Q6N3k6n9n9
$$ plain form
1630 -124 3 129 202 188 78 -83 -182 -183 -117 5 149 207 183 58 -75 -166 -195 -117 36 160 204 171 77 -75 -194
1655 -194 -220 -114 19 145 202 171 58 -76 -202 -218 -136 1 173 217 153 28 -105 -183 -217 -120 24 162 199 149
1679 149 45 -86 -212 -187 -75 49 156 219 162 42 -103 -183 -185 -86 40 166 216 153 12 -94 -186 -173 -80 40
1703 40 176 193 149 16 -132 -209 -190 -98 53 168 184 132 -14 -126 -185 -172 -79 56 178 208 123 22 -97 -184 -165
1728 -165 -42 80 174 188 130 21 -120 -196 -151 -50 50 146 184 114 -28 -127 -175 -130 -76 57 133 152 77 -18 -114 -174
1754 -174 -148 -48 57 132 161 79 -11 -128 -148 -118 -39 57 132 152 94 -23 -106 -121 -104 -30 78 162 138 72 -20 -86 -133
1781 -133 -95 -3 73 140 120 47 -15 -104 -134 -79 -19 53 106 105 34 -49 -93 -115 -91 0 63 100 116 19 -24 -86 -119 -68 -21 68
1811 68 112 100 60 -34 -104 -96 -71 3 72 122 105 34 -49 -80 -104 -69 -13 64 116 89 32 -27 -97 -132 -71 -22 64 117 91 32 -27
1842b7p2nM6N7P4N3k3p1n7o2k0M3Q0M6P0k5n8o7o1l6N6O8P9K4j0m6q7o2j1L4O8
1873bO8L9k1o1q1l8k9M5O9P2N8m2n3q3n0J4RJ01O4M4j4p9p9k5j4M0N3R4M0m1n0
1904D8r3m7j9O0P2P4K3l4n6o8q1J4K9J06O3Ror5q4l5JN2P7Q9K1l9p4q8l4KP2O9
1936B8Q4L5m0q9q5n0MP0Q6M4M1j8j05o9n7J2P1P0O9K5m5j03p3k1j2Q8Q7O2J6m7
1966G8r2r6k4J8P9R0O1J0m9p2r1m0L3O8Q0O2K6o2j02o6l3K9P1J03N1On9r7p6m1
1996a35M3P7Q0N4rn8p6p2m4M3P2Q6N0j9m1r0o4l0O6N9P7L9Lo8q5n7nK5Q8P4M2
2027A25k9m5q1o5%L6P9P3K9m7m9q3m1jN1O5N4L3l8n3p1m3%M2P0P5Ol0o0m5m6R
2059h0M6N1Q0J6l7n8p6l5J7N2O0P1qj6q8n5m5L4O7M2M6jl7o2n2k8J4N2O9M4Kn2
$$ plain form
1842 -27 -99 -104 -58 -1 73 126 103 32 -25 -87 -107 -64 16 62 132 107 49 -18 -79 -115 -59 9 88 112 102 56 -31 -93 -104 -70 -2
1873 -2 66 105 84 23 -58 -96 -125 -80 -11 61 119 77 24 -59 -109 -95 -86 15 79 123 109 30 -49 -74 -88 -48 5 99 139 98 48
1904 48 -45 -92 -111 -51 21 95 118 84 28 -40 -121 -107 -78 28 91 100 94 -1 -85 -120 -119 -67 10 99 120 81 7 -81 -115 -113 -41 28
1936 28 112 147 107 18 -67 -117 -113 -43 43 87 128 110 5 -64 -121 -109 -38 32 101 126 81 -22 -95 -116 -128 -40 47 109 125 78
1966 78 -14 -110 -134 -116 -37 53 114 124 75 3 -88 -128 -95 -27 53 115 141 79 -23 -89 -122 -93 -22 81 132 138 79 -18 -94 -135
1996 -135 -92 -15 65 119 110 52 -24 -96 -140 -97 -25 61 111 92 51 -39 -103 -133 -67 -8 69 108 111 43 -42 -99 -104 -79 9 83 125
2027 125 96 51 -30 -95 -95 -59 20 93 122 75 26 -57 -98 -99 -48 17 71 104 66 13 -58 -101 -101 -59 11 86 92 62 2 -43 -89 -80
2059 -80 -34 17 97 113 76 18 -58 -93 -76 -24 36 107 99 83 -5 -60 -105 -71 -4 38 84 83 46 -16 -68 -96 -82 -30 39 83 85 33
2091C3o7n5k3K2P9Q1K0ro3n8m7k1N1O7P8L0l2m7p7m9KM4O8N7K1pp1p4n0j0N8Q5
2123C6N7J6l4p7p0l7NM7P7P4Pl9o8q3l0J2P8Q9M9nk2j09m6m3K0Q9O3O1ql7j02
2154c0m6l5K1P6Q3M4kn3q2p9k4L9P8Q2L7j7m7r7o0j8J5J03Q1M3j2o5q0o2k7O2
2184g2P2Q9L7k4n7r4n3lM6Q8N2O8l9o7r8n9kN9P8P6L4l0q1n9p3j1N9Q9O1K5l1
2215H0o9r3m3K5M1R0N2K9l3o3p3m9lP0R3M4M1l6q9o9m0NM3R2P0Pl5q4p7l9J4O7
2247c2Q3M7Mk2p4q8n2J4O8R3N9Mn8n0o6m6J3O9Q0M2K2m9o1o4m0J9N6Q5N5%k8q8
2279en5l1K2N6N4M4K1k9r5o1j1J6O1N8L9Nm9l7p3l5J6P2O5K9Ok2p7o5j9L0N6M7
2311C3N0K0n7o3n0k6K0N4N9N7Qm0p8m5l6K4M9O7M9Ln6n8o1k8K4M9P1L5ol5o2n6
$$ plain form
2091 33 -34 -89 -112 -90 -11 70 90 81 18 -40 -87 -108 -57 10 88 118 86 39 -38 -87 -85 -41 27 84 105 98 27 -47 -97 -107 -49 36
2123 36 93 109 75 -2 -72 -109 -104 -57 20 94 101 62 -6 -89 -119 -107 -29 60 109 104 82 -27 -73 -116 -96 -7 56 117 109 72 -30
2154 -30 -76 -111 -90 -14 69 113 111 58 -24 -103 -127 -88 -10 72 109 92 45 -52 -112 -130 -115 -12 69 112 100 35 -45 -107 -134 -72
2184 -72 0 89 126 102 45 -49 -102 -105 -59 29 81 149 110 43 -55 -114 -116 -57 21 97 131 101 20 -39 -112 -123 -64 25 86 111 80
2215 80 11 -82 -125 -100 -59 31 83 112 79 16 -57 -106 -109 -39 54 98 139 103 14 -55 -95 -90 -47 45 115 122 87 3 -74 -113 -99 -32
2247 -32 51 98 102 80 6 -82 -134 -120 -52 41 100 104 46 -4 -70 -116 -103 -34 46 88 110 61 0 -64 -104 -85 -29 56 111 111 83 -5
2279 -5 -60 -91 -69 -13 41 85 106 77 -18 -79 -90 -74 -13 45 84 89 40 3 -70 -105 -89 -17 48 77 83 61 -16 -81 -100 -70 -14 33
2311 33 83 103 46 -17 -67 -93 -73 -19 40 97 105 65 -13 -58 -94 -70 -21 46 95 98 42 -16 -77 -105 -81 -32 39 74 68 33 -29 -85
2343h5nK8L8O0L1nk7o0l6j7K5N1N3J7J6m0n9m0j6L2M5N0L1rm0m2o2k4K3N8M3L8
2375G2k5j2o5k7j3K2K8N6J8km7l1l5j5L7L1N4J2j3k9m5m1J2K3N0L6K2mm5m1k2
2406c9JMO0K2J2j7n2k2l3J4K0O0J0J9j3o0l3m2L1N2K7L7k1j0l4m3OLM0L9L7k9
2438D6j2m6l2rL3L8M7j6jk8m3qQJ0K5K8J9j2m1k5m4j7M2N5L2J8k1l7m7j0k5M6
2470b7M3J5K4l3l9j4rj8K5N5K1J8k5l7l0k3kN0L2K3J2pm9l0k3%M4L9K1jk9l9j1
2503b4l8J3M0L6NRj1n2m6nJ2N9L4K8pk9n6k7LJ9L7N5Qpl2k9m0oK2N3J1J7K2n6
2537A8l2m1KK0N0K6J2j0l7l7j8NK2K2M5K4j8m3n2l6J2L2M1L4P%n1m9j3LL2O0J9
2570D9K4j6o2l2rNL1L5L3J5j9n4m1j6mO2K1J6J4k1n2k4k4K7K3N1K5ll3l6k9j5
$$ plain form
2343 -85 -90 -62 -24 36 67 62 35 -25 -61 -78 -53 -2 51 68 84 44 -15 -55 -71 -39 6 56 87 78 38 -4 -66 -90 -67 -9 34 72
2375 72 47 35 -30 -57 -70 -48 -20 36 54 52 5 -26 -61 -76 -39 -8 46 58 45 16 -29 -70 -58 -35 15 51 73 69 24 -17 -39
2406 -39 -38 -34 26 48 60 43 -9 -31 -64 -50 -30 30 40 59 46 -14 -47 -89 -58 -6 21 58 37 27 -7 -50 -44 -41 -1 38 75 46
2438 46 34 -12 -44 -53 -20 18 65 49 48 20 -23 -31 -23 -13 12 40 59 47 6 -19 -63 -80 -38 17 49 67 46 9 -38 -48 -73 -27
2470 -27 16 31 55 22 -17 -31 -40 -58 -33 22 43 61 36 -1 -31 -54 -56 -6 26 49 61 54 5 -25 -48 -48 -4 35 56 55 26 -13 -24
2503 -24 -62 -49 -9 27 32 41 30 -22 -68 -73 -61 -2 32 60 53 24 -32 -59 -56 -37 0 55 63 56 24 -5 -45 -51 -29 24 35 52 74 18
2537 18 -14 -55 -53 -33 17 43 55 45 8 -29 -47 -42 -20 2 47 71 53 10 -42 -78 -66 -34 7 41 48 48 -3 -52 -65 -62 -30 30 49
2570 49 73 57 -5 -37 -46 -41 -10 25 58 73 54 0 -41 -57 -61 1 22 38 52 31 -21 -45 -69 -42 -19 32 57 54 21 -15 -44 -59
2602e9lO0L1M4j1k6o5j1m%M0M1L1j2j7n1l8JOM1M5K4qj8n8l0mJ5L6M4J1Nm9m5
2636c4k1k6M0M6K3K6%l6n3l0K1J0M4L1K9k0k6m3l0JJ5M7M2J8j1n2n0k3mK6O3L1
2668E4J5k0m4m6k4J6J4N4K0J8j4m2n1oNK2M1L0J5j0n5l7j9QM9K7M7Mk7l5l2j7
2700d0%M2L7K7Ll1k8m5j7RM6K7K2ok7l9l3mPM3K7K0J5l5l5m2qRN4L8ROm3k4l2
2735d8J0J8L3N4jj2n0j5k8RJ5L0L7Mpn1l0l7J2L6L7K3J3k3k4k8l0LK7K2M0JJm9
2769hk7j7J8RN7oK9k2m0j7j9K6L0K6QRj7l4k5l1K6M4K0PNk4m5rnJ0L9J0j3J0j6
2804Hl0poK9kK9J0lk6j2mk2K8L1QJ2j3l4kk4K0J7K3J7Pj0k7k4mj3K1L2%lk2l1
2840b7QKkJ7J9nJ0j8l2j1j1K7K3K5lOj6k5j4j0K4J5L5Qj8j4qk5J7MK5PJ1k9rl3
$$ plain form
2602 -59 -62 -2 29 73 62 36 -29 -40 -44 -44 -4 37 68 56 39 -12 -50 -49 -43 -2 43 67 59 41 -17 -47 -51 -36 0 44 55 60 11 -34
2636 -34 -55 -81 -41 5 28 54 54 18 -35 -65 -44 -34 10 41 70 50 24 -19 -49 -48 -33 14 56 74 63 11 -39 -62 -66 -40 23 54
2668 54 69 49 5 -41 -65 -49 -35 19 39 57 43 1 -50 -56 -51 -29 12 42 57 47 -8 -45 -64 -56 -7 20 67 71 44 9 -23 -40
2700 -40 -40 2 39 66 69 38 10 -35 -52 -43 3 30 52 46 19 -20 -53 -57 -50 -7 20 40 55 20 -15 -57 -65 -56 -2 36 45 51 8 -16 -48
2735 -48 -38 -20 13 67 66 54 4 -11 -39 -30 -15 15 52 56 49 -2 -32 -69 -57 -21 16 39 52 29 5 -23 -53 -50 -23 -1 39 40 41 -8
2769 -8 -35 -52 -34 -25 32 26 55 33 -7 -24 -43 -17 13 39 47 56 39 5 -20 -51 -25 19 39 46 51 27 -18 -27 -32 -22 17 27 14 24 8
2804 8 -22 -29 -35 -6 -8 21 31 28 2 -10 -14 -36 -8 23 31 43 30 -4 -6 -30 -10 7 30 47 54 44 17 -7 -11 -24 -3 29 29 26 4 -27
2840 -27 -19 -17 -19 -2 17 12 22 4 -28 -39 -50 -23 0 25 22 28 12 -13 -27 -37 -13 2 37 45 27 13 5 -20 -3 1 26 33 44 15 6 -27
2876b7kJ5j0M1RJ4k5j4l9kJ2LK9J4jok0k4J7j4J3M7MKj5j9k1Kj1L9RK9j1Kl1p
2912Bj7NK4J5pJ2nk0j8j9kK1K4O%k3Lj7J1k4J0J1L0j1qj8KJ1qK2pK3Llj7rj3J9
2950HKJ6NqNpj3rjQJ7mJ1j4j3j0poPJ8J2j8K0rj8j1k0L5K6qQjj0l2qMK9L5Mj0
2990C3k5Nj7MkOK9Ppk0%j6j8K2oJ2K6j2Mk9j5j0lL0LJ3Moj9k1%QK7JJ5J7j4k4
3028Bj0pJ0L1JJ3%j7k3Kl2L6%K6Qj5j3rk3pJ5OL0lPk7j3j6J7j4J4PRJ7l6Nj2p
3066b8J1K3OL0k3ok0OJ2j4J2L4Pk6j1k1OMnLK4Jook4j8J4JK9kNk1j0jk1J3NL0
3104A3Mopj3jj2OoM3J7pQl7Ql4J7J6K4JnNl1nj2NQJ2J2kj3k6kMj7L8RJMj6qk5
3145c0J2KOK8oLJ0l0Mk6L2%J3J6Koql1rJ7kK9J2rk0oj0qJ1oJ8J0Mk1j1j1MmK1
$$ plain form
2876 -27 -29 -14 -24 17 26 40 15 1 -38 -40 -28 -25 4 18 17 11 -9 -33 -16 -30 -17 30 34 36 21 2 -19 -17 -28 11 20 49 38 40 9 2
2912 2 -15 -10 14 29 22 34 29 9 -9 -28 -30 -9 15 21 21 -2 1 -16 -5 -29 -19 -8 22 11 3 -15 -13 -2 -10 12 5 28 31 28 11 2 -11 8
2950 8 10 26 31 23 28 21 8 -1 -2 6 23 19 30 16 3 -7 -14 -20 -13 5 17 -1 19 10 -8 -19 -39 -4 22 14 22 21 11 -21 -29 -25 4 39 43 33
2990 33 8 13 -4 0 -2 4 33 40 33 13 13 -3 -21 1 -5 7 33 21 25 -4 -19 -29 -32 -2 1 14 18 12 -7 -28 -28 -20 7 8 23 40 26 2
3028 2 -8 -15 -5 26 27 40 40 23 0 2 -30 6 6 32 40 25 12 3 -20 -27 -12 -6 24 21 28 1 -12 -28 -11 -25 -11 -4 5 22 -14 -9 -21 -28
3066 -28 -17 6 12 42 19 13 -7 -1 11 -3 9 43 50 24 13 -8 -2 2 -3 0 24 25 19 13 -11 -29 -15 -14 15 13 18 -3 -13 -14 -35 -22 -17 13
3104 13 17 11 4 -9 -10 -22 -16 -22 21 38 31 39 2 10 -24 -7 9 33 34 29 34 3 -2 -14 -9 -1 11 23 21 8 -18 -20 -16 -33 5 14 15 19 3 -5 -30
3145 -30 -18 -16 -10 18 12 15 25 -5 -1 -27 5 5 18 34 36 30 22 -9 -18 -1 -3 26 38 29 9 3 -7 -15 -4 -10 8 18 22 1 -10 -21 -17 -21 0
3184@J5oQQl2j0kJ2J0J1J2jj3mr%NlJ7J5Jj7%k1KKPPJ5Lk6j7Nk6J4J9QkJpj0k4
3226c3J5K7j2K2monk1J0KJ7jOJ0Lk9Qj4J8RqL1oj2j4mpnPJ5PrPk8j5k0K3j2L8
3265A0qK0l2nJj3J4pK9Ljqlj0kJ7ROqJ6j1j2j1RmK2K1pj4j1j5rJ7OKqJJ1j1j1
3305gomkJ0J8j1n%OqqJK3j2MJ7l3lJ4%J6j1J8KpMjj7Pj0NJ9jj3j3kJ3jj0RpkP
3348aj1J5j0J7j7MMPjj7L5m8JJ5J1J7Nj7J0ml5K6j7QK6Kj0klJj4J6j3j4K3Qj7
3385@J6k3NKoJJ7kk9O%k3MJ6lNNJ0J1mj8mK5n%J7rpk%j4J0jJ0j4K2pnmj5jJ0M
3428@NMJk4Jj0J3mRJ1J0j2kl9J6J1NJ2J6j9Jjj6J3rK0%mLKj3LJ0j9K3j5NlK4l4
3468fmj9J9RJ0%j4J4j3pj5J2KmJ5Qpj4lOkJ0J6MnOj2rkjKLK1mkJ0l5OJ4J0j7P
$$ plain form
3184 0 15 9 17 25 -7 -17 -19 -7 3 14 26 25 12 8 -1 -1 4 1 18 33 34 17 17 -4 -2 0 7 14 29 32 6 -11 -6 -32 -18 1 9 7 8 1 -9 -33
3226 -33 -18 9 -3 19 15 9 4 -17 -7 -5 12 11 17 27 30 1 9 -5 13 22 14 45 39 27 13 9 2 -3 4 19 26 17 24 -4 -19 -39 -16 -28 10
3265 10 2 22 -10 -15 -14 -27 -13 -20 9 12 11 3 0 -10 -12 5 14 20 12 28 17 5 -6 3 -1 21 42 35 21 10 -5 -14 3 9 11 3 4 15 4 -7
3305 -7 -13 -17 -19 -9 9 -2 -7 -7 -1 -9 -17 -16 7 -5 -1 16 -17 -20 -6 -6 10 -1 17 19 12 16 15 -2 5 -5 0 19 18 5 -8 -10 3 2 -8 1 -6 -8 -1
3348 -1 -12 3 -7 10 -7 -3 1 8 7 -10 25 -23 -22 -7 4 21 26 9 19 15 -20 6 -11 -3 23 25 15 13 10 11 -3 13 0 -14 9 17 0
3385 0 16 -7 -2 0 -6 -5 12 10 -19 -13 -13 -36 -32 -16 -19 -14 -9 1 12 8 -10 -14 11 6 6 23 14 7 5 5 -9 1 0 10 -4 18 11 6 2 -13 -14 -4 0
3428 0 5 9 10 -14 -13 -23 -10 -14 -5 6 16 4 2 -37 -21 -10 -5 7 23 4 5 4 -12 1 -8 12 12 8 11 13 0 3 13 -6 17 2 7 4 28 -6
3468 -6 -10 -29 -10 -1 9 9 -5 9 -4 -11 -26 -14 -12 -16 -1 7 0 -14 -17 -11 -13 -3 13 17 12 18 6 -3 -5 -6 -4 -1 20 16 14 24 -11 -5 9 19 2 9
3510IJ3k5Jlj2RNk0K2oJ8k7qJ3JJ3oKrKj9K4j6K2PlJ1qNj2lJ1KKj2JJ5Nj9nLo
3552cRRrlj6%J2j4PJ3npMnoLJ7lkJmJ6Lj5lJ3mj3K3j4K3j9qJ3j9J5MKNoj9nrK2
3596CJjOj1jMoj3J0J5j4mJ7mj0J2k4K6RkJ1j4%k0ROmKJ4lPj3koQKJ0j1Pk2Lj0
3638a3lJ0j0PJ7rljk1RJ6qpK0Ljj4J6j5NOj1K1j2J2ollJKJ7Mkk3J5k6J6nJ4jO
3679B0j6Jok4J1RJ2j3j1L%KPj6J0K1mk6J8PmKjJ3oJjnKpQNjRj3Lkj5jJ2k2L0j3
3722aj7K0jLj2l0L2mjJ2kj6QjJpPPj4J8kLLj1J6nJ7jj7lJ6moNMLj0kj8RJ2%j8
3765gQJ8k6J3k0JK1j6oK1j7J0Pj3pJ5jJ9k5J4oj0nK5Rr%%kj3J7j7nJ6%j1Oj4k
3804a2j3K7j4J8j2KOj2j0%LPJ4Nk2KJQj9L9j1Kj2J4Kk2J3lJ1KKPj5K2m2J7RJr
$$ plain form
3510 9 22 -3 -2 -5 -17 -8 -3 -23 -1 -7 11 -16 -24 -11 -10 3 -3 -1 -10 -8 -27 -3 -19 3 10 7 18 10 15 3 0 11 13 15 3 4 19 24 5 0 3 -3
3552 -3 6 15 6 3 -13 -13 -1 -15 -8 5 0 -7 -3 -8 -14 -11 6 3 1 2 -2 14 17 2 -1 12 8 -5 18 4 27 8 0 13 -6 9 13 15 20 14 -5 -10 -19 3
3596 3 4 3 9 -2 -3 1 -5 -18 -8 7 -7 -11 6 2 -8 4 -20 6 15 13 24 10 10 -10 -1 5 1 3 17 14 21 8 6 0 8 10 20 9 16 -6 -3 -13
3638 -13 -16 -6 -16 -9 8 -1 -4 -5 -26 -17 -1 -9 -16 4 7 6 -8 8 -7 -2 4 -7 14 2 14 8 5 2 3 5 22 26 24 1 16 -10 6 1 15 14 20
3679 20 4 5 -1 -25 -14 -5 7 -6 -17 -14 -14 -12 -5 -21 -11 10 6 -20 -2 5 1 3 2 15 9 10 9 4 6 -1 7 12 11 20 7 10 8 -7 -8 4 -18 12 -1
3722 -1 -18 2 1 4 -8 -38 -6 -10 -11 1 -1 -17 -9 -10 -9 -16 -9 -2 -16 2 0 3 6 -5 11 6 23 22 5 2 18 14 8 13 17 20 10 8 -10 -1 11 11 -7
3765 -7 1 19 -7 6 -14 -13 8 -8 -14 7 -10 0 7 -6 -13 2 1 20 -5 9 3 -7 -12 13 22 13 13 13 11 -2 15 -2 -7 9 9 -2 4 -10 -12
3804 -12 -25 2 -12 6 -6 -4 2 -10 -20 -20 -17 -10 4 9 -13 -11 -10 -2 -21 18 7 9 -3 11 13 -9 4 1 12 14 16 23 8 30 -12 5 14 15 6
3843FQjj4Nk3K5k0%J6J3qj1j2j8J4%OJ6J9j9rJmnKJ5LQJj2%J2npJ5%mJ3j0k7J5
3884DmJ6j4J3lkj5mj8JJ3K1mPj4rj1J%K0JjQj8J8j5j8K4kjL1Jk3nNj6PMNJ2Oj5
3926FnJ3l6MJ1J4jjj2j0J2j3MOJ7nJ4j7j4Qj9J1J5LJ5qj7j8K2JlOpK2pj3ORrp
3966cJ9L%j5k7J3J3j6JJ2lK4k1n%j8kJ9jJ2Okj5%j1NmK0J2j4Kpp%NOPlJ4J0j2
4007A7j0Oj6J5oK2j7Ml0J3jKKOMj2kqJ0k7K8j4J1LmJ0j3Nlj3J1RNJ6qnj0j1%J2
4047AJOL5k3j5qrKJ2PQoppk8JJ0MJ3J0J1j7lj5lLJ9nQOlj5Qj1mJ1L1j1Kkj0rj5
4090a7J9J1QQnj0Jk8jMk%J3J3j2opj1j0J8K3KJ6k2Jj4pomL5jQqJ4j9l3K4RJJ0
4130A5J9rj7Kk1MPJ9LJmj3lj6J1oJ0oQJ4j8k1j2J9qJ4QNJ7j0mj5j3QJ2L3j8J0
$$ plain form
3843 6 14 13 -1 4 -19 6 -14 -14 2 15 7 -4 -16 -34 -20 -20 -14 2 21 2 -7 -6 -10 -15 -13 2 5 13 14 2 2 14 9 2 17 17 13 26 16 -11 4
3884 4 0 16 2 15 12 10 -5 -9 -27 -26 -13 8 4 11 -3 -12 -23 -22 -22 -2 -1 -2 6 -12 6 -9 -27 -3 -5 -6 25 26 3 -2 3 -13 -6 -2 3 15 21 6
3926 6 1 14 -22 -18 -7 7 6 5 -7 -17 -5 -18 -14 -8 9 4 18 1 -13 -5 -24 -13 2 5 20 12 -5 -23 -1 0 -3 3 -4 18 11 -2 4 13 4 -3
3966 -3 16 19 19 4 -23 -10 3 -13 -12 0 -3 21 0 -5 -5 -23 -25 -6 -7 5 11 9 -6 -6 -17 -12 -16 4 16 2 4 -3 -10 -10 -5 1 8 5 19 29 17
4007 17 7 13 -3 12 6 28 11 15 -15 -2 -3 -1 1 7 11 -1 -3 -11 -1 -28 0 -14 -3 0 -4 6 -7 -2 -5 -18 -7 2 7 23 15 10 0 -11 -11 1
4047 1 2 8 43 20 5 -3 -12 -10 2 9 17 11 4 -3 -31 -30 -20 -16 -3 7 18 1 -2 -17 -20 -17 2 -3 5 11 8 -7 1 -10 -14 -3 28 17 19 17 7 -2 -17
4090 -17 2 13 21 29 24 14 15 -13 -14 -10 -12 -12 1 14 2 -4 -11 -22 -32 -14 9 11 27 5 6 -8 -15 -21 -25 10 9 17 9 23 4 -29 -5 4 5 15
4130 15 34 25 8 10 -11 -7 0 19 22 23 19 6 3 -13 -2 -8 2 -4 4 18 0 -21 -33 -14 -22 -8 0 5 22 12 8 -7 -20 -12 0 33 15 25
4168B5Jm5K3j2NJ2J7Jj2lk1prL0qJ7J2j3j7ljj8RK0JJ0pl0Pj1JJ2K1J7J2j4j6
4205Fpk6J4%M3LrMqj5LpKJ6oJ3nj3j7Oj2%RJ5Rrj6Oj4j9J9J5NRk0nJ1j7pK0j0
4246a4L7mj2oj1KrRJ3K1ojj7%k0J1pK6LMJ1k8J0l4RJ0J2j8J7rnjl3J4QK5j6K5
4284A6j5J3lj1j0J1KJ0Pj9Pk2K5nnK2lJj1%kj7J4j5L6Jkk9lJ9k2olK8J6k3oKl5
4323c7J7j0L0j1PLj1Oj8PL1mQlnJ1j9J5j9NOj%%j6P%j7MK3J2j8Kj2Lj7JJ7KNj0
4364fnlnpK8j0NJ9rjk4K1j8RJ4OJ9j2Kj3j5JJK0J2k1Pnlk1oK8j6L4j8n%j4lnJ3
4405fk1N2l1%Jj4j4MQL6JRj9j6J0j4J7kK4Mj5%oRl7K3kjK6k2KJk4JKJ0QjmLk0
4446a8Pj7J9j2K1LpjJ0k0j2J5PQK0jk0Qorj5K3J3J5nj3j0kj0%MJ0Oj0Qjj3mj4
$$ plain form
4168 25 26 -19 4 -8 -3 9 26 27 15 12 -9 -16 -25 5 -3 14 26 13 -4 -7 -8 -26 -17 3 4 14 7 -23 -16 -27 -26 -14 7 24 36 22 6
4205 6 -1 -27 -13 -13 30 33 24 28 20 5 8 1 3 19 13 26 21 8 -9 -3 -15 -15 -6 9 18 9 -7 -1 -15 -34 -15 0 5 14 -6 -11 0 -17 -24 -4 -14
4246 -14 23 19 7 1 -10 -8 -17 -8 5 26 20 19 2 2 -18 -7 -14 12 15 19 30 2 12 -22 -13 -3 9 -9 8 -1 -6 -7 -40 -26 -18 7 -9 16
4284 16 1 14 11 0 -10 1 3 13 20 1 8 -14 11 6 1 23 20 21 10 10 8 -9 5 -10 26 27 25 -4 -7 12 -10 -16 -19 9 25 2 -4 -2 -37
4323 -37 -20 -30 0 -11 -4 -1 -12 -6 -24 -17 14 10 18 15 10 21 2 17 -2 3 9 8 8 8 -8 -1 -1 -18 -14 9 21 3 5 -7 -4 -21 -20 -3 -1 4 -6
4364 -6 -11 -14 -19 -26 2 -8 -3 16 7 6 -18 3 -15 -6 8 14 33 21 23 10 -5 -4 -3 17 29 8 15 10 7 -14 -20 8 -8 26 8 3 3 -11 -14 -19 -6
4405 -6 -27 25 -6 -6 -5 -19 -33 -29 -21 15 16 25 6 -10 0 -14 3 1 25 29 14 14 8 17 -20 3 1 0 26 4 6 7 -17 -16 -14 -4 4 3 -1 2 -18
4446 -18 -11 -28 -9 -21 0 3 -4 -5 5 -15 -27 -12 -5 3 23 22 2 10 4 -5 -20 3 16 31 26 13 3 1 -9 -9 -5 5 11 1 9 8 -5 -9 -23
4485b3J3KoJ2%kmk7K8qJ3J9k0rJ5k0RJ1oK1j8J9J1j7pj2J0KJ4J2nj3nk2QKJ2k7
4523a8M0mk2rLPj1rJ5PJ5k6jj1K0mQRRQk5JKJJ1Kj3Q%j1J1qmKLJklOll2OMK1J1
4568A5k1Pj3J4k3LJ5L1k7kMrk1RLPNJ5Rj0J1k2%kOMJ5ppKk0K6j4NOJlJ2l0ojK
4610a1J2Kj0J8lj9k0L3oqJ9OkkoljLj2K9oJ3%%j0Ok7K7nJJ6l5J5j2k2OJ4ORk0
4650eK2j7j8j3NPQK8k0J1k3lj7K7J2kqJ6Mk8KJ2j5J7K1llpklk3kJ2J3J7onkj4
4689ej4J7Oj2lJ8Prk1k6K6%%K9j3J1j5k3J5RNJ7qJkroj1MJ3J1K1j0Kj3kj4rJ5
4728BJJ2lqj4j6oK9%j%%jj0j1NJ1OOOj1ml%j4J0J3J0J3oj2j1Kj0K1J3rJ3J3k1
4768A5k9q%PJ5Oj2K3k3jj4olL4J9j2j4Mj5pkJ2J9mQMkk2%pJ1J3RLj5Pmj9J2jJ2
$$ plain form
4485 -23 -10 -8 -14 -2 -2 -4 -8 -35 -7 -15 -2 17 -3 -12 3 -17 -8 3 -3 18 0 19 30 13 6 -6 4 6 20 32 27 14 9 -13 -5 -3 9 -18
4523 -18 22 18 -4 -13 -10 -3 -14 -23 -8 -1 14 -12 -13 -24 -4 -8 0 9 18 26 1 2 4 5 16 18 5 13 13 2 13 5 1 3 6 7 5 2 8 5 -27 -21 -17 4 15
4568 15 -6 1 -12 2 -21 -18 -3 28 1 -1 3 -6 -27 -18 -15 -8 -3 12 21 11 22 0 0 -2 4 8 23 16 9 11 -9 17 3 8 14 15 12 24 -6 -12 -13 -11
4610 -11 1 3 -7 11 8 -11 -31 2 -4 -12 7 13 11 9 3 0 -1 2 -10 19 13 26 26 26 16 22 -5 22 17 18 34 -1 14 2 -20 -14 0 6 15 -5
4650 -5 17 0 -18 -31 -26 -19 -11 17 -3 8 -15 -18 -35 -8 4 2 -6 10 14 -14 -12 0 -15 2 23 20 17 10 8 5 -18 -20 -8 5 22 16 11 9 -5
4689 -5 -19 -2 4 -8 -11 7 14 5 -16 -42 -16 -16 -16 13 0 11 -4 -27 -12 -3 2 19 11 12 10 1 -5 -16 -12 1 12 33 23 25 12 10 -4 -13 2
4728 2 3 15 12 4 -10 -26 -32 -3 -3 -4 -4 -4 -5 -15 -26 -21 -10 -4 2 8 -3 -7 -10 -10 -24 -14 -1 9 22 16 4 -7 -5 -15 6 19 10 23 36 15
4768 15 -14 -22 -22 -15 0 6 -6 17 -6 -7 -21 -27 -30 4 23 11 -3 1 -14 -21 -23 -11 8 4 12 16 14 -8 -8 -15 -4 9 18 21 6 13 9 -10 2 1 13
4809A3RJ8j1m0K7k8j1J2NJ8Qj5l2%MPJ3lJ9j7pJ8k9KK4oJ0j1K0mj3JpJ3%Pj3J7
4847A8k1K1j%qNOj0J4j5jqmpRJ3j6L1k8Kj4qKJ6J5k2J2J4j4j9PLJ5J0%Lj0jpp
4887eJ1JRJ2pj9J0j1j8J8Q%jJ%j8nKQjJ2Qj1j0MrkJ9lKNj4oPRrNKJ1Pkk3kJ0J2
4932A7NnKj4J3j5kJ2l8L0qK1jj9j2JK1j5kMK4j2kpnppK9lMLkoRjj3K1LkRj9j3
4974bJ4j6J9RnnJ6k7qRj2K2j8OJ4j4j6NqPJ2k3J7OMnj0LMlQK1k6J3JmrLLJ6qQ
5016B1pLj2j0K6k3KJ4Mj6jjmj0K3j8J7Mpj2J4j6j1K3qJLL%rlRJlK0pO%rrLRJJ3
5060B4j3lMj3KMOj0pJ5k4J1mqjMQPnOj7J1j0KqJ4Qj8J7lj3KJ5qJ2JLJMj0j2PJ9
5103B0l1J3MJ1k6OJ9j4lRqnNmpnKlJ9j5K2%k0qJ1jJ5j4J6Knj3jJ1nJ6J0omrlj
$$ plain form
4809 13 22 40 29 -11 16 -12 -23 -11 -6 12 20 5 -27 -27 -23 -16 -3 -6 13 -4 -11 7 -22 -20 4 -2 8 -3 17 13 0 1 -6 7 7 14 1 18
4847 18 -3 18 17 17 9 14 20 10 24 9 8 0 -4 -11 -2 11 -5 26 -2 0 -14 -22 -20 -4 11 -11 1 15 1 -18 -11 -8 7 17 17 20 10 9 2 -5
4887 -5 6 7 16 28 21 2 12 1 -17 1 9 9 8 9 9 -9 -14 -12 -4 -5 7 15 4 -6 -2 -11 -13 6 3 5 10 -4 -10 -3 6 -3 2 4 15 22 20 -3 -5 5 17
4932 17 22 17 19 5 18 3 1 13 -25 5 -3 18 17 -2 -14 -13 8 -7 -9 -5 19 7 5 -2 -7 -14 -21 8 5 9 12 10 4 13 12 -1 20 23 21 30 11 -2
4974 -2 12 -4 15 24 19 14 30 3 -5 4 -8 14 -4 2 16 2 -14 -9 -17 -10 2 -21 -4 2 6 1 -9 -6 -2 -5 3 24 -2 11 12 8 -1 2 5 21 13 21
5016 21 14 17 5 -5 21 -2 0 14 18 2 1 0 -4 -14 9 -9 8 12 5 -7 7 -9 -20 3 -5 -4 -1 2 2 -7 -10 -1 0 -3 17 10 16 16 7 -2 1 10 11 24
5060 24 11 8 12 -1 1 5 11 1 -6 9 -15 -4 -8 -16 -17 -13 -5 2 -3 3 -14 -3 -13 -11 -19 -5 3 -15 2 -1 -14 -12 3 -5 7 8 11 12 16 6 -6 1 20
5103 20 -11 2 6 17 -9 -3 16 2 -1 8 0 -5 0 -4 -11 -16 -14 -17 2 -13 9 9 -11 -19 -8 -9 6 -8 8 10 5 -8 -9 2 -3 13 23 17 13 4 1 0
5145@j6J2RlJ7j4jqRj2oRrML%j1J6k4QL0k1Nj0J4pMj6J5J2oK2j2qj7QQ%PMJNL
5188B4k2M%KnOPOj6rkk4J3J4JK2ql1Lj0PJ1J2JK1j3pqqM%J3KJ4lj2plJ0j4L1R
5230C5j4opjk2RMJ6Jlnl1PpKlJ1J1J9j3Ql1rJ6LJ7NmnPk4J6kQJ5LQpj4k8JJ1J7
5273A4Nk5L4rk9l%k0L1JJ3Mj3j6poJ6jMRkJ7l0Jj1KNK2K3krj1qj8J7kK3MKj4%
5314A1j1j0QqM2k0Qj2k4kj5K0LK6j2LNj5j6oJ8kJ5J1J2l0mKj4L4j6K6j2Qj0j1
5350Bk4J9KJ7J3nnpk1nkNJ6J6pJk8Lj9pK6K2nJ5j4l5J6kj9J1L3JJ9k0j5Ljj2J8
5389EQJ5Kqnlk4LoJ5K5qKj5j7j8J7%OJ2J8k2Ok3Lj2L5lK0j0qk7kj2QK1K0Rj5m
5429HmJ3k1O%K7Kqpk5J5j8jJ6K1Mlqj5j2k2OK8j2J3j0Loj5J1j%J5J3Lnj5j2QP
$$ plain form
5145 0 -16 -4 5 2 19 5 4 -4 5 -7 -13 -4 -13 -9 -6 -6 -17 -1 -25 -17 13 -8 -3 -13 1 -6 -2 -18 -3 9 3 25 13 5 -12 -4 4 4 11 15 16 21 24
5188 24 2 6 6 8 3 9 16 22 6 -3 -5 -29 -16 -2 -1 21 13 -18 -15 -25 -18 -7 5 6 27 14 7 -1 -9 -5 -5 8 10 24 21 9 2 -1 9 -5 26 35
5230 35 21 15 8 7 -15 -6 -2 14 15 12 7 -24 -17 -24 -22 -25 -14 -3 16 3 11 -20 -29 -13 -10 7 12 8 3 10 -14 2 0 8 23 26 34 27 13 -15 -14 -3 14
5273 14 19 -6 28 19 -10 -13 -13 -33 -2 -1 12 16 3 -13 -20 -26 -10 -11 -7 2 0 17 -13 -12 -23 -21 -16 6 29 27 18 7 -1 -19 -2 -4 19 23 25 11 11
5314 11 0 -10 -2 -10 32 12 20 8 -16 -18 -33 -13 -10 16 4 7 12 -3 -19 -25 -7 -9 6 17 29 -1 -5 -3 -17 17 1 27 15 23 13 2
5350 2 -22 -3 -1 16 29 24 19 12 -9 -14 -16 -11 5 21 14 15 -13 -10 -29 -36 -10 12 7 22 8 -27 -11 -13 -32 -21 12 13 32 12 -3 0 -1 -13 5
5389 5 13 28 30 22 17 14 -10 -7 -13 2 27 19 21 6 -11 -29 -12 -12 -6 6 24 2 8 -15 -12 -24 11 8 28 18 10 -17 -19 -31 -23 -2 18 27 12 8
5429 8 4 17 -4 2 2 29 31 23 16 -9 6 -12 -13 3 24 28 25 17 2 -10 -32 -26 2 -10 3 -7 -4 -10 -25 -14 -15 -15 0 13 16 11 -4 -16 -8 -1
5469aJ4oJ2l%j2r%RJ7JRnk4J1l0K5oMpmLqmQj7J3kK2j8J0Mj7jKNqL2j4Kmk4J0
5512a1NJ4%J9Nmnk4oJ3j0J5NOrLk5K0j0%RNj3nK%mrKJ1JjJ5k7m%PJ7jmJ4ok5J3
5556bj1OPRJ8rQpk0kLjJ3kJ3j1%j7lj5K5Qj7K3jk6oLj0KK2J2jnj9MJ0rJ8KJ6j5
5598A3LRl7J0J7qK1%K3l6k1rNJ5J5j0Rrl0K7l4J0QK0kLj2j5RpkNPJ1J0mMk5kK
5638g%ORnNoojJ2%JK4j4pKj5pOlJK4Mj3j5JnOnJ8J1nk0oLk5JL0J3j4J5rpj7J1
5682iLK2jJ3J6k7j5J3rj6J1KK5j2J8k2j9Oj2J4%k%Oj5rkLJ1PJ0nJ2j9Lj9J6LJ7
5721A8mOk1Rj3mL3LqLJlpj4j5K4QoJ7rj3j0j1jRoK0J2jj0j4Jqj1L3KJ1k0Mrj0
5762a4j1J6K1J9Pj8Kl1pJ4RkM5k1j6J1k7j8KQK1Lj4Roj5pJ9LMlJ2rj5lnQNQPP
$$ plain form
5469 -1 13 7 19 16 16 4 -5 -5 4 21 22 31 26 2 13 -17 8 2 6 -1 -5 -2 -10 -14 -6 -23 -10 -12 10 -8 2 6 -11 -12 -10 -5 -13 19 5 7 3 -21 -11
5512 -11 -6 8 8 27 32 28 23 -1 -7 6 -4 11 16 22 13 16 -9 11 1 1 10 15 2 -3 -1 -1 -5 -14 -12 -1 0 -1 14 -13 -17 -17 -10 7 6 2 16 10 -15 -2
5556 -2 -13 -7 0 9 27 18 26 19 -1 -3 0 -1 12 10 23 12 12 -5 -8 -23 2 10 -7 16 15 -11 -17 -14 -24 -22 0 12 11 6 -13 -9 1 -8 10 12 28 13
5598 13 16 25 -12 -2 15 7 28 28 51 15 -6 -15 -10 5 20 10 19 10 -20 7 -27 -17 -9 11 9 12 0 -15 -6 -13 -15 -10 -3 8 18 14 18 -7 -9 -7
5638 -7 -7 -1 8 3 8 2 -4 -5 7 7 8 32 18 11 13 -2 -9 -3 -6 -5 19 23 10 -5 -4 -9 -3 -8 10 21 16 -4 -10 -7 -32 -31 -1 12 -2 13 4 -3 -20 -9
5682 -9 -6 16 15 28 44 17 2 15 6 -10 1 3 28 16 34 12 -7 -1 -13 1 1 -1 -1 5 -10 -19 -21 -18 -7 0 10 5 17 -2 1 -18 -2 1 18
5721 18 14 20 -1 8 -5 -9 24 27 19 22 23 20 13 -1 -16 8 16 10 27 18 5 -5 -16 -17 -8 -14 6 18 17 7 -7 -6 -14 -25 8 10 21 1 5 -4 -14
5762 -14 -25 -9 12 31 38 20 22 -9 -16 -2 7 5 50 29 13 24 -3 -21 -19 -11 10 13 -1 8 2 -13 -20 -1 2 6 3 15 6 -9 -12 -17 -9 -4 4 11 18
5803A8J0k0k2J3LmjMK3rlLnrMrL2j3Pj6j5j0K4j1K3J0l6Rmj2NpK2QKpMk3kj6K0
5844a0J5JK9j1rqqj9J2J0KJ9pro%JRpJ3Pj0rj0j3OJJ0QJ7k7J9j7j5%J5j4K4%Q
5884A7pk3QrJ1J0PNj4J4k5J7%j1JK3K1j9k0rmmpQK6j0KqRl4J1%RJJ3kj8J0j9q
5924b8NJ7J8kMj8nJ5j1JNRJ6j1lj9KmL5j4J9j3Kj6k2OJ0POj1Qjj6Rk5JJ6J0rK
5964eM%j1QoKJ4K0j6j3oKMKKK4rJ8k4j3Mj0K7lLk0K3k5JpMmJ5JmRk3J4k9J6rJ9
6006amK4j1qqj0J9lJ9kqK3k5%pRJMK7l2RmJ0k4pPJ8LpmKrnrK0j8J9Rj5Nj9k8J6
6049b4J1lL6Mk5J0j2rmMK1J3J3oqk2OjMK2k1MK1k6Jj1ljnJ1J3kj2j6mJ8jJ1jo
6089@pJlrK2j1J9j5J6lj2JlKrK5OrQk0j0K1j0J1JQj0Ljj0j0j1K3olK0j5j3oj5
$$ plain form
5803 18 28 8 -14 -1 2 -2 -3 1 24 15 12 15 10 1 5 -4 28 15 22 6 -9 -19 5 -6 17 27 -9 0 -4 -16 -11 -18 4 12 14 7 11 -12 -14 -30 -10
5844 -10 5 6 35 24 15 7 -1 -20 -8 2 4 23 16 7 1 1 2 11 4 17 24 14 5 -5 -18 -12 -11 -1 7 24 -3 16 -1 -16 -16 -1 -15 9 9 17
5884 17 10 -13 -5 -14 -3 7 14 19 5 19 -6 11 11 0 1 24 45 26 6 -3 -7 -11 -18 -10 16 6 8 0 9 -25 -14 -14 -5 -4 9 7 -11 -1 -20 -28
5924 -28 -23 -6 12 10 14 -4 -9 6 -5 -4 1 10 26 15 12 -7 -5 -9 26 12 31 18 20 4 -18 -12 -2 5 11 0 8 7 -9 0 -25 -24 -8 2 -7 -5
5964 -5 -1 -1 -12 -4 -10 -8 6 26 10 -3 -9 -7 -3 -1 1 25 16 34 10 -3 1 -9 18 15 18 -2 21 -4 -3 -10 -6 -10 5 6 2 11 -12 2 -27 -11 -20 -1
6006 -1 -5 19 8 0 -8 -18 1 -2 17 15 7 30 5 5 -2 7 8 12 39 7 16 12 22 -2 -9 -2 16 19 12 8 10 1 -4 -13 7 -11 8 17 2 7 -12 -40 -24
6049 -24 -13 -16 20 24 -1 9 -3 -12 -16 -12 9 22 35 29 21 -1 5 4 8 30 9 13 34 8 9 -2 -5 -6 -11 0 13 11 -1 -17 -21 -3 -4 7 6 0
6089 0 -7 -6 -9 -18 4 -7 12 -3 13 10 -2 -1 -4 -2 -11 14 20 11 19 -1 -11 10 0 11 12 20 10 13 12 2 -8 -19 4 -2 -5 15 0 -13 -19 -34
6129c4L4nj0K2lpl%loK0J7rNj4Nj2LoK7J3j4Pkqnj1JNMK1j6nqk2J4nQM%Lj5Jl
6173a2j7K4loJ9jnj8J2jLJKL9j3j4rLLpRJ4j0nKmj9lK4pORj5Pj7loK3nK9j3mj8
6216fj6J2JKJ5%Jkj3j%PPkJ8lj7NmJ4j5J0krJ9lj4Lj0k2K0J0J4Mk6jj4NJ0J0P
6257A4rNj1pmj1OJ6J5kpL9n4jmK3%J4Kj1%lj1j0K0K1jqKOj3j9nMNJ8LLqj6pjL
6300dJ1rJ7k3J2pRnJ3nJ5Oj7Rk3J6k0lJ5K0J5k2j0j1%j7J3K5mMj8J3j5j2J8j6
6336a0J8K%Qkk6pQkPK6npLj7j0J2J3J8lj4J9j7nqJ0RlK6j6j5j1%j0J4j3J9%%j1
6376@qrnJ5JkK8oj6r%JQlJ7%oJ4j5kj2J1nK1J8J1l4Nj1RO%MLqQm4J4pJ1K3j3J3
6419B6j2j2j7J9oj3K0J4mRj1Ok0j2J7OJ2J3j9mj1J0Pj4K9j5kkJ0j6j0J0jLJ2%
$$ plain form
6129 -34 0 -5 -15 7 4 -3 -6 -6 -9 -15 5 22 13 18 4 9 -3 0 -6 21 34 20 27 25 17 12 1 2 7 11 32 16 11 3 -19 -5 -10 -2 2 2 5 -10 -9 -12
6173 -12 -29 -5 -8 -14 5 4 -1 -19 -7 -8 -5 -4 -2 37 24 10 1 4 7 0 9 23 13 8 10 6 -13 -16 8 1 7 16 1 8 -9 -12 -18 5 0 29 16 12 -6
6216 -6 -22 -10 -9 -7 8 8 9 7 -6 -7 -7 0 7 5 23 20 3 8 4 18 3 13 11 2 21 18 4 7 -3 -25 -5 5 19 23 -3 -4 -18 -13 -3 7 14
6257 14 5 10 -1 -8 -12 -23 -17 -1 14 12 5 44 -10 -11 -15 8 8 22 24 13 13 10 -1 -11 9 30 29 21 23 29 16 -3 -8 -4 1 19 22 25 17 1 -6 -7 -4
6300 -4 7 -2 15 -8 4 -3 6 1 14 9 24 30 13 22 -1 15 -5 -8 7 27 42 20 10 -1 -1 -18 -5 20 16 20 2 15 0 -12 6 -10
6336 -10 8 10 10 18 16 -10 -17 -9 -11 -4 22 17 10 13 -4 -14 -2 11 29 26 12 31 14 9 1 11 20 17 43 27 12 1 1 -9 5 -8 11 11 11 0
6376 0 -8 -17 -22 -7 -6 -8 20 14 -2 -11 -11 -10 -2 -5 12 12 6 20 5 3 -9 2 -3 18 36 47 13 18 7 16 22 22 26 29 21 29 -15 -1 -8 3 26 13 26
6419 26 14 2 -15 4 -2 -15 5 19 15 24 13 19 -1 -13 4 10 22 35 16 12 1 11 18 4 33 18 16 14 24 8 -2 8 7 10 22 22
6455B2j7Mqj5QMK0mOj4jj2j0J5OJ5Mj4jQj8J3j5kK4RrMj1j8J8j3K4j3J1Nk4J5
6493A6j6Lj2J0J4P%j0j9%oJ9j3K0j6K4j1k1Pj6PJ9j8K4K1j6qlkJ1J4j2J0Nk5n
6529Bj7K7J4j2lJ3kNk4Lj5NpJ5K4k1Oj8qQkPj2K6pp%oMjJ0%kmJ1pnNKJ6NOpkj9
6574FJ3k9ML0j9K0j3Qj2j6J2LMKonLnPj7PJ1NqRqj0j9L1j0J3L1l3J7j0%o%OKJ
6615A9mkJ6pj7j0J4J6%j8J1mJk9J2j4QPqJ3Qj8PrJ4JJ2j2Olj3Oo%K5Rj2Nj3kj1
6656bK4qj2K6mj1Mj4OJoOJ5j4Mk0Pj3MrJ4lMpJ2k1J8JnNj1K0LqK3k6MMrK1RJk0
6699A3jnj7K3Qk0KJj8K3j8NmJ9Nj4Ooqopj6L2kNMj2rPj1K7j7NNL0j8lrkJ9mK0
6741C2k0J1oKj6qJK1rK1l3J6j6j0%J3j2K8mj3Knj%J3j6K4ll1J4pRJ8j8K2j1J0
$$ plain form
6455 22 5 9 1 -14 -6 -2 18 14 20 6 5 -7 -17 -2 4 19 23 9 8 16 -2 11 -4 -6 18 27 18 22 11 -7 11 -2 22 9 20 25 1 16
6493 16 0 3 -9 1 15 22 22 12 -7 -7 -13 6 -7 13 -3 21 10 -11 -4 -20 -13 6 -12 12 33 17 9 6 4 15 29 17 27 32 7 2
6529 2 -15 12 26 14 11 24 22 27 3 6 -9 -4 -11 4 28 7 13 -5 -13 -5 -7 0 -12 14 7 0 0 -6 -2 -3 7 7 5 1 12 5 0 5 7 23 28 34 27 25 6
6574 6 19 -10 -6 24 5 25 12 20 8 -8 4 7 11 13 7 2 5 0 7 -10 -3 8 13 5 14 6 -4 -23 8 -2 11 42 9 26 16 16 10 10 16 18 19
6615 19 15 13 29 22 5 -5 9 25 25 7 18 14 15 -14 -2 -16 -8 -1 -9 4 12 -6 1 -8 6 7 19 7 13 10 -3 3 -3 -3 22 31 19 24 11 9 -2
6656 -2 22 14 2 28 24 13 17 3 9 10 4 10 25 11 15 -5 2 -11 -7 -16 -2 -5 -1 -8 4 -17 1 2 -3 2 -9 11 14 6 29 3 7 11 2 23 32 33 13
6699 13 12 7 -10 13 21 1 3 4 -14 9 -9 -4 -8 11 16 2 8 2 -6 -12 -19 -35 -3 -5 0 4 -8 -17 -10 -21 6 -11 -6 -1 29 11 8 -1 -3 16 12 32
6741 32 12 23 17 19 3 -5 -4 17 8 29 -4 12 -4 -14 -14 -1 -13 15 11 -2 0 -5 -6 -6 7 -9 15 12 -19 -5 -12 -3 15 -3 19 8 18
6778A8j4oJoJ9o%K2k1l%lmpJ6Mj0Oj6qNNJ5qj2MJ9k3J1J1mj6K4MqKnj1LjJ7oJ
6821IJ4k4Rj1J5JJlJPq%Mj8oNJ8Nk0Oj1qJ4k8K5Pj1J2J2k0Kj6J3mJ0Rj5K4Ok3
6861Cj4J0jPJ3QQk7JmkoJ1jlMj6J1j5J3kQLnLKrJ3lj1PQl3K6pj1j4L1kJ7j3J3
6903B1j2J2j6j0J5j6K1kMOl0PjPLkj4K1j3k8K8j3mMJ9kpjjKk2K4J9j9J9j3mJj3
6942a0PJ5j4J4LoJ6k8nkJ3J1nJ8j7Mjj5J2j1J2j3J1qOk3Qk%K3k7L2lk0j0kLK2
6980Hj0J6Rj1jj3KqJ9nK3j1k6K4Lpj1jJ2k0K5j5Oj0K0l3mK0OJj4Ollj0%NkK5j1
7020AkkJ4j5kPOK2k5LK0k8jK0KqkrJ9k2%Oj2NMJ1k0Nj0RrJ2RMrpj6kPLNMRqJ3
7065A1ojMnK4k2oJ6Jl6J6J6lJ7j3oJ4Opj1j8J7nkqqJ3nJj0jMK4j1J2lpqOOJ9j8
$$ plain form
6778 18 4 -2 -1 -7 12 6 6 28 7 4 4 1 -3 -10 6 10 0 6 -10 -18 -13 -8 7 -1 -13 -9 10 -13 -2 9 5 -11 13 17 9 11 6 -5 -2 -3 14 8 9
6821 9 23 -1 8 -3 12 13 14 11 12 19 11 11 15 -3 -9 -4 14 19 -1 5 -6 -14 0 -28 -3 4 -7 5 17 -3 -1 -17 -4 -8 2 11 -4 20 26 3
6861 3 -11 -1 -2 5 18 26 34 7 8 4 2 -4 7 6 3 7 -9 2 -13 0 -2 6 9 4 7 9 0 13 10 -1 6 14 -19 7 0 -11 -25 6 4 21 8 21
6903 21 9 21 5 -5 10 -6 15 13 17 23 -7 0 -1 6 9 7 -7 14 1 -27 1 -12 -16 -12 7 5 -2 -3 -4 -2 -24 0 19 0 19 6 2 3 -10
6942 -10 -3 12 -2 12 15 9 25 -3 -8 -10 3 14 9 27 10 14 13 -2 10 -1 11 -2 9 1 7 -16 -8 -10 -10 13 -14 18 15 -5 -15 -17 -14 8
6980 8 -2 14 23 12 11 -2 0 -8 11 6 29 18 -8 16 19 12 1 0 12 -8 17 2 8 -2 18 -15 -19 1 7 8 -6 0 -3 -6 -16 -16 -11 -13 12 1
7020 1 -1 -3 11 -4 -6 1 7 29 4 7 27 -1 -2 18 20 12 10 1 20 -2 -2 4 -8 -3 1 12 -8 -3 -13 -4 -13 -1 8 12 3 -4 -20 -22 -15 -12 -7 -3 6 -2 11
7065 11 5 4 8 3 27 5 -1 15 16 -20 -4 12 9 26 13 7 21 27 20 9 -9 8 3 1 -7 -15 -2 -7 -6 -16 -17 -13 11 0 12 9 2 -6 0 6 25 7
7107GMj7K0j3jQj2J1J6jj6J8j6j0J9j4J0j0K0j3pmqPkPQj2KJ2k8lNLJ2j3mL5k8
7146hrJ6kPJ3J2j9Orj2kRMj1K2J0qmk7OJJ2kjNQj7ok4K0QlJ3j2K1qk2J1J4rk8
7187b5L2q%OLj4J4j2K2roJ0j0rNKJ0j0M1j6j7j2j0Rj5K3J1j5Oj1PmNnL%J2lMk0
7227fj9ONNJLJ9nk0JjJ7mJ5olKkOj5J1RLpJq%k0kkL2j7R%j4mj0rJ0NJ5J4Mj2k1
7272a4QpJ7jqQPorJ5j8KJ3J5k2PJ5j6j5mJ3MkJ4Nj4j8J0pj1J7J%nJ7j9l1J9JQ
7312a1jK2opnJmJ6J4j6LRk4RJ3rpKrK4oj6%K6k1j0J0L7rl1Jj4Oj3K1QmrK4l0N
7353a1j9K9pj0J8j2LnpJ4OMrK1ok1RpJ3Lj9L9%j4qLqkqKK2j5j1QpQoj3K1J6pK
7395Ij0oj1J9J6k2%QpLrkOJ3J0moJj1nRoJ0NMj2K9j6pk1PjJ5lj2J3j8KjjNKJ0
$$ plain form
7107 7 11 -6 14 1 0 8 -4 7 23 22 6 24 8 -2 17 3 13 3 23 10 3 -1 -9 -2 -4 3 11 -1 1 13 -15 -18 -13 -10 2 -11 -15 20 -8
7146 -8 -17 -1 -3 4 17 29 10 16 7 -5 -7 2 6 -5 17 27 19 15 -12 -6 -5 7 5 4 9 17 0 -6 -30 -10 -2 -5 8 -4 17 9 -13 -2 12 3 -25
7187 -25 7 -1 -1 5 8 -6 8 -4 18 9 3 13 3 -6 -1 1 11 1 42 26 9 -3 -13 -4 -19 4 15 0 6 -5 2 -2 3 -2 1 1 13 10 14 -6
7227 -6 -25 -19 -14 -9 -8 -5 14 9 -11 -10 -11 6 2 17 11 8 10 8 14 -1 10 19 22 15 16 8 8 -12 -14 -16 16 -1 8 8 -6 -10 -20 -29 -19 -14 1 15 19 7 -14
7272 -14 -6 -13 4 3 -5 3 10 4 -5 10 -8 -6 7 22 0 7 22 6 -9 -13 0 4 2 16 21 7 -11 -1 -8 -19 -2 -1 -1 -6 11 -8 -39 -20 -19 -11
7312 -11 -12 10 4 -3 -8 -7 -11 5 19 3 6 15 -9 0 13 4 -3 -1 -10 14 8 -8 -8 18 -3 -13 -3 34 25 -6 -5 -19 -13 -26 -5 3 -1 -10 14 -16 -11
7353 -11 -30 -1 -8 -18 0 -12 -9 -14 -21 -7 -1 3 -6 15 9 -12 -3 -10 3 6 -13 26 26 12 4 7 -1 -3 -11 -9 13 -2 -13 -5 -12 -4 -10 -23 -2 14 7 9
7395 9 -1 -7 -18 1 17 -5 -5 3 -4 -1 -10 -12 -6 7 17 13 7 8 -3 -8 1 -5 5 10 14 2 31 15 8 -13 -6 -7 8 5 -7 6 -12 -10 -11 -12 -7 -5 5
7438Eqmk%klK9j7lJ5k3K3J3j7JNKnLMj4Jj2LQnR%Kk2J1pmQljRMj3Qj2J5jj1R%
7484bJ3nj6mJ9JMj5QJ3j1rnPpJ3j5QJ0omlJ4Ompj%k6MRJjJ7j4J1oj3%j2K3QN%
7528HoJ0l1K6Kj5kJJ7Qpj2nPKlJ2Rqk9J2j5MJ2LnJ4r%Oj9J0ljNjlJ0j6j6J9j0
7570a9J6J%MqkJ7j7NJ6MnnMmnkqJ7J3qopj5RJ2j7PJ4Qj2j1j3J8lmmJ8j4%J9nj6
7613hOoJ5RpJ7j7nnJ9j3nJ7rPJ2l2J4j2MOmPj3j9J1oJ2K0k7J2j2pJ6j0J0j0OL
7652dRJ5j0pJmKJ3lOrpoLj1J2NMNmqJ4j4lrJ2qJ8j2q%KJ2j5oJ0%KJnRKOk9J5J0
7698FlMlorJ2J9oJJj0j2RpKmJ5PMl4kRj4PK0qQ%rjoJ0Qj2jJ7qjj6kJ2NJ7k5MJ1
7744IqJ0nj6MJ8JOj3Lj2j2QONkJ7j2j2%j0j0K5QpKmpNrK1j5KMJ7j8Qj7%L0k5K4
$$ plain form
7438 5 -3 -7 -9 -9 -11 -14 15 -2 -5 10 -13 10 23 6 7 12 14 9 12 16 2 3 -9 -6 2 -3 6 6 8 -14 -3 -10 -14 -6 -9 -10 -1 3 -10 -2 -14 1 0 -11 -2 -2
7484 -2 11 6 -10 -14 5 6 10 -5 3 16 5 -4 -9 -2 -9 4 -11 -3 7 1 -3 -6 8 14 10 3 2 2 -24 -20 -11 -10 -11 6 -8 3 -3 -16 -16 -28 -5 3 8 8
7528 8 2 12 -19 7 9 -6 -8 -7 10 18 11 -1 -6 1 3 0 12 21 13 -16 -4 -19 -15 -3 0 -5 9 0 0 6 -13 -3 -6 -7 -2 -3 -6 4 -12 -28 -9 -19
7570 -19 -3 -2 -2 2 -6 -8 9 -8 -3 13 17 12 7 11 7 2 0 -8 9 22 14 8 1 -14 -5 7 -10 -3 11 19 7 -4 -17 1 -2 -6 -10 8 -6 -6 13 8 -8
7613 -8 -2 -8 7 16 9 26 9 4 -1 18 5 0 17 8 15 27 -5 9 -3 1 7 3 10 -3 -22 -11 -17 -5 15 -12 0 -12 -19 -3 -13 -3 -13 -7 -4
7652 -4 5 20 10 3 4 0 2 15 12 18 9 2 -4 -1 -12 0 5 9 14 10 2 16 2 -1 -10 2 -6 12 0 -8 -8 -6 6 -9 -15 -5 -5 -3 -2 -7 2 4 10 -19 -4 6
7698 6 3 7 4 -2 -11 1 20 14 15 16 6 -6 3 -4 -2 -6 9 16 20 -14 -16 -7 -21 -14 6 -2 6 6 -3 -4 -10 0 8 -4 -5 12 4 3 -13 -15 -3 2 19 -6 -2 9
7744 9 1 11 6 -10 -6 12 13 19 6 9 -3 -15 -7 -1 4 2 19 7 -5 -5 -15 -25 0 8 1 3 -1 -8 -3 -12 9 -6 -4 0 17 -1 7 -10 -10 20 -5 19
7786A9qlrRj6LpL1j0%J1j6kmMnqJ6jJ1Qj8j8JK1mJj0Noj0J2k8J6kK5J0qmj2j0
7827a6J7J5j1pJ5Kj9jJ8j1jMJ4Ok8J5k8J4KjljJ5lj5J0k8J0QKMojk0%K8k2J7J4
7866H%j0kKPj4MJ1Qnj0Rk0J5oQqnK3rkmj1J1mK0qj4J4qMj5Rk2J9OnJkLj0%%J1
7910aoJ4k3J6Mp%J2j7LRjqJ0j1QJ6k2PJ3%j7loomML7k6Qj4J1J1k0J6j1J3Qk3O
7950@Krm%K9jrJ7k2j9K1q%LJ0j0J1k6RPj7J1JJ6j5PqJRk1J7okPnKj1%LLPOoJ3
7994A3lj2j1J8J3j2J5j2klj7K1j1nK0j0Llk5L3j9K6k0jkQjlpj9K5J5j8pJ9%oj2
8032a2J3nROj1Ljkp%K4q%JqPrKOj1J0MmoJnj2J6rJ4rRoKj9OPj6J3JJ5rj2J0mR
8078Cj5K0j6J9kj1l%K4j8Oj0J4pk4J6k0J7kJ0oJ1Qoj6J6j4j3J3J1j8LOJLrJJ7
$$ plain form
7786 19 11 8 -1 8 -8 -5 -12 19 9 9 20 4 2 -2 2 -3 -11 5 4 15 23 5 -13 -12 9 5 6 -4 1 -5 -15 -3 -31 -15 -17 8 18 10 6 -6 -16
7827 -16 1 16 5 -2 13 15 -4 -5 13 2 1 5 19 25 -3 12 -16 -2 0 -1 -4 -5 10 7 -8 2 -26 -16 -8 -6 -2 -8 -9 -29 -29 -1 -23 -6 8
7866 8 8 -2 -4 -2 5 -9 -5 6 14 9 -1 8 -12 3 -3 5 -3 -8 15 6 4 0 -11 0 -4 16 8 -6 8 0 4 -11 -2 -24 -5 1 -4 -3 -5 -2 -12 -12 -12 -1
7910 -1 -7 7 -16 0 4 -3 -3 9 -8 -5 4 3 -5 5 -6 2 18 -4 3 16 16 -1 -4 -10 -16 -20 -16 21 -5 3 -11 0 11 -9 7 -4 9 17 -6 0
7950 0 2 -7 -11 -11 18 17 8 25 3 -16 5 -3 -3 0 10 0 11 -15 -6 1 -16 -5 -4 12 -3 4 -4 -3 6 -15 2 -4 -6 1 -4 -2 -13 -13 -10 -7 0 6 0 13
7994 13 10 -2 -13 5 18 6 21 9 7 4 -13 8 -3 -8 12 2 5 2 -23 10 -9 17 -3 -4 -6 2 1 -2 -9 -28 -3 12 -6 -13 6 6 0 -12
8032 -12 1 -4 5 11 0 3 2 0 -7 -7 17 9 9 10 2 9 0 2 8 -3 7 11 7 1 2 -3 -15 1 -8 6 -3 6 0 2 -17 -11 -4 -20 -7 -6 9 0 -12 -2 -6 3
8078 3 -12 8 -8 11 9 -2 -5 -5 19 1 7 -3 11 4 -20 -4 -24 -7 -9 1 -5 6 14 8 -8 8 -6 -19 -6 5 -13 -10 -4 -3 0 -9 -8 9
8116IMk5J2nJ6k9J1J7j1jQMj7R%j5J3KpJ4k0J6j0LnJ0j6J9j3lrkQkJ5rrJ2Pj2
8156a1J5qpJ8jJ1j0jj6QOKJ5j9jpK8j9j4J5pQJL%j0jJj9RK2n%%j9
$$ plain form
8116 9 13 -12 0 -5 11 -18 -7 10 -1 -2 6 10 -7 2 2 -13 0 2 -5 9 -11 5 -5 -2 -7 3 -13 6 -7 -10 -19 -21 -13 -15 0 -9 -18 -6 1 -11
8156 -11 4 -4 -11 7 6 17 7 6 -10 -2 4 6 21 2 1 -6 22 3 -11 4 -3 5 6 9 9 -1 -2 -1 -20 -11 11 6 6 6 -13
8191a3
$$ Imaginary data points
##PAGE= N=2
##DATA TABLE= (X++(I..I)), XYDATA
0@%%%%%%%%%%%%%%%%Qj4J4j6J6k4L1l1L8m4N0n8O2p2Q4r6J11j22J38j57J74j97
38a05K19k43K71k99L31l64M03m47M91n43N99o58P26p98Q81r75J076j196J332j485
58g84J665j883K151k479K903l473M270n480P510j1548K2640j12779m65146j50244
72g12677J80936L86558M44614L47329L0983l30367m91737l72868j25079J48225
82d94083L77282M57277K87157l7835l19565m21991l40896j12112J72638L79535
92e2593L98144K28631m9736l01955l98950k96494p2229J69486L47314L77815K03870
103E53303q7413l04961l46443k54820p4281J71753L64885L46580J31824j04893
113C95534k53772l18307k66498n2048K19211L45791K72117J05267p5546k49113
$$ plain form
0 0 0 0 0 0 0 0 0 0 0 0 0 0 0 0 0 0 8 -6 8 -8 8 -16 15 -16 22 -22 28 -30 32 -40 44 -52 59 -63 75 -82 92 -105
38 -105 114 -129 142 -157 174 -190 213 -234 257 -286 313 -345 381 -417 464 -511 565 -631 701 -784
58 -784 881 -1002 1149 -1330 1573 -1900 2370 -3110 4400 -7148 15492 -97287 -562433 -712677
72 -712677 -531741 -145183 299431 646760 677743 347376 -144361 -517229 -642308 -494083
82 -494083 -116801 340476 627633 589798 270233 -151758 -492654 -604766 -432128 -52593
92 -52593 345551 574182 524446 222491 -176459 -472953 -545182 -375696 -28382 349433 553303
103 553303 465890 160929 -185514 -440334 -514615 -342862 22023 368603 500427 395534
113 395534 141762 -176545 -443043 -495091 -275880 69911 342028 447295 371749 122636
123A22636l31976k27705R932K12852K86346K44580J09606r1424k62351k93140
133b20644j72483J8362J88482K70985K28123P7491j07248k40424k60510j50530
143c68396L4750J89674K42062J93226O7426j04597k40504k42121j10987N0605
153b88862J65937K22244J93669N1535j34933k31920j95088q9303L4609J62513
163a09599K33759J72020Q553j36334j94364j78367r7055M6203J82593K15021J29503
174B71933l032j18018j85132j74741p4798O7186J69885J84312J14083m886j19427
185A27365j76820j51998n6784O8108J61373J70003R3308j7473j10959j60449j42058
196a96384m5829Q0445J54399J43436P8020j1406j07856j64572j28987j9627Q4131
$$ plain form
123 122636 -209340 -437045 -427113 -214261 72085 316665 426271 334847 72496 -220644
133 -220644 -393127 -374765 -186283 84702 312825 390316 283068 42644 -217866 -368396
143 -368396 -333646 -143972 98090 291316 358742 254145 13641 -228480 -339467 -288862
153 -288862 -122925 99319 292988 344523 209590 -22330 -217418 -306721 -272112 -109599
163 -109599 124160 296180 304733 168399 -25965 -204332 -301387 -255184 -72591 142430 271933
174 271933 268901 150883 -34249 -208990 -283788 -216602 -46717 137595 251678 246792 127365
185 127365 -49455 -201453 -258237 -190129 -28756 141247 234555 217082 106123 -54326 -196384
196 -196384 -242213 -161768 -7369 136067 214087 202681 94825 -69747 -198734 -218361 -134230
207a34230J33172J31487Q0970j9474j22358j54517j00727j0417P1807J28333J34437
218A38483O8809l8810j20054j34126q9363j0746P5095J30516J21367M9784m3727
229A47228j11128j23811q0283k061P6973J22144J09092L9655m8948j07060j10643
240h8842o8657J231P6794J19635R7291K3711n1652r5059j01445o6934P354Q4843
252f1730J12952P9172J6163m5615r2450j03039n7874K2367Q5011R8541P0433J7038
264A40969m8020r6928r6164m3076K7788P8398R2467O7900J1208n4733r4488q4998
276i9677l3890K9449P5470Q7361O0945M852n6472q9813p6008k6008L0917P1098
288b1776Q2049N6117j194n9823q3928o4666k0458K8846O8883Q0327M8899j0232
$$ plain form
207 -134230 -1058 130429 211399 191925 69567 -84950 -185677 -196094 -124287 4046 138483
218 138483 207292 168482 48428 -85698 -175061 -185807 -110712 19804 141171 190955 147228
229 147228 36100 -87711 -167994 -170055 -93082 29062 138154 177809 128861 21801 -88842
240 -88842 -157499 -156268 -79474 40161 137452 161163 109511 14452 -86993 -153927 -146573 -61730
252 -61730 51222 130394 146557 100942 8492 -94547 -152421 -130054 -45043 53498 123931 140969
264 140969 92949 -3979 -100143 -143219 -115431 -37033 55434 123334 134542 79809 -14679 -99677
276 -99677 -133567 -104118 -28648 58713 119658 124510 68038 -21775 -97783 -123791 -92874 -21776
288 -21776 60273 116390 115196 55373 -28555 -93221 -113679 -84833 -15950 64377 113276 103044
300A03044n9177p4278n8398k0389L0651P2078P5629L7633j5068n4390o9465n6951
312h9081j6245L6925P1206O6454L0542j5122n2572o8616n3097r054M0449O7146
324H935N9551K6115j6708n2660o6004m7019k861M1736O2498N3199K2401j7745
336G1438n2564o3460m0614L306M1455N6858M8575K0335k0310n4016n8787l2121
348g9905O679L8007N3313M7269J6828k5329n3250n1533k6689O532L7032N3438
360B2392M3949J0115k8086m9071m6188k4596P598L8522N1962L8438N303k8161
372D2177m6044m3185k1992J0230L9425M9190L3144J443k7915m3004m0298j9709
384f6538J2749M0273M5728K7525r16k6269m1367l9216j6174J7042L9506M0041
$$ plain form
300 103044 43867 -30411 -88809 -109198 -78547 -6469 69160 106793 91725 37335 -32130 -89081
312 -89081 -105326 -68401 2805 69259 99801 84679 32107 -36509 -89606 -98660 -58211 8935
324 8935 68486 94601 77893 25233 -40771 -87790 -90651 -48915 13583 66782 89183 71438
336 71438 18874 -44586 -85200 -81894 -40439 16419 64994 85329 65019 11003 -47784 -79905
348 -79905 -73226 -35219 18094 65363 82191 56862 3612 -47921 -74610 -68078 -31046 22392
360 22392 66341 76456 48370 -701 -46889 -71485 -63887 -25365 26597 65035 70338 42177
372 42177 -3867 -47052 -69044 -58814 -19389 29801 62945 64388 36473 -6531 -46829 -66538
384 -66538 -53789 -13516 32212 59737 58821 32552 -8815 -48031 -64205 -47163 -7657 32384
396C2384K3663o73k6115m1947l6361j0540J8876L5895L6629K2910k131k8518m0722
409a6650l1152o866J8221L3965L5208K0569n122k8988l7815k7506m861J8324L2816
422A43L3253J8129p326k9510l5339k3596k929J7623L1816L2376J5327j0648k8940
435A0379l1295k1164l284J8221L3162L0134J0381j2089k6078k9285k1162j481
447d3561K1087L1982K5415Q032j0930k5250k9429j9074J871K1424K9182K3084
459C3833P119j1670k5355k7498j6316L289K1170K7593K0696N391j1582k4448k6645
472b4423j4471N751K1112K4697J8629N601j2065k5720k4933j0321O840J8435K3354
485A2486J9449M227j5116k4991k0852q789N332J8482K4607J7573M92j5257k2118
$$ plain form
396 32384 56047 55374 29259 -12688 -49049 -59589 -40713 -4818 31811 54721 52590 24072 -16650
409 -16650 -47802 -54668 -36447 -2482 32726 53295 48173 19185 -18630 -46136 -50997 -32673 143
422 143 33396 51525 44199 14689 -20650 -44246 -47175 -29552 2264 34640 49967 39319 10379
435 10379 -20916 -42080 -45364 -27143 6019 36153 46534 34445 8367 -20918 -42080 -43561
447 -43561 -22474 9508 34923 42955 32025 6775 -22654 -41728 -39857 -18433 10749 33833
459 33833 40952 29282 3927 -23571 -39887 -36598 -15428 12165 32861 38252 26670 2222 -24423
472 -24423 -38894 -33143 -12031 12666 31295 36896 24831 -889 -25822 -36143 -29303 -10868 12486
485 12486 31935 36162 21046 -3945 -24797 -33586 -28254 -9772 14835 32408 32900 17643 -4475
498d475j9521r076O432J9712K3017J4701k49j4530k1670j8643p140P427J8828
511e187K1700J3492j741j4991j9837j6569o900P430J9609K0802J0404l127j3077
524A2008j8511j7204n876J0270J9278J7073Q781j555j2981k0063j5779k183J0575
537a6167J6414J6167R732k804j5112j8851j2532j459R384J6514J6314P801m684
550B0717j4372j7126j1923q48J0394J6041J4423O777m641j4710j6822r803P90
563b1103R449J4709J4555O186o776j4802j3944q228m23R175J6123J3677K950p366
577A4182j2205j2976r335M64J1421J5192J0433K298n700j2268j3933p823K835
590a7415J0869J3130J0094K550o846j2832j2277o102K688J0482J3242R112R06
$$ plain form
498 -4475 -23996 -33072 -26640 -6928 16089 30790 30541 16011 -5659 -24302 -31442 -24015 -5187
511 -5187 16513 30005 28264 13273 -6564 -23133 -30033 -22603 -2994 17808 28212 25085 12008
524 12008 -6503 -23707 -29583 -19313 -35 17038 25819 24264 11283 -8780 -24559 -26742 -16167
537 -16167 247 16414 26146 23342 8230 -10621 -23153 -24612 -15228 1286 17600 25401 20717
550 20717 6345 -10781 -22704 -23552 -13158 2883 17306 24083 19442 4732 -12090 -21893 -21103
563 -21103 -11654 3055 17610 23796 17020 2218 -11726 -19954 -20377 -11202 4921 18598 21548 14182
577 14182 1977 -10999 -20334 -19870 -8449 6743 17176 19474 13774 1506 -12427 -20250 -17415
590 -17415 -6546 6584 16678 19228 12382 -450 -12727 -18829 -16141 -5659 7583 16695 17601
603A7601o878j1609j1915n946M043J1155J1535P482J293o538j2586j1470l369
616a7202M938R201J0480Q374Q16q557j2250q699k509L501R158J1601P220j684
630A4388q366j0028q177l216M301J0230J0339N203j655p394j0194q105j784N123
644i335R251R334N081k140q089r376o617j579M662R584R250L499l092o978q418
659d963p105j345O199R532P168K589j983o734r410o430P14O226P657O649L496
674A2260k483q035q606m458Q79N053P623P101K471l645p256p249m339O01N468
689d615P608N951J778l229o918p202l617J383N058O661N833J773l923o994n895
704f348k798P39M671P273N590K10m179n654n342l445J008N839O857L892p5l180
$$ plain form
603 17601 10723 -886 -12801 -18747 -14704 -3549 7986 15468 16761 10223 -2363 -13833 -17202
616 -17202 -12264 -3063 7417 15791 16607 8050 -4200 -12899 -15408 -11907 -2749 8852 16072 14388
630 14388 6022 -4006 -12183 -15399 -11098 -868 9471 14674 13019 5625 -4569 -12674 -14458 -9335
644 -9335 -84 9250 14331 12191 4102 -5274 -11891 -13470 -8808 776 10026 13525 10433 3455 -4963
659 -4963 -12068 -13413 -7214 2318 9486 12075 10092 3358 -6052 -12482 -11768 -5542 2115 8764 12260
674 12260 9777 1742 -6864 -11322 -10443 -5390 2233 9334 11805 8160 904 -6345 -10684 -10083 -4615
689 -4615 2993 8944 10722 7493 575 -6627 -10244 -8861 -3803 2858 8691 10464 6541 -453 -6348
704 -6348 -9146 -8407 -3736 3537 9127 9337 5158 -496 -5838 -9283 -8275 -2436 4421 8313 8238 5058
720E058n584n990k810K289N561N643L615L76l562o012n232j765K190M941N512
735D230L459k22l655n363m742j744K383N005M849K788o6l327n498m511q24K577
751d661M080M322L190j15m052n295l328n26J802L961M918K803j192m029m274l060
767e456j021K041M621M531J813j297l422m280l249n52K570M351L889J664j263
782D940l533m090k771l10K404M184L719J236j445l116l667k844k72K740M036K931
798D142R32r38k860l951k628M14K713L240K649J364j002l393l745j794N82K191
814b084L140K964J083j627l363l124j587M20K303L384K665O03j730l144l030j387
830d514O60K339L113K493M47j852l073k583j166M88K175L210K294K7j833k500
$$ plain form
720 5058 -526 -6516 -9326 -7037 -1476 4167 7782 8158 4596 -1416 -6648 -8413 -6223 -1282 4230
735 4230 7689 7467 3812 -1551 -6293 -8037 -5654 -649 4200 6988 6922 3595 -1903 -6414 -7238 -4661
751 -4661 -581 3741 6931 6816 2764 -2531 -5859 -6385 -4583 -622 4296 7099 5907 1878 -2396 -5456
767 -5456 -6477 -4436 185 4716 6529 5232 1810 -2470 -5719 -6271 -3701 650 4539 6203 4940
782 4940 1407 -2683 -5454 -5764 -3360 824 4543 5779 4334 1218 -2449 -5293 -5565 -2825 1211 4142
798 4142 5074 4136 1276 -2675 -5303 -4889 -2176 1064 3713 5077 4075 682 -3063 -4857 -4275 -2084
814 -2084 1056 4020 5103 3476 113 -3011 -4598 -4178 -1875 1509 4174 4777 3047 -97 -3127 -4514
830 -4514 -3854 -1515 1598 4091 4538 2686 -387 -2970 -4136 -3648 -1473 1737 4031 4058 2225 -275
846b75k333j414M42K479L026J686p4j347k280k601j321Q83K427K467J518K07j333
863B157k620k421q12R95K117K333J581M4j575k533k126o63J037K136K245J341
879C236o9j584k483j985l75J097J902J992J405r8j760k365j502k52P78J684K162
896A783J303m27j703j841j293n63O78J913K016Q75n09j305j671j478m74R67J831
913A02J664P24l71j317j712j328k45J019J699J563O07m96j316j609j215j44J153
930a222J705J259M36m00j195j686j156J55J179J336J090O26l22j416j631p51K43
947a750P86J204J271O07n77j353j227o68j6P26J360J187L52n93j136j160p34Q8
965a633Q52J265R99L21o21j164j081n72J07Q33J294J001J03p58j023r02o32Q0
$$ plain form
846 -275 -2608 -4022 -3580 -1101 1925 3611 3537 2190 -90 -2691 -4012 -3129 -702 1765 3283 3490 2157
863 2157 -463 -2884 -3696 -2701 -584 1749 3330 3374 1799 -734 -2860 -3523 -2486 -350 1895 3236
879 3236 3167 1583 -900 -2885 -3260 -2163 -261 1731 3136 3038 1278 -1087 -2589 -2841 -2063 -379 1783
896 1783 3086 2659 956 -885 -2178 -2741 -2063 -150 1866 2741 2232 927 -744 -2222 -2696 -1729 102
913 102 1766 2490 2119 802 -910 -2238 -2483 -1464 235 1798 2405 1909 593 -1016 -2231 -2375 -1222
930 -1222 483 1742 2178 1778 583 -1103 -2259 -2104 -925 411 1501 2127 1805 389 -1242 -1993 -1750
947 -1750 -964 240 1511 2118 1541 188 -1039 -1707 -1723 -997 363 1550 1902 1309 173 -987 -1721 -1633
965 -1633 -781 484 1483 1804 1183 19 -1062 -1634 -1527 -694 600 1601 1704 946 -77 -979 -1611 -1531
983a531J008J312P06o4m88q86j114o46L68J046R70N98J90m39j096j092l72L99
1001a131P81R02P91J56o28j054q94l52K57Q22R85O72M9n66r78r32l09L89Q01Q68
1021F29O77J01o92j084p57j65K87P20J021P24j61q02q65o04l46K20R39J055M57
1040A354k22n77p79q36l75M81R36Q08M14j6n70r96p49j86M22P99Q71N11j10o89
1060D91q57o92k65M35R21Q21L46r3n77r19p97q4N54P78O62M85k1p34j014n65Q
1081a117L92O77Q41N48k76q26p36m92j96L70Q86Q30L02k71o23p55o56q4N21Q29
1101A64O79L25j96p05q14n04j6M07P92P69K85l46o51o73n38j08N21R15N95J29
1121A030k16n37q08o12R3O33O95M93L12j72p60q25l53J27M36O32O82K67l56p09
$$ plain form
983 -1531 -523 789 1495 1431 943 57 -1057 -1703 -1335 -289 681 1279 1469 1030 -66 -1158 -1530 -1131
1001 -1131 -350 552 1343 1499 871 -183 -1077 -1429 -1172 -350 635 1307 1356 790 -188 -1120 -1429 -1040 -239 629
1021 629 1306 1407 715 -369 -1126 -1291 -1004 -284 737 1461 1300 498 -367 -971 -1317 -1097 -158 897 1354
1040 1354 1132 555 -224 -1060 -1435 -954 -18 790 1204 1188 618 -378 -1127 -1313 -891 -92 779 1290 1180 491
1060 491 -366 -1058 -1323 -888 33 854 1200 1107 530 -389 -1186 -1270 -716 62 724 1209 1188 454 -560 -1125 -1117
1081 -1117 -725 -48 793 1341 1065 239 -497 -989 -1185 -815 71 901 1203 932 309 -446 -1102 -1186 -665 164
1101 164 843 1168 972 267 -547 -1051 -1067 -660 132 901 1186 840 189 -484 -1022 -1130 -609 306 901 1030
1121 1030 814 277 -531 -1143 -1050 -417 278 771 1083 911 151 -674 -1027 -900 -464 168 850 1117 761 52
1141E2o11l79JM98P31N85J07l09o04o73l92J71N03N95N28K02l56p04n94k25R8
1162g76M27O66N73O1m60n76m52l29J8N83O93M25n0l06m70o17l72K19N73N39L67
1183G36J09k89o45n60j87J71M47N81M15M7l92n41m74k39J70N12N60L10j9k90n41
1204a19n10j67K73M64M39L26M7l98n89m06m3J82L94N17L53j03m13m59l16j86J65
1225e49M89N33K34j06k94m80m11j28K47M52M18K44j8l49n00l66o8J93M42M52K63
1246F98j35l59m11l41j14K32M84M00J52j01k96m46l79NL13L82L24K05r0l73m82
1267c32k25J8K31L42M02J80j42l79l75k37m7K28M47L58J14j46l15m10k52J1K45
1288b84L97L11J70j50l71l96k07J6K53L88L60P4k07l50l00j95rL05L98K67J1j60
$$ plain form
1141 52 -559 -938 -937 -439 292 877 984 675 71 -602 -994 -823 -320 275 803 1005 649 -55 -649 -874 -776
1162 -776 -349 317 890 951 491 -85 -537 -866 -848 -265 428 853 803 497 27 -590 -962 -743 -170 369 736
1183 736 845 556 -89 -649 -836 -665 -218 363 778 825 433 -108 -582 -821 -651 -139 421 731 712 422 -119
1204 -119 -629 -796 -523 -59 380 706 753 355 -234 -640 -683 -501 -107 410 763 660 247 -212 -528 -714 -549
1225 -549 -60 473 707 601 307 -173 -584 -712 -465 -13 405 649 631 282 -218 -584 -652 -459 -17 435 698
1246 698 563 204 -207 -548 -662 -430 54 454 606 505 209 -237 -616 -611 -298 84 408 613 523 150 -332
1267 -332 -557 -539 -308 34 436 616 474 95 -280 -517 -564 -336 111 469 583 437 122 -288 -540 -529 -284
1288 -284 113 424 594 444 73 -323 -530 -514 -261 127 487 561 354 4 -296 -491 -500 -195 203 470 481 321
1310C21k97l68k06J17L22L11K15O4j50l64l32j14P9K74L09K61O3k16l42k79j27
1331d59P1K51L59K27jj61l36k86j31R1K79L00K14K5j96l49k45n8Q0K51K90K06
1353D22k7k21k79j96r0O5L07K89J41n8k23k34k04r8J51K76K37R2l2j80k69k17
1375c48qJ51K04K44J15m4k07k53j81k7J42K35K18J12p4k02k25j88RJ63K22J75
1397B33J00m0k34k39j23N0J19J80J96R7j14k05j92j10K2J22K37J80K0j02j96j70
1419a69j07J4J62J97J78Mj02j71k02q7L5J47J99J61M3j23j97j54r3LJ58K13J53
1442B62Rp5j73k16j09L5K16J63J14M6o8k05j90j02P8J28J93J50L0j00j95j68q8
1465b65L7J40K07J62nj11j63j79j04N1J40J99J25N2r8k20j71o4L0J36K12J48L7
$$ plain form
1310 321 24 -344 -550 -433 -111 200 415 479 329 -35 -367 -481 -402 -128 181 442 505 289 -53 -332 -459
1331 -459 -388 -137 222 449 448 287 -49 -335 -466 -375 -96 204 418 443 247 -102 -347 -405 -325 -74 216 422
1353 422 395 174 -105 -301 -391 -326 -19 270 411 353 130 -104 -308 -406 -255 21 258 350 318 138 -131 -348
1375 -348 -356 -205 -1 243 358 314 107 -146 -327 -354 -212 23 241 353 279 77 -148 -336 -327 -164 58 233
1397 233 333 293 59 -180 -303 -253 -134 46 242 339 225 20 -172 -282 -260 -138 99 279 299 197 1 -169
1419 -169 -276 -262 -100 97 275 279 177 6 -196 -283 -248 -101 98 259 302 179 -18 -172 -265 -262 -104 109 262
1442 262 271 196 23 -193 -302 -267 -51 112 226 272 204 -1 -191 -293 -215 -87 106 256 286 186 -9 -177 -265
1465 -265 -228 -88 119 281 276 165 2 -177 -281 -230 -90 109 234 286 188 -32 -203 -267 -237 -101 111 259 296
1488B96j40j70j60j01K4J72K13J19J5r3j61j97j24P9J64J95J17K7q9j88k06p1
1510b79N0J49K01J43K2j46j71j66q3L5J83J86J21Qq1j87j89q1P9J64J51J31L0
1533B70j17j92j56o1N8J23J89J23Mj21j57j35q1M9J45K01R6jj16j53j69p5P6J65
1557c5J68R5J0j11j65j64o2P2J27K05R8j2j22j72j12o5O6J55J74Q6k8q6j83j28
1581a89m1Q6J35J31R1Rj26j85r3j2O7J21J45Q3l3j13j60q9j8M3J71J38N6l2j13
1606G2j48j18j3P9J40J35P3n5j07j58j01lO7J65J36N1m7j31j23r4k1R6J34J35
1630A64L0m4j11j46j02J9R2J38J03N5l8j18j75p1K9P9J49J03O2q6j16j33p9MR9
1655i3J44J32L2p9j17j52r1M6R4J49J23L9n3j61j45n1NR6J51J27J2n8j49j19p4
$$ plain form
1488 296 156 -14 -174 -275 -251 -79 134 253 268 175 14 -183 -307 -228 -64 131 248 275 186 -2 -208 -279
1510 -279 -229 -80 121 264 286 140 -31 -197 -280 -245 -62 124 245 253 172 -15 -204 -285 -206 -42 109 240 270
1533 270 153 -39 -195 -256 -198 -75 114 237 241 120 -37 -172 -253 -204 -59 142 238 237 121 -32 -201 -276 -200 -35
1557 -35 133 228 238 127 -38 -202 -264 -192 -65 140 238 226 104 -68 -180 -245 -179 -24 150 236 208 122 -61 -189
1581 -189 -230 -144 -9 122 213 222 96 -89 -182 -194 -127 -6 139 222 189 76 -84 -173 -191 -148 23 161 217 185 72
1606 72 -76 -194 -207 -128 12 147 220 165 58 -100 -201 -204 -137 28 164 215 168 37 -86 -180 -201 -105 29 164
1630 164 194 150 39 -107 -209 -190 -98 40 143 198 160 42 -133 -204 -175 -96 53 156 218 132 16 -117 -196 -192 -93
1655 -93 51 183 215 136 19 -133 -224 -178 -84 65 188 227 174 13 -132 -183 -178 -82 69 196 208 150 1 -118 -192
1680a92QJ12J36J24%n4j27j56p2M6J10J36J10ll5j58j30l5K1J04J40R4K5p7j41
1705a4j15o9L6J22J36R0lp6j30j29l8L0J25J34Q1J3q6j38j16l9L6J08J40R6j5
1730A79j03j05j02o4O0J19J26O0j8o8j17q8m8N7R9J16P0Kr0j22r5l6M4J02J19
1755I7N2j0q4r0p8m6M2J10R2P7m2n1j21q4l2P5Q9R0O0j2q4j02p7j1N5Q6J03M1
1783A45l6p2q4p0JM4Q1Q4K7k6n3q3p8pO1R2N4K5k3o0q1m0kK7R1P1K9k6p2m9q5
1814a15nM8J05N6J5j2o6p8o4K8N2M1Q7K0k3o6r4k0j1M5P1Q5J3k9o9o8m6LL7Q1
1844B1P5J3l5o2o4n5LN3N5O6L9l0m8q9m1jM8R9M5K8l0p3o5n6pN5Q9O3J4j0q7p8
1876f5l9QM4Q9N3K4k0q7p7k8kL7Q6P0J4k7p5m5p4J1M8Q6Q2j6k3o4p6n1J9N3O9
$$ plain form
1680 -192 -184 -72 64 188 188 134 7 -149 -221 -175 -65 71 181 178 143 -15 -145 -180 -159 -55 85 179 204 127 -14
1705 -14 -129 -198 -162 -40 96 186 183 107 -23 -152 -190 -160 -35 99 180 193 107 -31 -147 -186 -150 -42 98 194 179
1730 179 76 -29 -131 -195 -135 -16 110 170 152 84 -33 -121 -169 -112 -13 103 173 175 85 -37 -132 -168 -124 -22 97
1755 97 149 139 55 -35 -113 -159 -117 -7 85 162 120 69 -52 -136 -168 -93 -4 86 146 134 50 -52 -129 -140 -85 1 104 145
1783 145 109 37 -47 -117 -116 -72 9 93 120 94 41 -42 -120 -127 -66 26 80 105 82 22 -59 -99 -101 -74 17 88 117 91 19 -30 -115
1814 -115 -120 -72 33 89 104 92 26 -52 -116 -88 -36 5 92 112 89 23 -71 -91 -102 -57 14 99 112 83 14 -54 -100 -97 -60 21
1844 21 96 109 74 12 -52 -107 -104 -51 4 70 109 79 31 -58 -99 -100 -52 47 92 120 90 17 -48 -104 -111 -56 33 96 110 100 13 -65
1876 -65 -104 -96 -52 37 90 114 94 7 -70 -98 -100 -63 23 93 107 80 5 -40 -114 -103 -55 31 113 97 74 10 -66 -117 -98 -45 24
1907B4Q1J2l0q6q2k4lQ1N4R7Nm8q1q0n5L3O6P6N0K7l9j00p2l5K7O3J02M0K3o0
1937F6o5r4m2M2O6R7N7k2m3p3p7m8L5R0Q3O2qo6p9o8l0K7Q4P2N1Kn6r5o8l5L3
1968a02Q1Q7P0j8n3j13n6l9O2P9P4O3%j09p1o3l0O8P5O8O0k2o9p0p8j8L7Q3Q5
1997H1N5j7q0p6o3j1M4P4P7K6K0p9r1o4NK9Q9O1M4j5o4r4o4nO3P2P4J4j8p2n3
2028c8o9NO1P5O8Mj1p7p0m2JN3P5O3J5l6p7o8k5J0L4R0N8Rl4q0o0l5K2N4Q6K8
2060H9Ro0m6o9l5K8P2P8L7l3k5o2n0j0OP0N7N4k9l0q3m4j5M4N6N6L8j4o2o2m7
2091h2k1M2N4P1K5j0p0n6o1J2M3Q0L6L7l1o3p2l6mO3Q4N7K5n4o6o6m3K6M2Q0N8
2122A00%l4p9n7l7J6Q3O8N0Nn3p3q0l2K4Q1P9N1j0p0p0o4j5K3R5O8L9Ko4j00m2
$$ plain form
1907 24 105 117 87 1 -81 -105 -108 -27 27 124 129 81 0 -80 -135 -102 -36 40 90 117 78 -22 -94 -129 -102 -39 63 103 126 66
1937 66 1 -93 -135 -93 -27 70 127 105 62 -11 -88 -136 -101 -11 72 134 126 60 -19 -87 -117 -90 -6 66 117 119 63 -32 -100 -135 -102
1968 -102 -21 66 136 118 65 -48 -104 -143 -81 -2 72 135 135 26 -45 -108 -138 -70 5 73 133 111 42 -28 -106 -124 -87 -4 81
1997 81 136 119 39 -37 -100 -111 -67 7 84 110 130 51 -40 -104 -99 -70 19 80 124 109 45 -49 -113 -118 -55 17 91 105 87 15 -38
2028 -38 -107 -102 -41 34 102 106 95 18 -52 -94 -93 -40 35 98 113 77 0 -68 -93 -83 -49 41 99 108 74 -6 -66 -101 -79 -25 61 89
2060 89 98 38 -8 -77 -112 -84 -12 66 103 70 45 -17 -67 -77 -71 -1 56 110 81 51 -32 -76 -91 -47 9 65 103 89 27 -35 -82
2091 -82 -103 -61 -7 64 89 79 9 -47 -108 -96 -53 27 63 100 69 6 -66 -102 -106 -43 41 98 123 69 3 -63 -106 -80 -38 42 100
2122 100 100 66 -13 -70 -107 -91 -8 60 110 115 62 -11 -91 -123 -99 -18 61 112 102 32 -38 -102 -117 -94 1 69 108 110 46 -54 -96
2153i6l5M9J03M9N5qp3r6o8LL6Q6Q1L7l1o9o1p1lL2R2R4Mk7m9r9n1nM8R8P0K7
2185A22j9r3q4l7qN6R4O7K2l8p4q7n6K4O9P6P4Rj6j10o2k7mN4R4O5Rl8p4p8n4
2216a24L3N4Q9N5J7n8o8q5k8LO8R5N4ol6q1r3jL4N7R0M3Po1p0p7l5K5P9P6L9R
2248A04m3n8q9k1K7O4Q6M8j5l9p8o6k3K4N6Q4N1j0o0p2p9KK1P2O4M4rk7p2o3l4
2279a11K5P5O7O5k3o5p5n9j1N5N9P3L9j1n0q7m1k3K8O5N4M7Lo1n7o3oJ9O4O6L7
2310I8k1m1o2o0j3L8P9M3K8j5n3o6m6RK3N2O9J6Mm6n6n7j4K7N1N8M8j8l8o5l4
2341f2j7PO6N3K8Lm0n4n8oK9N0M4J4J4m1n7m2mL6L0O7J2Rm7n4l6j5J2M0O8J8K
2374F9n5l6k5k2L3M8L4K3Mo0m5m7J5M7M0M0Rk1m3n6j7J2RN5N1Ol2k0n6k7ML7M7
$$ plain form
2153 -96 -131 -82 21 70 125 117 44 -52 -120 -117 -81 5 86 123 92 23 -38 -109 -112 -80 12 106 110 83 34 -65 -116 -121 -73 25 95 122
2185 122 103 10 -74 -111 -119 -63 31 98 120 82 8 -79 -135 -111 -42 34 108 117 101 -9 -71 -98 -102 -48 46 111 120 82 8 -70 -124
2216 -124 -91 -37 52 107 124 66 -2 -87 -115 -112 -44 51 105 99 63 -18 -111 -112 -78 -21 69 112 119 58 -12 -89 -124 -99 -20 56 95 104
2248 104 61 3 -86 -107 -80 -16 70 118 103 64 -14 -80 -103 -79 -23 61 112 102 42 -30 -109 -107 -86 -14 50 94 85 58 -14 -77 -111
2279 -111 -86 -11 56 121 98 33 -42 -101 -112 -57 2 75 114 103 53 -34 -75 -98 -70 -5 49 96 99 38 -19 -82 -88 -69 -5 61 98
2310 98 77 36 -26 -86 -99 -61 18 61 89 74 21 -45 -91 -82 -59 -7 62 78 82 36 -20 -77 -91 -64 -13 45 93 75 37 -28 -62
2341 -62 -79 -72 -6 47 75 78 38 -16 -74 -80 -51 -1 43 57 71 30 -27 -69 -73 -37 -7 60 72 81 34 -20 -56 -71 -59 -19 49 67 69
2374 69 14 -22 -47 -69 -36 12 46 69 73 13 -32 -79 -64 -17 23 63 72 51 8 -48 -65 -53 -44 11 62 68 36 16 -40 -67 -63 -26 21
2407B1M3nk2m4m4j2J1N1L3K6Jl3k4n5KML2N7J4J7m9k9l7J2j0L8L5M9m3m2k5k0
2439d8jK0K4K1K7mk4m3k9LL0K5N0J7n2j0l7k8RJ6N7L9Ml5l4l6k9L3NN4K7J4n0
2472A5m1k7qJ7L2K7L5rPo5k4j4qM0N6J6pk9m2k0oJ9L8M3Lj1k5k6l8K8k0M7M0J3
2506E6pl8m5k4J2MN7L7Qj2l1m9k9OK0N8L0LMm9n1j5rL8M7L1j3Nk7n5k3LM5K4M6
2541E7jjm3m0l2J8L6L0M1K2l2o4ql7J7K9M5L2pk8n1l4kJ6K7M4K4oj6l9n7J0LN2
2575EL4J3Jk1m0m9kNM8L9M0pk3o3l1mOM4L0N0lo0l2m4J3NM4N4J6k4k9l4k4k1J8
2610d6N3L6J1j3k2m8m4J9K7N0L2Qnl7l5k6oK0L6L3M4n0k6l7l2RPQ0J4J5op1k9
2643c9j6JJ7O2J1L0j1m5n1m0K1M4M9J9lkn5l7k8K1L0M6M2j2pn1l4l5L2K4L4L8
$$ plain form
2407 21 64 59 37 -7 -51 -63 -52 -1 32 58 59 26 2 -53 -51 -47 -15 42 56 73 24 -5 -42 -30 -40 -2 33 82 39 -3 -28 -48
2439 -48 -49 -29 -5 16 43 39 15 -28 -57 -54 -24 1 51 68 16 6 -31 -59 -50 -34 23 62 66 31 -3 -39 -68 -35 -30 24 51 65 15
2472 15 -26 -53 -61 -44 -12 15 50 41 48 -17 -41 -55 -63 -23 33 49 42 13 -29 -49 -55 -36 2 45 48 37 12 -14 -52 -24 -44 3 43 56
2506 56 49 11 -34 -58 -46 -42 15 52 60 48 17 -32 -61 -55 -35 23 53 56 60 11 -40 -55 -64 -26 21 52 39 44 17 -38 -61 -58 -13 11 57
2541 57 56 55 12 -28 -60 -42 -6 24 65 87 55 -9 -17 -54 -37 -8 37 69 62 34 -17 -51 -53 -37 -10 34 58 52 36 -3 -60 -50 -47 5
2575 5 39 52 53 32 -8 -57 -59 -54 -6 33 73 66 43 -20 -51 -55 -49 -5 25 75 72 12 -20 -64 -51 -46 -2 52 68 44 15 -19 -43 -64 -46
2610 -46 7 43 54 41 19 -29 -73 -54 -27 23 55 63 58 21 -14 -40 -46 -26 10 43 87 37 11 -26 -58 -49 -42 38 52 67 61 -10 -39
2643 -39 -55 -54 -37 25 36 66 55 10 -41 -81 -60 -16 33 52 49 47 -8 -45 -73 -52 -22 24 66 54 47 -4 -38 -73 -41 -17 17 55
2675E5Ml2m1m6oL5lO2L1Pl1p1j3k1J6K7M7M7k5j5m7l1k7L0M4L0K8Ll9l8k2j7K5
2708c4M0M0K9l2k3m3m2K5pM6L8PJ5l3n4m0JK9N0L6J0k0k4l5k9LL1K1M4Ok8k7j5
2741a5m3j0M7M3NOok4m4mrL4K9L9Ql4j6n7J5oJ9M9K9Om1nn6j1K4K4K4K7j4m4r
2776b0k1rK1L0K8PNk5m0k6mK0P0Pnj4j5k3j8j2K9K3K5%j1j6j5j3j3J1L3J5Onm5
2811b0Jl0J7K5L1OQl0k0l3NJ5OJ7M2j3j5l1j9J0mL8RJ5j6j6j7rj0K9K8PQj1j3
2846A0j5k9J0J1L1J5qqPk2k2qJ5PJ1J8qk2k2mJ0K7K2lJj2rl5pL2J3LL0l1Ml9n
2883c2J8j2J8L1Ql6J3pk4MqJ4L5kLMm0pLj7L6J4NKLl4j0lj5K4L9LJj1l1j7%J2
2921a6J1J6J0Oj3j2qmJ2kPMQrj5Jj7%J5L0Mpj4j4k1J0kJ1K0Pqmj3nj3J3J8jLJ7
$$ plain form
2675 55 59 27 -14 -60 -66 -31 -34 28 59 66 35 -36 -49 -70 -54 -27 20 67 42 27 -20 -51 -78 -48 -4 26 54 57 18 -20 -42 -59 -34
2708 -34 6 46 75 43 20 -23 -65 -40 -47 -1 37 44 59 26 -28 -68 -67 -38 12 48 58 38 14 -21 -50 -47 -16 5 49 55 27 0 -15
2741 -15 -58 -68 -21 22 27 33 27 3 -41 -45 -54 -20 9 48 56 22 6 -51 -36 -42 -23 26 55 61 20 15 -41 -52 -28 -4 20 47 33 -11 -20
2776 -20 -41 -50 -29 1 29 36 41 16 -24 -50 -54 -34 36 43 38 24 9 -14 -32 -44 -15 8 33 33 22 6 -9 -22 -35 -24 9 24 30 25 -20
2811 -20 -19 -49 -32 -7 24 30 38 8 -12 -45 -40 -25 -19 -2 40 27 12 -19 -38 -28 -32 6 15 30 14 -2 -19 -28 -38 -9 19 26 34 23 10
2846 10 -5 -34 -24 -13 18 33 25 17 24 2 -20 -28 -13 -6 5 23 15 -7 -29 -33 -23 4 26 23 24 12 3 -32 -39 -7 6 9 39 8 12 -27 -32
2883 -32 -14 -26 -8 23 31 -5 8 1 -23 -19 -27 -13 22 20 23 27 -13 -20 -17 -34 2 16 21 23 26 -8 -18 -21 -36 -12 27 30 31 20 -11 -28 -28 -16
2921 -16 -5 11 21 27 14 2 -6 -10 2 0 7 11 19 10 -5 -4 -21 -21 -6 24 28 21 7 -7 -28 -18 -20 -9 11 18 10 6 -7 -12 -25 -12 6 5 8 25
2961B5ol6j3RKJ0RK2pMl0qKPJ4OJ4j8Lj1rnqK3JK3pl1Qrj9K3MOK6ojoj6mJJ1Q
3004A1K6j0j9mk2MQMK9KKl3j1kj5J4L0J2j1J2l3kpj8K0J6J0Rj0Lk7k3J2PK3K4
3040C1j3jj0k4j0J5J0JL2j9Klk3kj6NN0J6k5k8pRj9LK8%J9Lj1j3k7NqK1K9OoJ
3078B1j2k0pLJ3J8J7k7J3j1k7j9J4J0K6J0Kok2j4MrK7kJ5Jrj3j2nrJ8OK3rkj1
3115ej5nMJ7J2Rpmj8l2J3K2oK4POJ2l3k2j3J4OL6%j0Ok2j4J4Oj1J9nJ2Rl6Jrk
3154b0J7OK1Lk5jl0J9j6L7jPooj9j3K1OQjJ8Pj1l1rkjJ8J2K3k7pj0jj2J2J6K5
3192B7oKj5j2j5PJ8j5J9mJ4k2lk2KJ3RJ1K4j4j0k7J7kQlJ8Nj1j0j4knJ7KJ2Ln
3230A1qj4k0K0RJ4j8L2j6k4j3NRJ3OJ0Lj0pj3jpJ7K3OpoJk2RmlM2nk3Pj1j1j3
$$ plain form
2961 25 19 -17 -30 -21 -19 -9 0 22 15 19 -11 -19 -17 -10 4 10 24 6 9 -2 -11 -16 -24 -1 0 23 16 -15 -7 -16 -35 -12 -8 -2 24 18 17 11 -5 -9 -8 3 11
3004 11 37 27 8 4 -18 -14 -6 -2 27 29 31 -2 -13 -15 -30 -16 14 26 15 27 -6 -8 -15 -33 -13 3 13 22 12 15 -12 -35 -23 -16 7 31
3040 31 18 17 7 -17 -27 -12 -2 -1 31 12 14 11 -12 -14 -30 -25 25 41 16 -12 -19 -10 -29 -26 2 2 21 24 13 0 -27 -22 -30 -9 20 26 20 21
3078 21 9 -11 -18 -15 -2 16 33 6 19 8 -19 -38 -24 -14 12 22 24 18 -4 -18 -14 -23 4 2 17 18 9 -4 -16 -21 -30 -12 -6 17 8 6 -5
3115 -5 -20 -25 -21 -4 8 17 10 6 -12 -44 -31 -9 -15 9 16 22 34 1 -21 -34 -20 -14 22 22 12 18 -4 -18 -4 2 -9 10 5 17 26 -10 -9 -18 -20
3154 -20 -3 3 24 27 2 1 -29 -10 -26 11 10 17 11 5 -14 -27 -6 0 8 7 25 32 21 -10 -19 -21 -22 -4 8 31 4 -3 -13 -14 -26 -14 2 27
3192 27 21 23 8 -4 -19 -12 6 -9 10 6 20 -2 -5 -27 -25 -12 -3 8 32 18 8 -19 -2 -4 4 1 19 24 13 3 -11 -13 -18 -1 1 13 16 11
3230 11 3 -11 -31 -11 -2 12 -6 26 10 -14 -27 -22 -13 0 6 16 19 9 2 -11 -12 -19 -2 21 27 20 14 15 -7 2 -2 -5 37 32 9 16 5 -6 -19
3269a9J5KJ6Jkk4RloLJ1MJ7k4Mj1jKMPJ7j3J7k0nrkJ2JRPj1j5J8k4QlL5k5KPj6
3311ekmrK7npjJmK0j7oJLK2j7J3j7KKj0RK2qj6J5Kj1k2LRJ4mJ4k1M%Jj5J8NPj
3354A2J0k0j2J9k9J7LJ5mj3joj%lJ8nJ1k2J0QqoNnMmJ6Rj2MkjJJ%J2nrnj0jQP
3398FLMj2J0k3pK0j4RJ9j3J0j6J1k1OQOrK0l1J9j3j3J7OjK3kLlk4Kj6RJ0NJ4j3
3437IkrJj5QJ4mJ1Pj2j1jnRj9K3Nj6K3l3Qj2LK2J5rQkk0pj0J1PK2jj1oMj8QJ3
3478HMRKMj6j5lJ5j0%QKJ1k3J2qoj3J4K0Jjj7J3j5kKJ0RmRj5qJ2pmJ4JJ6Ok1k4
3520a0OJ1k0J6J2lMj5kOrJ7Lj7K3k0oRj1mJJ7J2rkLok0MJ4kK0k8J2oj3K2k3J9
3559ERmj2OqKpJ0Qmj6L2k1RrPrj0K6j9LNrk2J3J3J1%jRj1Nkj1QmQNokj2RmkOJ5
$$ plain form
3269 -19 -4 -2 14 15 13 -11 -2 -5 -11 -8 3 7 24 0 4 -7 -8 -6 -2 5 22 9 26 6 1 -8 -10 2 3 12 19 8 -7 11 -13 -5 -8 27 2 4 11 -5
3311 -5 -7 -11 -20 7 2 -5 -6 -5 -9 11 -6 -12 -11 -8 14 -3 10 -7 -5 -3 -13 -4 18 10 -6 9 11 0 -22 -19 -10 4 0 14 -7 -3 -3 -2 -17 1 6 13 12
3354 12 22 2 -10 9 -20 -3 0 15 11 -2 -3 -9 -10 -10 -13 5 0 11 -11 -1 7 -1 -7 -2 -7 -3 -7 9 18 6 10 8 7 8 9 9 21 16 7 2 -8 -9 -1 6
3398 6 9 13 1 11 -12 -19 1 -13 -4 15 2 12 -4 7 -14 -8 0 6 -3 17 -14 5 -8 -21 -4 2 1 24 22 25 22 -2 0 -16 -7 3 8 22 9
3437 9 7 -2 -1 -16 -8 6 2 13 20 8 -3 -4 -9 0 -19 4 9 -7 16 -17 -9 -21 -18 4 19 10 18 16 -4 -11 -21 -10 -3 19 18 7 1 5 -13 -5 8
3478 8 12 21 23 27 11 -4 -7 8 -2 -2 6 8 19 -4 8 0 -6 -19 -5 15 16 15 -2 11 -4 -6 -4 6 15 11 20 5 -3 9 2 -2 12 13 29 35 14 -10
3520 -10 -4 7 -13 3 15 12 16 1 -1 5 -4 13 16 -1 22 2 -4 5 -6 -10 -9 8 20 11 9 12 6 -14 -10 4 2 22 -6 6 0 -13 9 -14 5
3559 5 14 10 -2 4 -4 -2 -9 1 9 5 -11 21 0 9 0 7 -2 -12 14 -5 -2 3 -6 -28 -15 -2 9 9 8 17 6 11 9 -2 6 2 10 15 9 7 -5 4 0 -2 4 19
3605A9jj2mjonJ4oqL1j5j7NoJ4%jK1k4K0k9OLj7J7LPOj2%j5jJ5MlJ6Oj0j2j2J1
3646ApJ6oLlJ1k1moRJ9j4nJ1oj6J6%lJJ3r%PnmoK1JQj3MprJ6j9jKPlMJ7k5OoM
3692aLLJ5k5K0j4LqLpL2j1k0lKRkPJ5j1Oj2%mJ3L%Nk3J5Lj8qJ6oJ7kk5J5%NKj7
3735eKJ2oPj6j0PnNJ6j2J8qk2J2Rj2%J2K7m1%J8kQj0J6lKk3J6j4K5k6jJ6JJ2k7
3774bJ2Mj7JJ2Pj5J7Lj5PpJ0j6jj4K7k2oPmJ5J6rlj4K1onQKj2K0Nk9Jj1PK2Jm
3815A3qKj6oklM2k2J1Mjk6J4k7J4OJ4Kj6NJ0j3nLJ8Mj5K0rj6lj2RK0K1mj1jj3
3854CpLoL6lnpj9J4k7K5kJ4jjj9MkrOmK1qJ6rj3jqnPK7Lj5nJ4k5jLK1LlJ4j1n
3898A3pj6OOlJK0Ol7OlqK2KoK0lk2j1kjK3nJ2kPj4Jj3QqK2mRMk5j0lML7j6J5k6
$$ plain form
3605 19 18 6 2 1 -5 -10 4 -2 -10 21 6 -11 -6 -12 2 2 1 22 -2 18 -11 -5 -2 -19 -2 1 8 14 2 2 -13 -14 1 5 2 18 24 14 2 -10 1
3646 1 -6 10 4 7 4 15 -6 -10 -16 -7 12 -2 -7 4 -2 -18 -2 -2 -5 -4 9 0 0 7 2 -2 -8 13 14 22 9 13 6 -3 13 -6 -7 -5 2 -1 3 20 -5 1 -5 -1
3692 -1 2 5 20 -5 15 1 4 -4 -1 -8 24 13 -7 -10 -8 1 -1 6 21 10 16 4 4 0 13 16 16 21 -2 13 16 -2 -10 6 0 17 15 -10 5 5 10 12 -5
3735 -5 -3 9 3 10 -6 -16 -9 -14 -9 7 -5 13 5 -17 -5 4 -8 -8 4 31 -10 -10 8 6 14 4 20 17 19 -4 12 -2 23 -3 -4 12 13 25 -2
3774 -2 10 14 -3 -2 10 17 2 19 22 7 14 7 17 1 0 -14 13 -9 -15 -8 -12 3 19 10 7 -7 14 8 3 11 13 1 21 26 -3 -2 -13 -6 16 17 13
3815 13 5 7 -9 -15 -17 -20 22 0 11 15 14 -12 2 -25 -11 -5 9 11 -5 0 10 -3 -8 -5 13 17 2 22 13 -3 -6 -18 -9 11 32 28 17 16 3
3854 3 -4 -1 -7 29 26 21 14 -5 9 -18 7 5 19 18 17 -2 2 0 -9 -3 -7 14 6 22 13 0 -1 -9 -14 -7 20 23 8 3 17 -8 -9 -6 15 18 15 29 18 13
3898 13 6 -10 -4 2 -1 0 20 26 -11 -5 -8 -16 6 8 2 22 19 -3 -14 -16 -17 6 1 13 11 18 4 5 -8 0 -8 14 10 19 23 -2 -12 -15 -11 26 10 25 -1
3941aK4l0kQJJ0JrJ2lk0j5jK3rK7j9K0k1j4J6MnJ6RkLk6J9j0k4L1j0J0kJ1k1J1
3979A2k0OmJ2PPj3nj1mJ3j2OL5j4rjk8J4jMJ7nlJ8j4mj5M%K9j4%Qk4OpJ1J5j0
4019Fj5M3k3k6J6j7K0pJ4JkPk3j7kL2LoJ0JLj9Pj6oJ0K8Lk7%J9k1Jk0RJ8K5k6
4057CJ0nj8qRJ1QkqLpQj7NmM5j9j1jj9j3J9%PoK0kk7Oj9PJ3lJ1J9Nj0J1n9K8%
4098a0J2J2KNj7Kk1K2qMK1oNj7J5l8%MJ0oK3j%Mk2rNLJ9JJ2j6k6J1j9K2pK2K0
4137C3j8lj6nKRJ3J3l%j7jk2oRNOJ7K1j0j6l1QRNJ3m%Rl1Pj3J4mOQJ9nk8mn%K3
4180GJ3J2j4J3l5Mj0j0QJ8J4J2pk7Om3K8K1J4pKj1Mj7j3qRK9J0lkk2kookK8J4
4218B1J1rl4Mnj0J3K3RPj4k0qKmRJ1J1qJ2k2j4JnRK4jlPk2J0mj9QJ1K6rJlk7k1
$$ plain form
3941 -1 23 -7 -9 -1 0 10 11 2 14 11 -9 -24 -25 -2 -11 16 -3 17 -4 -18 -2 2 -3 13 22 20 23 -3 16 6 -18 13 3 13 11 22 1 12
3979 12 -8 -2 -6 6 13 20 7 2 -9 -13 0 -12 -6 29 15 6 5 -23 -9 -10 -6 11 6 3 21 7 3 -12 -8 -8 21 7 7 15 -9 -3 -10 1 16 6
4019 6 -9 34 11 -15 1 -16 4 -3 11 12 10 17 -6 -23 -25 7 10 4 14 15 18 -1 6 -10 -16 -6 22 25 -2 -2 17 -4 -3 -23 -14 4 29 3
4057 3 13 8 -10 -18 -9 2 10 8 0 3 -4 4 -13 -8 -12 33 14 3 2 -17 -30 -11 -11 -4 -10 10 8 -19 -13 -32 -25 -12 -15 -4 15 20 10 21 -38 -10 -10
4098 -10 2 14 16 21 4 6 -15 7 -1 3 24 18 23 6 21 -17 -17 -13 -3 -9 14 13 13 17 -5 -14 -9 -6 13 14 26 10 -16 -5 -24 -2 -9 13 33
4137 33 15 12 -4 -9 -7 2 15 28 25 25 8 7 -15 -21 -12 -7 -1 16 37 27 11 -20 -12 -3 2 15 11 11 20 -11 -4 -17 -3 -7 -1 7 26 21 -7 -11 -16 -16 7
4180 7 20 32 18 31 -4 0 -10 -20 -12 6 20 32 25 -2 4 -39 -11 10 24 17 19 8 12 -5 -18 -26 -17 12 22 19 17 -5 -7 -13 -19 -21 7 21
4218 21 32 23 -11 -7 -12 -22 -9 14 23 30 16 -4 -12 -10 -14 -5 6 17 9 21 -1 -15 -14 -19 -10 14 13 10 17 -5 5 1 -18 -10 1 27 18 19 16 -11 -32
4259c2K6QpK5%Ml7NjNmMK7k4Pj1Nk0J1MJ6%Mpj0j1qJ1RK2qj1Lplj6PL0Nk2K0j2
4301Gj5j6JNJ8J6lKj1j7QLJ4LOk1J7k3kJ4k4L1j6J3Nlrj1j6L0Jj8K7J0j8rj4j
4339a6J9ljJ8nk4K2j7pL0pM%nkLj8NLJ2QmOj5k8QNlK6RRk5Qk5oOLJ2lMjr%rJ0
4384cpJ9MK0pj2l0NMoK6nPn%mj9PK2k3J9K9j1m4Pj7PQK4j1jJ4j2j3k0L7j8J7%
4423Hj3L1l0Rqj8RJ3J1J0j1qj0j5J4QJ2J8k8K1pk8J3oRlJ1J1j3Nj6k8L2oJ7j6
4459bK0j9oJ2j3J1Nj9L3j9LmkmqkK0RoLoJjj9K3lJ7Kk6lJ3k3J1J1Mj3%Rj8Q%n
4501fJ4qK2rmj1j1NKJ4j0J0kkkNLrnj0J6Olk0K4qpK0pNP%k8Qj0J0JmK9k4Qrj2
4544a2j%lK1Jr%j4kJ7OK5k2J2k1LLj0k3RK8%J0roJ%oj1K6Qj0j7K4k7NrJ4N%kl
$$ plain form
4259 -32 -6 2 -5 20 20 24 -13 -8 -9 -4 -8 -4 23 -1 6 -5 0 -20 -9 -5 11 11 15 8 -2 -13 -21 -10 -1 21 13 2 5 -2 -5 -21 -14 16 21 -1 19 7
4301 7 -8 -24 -23 -18 0 16 13 15 4 -13 -5 -2 12 15 21 0 17 -6 -8 6 -18 13 -3 10 15 12 3 -8 -24 6 7 -11 16 26 8 -1 -15 -16
4339 -16 3 0 -1 17 12 -12 10 -7 -14 16 9 13 13 8 6 9 -9 -4 -1 11 19 15 21 6 -22 -14 -9 -12 14 23 32 7 15 -10 -16 -10 -7 5 2 6 5 -4 -4 -13 -3
4384 -3 -10 9 13 33 26 14 -16 -11 -7 -13 13 8 15 10 10 6 -13 -6 16 -7 12 41 30 -14 -7 -24 -17 -9 15 4 3 17 5 -8 -28 9 -9 8 8
4423 8 -5 26 -4 5 -3 -21 -12 1 12 22 11 3 -7 -22 -8 0 12 30 2 23 16 -12 1 -5 4 1 12 23 10 15 -1 -29 3 -3 14 -2
4459 -2 18 -1 -7 5 -8 3 8 -11 22 3 6 2 0 -4 -12 -14 6 15 9 12 6 7 6 -13 10 7 24 26 0 -3 10 -13 -2 9 13 0 0 9 -9 -1 -1 -6
4501 -6 8 0 22 13 9 -2 -13 -8 -6 8 -2 8 6 4 2 7 10 1 -4 -14 2 8 5 -15 9 1 -6 14 7 12 19 19 -9 -1 -11 -1 0 -4 25 1 9 0 -12
4544 -12 -13 -13 -16 5 6 -3 -3 -17 -19 -2 4 29 7 19 -2 1 4 -6 -29 -20 8 8 18 9 3 4 4 -2 -13 13 21 11 -6 18 -9 -4 -13 1 6 6 4 1
4586AJ0oj7jQNKLLLkj0j6J8KJ8%rPj1j6K3ok0K0J5j1j5Mj4NRNJ5k5kkQj6j3K3
4627ePKpK1k2mNj4K3pJJ5j2Lnj8J5QOJ7rqj6J0j7ljN4pl3MKopJ0pOJ7J0k7mOj4
4670a1j2K3K2j6mK5j6j7qnJ7mK2Mmj1qQnMJ7lJ5k6j6MmJ2j7L0knnmj0rjJ8PJ0
4710A5nlk6J4j1J6J2OPk3OlmrLRQJ3qrk7K1kNK2rJJj0j1qlPJ5LjnoJ6k7J%KK7
4754B0j6J9rnk1kJ9j3J9jkQlm1L5k3M0JonrkopLJ3PjqKj3J5j2%jJ5J2j4j0Oj4
4795a0NQlJ2P%k7MjkJ2J6qlRk1j6RMJMJ3Mj2ppLrRNK0j0jj7Nj3K0nQlJ4k6J1m
4839bj2J2nLJ0J1j7rMj5J4L1k4J2mLj4kmK0j6L2j3mJ1j2nk3RMJ1K4j9Nk3LNJ5
4877A6kj1M%Mj9%KKOjJK4j0l0MJ0JoJ8k%Jpk6J5J3KpOj0LokONJ5oPnpl4PQJ8l
$$ plain form
4586 1 11 5 -12 -13 -5 0 2 5 8 11 9 -1 -17 1 3 21 21 12 19 8 -8 15 9 -11 9 24 13 -2 2 -12 -7 2 7 22 -3 -5 -7 1 -15 -28 -5
4627 -5 2 4 -3 18 -4 -8 -3 -17 6 -1 0 15 3 6 1 -17 -2 6 12 29 20 12 -4 6 -11 -14 -15 39 32 -1 3 5 -1 -8 2 -5 1 18 28 1 -3 3 -11
4670 -11 -23 0 22 6 2 27 11 -6 -14 -19 -2 -6 16 20 16 5 -3 5 0 4 21 18 33 7 -9 -5 -9 3 -14 16 14 9 4 0 -10 -19 -20 -2 5 15
4710 15 10 7 -19 -5 -16 0 12 18 25 2 8 5 1 -8 -5 4 12 25 17 8 -19 2 0 5 27 18 19 20 10 -1 -9 -12 -5 10 13 12 7 1 17 -10 -9 -9 -7 20
4754 20 4 23 14 9 -12 -14 5 -8 11 10 8 16 13 -28 7 -16 24 25 19 14 5 3 -3 -10 -7 6 13 12 4 6 -7 8 -4 -4 -5 10 22 8 -2 4 -10
4795 -10 -5 3 0 12 19 19 -8 -4 -5 -7 5 21 13 10 19 -2 -18 -9 -5 -4 0 13 17 5 -2 -9 -6 -15 -6 -1 19 9 8 -9 -4 -17 3 -2 6 3 17 -9 2 -2
4839 -2 -14 -2 -7 -4 6 17 0 -9 -5 -20 -6 25 1 13 9 12 -2 -4 -8 12 -4 28 15 11 22 10 5 -18 -9 -5 6 30 11 16 -7 -4 1 16
4877 16 14 3 7 7 11 -8 -8 -6 -4 2 1 2 26 16 -14 -10 0 1 -5 13 11 11 12 5 -21 -6 7 9 2 8 -2 1 -5 -7 -1 4 19 13 20 15 8 -26 -19 -11 7 4
4923DJ0Nj5j3pJ6j9K1mJ4j1J0kj0J7j9RKoMJ0l6L1nj9K9j5J8oj9K%%oL4Nj9MJ0
4962B4j3l0NL0%qj8J2no%%%K5j8J2J9k2qj4J6J1Jjj0lK2l5J4PJ7%mj5Mr%ljNp
5003fK7j6j8J7Jk2J7mQJJJOk0J1oj0K9ljnmnJJ1kqJ5J4k3mpJ1k1L7k7J9j0rLn
5044fNj3J5%lRqRj5rlJ5RJ2lk4qmK3kNkjK0rkjj6MNjJ8j6J1j3J6mj6q%PJ7kk2
5088a1J6%j3QJLJ1qj1j0J3Nj0Qpjj1J0OOj0kJL4ok3jojj0K3mjjJ0qj1J3j1K5j7
5129aNnpJ2k5K0j4K1Nj1OQj9%LQPQ%Pj4j6lLK0j3J3qJ8k5Rk1K4qpJ6k3J8qj0q
5170a5pQJ5Kq%jKLk5K8j6K6mrJ0j8qNRQK2j9Nnjj3rK5jJ6jj3j0mPj5K3nnJJ4p
5213A0l2%J8kK6rjk0J1jj9J1mJ9%KJ3ol2J8kPLJ7oj1jl0J8%J9rJ0kj1kJ0j5JL
$$ plain form
4923 4 14 19 4 -9 -16 0 -19 2 -2 12 1 11 9 -1 16 -3 6 8 2 6 16 -20 11 6 -13 16 1 19 13 -6 -4 -4 -4 -10 24 29 10 14 24
4962 24 11 -19 -14 16 16 8 -10 2 -3 -9 -9 -9 -9 16 -2 10 29 7 -1 -15 1 12 13 12 2 -1 21 -14 0 7 24 24 20 5 9 0 0 -3 -4 1 -6
5003 -6 21 5 -13 4 5 -17 0 -4 4 5 6 7 13 -7 4 -2 -12 17 14 13 8 4 -1 0 11 9 1 16 30 7 3 -4 7 -14 23 -4 15 5 -4 -1 -6
5044 -6 -1 -14 1 1 -2 7 -1 8 -7 -16 -19 -4 5 17 14 -10 -18 -22 1 -1 4 2 1 21 12 10 9 -7 -3 2 1 19 3 14 1 17 13 -3 -11 -11 -4 13 11 -11
5088 -11 5 5 -8 0 1 4 15 7 -4 -14 -1 4 -6 2 -5 -6 -17 -7 -1 5 -5 -7 -6 28 22 -1 -2 -8 -9 -19 4 0 -1 -2 8 0 -11 2 -9 16 -1
5129 -1 4 -1 -8 4 -21 -1 -15 6 11 0 6 14 -5 -5 -2 6 13 21 21 28 14 -2 -5 -2 18 5 18 10 28 3 12 -9 15 7 0 16 -7 11 3 -7 -15
5170 -15 -22 -14 1 3 -5 -5 -6 -4 -1 -26 2 -14 12 8 -1 9 -9 -17 -12 -3 5 27 8 13 8 7 -6 -15 10 9 25 24 11 1 -3 4 -11 12 7 2 3 17 10
5213 10 -22 -22 -4 -6 20 11 10 -10 1 0 -19 -8 -12 7 7 9 22 16 -16 2 0 7 10 27 21 10 9 -21 -3 -3 16 7 17 15 4 2 12 -3 -2 1
5253AK0j3Jqoj9j2J6J0J7J1lKk2J0l4L0J7j2OLq%j2NpJ4K2j6K1k6mj6QmJ2J0J4
5291B8Ll0mrNJlK7MJ1m0Pl1J4J4j4K5J1rrmNj7j2L6%K6Jl4lj7jOL6NQrk4j7j2
5331b6QJ1J8PQml2Lj2J2OK1j1Mrlk3PPJ2j%J0%j0ppJ0%lK7mk2Kj9rnL3J3QRKk4
5374Gk7KRrJ8J3Mj9kj8qK5qK2LJpj9J0j6J3MJ0K3qj4qmJKPpL7mk0ol5MK3mJ4J0
5416A9nnnj6JLRJ1J4k4j4J6k9J2KJ5J8k5J7oJk8LmJ5K0J0j0j9j1JMnJ7K6qJ3l7
5454dNk3K9Nk2J5K8j7k3J8j8j3K1oJ3kJ5j5j3J%oK8%lJ4k2j8K5j8J4J5j3Pj1p
5490aOnoJ0J3oRk4MjrJ3rjJ1J4Lrk1j0J7J4k7K4Nj3J0j3j6J2pPJ7qN%j4mJ1nK3
5531A9%Qk%k0kqrJ2K2J0k2k0Mk3L3qJ2JJnj4OmPLJ8%rrOk2lRNJ1mNnOj5j1J9M
$$ plain form
5253 1 21 8 9 1 -5 -24 -36 -20 -10 7 18 15 17 -5 5 -29 1 18 6 12 15 7 7 -5 0 -7 7 29 13 34 8 4 -12 -4 -8 4 14 28
5291 28 31 1 -3 -12 -7 -6 -9 18 22 33 -7 0 -31 -17 -3 -17 8 19 10 1 -3 2 -15 -27 9 9 35 36 2 -1 -18 -19 -13 23 28 36 27 3 -14 -26
5331 -26 -18 -7 11 18 26 22 -10 -7 -19 -7 -1 20 9 13 4 1 -22 -15 -8 4 3 3 13 13 3 -4 -11 -1 -1 -4 23 19 -3 -1 -20 -29 -34 -1 12 20 29 31 7
5374 7 -20 -18 -9 -18 0 13 17 -2 -4 -22 -30 -5 -13 9 12 13 6 -13 -3 -19 -6 -2 8 31 23 9 1 -3 -2 0 7 0 37 33 13 7 -28 -24 -1 -5 9 19
5416 19 14 9 4 -12 -11 -8 1 12 26 2 -12 4 -25 -13 -11 4 22 -3 14 8 9 -19 -16 -20 -5 15 25 15 -4 -15 -14 -10 -15 2 28 20 33 -4
5454 -4 1 -22 7 12 -10 5 33 16 -7 11 -7 -20 1 -5 8 6 21 6 -7 -6 -6 -12 16 16 13 27 5 -13 12 -6 8 23 10 17 6 -1
5490 -1 5 0 -6 4 17 11 20 -4 0 -1 -10 3 -6 -7 4 18 21 12 -9 -19 -2 12 -15 9 14 1 11 -2 -18 -6 -13 -6 11 3 8 8 -6 -10 1 -4 19
5531 19 19 27 25 25 5 3 -5 -14 -2 20 30 8 -12 -8 -31 2 -6 6 7 8 3 -11 -5 -9 -2 1 19 19 10 1 7 -15 -18 -9 -4 7 3 8 3 9 -6 -17 2 6
5575FKJ5kk8NkMk2K7oPqNj3J6k0J6k2K1NJ0k0j2J3j5K6rK7k3Qrk4L4qj1K7lmJ
5614A4npj2QMJ1J1pmj6pj1J5OmK5Kk6j3QJ0j8kK9QJj4j2j7nJ5PJ1j4K4Qk2pk%
5654hQJ5J2j9O%k5j3J7J6KJ0nnro%j0J2KLJ0j1j2j6NJ5J6j3LJ0Pk4kNQj5K4mk
5694GJ1ml4J1MPJJ2pJ8k4j9mJ5J2KQmll5J9%qNjRJ3k2j0rjJ9K3NQRj4l0L%rNL3
5737B1Jl6J4Oj5kK5kQJ3k2qMj7OJQJ6qJj6k3MMJ5J0lJ2k0qlJ7j7%K3J8k4J2oL
5777A2qj1J9%J0oOj1j7k0J5K0J5oPPl4Mj7KJ0PJ0j3Nk2Rj7K2lJ1K0jl3lPmRJ4
5816A5LMPk3ml2J3J5J4JJ2Qk6Nj2lLRlQQl5J5j6lJ0LK3joj1omllK2nK1j1j3Nr
5858ej9ML4qQJQk0rjJ6mjP%J2j9qj2J2MK6j1pj3loJ4oj2J7J8jk2k1NPlJ1J6J3
$$ plain form
5575 6 8 23 21 -7 -2 -4 0 -22 5 -1 6 -2 3 -10 6 -14 2 -20 1 6 16 -4 -16 -3 -18 8 -1 26 3 11 2 -22 12 4 -7 20 17 13 14
5614 14 9 2 -10 -2 2 13 24 17 13 -3 -10 -21 -6 0 -4 21 23 -3 -16 -8 2 -16 -18 11 19 20 6 -6 -23 -28 -13 -6 5 -9 15 23 1 -6 -8 -8
5654 -8 0 15 27 8 14 14 -11 -24 -7 9 11 21 16 11 2 -4 -4 -14 -2 0 3 13 2 -10 -26 -21 -6 10 -3 0 10 17 -7 -9 -4 4 -11 13 9 7
5694 7 18 14 -20 -9 -5 2 3 15 8 26 2 -17 -21 -6 6 8 16 12 9 -26 -7 -7 -15 -10 -11 -2 11 -11 -21 -30 -31 -12 11 16 24 33 19 -11 -8 -8 -17 -12 21
5737 21 22 -14 0 6 -9 -11 14 12 20 33 11 3 7 -10 -4 -3 5 21 13 14 -2 -25 -21 -17 -2 8 5 17 -3 -11 -14 3 -14 -14 9 27 3 15 9 12
5777 12 4 -7 12 12 22 16 22 11 -6 -26 -11 9 24 18 25 32 -2 2 -15 -13 -3 4 14 1 6 -16 -7 -24 -2 -5 6 26 25 -8 -11 -4 -8 1 15
5816 15 18 22 29 6 2 -30 -17 -2 12 13 25 33 7 12 0 -3 0 9 6 14 22 -13 2 -14 -17 -7 -4 19 18 12 1 -5 -9 -12 -15 7 2 23 12 -1 4 -5
5858 -5 -24 -20 14 6 14 15 23 3 -6 -7 9 5 4 11 11 23 4 -4 -16 -4 0 26 15 8 -5 -8 -14 0 -6 -18 -1 17 16 -6 -27 -22 -15 -18 -7 9 22
5899B2Kj4j0rPnJ6J1Lqk7j1JlJ6J4rL0k7mj0lmJ3J8pKK3k9j3%j8J9J1OoK5j8j0
5938fqkOQOK1k4Pmj2qK4Mk0J7nj6Oj3LJ2MJ1Rok3k1J2J0NJ0K3k9lKk1mK6mJ9q
5979HNl1J7Nk3RK3mpJ3pjk2J1MJ0MKjmm1J3MJ9QKj1rjJj2mKK4PLNj4j7k0J6K7
6021A3k1K9j7lKk7QJL5j0J4Mk0j7jjJ2pJ5jL0k3k3jk3K7J1L%Ok0j1oj3K0NPNJ0
6060A2rPk2JrK0LNKj9LKj7K5oJ0J0j0J0j1pj2K3j6PK3rj8Nj1kJ1qJ4mKRk8j2%
6100b6J6oJ3mK3j1mj2lLMOJ4Qk8knmPJ0J5j2MjJj9J8qoMK3k4PoprQK7k5J0%kj1
6143a4Pj3QJJ6Qj5Llj3K3Nj7J5J2pmj5j0J2nK4j1J1%j5Oj4j2J9oKPJ3ok0mMmJ3
6183ANmkJj7MK0k3K2Oj0j2Pj8K1j4J7J0oJ1j4j1KkJ3lJ0Lqj6lJ0j7J0J1lK1Pk1
$$ plain form
5899 22 24 10 0 -9 -2 -7 9 20 23 15 -12 -23 -22 -25 -9 5 -4 26 -1 -5 -15 -18 -22 -9 9 2 4 27 -2 -15 -15 -33 -14 -3 3 -3 22 4 -6
5938 -6 -14 -16 -10 -2 4 25 1 8 4 -8 -16 8 12 -8 9 4 -12 -6 -19 -16 -4 0 11 20 14 -9 -30 -18 -8 -3 7 30 1 -2 0 -21 -25 1 -3 16 8
5979 8 13 -18 -1 4 -19 -10 13 9 2 15 8 7 -15 -4 0 10 14 16 15 11 -30 -17 -13 6 14 16 5 -4 -5 -4 -16 -20 -18 6 13 16 21 7 -10 -30 -14 13
6021 13 -8 21 4 1 3 -24 -16 -15 20 10 24 28 8 -9 -10 -11 1 -6 9 8 38 15 -8 -9 -32 -5 6 9 9 15 -5 -16 -22 -35 -15 -10 -3 2 12
6060 12 3 10 -12 -11 -20 0 3 8 10 -9 -6 -4 -21 4 -2 8 18 8 18 7 0 -12 11 -5 2 25 16 -2 3 -8 -10 1 -7 7 3 5 14 -14 -26 -26
6100 -26 -10 -16 -3 -7 16 5 1 -11 -14 -11 -7 -1 13 21 -7 -9 -14 -18 -11 -1 14 2 6 5 6 -13 5 -3 -9 -5 18 -6 1 -5 -12 -21 -13 14 -11 -1 -1 -3 -14
6143 -14 -7 -20 -12 -11 5 13 -2 1 -2 -15 8 13 -4 11 23 16 12 -3 -13 -1 -6 18 7 18 18 3 9 -5 -17 2 -4 -2 5 18 12 -8 -12 -8 -12 1
6183 1 6 2 0 1 -16 -12 8 -15 7 13 3 -9 -2 -20 1 -13 4 14 8 19 5 -6 -4 -6 7 4 14 17 9 -7 -10 0 -17 -7 4 1 22 29 8
6222Hk8qoJ9QKQlmj2mMpK5PJ0Jj0j4mj6J6J3LK1j7qj1J0rpK9jnLj5j6MrJ4NK0
6264A6qPj1j2jMqjK7l%mj3j3J9mJ6K1j9Qqk5MJ5k1K0RPJ5l7j5J1lOpJ4nK1k0q
6304f%%MKO%jOk0j6K1j3J9J6Rk3jj3l%J6J0Kj0Qk3rOJ3J4nJkJ2mk8klK3j0LRj2
6347dKkmpK3Okj2JKj1j6J5kJ4LM%mj7nRLJ2J0j3lj6J7j4OJ2MJ0lj8Lj2j0PJ5N
6389HQJj7pjj0RJ8kK3j9j2j1oLJ5j4M2j8nnqj4J1J6qRNlQj1qJJK4%Lk1Lk6lJ6
6431eqROJ2kqj5mnRJ2J3Jj4rj1lJ2LQJ6Kj6J5l2LQkJ3jJ8j8J6l5lJ1QJ3qJ2j4
6472Gqj7J3Qk5K7Oj1Oj3jj2jK6nmRMj9mRLqNK4j9Rj1J2l2K2JJ2%koJ3j8qOMkl
6515cK1j9mk0lNJ3PK3j7J9k2j8NjRj0K0llj8PMJ0MRMNj1k7oJ2kKJ7mJ6l1K3k0
$$ plain form
6222 8 -20 -28 -34 -15 -7 -5 3 0 -4 -16 -20 -16 -23 2 9 19 20 10 -4 -8 -24 -8 5 8 29 12 4 -7 3 -6 -13 16 15 10 13 -2 -18 -14 -23 -9 -4 16
6264 16 8 15 4 -8 -9 -5 -13 -14 13 10 10 6 -7 -20 -1 -5 11 32 13 21 13 -12 -8 7 -14 6 15 22 37 0 -15 -4 -7 -1 -8 6 1 22 2 -6
6304 -6 -6 -6 -2 0 6 6 5 11 -9 -25 -4 -17 2 18 27 4 3 -10 -13 -13 3 13 15 5 13 -10 -19 -13 0 14 9 10 8 20 16 -12 -14 -17 6 -4 -1 8 -4
6347 -4 -2 -4 -8 -15 8 14 12 0 1 3 -8 -24 -9 -11 3 6 10 10 6 -11 -16 -7 -4 8 18 5 2 -14 3 -11 -5 7 11 21 18 0 3 -9 -19 -12 3 8
6389 8 16 17 0 -7 -8 -18 -9 9 7 30 11 -1 -12 -18 -15 0 -14 28 10 5 0 -8 -22 -11 5 -3 6 11 8 16 5 -3 -2 -1 23 23 26 5 8 -18 -21 -5
6431 -5 -13 -4 2 14 12 4 -11 -15 -20 -11 1 14 15 1 -8 -19 -22 -10 -7 1 17 19 3 18 -14 -11 -3 -5 8 7 25 7 23 -12 -15 -4 4 17 9 21 7
6472 7 -1 -18 -5 3 -22 5 11 0 6 -7 -8 -20 -21 5 0 -4 5 9 -10 -14 -5 -2 -10 -5 19 0 9 -2 10 -22 0 1 13 13 11 5 18 0 -8 -2 2 0 -3
6515 -3 18 -1 -5 -25 -28 -23 -10 -3 20 3 22 0 -18 -13 -14 -5 -15 5 2 -1 -19 -12 -8 2 6 15 19 24 13 -14 -20 -8 -10 -8 9 5 21 -10 13 -7
6555gJj1J4J0j6LLk3KJ6kRPMNoj8%knK9oj0J0Pj0j0jjQJ1%qJ2j1j2lJ0ooJ9Jj3
6598fj7J1j2L2j3J5j4jkj3K4j8J0JJ4jOj9k0Q%QK0k3L0k0llPpljJ8j3pjJ2j6Q
6637ikMJ1j3K1l7K6j4rJ5J1noK1k1PNnj2QJ7qJk3kLJ0PjK2j0j8k0K3%Nj2K0mL
6677Ijj2llRnkjJ7k3Mj1j0NJ9PpLJlj5%lJ4J8j0K5nqJl1J0MOlK1qlLk8JKJ3oR
6722@oKl%k2K4J3j1k6K8jj5K1j9MJ4Jj1kJ6pkmJ6qJ7j0pj4%K9m0K7J8k9J8Nj9
6760cKnj4QJ0J6pk3Qj1RoPMj2J2j0%MJPkJ7j2JmLJKMjj1J7Kk1MlOk2K9j0kL6m6
6804a5LMJ1l2J3K4j2Pk8Oj2J8J5j7QJ4j3j3J4j2nK3j6K2NJ%j8Lk0J5KQnNj3nK3
6842Hk6J6j6ML1j7j0j0prJ4J6J8Jk1%mNj9K5Jj2LOPj4j%Qj2L0Qk3ljOpJ2kMnQ
$$ plain form
6555 -7 -6 -17 -3 7 -9 -6 -3 -26 -24 -8 -10 -1 6 10 15 9 -9 -9 -11 -16 13 7 -3 7 14 4 -6 -7 -8 0 11 11 3 15 4 -8 -11 -1 -7 -13 6 7 -6
6598 -6 -23 -12 -24 8 -5 10 -4 -5 -7 -20 4 -14 -4 -3 11 10 16 -3 -23 -15 -15 -7 13 -10 20 0 -3 -6 1 -6 -9 -10 8 -5 -12 -13 -1 -17 -9
6637 -9 -11 -7 4 -9 12 -25 1 -13 -22 -7 4 -1 -7 14 -7 0 5 0 -12 -4 13 5 6 -17 -19 -16 -6 1 0 22 12 -6 -26 -3 -3 2 -10 10 6 9
6677 9 8 -4 -7 -10 -1 -6 -8 -9 8 -15 -11 -22 -32 -27 -8 -1 -8 -5 -4 -7 -22 -22 -25 -11 7 -3 22 17 9 10 -21 -11 -7 -1 -4 17 9 6 9 -19 -18 -16 -3 -9 0
6722 0 -6 -4 -7 -7 -29 -5 8 -3 -29 -1 -2 -17 4 -15 -11 3 4 -7 -9 7 0 -2 -6 10 2 19 9 2 -12 -12 17 -23 4 22 -7 11 16 -3
6760 -3 -1 -6 -20 -12 -2 14 7 -16 -8 -19 -10 -16 -9 -5 -17 -5 -15 -15 -11 -10 -3 -5 12 0 1 -3 0 1 3 7 6 -5 12 14 -7 -3 -6 0 -22 7 -3 -5 31 -15
6804 -15 -12 -8 3 -29 -16 8 -4 3 -25 -19 -31 -13 2 -15 -7 7 -6 -19 -5 -17 -22 1 -15 7 12 13 13 -5 -2 -22 -7 -5 3 -2 3 -10 -15 8
6842 8 -18 -2 -18 -14 17 0 -10 -20 -27 -36 -22 -6 12 13 -8 -8 -12 -7 -26 -1 0 -12 -9 -3 4 -10 -11 -11 -3 -15 15 23 0 -3 -4 2 -5 7 5 9 4 12
6884A2jk6MlkQJ2K1n1jJ5oQKK1j5MrLk3J3jj0L5j6J1qjj7J4PpJ3rJ4j6J0j8Rn
6924ij%K0j5nRk0LNJ5kQk2ljmJ8j0mOJ5jmOnKqM%J1J3l3J5Nj0RKj5LK1k1LrmK
6969a1PMk0L3j7J0j7JJ0j6OK1j5j4L1k4nlJ0J1rOpL%KjoKJ5k5L0k2LJ4lj4J0N
7008ErK4j8j1QjqJ2PKj6okJj3J8JoJ8j9J9j2kQ%jNj0olLJ5%j1lL6k8RPk9P%RN
7052EKk4k2K7Mn%MJ2mlLj7J3j0%QJ2nj0kk0K4Nj7K6J2l1J8qprOJ3%Nj2KrQj1J3
7094dJ1j7mJ6pqJ0moJ7qmNKj7nj2L0lJ5oloJqQj0J7J3rqmJ0j1j0J5mJ9j6J6ok2
7136a7%P%QK2j8Mj0Rj2Lj6J9PJ3k0orkj0K0PK3k2Pj7JPmMnK3j0j1K1k8J6mRj1
7176bKKnojj3pJ3J2RKqkmj1jjK3k2J1mj0mJ8rJ9RkJrk6J8k6L7KJ7mj4pjj2nJ1
$$ plain form
6884 12 11 -15 -11 -14 -16 -8 4 25 -26 -27 -12 -18 -10 -8 13 -2 2 -7 -4 -27 -14 -15 -25 10 -6 5 -3 -4 -21 -7 0 -7 6 -3 11 -5 5 -13 -4 -9
6924 -9 -10 -10 10 -5 -10 -1 -21 -18 -13 2 0 8 -14 -17 -18 -22 -4 -14 -18 -12 3 2 -2 4 -1 1 -7 -3 -3 8 21 -12 3 8 -2 7 9 -6 -3 18 -3 0 -9 -13 -11
6969 -11 -4 0 -20 13 -4 6 -11 -10 0 -16 -10 11 -4 -18 13 -11 -16 -19 -9 2 -7 -1 -8 -5 -5 -3 -4 -10 -8 7 -18 12 -10 -7 7 4 -10 0 5
7008 5 -4 20 2 -9 -1 -2 -10 2 9 11 -5 -11 -13 -12 -25 -7 -6 -12 6 -13 6 -6 -8 0 0 -1 4 -6 -12 -15 -12 3 3 -8 -11 25 -3 6 13 -16 -9 -9 0 5
7052 5 7 -17 -39 -12 -8 -13 -13 -9 3 -1 -4 -1 -18 -5 -15 -15 -7 5 0 -10 -12 -32 -8 -3 -20 6 18 -13 5 -3 -10 -19 -13 0 0 5 -7 -5 -14 -6 -17 -4
7094 -4 7 -10 -14 2 -5 -13 -3 -7 -13 4 -4 -8 -3 -1 -18 -23 -35 -5 -8 7 1 -2 -8 -7 -15 -7 -17 0 13 4 -4 -8 2 -9 -19 -4 -8 11 -5 11 5 -17
7136 -17 -17 -10 -10 -2 20 2 6 -4 5 -7 -4 -20 -1 6 19 -1 -7 -16 -18 -28 -8 -1 22 0 7 -10 -9 -2 -6 -2 -7 16 6 -5 16 -12 4 0 9 -2
7176 -2 0 2 -3 -9 -10 -23 -30 -17 -5 4 6 -2 -4 -8 -19 -20 -21 2 -20 -9 -13 -23 -27 -9 -18 1 10 8 9 0 -26 -8 -34 3 5 22 18 4 -3 -4 -16 -21 -10
7219a0QK6k5JjOl0J8kJ9j0%rnNj9lK4j5J6PJjkk0J6j8J3MK7j5Oj7M%%mK2jmj1
7260AlMj0KjNMJk2J5jj7J6J0rJ2k3j%r%MPJ6J1j0jk7j3L7nOLJj4K0k4OJ5Jk0K0
7302GRj1k2mJ5NPqPOk2%j7JQK0j6K3j0Nmj4Qj5J5K4k1Rrj1%JKJ7kOj3rkPlj2K1
7345bNQKkpj8PJ2JknKk2%oLQJ1%J4plj7mJ3oJJ4Oj4J2Pj3J0JoJ6pk3K0j1Lj0P
7389bMj5J9Lj3QpMj6KJ1lMj1nkJ8J0j3jj1J7j6QjLK3l3J9J0KJ2l0nJ7mpJ0kj2
7429eJJNqJ1mMqj3J7j9J1Lj6K4Pqk6NnLK9jPj4kmrQoJ4%NnK3k3j5J3Oj3J2mJj4
7473a2J9nj9LjJ0%J4k3MpQOjRj6MMj6QMo%QJ0Rj3Nj6pJ7LJ5j4J3k5J2LnkpPNj
7517Dnj1pQk6J9RMJ1j7JKlkLJ0j0PNj2nJ2MlnJJ7j1KpNNjNRnjk7j5J5OmP%PmJ0
$$ plain form
7219 -10 -2 24 -1 0 -1 5 -25 -7 -9 10 0 0 -9 -14 -9 -28 -31 -7 -22 -6 1 2 1 -1 -21 -5 -23 -10 -6 21 6 12 -5 -1 -1 -1 -5 17 16 12 1
7260 1 -2 2 -8 -6 -7 -2 2 3 -19 -4 -5 -22 -6 4 -5 7 -16 -17 -17 -26 -26 -22 -15 1 12 2 1 -26 -39 -2 -7 -1 2 3 -11 9 -15 -9 6 7 -13 7
7302 7 16 5 -17 -21 -6 -1 6 -2 5 11 -11 -11 -28 -27 -19 1 -15 8 -2 3 -1 -15 -7 -22 -7 17 -4 5 -4 -15 -15 -14 -12 5 3 9 -4 -13 -15 -8 -11 -23 -2
7345 -2 3 11 13 11 4 -14 -7 5 6 4 -1 1 -21 -21 -27 -24 -16 -5 -5 9 2 -1 -18 -22 -9 -15 -14 0 6 -8 4 11 -2 8 9 3 19 12 -11 9 -2 1 -9 -2
7389 -2 2 -13 6 9 -4 4 -3 1 -15 -13 -2 -5 -1 -12 -17 -19 -1 9 -4 -5 -16 1 -15 -7 -8 -5 18 -15 4 14 16 28 -2 -7 10 6 -1 9 7 -5
7429 -5 -4 -3 2 -6 5 1 5 -3 -16 1 -18 -7 -4 -20 4 11 3 -23 -18 -23 -20 9 8 15 1 -1 -5 -14 -6 -12 2 2 7 2 25 2 -13 0 6 -7 5 1 2 -12
7473 -12 7 2 -17 -14 -15 -5 -5 9 -14 -10 -17 -9 -3 -4 5 -11 -7 -3 -19 -11 -7 -13 -13 -5 5 14 1 6 -10 -17 0 3 18 4 17 -8 4 7 2 0 -7 0 5 4
7517 4 -1 -12 -19 -11 -37 -18 -9 -5 6 -11 -10 -8 -11 -13 -10 0 -10 -3 2 -10 -15 -3 1 -2 -7 -6 11 0 2 -5 0 5 4 9 18 13 12 -15 -30 -15 -9 -13 -6 -6 1 -3 7
7564Gk7Kk3K9J9j5j1O%MMJj8J0K2nj0Klj8J9J2j3J0jJj0JpjK2rPNlj3Pj7QnJ4
7605CoJ5k1oP%j0LK4j1Nj8%LlqPL0j3Oj1LrJ0j1QJ9j2oJ5j9J0Ok0NkK3k6J9k8
7645a9J2Nj1QJ7oj4Rj7J0j1nPJ5pj5LjJ1mkJ7lPj5J3njloJ1KjJPj8nJ4OJKkj2
7688ekMj6KljK4jrj2nLmJ5NJ6j2%j7J3KjrK6J2j4j0j7J4j2OjJ9plmJ3rj6RJ7k2
7730a2RoNomJ1Mj9K0knJrJj0J7j0K7l3J4olpJ6rJ7j2J7jj4J2j6J4Oj7J2Jj6J1
$$ plain form
7564 7 -20 -18 -41 -12 7 -8 -19 -13 -13 -9 -5 -4 -22 -12 10 5 -5 -3 -6 -24 -5 7 -6 4 3 4 -6 -5 -12 -13 9 0 7 12 9 -4 3 -14 -6 -11 3
7605 3 -3 12 -9 -15 -8 -8 -18 -15 9 -2 3 -15 -15 -12 -15 -23 -16 14 1 7 -4 -1 -10 0 -11 -3 16 4 -2 13 -6 4 10 -10 -5 -7 16 -10 9 -19
7645 -19 -7 -2 -13 -5 12 6 -8 1 -16 -6 -17 -22 -15 0 -7 -22 -19 -20 -9 -13 -15 2 -1 6 -9 4 -1 -2 -5 -11 0 2 1 2 9 -9 -14 0 6 7 9 7 -5
7688 -5 -7 -3 -19 -17 -20 -21 3 2 -7 -19 -24 -21 -25 -10 -5 11 -1 -1 -18 -5 -3 -4 -13 13 25 11 1 -16 -2 -14 -8 -9 10 3 0 -4 9 0 -16 -7 10 -12
7730 -12 -3 -9 -4 -10 -14 -3 1 -18 2 0 -5 -4 -13 -12 -22 -5 -15 12 -21 -7 -13 -16 -23 -7 -16 1 -11 6 5 -9 3 -13 1 7 -10 2 3 -13 -2
$$ [...]
8191a2
##END NTUPLES=NMR FID
##END=
