##TITLE=1H_AM_NV119
 CDCl3
 8 sc, 
 9.2.2024
##JCAMPDX= 6.0         $$ Bruker NMR JCAMP-DX V2.0
##DATA TYPE= NMR FID
##DATA CLASS= NTUPLES
##ORIGIN= UXNMR, Bruker Analytische Messtechnik GmbH
##OWNER= root
$$ XWIN-NMR		Version 3.5
$$ Fri Feb  9 14:25:50 2024 Russian Standard Time (UT+4h)  she@DPX200
##.OBSERVE FREQUENCY= 200.1313
##.OBSERVE NUCLEUS= ^1H
##.DELAY= (6, 6)
##.ACQUISITION MODE= SIMULTANEOUS
##.ACQUISITION SCHEME= undefined
##.AVERAGES= 8
##.DIGITISER RES= 18
##SPECTROMETER/DATA SYSTEM= spect
##.PULSE SEQUENCE= zg30
##.SOLVENT NAME= DMSO
##.SHIFT REFERENCE= (INTERNAL, DMSO, 0, 15.7039)
##AUDIT TRAIL= $$ (NUMBER, WHEN, WHO, WHERE, WHAT)
$$ ##TITLE= Audit trail, XWIN-NMR		Version 3.5
$$ ##JCAMPDX= 5.01
$$ ##ORIGIN= Bruker BioSpin GmbH
$$ ##OWNER= she
$$ F:/spectra/data/she/nmr/H-F/1/audita.txt
$$ ##AUDIT TRAIL=  $$ (NUMBER, WHEN, WHO, WHERE, WHAT)
(   1,<2024-02-09 14:24:31.81 +0400>,<she>,<DPX200>,
      <created by zg, POWCHK disabled, PULCHK disabled
       configuration hash MD5:
       00 E9 B6 7A A2 85 ED C7 34 08 36 98 17 FE 4E 26
       data hash MD5: 16K
       3B 41 54 57 7E 2C F1 87 F0 B5 B4 D8 FF EF 80 36>)
$$ ##END=
$$ 
$$ hash MD5
$$ B6 D3 88 B6 28 10 AF 69 53 E0 22 39 7E F7 46 38
##$RELAX= 
##$RELAX= 
##$RELAX= 
##$RELAX= 
##$RELAX= 
##$RELAX= 
$$ Bruker specific parameters
$$ --------------------------
##$DU= <F:/spectra>
##$EXPNO= 1
##$NAME= <H-F>
##$PROCNO= 1
##$TYPE= <nmr>
##$USER= <she>
##$AMP= (0..31)
100 100 100 100 100 100 100 100 100 100 100 100 100 100 100 100 100 100 
100 100 100 100 100 100 100 100 100 100 100 100 100 100 
##$AQSEQ= 0
##$AQ_mod= 1
##$AUNM= <au_zg>
##$AUTOPOS= <>
##$BF1= 200.13
##$BF2= 200.13
##$BF3= 200.13
##$BF4= 200.13
##$BF5= 200.13
##$BF6= 200.13
##$BF7= 200.13
##$BF8= 200.13
##$BYTORDA= 1
##$CFDGTYP= 0
##$CFRGTYP= 5
##$CHEMSTR= <none>
##$CNST= (0..31)
1 1 145 1 1 1 1 1 1 1 1 1 1 1 1 1 1 1 1 1 1 1 1 1 1 1 1 1 1 1 1 1 
##$CPDPRG= <>
##$CPDPRG1= <>
##$CPDPRG2= <>
##$CPDPRG3= <>
##$CPDPRG4= <mlev>
##$CPDPRG5= <mlev>
##$CPDPRG6= <mlev>
##$CPDPRG7= <mlev>
##$CPDPRG8= <mlev>
##$CPDPRGB= <>
##$CPDPRGT= <>
##$D= (0..31)
0 1.2 0 0 0 0 0 0 0 0.06 0 0.03 0 0 0 0 0.0002 0 0 0 0 0 0 0 0 0 0 0 0 
0 0 0 
##$DATE= 1707474271
##$DBL= (0..7)
120 120 120 120 120 120 120 120 
##$DBP= (0..7)
150 150 150 150 150 150 150 150 
##$DBP07= 0
##$DBPNAM0= <>
##$DBPNAM1= <>
##$DBPNAM2= <>
##$DBPNAM3= <>
##$DBPNAM4= <>
##$DBPNAM5= <>
##$DBPNAM6= <>
##$DBPNAM7= <>
##$DBPOAL= (0..7)
0.5 0.5 0.5 0.5 0.5 0.5 0.5 0.5 
##$DBPOFFS= (0..7)
0 0 0 0 0 0 0 0 
##$DE= 6
##$DECBNUC= <off>
##$DECIM= 32
##$DECNUC= <off>
##$DECSTAT= 4
##$DIGMOD= 1
##$DIGTYP= 9
##$DL= (0..7)
0 120 120 120 120 120 120 120 
##$DP= (0..7)
150 150 150 150 150 150 150 150 
##$DP07= 0
##$DPNAME0= <>
##$DPNAME1= <>
##$DPNAME2= <>
##$DPNAME3= <>
##$DPNAME4= <>
##$DPNAME5= <>
##$DPNAME6= <>
##$DPNAME7= <>
##$DPOAL= (0..7)
0.5 0.5 0.5 0.5 0.5 0.5 0.5 0.5 
##$DPOFFS= (0..7)
0 0 0 0 0 0 0 0 
##$DQDMODE= 0
##$DR= 18
##$DS= 0
##$DSLIST= <SSSSSSSSSSSSSSS>
$$ [...]
##$SUBNAM2= <"">
##$SUBNAM3= <"">
##$SUBNAM4= <"">
##$SUBNAM5= <"">
##$SUBNAM6= <"">
##$SUBNAM7= <"">
##$SUBNAM8= <"">
##$SUBNAM9= <"">
##$SW= 18.0517328524113
##$SWIBOX= (0..15)
0 0 2 0 0 0 0 0 0 0 0 0 0 0 0 0 
##$SW_h= 3612.71676300578
##$TD= 16384
##$TD0= 1
##$TE= 0
##$TE2= 300
##$TE3= 300
##$TEG= 300
##$TL= (0..7)
0 120 120 120 120 120 120 120 
##$TP= (0..7)
150 150 150 150 150 150 150 150 
##$TP07= 0
##$TPNAME0= <>
##$TPNAME1= <>
##$TPNAME2= <>
##$TPNAME3= <>
##$TPNAME4= <>
##$TPNAME5= <>
##$TPNAME6= <>
##$TPNAME7= <>
##$TPOAL= (0..7)
0.5 0.5 0.5 0.5 0.5 0.5 0.5 0.5 
##$TPOFFS= (0..7)
0 0 0 0 0 0 0 0 
##$TUNHIN= 0
##$TUNHOUT= 0
##$TUNXOUT= 0
##$USERA1= <user>
##$USERA2= <user>
##$USERA3= <user>
##$USERA4= <user>
##$USERA5= <user>
##$V9= 5
##$VALIST= <valist>
##$VCLIST= <CCCCCCCCCCCCCCC>
##$VD= 0
##$VDLIST= <DDDDDDDDDDDDDDD>
##$VPLIST= <PPPPPPPPPPPPPPP>
##$VTLIST= <TTTTTTTTTTTTTTT>
##$WBST= 1024
##$WBSW= 4
##$XGAIN= (0..3)
0 0 0 0 
##$XL= 0
##$YL= 0
##$YMAX_a= 263704
##$YMIN_a= -216214
##$ZGOPTNS= <>
##$ZL1= 120
##$ZL2= 120
##$ZL3= 120
##$ZL4= 120
##$ABSF1= 10
##$ABSF2= 0
##$ABSG= 5
##$ABSL= 3
##$ALPHA= 0
##$AQORDER= 0
##$ASSFAC= 0
##$ASSFACI= 0
##$ASSFACX= 0
##$ASSWID= 0
##$AUNMP= <proc_1d>
##$AZFE= 0.1
##$AZFW= 0.1
##$BCFW= 1
##$BC_mod= 2
##$BYTORDP= 1
##$COROFFS= 0
##$CY= 11.3945322036743
##$DATMOD= 1
##$DC= 2
##$DFILT= <>
##$DTYPP= 0
##$F1P= 15.7292609196834
##$F2P= 12.9074282941183
##$FCOR= 0.5
##$FTSIZE= 0
##$FT_mod= 4
##$GAMMA= 1
##$GB= 0.15
##$INTBC= 1
##$INTSCL= 1
##$ISEN= 128
##$LB= 0.24
##$LEV0= 0
##$LPBIN= 0
##$MAXI= 10000
##$MC2= 0
##$MEAN= 0
##$ME_mod= 0
##$MI= 1.114404
##$NCOEF= 0
##$NC_proc= 0
##$NLEV= 6
##$NOISF1= 3.799351
##$NOISF2= 2.8
##$NSP= 1
##$NTH_PI= 0
##$NZP= 0
##$OFFSET= 15.70392
##$PC= 1
##$PHC0= -24744.88
##$PHC1= 19.45268
##$PH_mod= 1
##$PKNL= yes
##$PPARMOD= 0
##$PSCAL= 0
##$PSIGN= 0
##$REVERSE= no
##$SF= 200.130013532006
##$SI= 16384
##$SIGF1= 3
##$SIGF2= 2
##$SINO= 400
##$SIOLD= 16384
##$SREGLST= <1H.CDCl3>
##$SSB= 0
##$STSI= 0
##$STSR= 0
##$SW_p= 3612.71676300578
##$SYMM= 0
##$S_DEV= 0
##$TDeff= 0
##$TDoff= 0
##$TI= <>
##$TILT= no
##$TM1= 0
##$TM2= 0
##$TOPLEV= 0
##$USERP1= <user>
##$USERP2= <user>
##$USERP3= <user>
##$USERP4= <user>
##$USERP5= <user>
##$WDW= 1
##$XDIM= 8192
##$YMAX_p= 0
##$YMIN_p= 0
$$ End of Bruker specific parameters
$$ ---------------------------------
##NTUPLES= NMR FID
##VAR_NAME=  TIME,          FID/REAL,        FID/IMAG
##SYMBOL=    X,             R,               I
##VAR_TYPE=  INDEPENDENT,   DEPENDENT,       DEPENDENT
##VAR_FORM=  AFFN,          ASDF,            ASDF
##VAR_DIM=   8192,          8192,            8192
##UNITS=     SECONDS,       ARBITRARY UNITS, ARBITRARY UNITS
##FACTOR=    0.0002768,     1,               1
##FIRST=     0,             0,               0
##LAST=      2.2672688,     0,               0
##MIN=       0,             -216214,         0
##MAX=       2.2672688,     263704,          0
$$ Real data points
##PAGE= N=1
##DATA TABLE= (X++(R..R)), XYDATA
0@%%%%%%%%%%%%%%%%%qJ6j6J6j6J7k5L2l3L9m6N2o0O9q0R2j04J17j32J48j66J87
$$ 0 0 0 0 0 0 0 0 0 0 0 0 0 0 0 0 0 0 -8 8 -8 8 -8 9 -16 16 -17 22 -24 28 -32 37 -43 49 -55 62 -70 78 -88 99
39I9k08K32k60K88l18L51l88M30m76N26n79O36o99P71q50R37j037J149j277J423
$$ 99 -109 123 -137 151 -167 184 -204 226 -250 276 -303 333 -366 405 -445 492 -545 604 -673 750
59G50j593J798k046K350k737L250l970N057o921J1020l7844Q46m4590j39682j902
$$ 750 -843 955 -1091 1259 -1478 1772 -2198 2859 -4062 6958 -30886 -30040 -74630 -214312 -216214
74b16214J35334J23620j1597m6646L1669Q7916J0128p9186o0394L1057M3766k6402
$$ -216214 -80880 42740 31143 -15503 16166 104082 114210 35024 -25370 5687 49453 23051
86B3051o5053n742N4110K8960m0740m5359J2542M1686j292m0135j1042M5031M3762
$$ 23051 -42002 -47744 6366 35326 -5414 -50773 -38231 3455 2163 -37972 -49014 -3983 39779
99C9779n916k6601Q862L5093M491m1889l8296K843J7547j1780l0271k285L4558
$$ 39779 33863 7262 16124 51217 55708 13819 -24477 -21634 -4087 -15867 -46138 -48423 -13865
112a3865K8065o309j4053J2764K6345P32k7930j8727J1047J5284r431k1153M27
$$ -13865 14200 7891 -6162 6602 32947 33679 5749 -12978 -1931 13353 3922 -17231 -16804
125a6804K1851J0472j4754j5375O814J5046l245j8311n089J6875J5352m978j1329
$$ -16804 5047 15519 765 -14610 -7796 7250 4005 -14306 -19395 -2520 12832 7854 -3475
138c475N168J5971K220j6110j2785M525P807o385j3536oJ4690R324n841o843O634
$$ -3475 1693 17664 19884 3774 -9011 -4486 3321 -3064 -16600 -16606 -1916 7408 1567 -5276 1358
153A358J1472j509j2829o172O933O162n483q381K949J0928L276p873n842N094
$$ 1358 12830 11321 -1508 -7680 -747 5415 -68 -8449 -5500 5428 8704 831 -5011 83
167H3O221m344r781j416Q013M929m473m272M853Q133k9p440l294M634L069n367
$$ 83 6304 1960 -7821 -9237 -1224 3705 -768 -5040 -187 7946 7917 477 -2817 1817 4886 -481
183d81o772J429O927J899m860k331M925N006k420o094n92M781J533m567l203L502
$$ -481 -7253 -5824 1103 3002 -1858 -4189 736 5742 3322 -2772 -3364 1417 2950 -1617 -4820 -1318
199a318N402m21m506p96M146J930m004m650Q71L897J08l790q76M162L671j480
$$ -1318 4084 3663 -843 -1639 2507 4437 433 -4217 -3346 551 659 -3131 -4007 155 3826 2346
215B346l483O40L567M36m062k869K204L001j112l291J47L698J677k655k587J508
$$ 2346 -1137 -497 3070 3506 -556 -3425 -1221 1780 668 -2623 -2476 1222 2899 244 -2343 -835
231h35K971o79l433q66L100K235j696k458J037K916K79l039j742J830J866j429
$$ -835 2136 1457 -1976 -2842 258 2493 797 -1661 -624 2292 2571 -468 -2210 -380 1486 57
247E7k638L72K907J263j961j495J553K350o38k675o71J920J140j667j845R23K430
$$ 57 -2581 -2209 698 1961 0 -1495 58 2408 1770 -905 -1576 344 1484 -183 -2028 -1105 1325
264A325J39k186r12J819J653j307k116K15K173O64j841j184J437J867o15k153
$$ 1325 1464 -722 -1634 185 1838 531 -1585 -1370 803 1467 -374 -1558 -121 1746 1131 -1022
280a022k57J891R14j699j735R76K003N2j876o38J704J479j201j769L91J889J41
$$ -1022 -1279 612 1526 -173 -1908 -932 1071 1123 -753 -1391 313 1792 591 -1178 -787 1102 1243
297A243j813j013J325J546o35j824l0J863P40j422j303R15J552k41j668m75J520
$$ 1243 -570 -1583 -258 1288 653 -1171 -1201 662 1402 -20 -1323 -408 1144 903 -765 -1240 280
314B80R98j093j423N29J646J80j524q01J153J214o40j497N6J393N67j232r17Q25
$$ 280 1278 185 -1238 -709 937 1117 -407 -1208 -55 1159 519 -978 -922 471 1038 -194 -1111 -286
332b86J389k64j422l30J262P53r78j257M76J356Q2j222m48J005J017o62j271J18
$$ -286 1103 839 -583 -913 349 1102 124 -1133 -657 699 781 -441 -889 116 1133 471 -800 -682
350f82J177L04j094q71Q55J116k44j065j43J122O11r42j044M34J030j21j077l33
$$ -682 495 799 -295 -1166 -311 805 561 -504 -647 475 1086 144 -900 -466 564 443 -634 -967
368i67R17Q59m15r47J58J103J38r97o97O49Q15l88r24O6J014M49p99o78N10P74
$$ -967 -50 809 394 -553 -395 708 846 -151 -848 -199 616 228 -696 -630 384 833 34 -644 -134 640
388F40j75j089k29R06N35o20n82M34R75Q7j014l96O12N57o47q71J00R23L12p52
$$ 640 465 -624 -853 53 588 -32 -614 -180 795 882 -132 -528 84 641 -6 -877 -777 146 458 -294
408b94k95O77P17k81q01j26P47K01o67n99M29P83r2o59j78O85L44n03o32O5P34
$$ -294 -589 88 805 524 -277 -403 344 545 -122 -721 -292 491 399 -260 -438 247 591 88 -544 -479 255
429B55Po09k10O21N72k94n18P0M86O4n18n18K82M69j30m44R5N07K91l36l71J18
$$ 255 262 -347 -557 64 636 342 -176 -106 380 444 -74 -592 -310 159 29 -415 -320 187 478 142 -229 -111
451a11M66l6n58k70N00L77k40m31J52M76J29m89m15K52L54j44m29j02O03L63k81
$$ -111 355 319 -239 -509 -9 368 128 -303 -151 325 454 -35 -450 -198 156 12 -417 -519 84 447 166
472A66k99K72M06p8n51k88L69K25l16m09J22N50J37l78k93L82L62j72n33k2M73
$$ 166 -133 139 545 467 -84 -372 -3 222 -94 -503 -381 169 306 -72 -365 17 379 207 -326 -348 125
493A25K64l94k97L38N21q3o21j77L21K07l87m44J17N96J47l29q3M72M49k88n60
$$ 125 389 -5 -302 36 557 474 -147 -324 -3 204 -183 -627 -510 86 233 -96 -179 293 742 454 -106
514a06NL62N1m95m75L52M45j13m09k2O13K41m64l70K24M58Q4m34j68M03L85k12
$$ -106 -101 261 312 -183 -658 -306 139 26 -383 -405 208 449 -15 -385 -161 297 381 -53 -221 182 567 355
536C55n25o0L55J4n28l74L36M78k9l04J18N13L66l76l35J28K84j10n49k75L06
$$ 355 -170 -230 125 139 -389 -763 -427 51 22 -282 -164 349 715 339 4 132 416 306 -243 -518 -212
557b12L46k23l23O1M99J67l72k43K84L85p3l93j15M67K34k59m99N5L62m1m84k02
$$ -212 134 -89 -412 -351 148 315 -57 -300 -16 369 296 -97 -212 255 489 230 -269 -214 148 107 -377 -579
579e79L21L71j07k77R1M54K79k65l84J39K64j24l93j96L20K61k07k86R8L41K02
$$ -579 -258 113 6 -271 -180 274 553 288 -96 43 307 183 -210 -406 -86 175 -32 -318 -220 121 323
600C23l51j68J62K57k6l48j1K70J52j72k62Q7K47ll70j20J82K20m7j62L0K38J73
$$ 323 -28 -196 -34 223 197 -151 -162 108 260 88 -174 -87 160 157 -213 -333 -151 69 22 -140 -110 128 301
623C01k48j72J44K06j13l15K3J54J64j78k00J13K65J0k61mJ14J96j83j28j2J97
$$ 301 53 -119 25 231 118 -197 -174 -20 144 -34 -234 -121 144 154 -107 -111 3 199 16 -112 -124 73
645G3N5j18j34J80J07j17j63k4K23j2j22j03J07J04L9j51m4J32J08j48n1l0J76
$$ 73 128 10 -124 56 163 46 -117 -141 82 70 -52 -155 -48 56 95 -56 -100 32 140 -8 -59 -89 87
668H7p6k2q7J09P6Mj84oJ47L1j29p7P5J10O3j50o1J38O7j21j00kJ83l4j50k0R7
$$ 87 11 -11 -98 11 87 91 -93 -99 48 79 -50 -127 -52 58 121 -29 -90 48 115 -6 -106 -108 75 41 -109 -129 -32
695c2J14o9j50P6J03L5j12m3N1J18jj95J08L8O5r1o2K4N6J10k18m3P5P2%j00K6
$$ -32 82 13 -137 -61 42 77 -35 -78 -27 91 90 -105 3 41 106 15 -47 -23 33 143 -75 -118 -43 29 29 -71 -45
722d5Q6L4j35j8N3R5j0j28k5J08O7j06p3M8R8j6n7o0J07L7q0n9J04J4n0m4nP1
$$ -45 41 75 -60 -78 -25 70 60 -68 -93 15 82 -24 -97 -49 49 33 -24 -84 23 60 -20 -79 25 39 -11 -55 -60 11
750A1J5ql0J9M7L8j15m6L0O3K9o5j8M3L9k1p9J9P7j3o2J1m4N6M7o7j9L2P2o0k7
$$ 11 26 18 -12 7 54 92 -23 -69 -39 24 53 -12 -30 13 52 31 -48 -29 48 35 -27 -16 -60 -4 43 -24 -43 -11 61 1 -26
781b6r2J00Q8m1r9P1M3Qo2p1Q5K6oj19N7M0J01j53r2J34P5J4j37m9R7R5n5j03
$$ -26 -118 -18 70 29 -70 1 44 52 -10 -81 4 30 24 -95 -38 2 103 -50 -142 -8 67 81 -56 -105 -8 87 32 -71
809g1Q9J1N6j69j6J08L3j5j02nJ59l3n9n7P6P6o1l2p9J51l1k0r7P0Q0j1j04pP0
$$ -71 18 29 85 -84 -100 8 41 26 -76 -81 78 45 -14 -71 5 81 20 -12 -91 60 29 9 -88 -18 62 51 -53 -60 10
838A0P3k6j25L2J33j8j24k5M9P2J2j14%P8N2j02n5M5R6J6p4p5O9J11j45LL1L5
$$ 10 83 57 -68 -36 97 79 -45 -70 -21 51 63 -51 -51 27 79 -23 -78 -33 63 79 5 -70 -1 110 -35 -32 -1 34
866C4opl6QL5K9p0o6Q5M6n9l0M8K0L9n9l1k3J00p8N1k9pN0p2lL6J3O8p5lL9M9
$$ 34 28 21 -15 -7 28 57 -13 -79 6 52 -7 -37 11 31 70 11 -20 -43 57 -21 30 1 -6 44 -28 -31 5 18 86 11 8 47 96
899I6j34OjO0L4m6p5K1PkJ6p1J34K3l3n5n2J09K4j30M1MR8o7o9J1R3j0m6l3N1
$$ 96 -38 -32 -33 27 61 15 -60 -39 -32 -34 -18 -89 45 68 35 -20 -72 37 61 -69 -28 -24 74 7 -62 -51 42 32 -14 -47 4
930DM0m3Km3M1jL2r1Q1NMn3n6Q4J33j71k2mQ4jr3K6P4J7q3m3K9J28j9n7p7N1O3
$$ 4 44 1 3 -40 1 0 32 -59 22 27 31 -22 -78 6 139 -32 -54 -58 26 25 -68 -42 32 49 -34 -77 -48 80 61 4 -73 -22 41
963D1k8p8O3L8mn2Rj6Q0j3m4K4K4oj6q3L1Q3j1l5p3J21m6m9k6J8Q5K4q7k6O6J05
$$ 41 13 -65 -2 36 32 -20 -11 -27 53 40 -4 20 44 38 22 -61 -30 53 42 7 -66 55 9 -40 -66 -48 37 61 -26 -52 14 119
995A19j20n3l7J03O0o9m8L2R1n7m1o7O4R4r4l6%O6P5r6kM6R2q1o3PK6j6p1N1m0
$$ 119 -1 -54 -91 12 72 3 -45 -13 78 21 -20 -87 -23 71 -23 -59 -59 7 82 -14 -16 30 122 41 -22 -15 11 -5 -76 -25 -65
1026f5Q9np2O0NL0k2o4L2K4Nk8k4L5J1L6p6l1P1K6J4p5m8R5K2k2l2qN2m4l6j4
$$ -65 24 19 -53 7 12 42 20 -44 -12 12 17 -11 -35 0 11 47 -29 -60 11 37 51 -24 -72 23 45 23 -9 -17 35 -9 -45 -59
1058e9P3K2o6j9O4QK6o1M2l7K0J9m4k1K5K7n9j3M6j4N5r5NO7Ml5n4M6M3N1q7R
$$ -59 14 36 -30 -49 15 23 49 -12 30 -7 13 32 -12 -33 -8 19 -40 -53 -7 -21 34 -61 -56 11 15 -20 -74 -28 15 66 -21 -12
1090a2rN8K2j27K9j9Q1k1l0K7K5L2o3kj7OJ5k8l8Q0rl1%N0Rn8K5j1NJ12o7o1j3
$$ -12 -21 37 59 -68 -39 -58 23 2 -28 -1 24 56 -7 -9 -26 -20 -5 -33 -71 9 0 -31 -31 19 28 -30 -5 -16 -11 101 34 -27 -40
1123d0M1l4O3oJ9n0O1p0J9j2K8n0J7K5Kn4N9q8P4Kl2K4K6j8KNoK0j2o6QL9L5j8
$$ -40 1 -33 30 24 43 -7 54 -16 3 -9 19 -31 -14 11 13 -41 18 -70 4 6 -26 -2 24 6 8 13 7 27 15 -51 -43 -4 31 13
1157A3j5O2n5jm4P2m4OJ8n5R6j1k2o6M8J0j8J8n4N6%j8P5q7k0N8j4rj9KO0o5L8
$$ 13 -2 60 5 4 -40 32 -12 -6 12 -43 53 42 20 -46 2 12 -6 12 -42 14 14 -4 71 -16 -36 22 8 -1 -20 -18 42 -23 15
1190A5kk6L6n4QM0jMp4MM8k1M3q1N2j3K1J9l7pN1Orl6rK1k0K3oM8k2l0j0j5P2
$$ 15 13 -13 23 -31 -23 17 16 20 -54 -50 -2 -23 20 -61 -9 -22 -1 18 -19 -26 25 31 22 -14 -23 -2 -22 1 -5 43 21 -9 -19 -34 38
1225C8l9qJ2Q3o6m5oM5K0L3j20l6R9K3m1q5Q5QQj3j4j9O3k9K8p7J04m1p8NJ5J02
$$ 38 -1 -9 3 86 20 -25 -31 14 34 67 -53 -89 10 33 -8 -93 -8 0 8 -5 -19 -38 25 -4 24 -53 51 10 -68 -63 -48 54
1257E4k4m5MN8Pl4k0l0L4L7k3j7K9lj4p2RL7L9m0l0K2O4j9p7LO7oj0l2j7Q3k5
$$ 54 30 -15 -11 47 54 20 0 -30 4 41 18 1 30 27 13 -59 -50 -13 26 -14 -44 -22 42 23 -54 -51 16 10 0 -32 -49 34 9
1290IK5p2J9L0j2J4o0J08n6K2r4Q3K4no1J5K0N8p4k7PN2k2n5nM4Kj5K7k1N2m7
$$ 9 34 -38 -19 11 -1 13 -47 61 5 27 -67 16 40 35 -26 -11 9 67 -7 -34 -27 25 3 -52 -57 -13 -11 -26 1 -20 32 -15
1322a5rn2Q0J7Lo8J15k3k2j6l2JL6k3k4MJ1Q3r1K3JN0k1J3p5N9mOk9M3j9k4o4
$$ -15 -24 -76 4 21 24 -44 71 48 26 10 -22 -21 15 -8 -32 -28 -17 66 -25 -2 -1 49 28 41 -34 25 21 27 -2 41 22 -2 -66
1355f6L2N8J8k8k8j8N3K3p2NM9Rp7lJ9L3%k1j3P3k2%l3nnL2J1k1%j3n0L5M2Mj
$$ -66 -34 24 42 14 -14 -32 21 44 -28 -23 26 35 -42 -45 -26 7 7 -14 -27 46 24 24 -9 -14 -19 13 24 3 3 -10 -60 -25 17 21 20
1390B0m5L4rO6k5l8l0j6J7PL7k1L8Kk8lj8K8j9l2L4j9L6lp8N8K0j1Kk0K1j6M4
$$ 20 -25 9 0 66 41 3 -27 -43 -26 -19 18 -3 35 37 9 6 -12 16 -3 -35 -1 -20 16 13 -65 -7 13 2 4 -16 5 -11 33
1423C3m5J8Mj1mqPM0k2j6k7K5K5j9L6q7K9OK6j6K1l0O0l6l4J8J9o1O2n3K2O7l4
$$ 33 -12 6 10 -1 -5 -13 -6 34 12 -4 -31 -6 19 0 36 -51 -22 -16 10 -6 15 -15 45 9 -25 -7 12 -49 13 -40 -18 49 15
1456A5m6N1kk0Kj8O4o2M8j03P5KNk2k8K9M9j3q7N4N0N8j45n9J05K6n5L7k1N7J8
$$ 15 -31 20 18 -2 0 -18 46 -16 32 -71 4 6 11 -11 -39 -10 39 26 -61 -7 43 101 -44 -103 2 28 -27 10 -11 46 64
1487F4o4Nj4pL2j12Q7m0O0l7k5N9O6l0r0M2L3o6K4J7LN8m8K4j9nJ4K0q9k5Q7k4
$$ 64 0 5 -9 -16 16 -96 -9 -49 11 -26 -51 8 74 44 -46 -4 29 -37 -13 4 7 65 17 41 22 17 31 51 -38 -63 24 0
1519@mm8M3N7j9m5k8O4m4M5l8m4J14Oq6J8L9jk5m2l0N3j0K4n4M4N9l0m3J9K9o
$$ 0 -4 -52 -9 48 29 -16 -44 20 -24 21 -17 -61 53 59 -27 -9 30 29 4 -38 -68 -15 -25 -1 -55 -11 48 18 -25 -6 23 17
1551A7K4k9O5k97K74Mo3L0j6J1j2q8J01M3j04J3j0M1L3p1J3J0N3l2l8M4mM0j24
$$ 17 41 12 77 -220 54 58 -5 25 9 20 8 -80 21 64 -40 -27 -37 4 37 -34 -21 -11 42 10 -28 16 12 52 -72
1580g2NN2j1K9q3N7K9L0j7m2J1Q4k7l8j5J0L0jp5M3M1l2k7n1P2L7j1n6k5Q4j3
$$ -72 -67 -15 -26 3 -80 -23 6 36 19 -23 -12 72 45 7 -8 2 32 31 -44 -1 40 8 -19 -70 2 39 28 -28 -53 31 18
1611A8K3o2Kk7R6j35M2J19%q3m3N5M3J4o6n1J9O2J1p0%K6j0K7j4m9Q9l3p7J29
$$ 18 41 -21 -19 -46 50 -85 -43 76 76 -7 -50 5 48 62 -4 -55 -36 26 37 -33 -33 -7 -17 10 -4 -53 36 3 -74 55
1641E5k59M39k71J42j22J21J53k95O0r5Q8K4n0m5P6l9l9N1PM6K3o4l2LL7k6l2
$$ 55 -204 235 -36 106 -16 105 258 -37 23 -72 16 40 -10 -55 21 -18 -57 -6 1 47 70 6 -26 -23 14 -12 -44
1668d4N3k8M1k4pL3K5m7l2M1K8kk2j8K0pPmlK3o6K0MJ2K9m1L0k4qJ6l5j5j3Q3
$$ -44 9 -19 22 -2 -9 24 49 2 -30 11 39 37 15 -3 17 10 17 13 10 33 -33 -13 -9 3 32 -9 21 -3 -11 5 -30 -45 -58 25
1702B5j7n0K3lNM7l9L6l1L2k8J2J4n2MK6o0P2j3oK0j0JL7m4k7k3L8K3mnLL7j9
$$ 25 8 -42 -19 -22 -17 30 -9 27 -4 28 0 12 26 -26 -22 4 -56 16 3 -3 17 7 8 45 1 -26 -49 -11 12 8 3 6 43 24
1736B4k1K7jpj4%j1J1lj8k3Q7m8l8O6l4L5o3OJ0N8n8L5j04P6L4l3l2mJO7K7r2
$$ 24 3 30 29 22 8 8 -3 8 5 -13 -36 51 3 -35 31 -3 32 -31 -25 -15 43 -15 20 -84 -8 26 -7 -39 -43 -42 25 52 -40
1769d0j3J13m5r3L8N5J0lm0K4J5m8K0qNN1k9k4j1L1M8p1k4j2P1Jl7J2MO6J0q9
$$ -40 -53 60 15 -78 -40 15 25 22 -18 6 21 -27 -7 -15 -10 41 12 -12 -23 8 56 -15 -39 -51 20 21 -16 -4 0 66 76 -13
1801a3L6lK1n0K7m8K4N0m4j7O6m7M4n0M5l4k8K2m8L8N2n3J1k7J4Kml2Q0k4k2m2
$$ -13 23 20 41 -9 18 -30 -6 44 0 -17 49 2 46 -4 41 7 -21 1 -47 -9 43 -10 1 -26 -12 -10 -14 -46 34 10 -12 -54
1833e4J1N8J9j8L6j6p3J4l9O8k5J4rj8M2nNmK8m1K7j7N9r3M0l0lk7KN7pj8K1j
$$ -54 -43 15 34 16 52 36 -37 -23 -62 6 -19 -5 -14 -32 10 5 10 6 34 -7 20 3 62 -31 9 -21 -24 -51 -49 8 1 -17 4 3
1867CJ7p1J4J0K4P4r1K0k7N6m9J3n3j3J14o6K6l6O6Kj3l0MK1NJj6L5k0p7N2j6
$$ 3 20 -51 -37 -27 -3 71 -20 0 -27 29 -20 -7 -60 -73 41 -25 1 -35 31 33 20 -10 -6 15 20 21 5 40 20 -57 -5 -21
1899b1N9j4o3L8n1Q6j1j3k5M5J2l1j0k3K0J9o0L5J4K0l1m7J1K5L5q3O5Qj0OJ0
$$ -21 38 24 -39 -1 -52 34 23 10 -15 30 42 11 1 -22 -2 17 -43 -8 6 26 -5 -52 -41 -16 19 -64 1 9 -1 5 15
1930A5%J4l6n2N1P4j08R2m3L3j3l5M6j3J1kl4l1L3J7K1l9J5Lm7L5k1n3P3j9Mk6
$$ 15 15 29 -7 -59 -8 66 -42 50 7 40 27 -8 38 25 36 34 0 -31 2 19 40 1 16 19 -28 7 -14 -67 6 -13 -9 -35
1962c5M4qk7R8m2On8j6LqN7l1Pj9J5O1r1l3J07k2K8n3P6Ol1l6M7j3m9K8rl7PL4
$$ -35 9 1 -26 72 30 36 -22 -38 -35 -43 14 -17 -10 -29 -14 47 -44 -77 30 8 36 -17 59 65 34 -2 45 32 -17 11 2 -35 -28 6
1996Fn1K0K2j2K0Lo9Q0j7l9NqN2j7j8J1j9L5P2p9j1J3pJ7n5l3J9Q7Lm6L1l9j4
$$ 6 -45 -25 -3 -15 5 8 -61 19 2 -37 -32 -40 12 -5 -23 -12 -31 4 76 -3 -14 -1 -8 9 -46 -79 -60 27 30 -16 15 -24 -38
2029c8J6J4k3K2N0m7l9L7QPJ2j6K6k2qkM1p8O3l5Lk4K5K2q9J01K2l4K2p1QO3L0
$$ -38 -22 -8 -31 -9 41 -6 -45 -8 0 7 19 3 29 7 -1 -3 38 -40 23 -12 -9 -33 -8 14 -75 26 48 14 36 -35 -27 36 66
2062F6l0n6K6OPm0JnK0O7q6%M8l2%Q2r4Olk8J6j9M4RJ6jn3P4n9OL1Rj8j7J2j4
$$ 66 36 -20 6 12 19 -21 -20 -25 -5 62 -24 -24 24 -8 -8 74 -20 -14 -17 -45 -29 -48 -4 5 21 20 -33 41 -18 -12 19 28 10 -7 5 -9
2098iJ0k8MM6o7LL4k2%M0j4K3nNl2rN4l0jK1o1M6J9lk6L4m0OM5o4l2Q3km4K1j4
$$ -9 1 -27 -23 23 -44 -41 -7 -29 -29 11 -3 20 15 20 -12 -21 33 3 2 23 -38 8 27 24 -2 32 -8 -2 43 -21 -53 30 28 -16 5 -9
2134iK4Prmj2LO2o3QMm0N1On1K4Lj3K5J5J9o6k7Q4p7N5QJn1qL4k5M9q9J15j0l8
$$ -9 15 22 13 9 -3 0 62 -1 7 11 -29 22 28 -23 1 4 -9 16 31 50 -16 -43 41 -36 19 27 28 -23 -31 3 -22 27 -62 53 43 5
2170EK1J0n6QN0o4OJ5mN7j7k4RmmK0j4j7J9OK3l7rj3%K1j4Rk4J4q8R3k9N7j9O
$$ 5 26 36 -20 -12 38 -26 -20 -5 -9 48 31 7 16 12 8 28 14 -3 16 22 45 8 -1 -14 -14 7 -7 2 -22 -8 -96 -3 -32 25 6 12
2206A2Pj9rjk5L7L4j1l8K6q8M0QK9nj1Nm2N4mL4lk3ooJO3n7qJ8n2KL5J0k8RL1
$$ 12 19 0 -9 -10 -35 2 36 25 -13 13 -75 -35 -27 2 -3 -14 -9 -51 3 -1 33 30 7 1 -5 -4 59 2 -6 12 -40 -38 -3 7 -21 -12 19
2243A9m8J6MJ6Kn2M0J1oj9oM6r1Q7n2L1k5K7N7p2k6M4j9J3O0m2K1l3ojj0j3O9
$$ 19 -29 -13 -9 7 9 -43 -3 8 2 -17 -23 23 -68 19 -33 -2 -27 0 57 -15 -41 3 -16 -3 57 15 36 3 -3 -4 -14 -27 42
2276D2k3m1O3k1j8O0n7l3P9j4l1m6J2j9N3j3l7JK8J1j3L0m5N0k4%J3qql5M4L0
$$ 42 19 -22 41 20 2 62 5 -28 51 37 6 -40 -28 -47 6 -7 -44 -43 -15 -4 -17 13 -32 18 -6 -6 7 -1 -9 -44 0 30
2308C0pj7n7L4L8j2pk9M4l1l3O1l5OJ5nLl5k7N1K6k5l8J1J15m6J8p9P0k7K3k6
$$ 30 23 6 -51 -17 21 9 2 -27 17 -14 -47 14 -21 -15 0 -5 -2 -37 -64 -13 13 -12 -50 -39 76 30 48 -31 39 12 35 9
2340Il1oj7M9l4K3N9p8M9pKK2l8L4o4N2n8J5j0N3ml0J7J1Jj5l1K9J0jl7L4m1K5
$$ 9 -22 -28 -45 4 -30 -7 52 -26 23 16 18 40 2 36 -28 24 -34 -19 -29 24 20 -10 7 18 19 4 -27 2 12 11 -26 8 -33 -8
2374hJ0pj0M7j7%rol1L6k8J9N1j07K8N0J3k4n8N9nL9m8M0o6n3J21k6l3j3O8p1
$$ -8 2 -5 -15 32 15 15 6 0 -31 5 -23 -4 47 -60 -32 18 31 7 -51 8 3 42 -6 34 -32 -85 36 10 -23 -36 32 -39
2406c9Q3k9l3j3J4L6j6m9J9L9l0N9p0N7ll9L7m2J6O5j00K6L3L0j04j6O5l2NK9
$$ -39 44 15 -18 -31 -17 19 3 -46 -27 12 -18 41 -29 28 25 -14 23 -19 -3 62 -38 -12 21 51 -53 -69 -4 -36 -31 -2
2436bM2kk7l9M2Jk7QL5j0n2L1l5J4ML5q0O9J3l8N1j1J0n8K9m4L8J9j8lJ8l4J4
$$ -2 40 38 11 -28 14 15 -12 -4 31 21 -31 0 -35 -21 -17 18 -62 7 20 -18 33 22 32 -26 3 -41 -3 16 -2 -5 13 -21 -7
2469gJ8k9L8l9k0M4JJ9m7J3j1j1M0k4j1ML6Oo1P7Kn9M7j9J6l7l7L0M5J2m6P2n9
$$ -7 11 -18 20 -19 -39 5 6 25 -22 -9 -20 -31 9 -15 -26 -22 14 20 -41 36 38 -21 26 7 23 -14 -51 -21 24 36 -10 62 3
2502Co5M5k7J6JM2ol4K1K1Pk5LM0j9Ml8j4J8N3p4O6Lo3M5j4j7K5j9mOJM4km5J0
$$ 3 -62 -17 -44 -28 -27 15 9 -25 -4 17 24 -1 2 42 23 27 -11 -25 -7 46 -28 38 41 -22 23 9 -8 17 -2 -6 0 1 45 43 -2 8
2538Hn0P3J7o0M2o2M8k9L7oOl4P2o5n0Q0m1L3Mk7J0j9J4N0l0nl8M3l2L0J2o6P7
$$ 8 -42 31 48 -12 30 -32 16 -13 24 18 24 -10 62 -3 -53 27 -14 19 23 -4 6 -13 1 51 21 16 -22 21 -11 19 31 -35 42
2571D2nm7j3M1n0K1j5O1n9M4l9lk1M7M6j03K8J9olJ8o4%R1j3j9MN5Rq5M3j8L8
$$ 42 37 -10 -23 18 -32 -11 -26 35 -24 20 -19 -22 -43 4 50 -53 -25 -6 -12 -15 3 -61 -61 30 17 -2 2 57 66 -19 24 6 44
2604D4l2n1O4q0M9k3PJ7O0o8K1onJ8K7n1N1l2J9k2J9m6J3j5QQ3m8m9M8o0O7j45
$$ 44 12 -39 25 -55 -6 -29 -22 -5 55 -13 8 2 -3 15 42 -9 42 10 29 7 26 -20 -7 -22 -14 69 21 -28 20 -40 27 -118
2636a18J95J9Q6j87lM70l56k62J67Lj4M5p3K1m0R6j00J6K4J0j1K6J7oK6o0mQK1
$$ -118 77 96 182 -5 -8 462 106 -156 11 14 0 45 -28 -7 -47 49 -51 -35 -11 -1 -12 14 31 25 51 -9 -13 -5 16
2665A6j3m5O4j2K7l6j8k6J2m5J06j06k4R8Q1j11p7L4j43J42K04k92J05M5J04k90
$$ 16 3 -42 22 10 37 1 -17 -43 -31 -76 30 -76 -100 -2 79 -32 -109 -75 -218 -76 128 -164 -59 -14 90 -200
2691b00K2J18J83R8j13k13J51k9j01O8k0J2M5q8R8m4K7k7K3J3l3K3J5j1m7N0m
$$ -200 -178 -60 123 221 108 -105 46 17 -84 -16 -36 -24 21 -67 31 -13 14 -13 10 23 -10 13 28 17 -30 20 16
2718A6L7j04J11n4l0L9l2K3jJ0%l0LL8Ro2N0lm4L9pm4L0kk6L3L3n3J3l3O5m4K5
$$ 16 53 -51 60 6 -24 15 -17 6 5 15 15 -15 -12 26 35 -27 23 20 -24 15 8 -36 -6 -8 -34 -1 32 -21 -8 -41 24 -20 5
2751Ej8J2K8Ll3k6J4N4l9K1L4o5KRj4l9N5k6N4l9K1j6Rj0%j1j4rO2M6p9M6n1K3
$$ 5 -13 -1 27 30 -3 -29 -15 39 0 21 55 -10 -8 1 -13 -52 3 -23 31 -8 13 -3 6 -4 -4 -15 -29 -38 24 70 -9 37 -14 9
2785IO%Mkn9L3Ml4L3Qj3PJ3j2l8K8k6K0m6M0RK1K7k9PK8p9N0M6m0n5LN9L3r1o
$$ 9 15 15 19 17 -42 -9 -5 -39 -6 2 -11 -4 9 -3 -41 -13 -39 -19 -65 -25 -16 5 32 3 10 38 -41 9 55 15 -40 -37 22 55 -36 -42
2821d2R1n0k6K2K1k5M4m0JPJj0pJ7k2nO8j11K4kN9ol5RK8J7p6J9O1l8k1J5N2j8
$$ -42 49 -1 -27 -5 16 -9 35 -5 -4 3 4 -6 -13 4 -18 -23 45 -66 -42 -44 15 9 -26 -17 11 28 -48 -29 32 -6 -27 -12 40 22
2855B2l7pJ5L7J6k0l9K4MNj2l5jN8m1%j2Oml6P7m1L1qj9L2O9p3m2K0K5k7j7L7
$$ 22 -15 -22 -7 30 46 26 -13 11 15 20 8 -27 -28 30 -11 -11 -23 -17 -21 -57 20 -21 10 2 -17 15 84 11 -31 -11 14 -13 -30 7
2889Gj6j7NK7oL4n8QQL6j05N5O5m8Mj8K5M1p4j3jP9l6n3Q6r0LL9%j1N9m6J8j6
$$ 7 -9 -26 -21 6 0 34 -24 -16 -8 28 -77 -22 43 -5 -1 -19 6 47 -27 -40 -41 38 2 -51 35 -55 -52 -13 -13 -24 35 -11 7 -9
2923iK8j5j9J3l4%j3K9P0p8J8l1Q2p3P6l1L0q6PP3n2L7o8M4M3rj1jk2L4nnk4m0
$$ -9 19 4 -15 -2 -36 -36 -49 -20 50 -28 -10 -41 41 -32 44 13 43 -43 -36 37 -15 22 -46 -2 41 32 21 20 -2 32 27 22 -2 -42
2957d2K5lO1rm5k7OL0O7p7j3K7n1O0o3m2P7KjL7k6%j0J4J0l6Ql3N9%l1J8j8J1
$$ -42 -17 -20 41 32 -13 -40 -34 -4 63 -14 -27 0 -51 9 -54 -96 -19 -17 -18 19 -7 -7 -17 -3 7 -29 -21 -54 5 5 -26 -8 -26 -15
2991a5j3kL7j6K0k0m5O3M0r5M4K3l1M3j2k6k7L8L4n8K4J1j4k9k1K9K6j7M7ql5
$$ -15 -28 -30 7 -9 11 -9 -54 9 49 -46 -2 21 -10 33 21 -5 -32 6 40 -18 6 17 3 -26 -47 -18 8 -9 38 30 -5
3022el5L3J8L9o5N7kr%m5j6KM9m5k4N1L1j7n6M6Nj1j3Jm5O8l7K4pK2l5K2rj9K0
$$ -5 -40 -7 11 50 -15 42 40 31 31 -14 -30 -28 21 -24 -48 3 34 17 -39 7 12 1 -12 -11 -56 12 -25 -1 -8 14 -21 1 -8 -27 -7
3057gk7j9Q2nm4K5K5k5ol3N4JlK0pqk7J2J5m1ON7k9rk8L5l4K2Km4J0N9o4L5K3
$$ -7 -34 -53 29 24 -20 5 30 5 -1 -34 20 21 18 38 31 23 -4 8 23 -18 -12 45 16 7 -21 14 -20 2 4 -40 -30 29 -35 0 23
3092B3l2pmK8m5O4o2K4jN1Nq3N4JLk3L0j7Qk9J0K1Nk8K7k9N0l3m4M3on7O4p2L4
$$ 23 -9 -16 -20 8 -37 27 -35 -11 -12 39 44 -39 15 16 19 -4 26 9 17 -12 -2 19 24 -4 23 -6 44 11 -33 10 4 -53 11 -61 -27
3127b7L6k5l7N8Jnj7k9K8M2M5o1o4M5j2OM4j8L8r0O5m0J7Ro1M0lJK9L4l5Rqlk3
$$ -27 9 -16 -53 5 6 1 -16 -45 -17 25 70 9 -55 -10 -22 -16 28 10 48 -42 23 -17 0 9 -52 -12 -15 -14 15 49 14 23 15 12 -11
3162a1K7J3n9L5J3m4K2L6m9M4j8ql8L8Pj02R0pOJ0o1N4K2j7m7K0RnJ6m9J7L8j5
$$ -11 16 29 -30 5 18 -26 -4 32 -17 27 9 1 -37 1 8 -94 -4 -11 -5 5 -56 -2 20 3 -44 -24 -15 -20 -4 -53 -36 2 -13
3195a3LK3qOn2J9N1j0%m1O7l1J6n3J1LM1K4kr7M9k8k4L9n3lJ7J13q4j5J4K9l2
$$ -13 -10 13 5 11 -41 -22 29 19 19 -22 45 14 30 -23 -12 -9 32 56 54 -43 6 -22 -46 -7 -60 -63 -46 67 -17 -32 -18 11 -21
3228b1N6j5j3q6K3J07o9L9o0K2L0l9N5k3k6N4l9M1m2L3l2K6Nm4K6kJ1K5p3N6k6
$$ -21 35 20 7 -79 -56 51 -18 21 -39 -17 13 -26 29 6 -20 34 -5 36 -6 27 -5 21 26 -18 8 6 17 42 -31 25 -1
3259aM2j6k8l1RQ0q9L2N5q4R1k8l3Mk9Q8m2k0K5K8m6J3r2R0%j4Mj3j6J8J7o3N0
$$ -1 41 25 -3 -34 -25 55 -34 -2 53 -31 60 32 -1 3 -26 62 20 0 25 53 7 20 -72 18 18 4 8 -5 -21 -3 14 -49 1
3292Aj3k4J8k3O2k9J4L6r4N4No5L6K0Lj1J0o1O1k6k2M4ooM2qn7J04j01L5j2L8
$$ 1 -12 -36 -18 -41 21 -8 6 42 -52 2 7 -58 -22 -2 1 -10 0 -61 0 -26 -48 -4 -10 -16 26 18 -39 65 -36 -1 -13 25
3324B5m7J2j9l5O2Mj4M0j3k7Rl8N6k9N0l1m7O7qp5L3j1M3k7M4k0k6LJ0lK6KLk7
$$ 25 -22 -10 -29 -64 -2 2 -12 28 15 -12 -3 -41 15 -14 36 5 -42 25 17 -58 -25 -36 7 -20 24 4 -22 -19 -9 -12 14 16 19 -8
3358hL0n1JJ7KJ1pK3m1rM6J0mK7n4K0j0J3Qp1J02l9j1n9N3L9m1N2m1J9Kj1mo2
$$ -8 22 -29 -28 -11 -9 2 -5 18 -23 -32 14 24 20 47 -7 13 3 16 24 -47 55 16 5 -54 -1 38 -3 49 8 27 29 18 14 -48
3392d8K6K7L8n3k6N3k4jL2l5Q3q0Qo4P0qoN8n2L5m6J4K7l2L6j9k7j0N2m8P0n2
$$ -48 -22 5 43 -10 -36 17 -7 -8 24 -11 72 -8 0 -64 6 -2 -8 50 -2 33 -13 1 28 -4 32 13 -14 -24 28 -20 50 -2
3424bj0j4j3O0J4n0K1j8l1O6J6n4J4j2KN5p7lL1L4n1LJ3M0n1mM8om9KRlRK0J3
$$ -2 -12 -26 -39 21 35 -15 6 -12 -43 23 39 -15 -1 -13 -11 44 -33 -36 -5 29 -22 -19 -6 34 -17 -21 27 21 -28 -26 -17 -20 -11 9 22
3459B2o7O6k2J7k2pK0j7K9o8N5n0P7n9J7J8l2L2L6m5M1o4J2lJN4k9J7mLl5Nkm0
$$ 22 -45 21 -1 16 -6 -13 7 -10 19 -49 6 -44 33 -26 -9 9 -23 9 45 0 41 -23 -11 -14 -13 41 12 29 25 28 -7 -2 -4 -44
3493d4L6KPK5m2JpK8o6K9L4O2j15O4n8K6q%L4k8k0N7jp8M2J3l5L7K4L7n7m5J0
$$ -44 -8 -6 1 26 -16 -15 -22 6 -60 -31 3 65 -50 14 -44 -18 -26 -26 8 -20 -40 17 16 -62 -20 -7 -42 -5 19 56 -1 -46 -36
3526c6K4K3K0n2m9J07m6%oM5j8qo3P6k4L7Lo5K5j6j6N8Nl1L2k3j9lK9j0k3L4M7
$$ -36 -12 11 31 -21 -70 37 -9 -9 -15 30 12 4 -59 17 -7 30 33 -32 -7 -23 -39 19 24 -7 25 2 -17 -20 9 -1 -24 10 57
3559E7m2J3l6j7L7K3pm8L6n5L7j9j6M4OJ7m6MK2J4k5Qj5j2J9J0l7K4nM2j2k3K5
$$ 57 15 28 -8 -25 12 35 28 -20 16 -39 -2 -21 -37 7 13 30 -16 -12 10 24 -1 7 -8 -20 -1 9 -28 -4 -9 33 21 -2 23
3592B3jj5l1N%pK7j5l9O6K6j02PL9M4r4L6j7N7MLj2l3%%M9KPo5L0J4RK0j9m4J1
$$ 23 22 7 -24 -19 -19 -26 1 -14 -53 13 39 -63 -56 -17 27 -67 -31 -48 9 13 16 4 -29 -29 -29 20 22 29 -36 -6 8 17 37 18 -26 -15
3628a5J9j5K9Ml0l0M5rn7J06n2K0l0J2Pm8Rj1M3%L9n3l1O1Kl8PM7m3J3N0j0k6
$$ -15 4 -11 18 22 -8 -38 7 -2 -59 47 -5 15 -15 -3 4 -44 -35 -46 -3 -3 36 -17 -48 13 15 -23 -16 31 -12 1 51 41 15
3661A5qk1L3J1r2O3qoJ2M2n1j5J9j9N4l7nn6Q6l0L1k3J2k9PmlK6m3N9Ool5j3N6
$$ 15 7 -14 19 30 -62 1 -7 -13 -1 41 -10 -25 -6 -25 29 -8 -13 -69 17 -13 18 -5 7 -22 -15 -19 -22 4 -39 20 26 20 -15 -28 28
3696B8l8jK7Lk4On1O2m9J8J8O4r5O6l8j7J7PL1o3O5p9L7K3k3K4j0PK9k8rj3RK5
$$ 28 -10 -11 16 19 -5 1 -50 12 -37 -19 -1 63 -32 34 -4 -21 -4 3 34 -29 36 -43 -6 17 -6 18 8 15 44 16 7 -6 3 28
3730B8J6o8l4J35o0q5Q5k1J0o8N5M5m0mj7OLrJ4j9J6K6r6Q9J1k3M3k9L9k8K8j3
$$ 28 44 -24 -58 77 17 -68 17 -4 6 -62 -7 38 -2 -6 -23 -17 -14 -23 -9 -28 -12 14 -82 7 18 -5 38 9 48 20 48 35
3762C5j5n4O6l6k6n2N7K4L4n4P3q5N5k0k7L9k2J3l2Rl6N2J4l6J09r6K9j0oN8r1
$$ 35 20 -34 32 -4 -30 -82 -25 -1 33 -21 52 -33 22 2 -25 14 -8 5 -27 -18 -54 -2 12 -24 85 -11 18 8 2 60 -31
3793c1N8l7M4k0k3L9p0pM3K0Qk9k3NM4m9K8rj3L2l3m2O1L2m4K3l7N1j5j0L7m0
$$ -31 27 -10 34 14 -9 30 -40 -47 -4 16 24 -5 -28 -23 21 -28 0 -9 -22 10 -23 -65 -4 28 -16 7 -30 21 6 -4 33 -7
3825gj2K3k2k4N4m8K2L3Ql3LK0n0mL7k8P7n2%K7j8J7j4l5mP7o7K6k1N5p4P3ok3
$$ -7 -19 4 -18 -42 12 -36 -14 19 27 -6 -3 17 -33 -37 0 -28 49 -3 -3 24 6 23 9 -26 -30 47 -20 6 -15 40 -34 39 33 10
3859A0qlK3k9j1JJ2L1p7M9K2l9O3p0J1J9J2l4N2p7O3j1Jo%L6m2j5jn6L7L0J9k2
$$ 10 2 -1 22 -7 -18 -17 -5 26 -51 -2 20 -19 44 -26 -15 4 16 -18 34 -43 20 9 10 4 4 40 -2 -17 -18 -74 -37 -7 12 -10
3893a0rJ6K3o5L5m0R1m3JON9m6p1J16o4J2k8k5P5k5l1k0j6L3rJ3N3k3K7l2o2J12
$$ -10 -19 -3 20 -45 -10 -50 41 -2 -1 5 64 18 -53 63 -1 11 -17 -42 33 8 -23 -43 -59 -26 -35 -22 31 8 35 3 -59 53
3925E3k3n8L3l1J5NRl0K5J8j5K8l7K0o5J11n6Ll1j5O9k5k9R2r8j1K3pJ1K2j6J8
$$ 53 30 -28 5 -26 -11 -6 3 -27 -2 16 1 29 -8 12 -53 58 2 5 -26 -41 28 3 -26 66 -32 -43 -20 -27 -16 6 -10 8
3957HK1n0j8P5j0m9K1Lj4l0M4Pk6N3o3jK9l4M2o5L9N0k3j6J9%k9J5pJ6L8r0P8
$$ 8 29 -21 -39 36 26 -23 -2 1 -13 -43 1 8 -18 35 -28 -29 0 -34 8 -57 -18 32 9 -7 12 12 -17 -2 -9 7 45 -45 33
3990C3l4qL1poK6k6J8j7P0o5Jk8K7Jk2NKj6j7K6l0L5qJ0J7j9K6Lj6j2j0L1n3L5
$$ 33 -1 -9 22 15 9 35 9 27 10 80 15 16 -12 15 16 -6 -1 1 -15 -32 -6 -36 -1 -9 1 18 -1 25 28 12 0 -10 21 -32 3
4025CJ2l1M2o5ML7j0K6l5kL2qKlk2L5l2M0j8L2l0jp0Q5J0l9J5j1kk8Q1o5J4QJ3
$$ 3 15 -16 26 -39 -35 2 -8 18 -17 -19 13 5 7 4 -18 17 -15 25 7 39 9 8 -62 23 33 -6 9 -2 -4 -32 49 -16 -2 6 19
4060A9n0J23o3j9N0j11O7l6j2l2O6J3o9J8OM8j2J0K6m1O3n4m6M6m3M3mk4L9l9
$$ 19 -31 92 29 10 60 -51 16 -20 -32 -64 2 15 -54 -36 -30 18 6 16 42 1 64 10 -36 10 -33 10 6 -18 21 -18
4090a8N3n9M9m8O9j7m2J4m3L2K8lOJ1k2j5M1j1p1L7QM3m0j3K6Rol7j2L2NM3k0
$$ -18 35 -24 25 -23 46 29 -13 1 -42 -10 18 15 21 32 10 -5 36 25 -46 -9 -1 42 2 -11 15 24 18 -19 -31 1 6 49 29
4123B9%QK4qm2l6M1k7K9J2Qk7Oj2l3L6l6Q4q9L9qn3N5L2k9j3O6n2k0mrj5M5l6
$$ 29 29 37 61 53 11 -25 16 -11 18 30 38 11 17 5 -28 8 -28 56 -33 6 -2 -55 0 32 3 -10 56 4 -16 -20 -29 -44 1 -35
4157c5L5k5J7l9K0Ok9PjqJ03n7N0m4M4Mm0J0m5O1k5j2QL2n3qLj5NK6j0JK3Nl3
$$ -35 0 -25 -8 -47 -27 -21 -50 -43 -44 -52 51 -6 44 0 44 48 8 18 -27 34 9 -3 5 37 -16 -24 -21 -36 -31 -5 -15 -14 9 14 -19
4192a9NM9n9J0O8o7K0q4L4K7j0N0o2M3P8n3K8m7m0K8KK1k1L3l6j8J2k3L2k7K5
$$ -19 -14 35 -24 -14 54 -13 7 -77 -43 -16 -26 24 -38 5 83 30 58 11 -29 -1 1 22 1 34 -2 -20 -8 -31 1 -26 -1
4223aj5j0N6j2j6JnKRlMJ9l4oMJ7j0Jm4N4J4J0r4N3J0qlPJ9q2N9MK2kJ4p5qO3
$$ -1 -16 -26 30 18 2 3 -2 0 9 6 10 29 -5 -11 -7 10 0 1 -43 11 25 35 -59 -6 4 -4 -7 0 19 -63 -4 0 22 20 34 -41 -49 14
4261A4k6K2J5J7j6k0k9O0r1M9J5Jj9J8pj8J0j7N2k4o6%Q3l3Joj9OM1n7M3k4N9
$$ 14 -12 10 25 42 26 6 -23 37 -54 -5 10 11 -8 10 3 -15 -5 -22 30 6 -60 -60 23 -10 -9 -15 -34 -28 13 -44 -1 -25 34
4294C4po5J18r6K2J0ll9M0j7LK0m7O0k9k1okL1o4P4m0N7n3L6k1m8P0o1K2N6l1
$$ 34 27 -38 80 -16 6 16 13 -26 14 -3 0 20 -27 33 4 -17 -23 -25 6 -58 16 -24 33 -20 16 -5 -53 17 -44 -22 34 3
4326CJ6J3K0n3Ok4L2n0J6Q5j00K2J8%K4j2Pm3N6n0M7m5N5J5q8L0K0j1j0l7M1l6
$$ 3 19 32 52 -1 5 -19 13 -37 -21 64 -36 -14 4 4 28 16 23 -20 36 -14 33 -12 43 58 -30 0 20 9 -1 -38 3 -33
4358c3K9j9RK8j5M2r0P7q2P0L6k6l2k8N0k5M8m4J4j4j4P1no2R1j20N3K8l1j7J4
$$ -33 -4 -23 -14 14 -1 41 -49 28 -54 16 52 26 -6 -34 16 -9 39 -5 9 -5 -19 52 47 -15 76 -44 9 37 6 -11 3
4389CKl5M3o9J06r7J2J2K0k9JK4Rjj4rm0N2ROL5n5j4M5m0j5L2mjR%K5k8k7M7L
$$ 3 5 -30 13 -56 50 -47 -35 -23 -3 -32 -31 -7 2 1 -13 -22 -62 -10 -1 5 40 -15 -29 16 -24 -39 -7 -11 -12 -3 -3 22 -6 -33 14 17
4425A7k9mJ5rlk3QM2J3k8m2N2m1M1jM5o9k2K9l6J3M5l2J3L7l0l8M7j5kpm0ML5
$$ 17 -12 -16 -1 -10 -13 -36 -28 14 27 -1 -43 9 -32 9 8 53 -16 -38 -9 -45 -32 13 -19 -6 31 1 -37 10 -5 -7 -14 -54 -50 -15
4459a5K6m1L6k8K6k0K0J4nm3K2j4J8QKm3N3oL7l5m5M0Kk5K3N5k8k7J6k3l8L1q
$$ -15 11 -30 6 -22 4 -16 4 18 13 -30 -8 -22 -4 4 6 -37 16 10 47 12 -33 7 9 -16 7 62 34 7 23 0 -38 -7 -15
4492a5J1L4no2PnK2J0L6k1m1N5n8M2m5N9n6k4R2o8P4r4N4j7j7M8l4%J8jK9n6K2
$$ -15 -4 30 25 -37 -30 -35 -13 -3 33 12 -29 26 -32 10 -35 24 -32 -56 36 -32 42 -52 2 -15 -32 16 -18 -18 0 -1 28 -28 -6
4525fN9r6L6k6L2lQpM8j31O1L5j4L4n3j5N0j5k8M3j2K3Rm6Kj0K8l7J8O8p2L3m6
$$ -6 53 -43 -7 -33 -1 -4 4 -3 45 -86 -25 10 -4 30 -23 -38 12 -3 -31 12 0 23 32 -14 -12 -22 6 -31 -13 55 -17 16 -30
4558c0N2l7M9k4p8L2K8MJ2J5pLn7M1L7l4NK5m8k8M2m6M1%qO1l0Ll4n4M7k6P4k9
$$ -30 22 -15 34 10 -68 -36 -8 -4 8 23 16 19 -38 3 40 6 11 36 -12 -40 2 -44 -3 -3 -11 50 20 23 -11 -65 -18 -44 30 1
4592AO6l2n7J6J3j1O3q2M4jk8L9n6M0r0N8j1M4o3K9K1l2L9k9M1M0r1j1j3N1l6
$$ 1 67 35 -22 -6 7 -4 59 -23 21 20 -8 31 -25 15 -75 -17 -28 16 -47 -18 3 -29 10 -19 22 62 -29 -40 -53 -2 -38
4623c8O6l9L0m5M9J0m2JK8N4r1N5o3P3j06N6J1%k4K6kll3L6l8NK6J4J5k1j7lK4
$$ -38 28 -11 19 -26 23 33 -9 -8 20 74 -17 38 -25 48 -58 -2 9 9 -15 11 9 6 -27 9 -29 -24 2 16 31 10 -7 -10 14
4656A4M4r7K4OM3o1L9m2N1k4j2K8m5l0P7k6l0M1J8ol4J5K0k4L9k5oNJ2K4l7QJ1
$$ 14 58 -39 -15 -9 34 -27 12 -30 21 -3 -15 13 -32 -62 15 -11 -41 0 18 12 -22 -7 13 -11 28 3 -3 2 14 38 1 9 20
4689B0n3M6k0j5K7J8Pl4J2o9P9k4Qn2LM3m8M4l0j7K7Jk6O5j2KL2Nn5K9jJ5l2k3
$$ 20 -33 13 -7 -22 5 23 30 -4 8 -61 18 -6 2 -50 -47 -4 -52 -8 -38 -55 -28 -27 -53 12 0 2 34 39 -16 13 12 27 -5 -28
4723b8N1M4m0J5Rp3N5o4M1j8J9N%k3l9O4l2K7N2j38P3j2m5L8N1j5n4K4M3m3M5
$$ -28 23 67 27 42 51 -22 33 -31 10 -8 11 16 16 -7 -46 18 -14 13 65 -73 0 -12 -57 -19 32 17 -37 -13 30 -13 32
4754C2%J8o0RJ1j2N2l3l6N1p1rJ33o1k8L1j3rk3LO7j5p5M3j5M1Pm2K8rl2j0PR
$$ 32 32 50 -10 -1 10 -2 50 17 -19 32 -39 -48 85 24 -4 27 14 5 -18 -15 52 37 -38 5 -10 31 38 -4 24 15 -17 -27 -20 -11
4788a1Pm1L8K7J0q2L8K6j9J2J8l2ML4J2j3m5j3JK1l3J05o3k9J3j1K0KJ5Km8PJ3
$$ -11 -4 -45 -7 20 30 -52 -14 12 -7 5 23 -9 -5 29 41 28 -17 -30 -29 -8 -41 64 1 -28 -15 -26 -6 -4 11 13 -35 -28 -15
4821a5J8l2O6k2NJk8M1ll1j0k6k%K5J0j9J6p3R9jl7K4J6rm0J0J9m6J4K4O1o0L7
$$ -15 3 -29 37 15 20 21 -7 34 31 0 -10 -36 -38 -38 -13 -3 -22 -6 -79 20 19 -18 6 22 13 -27 -17 2 -44 -30 -6 55 -5 32
4855C2j5j2k0Pj4QK1J9m1j6J3M4n8N0m6NL4qRk7qlK5JJk7l5L2J8M7l9k7P5n1k4
$$ 32 17 5 -15 -8 -22 -14 7 26 -15 -31 -18 26 -32 18 -28 -23 11 3 12 -15 -23 -26 -1 0 1 -26 -61 -29 -11 36 -3 -30 45 -6 -30
4890c0N1O5j17K0N9l7J2m5L1j3j6N5l1Mkk9rK5L9l0m1L1KK2k4J0q4O6J6MK3p9
$$ -30 21 86 -31 -11 48 11 23 -22 9 -4 -20 35 4 8 6 -23 -32 -7 32 2 -39 -8 -6 16 -8 2 -82 -16 0 4 27 -52
4922e2O4j7l5M0Rj4K8Nl7k9rN5J0l8M4jm8N5Om1K2n3M1K9Mk3oj6jM7L2n3Ml0N
$$ -52 12 -5 -40 0 9 -5 23 28 -9 -38 -47 8 18 -20 24 23 -25 30 36 -5 17 -36 5 34 38 15 9 -7 -8 39 71 18 22 -8 -3
4957crO9o6n6J01m2LPl0M1l7L8n3lO2q7N0LPj9N1Kk9l3LL3m5N5j8M6m9m1P7l9
$$ -3 -12 57 -9 -65 36 -6 -3 4 -26 15 -22 16 -37 -40 22 -65 -15 -12 -5 -24 27 29 0 -33 -30 3 -42 13 -5 41 -8 -49 28 -11
4991a1p%Mk0R3l4n3L7Ok8L0l8K9n2R9m7k2k0N6j5LL7k5lJ8k5jj1pK8lkn1N9m2
$$ -11 -18 -18 -14 -34 59 25 -28 9 15 -13 17 -21 8 -44 55 8 -14 -34 22 7 10 47 22 19 37 12 11 0 -7 21 18 16 -35 24 -18
5026a8P2o1LqRronk5JJ2NK6J7j6JJ5l6j0N2m8mPJ2j0Kl3N9pj8K6pqk2l6O3k6N2
$$ -18 54 -7 -4 -12 -3 -12 -18 -23 -48 -47 -35 -30 -4 13 -3 -2 13 -23 -33 19 -29 -33 -26 -14 -24 -22 -55 4 -3 -21 5 -2 -10 -32 -68 -5 -31 21
5064B1m4oM2J9j8lK0l7j9J3PK3l5j0O8k9J0j1k1nM3l7l0J2Q1r1M2mm1N1j6J4k6
$$ 21 -23 -29 13 32 14 11 31 -6 -25 -12 -5 18 -17 -27 41 12 22 11 -10 -15 28 -9 -39 -27 54 -37 5 1 -40 11 -5 9 -17
5097a7rN9k3L0o9jN2k4MJ4l8L8l0ooO9J2m6J6kk5Jj1m1N0k1N5m5j5j0OO4p9K1
$$ -17 -26 33 10 40 -29 -30 22 -2 2 16 -22 16 -14 -20 -26 43 55 9 25 23 -2 -1 -12 -53 -3 -24 31 -14 -29 -39 -33 31 -48 -27
5131b7PM4k9j7j2L3Rl8N9M5q5J9k2J7j0J7oJ2J1j7kj1J7k2N%j1k4P4k7J3k8MK7
$$ -27 -20 24 -5 -22 -34 -1 8 -30 29 74 -11 8 -14 3 -7 10 4 16 27 10 8 -3 14 -8 -3 -3 -14 -38 36 9 22 -6 -2 25
5165B5k6l3M5K0n3P8m2k%PJ3j6k1Ok4k9P5rl4Kl0K8PK2m9N0k9J8J6K2l0j4k8K0
$$ 25 -1 -34 11 31 -22 56 14 12 12 19 32 16 -5 1 -23 -52 23 14 -20 -18 -48 -20 -13 9 -40 10 -19 -1 15 37 7 -7 -35 -15
5199a5K0k8QK2M8o2kNl6M8k6rL7j3k1N9Kl6l6Q6k9%k2N8q5P8n1l3L4K3qo4P7L9
$$ -15 5 -23 -15 7 55 -7 -9 -4 -40 8 -18 -27 10 -3 -24 35 37 1 -35 51 22 22 0 58 -27 51 0 -33 1 24 16 -48 29 68
5233F8n8k0N0m9N4m8OM2%m8m8L5L8m8J7jN2n9L3q4Q3p6PO6oRJ9kj5k3j1qM9m3
$$ 68 10 -10 40 -9 45 -3 3 45 45 -3 -51 -16 22 -26 -9 -10 42 -17 16 -68 15 -61 -54 12 6 15 34 32 17 -6 -17 -25 24 -19
5267a9pJ0J3k7J47j45N1kjjK3n7l0L8LL1j0rk5m1N7K4qk2M9l0jk6L3j5Qk3P3j0
$$ -19 -26 -16 -3 -30 117 -28 23 21 20 19 42 -15 -45 -7 -4 27 17 8 -17 -58 -1 23 15 -7 42 12 11 -15 18 3 11 -12 61 51
5301E1l5j1mj7j05N4P4OK1n2rk2N2M1o4O0m1J2j9N2n1PM1ql7l2M7Lj2J7j9j0k5
$$ 51 16 5 1 -16 -121 -67 7 13 34 -18 -27 -49 3 44 -20 40 -1 11 -8 44 -7 0 41 33 -4 -36 11 14 2 19 0 -10 -35
5334c5N0L1m1J9l9NJ4%p6Q7p1Q7k7j5k7K8K2K9n2L8K8j7m4M5n0L5Ml5L7l5j5M7
$$ -35 15 46 5 24 -15 -10 4 4 -72 15 -56 31 4 -11 -38 -10 12 41 -11 27 55 38 -6 39 -11 24 28 -7 30 -5 -20 27
5366B7qm7l9J6Q1j1n8L1Jl0N6J9l2J3j7K3Npk2k4L7Rn3M2j0K9k1o1R3p7N7k8j7
$$ 27 19 -28 -67 -51 30 19 -39 -8 -7 -37 19 38 6 19 2 25 30 23 1 -23 14 23 -30 12 2 31 10 -51 42 -35 22 -6 -23
5399b3O8o3%L3k7L4M0o8J7J4n0M5MPrm9mN7l9K0J7n4J7k4mKO8Jj6k6J3l6M6m4
$$ -23 45 -18 -18 15 -12 22 62 -6 11 25 -25 20 24 31 22 -27 -31 26 -13 7 24 -30 -13 -37 -41 -39 29 30 14 -12 1 -35 11 -33
5433c3O2k9MNj4O3n4m1M3kj2Mnj9OM2l5KN3Qm2J5qm0P6k6m3K3k9mO6mj9k5J5l0
$$ -33 29 0 4 9 -5 58 4 -37 6 4 -8 -4 -9 -28 -22 20 -15 -13 40 48 6 21 13 -27 49 23 -20 3 -26 -30 36 32 13 -12 3 -27
5469b7M6moQK3l8j8J2PL1no8K8NL9Jkk3J6l1J1n0O1n9O6m2j8P8rl7KK9lk5JJ2
$$ -27 19 15 9 17 40 2 -16 -4 3 34 29 -39 -11 -6 33 34 32 9 25 -6 5 -45 16 -43 23 -19 -37 41 32 -5 -3 26 23 -2 -1 11
5505A1j7Mo6N8KJJ4k5K0Kl0M2ml5oO5Lo4Q1k4Po5O6q3L1J5O4l9k5K4J2k3n8LN3
$$ 11 -6 -2 -68 -10 -8 -7 7 -18 2 4 -26 16 12 -23 -29 36 39 -25 56 32 39 -26 40 -43 -12 3 67 28 3 27 39 16 -42 -39 14
5540A4Ql6J2Kj6K6L9k9o3N4Ll7M2j8pPLK2l6M9p2Q2l5r3P7JL5r9P0k4N5M5j02
$$ 14 22 -14 -2 0 -16 10 49 20 -43 11 14 -23 19 1 -6 1 4 26 -10 39 -33 49 14 -79 -2 -1 34 -65 5 -19 36 81 -21
5573b1k2L8M2l6J8j2K4m0K4k5J9Mn2N7n6Q1k7Pk6MoJ6k9J0qK5M1l4J3mJ3o6K0
$$ -21 -43 -5 37 1 19 7 31 -9 15 -10 9 13 -39 18 -38 43 16 23 -3 1 -5 11 -18 -8 -16 9 50 16 29 25 38 -28 -8
5606hJK8OJ4J2k3lj3L9p0RK5j4K7rk1n5P9k1NJ8r0L1M2OJ2j4M6l7j3n7PQ1m3L5
$$ -8 -7 21 27 41 53 30 27 14 53 -17 -8 17 3 30 21 0 -55 24 3 8 26 -64 -33 9 15 27 13 59 22 9 -48 -41 40 -3 32
5641C2l5jm1M3J0L9n9KJK7p5O3Jj9rL4n6L6m4L4J4jQ8j03pN3j9l5L5K2%l7L7j5
$$ 32 -3 -4 -45 -2 8 47 -12 -10 -9 18 -57 6 7 -12 -21 13 -43 -7 -51 -17 -3 -4 84 -19 -26 27 8 -27 8 30 30 -7 30 15
5675A5n3L1k0oJ0J0K9l8KJ8o5N3Jj9M2P2q5L3m5mk0N2j5K2L1n2PoJ8l1M5r1R5
$$ 15 -38 -7 -27 -33 -23 -13 16 -22 -20 -2 -67 -14 -13 -32 10 82 -3 30 -15 -19 -39 13 -2 20 51 -1 6 0 18 -13 32 -59 36
5708C6m9K2Kl2K0kJ5mnm1k0O8j7L1k0J7r5J20k1Ok3J8n5J7Rl1M0l8L0N4J0l7l2
$$ 36 -13 9 11 -21 -1 -3 12 8 3 -38 -58 10 -7 24 4 21 -74 46 25 31 8 26 -29 -12 -3 -34 6 -32 -2 52 62 25 -7
5741gJ9M9k1o2N7k3k7J5l6N5qk1l8L9K1k0OrjRk5J4K3n7O0J8m9jJj2N3j7k3k2
$$ -7 12 61 40 -22 35 12 -15 0 -36 19 11 -10 -48 -9 12 -8 -2 -11 -12 -3 -28 -14 9 -48 12 30 -19 -20 -19 -31 22 5 -18 -40
5775d0K3PJ8Mk4k5R5l9J6n5l0L4P8m9k1j3qP0p1N0j5l5J0kL1l3L9o6N0k5K3J6
$$ -40 -17 -10 8 12 -12 -37 58 19 35 -20 -50 -16 62 13 -8 -21 -29 41 -30 20 5 -30 -20 -22 9 -24 15 -51 -1 -26 -3 13
5807A3noj9Q5p2j2K9J0j8kJ7JQo7M7J3l8n%JL9J2qk1kk1KM0m8k9K0N4pj2Pj3J5
$$ 13 8 2 -17 68 -4 -16 13 23 5 3 20 21 29 -38 9 22 -16 -21 -21 -20 19 31 23 2 0 -21 -19 21 -27 -56 -36 18 11 -1 6 -7 8
5844HL6l5K9j5p1L1L4L3n6K1n1L9M7kLp0J5rk5L2o5O9L3l3jnJK6m1L1q4L9N7o4
$$ 8 44 9 38 23 -48 -17 17 50 -6 15 -36 3 50 48 51 -19 -4 -13 -38 -6 -71 -2 31 -2 -3 -8 -7 19 -22 9 -75 -36 21 -43
5878d3M4M7k9l8M5p3L1M1j7p5M5K0j7ON9m3k6j0N0k3KJqMj3l7N1lK4k1llOLK7
$$ -43 1 48 19 -19 26 -47 -16 25 8 -67 -22 -2 -19 -13 46 3 -23 -33 17 -6 -4 -3 -11 -7 -20 -57 -6 -9 15 -6 -9 -12 -6 -3 24
5913B4J9p2K8K5j9k%J1qN4j04O7l4K2K3l7LK2kn0L5k6K9n9J01l8Prl1M4k3j7K4
$$ 24 43 -29 -1 24 5 3 3 14 6 60 -44 23 -11 11 34 -3 0 22 20 -30 5 -21 8 -51 50 12 19 10 -21 23 0 -17 7
5946Gj7J8J6j5j9k5O1n3PO4pq5Q5kk6j5k9M0L3o3J6Rj2N9m2N8j01M0K4l5j2N4
$$ 7 -10 8 24 9 -10 -35 26 -27 -20 44 37 -48 37 35 9 -6 -35 5 38 -25 -9 0 -12 47 5 63 -38 2 26 -9 -21 33
5978C3l8k4M8PK1qo6O4Om6J1jLM1n2J3%ROk0n7O0nm0O5j4jj2k6L0j1QJ2J4k1q3
$$ 33 -5 -29 19 26 47 39 -27 37 43 -3 8 7 10 51 -1 12 12 21 27 7 -50 10 5 -35 30 16 15 3 -23 7 -4 4 16 30 9 -74
6014g4M7%jK5K1l9O3o8K0J2J9QKm0J4J6kl1M0k6j0j9O6m7l3RO3k2K7k5kRj8Jn
$$ -74 -27 -27 -28 -3 18 -21 42 -26 -6 6 25 33 35 -5 9 25 23 -8 32 6 -4 -23 43 -4 -37 -28 35 13 40 15 13 22 4 5 0
6049@J4J3p9M3K6m5M0m8j4J00l2l6K8n5j2N8KpqM7n8OJ8k8O6n4K3m2M7n8J2K2
$$ 0 14 27 -52 -9 17 -28 12 -36 -50 50 18 -18 10 -45 -57 1 3 -4 -12 35 -23 -17 1 -27 39 -15 8 -34 13 -45 -33 -11
6081a1j7L1L7l7J6m9L3j9Kj3k4Q5j03O0J4kl2J0O8q9K7k4J8L4j1l1L2m4N5KMj2
$$ -11 -28 3 40 3 19 -30 3 -16 -14 -27 -51 34 -69 -9 5 3 -29 -19 49 -40 -13 -37 -19 15 4 -27 5 -39 16 18 22 10
6113A0j8J0K7p0M8jm6M3k0J3k2M4K0K7p0L0Pk9K8j9LOj7nM3q6L2pL8mnJ9n9P1
$$ 10 -8 2 29 -41 7 6 -40 3 -17 -4 -26 18 38 65 -5 25 32 3 31 12 15 21 4 -1 42 -44 -12 -19 19 15 10 29 -30 41
6147D1m3k6RJ7j1Nkm7R0r4J9jM4m5Q0l9Rj2jQ9j10M0j8l6N8M4q2NL8j1nj1lk3
$$ 41 -2 -28 -19 -2 -13 -8 -10 -57 33 -61 -42 -43 1 -44 36 -3 6 -6 -7 82 -28 12 -6 -42 16 60 -22 -17 21 10 5 -6 -9 -32
6181c2R0n5J7q4Q0l5M8n2M8o9K7LQJ1l0N0k6pJ3Km4N6l4M3k1k8K1M5k4k5M7p7
$$ -32 58 3 20 -64 16 -19 29 -23 25 -44 -17 -14 -6 5 -25 25 -1 -8 5 7 -37 19 -15 28 7 -21 0 45 21 -4 43 -34
6213c4K4J1j7K2Ln9Q0n1M1J0n2rM5ok3L8j3N6j04O5m0KpJ4n2J17m3K8q2O2%n4
$$ -34 -10 1 -16 6 9 -50 30 -21 20 30 -22 -31 14 8 -15 23 10 66 -38 27 -13 -11 -18 -4 -56 61 18 46 -36 26 26 -28
6245b8lL2K1Nl9pL5Rl4m7P0n0L1k7M4k1k0k5O4k1MJ4l9O3k6j6K2J8lpn1L7J0l9
$$ -28 -31 1 22 27 -12 -19 16 25 -9 -56 14 -36 -5 -32 12 -9 -29 -54 10 -11 -7 7 -32 31 5 -11 11 29 26 19 -32 5 15 -24
6279b4O8l1l6L7j6J6n1L7qj7O5l1Jj9K8j0j2Pn0N0m3NJ1K0O7o6k0N3n2K1j1n9
$$ -24 44 13 -23 14 -2 14 -37 0 -8 -25 40 9 10 -9 19 9 -3 4 -46 4 -39 -34 -23 -3 64 -2 -22 31 -21 0 -11 -70
6311g0R9m3M6J4l6nm0M1m8O1j0k5K4N2p8mL4j8K5%l3J6oJ5m8J3M5j7j4L6nk0n
$$ -70 29 -14 32 46 10 5 -35 6 -42 19 9 -16 8 60 -18 -22 12 -6 19 19 -14 2 -4 11 -37 -24 21 4 -10 26 21 1 -4
6344djN5j3n5M2l9k0J6N2o1J3J8j8km0O1J7k7K9lppOj6%on0R9j9jo7M6J6J2p4
$$ -4 -5 50 37 -18 24 -15 -35 -19 33 -28 -15 3 -15 -17 -57 4 21 -6 23 20 13 6 12 -4 -4 -10 -60 39 20 19 -48 -2 14 26 -48
6379d8N9J5k8L0q4O7Lk5J5Rj8N5m3rJ3k8L5l8L7oL8p0j0N2k6J4L9l6k4m6N9Pl
$$ -48 11 26 -2 28 -56 11 14 -11 4 13 -5 50 7 -2 11 -17 18 -20 17 11 49 -21 -31 21 -5 9 48 12 -12 -58 1 8 5
6412ERj9K9j0L6p3j7K9K5OK8p2L0L5k2m4LJ3o6P1K1l1L9p1O4Mk9k0J0K9J3K7p2
$$ 5 14 -5 24 14 50 -23 -40 -11 14 20 48 -24 6 41 19 -25 -22 -9 -75 -4 17 -14 25 -46 18 22 -7 -27 -17 12 25 52 -20
6445b0M2k2k9K0L5No1M8K5n8%J9Nj7j4m0N9LL7k6l2J4l5L8m1O9j1K0Lp2M6j2L
$$ -20 22 0 -29 -9 26 31 -30 18 43 -15 -15 4 9 -8 -22 -62 -3 0 37 11 -21 -7 -42 -4 -45 24 13 33 36 -36 10 -2 1
6478Aj4pK7J2o4K9LnJ1O7qo6L2k7K7k6L3p6Q6m2M2l0qL3o5L6j4k6oM7j4J8kl0
$$ 1 -13 -20 7 19 -45 -16 -13 -18 -7 60 52 -14 18 -9 18 -8 25 -51 35 -7 35 5 -3 30 -35 1 -13 -39 -45 2 -12 6 4 -26
6512b6K5LL9n3K7K2J9p9k2P5k2L0l7jj0m6P6qo6N0k1M1nK0j4oK2nk4J2q3mM9k
$$ -26 -1 2 41 -12 15 37 56 -23 -45 30 8 38 1 0 -10 -56 20 12 -54 -4 -25 16 11 31 17 11 33 28 4 16 -67 -71 -22 -24
6546b4j1L2J6l5J0j4PL4m3j6M9l5J5M2J0l2oJ5k1Ml2N0l3J5J9K1pnl7j3qR3kj11
$$ -24 -35 -3 13 -22 -12 -26 -19 15 -28 -44 5 -30 -15 27 37 5 -1 14 -7 -3 -35 15 -18 -3 16 37 30 25 -12 -25 -33 60 58 -53
6580e3M5MOLm4M7l8J7k2O2q6O5Pl4O6p5M4M0l4l2L1k2n3M2k3M8PlK6nl0PJ0j6
$$ -53 -8 -4 2 5 -39 8 -30 -13 -35 27 -59 6 13 -21 45 -30 14 54 20 -12 19 -3 -56 -14 -37 11 18 15 41 36 6 13 23 7
6614Gk2K7k6M2l8K1K3l2l3K0M6k9l5L0J8J1Mm6J7l6K2M0nJK1n6Rk9K9J6Nj1k7
$$ 7 -15 12 -14 28 -10 11 34 2 -31 -11 35 6 -29 1 19 30 34 -12 5 -31 -9 31 26 27 48 -8 1 -28 1 17 22 11 -16
6647a6J3M5k6RM0j05J4K3NL3n0%J7lj4mJ9L0l2j5K3j5K2k5k8Pj2M3k3L3N7l2m6
$$ -16 -3 42 16 25 65 -40 -26 -3 2 35 -15 -15 2 -1 -15 -19 0 30 -2 -17 6 -9 13 -12 -40 -33 -45 -2 -25 8 65 33 -13
6680a3M9l7l3rP8Pn2K6j7o1N9n5M7J6n7N7%j7L2MKj3l8N8Nkjj0p2M7j3J5l9M8
$$ -13 36 -1 -34 -43 35 42 -10 16 -1 -62 -3 -58 -11 5 -52 5 5 -12 20 24 26 13 -25 33 38 36 35 25 -47 0 -13 2 -37 11
6714A1j9L2Nj6j0K3k8j6K2m8L8n1O0l7K3M1Ol8j4K3n3Q6K3o2j3j0M2N1o7nJ1j4
$$ 11 -8 24 29 13 3 26 -2 -18 4 -44 -6 -57 3 -34 -11 30 36 -2 -16 7 -46 40 63 1 -12 -22 20 71 4 -1 10 -4
6746djk2K7J8lj4K4J0p7K8L4j1n8K0N2rk9k0P1m2M6lj12O9kp5P2K5J4n4N2mL7
$$ -4 -5 -27 0 18 15 1 25 35 -42 -14 20 9 -49 -29 23 14 -15 -35 36 -6 40 37 -75 -6 -8 -83 -11 14 28 -26 26 22 59
6779E9o2l0KJ6J8P4j16P2K3k9o1L8mj6L6n8N0lJ5l3jO4j6j07P2l4J4N9l4K5m9
$$ 59 -3 -33 -31 -15 3 77 -39 33 56 27 -34 4 0 -16 20 -38 12 9 24 -9 -10 54 38 -69 3 -31 -17 42 8 33 -16
6810a6k0J7P4n9J8m7l4O2k0L0J4rJ3LOk1L3m6M1m4N4k4l4k4L7J4m6M6K5m5j5O4
$$ -16 -36 -19 55 -4 14 -33 -67 -5 -25 5 19 10 23 26 32 11 44 -2 39 -5 49 25 -9 -33 4 18 -28 18 43 -2 -17 47
6842D7pnn3NJ4q6Q3jK6n3M1Nn5Q0m7l8MP1l8k8N4Oj2%l7J4qM6k9Rk7K3j0%Qj6
$$ 47 40 35 -18 -13 1 -85 -2 -3 23 -30 11 16 -39 41 -6 -44 -40 31 -7 -35 19 25 13 13 -24 -10 -18 28 -1 8 -19 4 -6 -6 2 -14
6878a4n3Q2j6j0O5l1m5O0l5Mpk0Q4j11L1J8L1q2L4l3L4RK1%j8J8k1k3M1J1k9l2
$$ -14 -67 15 -1 -11 54 23 -22 38 3 7 0 -20 64 -47 -16 2 33 -49 -15 -48 -14 -5 16 16 -2 16 -5 -28 13 24 -5 -37
6910c7K5pL0J7m0Ml0O0rM5j9k1o8O3Lk6l4J08n4J3k0l6Ml9P7m7M4J3O4p6oLm6
$$ -37 -12 -19 11 28 -12 -8 -38 22 13 58 39 18 -50 13 16 -10 -44 64 10 23 3 -33 -29 -68 9 -38 6 19 83 7 1 4 -42
6943d2L5J7oJ1j9Npj3j6j6N8MK7j9l9J8Lj5lL5j2L2j17N8K2J5Jl8M1%m6J9j9l2
$$ -42 -7 10 4 15 -4 1 -6 -19 -35 -51 7 11 38 19 -20 -2 1 -14 -17 18 6 38 -79 -21 1 16 17 -21 20 20 -26 -7 -26 -58
6977e8L2L8J0oj0k8O6o4K7M8m3J1K8q6J0nK8M8p2K6nj3L7ml9j5Q6n7lN1m3k3j
$$ -58 -26 12 22 16 6 -22 44 -20 7 55 12 23 51 -35 -25 -30 -2 46 -26 0 -5 -18 19 15 -24 -39 47 -10 -13 38 -5 -28 -29
7010b9K2kj4J8M1j3l8j8N6l1N9l7p4P7k2Mk8o1P6j7J8lkL1k3j9L7nK2J5l4N9m1
$$ -29 -7 -9 -23 -5 36 23 -15 -33 23 -8 51 14 -60 17 -5 -1 -29 -90 -14 -31 -13 -16 -18 13 -10 -29 8 3 25 40 6 65 24
7043B4Nl3k9O9m5rK3J0J5J7l9J2Ll8nj4J0RP1p5jj5K7l9O6m7P1o0M2M7j09J02
$$ 24 29 -4 -33 36 -9 -18 5 15 30 47 8 20 23 -15 -20 -34 -24 -15 56 -19 -20 -35 -8 -47 19 -28 43 -17 25 72 -37 65
7075F5j07L6j7K3k1mL3jk3MM9l2k2k5O5k7mk7pK6NK5Rm9O6mm0J5o6K6M9pm0J2
$$ 65 -42 -6 -23 0 -21 -25 8 7 -16 -12 37 5 -17 -42 23 -4 -8 -35 -42 -16 -11 14 23 -26 40 36 -4 11 -55 -29 20 13 -27 -15
7109a5M6ol2ko0J03mo0N9Qm8J2j0J2l1L6Lk8J3JM3p8J3JN8Om2j2m1K9K4rQ3o3
$$ -15 31 25 -7 -9 -69 34 30 -30 29 37 -11 1 -9 3 -28 8 11 -17 -4 -3 40 -38 -25 -24 34 40 -2 -14 -55 -26 -2 -11 72 9
7143Irn4L0O9m7j2j2O8n1L8k4jj7J5J6k4j9LN2l0j1L2k9JK6n7J7K2j1rM2l0Nj8
$$ 9 0 -54 -24 45 -2 -14 -26 42 -9 29 5 4 -13 2 18 -6 -25 -22 30 0 -11 21 -8 -7 19 -38 -21 1 -10 -19 23 -7 -2 -20
7177b0jK4l5rM2P1j12rR8m5k0j2N3om0N4K2n7K5J1Nl6J8nM1o4O2k4o5K7J9M0n8
$$ -20 -21 3 -32 -41 1 72 -40 -49 49 4 -16 -28 25 19 -21 33 55 -2 23 34 39 3 21 16 57 -7 55 31 -34 -7 12 52 -6
7210fL3j29P1j7O3j8K0j8J9j9K6r0M7Mk5O2m1M8j5n0M4k4l6N2K1OnK8j06O7J9
$$ -6 27 -102 -31 -48 15 -3 17 -1 18 -1 25 -65 -18 -14 -39 23 -18 30 15 -35 9 -15 -51 1 22 28 23 51 -55 12 31
7241C1o0M9O0l6n5j2N7j8k9K7Ll8NP0q2O8n8L1Mo4K2L6k6M9p2K1J9k0Mj4N3k7
$$ 31 -29 20 80 44 -11 -23 34 16 -13 14 17 -21 -16 54 -28 40 -18 13 17 -47 -25 11 -15 34 -38 -17 2 -18 -14 -28 25 -2
7273bQMl7M2j5J0J6k6nk6P0m5M3n9P2o1K5K6o1mML1j9O0o5nK1M0k0Nl3n8M3MM6
$$ -2 6 10 -27 15 0 10 26 0 -5 -31 39 -6 37 -22 50 -11 14 40 -21 -25 -21 10 -9 51 -14 -19 2 42 22 27 -6 -64 -21 -17 29
7308B9j5k9Pj1NRj4L4K2oj7Nk8k7J7qM1o7L2M0L8n9J6n8J0P2p4Q1m3J2k9Qk1N6
$$ 29 14 -15 -8 -19 -14 -5 -19 15 37 31 14 19 -9 -36 -19 -27 14 -53 -21 19 57 -2 14 -44 -34 38 -36 45 2 14 -15 -7 -28 28
7342B8okk1nl6NN0m7M6n1M4N8r7P5l1j8K1qk4k2L8k3J7Rl8%lJ07o0p7O3pM4m3
$$ 28 22 20 -1 -6 -42 -37 13 -34 12 -39 5 63 -34 41 10 -8 13 5 -19 -41 -3 -26 -9 0 -38 -38 -41 66 6 -71 -8 -15 29 -14
7376a4rL8nl7K6k6Q7m4k0n0Q4k7N4p8L7jl1L3m8P3o1kK3m1O5K4l4jkMj5k7M6j4
$$ -14 -23 15 10 -27 -1 -27 60 16 -4 -54 30 3 57 -21 16 15 -16 17 -31 42 -19 -21 2 -39 26 50 16 15 13 17 2 -25 21 7
7410GJ3k4j0j6L5J4k2M5o0j5M8om9O3nj1k5j6K2J2k0M7j0j9l5L2K3pr%qNK7L0
$$ 7 20 -4 -14 -30 5 19 -3 42 -18 -33 15 9 -40 23 18 7 -18 -34 -12 0 -20 27 17 -2 -37 -5 18 11 2 2 -6 -1 26 56
7444E6n8l1P0j2j1M5p6OL7J4p4J2OL3nK0k8J9j2L3j15M6J1k4P1M5n8k6J0m7P9
$$ 56 -2 -33 37 25 14 59 -17 -11 26 40 -34 -22 -16 17 12 32 4 23 11 44 -71 -25 -14 -38 33 78 20 -6 4 -43 36
7475C6m7O2p1j2M2k2j2m1N2K8Rk8rJ0lm8N3NRJ6l4kNK5r1N0L0j2l1J4J9l8OM6
$$ 36 -11 51 -20 -32 10 -12 -24 -65 -13 15 24 -4 -13 -3 -6 -54 -1 4 13 29 -5 -7 -2 23 -68 -18 12 0 -31 -17 2 -36 -30 16
7509A6Pj9Lj8m4L2M7p7M7k9rjL2jj0O1j7J7k6q5M2RK1MK7m3Q1o8q8O3nj0P5k9
$$ 16 23 4 7 -11 -55 -23 24 -53 -6 -35 -44 -45 -13 -14 -24 37 20 37 11 -74 -32 -23 -2 2 29 -14 67 -1 -89 -26 -31 -41 34 5
7543EJm1N4rk5K4J1Kp1K3L7l6L3lQL6p6M9k6m4N2j1M9j9p0N8j4L0q3K9j0O7m2
$$ 5 6 -35 19 10 -15 9 20 22 -49 -26 11 -25 8 5 13 49 -27 22 -4 -48 4 -7 42 23 -47 11 -3 27 -56 -27 -37 30 -12
7576a2%J6K7n6K0K2nk5k5L7J5Ql4qk7M2j5MJ9j1L0o1L3M3N9q5K5n0N0l8qL7J1
$$ -12 -12 4 31 -25 -5 17 12 -13 -38 -1 14 22 -12 -20 -47 -5 -20 -16 3 -8 22 -39 -6 37 96 11 36 -14 36 -2 -10 27 38
7609C8o1%K6l9M1J0l2P2q7L2j1L2%j8mJ9qJ5k5LK5rj6o8N2J3Njm0K5JJ0%l8K4
$$ 38 -23 -23 3 -36 5 15 -17 55 -32 0 -11 21 21 3 -1 18 10 25 0 3 28 19 3 -65 -13 0 5 4 -36 -11 -10 0 0 -38 -14
7644a4P8o0k1J8qK5j9l8O3p0L5k6K8L7j5m4J3L2o1N6J0l0%m4Q4n4k5J9L6J7k8
$$ -14 64 4 -17 1 -7 18 -1 -39 24 -46 -11 -37 -9 28 13 -31 -18 14 -47 9 19 -11 -11 -55 29 -25 -50 -31 5 22 -6
7675fk1j4j5J03op9J0pj3K2j5K8JK7K4n3k3M2P0j12mJ0P0n6m1N2J9j2J4j2m0P3
$$ -6 -27 -41 -56 47 41 -38 -28 -35 -48 -26 -41 -13 -12 15 39 -14 -37 5 75 -37 -41 -31 39 -17 -58 -6 13 1 15 3 -37 36
7707C6j6jm6nL1Lj7k7Q5k7l9K7j1j6mpN1p2M9O6j32K6M4N2m0M9q4J7j2K1Jk4M6
$$ 36 20 19 -27 -32 -1 2 -15 -42 43 16 -23 4 -7 -23 -27 -34 17 -55 -6 60 -72 -46 -2 50 10 59 -25 -8 -20 1 2 -22 24
7740B4J9o1K1NrJ7j6j1L5L2l1l6N3On4L4l3k3LL7lk5j1O0Kk6l2n4R6l9L1j2L9
$$ 24 43 -18 3 8 -1 16 0 -11 24 56 25 -11 42 48 -6 28 -5 -28 -25 12 9 -16 -27 33 35 9 -23 -77 19 -20 11 -1 38
7773C8j8p8K7K8m7M3L3k7o8R0l8M2mo3O4J7m9l4N3l6mL2K3o9%O6j2j6j8l0O5n5
$$ 38 20 -58 -31 -3 -50 -7 26 -1 -69 21 -17 25 21 -42 22 39 -10 -44 9 -27 -31 1 24 -45 -45 21 9 -7 -25 -55 10 -45
7805d5N9k6K6K9m5rM4l1l4J5LL9j1j5k1L2l0N7l9K3L7q7nO9l0m6N2l4K4l6O2k4
$$ -45 14 -12 14 43 -2 -11 33 2 -32 -17 -14 25 14 -1 -22 10 -20 37 -2 21 58 -29 -34 35 5 -41 11 -23 1 -35 27 3
7837CnJ7rJ0k0k6PK9o2Q0o0K0n1P9k9k3K0j2MjJ4M2j7J9K5l5k9o7P7p8P3j0k9
$$ 3 -2 15 6 16 -4 -30 -23 6 -56 24 -36 -16 -67 12 -17 -40 -20 -32 -28 -29 -15 27 10 29 54 19 -10 -77 0 -78 -5 -15 -44
7870d4K6J8L0o0L2l0N1j2K6Om3k3n1Q1m2R6j2m4o3P1l6L7j9J7KK3q0M8j3J8j1
$$ -44 -18 0 30 -30 2 -28 23 11 37 43 0 -23 -74 7 -35 61 49 5 -58 13 -23 14 -5 12 14 37 -43 5 -8 10 -1
7901al3K8M6o3k2M3L%n3M2k0N4l7J7j5M9j4k4j1n2L3N4m9k9M9k3K9mM1l4M2j01
$$ -1 -34 -6 40 -23 -45 -2 1 1 -52 -10 -30 24 -13 4 -11 38 24 0 -11 -63 -30 24 -25 -54 -5 -28 1 -3 38 4 46 -55
7933e5R6m8M4n1M2j38Q6M8j29J39k9J2jj1JM8n6J3L8k3lk7j9nOJ5J2Oj5RRpq2
$$ -55 41 -7 37 -14 28 -110 -24 24 -105 34 5 17 16 5 6 54 -2 11 49 26 23 -4 -23 -28 -22 -7 5 11 -4 5 14 7 -75
7966g5K1J54j54M5J3J51j47k0%n1M0j9JL3K6j4k0LJ7j5j1N2q7Q5p1J03p6O0j5
$$ -75 -54 100 -54 -9 4 155 8 -12 -12 -63 -23 -42 -41 -8 18 4 -16 -13 4 -11 -22 30 -57 28 -43 60 -16 44 29
7995B9km2J4lJ2p0K6M7J5k0K5Lj8k1K5%k1%J5k6K3k5m2O5o8P6j13J39n8j4J0O
$$ 29 27 -15 -1 -4 8 -62 -36 11 26 6 31 34 16 -5 20 20 -1 -1 14 -12 11 -14 -56 9 -59 17 -96 43 -15 -29 -19 -13
8027a3J8mO8p6j7L0k0K8LjJ2rk8M8n2LK7J1J9m1j2k4jM2m7L1%Orj3pJ3K7m3J4
$$ -13 5 1 69 -7 -24 6 -14 14 17 16 28 19 -9 39 -13 -10 17 28 47 6 -6 -30 -31 11 -36 -5 -5 1 -8 -21 -28 -15 12 -31 -17
8062a7kN1n5J9M2m3M8l9mKK1k4J5l2Qj0ON2k6j6J6k8j1j0j8j4N0L1kl3L3j6mN6
$$ -17 -19 32 -23 -4 38 -5 43 4 0 2 23 -1 14 -18 -10 -20 -14 38 12 -4 12 -16 -27 -37 -55 -69 -19 12 10 -23 10 -6 -10 46
8096D6m4jJ6M4j07J00q7K4o1J00qj17Q5o2P4K5l3K7Ql7l4O3LOn0J1l5R1k4l0K3
$$ 46 2 1 17 61 -46 54 -33 -9 -70 30 22 -95 -10 -72 2 27 -6 21 29 -8 -42 21 24 30 -20 -9 -44 47 23 -7 16
8127A6L8jj19M7M1n6N7O6q9L3o7l7Q2L5n1J6m3Rl7P0oJ3OLJ2p7j2LJ5L8k1M6j9
$$ 16 54 53 -66 -19 22 -34 23 89 0 33 -34 -71 11 46 -5 11 -32 -23 -60 10 4 17 23 26 38 -39 -51 -48 -33 5 -16 30 11
8160A1j8l5QL5M4o4J1m0M6mk8P9%p3PK8L0K4q5O1l7j1lL6k7Oj8nN3n4K0
$$ 11 -7 -42 -34 1 45 -19 -8 -48 -2 -6 -34 45 45 -28 -21 7 37 61 -24 37 0 -11 -14 22 -5 1 -17 -22 31 -23 -3
8191c
$$ Imaginary data points
##PAGE= N=2
##DATA TABLE= (X++(I..I)), XYDATA
0@%%%%%%%%%%%Qj6J6j6K4l2L3m1N6o5P3q8J05j23J46j70J95k27K61l00L46l94
$$ 0 0 0 0 0 0 0 0 0 0 0 0 8 -8 8 -8 16 -16 17 -24 32 -33 40 -48 57 -66 80 -90 105 -122 139 -161 185 -209
33b09M44n02N66o33P08p95Q91r90J103j226J355j499J658j834K024k228K455k706
$$ -209 235 -267 299 -334 374 -421 470 -520 583 -643 712 -787 871 -963 1061 -1167 1288 -1418
51a418K982l287L623l999M425m909N460o097O845p737Q822j0174J1918j4268J7614
$$ -1418 1564 -1723 1900 -2099 2326 -2583 2877 -3220 3625 -4112 4710 -5464 6454 -7814 9800
66I800k2802L2030n3454J97401J00729k86740n5612L4422M0916r9773n9926M3136
$$ 9800 -13002 19028 -34426 162975 263704 -23036 -78648 -44226 -3310 -103083 -163009 -119873
78a19873J19731K4348m1715j8326P2972M7974l3018p1685L068N0688J9441m8985
$$ -119873 -142 24206 -17509 -35835 37137 85111 52093 -19592 -16524 34164 53605 4620
90D620l2609K5897M3884j6632n2722k1855L0730J7401k6747l0522K3090N1015
$$ 4620 -27989 -2092 41792 25160 -27562 -49417 -18687 -1286 -28033 -58555 -35465 15550
102A5550K0715k0443q411K6604K4108k0784m2358j5550J5685L373k5433j9215
$$ 15550 36265 15822 7411 34015 58123 37339 -5019 -20569 -4884 -1511 -26944 -46159
114d6159J8383L2692O746j7049l081K2102J5764j5219k4292p3J8995M733j6854
$$ -46159 -27776 4916 11662 -5387 -8468 13634 29398 14179 -10113 -10186 8809 13542 -3312
127c312j0418J3694J7060n631j9769n386J2996O192j3474j3513Q128J9225N004
$$ -3312 -13730 -36 17024 11393 -8376 -13762 -766 5426 -8048 -21561 -13433 5792 10796
140A0796j0069k981J2817J0055q789j6069k679Q856R48j2210p651R133J3328K2
$$ 10796 727 -2254 10563 20618 11829 -4240 -6919 1937 2885 -9325 -16976 -7843 5485 5507
154E507q980n97J0279N064q645j0084K113Q792M57q284k523Q824P862m013q626
$$ 5507 -3473 -4070 6209 11273 2628 -7456 -5343 3449 3906 -4378 -6901 1923 9785 5772 -2854
169b854k45O790Q14q391o014M563P518n21n641O20P908M017n197o080J833N145
$$ -2854 -3099 3691 4505 -3886 -9900 -5337 2181 1660 -3981 -3361 4547 8564 3367 -2713 -880 4265
185D265j380p004k486N353M815k488m553J671N679O69n507l474L236L808k178
$$ 4265 2885 -4119 -6605 -1252 3563 1075 -3478 -1807 3872 4541 -966 -4440 -1204 2604 426
200D26m525P26N565K587l270l076K246L549j505n194j670L267K176k636k868K141
$$ 426 -4099 -3373 2192 4779 1509 -1567 679 4228 2723 -2471 -4141 -874 1302 -1334 -4202 -2061
216b061M583P70l420j596K901K412k272l823J37L381R27k830j787K431L034j054
$$ -2061 2522 3292 -128 -1724 1177 3589 1317 -2506 -2369 1012 1939 -891 -2678 -247 2787 1733
232A733l342n43K809J304k590k355J575L230O1k522o97K579J736j955k784L62
$$ 1733 -1609 -2152 657 1961 -629 -2984 -1409 1821 1882 -640 -1337 1242 2978 1023 -1761 -1399
248a399K419J47k609j318K079K409p28k240J87K361R24k156j774J122K003n07
$$ -1399 1020 1167 -1442 -2760 -681 1728 1000 -1240 -1053 1308 2232 76 -1698 -576 1427 920
264I20k284l71K204J425j497j966O90K133P7k155j032J681J630q91j874L39K150
$$ 920 -1364 -1735 469 1894 397 -1569 -879 1254 1331 -824 -1856 -175 1455 564 -1310 -971 1179
281A179O24j894j370J192J683n63k127l02J817J154j350j540Q65J979r4j907o63
$$ 1179 1803 -91 -1461 -269 1414 851 -1276 -1578 239 1393 43 -1497 -632 1347 1253 -654 -1317
298a317J501J318j061j788K83J888L97j600j052J203J515n55j647j60J686P30
$$ -1317 184 1502 441 -1347 -1064 824 1221 -379 -1431 -228 1287 732 -915 -1075 611 1341
314A341j288j328P83J583j67j624m90J396J045r02j342K96J451K18j380p84R78
$$ 1341 53 -1275 -492 1091 924 -700 -1190 206 1251 349 -993 -697 754 972 -408 -1192 -214
331b14J269n50j428L3J444N81j080r73O18J177k69j307k81J111P82p84j060M59
$$ -214 1055 505 -923 -890 554 1135 55 -918 -300 877 608 -699 -980 131 913 129 -931 -472
349d72J336O1j143p32Q61R11n60j178Q4J255M53r59p04P76R91l02j226k96R96
$$ -472 864 925 -218 -950 -89 822 262 -916 -832 423 876 -83 -787 -11 980 678 -548 -844 152
368A52N80q31q45M40J104J19r52l33P65O95o21r80M9J009K12q51n20P04R51l03
$$ 152 732 -99 -944 -504 600 719 -233 -566 199 894 273 -707 -658 351 563 -288 -808 -104 847 544
388E44r96n2Q98K13q10p65N44Q63p4q26q9R72N55o27p84J79Q02j16r49m05P37
$$ 544 -452 -504 394 607 -203 -968 -424 439 365 -461 -550 422 977 350 -434 -255 547 431 -518 -923 -186
409a86O63l72o69K75Q81J93p84n59M65O16k97p77k3P97L53m75m96L51O31j97q25
$$ -186 477 105 -564 -289 592 785 1 -558 -93 523 226 -551 -574 223 576 101 -395 -44 587 390 -435
430d35j96N49L73m21m56K54P14J67n18k42L46L49l03o33J6N12J89m32k63K91N57
$$ -435 -631 -82 291 -130 -586 -332 382 549 31 -211 135 484 181 -452 -436 76 265 -167 -430 -139 418
451D18k2n94j16M12K43l47m67K23M99J17m21k34M61L62k66n98m4L93Q5l77l49
$$ 418 396 -198 -314 98 341 -6 -473 -250 249 366 -55 -289 172 534 268 -330 -374 19 104 -273 -622
472f22L84N50K6l93k9M22K06l80m95J30M53q9n08j13M10M00k17m27O7M48K7m17
$$ -622 -238 312 338 -55 -84 338 544 164 -331 -201 252 163 -345 -458 -48 352 135 -292 -225 223 250 -167
494a67k67L14N12k00l56P1N05K18m46m56J09L90k43n25j05M51M29k36l14K58O09
$$ -167 -434 -120 392 192 -164 -93 412 630 184 -272 -163 227 -16 -541 -646 -195 234 -2 -316 -58 551
515E51O3m92k58K07L41k90n77J8N22J84l76l50K60M12n9m70j40M94L36k80k89
$$ 551 614 122 -136 71 412 122 -455 -437 85 269 -107 -457 -197 215 156 -314 -454 40 376 96 -193
536a93K28N33Q9n22l38K68K15l86n45j7N15K25l00j22L55N49j7m67j12L58J23
$$ -193 35 568 657 135 -203 65 280 -106 -651 -668 -153 72 -228 -350 5 554 537 70 -42 316 439
557D39l53n05Q0M00R7l70k52L48M04j53m45j03N37J84k42l14K89M50j6m72j85
$$ 439 86 -419 -339 61 158 -212 -464 -116 288 135 -310 -413 124 308 66 -248 41 491 475 3 -182
578a82K71J77l12m21j9M65J09k66r6K86M28p2l25r6K92N3l12l07J01L34N1l40
$$ -182 89 266 -46 -467 -486 -21 88 -178 -274 12 440 368 43 -53 239 292 -20 -327 -226 108 159 -181
600a81p9K53K41j48l21N1K68J67k52j82J67K78qk89j08K31J02k02k94O1L15L3
$$ -181 -260 -7 234 86 -235 -184 84 251 -1 -183 -16 262 254 -35 -143 88 190 -12 -306 -245 70 103
622A03j94j14K17K36p0k34l8K55qk27j04Q1K26q5j31r7K13J34j73j70N5K16l0
$$ 103 -91 -205 12 248 178 -56 -94 161 153 -74 -178 -97 129 44 -87 -184 29 163 -10 -180 -125 91 61
645F1j54n5J80J17p0j84O8J51Kj99q5J93M4n5j01J4J06J20j39p7Q9N8K5j86j8
$$ 61 -93 -148 32 149 79 -105 -37 114 116 -83 -168 25 69 14 -87 -73 33 153 14 -63 26 84 109 -77 -95
670i5J63L7r5j16M7J43J9j31n4P7P9n7j02n0J62P7j26o6J06N1oj08q2J31N4l8
$$ -95 68 105 10 -106 -59 84 103 -28 -82 -5 74 17 -85 -135 27 104 -22 -88 18 69 63 -45 -127 4 58 20
696B0j00j2J41N9p5j24Q7J29o0j38j0J06O2q8j04O9J46p3j12QR0N8j01p7M1R7
$$ 20 -80 -92 49 108 33 -91 -4 125 65 -73 -83 23 85 -3 -107 -38 108 35 -77 -69 21 79 -22 -99 -58 39
722C9m1l5o2J07R5m4p5j1M3K5n6p2K0J14kj09L4N9J8l4n6L2Q9l5q9m8J11N%o1
$$ 39 -2 -37 -99 8 103 59 -16 -27 16 41 -15 -87 -67 47 45 -64 -30 29 47 13 -43 -11 78 43 -46 -94 17 22 22 -39
752c9%Q8K4r7m1M0J6j5o9M7N3Pj0r9P7M2Pn8l9K9O1k6q8Q5k6O0n5n8J8J07M4r6
$$ -39 -39 49 73 -24 -65 -25 -9 -24 -93 -46 7 14 4 -95 -18 24 31 -27 -66 -37 24 -2 -90 -5 -31 29 -26 -84 -66 41 85 -11
784a1n0N3J08q5n0pR1J8j9j33N9J25n3J4j20N2Q1k6r7jM5P7q2p9R6N6lj51PP3
$$ -11 -61 -8 100 15 -35 -42 49 67 48 -85 -26 99 46 60 -60 -8 73 47 -50 -51 -6 71 -11 -90 6 62 59 -92 -85 -12
814a2Q9j06m2P1N3J5j06m0J28L1r7p1K0R0O1n5q7M4Q2j9j23rJ20K9j06n3R6R9
$$ -12 77 -29 -71 0 53 68 -38 -78 50 81 -16 -87 -67 23 84 29 -58 -14 68 49 -74 -83 37 66 -40 -93 3 102
842A02j08o3rJ08M9l4r6P4j3M3j26K1M1J2K1o8rR8l3o0L1k0R6j2ml9lN7q0j2l1
$$ 102 -6 -69 -78 30 79 45 -51 23 10 53 -73 -52 -11 1 22 -46 -55 43 10 -50 -19 -39 57 45 41 2 -1 56 -24 -36 -67
873f7Q5On2j1L1O4nl9q3M9N5o0l7NO0J7k0o6M0KP4p0NK1O5q9j7L7N4m6o0JJ53
$$ -67 18 24 -28 -39 -8 56 51 12 -71 -22 33 -27 -64 -59 1 18 -2 -68 -28 -26 48 -22 -17 4 69 -20 -37 0 54 8 -52 -51 102
906A02k6q1j4n3M4J01p8%k3O1M9j06J1K2K1j8m6mN2jp1%M5P1or6j4P0J3k2p8M2
$$ 102 76 -5 -19 -72 -28 73 -5 -5 -28 33 82 -24 -13 9 30 12 -34 -38 14 13 -58 -58 -13 58 52 -44 -58 12 25 3 -75 -33
938c3M2J5o9M5QO9k2j24L7O4ll2o8Q8N9o4o6P4M5o6j5m6O0L6J3j21M6M2L1p7J3
$$ -33 9 24 -45 0 8 77 55 -69 -32 32 29 -3 -71 17 76 12 -54 20 65 -1 -16 -62 -2 34 47 -74 -28 14 45 -32 -19
969a9N5K4p3l3k0J26l0p1j5J1J04k7Nr9J22K9o4m1l0J49p4n7k4M9Q1o5p8J0Q0
$$ -19 36 60 -13 -46 -66 60 30 -41 -56 -45 59 32 37 -62 60 89 25 -16 -46 103 29 -28 -52 -3 78 13 -65 -55 25
998B5KK2j16Q1R8n0j33M1O6J1n2n5L6L5Ol6l7K1R9o2k9j2P3J4n5o6J4J00k9q2
$$ 25 27 49 -67 14 112 62 -71 -30 36 47 -5 -60 -24 11 17 -19 -56 -35 64 2 -27 -39 34 48 -7 -73 -59 41 12 -70
1028g0k6Q7O4o0k1L8Nk2qj6O7ql2l0kN6m4J3l6OP0Jk1l9MN5n1nK1K0K6n5K5r9
$$ -70 -96 -9 55 -5 -26 12 17 -5 -13 -29 38 30 -2 -32 -34 22 -22 -9 -45 -39 31 32 11 -28 -24 31 -20 -25 -4 16 42 -13 12 -87
1062h7Q7J5Rr6N2J35j27j7J8K5Q0p4m2K1Pm4J7L1K7K0q5L0n1N6J5j9j3M3Nk3k9
$$ -87 0 15 24 -72 -20 115 -12 -29 -11 14 94 20 -22 -1 6 -38 -21 10 37 57 -28 2 -49 7 22 3 -10 33 38 15 -14
1093a4KnL0k2l7k0Q2L2q5L6k3N6j7r4P4kO8j5o5l0N6Mo1N4L2j2m1l2N0J4M7q5
$$ -14 -12 -17 13 -9 -46 -66 16 48 -37 -1 -24 32 15 -79 -5 -7 61 46 -19 -49 7 11 -50 4 36 24 -17 -49 1 15 62 -23
1125b3K0N5k2mrqK0Lo4K2K9mp7O8l2R0m3o4L6n7J01o4Qn2R2L8r9M6kNk7m4J09
$$ -23 -3 52 30 26 17 9 29 32 -32 -10 19 15 -62 6 -26 64 21 -43 -7 -64 37 -27 -19 -71 21 59 -40 6 4 9 -18 -62 47
1158D7n8K6jp2O0J5m0L8J8Nm4L7l3l1M7l6k1Q9j7p7N9j6L4p2K1K5J9l6k7J8j9
$$ 47 -11 15 14 -58 2 17 -23 15 33 38 -6 31 -2 -33 14 -22 -43 46 29 -48 11 -5 29 -43 -22 3 22 -14 -41 -23 -42
1189d2j2M7M0o3QO5p2M5l6j0L1K6p3k1L6M1L8j90N2P4J7M0l5m9M2J9j2j9N6Rl6
$$ -42 -54 -7 33 -30 -22 43 -29 16 -20 -30 1 27 -46 -67 -31 10 48 -142 -90 -16 1 41 6 -43 -1 18 6 -13 43 52 16
1220A6n1K5k7Q8m6J2M4o0J8m3J7O8k1l9k4o0P9R6j56O9lJ5l5kj3M5P0j09l7M3
$$ 16 -35 -10 -37 51 5 17 61 1 19 -24 -7 61 40 1 -23 -83 -4 92 -64 5 2 17 -18 -20 -33 12 82 -27 -64 -21
1250b1O0Jk8o5Q7M7p1r1OJ19k1m1m3L8M9l9j9J1L0oOk4n4P3K0m1%J3M5Rq6J8N3
$$ -21 39 40 12 -53 34 81 10 -81 -75 44 23 -18 -61 -23 26 -13 -32 -21 9 3 9 -15 -69 4 24 -17 -17 -4 41 50 -36 -18 35
1283C5k6N5r2J2M1m2k3qL7M8j9m7N8M1k5p8nO1Mj7k0p0O3K9j0r2R3Kj0M8q1J18
$$ 35 9 64 -28 -16 25 -17 -40 -48 -11 37 18 -29 29 70 45 -33 -38 23 27 10 -10 -80 -17 12 2 -90 3 5 -5 43 -38 80
1315H0m5j6p2K3J1K6p9PM7M4p3jO8nK4q8L7N2N7r1n0R3K5p0n7R2j0j7Lo0jO2j6
$$ 80 35 19 -53 -30 -19 7 -72 -65 -18 26 -47 -48 20 15 39 -49 -12 40 97 6 -44 49 74 4 -53 39 29 12 15 -45 -46 16 0
1348@j7J6j5O9k5k1MNL8r5o4O2K6J9j5m7M0M6rm0K3K6J5k3m2J8Q3l1n5RO7%o8
$$ 0 -17 -1 -16 53 28 7 11 16 54 -41 -105 -43 -17 2 -13 -60 -20 26 17 -23 0 26 41 18 -24 -6 77 46 -9 0 67 67 -1
1381ar%J3J4k8k8J18q6o5N5M5m3J2n5j8J13n3j9K5l0O5l0K6n8j2R1l0P1j49Q7
$$ -1 -10 -10 3 17 -11 -39 79 -7 -72 -17 28 -15 -3 -58 -76 37 -16 -35 -10 -40 25 -5 21 -37 -49 42 12 83 -66 21
1411B1J6n0n0N7l9K7j9kM2nJ0j4K7j8Q1j17KK2L9k8k1l2P6K4j3j0kj7j9pn4J9
$$ 21 37 -13 -63 -6 -45 -18 -37 -39 3 -2 8 -6 21 3 84 -33 -31 -9 30 2 -19 -51 25 49 36 26 24 7 -12 -19 -73 -54
1443e4P1l3o4K2J05M5j32nL7L6J2q7N5QL0j9n9N3k0J4q9L0M2NRo3L0L9K1p8K4
$$ -54 17 -16 -80 -58 47 92 -40 -45 -8 28 40 -47 8 16 46 27 -32 21 1 15 -74 -44 -2 3 12 -51 -21 18 39 -39 -15
1474a5L6Mm5j7lL5K1L1p7N6pJ2k5J8mN6q3m0J2L5l5oRl2Q5K3p0%P4m5Jl8K8kP3
$$ -15 21 25 -20 -37 -40 -5 16 47 -30 26 19 31 6 24 20 76 -7 -47 -35 0 -35 -41 -32 -64 21 44 -26 -26 48 3 4 -34 -6 -8 65
1509F5o7n7P6J2m8k4M1jN0r3NO1K4j5l1L5n2P1o9k6L0nM3r3j6M1Q6j02L7%O9j0
$$ 65 -2 -59 17 29 -19 -43 -2 -3 47 -46 -41 20 44 29 -2 33 -19 52 -17 -43 -13 -18 25 -68 -84 -43 43 -59 -22 -22 47 37
1541C7l3K4m1M1l8l2NJ29k74R6J32k3K34l67qJ71n1M0o3lQQJ3K4m8j2K2j3l9M8
$$ 37 4 28 -13 28 -10 -42 -37 92 -182 -86 46 23 257 -110 -118 53 2 42 -21 -24 -16 -8 5 29 -19 -31 -9 -22 -61 -13
1571a3K9L5k1n3%K8NPm1K3L1r2kP0lL0j0j00J17pm8m3O2j6O9r4j4K7N3Qlp5J5
$$ -13 16 51 30 -23 -23 5 10 17 -24 -1 30 -62 -64 6 3 33 23 -77 40 33 -15 -58 4 -12 57 -37 -51 -24 29 37 34 -41 -26
1604b6RJ5j9J5JJ2jp8O3L7L3q9k9Q3Lk7l6L3j4J9n4M5L2%m5j2k7N1Pl4k4P6oN
$$ -26 -17 -2 -21 -6 -5 7 6 -72 -9 28 61 -28 -57 26 29 2 -34 -1 -15 4 -50 -5 27 27 -18 -30 -57 -6 1 -33 -57 19 13 18
1638A8LL0k4P9j52k61K20K84k1j97M0j0M8lj21P4l7Q8j03MK5J9J6m9KO6Pn2l0
$$ 18 21 51 27 106 -46 -307 -87 197 176 -21 19 9 57 54 -67 7 -30 58 -45 -41 -16 3 19 -30 -28 38 45 -7 -37
1667c7ON3j3m4L3l2M7JOrM9n0n8j0N3L7j3k8k2L7N7p4j3M1oJ6m5p5N6nK8L6k6
$$ -37 -31 22 9 -35 -2 -34 13 14 20 11 60 10 -48 -58 -5 32 19 -9 -31 6 63 -11 -24 17 11 27 -18 -93 -37 -42 -14 22 -4
1700dJ8l6K4j1ML3m0L%OK6k7K9n0M2n7Q2l4j3L0l4l7j7P8J8n5Rm4M6L1p2QM9K3
$$ -4 14 -22 2 -9 -5 28 -12 -9 -9 -3 23 -4 25 -25 17 -40 42 8 -5 25 -9 -46 -63 15 33 -22 -13 -57 -11 20 -52 -44 5 28
1734B8j9m5L2rK3k5L0m7N7n0K0k1%j5qP2o4M7po1L4N0p9O4Kk2j8O0o1K6J4Pk3
$$ 28 9 -36 -4 -13 10 -15 15 -32 25 -25 -5 -26 -26 -41 -49 23 -41 6 -1 -62 -28 22 -57 7 9 -13 -31 29 -32 -6 8 15 -8
1767hl9L5oQK1o4O0N4p1O5o1L9lk1o9OP6ln3N1jJ0n9K9J6K0o4M5m1NO4k7p8P8
$$ -8 -47 -12 -18 -10 11 -53 7 61 -10 55 -6 33 30 9 -60 -54 22 19 -34 17 16 26 -33 -4 12 32 -32 13 -28 -23 41 14 -64 14
1801A4L8m1k6L3K2l9N1q6KpM8k3l4J05j2n9n0K0L9K2j2n6J9L0L5j05P0l4J7J8
$$ 14 52 11 -15 18 40 1 52 -34 -32 -39 9 -14 -48 57 45 -14 -64 -44 -5 17 5 -51 -32 -2 33 -72 -2 -36 -19 -1
1831al1K2j0O6Kj02M3K6k6L8m4J4J4J5o5L1M7j3m8RM6J6l5J7j4k2K8on8K7j8L3
$$ -1 -32 -10 -20 46 48 -54 -11 15 -11 27 -17 -3 11 26 -39 -8 39 26 -22 -13 33 49 14 31 17 -5 23 17 -41 -14 -32 1
1863Al9k9M2j5n8O6L7kk1K9m8k0O9J0n4M3K0m4M1k1kk9%mJ4RM5o4k4O3lj3lJ7
$$ 1 -38 -67 -25 -40 -98 -32 5 3 -18 11 -37 -57 12 22 -32 11 31 -13 28 7 5 -24 -24 -28 -14 -5 40 -24 -48 15 12 -1 -4 13
1897A3k9PN6m3j7J6l7K3K3om1L1M7p9M4RJ1J0n9L2m1moJ7N5k6l4j7J00n8J4J2
$$ 13 -16 -9 47 4 -13 3 -34 -11 12 6 -35 -4 43 -36 8 17 28 38 -21 11 -30 -34 -40 -23 32 6 -28 -45 55 -3 11 23
1929B3l1jL2k6K7M8q7L4m5J4J8J0j3k0M9m1RNj0j3MK4m1JokL0M4k8l0K4n4M0l8
$$ 23 -8 -9 23 -3 24 72 -15 19 -26 -12 6 16 3 -17 32 -9 0 5 -5 -18 -14 10 -31 -30 -36 -38 -8 36 8 -22 2 -52 -12 -50
1963e0O3k3M9l9M6o8K6k1L4k7rO0QK9p6NQ5q8J2ml5M5k1K9K0r6K6J9RrJ9m4M4
$$ -50 13 -10 39 0 46 -22 4 -17 17 -10 -19 41 49 78 2 7 92 4 16 12 -23 22 1 30 50 -46 -20 -1 8 -1 18 -26 18
1996A8k0n0R7kq2R0p4N0Pj8J3k4J7l4J9k9P8r1L2Jj6N0m2J4J1j0K6k4pNK5j4k6
$$ 18 -2 -52 45 43 -39 51 -23 27 34 16 29 5 22 -12 7 -22 56 -35 -3 -2 -18 32 -10 4 15 5 31 7 0 5 30 16 -10
2029a0lk4L9j9K3j1p7M6L6o0N6OK0m9K2l5K2M2j3J4qM4q5M6m3M6k1k7Q4p3O9l3
$$ -10 -13 -37 2 -17 6 -5 -82 -36 0 -60 -4 2 22 -27 -5 -40 -18 24 11 25 17 61 -24 22 -21 25 4 -23 61 -12 57 24
2061B4m0qL4k8K3K1Jo1RP2o4OL2j7Mn5O0mjK1Jj9k5J2j3J9J1J3o6N6k8O5Pn5J1
$$ 24 -16 -24 10 -18 5 26 27 -34 -25 47 -17 -11 21 4 8 -47 13 9 8 29 30 11 -14 -2 -15 4 15 28 -38 18 -10 55 62 7 18
2096A8j7jrK7j4M3q4L8M5n4qL5n7L6%K7o7K2j4L2l0K9OlK1l7lL3K8k3k9J9J7l6
$$ 18 1 0 -9 18 4 47 -37 1 46 -8 -16 19 -38 -2 -2 25 -42 -20 -34 -2 -32 -3 3 0 21 -16 -19 14 42 19 -10 9 26 -10
2130a0Nk3P3q4P5p3P5j0J4J8j5o2K4m3K6L0K1q1L6J4j3N3m6k8M1k3Pl8J8K6j7
$$ -10 -5 -28 45 -39 36 -37 38 28 42 60 45 -17 7 -36 -10 20 41 -40 -4 10 -3 50 4 -24 17 -6 1 -37 -19 7 -10
2161a0J8n4L8L9nl9k2L1K3k3M1n6nJ6N7k9l4M6m2K1l6R0o5k0N9n5N2l3JM7l0l5
$$ -10 8 -46 -8 31 26 -13 -35 -4 19 -4 37 -19 -24 -8 49 20 -14 32 -10 11 -25 65 0 -20 39 -16 36 3 4 51 21 -14
2193a4J6MRpl6L3k8N8Nl3l5nR0l9j0K3m1L1J0pm8k0N0l4M4k2oN8n8oNjJ1m9%O8
$$ -14 2 6 15 8 -28 5 -23 35 40 7 -28 -33 57 18 8 31 -10 21 31 24 -24 -44 6 -28 16 -6 -12 46 -12 -18 -13 -14 -3 -52 -52 16
2229A6l8O3q0N5j4J5n1lK9k5M5l4j6jL5n2L9K6J2l3pl5M5O7o6M0o8J5K3J7l3k1
$$ 16 -22 41 -39 16 2 17 -34 -37 -8 -33 12 -22 -38 -39 -4 -56 -17 9 21 -12 -19 -54 -9 58 -8 32 -36 -21 2 19 -14 -35
2261c5M3L6m2j3j0M2k1M5j08M7K0qN9n4M3k0r7M9K7J7n0pL4n5N5k2M6l3J6o2M9
$$ -35 8 44 2 -11 -21 21 0 45 -63 -16 4 -4 55 1 44 24 -73 -24 3 20 -30 -37 -3 -58 -3 -25 21 -12 4 -58 -9
2292ij9J9K6j2m4L6J2oj1K2QLjm4N6l0RQo5M7k6K7J9m8M7k4l1J1k8M1%L5m5Qm1
$$ -9 -28 -9 17 5 -39 -3 9 3 -8 14 22 25 24 -20 36 6 15 23 -42 5 -21 6 25 -23 24 0 -31 -20 -48 -7 -7 28 -17 -9 -50
2327e0l5L1L9Pk%M4m9L4J2nq0M6LmMJ3k5K4m0N0J6j9J8l6k4M4j0Om0N4k6K3Qn9
$$ -50 -85 -54 -15 -8 -10 -10 34 -15 19 31 26 -54 -8 -5 -9 -5 8 -17 7 -33 17 33 14 32 -4 -28 16 6 12 -28 26 0 23 31 -28
2362b8J2M2l5m2K7N7k2m5K7k1NK9k3N0j2l6J5j9R4m3pQm4j7O2p2N0Pnjm0N9j8
$$ -28 -16 26 -9 -51 -24 33 11 -34 -7 -28 -23 6 -17 33 21 -15 0 -19 75 32 25 33 -11 -28 34 -38 12 19 14 13 -27 32 14
2395A4k2k9K5pQpJ8K0k4L6mJ7k0K0r2K5L6o8P5J1n1K8Rn6L4l4K8J3L2j1JlK7n9
$$ 14 -8 -37 -12 -19 -11 -18 0 20 -4 32 28 45 25 45 -47 -22 14 -54 21 32 -19 9 18 -38 -4 -38 -10 3 35 24 25 22 49 -10
2429a0OLk3K7j7N3k7J5l3k8M3J8l2oNk1Q7m8n3P7j7j1l3j3K0Ol6K5M7k7L0l4K1
$$ -10 -4 -1 -24 3 -14 39 12 27 -6 -34 9 27 -5 -11 -6 -27 60 12 -41 36 19 8 -25 -38 -18 -12 -48 -23 24 -3 27 -7 14
2462A4J7q6Q2k2qk0NJ7J5j7J7n8K1J1K9q2Q0mm8L5K6qj0l8N7j3l6lJ5JL1l8qP
$$ 14 31 -55 27 5 -3 -23 -18 -1 14 -3 14 -44 -23 -12 17 -65 15 11 -37 -2 24 16 6 -32 25 12 -24 -27 -12 -11 20 -18 -26 -19
2496a9mM9p5NM4J1n0K2K3k8KL0j8n9rJ26op6N9k4J3MJ5m9j2M5n3K2J3K5j7m4K2
$$ -19 -23 26 -49 -44 0 11 -39 -17 6 -22 -20 10 -8 -67 -76 50 44 -32 27 3 16 20 35 -14 -26 19 -34 -12 1 26 9 -35 -13
2529a3Pl1J4qJQl2M1l8O7n4K7J3r1Q5l1k1K6L8p5P3k8Q%K4K7p4N3m5K3M6k1k6
$$ -13 -6 -37 -23 -31 -30 -22 -54 -13 -51 16 -38 -11 2 -89 -4 -35 -56 -30 8 -67 6 -22 -14 -14 10 37 -37 16 -29 -6 40 19 -7
2562gj9%Q0p1K2LrlK5o2RJ9J0M8rp6J3m2J7L8N8n2j6K7n1LN4m0k3N4l9K7j1L5
$$ -7 -26 -26 54 -17 5 8 -1 -4 21 -41 -32 -13 -3 45 36 -40 -27 -69 -52 -14 44 -8 -24 3 -48 -45 9 -31 -54 0 -39 -12 -23 12
2596A2K3n1j5R9n6Lk2jkJ7l7N7n5K1L4j1OOl2jj0J1N9o5m4J1P1n9J7J0ol3M7l7
$$ 12 35 -16 -31 68 12 15 -7 -8 -10 7 -30 27 -28 -7 27 16 22 28 -4 -5 -15 -4 55 -10 -54 -43 28 -31 -14 -4 -10 -43 4 -33
2630c3M0k4K0n3Q5j71J6K10O3L3j73n5M1L7l6K5o8R5K2m0l8M6n7K6J8l0J3Jk0
$$ -33 7 -17 3 -50 35 -136 -120 90 153 186 13 -42 -1 36 0 25 -43 52 74 34 -4 42 -15 11 29 -1 12 13 -7
2659gK7k3K3k8k1L6Kj3j9K7k9K1m1L5N1k2OP4j41N8J9j1n6RK52m67J87m6j0J7
$$ -7 20 -3 20 -8 -29 7 9 -4 -23 4 -25 -4 -45 -10 41 19 25 99 -42 16 35 24 -32 -23 229 -238 -51 -97 -107 -90
2689i0P5m0J17J00l84L55k20J27j52R4J01k01J24kKm3N4J4k6J7Pl6J3l9L0l1M1
$$ -90 -15 -55 62 162 -222 133 -87 40 -112 -18 83 -118 6 4 6 -37 17 31 5 22 29 -7 6 -33 -3 -34 7
2716Grl0N0j8K1Mk5m8P2km3J9l2Q1o9k5O4J8m0pJ2l7N2P3r6j2J1K8qk2K2PNJ3
$$ 7 -2 -32 18 0 21 25 0 -48 24 22 -21 -2 -34 47 -22 -47 17 35 -5 -12 0 -37 15 88 -8 -20 -9 19 11 -11 11 18 23 36
2750C6o1K6qRl7L3K5o6Q3o2J0lk9J8j9O1J2n1O0k2k3J3pN4j08J01r5J6P7ln0M
$$ 36 -25 1 -7 2 -35 -2 23 -43 40 -22 -12 -15 -44 -26 -45 16 28 -23 37 15 -8 5 -2 52 -56 45 -50 -34 43 40 -10 -6
2782fo4N7M3q0Q3j7n9Pj5N0Rm0nRK0L1k9KM9m2l8JN3PK4n4PMk0M0Jm7O2m0j1J8
$$ -6 -70 -13 30 -50 33 16 -43 -36 -51 -1 8 -32 -37 -28 -8 23 -6 -4 45 3 -35 -34 19 26 50 -4 3 7 -13 27 28 -19 43 3 -8 10
2818A0j6L3m3J9Ol8K9J5LJ2j4o4J0N0QRmp1nP5p8O6J7j7K2n2oN2nk1l2L5J2o1
$$ 10 -6 27 -16 3 9 -29 0 15 18 30 16 -48 -38 12 20 29 25 -46 -51 24 -54 12 29 12 34 -18 -24 28 23 2 -30 5 17 -44
2852d4O2k4k7Poj1M6J3K3l5L5m3K7%n4N3Qn0N7p0L7Pm2P6m7j0K2p3N5mN3Rr8P7
$$ -44 18 -6 -33 -26 -32 -43 3 16 39 4 39 -4 23 23 -31 22 30 -20 37 -33 4 11 -31 45 -2 -12 10 -63 -8 -12 41 50 -48 29
2886B9k1j2l6O6m7J3ljK8n4N4l3k6RQ1l4j2n4J8P4p6O1j9Ll3L1om0O9o4N2j5m7
$$ 29 8 -4 -40 26 -21 -8 -11 -12 16 -38 16 -17 -43 -34 47 13 1 -53 -35 39 -37 24 5 8 -25 6 0 -40 29 -35 17 2 -45
2919d5O2n2J0Lk9N1l5O9mo0OK2J3Om7M4oL0l3L0nol5jLJ5m1J0M1o4K3mK7Rj1j0
$$ -45 17 -35 -25 -22 -51 0 -35 34 30 -30 -24 -2 11 17 -30 14 8 38 5 35 30 24 -11 -12 -9 6 -35 -25 16 -48 -25 -29 -2 7 -4 -14
2955a4OK6jmok6K9ml9M0qoJj9j0L3rM7p9J5ORK8k0J1J7J0l4P8j25P8Ol5QnM1n0
$$ -14 -8 18 17 13 7 -19 10 6 -33 7 -1 -7 -6 -25 -35 -2 -11 36 -43 -28 -22 -13 15 -5 6 23 33 -1 77 -48 30 36 1 9 4 45 -5
2992eMJ3j7KK3N6o0ol8J3k5K1J8pK2n1M6J0j7Kk1MJ1j7Kk4N3j2Lm5O3j8j%N2m5
$$ -5 -1 12 -5 -3 20 76 16 10 -28 -15 -40 -19 -1 -8 14 -37 9 19 2 4 -17 -13 -2 -19 -17 -41 12 0 3 -42 21 3 2 2 54 9
3028Ik7M8kk5mK3j3o0O4rj4K8o6LO5Rk0l3P9J8o7k6N3p6qK2oK7MJ2N4o8K7l5N0
$$ 9 -18 30 28 3 -1 22 9 -51 13 4 -10 18 -48 -45 20 29 9 -24 55 73 6 -20 33 -43 -51 -29 -35 -8 -4 8 62 -6 21 -14 36
3063C6l2n5N5J7k8O2q6j0L4Pk4K8jj4M3l3mJ2Oo4L2K8P1n7l9K9k7Pj6QJ5k5L8
$$ 36 4 -51 4 21 -7 55 -31 -41 -7 0 -24 4 3 -11 32 -1 -5 7 13 -51 -19 9 80 23 -16 13 -14 -7 -23 -15 0 -25 13
3096A3o2L6J9Lo4N1k8L2K5j7l4L1L6n3N0J2q8Q9k9k3k8L2KPl7N1j4N3j10P2%k6
$$ 13 -49 -13 6 9 -55 -4 -32 0 25 8 -26 5 41 -12 38 50 -38 51 22 -1 -29 3 5 12 -25 26 12 65 -45 27 27 1
3128Ajn5O5k1K9m8J9k0K5J8l8J5K5o8L6P0p6N2k5J9pk4L0l2OJ7PJ7nm3M9l1L5
$$ 1 0 -55 10 -11 18 -30 -11 -31 -6 12 -26 -11 14 -54 -18 52 -24 28 3 22 15 -9 21 -11 -5 12 19 36 31 -12 37 6 41
3161D1o0J2j0J0L3m0J1Jql8KL9N7r0N7nk0K4j7m7L8N2m4K6n9M0N0r7O7k3J6L4
$$ 41 -19 -7 -17 -7 26 -14 -3 -2 -10 -48 -46 -7 50 -40 17 12 -8 16 -1 -48 -10 42 -2 24 -35 5 55 -42 25 2 18 52
3193E2j4k5N9m5MrLJ1j8k4M6n0J9Mn6J9M2o3O4l6jK1n6M9j2Jj2l9P1m6N0%J0p8
$$ 52 38 13 72 27 31 22 25 36 18 -6 40 -10 9 13 -43 -24 18 -45 19 -17 -18 3 -53 -4 -16 -15 -27 -66 5 -41 9 9 19 -59
3227e9O8mmJP2o2m4P6n5O9q9O8o6N1j8N0o9K8j9OQk9K6k0OL3J0l0l6Nj7L6K2o5
$$ -59 9 5 1 2 74 12 -32 44 -11 58 -31 37 -29 22 4 54 -15 13 -6 0 8 -21 5 -15 -9 24 34 4 -32 -27 -44 -8 14 -51
3261e1M8l6M2M9m3l2m1J0O9KPN4j13M2j0l3L7qM6m9j1kk1O4l3j9L3Rl7J4M9n7
$$ -51 -3 -39 3 52 9 -23 -64 -54 15 17 24 78 -35 7 -3 -36 1 -7 39 -10 -21 -23 -44 20 -13 -32 1 10 -27 -13 36 -21
3293b1k6lJ02j19N9NK7n7K5P9j00K7k8J2J6J1n2l6J24l5K3l0k3nO1n5qP5r1M6
$$ -21 -47 -50 52 -67 -8 -3 24 -33 -8 71 -29 -2 -30 -18 -2 9 -43 -79 45 10 33 3 -20 -25 36 -19 -27 48 -43 3
3323CK1m5K6l0P6q3Q8m7ol5JPJ1MK2L7m8j5j7M2kJ9q1qO0J0k6M3l0oPj6L8l0K9
$$ 3 24 -21 5 -25 51 -32 56 9 3 -32 -31 -24 -13 -9 13 50 2 -13 -30 12 10 29 -52 -60 0 10 -16 27 -3 -9 -2 -18 20 -10 19
3358A9J1m0n9O1J6M4o1O0k1Kk2k3K2k7l3K4J2j8J3j4J3M6p3K4ML7m9M3Nl1j0N
$$ 19 30 -10 -69 -8 8 52 -9 51 30 32 10 -13 9 -18 -51 -27 -15 -33 -20 -34 -21 25 -48 -24 -20 17 -32 11 16 -15 -25 -20
3390b0J9m4lO3o5L5M0j4l4L3mK5p7N4k9JN4p7M0K3l9Q1m3Nk8j7NlN1l5Qj1N5l3
$$ -20 -1 -45 -48 15 -50 -15 25 11 -23 10 6 31 -46 8 -21 -20 34 -43 -3 20 -19 62 19 24 -4 -21 -16 -19 32 -3 5 -6 49 16
3424A6Nl0oj8K8J6p2P2n3J5J7L6l5K0l1K2J3%j1L7l0J2l9P7j3n4Kk1MM4N6p7J9
$$ 16 21 -9 -15 -33 -5 11 -61 11 -42 -27 -10 26 -9 11 -20 2 15 15 4 41 11 23 -16 61 48 -6 -4 -25 -21 23 79 2 21
3457B1k7Pm2M3Om8KkL5Nk4M0j2j8M4k9J8l0l1L1K5nLkk4K6lL3n7K7L3q2M0o3P7
$$ 21 -6 1 -41 2 8 -40 -38 -40 -5 0 -24 16 4 -14 30 1 19 -11 -42 -11 14 9 12 10 -14 12 9 42 -15 12 45 -37 3 -60 17
3492A7ql3K2m3M8N8r0O1n2nJ5nJ3k4k3P7j8m8J9KO5j7n3L8oj3P1r9L9oK7l3N0
$$ 17 9 -24 -2 -45 3 61 -29 32 -20 -25 -10 -15 -2 -26 -49 28 10 -38 -19 -17 48 31 -22 16 10 -3 68 -31 8 2 29 -4 46
3525D6l5j5Jj8M5o6L7L6o8N3oLJ2r1R3l7K6J7j2klk1Pk6L6k9%MMN0m6Lm3O9m2
$$ 46 11 -4 -3 -21 24 -42 -5 31 -37 16 10 13 25 -66 27 -10 16 33 21 19 16 -5 2 -24 12 -17 -17 -13 -9 41 -5 -2 -45 24 -18
3560a8P1l1j9rM7l7J3j7K1M2k6o5JK4K1r1O8j7N0o5M7k0QK6j5j6kj0lj1K2L8o6
$$ -18 53 22 3 -6 41 4 17 0 21 63 37 -28 -27 -3 18 -73 -5 -22 28 -37 10 -10 -2 24 9 -7 -9 -19 -22 -33 -11 27 -39
3593c9L8m2J3K3L7k0J9Lj0N6p4LJ6oJl5N7Kq1Qk9J15o2l0M4K6j4rklK5m7j3K3
$$ -39 -1 -43 -30 -7 30 10 29 32 22 78 4 7 23 17 18 -17 40 42 -39 -31 -60 55 -7 -37 7 33 19 10 8 5 30 -17 -30 -7
3627gL8j4p0J7K4j6J7J1p0P9J4j05R6m0J6J3j0NK6J2Lj03J8O3k5Mj7L6j6rjL4
$$ -7 31 17 -53 -36 -12 -28 -11 0 -70 9 23 -82 14 -26 -10 3 -7 -2 24 36 39 -64 -46 17 -8 -4 -21 15 -1 -10 -11 23
3659B3m1NN4Kl6l0Rj7M5o3J1k8P9j8J4J2j0qm0L5k8lK9n3J16o7K8n8M7j0j1K2
$$ 23 -18 -13 41 43 7 -23 -14 -31 14 -49 -38 -66 13 -5 9 21 11 3 -37 -2 -30 -33 -4 -57 59 -8 20 -38 9 -1 -12 10
3691A0ML2j01QJ3J6J1oKlj1M2j7J0K9j9j5k2J3m5M8L2k7J6j6j3m2J1K0j1K4j0
$$ 10 14 46 -55 -47 -34 -18 -7 -13 -11 -14 -25 17 0 10 39 20 5 -17 -4 -49 -1 31 4 20 4 -9 -51 -40 -20 -31 -7 -17
3723a7PJ8Nj3J3m9M3m9Q7k4j1k6Rj8j3N9n3M9l9M6o6M7oj5M8kok2M9Pm9j0nkK
$$ -17 -10 8 13 0 13 -36 7 -42 45 21 10 -16 -7 -25 -38 21 -32 17 -22 24 -42 5 -1 -16 32 30 24 2 51 58 9 -1 -6 -8 -6
3758fJ6L2j5l6J1k7pK3L7k5Ql4M4J8o6j7O1lNLJ1k6m4K6O3q7O9j6m2lJ4J01j24
$$ -6 10 42 27 -9 2 -25 -32 -9 28 3 11 -23 21 39 -27 -44 17 14 19 22 33 7 -37 -11 52 -35 34 18 -24 -27 -13 88 -36
3791c6L4k0OL1m7K6j3mn0P9l0K7J1j5KK1l9m3P6j7KMj9J0K6pnJ9l4L0l7K7L4k8
$$ -36 -2 -22 -16 15 -32 -6 -19 -23 -73 6 -24 3 14 -1 1 22 -17 -60 16 -1 1 5 -14 -4 22 15 10 29 -5 25 -12 15 49 21
3825B1n6K9J5l1LN8j4K4n2%j2j3L2j4J8J3p3L7j0K9M2Op7LN6l6Nor%lj7N2j9k3
$$ 21 -35 -6 9 -22 -19 39 25 49 -3 -3 -15 -28 4 -10 8 21 -52 -15 -25 4 46 52 -25 -22 34 -2 3 -3 -12 -12 -15 -32 20 1 -22
3860b2L5nj2Ll4O0QJ8j00N9qJ2lk8J2Qj5m4P2k8J4l2mK3jjK9n9K5L1r4N5K7n1
$$ -22 13 8 -4 -1 -35 25 33 51 -49 10 2 14 11 -17 -5 3 -12 -56 16 -12 2 -30 -34 -11 -12 -13 16 -43 -18 13 -81 -26 1 -50
3894e0N7j2n1N7m6O9mj1O4o8K2j7rL2k5L4l0Mp6K4N5j7%pnK8l1%K5l5L3j6J2o
$$ -50 7 -5 -56 1 -45 24 20 9 73 5 27 10 1 33 8 42 12 16 -60 -36 19 2 2 -5 -10 18 -13 -13 12 -23 10 -6 6 0
3928@Ll1L6L2p7O1p0K8lN4k0Mj7pK7j1mJ1j4Qm4N6JL0n4OJ9l5m7Q7n4j0OM3Lj3
$$ 0 3 -28 8 40 -37 24 -46 -18 -21 33 13 17 0 -7 20 9 5 16 2 10 -34 22 23 53 -1 5 24 -11 -58 29 -25 -35 -29 14 17 4
3964DK2k0J6rj1j9M3m2Rnk8L5k1j3M7l8J7p0N0K1J1J8k4N7o4nL0l2O4m%k1j1q
$$ 4 26 6 22 13 2 -17 26 -16 -7 -12 -40 -5 -26 -39 8 -30 -13 -83 -33 -12 -1 17 -7 50 -14 -19 11 -21 43 39 39 18 7 -1
3998an2O6l0K3On4N8l3k3K8j6J1J2J0%j1l4K0j7N4p5K7N3qJ5j2n8M4k5M9k6J2
$$ -1 -53 13 -17 6 12 -42 16 -17 -40 -12 -28 -17 -5 5 5 -6 -40 -20 -37 17 -58 -31 22 14 29 17 -41 3 -22 27 1 13
4030A3rJ2k1J5K1k3L6n1J3o0N7O7k3l5K6J9n1l3M8n0L1l5nM0l4JRL0MolNn0N8
$$ 13 4 16 -5 10 31 8 44 -7 6 -54 3 70 47 12 38 57 6 -27 21 -29 2 -33 -38 2 -32 -31 -22 8 12 6 3 8 -42 16
4064A6nrNl1N1r2M8J9k3M7j4J8n6K2jL4J2o5K6M5q4L8m5N0K1o3K0N5m7K1m7op
$$ 16 11 2 7 -24 27 -65 -17 2 -21 26 12 30 -26 -4 -5 29 41 -24 2 47 -37 1 -44 6 27 -36 -16 39 -8 13 -34 -40 -47
4097d7J3M1m2k7L4K8K5m1j8Q5o5M4oj3j2l0K5L6k7N0l5j5LN1r0R3m3j7L5l7Ok5
$$ -47 -34 7 -35 -62 -28 0 25 -16 -34 51 -14 30 24 11 -1 -31 -6 30 3 53 18 3 6 57 -33 60 17 0 35 -2 4 -21
4129b1J6J0k4l5L2k7P1k9j0M2j6l5J9j9J4M5m2k4M3jJ1K3j6p3N5j2O1o7Km1j1
$$ -21 -5 5 -19 -54 -22 -49 22 -7 -17 25 9 -26 -7 -26 -12 33 -9 -33 10 9 20 43 27 -46 9 -3 58 -9 -7 -48 -59
4160e9J6O5M1q7L2n6Q4o3L5j9%%L2o3L2K6m2J4nK1J3j4k8K7L7r8N5Klj8j3KoO3
$$ -59 -43 22 63 -24 8 -48 36 -27 8 -11 -11 -11 21 -42 -10 16 -26 -12 -17 4 17 3 -25 2 39 -59 -4 -2 -5 -23 -36 -34 -40 23
4194B3l9KK4o0L2Q0j05M8L1l7J5m5P1j6l4K5l3J7P4q4M6n7O5o0P2m3o9O5l0j6
$$ 23 -16 -14 10 -50 -18 62 -43 5 36 -1 14 -31 40 24 -10 15 -18 -1 73 -11 35 -22 43 -17 55 12 -57 8 -22 -38
4224c8Q3k9q3N2J9k6Mj8O9k3j6rj3L1kPro3Q4j6K7p1N5j9m9M5j2jK9k7J3JQk1
$$ -38 45 16 -67 -15 4 -22 -18 -36 33 10 -6 -15 -28 3 1 8 -1 -64 20 4 31 -40 15 -4 -53 -8 -20 -21 8 -19 -6 -5 3 -18
4258a8NO7j19O5p8R0oJ6l6%MM1n3J9Mjl9J5k0KL9Ro1O1N8o6K3K4l6Km7L6k4l7
$$ -18 -13 54 -65 0 -78 12 6 22 -14 -14 -10 31 -22 -3 1 0 -39 -24 -44 -42 -3 6 -55 6 64 -2 21 45 9 11 -36 0 -24 -61
4292f1J04k4j5J1Kj9mm5M2j2OK4k7J8j1J3P2n8n5N6JJ6l4j4ol6P2o4N2k9n6P9
$$ -61 43 19 4 15 17 -2 -6 -51 -9 -21 -15 9 -18 0 -11 2 74 16 -39 17 18 34 0 -14 -20 -56 16 -48 4 -25 -81 -2
4324bnj%j8NJ9J0k6K4lj8L4Pj6k4mL0m6N6o6PJ5N0p4M3j4L4k2J6m1K0N7j01N0
$$ -2 -7 -8 -8 -26 -21 -2 8 -18 6 3 -15 19 26 10 -14 -18 12 -34 22 -44 -37 -22 28 -46 -3 -17 17 -5 11 -30 -10 47 -54 -4
4358doj6j4L8NL2l0j1J3n4O9qrm1L3M7j4j9k0K0j4k4N8rl1N2l9j8rM0nKk3K4j0
$$ -4 -10 -26 -40 -2 3 35 5 -6 7 -47 22 14 5 -36 -3 44 30 11 -9 11 -3 -27 31 22 -9 43 4 -14 -23 17 12 14 -9 15 5
4393EJO7r0j1oM1N1p8L7k4kQ5p2k7PNJ4qK2OJ8l8m3P2l0j6M0l1MJ3j7mRkJ1J2
$$ 5 6 73 -17 -28 -34 7 58 -20 17 -7 -9 76 4 -23 -16 -11 3 -5 17 23 41 3 -40 32 2 -14 26 -5 -1 12 -5 -9 0 -2 9 21
4429B1j8lk0kK6m0O6m0k7k0l0P6jJ8J0o8M3l0M3k3k3L0%O5m7ok6N7o7J7jM6l8
$$ 21 3 0 -20 -22 4 -36 30 -10 -37 -57 -87 -11 -12 6 16 -52 -9 -39 4 -19 -42 -12 -12 53 6 0 -26 31 -36 -19 -20 26 -12
4462a2O0n7L1k4pJ9j4K7q0Q3Rmm8L3mk6L0J4j9j5J0k2K3lj5L0l9L8Ro9P7j8n4
$$ -12 48 -9 22 -2 -9 10 -4 23 -57 26 35 31 -17 16 12 -14 16 30 11 -4 6 -16 7 4 -11 19 -20 18 27 -42 35 17 -37
4495c7K7Lm0QP4k0l3M4k7m7N9N6q2J2K5n7K3K1j8Oj1L4n1P3n7Q9o6J8J4l2k0l0
$$ -37 -10 -7 -47 -39 35 15 -18 26 -1 -48 11 67 -15 -3 22 -35 -12 9 -9 -3 -14 20 -31 42 -15 74 8 26 40 8 -12 -42
4527d2L6J5lo6O6j8L0j7j2J3L0n5M8j3l7L4J8Mm5K6k9M4o9O7j2J0l7J6Jnn9O1
$$ -42 -6 9 6 -60 6 -12 18 1 -11 2 32 -23 25 12 -25 9 27 31 -14 12 -17 27 -42 25 13 23 -14 2 3 -2 -61 0
4559@L0k9L5r5O4Kj3J4lJ6%k5k3P3r0O8o3K6O9n9L6%Nl8K6nL0m2l4PRPoJ5J6K5
$$ 0 30 1 36 -59 5 7 -6 8 5 21 21 -4 -27 46 -44 24 -39 -13 56 -3 33 33 38 0 26 21 51 9 -25 -18 -9 -2 -8 7 23 48
4595D8n4k1j4O6n2K0m5K5L8PJ6q3J9N2j9j8nM0o3K0M9j8rm4O2k0M2k9pK5k6K6
$$ 48 -6 -27 -41 25 -27 -7 -52 -27 11 18 34 -49 -30 22 3 -15 -20 20 -43 -23 26 8 -1 -45 17 -3 39 10 3 28 2 28
4627B8rm4k6J8J5J3j0K6k2k0N4lJ2J6n4m0j7M4M5kkk1L8o6J6L4rM7m8l4M2k0l5
$$ 28 19 -25 -51 -33 -18 -5 -15 11 -11 -31 23 20 32 48 -6 -46 -63 -19 26 24 22 1 39 -27 -11 23 14 61 13 -21 21 1 -34
4660c4Q4m4LNj8jj6O4On9L0k1k9KRN8k1j8qm0M8K3l8L8j1n9P4J0rpl7NJ7l5P1
$$ -34 50 6 9 14 -4 -5 -21 43 49 -10 20 -1 -30 -28 -19 39 18 0 -8 -48 0 23 -15 23 12 -47 27 37 28 21 -16 -11 6 -29 42
4695D2j0n3N4p8P3k3rMK4j9k5J8Q%j1l6P1k0j7K2KJ9l4PK9n4L2L3k9jm8pM2l2
$$ 42 32 -21 33 -45 28 5 -4 0 24 5 -20 -2 6 6 -5 -41 30 10 -7 15 17 36 2 9 38 -16 16 49 20 19 -29 -36 6 -26
4729b6m4P5kn1K8QK1J4l9K3k0LL3oOj5J1p3N1k3N6jPj1m0qM0n5L3J6n6O9Ol6J1
$$ -26 -70 5 3 -48 -20 -12 9 23 -16 7 -13 -10 23 17 23 8 19 -54 -3 -26 30 29 36 25 -15 -23 17 -38 -5 11 -45 24 30 -6 5
4764EM6n7k2P9n5J4m0M9l6L3j2%k2L0k9m2N3MMPL4k5jn6M3j3Jk8N4k3J8k9M7o2
$$ 5 51 -6 -28 51 -4 10 -30 19 -17 16 4 4 -18 12 -17 -59 -6 -2 2 9 43 18 17 -39 4 -9 -8 -36 18 -5 13 -16 31 -31
4798c1O2p5P8l6J5j4Kj8j2J6n4P0m4mO4o8RP2k4nJJ9j9Mk8J9QK9m9m6Q3m6J9K3
$$ -31 31 -44 34 -2 13 -1 1 -17 -29 -13 -67 3 -41 -45 19 -49 -40 32 8 3 4 23 4 8 -20 -1 7 36 -13 -59 24 -22 -3 20
4832B0nPN1o8j9O4l0m2J2QLJJ2m8L1l0l5J16p0J8l7K7k1N0k2j6l0M1l9N6j9k7
$$ 20 15 22 73 5 -14 50 20 -22 -10 -2 1 2 14 -34 -3 -33 -68 48 -22 -4 -41 -14 -35 15 -7 -23 -53 -12 -51 5 -14 -41
4864d1O4k4j7n1N6j9Q8n5j9J9K0m4M0j7L1j0JJ9p5N5K1l6l6L2pK3J0mm8l3N9j7
$$ -41 23 -1 -18 -69 -13 -32 56 1 -18 1 21 -23 17 0 31 21 22 41 -34 21 42 6 -30 2 -5 18 28 24 -24 -57 2 -15
4896a5K6J7n3K3QMn5Q3m0Jk2M1Mj0J0%p3M6j8J9l8L7J3k4K5j0j2K7Om3M2j7k2
$$ -15 11 28 -25 -2 6 10 -45 38 -2 -1 -23 18 22 12 22 22 -51 -5 -23 -4 -42 -5 8 -16 9 -1 -13 14 20 -23 19 2 -20
4929b0M5n2oN1k8L4l6Lk7M4l0k7O1j0k5K0L0k5k5N7p8P1m8l0O7j1m1L9L8m2Lk4
$$ -20 25 -27 -33 18 -10 24 -12 -9 -36 8 -22 -49 12 2 -23 -3 27 2 -23 34 -44 27 -21 -51 16 5 -36 3 41 -1 2 -22
4961b2j0K9KK0M1p2J5KRJM7l9l6K9r5J07j2j9l4L2PK7p9K7J7m4Q4n5J5rK1M5r7
$$ -22 -32 -3 -1 19 60 -12 3 5 14 15 62 23 -13 16 -79 28 16 -3 -37 -5 2 29 -50 -23 -6 -50 34 -21 -6 -15 6 51 -46
4994d6K0J2J3pN8k2On1KM1l0K6k7N6kr2R6l1k7j7M3o8J8K1k3M9l0J0J2j6M8p8
$$ -46 -26 -14 -1 -8 50 28 34 -17 -15 26 -4 22 -5 51 49 -43 53 22 -5 -22 21 -47 -29 -8 -31 18 -12 -2 10 -6 42 -36
5026c6L1m5K5K7j8qK4j0J1J5j8RM2l6m4K7M7n6L7m5L3Ml0%M1p1M5JK2j6j6kL3
$$ -36 -5 -50 -25 2 -16 -24 0 -10 1 16 -2 7 49 13 -31 -4 43 -13 24 -21 12 16 -14 -14 27 -44 1 2 24 8 -8 -10 23
5059B3qm4K4l5M1K6n3M2n7J8MJ7k6mK7l5J0N5J4n2K5j3l6O3j5mnk9L8Rl5L6m2
$$ 23 15 -29 -5 -40 1 27 -26 16 -41 -23 -19 -2 -28 -32 -5 -40 -30 25 39 -13 12 -1 -37 26 11 7 2 -27 11 20 -15 21 -21
5092b1K9M3q6QR0k0p0J9K2KK5Lm8L2k4m0Q0n3nNL2n4j5K8K0J8Nl6%J9Ol3K5k6
$$ -21 8 51 -35 -27 63 43 -27 -8 14 16 41 44 -4 28 4 -36 44 -9 -14 -9 23 -31 -46 -18 2 20 25 -11 -11 8 14 -19 6 -20
5126b0N3m0k4N3M7qp2n3N5nLk2N0l1k7l0MN6J4k0K0L1n8L2j0on1R6j4j5J2PJj0
$$ -20 33 -7 -31 22 69 61 -11 -64 -9 -14 -11 -33 17 -14 -41 -71 -67 -11 3 -17 3 34 -24 8 -2 -8 -59 37 23 8 20 27 28 18
5160A8K9o6J2k0J0j3K7j1k1N8j1k6lK7n0KM2LL4o5K4J3Nl8l2O9k5J4l4PMjL1r1
$$ 18 47 -19 -7 -27 -17 -30 -3 -14 -35 23 12 -14 -17 10 -40 -38 4 7 41 -24 0 13 18 -20 -52 17 -8 6 -28 -21 -17 -18 13 -78
5194g8J21m9L1k1m0M5j1PrJ7L4m1J7rj7j4K4J0k8j0P7q8O1j2k7K1j4m1M2K1k6
$$ -78 43 -6 25 4 -36 9 -2 5 -4 13 47 6 23 14 -3 -17 7 17 -11 -21 56 -32 29 17 -10 11 -3 -44 -2 19 -7
5225gjK9o3j0Q2m0Pj7lrlO5j7j9mK9m2L3QJ5o8N9k1lol2O0M3o7N6m2J5n0M3J2
$$ -7 -8 21 -42 -52 30 -10 -3 -20 -23 -32 -35 30 13 -6 -10 19 -23 10 18 33 -35 24 3 0 -6 -38 22 65 -2 54 12 27 -23 20 32
5260C2k5k9L8Pl4L1L7l1n7P5l6Ko5O2lQl7P0p8P7j7o1K4K2o7L8L3m1O0k6j5l0
$$ 32 7 -22 16 23 -11 20 57 26 -31 44 8 10 -55 7 4 12 -25 45 -33 44 27 -34 -10 12 -55 -17 16 -25 35 9 -6 -36
5292c6R3l5MK4j0rj0j8J1M5m8J8m9J87j65m9J1P5l5Lo3O4J7K3k1l3J4K3k8Pn8
$$ -36 57 22 26 50 40 31 21 3 14 59 11 29 -20 167 2 -47 -36 39 4 7 -56 8 25 48 27 -6 8 31 3 10 -48
5323d8K8QK7k6J6k6M3m5M6J6pJ7p1k1k1L2L7K3JK3ok3l2N5o8M6J5J9l7mj5O%j9
$$ -48 -20 -12 15 -11 5 -21 22 -23 23 39 32 49 -22 -43 -64 -32 5 28 29 52 46 23 -9 46 -22 24 39 58 21 17 2 8 8 -11
5357a1JK0l0K3Jk7j1M8k7l5J8M0J2J2j7rM7j5j7n9M8r1J04Pm5L1QJ7l8J7ml2l5
$$ -11 -10 10 -20 3 4 -23 -34 14 -13 -48 -30 10 22 34 17 8 55 40 23 -36 12 -79 25 32 -13 18 26 43 5 22 18 -14 -49
5390d9RN7K7o7N0m1JONj2k3J5j0j6P4o3L8l1K0Mj6KN6nnk3Q1q4k4K4j9K2jJ1k8
$$ -49 -40 17 44 -23 27 -14 -13 -7 -2 -14 -37 -22 -32 -48 26 -37 1 -30 -10 -6 -22 -20 36 31 26 3 84 0 -24 0 -19 3 2 13 -15
5425a5Jm8O1rk6%M9n0M2k7O9om1k9L5j9oK5j1%k3K9J1k7M8L1j13M2J7M3l7l2L8
$$ -15 -14 -62 -1 -10 -36 -36 13 -37 5 -22 47 41 0 -29 6 -13 -19 6 -5 -5 -28 1 12 -15 33 64 -49 -7 10 53 16 -16 22
5458B2l6P7m9K4p6M2J9p7N7l8P3o0NL6K9o6j2Q4o7K2KL7j6o7K9KK0Ron8L2qoN
$$ 22 -14 63 14 38 -38 4 23 -54 3 -35 38 -22 -17 19 48 -18 -30 54 -13 9 11 48 32 -35 -6 -4 16 25 19 -39 -7 -15 -21 -16
5492a6M0q0P3J7j1l1rlJ7Pk8Q2p5N1j9RnJn2J11l5m4MK1l3J0k8P1k4k0j3j7J3
$$ -16 24 -56 17 34 23 -8 -17 -20 -3 4 -24 58 -17 34 15 24 19 20 -32 79 44 0 4 25 -8 2 -26 45 21 1 -12 -29 -16
5525a6m0M3J7K5m3ol1J9L9K1k4N4o4M6k4Kl6lJ9j2j5P2j7k0k8k3N7j8l5O7K0o1
$$ -16 -56 -13 4 29 -14 -20 -51 -32 7 28 4 58 -6 40 16 18 -18 -21 -2 -14 -29 43 26 6 -22 -45 12 -6 -41 26 46 -15
5557a5J6K2p5Q0J2n1rj3N9l8kNj3K6K8o4J8L6p5N7l6RJ5j4O2n6Qj5J4o3Q4%Qm5
$$ -15 1 23 -52 28 40 -11 -20 -33 26 -12 -14 -9 -22 4 32 -32 -14 22 -53 4 -32 -23 -8 -22 40 -16 -8 -23 -9 -72 12 12 20 -25
5591b5oM8j4O2n6J7q2N6K8j0j7K3m7O7j5l1j3pJ1l3R4q6K1L0j3J5m8N0k6j6k6
$$ -25 -31 17 3 65 9 26 -56 0 28 18 1 24 -23 44 29 -2 -15 -22 -11 -44 50 -36 -15 15 2 17 -31 19 -7 -23 -49
5622d9L1ol4M4O1l6l7Jl0M9L1k5mK9k4l2M7Lk7M2m4Kj5j4P5q0l4O2j2J3kN1K8
$$ -49 -18 -24 -58 -14 47 11 -26 -25 -55 -6 25 0 -4 25 1 -31 16 19 -8 34 -10 -8 -23 -37 38 -42 -76 -14 -26 -13 -15 36 64
5655F4j11J6K0L8l1k8OM9p1j8J00o1L7m1P8n2J3l1M1k0QpK5Qo6N7Kj1qK6rKk1
$$ 64 -47 -31 -11 27 -4 -32 -26 23 -48 -66 34 -27 10 -31 47 -5 8 -23 18 -2 6 -1 24 32 -34 23 25 14 6 32 23 25 4
5688Dk1K2l3K5j1n0KQ1m9N5L4l6o0K3L4l2j7N8j2k0Jj2j6l0P5L0j9j4j4j4N6m8
$$ 4 -17 5 -28 -3 -14 -64 -62 19 -30 25 59 23 -37 -14 20 -12 -29 29 17 -3 -2 -14 -30 -60 15 45 26 12 -2 -16 40 -8
5720hK2k5J0J0Ok2J3M0m7k9J7j2J5M2m2pL4L6n1p2RP5nJ1j4JJ9k7j3K1M0nm3j7
$$ -8 14 -11 -1 9 15 -7 6 46 -1 -30 -13 -25 -10 32 -10 -17 17 53 2 -70 -61 14 9 20 6 7 26 -1 -14 7 47 42 -1 -18
5754a8K9M4J1k1j7Pm1P5m0o5N1pL9n7O1n9L6J5n4K8m1M6j01Q4J2l0PM3nkl6j6
$$ -18 11 55 66 45 28 35 -6 69 29 -36 15 8 47 -10 51 -8 28 43 -11 17 -24 22 -79 5 17 -13 -6 37 32 30 -6 -22
5786b2L4k5M0m8QL4k8J1K0J0m3J0qK5k9M4j7Pk5l9J7j0J8kJ3K0k6j2M6l0J4j0
$$ -22 12 -13 27 -21 -13 21 -7 4 24 34 -9 1 -7 18 -11 33 16 23 -2 -41 -24 -34 -16 -18 -5 15 -11 -23 23 -7 7 -3
5818cj6J2J5K5j9n7%N6m8mL5K4pj3L9m4K9p0P7J1j11K2K1J0K6K0o1N2Rjj0Pol1
$$ -3 -19 -7 8 33 14 -43 -43 13 -35 -39 -4 20 13 0 39 -5 24 -46 31 42 -69 -47 -26 -16 10 30 -31 21 30 29 19 26 20 -11
5852a1R3m4k8k3kJ6%L3m9J0n4M0k2N7k3PM1%j5l1k2K1l6J2O7j9l3j0K4KK1m6J2
$$ -11 82 38 10 -13 -15 1 1 34 -15 -5 -59 -19 -41 16 -7 0 41 41 26 -5 -27 -6 -42 -30 37 18 -15 -25 -1 1 22 -24 -12
5885a2n9L2L4kM5pom3QJ5rMJ8l6N3n8mOQn4Q5n0M1j8jL1k9J8n1K0J6Jk4QK1k0
$$ -12 -71 -39 -5 -7 38 31 25 -18 -10 5 -4 0 18 -18 35 -23 -27 -21 -13 -67 18 -32 9 -9 -10 21 -8 10 -41 -21 -5 -4 -28 -20 1 -19
5921a9M2l5m3L3K8rL2j5L1n3K7k0K5ppj1Lk5O4j6j4N5r3N3Ok3%q5M4k2O0Rn3M3
$$ -19 23 -12 -55 -22 6 -3 29 14 45 -8 19 -1 24 17 10 -1 2 -23 41 25 11 66 -27 26 32 9 9 -76 -32 -54 6 15 -38 5
5955El9N2N0q2J4Ok8N3o9L6j1J8pJ4JKkRm2kK4L8o8N8k6Pl7M7J2k8j4k6L8K1o3
$$ 5 -34 18 68 -14 0 6 -22 31 -38 -2 -13 5 -2 12 13 15 13 22 -20 -22 2 40 -28 30 4 11 -26 21 33 5 -9 -35 3 24 -39
5990c9N0Mk7k7L1n9J0J08p6k1JO6pJ1l0kJ8M5o2l8O5%l9O4k8l2J8qRK6j7j0Lm8
$$ -39 11 15 -12 -39 -8 -67 -57 51 -25 -46 -45 21 14 25 -5 -7 11 56 -6 -44 21 21 -18 46 18 -14 4 -4 5 31 14 4 7 -41
6024d1L0j1j0m2J47o2j4L6j5Mpj9lL0J7n0LK1Pl2j0M2K2o9M0l9M3K0l0m6K5j6
$$ -41 -11 -22 -32 -74 73 11 -3 33 18 22 15 -4 -7 23 40 -10 -7 14 21 -11 -21 21 43 -26 14 -25 18 38 8 -38 -13 -29
6056b9N1j1M8l1j3k4K3m8N5l0r4O7RL4k2k0rj1M2O9p7J2lK6K2n8K0J6l0L8n9L8
$$ -29 22 11 59 28 15 -9 14 -34 21 -9 -103 -36 -27 7 -15 -35 -44 -55 -13 56 -21 -9 -12 14 36 -22 -2 14 -16 22 -37 1
6088AK4L0m5j9P0k2k6k5nJ1M4m0O2k2m3j5J3Pk1J7j2N2K3n9kl4K6l0rL3pN5Mk6
$$ 1 25 55 10 -9 61 39 13 -12 -17 -6 38 -2 60 38 -5 -20 -7 0 -21 -4 -16 36 59 0 -2 -36 -10 -40 -49 -16 -23 32 36 10
6122A0j1m0N8m0j6N4k4J2l9L4J7l2O3l6Lj2J1l8L8j8J6rJ1l6l4P9l7M3j6j0J5
$$ 10 -1 -41 17 -23 -39 15 -9 3 -36 -2 15 -17 46 10 13 1 12 -26 12 -6 10 1 12 -24 -58 21 -16 27 11 1 16
6153A6L8q0J4K3%n7M7m7PM5j5j2nj6M6k7m0O0J6J9k1k5OQ4j13L2J6mrRJ5k1j2
$$ 16 54 -26 -12 11 11 -46 1 -46 -39 6 -9 -21 -26 -42 4 -23 -63 -3 13 32 11 -14 -8 76 -37 -5 11 7 -2 7 22 1 -11
6186a1mK8l7L5J4mm8Lj3K5k7M5M5j06L3kQ%J0L7k8m0N3L3m0k3K1nN6m7LK2r7M
$$ -11 -15 13 -24 11 25 21 -27 -24 -37 -12 -39 6 51 -55 -22 -24 -16 -16 -6 31 3 -37 16 49 9 -14 7 2 58 11 14 36 -61 -57
6220e7M7j3MJ1jQk3pM3l4mR9o1NK9Lp5J7N4m7l7M9J8o8O2r8J07J0l9J9k6Rl1N1
$$ -57 -10 -23 -19 -8 -9 -1 -24 -31 12 -22 -26 73 12 17 46 49 -26 -9 45 -2 -39 10 28 -40 22 -76 31 41 2 21 -5 4 -27 24
6254B4k7lJ4m0Q0J3k8k7nL0j1J7k4q3P7J0J7l0oJ1L1lm7J4RK7m5L4m7M1J4m7K4
$$ 24 -3 -6 8 -32 48 61 33 6 1 31 20 37 13 -70 7 17 34 4 -2 9 40 37 -10 4 13 40 -5 29 -18 23 37 -10 14
6287A4nJ3L7m3ll0j6K8j6Mqpk4R7l9p1P3p4J24j0rRl3mn8M1L0l6kj9O4Jm5M9m7
$$ 14 9 22 59 16 13 -17 -33 -5 -21 -17 -25 -32 -56 41 2 -69 4 -70 54 44 35 44 11 7 -51 -10 20 -16 -18 -37 27 28 -17 32 -15
6322a5j4k6j1N2J0K4K4l3m1J0L6o0N3OoM3o6QK0J6k2j8J1KOK7n3M2j2j3K2k4L5
$$ -15 -29 -55 -66 -14 -4 20 44 11 -30 -20 16 -44 9 15 9 52 -14 -6 14 30 8 -10 1 3 9 36 -17 25 13 0 22 -2 33
6355C3Ql2J8k2m1Pl0N5L3o0L9l5ML0k4j4M9m5L9J2m0%J4L0q1P2l2J2qk1KLL6m6
$$ 33 41 9 27 5 -36 -29 -59 -4 29 -31 8 -27 -23 7 -17 -31 18 -27 12 24 -16 -16 -2 28 -53 19 -13 -1 -9 -30 -28 -25 11 -35
6389c5O4M0l3k2m4P3j5Pl5N3k5Ok4j3K0l1j2j3P8l8Oj0J8pnL0l1K1p6P3nlPN0
$$ -35 29 69 36 14 -30 43 28 35 0 53 28 34 10 -3 17 -14 -26 -39 39 1 7 -3 15 8 3 33 2 23 -53 20 15 12 19 69
6423F9q9M1o2N2k2j0l0K3P0k5q1L4L7o1M7j9o0J29k4l9L0J9m6j4N3p3P3nj8KK9
$$ 69 -20 21 -41 11 -11 -21 -51 -28 42 17 -64 -30 7 -54 -7 -26 -86 43 19 -20 10 29 -17 -31 22 -51 22 17 -1 1 30
6454C0m1NL0n4k5Q2n5m2J07m4L7o2J0M5j9j5K0M2j11O0m3J11l6K3K0q0P4j20M0
$$ 30 -11 -6 24 -30 -55 27 -28 -70 37 -7 30 -32 -22 23 4 -11 9 51 -60 0 -43 68 32 55 75 -5 69 -51 -11
6483a1K8k9L3k5K5m3k7L1J4M9p9O6j04O4J9k1nJL3l1m5O3k6L0k6pLN5Lm2K2l7
$$ -11 17 -12 21 -4 21 -22 -49 -18 -4 45 -34 32 -72 -8 11 -10 -15 -14 19 -12 -57 6 -20 10 -16 -23 -20 35 38 -4 18 -19
6515a9N9m5j0L1Pl1l4O3N2l3o2qL9qK6o1P8o9O1Pn9N3o0J4k7j4Q9j4n5J3M6n8
$$ -19 40 -5 -15 16 23 -8 -42 21 73 40 -22 -30 9 1 27 -34 44 -25 36 43 -16 37 -23 -9 -36 -50 39 25 -30 -17 29 -29
6547b9N4m6LJ9NK6m5k3K1J3M0q1L4k7%M6K4nq0R7l8m0O6q9L8J5K7j2o5P3n5OM3
$$ -29 25 -21 -18 1 6 32 -13 -36 -15 -2 38 -43 -9 -36 -36 10 34 29 -51 46 8 -32 34 -55 -17 -2 25 13 -52 21 -34 -28 15
6580A5j9N3j21O0JNO4m1l1j0K3k5Ql2L7K5j5rj0L1j1K6Rk1j0kq0Q4N4j08M8J2
$$ 15 -4 49 -72 -12 -11 -6 58 17 -14 -24 -1 -26 -18 -50 -13 12 -3 -12 -22 9 -2 24 33 12 2 0 -80 4 58 -50 -2 10
6612A0j5k9J2L0l1L6j1j8j4J8Kk8P2l6K9%p7L6Ml3N5p0N6Rl3K5k5J4KK8k0NMp
$$ 10 -5 -34 -22 8 -23 13 2 -16 -30 -12 -10 -38 34 -2 27 27 -50 -14 -10 -43 12 -58 -2 7 -26 -1 -26 -12 -10 18 -2 3 7 0
6646@lN0j11R3rQp4K1M9p4Q9j08L5K7m6N2L3o4l5M1O8q3M4o7L7M2m7K0j8N0k7
$$ 0 -3 47 -64 29 20 28 -46 -25 24 -50 39 -69 -34 -7 -53 -1 32 -32 -67 -26 42 -41 3 -64 -27 15 -32 -12 -30 20 -7
6677gj0n9P9J6Ok2K4j3LL3m8n1K0Rk5N0j0MK7K0n4J9%j1j0m0R9k1n8M2k2J1kN9
$$ -7 -17 -76 3 19 25 3 27 14 17 50 2 -49 -29 -20 -45 5 -5 -1 26 46 -8 11 11 0 -10 -50 49 28 -30 12 -10 1 -1 58
6711E8m1j4K4ql0J4J2k4J2j0RrM3l0L2m3L6j2L3p9O1J1m4L9j01R1k2j4k6N6kJ7
$$ 58 17 3 27 19 -11 3 15 -9 3 -7 2 -7 36 6 38 -5 31 19 52 -27 34 45 1 40 -61 30 8 -6 -32 24 22 39
6743C9n4L3Ol0P2r5J6pK6n0K6jK1j2j0JJ4l2P8l3j4J8j0nl4P4p3Q7q8Q0K4p0K9
$$ 39 -15 18 24 -6 66 -29 -13 -20 6 -44 -18 -19 2 -10 -20 -19 -5 -37 41 8 -6 12 2 -3 -37 37 -36 51 -37 43 67 -3 26
6776B6n1L6J7JJ2j13K5O2k6N1l8Rn7QJ8j5O5n1M4o0N3J0Oo2K0k4M9j6J4l7%J8
$$ 26 -25 11 28 29 41 -72 -47 15 -11 40 2 11 -46 -38 -20 -35 30 -21 23 -37 16 26 32 -30 -10 -34 15 -1 13 -24 -24 -6
6808fKM2j06Q0K3l1J4Oj7K9l6M1j8l7L7l7J6M3j3jl6K1J2j9j7JJ8j7k6L3m6M5
$$ -6 -4 38 -68 12 35 4 18 24 7 36 0 41 23 -14 23 -14 2 45 32 31 -5 16 28 9 -8 -7 11 -6 -32 1 -45 0
6840@j9J7%j2L9j4l9N7k8Q9o2m3K0kOJ3Qk9J0m4O4Rrm0K8l0J5K9n8k8N8L7q3L8
$$ 0 -19 -2 -2 -14 25 11 -28 29 1 90 28 -15 5 3 9 22 30 1 11 -33 31 40 31 -9 19 -11 4 33 -25 -53 5 42 -41 -3
6874cj7j2QO5Ok5k7j3PqjM1p2P9L7l8k1l6J1K3K1l0k4K0Ok5K3Nl0N7no5O7m5L0
$$ -3 -20 -32 -24 41 47 22 -5 -18 -11 -19 -20 21 -51 28 65 27 6 -30 -19 4 25 -5 -29 -9 -3 -28 -5 0 -30 27 22 -43 24 -21 9
6909In8K0L2L4k3k2k8kN7k0m5J8NlM7k8j5%OM8M0o0NJ4m1j5j6O9k2Nk6j1N9l4
$$ 9 -49 -29 3 37 14 -8 -36 -38 19 -1 -46 -28 -23 -26 21 -7 -22 -22 -16 32 72 12 17 31 -10 -25 -41 28 6 11 -15 -26 33 -1
6943an4K0P5m7N0l7j1K8j2k1m2P2j7m1L9j6j0k5Q8p6j4J4kM4m2M7l6KK0oj2Ln
$$ -1 -55 -35 40 -7 43 6 -5 23 11 -10 -52 20 3 -38 1 -15 -25 -50 38 -38 -52 -38 -40 4 -38 9 -27 -25 -5 -11 -23 -20 -25
6976b5M1kj6KK5Jok8L1rj7k7L3k7kJ9o8P0mK0k2J8po1L6l3O2J3p1M2J6k1K2J4
$$ -25 16 14 -2 0 25 26 20 -8 23 14 -3 -30 3 -24 -26 -7 -75 -5 -9 11 -11 7 0 -61 -25 -58 4 17 -54 -12 4 -17 5 19
7010A9l9j6L2n7L3K9K6n5N0L4m5k3l4L6o8P0M3J1Km8J4l5PJ5j8n8L7N1l3K8l7
$$ 19 -20 -36 -4 -61 -28 1 27 -28 22 56 11 -12 -46 -10 -78 -8 35 46 48 0 14 -21 -14 1 -17 -75 -38 13 -20 8 -29
7041b9J8NJ0l1%L5J4n8L4j3J8j3oN3%j9j4k5MLPL2J7l3K4k0L1l4J2mj4j4P0m6
$$ -29 -11 -6 4 -27 -27 8 22 -36 -2 -15 3 -10 -16 37 37 18 4 -21 -17 -14 -7 25 42 9 33 13 44 10 22 18 4 -10 60 14
7075A4k0rpN4j3j9Rln5N2rk1M2rp7P1j0K9k3LOk2J2LK4k0K0n0j2K0N6L5o4k5J2
$$ 14 -6 -15 -22 32 19 0 9 6 -49 3 -6 -27 15 6 -71 0 -10 19 -4 -1 5 -17 -5 -2 22 2 22 -28 -40 -20 36 71 7 -18 -6
7110fM7o5J1M9j00Q1k7m3M3l0L5L6K7n3L0m8J1m0l0O8J4K6m7L4l1j1M4Mj8l2O5
$$ -6 41 -24 -13 36 -64 17 -10 -53 -10 -40 -5 31 58 5 35 -13 -2 -42 -72 -4 10 36 -11 23 -8 -19 25 29 11 -21 44
7141D4l2KoOlj8RM1l8J5j5L4j8k0J4l3lKmM8l4MOr0Q6nP7q8L9nNNj7l0L3K2m2
$$ 44 12 14 8 14 11 -7 2 43 5 20 5 39 21 1 15 -18 -21 -19 -23 25 -9 -5 1 -89 -3 -8 69 -19 20 15 20 25 8 -22 11 33 -9
7178ik4K6J3pJ4k0lkL6k0J9o9pN0M3j5o6N5qk6K2qN5n0OKMm8L0j0K5m7M4llK7
$$ -9 -33 -7 6 -1 13 -7 -10 -12 24 4 23 -46 -53 -3 40 25 -41 14 6 -20 2 -6 49 -1 5 7 11 -37 -7 -17 8 -39 5 2 -1 26
7214B6l0o4J5M7L8j6Ojn1K1N%L8l5J3jl6J9K5l3k7M9nJ0m3P9l4o%k1N2k3K7m3
$$ 26 -4 -68 -53 -6 32 16 22 21 -30 -9 -4 -4 34 -1 12 11 -25 -6 19 -14 -41 8 3 13 -30 49 15 9 9 -12 40 17 44 1
7248AM0m1O4j25N3L6q7O1j6J9OQl7Ql3K6L6j5MJ3m3K0j0N2lj3j9J8l4L2n9P7p
$$ 1 41 0 64 -61 -8 28 -59 2 -14 5 11 19 -18 -10 -43 -17 19 4 8 21 -22 -2 -12 40 37 24 5 23 -11 21 -38 39 32
7281C2j02PL1N2J1n9N2K3o4pO6n5QO1j29O1PK0Qm0MK9J8k9o1N2k0M7l0km5L5O5
$$ 32 -70 -63 -32 20 31 -28 24 47 -17 -24 42 -13 -5 56 -73 -12 -5 15 23 -17 -13 16 34 5 -56 -4 -24 23 -7 -9 -54 -19 46
7314D6l5n0L4J3K2n7M9k2j1L9k8M3j1%m5K9k2K7m9P1k6l4K0Rm2J5k3lJ9P2k0j
$$ 46 11 -39 -5 8 30 -27 22 0 -11 28 0 43 32 32 -13 16 -6 21 -28 43 17 -17 3 12 -30 -15 -38 -41 -22 50 30 29
7346B9j2n1P1m1K9K0m0k4P3p1M9K2Pj9p0J1N7p1L4QJ3jn1L8k0j3M9o0J7Nj4MJ1
$$ 29 17 -34 37 -4 25 45 5 -19 54 -17 32 54 61 42 -28 -17 40 -31 3 11 24 23 -28 10 -10 -23 26 -34 -17 -12 -26 -22 -11
7379a1N3m3K3j9k9O6r8P6Om7K6N5m6K6o1pM4J8k5jnj6QN2m9l3N0opRk9O6q8N4
$$ -11 42 -1 22 3 -26 40 -58 18 24 -23 3 58 12 38 -23 -30 14 32 7 6 1 -15 -7 45 -4 -37 13 7 0 9 -20 46 -42 12
7413A2l1K1K5o4L3LL8o1K2l4j5Q0m6rP8l8l7lLj8N2J6m8J4Q1m2K0m7L7m8l7L2
$$ 12 -19 2 27 -37 -4 -1 37 -24 -2 -36 -51 29 -17 -26 52 14 -23 -26 -23 -41 11 27 -21 -7 74 32 52 5 42 -6 -43 -11
7445a1K1rL2j6k7J9lM3o2N4k2j6J4K2j7oJ6l2J3m2K4Nk4mK2J7m5P1m7J5J8n5M5
$$ -11 10 1 33 17 -10 9 6 49 -13 41 19 3 17 39 22 16 32 0 13 -29 -5 0 -24 -28 -6 11 -34 37 -10 5 23 -32 13
7478A3j9O4k1o1J6k7L6K6lJ9k3m7nK5k6k2O4K3l0k1O6n0N6r2P2k8m5J00r3N4J4
$$ 13 -6 58 37 -24 -8 -35 1 27 24 43 20 -27 -32 -7 -33 -55 9 32 2 -19 47 -3 53 -39 33 5 -40 60 -33 21 35
7509C5p4PP6p7M8NJ1k8lj1J6k9O2p4kK6k6K8j9LM3L1l1j02L7Q6l0mJ2j5K9o1N8
$$ 35 -39 -32 44 -33 15 20 31 3 0 -11 5 -24 38 -36 -38 -12 -38 -10 -29 -26 17 48 17 -85 -48 38 8 4 16 1 30 -31 27
7542B7l3k5J3M9k0kj8L2l8m1N7on8Q1k6ON6j01M7K1k6rK6l8J7M0l8M4j3r8Q9q
$$ 27 -6 -31 -18 31 11 9 -9 23 -15 -56 1 -5 -63 18 -8 -2 54 -47 0 21 -5 -14 12 -26 -9 31 -7 37 24 -74 15 7
7574Gn1N5jJn5j7O6m1J9k0M4n9L0N2p3O0l4j9N1m6jK1K0j2L3qk6l6L1L0l2L6J9
$$ 7 -44 11 10 11 -44 -61 5 -36 -17 -37 7 -52 -22 30 -43 17 -17 -36 15 -31 -32 -11 9 -3 30 22 -4 -40 -9 21 -11 25 44
7607D4l7m8O3j7NMJ2om6J3M3PJ0k9n5j9K7Q2p1L7pl8PK7K7k6m7M2Pkk0J0K3n2
$$ 44 7 -41 22 5 10 14 26 20 -26 -13 30 37 47 18 -37 -56 -29 53 -18 19 12 -26 -19 8 35 9 -38 4 11 9 -11 -1 22 -30
7641c0K9Kj0J6k5M0oj1nJj7j1J1j6M9jo4N2jk9K3KK9k7Q0o7OJ9k8n6L4K7n7N4
$$ -30 -1 1 -9 7 -18 22 16 5 0 1 -16 -27 -16 -32 17 16 -48 4 3 -26 -3 -1 28 1 81 14 20 39 11 -45 -11 16 -41 13
7675A3k6k2L1J3l1M6p1L3M1k4ok0K9o2N0m2Q0j6J2m0j8M3j0nK5l1Kl0P8k9Lon
$$ 13 -13 -35 -4 9 -22 24 -47 -14 27 3 -3 -23 6 -56 -6 -48 32 16 28 -12 -30 13 3 -2 23 -8 -6 -36 42 13 16 10 5
7708Ejl6j3K1N5K4n2k5J8Pl9N9k4M6k4K3mjr0N2J0j8p%j6K6J8k9K4j3k6K9qj6
$$ 5 4 -32 -45 -24 31 55 3 -22 -4 3 -36 23 -1 45 21 44 40 39 -51 1 11 -7 -14 -14 -30 -4 14 -15 9 -4 -30 -1 -9 -25
7742b5mK9NMJ5l4NJ1rL5j6K6o8oL2O0n3qOK6m0JK3K4m7K2k0PK9q9J00p9L6Qk4
$$ -25 -29 0 5 9 24 -10 -5 6 -3 32 16 42 -26 -32 0 60 7 -1 5 31 -9 -8 15 39 -8 14 -6 1 30 -59 41 -38 -2 6 -18
7777a8PJ2jM4On3l1M7k2PK0n7O3m3L4m4qP4k2j8K2k0N1p2oK9k0K1l1P0q3k7Q0
$$ -18 -11 1 0 44 50 -3 -34 13 -9 -2 18 -39 24 -19 15 -29 -37 37 15 -3 19 -1 50 -22 -28 1 -19 2 -29 41 -42 -69 11
7810A1l6LL1qN7m0L6m0Qk1K3kj6l2MK8L7m9J4k6L0j8mj6Q9n5L6m5nj6k2Q3k4n8
$$ 11 -25 -22 9 1 58 18 54 14 22 1 24 22 6 -26 -22 6 43 -6 8 -18 12 -6 -10 -26 63 8 44 -1 -6 -22 -44 39 15 -43
7844d3O4j9Ml5P4q1P6m9qN0p6J30j32N6k7J6o0P0lOk6j5L9m4M0K0p7N2rJ9J3l1
$$ -43 21 2 6 -29 45 -36 40 -9 -17 33 -43 87 -45 11 -16 0 -60 10 7 13 -13 -28 11 -33 7 27 -50 2 -7 12 25 -6
7876fJL5JJl1j8j2K7M2m2l4lK9l3N2J9M4r1L1Mn0P4k8m5K1%LQ5p8m2Q9m0K9k0
$$ -6 -5 30 31 32 1 -17 -29 -2 40 -2 -36 -39 -10 -43 9 28 72 -19 12 16 -34 40 12 -33 -12 -12 -9 76 -2 -44 45 5 34 14
7910A4kl4J3K5Nj3JO0o5J7j4J7K0n9O6o5MLl7KJ9k0M6N1p8J5K3m6O1L6j06%M0
$$ 14 12 -22 -9 16 21 8 9 69 4 21 7 24 44 -15 51 -14 -10 -7 -44 -42 -23 -43 3 54 -24 -9 14 -32 29 65 -41 -41 -1
$$ [...]
8191e3
##END NTUPLES=NMR FID
##END=
