##TITLE=1H_AM_NV105
 aceton d6
 8 sc, 
 27.12.2023
##JCAMPDX= 6.0         $$ Bruker NMR JCAMP-DX V2.0
##DATA TYPE= NMR FID
##DATA CLASS= NTUPLES
##ORIGIN= UXNMR, Bruker Analytische Messtechnik GmbH
##OWNER= root
$$ XWIN-NMR		Version 3.5
$$ Wed Dec 27 14:05:51 2023 Russian Standard Time (UT+4h)  she@DPX200
##.OBSERVE FREQUENCY= 200.1313
##.OBSERVE NUCLEUS= ^1H
##.DELAY= (6, 6)
##.ACQUISITION MODE= SIMULTANEOUS
##.ACQUISITION SCHEME= undefined
##.AVERAGES= 8
##.DIGITISER RES= 18
##SPECTROMETER/DATA SYSTEM= spect
##.PULSE SEQUENCE= zg30
##.SOLVENT NAME= Acetone
##.SHIFT REFERENCE= (INTERNAL, Acetone, 0, 15.7039)
##AUDIT TRAIL= $$ (NUMBER, WHEN, WHO, WHERE, WHAT)
$$ ##TITLE= Audit trail, XWIN-NMR		Version 3.5
$$ ##JCAMPDX= 5.01
$$ ##ORIGIN= Bruker BioSpin GmbH
$$ ##OWNER= she
$$ F:/spectra/data/she/nmr/H-F/1/audita.txt
$$ ##AUDIT TRAIL=  $$ (NUMBER, WHEN, WHO, WHERE, WHAT)
(   1,<2023-12-27 14:04:52.07 +0400>,<she>,<DPX200>,
      <created by zg, POWCHK disabled, PULCHK disabled
       configuration hash MD5:
       00 E9 B6 7A A2 85 ED C7 34 08 36 98 17 FE 4E 26
       data hash MD5: 16K
       82 CF A8 7E 16 B7 C6 25 DA 51 D1 13 09 5F 81 66>)
$$ ##END=
$$ 
$$ hash MD5
$$ 28 DA 45 60 97 95 B6 96 EC A1 89 B1 61 4D 46 0E
##$RELAX= 
##$RELAX= 
##$RELAX= 
##$RELAX= 
##$RELAX= 
##$RELAX= 
$$ Bruker specific parameters
$$ --------------------------
##$DU= <F:/spectra>
##$EXPNO= 1
##$NAME= <H-F>
##$PROCNO= 1
##$TYPE= <nmr>
##$USER= <she>
##$AMP= (0..31)
100 100 100 100 100 100 100 100 100 100 100 100 100 100 100 100 100 100 
100 100 100 100 100 100 100 100 100 100 100 100 100 100 
##$AQSEQ= 0
##$AQ_mod= 1
##$AUNM= <au_zg>
##$AUTOPOS= <>
##$BF1= 200.13
##$BF2= 200.13
##$BF3= 200.13
##$BF4= 200.13
##$BF5= 200.13
##$BF6= 200.13
##$BF7= 200.13
##$BF8= 200.13
##$BYTORDA= 1
##$CFDGTYP= 0
##$CFRGTYP= 5
##$CHEMSTR= <none>
##$CNST= (0..31)
1 1 145 1 1 1 1 1 1 1 1 1 1 1 1 1 1 1 1 1 1 1 1 1 1 1 1 1 1 1 1 1 
##$CPDPRG= <>
##$CPDPRG1= <>
##$CPDPRG2= <>
##$CPDPRG3= <>
##$CPDPRG4= <mlev>
##$CPDPRG5= <mlev>
##$CPDPRG6= <mlev>
##$CPDPRG7= <mlev>
##$CPDPRG8= <mlev>
##$CPDPRGB= <>
##$CPDPRGT= <>
##$D= (0..31)
0 1.2 0 0 0 0 0 0 0 0.06 0 0.03 0 0 0 0 0.0002 0 0 0 0 0 0 0 0 0 0 0 0 
0 0 0 
##$DATE= 1703671491
##$DBL= (0..7)
120 120 120 120 120 120 120 120 
##$DBP= (0..7)
150 150 150 150 150 150 150 150 
##$DBP07= 0
##$DBPNAM0= <>
##$DBPNAM1= <>
##$DBPNAM2= <>
##$DBPNAM3= <>
##$DBPNAM4= <>
##$DBPNAM5= <>
##$DBPNAM6= <>
##$DBPNAM7= <>
##$DBPOAL= (0..7)
0.5 0.5 0.5 0.5 0.5 0.5 0.5 0.5 
##$DBPOFFS= (0..7)
0 0 0 0 0 0 0 0 
##$DE= 6
##$DECBNUC= <off>
##$DECIM= 32
##$DECNUC= <off>
##$DECSTAT= 4
##$DIGMOD= 1
##$DIGTYP= 9
##$DL= (0..7)
0 120 120 120 120 120 120 120 
##$DP= (0..7)
150 150 150 150 150 150 150 150 
##$DP07= 0
##$DPNAME0= <>
##$DPNAME1= <>
##$DPNAME2= <>
##$DPNAME3= <>
##$DPNAME4= <>
##$DPNAME5= <>
##$DPNAME6= <>
##$DPNAME7= <>
##$DPOAL= (0..7)
0.5 0.5 0.5 0.5 0.5 0.5 0.5 0.5 
##$DPOFFS= (0..7)
0 0 0 0 0 0 0 0 
##$DQDMODE= 0
##$DR= 18
##$DS= 0
##$DSLIST= <SSSSSSSSSSSSSSS>
$$ [...]
##$SUBNAM2= <"">
##$SUBNAM3= <"">
##$SUBNAM4= <"">
##$SUBNAM5= <"">
##$SUBNAM6= <"">
##$SUBNAM7= <"">
##$SUBNAM8= <"">
##$SUBNAM9= <"">
##$SW= 18.0517328524113
##$SWIBOX= (0..15)
0 0 2 0 0 0 0 0 0 0 0 0 0 0 0 0 
##$SW_h= 3612.71676300578
##$TD= 16384
##$TD0= 1
##$TE= 0
##$TE2= 300
##$TE3= 300
##$TEG= 300
##$TL= (0..7)
0 120 120 120 120 120 120 120 
##$TP= (0..7)
150 150 150 150 150 150 150 150 
##$TP07= 0
##$TPNAME0= <>
##$TPNAME1= <>
##$TPNAME2= <>
##$TPNAME3= <>
##$TPNAME4= <>
##$TPNAME5= <>
##$TPNAME6= <>
##$TPNAME7= <>
##$TPOAL= (0..7)
0.5 0.5 0.5 0.5 0.5 0.5 0.5 0.5 
##$TPOFFS= (0..7)
0 0 0 0 0 0 0 0 
##$TUNHIN= 0
##$TUNHOUT= 0
##$TUNXOUT= 0
##$USERA1= <user>
##$USERA2= <user>
##$USERA3= <user>
##$USERA4= <user>
##$USERA5= <user>
##$V9= 5
##$VALIST= <valist>
##$VCLIST= <CCCCCCCCCCCCCCC>
##$VD= 0
##$VDLIST= <DDDDDDDDDDDDDDD>
##$VPLIST= <PPPPPPPPPPPPPPP>
##$VTLIST= <TTTTTTTTTTTTTTT>
##$WBST= 1024
##$WBSW= 4
##$XGAIN= (0..3)
0 0 0 0 
##$XL= 0
##$YL= 0
##$YMAX_a= 531111
##$YMIN_a= -359124
##$ZGOPTNS= <>
##$ZL1= 120
##$ZL2= 120
##$ZL3= 120
##$ZL4= 120
##$ABSF1= 10
##$ABSF2= 0
##$ABSG= 5
##$ABSL= 3
##$ALPHA= 0
##$AQORDER= 0
##$ASSFAC= 0
##$ASSFACI= 0
##$ASSFACX= 0
##$ASSWID= 0
##$AUNMP= <proc_1d>
##$AZFE= 0.1
##$AZFW= 0.1
##$BCFW= 1
##$BC_mod= 2
##$BYTORDP= 1
##$COROFFS= 0
##$CY= 11.3945322036743
##$DATMOD= 1
##$DC= 2
##$DFILT= <>
##$DTYPP= 0
##$F1P= 15.7292609196834
##$F2P= 12.9074282941183
##$FCOR= 0.5
##$FTSIZE= 0
##$FT_mod= 4
##$GAMMA= 1
##$GB= 0.15
##$INTBC= 1
##$INTSCL= 1
##$ISEN= 128
##$LB= 0.24
##$LEV0= 0
##$LPBIN= 0
##$MAXI= 10000
##$MC2= 0
##$MEAN= 0
##$ME_mod= 0
##$MI= 1.114404
##$NCOEF= 0
##$NC_proc= 0
##$NLEV= 6
##$NOISF1= 3.799351
##$NOISF2= 2.8
##$NSP= 1
##$NTH_PI= 0
##$NZP= 0
##$OFFSET= 15.70392
##$PC= 1
##$PHC0= -24750.03
##$PHC1= 8.852731
##$PH_mod= 1
##$PKNL= yes
##$PPARMOD= 0
##$PSCAL= 0
##$PSIGN= 0
##$REVERSE= no
##$SF= 200.130013532006
##$SI= 16384
##$SIGF1= 3
##$SIGF2= 2
##$SINO= 400
##$SIOLD= 16384
##$SREGLST= <1H.CDCl3>
##$SSB= 0
##$STSI= 0
##$STSR= 0
##$SW_p= 3612.71676300578
##$SYMM= 0
##$S_DEV= 0
##$TDeff= 0
##$TDoff= 0
##$TI= <>
##$TILT= no
##$TM1= 0
##$TM2= 0
##$TOPLEV= 0
##$USERP1= <user>
##$USERP2= <user>
##$USERP3= <user>
##$USERP4= <user>
##$USERP5= <user>
##$WDW= 1
##$XDIM= 8192
##$YMAX_p= 0
##$YMIN_p= 0
$$ End of Bruker specific parameters
$$ ---------------------------------
##NTUPLES= NMR FID
##VAR_NAME=  TIME,          FID/REAL,        FID/IMAG
##SYMBOL=    X,             R,               I
##VAR_TYPE=  INDEPENDENT,   DEPENDENT,       DEPENDENT
##VAR_FORM=  AFFN,          ASDF,            ASDF
##VAR_DIM=   8192,          8192,            8192
##UNITS=     SECONDS,       ARBITRARY UNITS, ARBITRARY UNITS
##FACTOR=    0.0002768,     1,               1
##FIRST=     0,             0,               0
##LAST=      2.2672688,     0,               0
##MIN=       0,             -359124,         0
##MAX=       2.2672688,     531111,          0
$$ Real data points
##PAGE= N=1
##DATA TABLE= (X++(R..R)), XYDATA
0@%%%%%%%%%%%%%%%%%oJ2j4J6j6J9k3K8l4L8m5N3n9O8q1R4j06J19j35J53j72J94
39A03k16K41k68K97l32L70m09M51m97N49o05O66p34Q08q91R81j082J195j323J467
59G71j631J824k050K319k644L043l541M170m908N278M34K09438j59828l77007
73c24332k5973O9639p692J50527K60313j3035j42699M9542J05540O291J24960
84B53081J47417k02745l58106O193K29656J7646j20896n7956j28018j34434J52163
95a95999K71823J342j05973P4830K9942j51911M3218K92543L7330l05911j61991
106a70757J13781R4420K1309L3148q1389j74914K938J54577L5236k9477O8176
117F7048j7789j92943l3459K36205J36085j06671r5491k2139n4192L7770J73011
$$ y = [0, 0, 0, 0, 0, 0, 0, 0, 0, 0, 0, 0, 0, 0, 0, 0, 0, 0, -6, 6, -8, 8, -8, 11, -12, 16, -18, 20, -25, 28, -31, 37, -44, 50, -56, 63, -72, 81, -91, 103, -113, 128, -140, 157, -175, 195, -214, 237, -260, 289, -316, 350, -384, 424, -467, 514, -568, 627, -696, 771, -860, 964, -1086, 1233, -1411, 1632, -1909, 2261, -2647, 2631, 3065, 212503, 52675, -324332, -350305, -280666, -288358, -137831, 122482, 109447, -33252, 16290, 121830, 128121, 253081, 400498, 197753, -160353, -154160, 75496, 93142, -27754, -85710, -213728, -348162, -195999, 75824, 77166, -28807, 46023, 75965, -75946, -32728, 259815, 297145, -8766, -170757, -56976, 37444, 58753, 91901, 10512, -164402, -161464, -6887, 28349, -1128, 67048, 49259, -143684, -177143, 59062, 195147, 88476, -7015, -29154, -83346, -45576, 127435]
128A27435J7460k01325p8178J18441L2109n1882P9007P9839j33593j51295O6055
139i5927J41667M3526j2616o0976j14936l227J56048P0764j02177n6138L7100
150C108m0628n9165R6724J15188o7350j17337O258M7505K7638P2075L0989j28397
162a3392j20629P2569J16241j5961m4118J6911k2237o2054K7860Q8845K1055l3717
174C1373l5337n5394j4923J06448R4222p7476j20361J7541O6032r509l836M4847
186D3627k0384q5499j1933O4091L6426J2596J2866m6674p5608K7195J02300J6271
198G5274p3451l9483P156L419K3084M3048m554m4449j5426J006q446L5144O6664
211F8986j9983r9422k2379Q0526M8171k5012k3057j1260k8205m837L9022K2245
$$ y = [127435, 144895, -56430, -134608, -16167, 15942, -35940, 43067, 122906, -10687, -161982, -95927, 45740, 89266, 76650, 15674, -99262, -102489, 53559, 124323, 22146, -33992, 3108, -37520, -96685, 39, 115227, 47877, -69460, -63202, -15697, 11941, 84016, 115005, -13392, -134021, -61452, 54789, 38828, -5290, 11621, -10616, -72670, -44810, 44035, 65090, 31373, -3964, -59358, -74281, 32167, 126389, 48913, -71448, -53907, 12125, 2616, -1220, 43627, 23243, -62256, -74189, -10098, 26328, 38924, 51790, 5116, -70492, -43297, 59003, 75274, 1823, -37660, -30504, -27085, -4001, 39047, 34493, -9956, -25382, -24376, -32822, 2322, 68986, 49003, -50419, -72798, 7728, 55899, 30887, 7830, -3430, -31635, -36472, 2550, 24795]
223B4795j6259j2528j0594k3924J3844O6501K7517n4711n2486P663K9153K0636
235A9607J2958j7562m3205r328L1018J2422p113J4992N829m3791k9281M6558N7918
248E1022q216m3324k0078N046J8727K4622P08l0876k2010L368K523L485K5609
261A0606J7434k7294l4897R693L6340J9846l889k1199k8304k943L2454K2472j6531
274A3788k0926n70l561j0427J2450K8738J374k9914k1203R459K7859K2837l995
287B5909k9029j8100J4038J9568j58o146p41r586j6476K499K2747J4522p868j9228
301h049j4778M444K5412J9650j1359k5528n439J3589R542J453J237l042j2200
314e068j0627L672J5938J2801o279k2925j3645J4517K5196N506j4636j1815L45
$$ y = [24795, 8536, -3992, -14586, -38510, -24666, 41835, 69352, 14641, -37845, -30182, -1029, 19607, 32565, 15003, -28202, -37530, -6512, 5910, -1203, 13789, 19618, -24173, -53454, -6896, 51022, 42806, -518, -20596, -15550, 3177, 27799, 28507, -2369, -24379, -21011, -18488, -15003, 10606, 28040, 746, -34151, -24458, 11882, 31728, 27839, 6640, -21664, -24607, 7847, 30319, 13788, -7138, -7708, -11269, -21696, -9246, 19492, 20866, -9048, -30251, -20792, 7067, 29904, 25909, -3120, -21220, -7182, 12386, 12228, 6082, 5341, -4245, -20721, -18222, 4525, 19047, 11179, -8049, -22827, -18383, 7029, 26679, 15320, -10208, -15647, -2058, 7484, 8937, 10174, 7132, -5068, -15695, -12023, 3915, 16716, 10437, -12488, -26133, -11616, 13580, 19086, 4450, -7365, -7020]
327g020M811M915O144L021o220j2496p812N761J6110R300j0437j9763o007J4028
341e665J6214J462j0486q537K39M801M724N116L923m133j3000r019P081J5979
355H699N090j2653j5855p56J3684J1560j244p736m027o20m18L203Q234M272p045
370D388j1643l486Q760J2481K060j2306j3507M54J1363O641k020k995j247k315
384c372m46N595P326J097p116j0405l825R083J2616n41j3130p676N086O779J298
399B369j55n66l983l861J412N908O632K544o232j0969j518J1149P325o356r547
414e848j995K665L232M411K693k364l732j807p23K697P337K079r745r199M619
429e680J0575K366m539m481k869k25L750L495l63p59m61l744k046P155Q347m019
$$ y = [-7020, -2209, 2706, 8850, 11871, 5651, -6845, -14657, -8896, 7214, 16514, 6077, -13686, -19693, -5665, 10549, 12011, 1525, -7012, -6773, -1972, 2752, 7868, 11791, 7658, -5342, -14361, -7280, 8699, 13789, 1136, -14719, -15475, -1791, 9769, 8525, 789, -3238, -3858, -4276, -1073, 7161, 11433, 4388, -7255, -10741, -1981, 10500, 12560, 254, -13253, -12799, -1436, 5205, 3185, 190, -1057, -3372, -3818, 1777, 9103, 10200, 3084, -7321, -11146, -2063, 10553, 10012, -3118, -10794, -5708, 1071, 2369, 2214, 1648, -2335, -6196, -4784, 1124, 7756, 10300, 4068, -6901, -8419, 2730, 10055, 3699, -5848, -7843, -5178, -1946, 2465, 5158, 2794, -938, -2745, -3468, -771, 6566, 8645, -1100, -10299, -5680, 4895, 7261, 2722, -1759, -4628, -4853, -1103, 2392, 2029, 1270, 809, -2935, -4981, 2174, 10521, 6502]
445F502j1130l488M657M252J749n53l972k914L125M284K13L75J661l888p175J182
461e120Q815L272n181n314j303J701M570K995l742n158J028K863o60J464N788
476F018M21p321l701M609M385p13l252m411l115L119O183N26l533jJ553k024n01
493a758M816K739m225m538L0K239L040K444k783o682q96N251J906k638P2K025
509A042j812k053L575M433m51l003k996k370J286M817P67n447k785L396K479p93
525H5J047J731k440l289Q45K497J130J014n42m046j834M813L976l057m230K03
541b097Q09o16J193K251m41j902l10L6L37K781J782l749m240K176M679L07j888
558A108j17o32j719K92J662n79j477j69r07j222K701M701j80l895q05K423J091
$$ y = [6502, -4628, -8116, -3459, 793, 2542, 1989, -1983, -4897, -1772, 2512, 2725, 3100, 4761, 873, -6302, -5120, 3695, 6967, 1786, -3528, -4831, -3130, 1440, 4435, 693, -4465, -3437, -574, -1234, 230, 6018, 6439, -882, -4583, 26, 4411, 3698, 446, -3965, -7080, -3961, 2222, 2748, -785, -786, 767, -1257, -1758, 3058, 5797, 1572, -2966, -2936, -697, 2343, 4787, 2004, -4678, -5574, -323, 1583, -1055, -983, 1042, -770, -2823, 752, 5185, 4734, 1731, -1265, -3635, -2349, 2468, 3235, -2212, -4997, -1601, 878, 85, 1132, 2863, 423, -2866, -2021, 476, 1606, 2620, 2078, -1968, -3802, 1011, 4987, 1930, -2300, -2097, -1288, -1904, -711, 1540, 1099, -803, -1113, -1077, -740, 2041, 3823, 74, -4166, -1990, 2689, 2996, 1108, 991, 359, -1360, -1068, 594, 15, -1462, -1631, -2538, -3760, -1059, 3642, 3462, -433, -1238, 1185, 2276]
575B276j85k13j430k187L84J289m18j91J375j061l497K07M420J823k195j223Q58
592C2P99R59J436q49k530o79L91j005l13K115M97k760j185K522K263n7p30j067
610a61j300P09K287J50j771K9Q37j218r54J973J443j899k335L30J386J113Q92
627A511n20j916k56J857L88j254M9O76j217j230J557J996j72j146o85n62K88J692
645A056M79k114j388J354J098n83K05R92o04j555j2J100N35K60m30j402l83J945
663E53J488j261j443L69K95p37K02J156j29r31k39L66K71R19N80j385j721O89
681i58J771Rq13n5J12l87N1O77J15m07j56o39n87R90J728m09j811k00J205L40
701E76l49K8j40o44r9O34J72J36L60m01j230J26J385N72r87q27J39L64L19N07
$$ y = [2276, 2091, 1878, 448, -1739, -1355, -66, -484, -675, 700, -361, -3858, -3651, 769, 2592, 397, -826, 32, 831, 1790, 3226, 2377, -153, -832, -441, -1446, -1759, 356, 853, -1907, -3092, -570, 1693, 1636, 906, -161, -1461, -752, 1535, 1685, -86, -57, 780, -438, -1392, 581, 2024, 125, -2210, -1880, -494, 619, 1511, 991, -925, -1181, 676, 1064, -190, -141, 535, -682, -1912, -355, 1641, 1469, 323, -362, -924, -636, 1056, 1535, -579, -1967, -613, 485, -98, 107, 1099, 495, -1060, -1072, 28, 563, 823, 393, -1009, -1392, 553, 2041, 780, -663, -294, 1, -736, -534, 622, 493, -438, -677, -311, -40, 879, 1459, 74, -1647, -958, 813, 822, 9, -46, 66, -321, -270, 407, 522, 115, -41, -680, -1267, -277, 1451, 1042, -769, -969, 236, 576, 227, 255, 115, -529, -628, 6, 178, 314, 674, 273, -957, -831, 554, 1126, 139, -688, -549, -185, 134, 641]
721F41j99o23q9K87l65K6R26K53j297p87J059R76j78n67l79k24J87O03J04l98
741d4M3J62m08k70Q38O76p08j027O0N56M03K45k78o70j50P26K84m13PL73m60o38
763f93L53Q96J23o40n53k6L83O05R5p29l43L58K51j57J59M13k29o14j33N16L80
784D15l3l01n38j57N53O62k93n36K8K32o0r1L81J78l95m37j6L35M94J61o41n21
806e80J66P42K8l29j21J29k38q5L07K96j25j51l02j11L45O11k10n81k59L51L20
827B03l4n8j50j4m6J3N8K37R3k18m91M5O18L09l52m51k5K42O7M6j0p9j18o0N4
852a21R5L49M7l79m04J82M44R1k35k64l3J04J79j1K3l6J2j64j16K73L32j03m55
875a90j50L15K45K0j97k28M4J13Q2n1Q6N0k02j81J41K32J37j39l20r6K51J39Q5
$$ y = [641, 442, -181, -270, 17, -348, -322, 604, 857, -440, -1227, -168, 808, 630, 63, -316, -540, -353, 250, 354, -44, -1, 161, -247, -517, 321, 997, 289, -738, -678, -122, 281, 526, 248, -422, -572, 154, 438, 25, 32, 405, -55, -693, -340, 556, 679, 39, -514, -540, -157, 448, 543, -186, -529, -171, 80, -77, 82, 495, 266, -348, -481, 35, 415, 382, 81, -457, -614, -61, 601, 308, -228, -200, 32, -28, -119, 262, 440, 45, -392, -408, -73, 421, 582, -59, -580, -414, 328, 356, 27, -94, 35, -203, -288, 19, 315, 190, 39, -263, -374, -29, 582, 372, -209, -468, -117, 203, 169, 111, -39, -53, -99, -86, -28, 209, 302, 84, -407, -362, 256, 565, 213, -238, -263, -21, 46, 92, 82, 3, -115, -175, -121, -26, 323, 370, -9, -413, -231, 213, 304, 69, -195, -228, -124, 55, 44, 67, 31, 43, -121, -237, 36, 368, 265, -190, -340, -25, 220, 240, 43, -185, -141, -28, 54, 3, 89, 139, -63, -244, -103, 129, 266, 127, -193, -289, -38, 101, 186]
898A86k15q5P8R1m9L8R8k5k24j53R5K62J60j35l61J13K05M3n6r4m4P0m1M0K9J50
924A76n0k49q8J52K07k8j65j82J20J57L8n8mr1P3J9j12J84O6j16k42r5L09J62
948A83o3j85o5M4J23J0p0J3K2k3kl0J80M7k16j32R5J38O5K5j68o2QR1J3j3qk8
976ho2q8J38J64o4q0j63M8J34J44p6k08L0J05pk0N5L3r1q5J2J20N7k9q5r5M4J50
1004G3O7j33m4L6LQp0J03J1r3k8L6J9J51q2j50k5J02J74j09j02M7J8J4l5K3oJ6
1032B4p5p3J17PJ55j13j02N2L7Q2r4P5p6m0M2p9M6O8k3r5n8M4J97n1j41J2M2N0
1060C0k7J6j0m8J2K1l8P6OK2j19o2J78J4r1p1N5LN1N4jj10L6L1p3K1J29j4j12
1089b1j1O8K6m4N2p5j11P2J19n5K4n2K4j8j03P1J03o1on3nR1l9J5k3m7P4JkKN
$$ y = [186, -29, -114, -36, 55, 6, 44, 142, 117, -107, -260, -165, 97, 257, 122, -239, -126, 79, 122, 66, -28, -72, -2, -43, -3, 26, 176, 126, -123, -211, -59, 148, 120, -45, -227, -107, 50, 88, 30, 26, -65, 8, 27, -85, 99, 165, 49, -193, -288, 21, 183, 120, -65, -130, -86, 37, 47, -23, -10, 12, -11, -13, -43, 137, 184, -32, -164, -69, 69, 134, 159, -9, -71, -63, 28, 41, 28, 20, -8, -70, -158, -20, 144, 80, 0, -163, -115, 19, 163, 87, -121, -91, 14, 7, -13, 42, 75, -16, -101, -89, 31, 88, 59, -26, -121, -77, 73, 140, 7, -37, -1, 2, 10, -60, 43, 54, -39, -67, -31, -12, 139, 57, -93, -118, -16, 158, 49, -53, -6, 12, 26, -9, 14, 8, 24, -51, -124, -7, 0, 155, 42, -60, -8, 29, 111, 17, 92, 16, -24, 18, -61, -15, 53, 30, -65, -123, -79, 118, 67, -74, -62, -20, 30, 3, 19, 9, -39, -27, -6, -44, 32, 38, 60, -59, -121, 57, 71, -20, -91, -36, -33, 18, 72, 71, -39, -3, 28, -45, -24, 105, 91, -21, -32, 36, 62, 18, 70, -5, -116, -44, 75, 20, 44, -8, 16, -2, -105, -34, 69, 8, 2, -51, -56, 35, -4, 11, -12, -59, 15, 16, 14, 16, 21]
1120B1op0N3J3N2l8J8p7j3Q2jj1j28J25k2K8q0P6J5k6p1M3L8n7J19j18pJ8L5R
1150B0l1k6M1jLk1koK9jn1J8R4p1m5M9M5k7n1O9n5J9Qk5N4r4O0%j4rK0M5l6J5
1184B3po0O7k3kn0N0k7L2n6N3NOj6Lj4jM5J2j1l0L8l9LlJ2N9o9KL8k4l9N8n9n0
1219g4P5m1L0L8l0pJ2Ol0L9m3J7M1p0N1l3P9j12R6o3L4j4M4k6J7nl8J6M5j17K5
1250c8J6j0O0k1Jl4oK4jl8N8PJ7n5p6P1O1j5j2k2n6J7J04m9j4k1L7L4n5Q9j01
1281b8J9K6l7P4k8k3pk8LL8Jl2M0Ln2O9k5J4l0L%k2L9RJ1k2p4K6L6nL9Mk9k2q6
1316i6J19J3l2Pj8J0J2mK7k3l9P6n7M5n6L5m1L4n0K9K2jl9j3N2l6P1l0J8k0j3
1347BjK4n0J6j0k3QmRK9Rk7m0J08Rm2j7m2L6Pj5K0L6l7K6l8lK7n3N4oj5N6k8l4
$$ y = [21, 15, -55, -2, 11, 63, 25, 43, -34, -47, 35, 34, 23, -105, 20, -2, 26, -54, 22, 37, 11, -60, -17, 21, -36, 83, -35, -42, -24, 11, 20, -11, -37, 4, 3, 6, -15, -17, -23, 6, 5, -46, -28, 66, -5, -50, -1, 44, 17, -34, 35, -20, -1, 7, -18, 36, -58, 2, 2, -12, -21, -1, 44, 8, 23, 16, -44, 23, 0, -2, -52, -2, -29, 3, -53, 0, 5, 11, -5, -2, -16, -17, 28, 40, 29, -1, 37, -2, 1, -2, 10, 69, 0, 2, 40, 16, -23, 35, -24, -74, 1, -40, -10, 28, -2, -9, 3, 9, -21, 18, -25, -8, 33, -37, 14, -19, 60, -52, 44, -19, 15, 1, 45, 19, 36, 31, -7, 9, 54, -63, -38, -22, -32, 28, 7, 8, -26, -32, -8, -9, -47, 11, 18, 35, -20, -96, -25, 36, 21, 9, -13, -69, -52, 52, 3, -11, -32, 5, 39, -16, 73, -28, -9, 17, -20, 54, 26, 3, -4, -32, -29, 9, 10, -22, 18, 21, -31, 38, 13, 27, -3, 0, 0, -22, 17, 26, 37, 15, -59, -33, 3, -2, 37, 41, 12, -10, -96, 23, 36, 4, 11, -7, 3, 15, 11, 38, 15, -24, 52, -5, 40, -16, 19, -22, 12, -38, -9, 13, 12, -27, -40, 12, -24, 47, 17, 35, 15, 2, 1, 25, -25, -9, -19, -42, -34, -38, -29, 0, 9, -18, -58, 50, 59, 17, 0, -42, -6, 1, -14, 6, 42, 5, 31, -7, -10, 17, -36, 18, 12, -3, 53, 25, -9]
1382ij6L0Lnn9R0m0l3n6J19l6O2k9p0J6o0J25k8k5N2m6Mk3O9o0K9m9OKQ7m3L0
1414C7p4K7rjK4j5L6%j4M5k4o9Q7n2j5K4Mk3P3p1J3oJ0k2N7n2k8j1N2M2j7j8l
1447GM1j35J02K1k5rQPm3J02J2r7MN8j04O0lkJ5j8J8J2j0m6k1N9n9N8n5K7Jm1
1479e6O6k9K8jj8j8O9m6N0p9J6K5KJ2pl4L7k1l0K0Qk0O3n8J9k3QN4q4R0l9j8L3
1512A9l5N1p7KP3j7l7L3%j5j0L3j8J4j6k6M3k6J2K2rk3K8k8NN0n5J5M1p0M6j6
1544InK4nn2%O2j1K4n9J2l7L3k0L6lj2j6QM0j6Mmj3J4n9M8J0n3J7L5M2m6l3P0
1578D4l3j4K7J0m3L9n9M1nK5k4j3J9p3M2n5M6L3K1n3j0N9o7M9l6PO1p4k2N8j3
1609a3j3QjK0jj0J0k0K6K6q2MP6j3J3j4Nj8K0j3K0m2Qj5M9q2J13r0P5n7O2r9O4
$$ y = [-9, -25, 5, 8, 3, -56, 34, -6, -39, -95, 24, -12, 50, 21, -49, -33, -93, 32, 4, -21, 31, -15, -11, -34, 35, -25, 4, -45, -39, -37, 50, 7, 37, -37, -10, -19, -20, 4, -11, 25, 25, 11, 56, 32, -37, 50, -2, -17, 7, 11, -12, 61, -10, 3, -3, 7, -15, 42, -10, -38, -49, 3, 45, 28, 10, 7, 48, -87, 15, 36, 11, 2, 10, 17, -26, 76, 88, -9, -5, 53, -51, 9, 6, 4, 19, 1, 19, 31, 21, -25, -46, 13, -46, 12, -43, -16, -15, -56, 10, -19, 9, 8, -10, -28, 41, -5, 45, -34, -18, 7, 9, 21, 14, -20, 17, -4, -34, -14, -6, -26, 37, -21, -2, -25, -17, 37, -47, 43, 4, -14, 19, -16, 35, -42, -40, 33, 16, -21, 12, 12, -3, -13, 20, 2, 16, 0, -26, 17, -9, 3, 25, 16, -7, 21, -7, -2, 48, -7, 8, 49, -21, 25, 9, 4, 28, 23, -29, -29, 33, 22, 46, -13, -1, -38, -5, -25, 11, 8, -4, -20, -12, 28, 12, 16, 12, -1, 13, -46, 2, 12, -41, -24, 11, 53, 7, -26, 44, 11, -3, 24, 34, -9, 30, -29, 12, 7, 32, 8, -5, 14, -59, -17, -72, -26, 7, 28, -25, -35, 24, -43, 6, -30, -23, 38, -36, -58, 0, -13, -26, -18, -19, 1, 0, -10, 0, -20, 6, 32, -50, -46, 30, 17, 30, 16, 21, 3, 23, 10, 30, -12, -4, -19, 30, -52, 61, -29, 46, -11, 51, -48, 16]
1642A6n7L3pM1l5K8m8j4P0ml8l8O3J0q0J7J9M0Qm3J8l3P4o6N7j0J6o2K3J7L6j3
1674C8j4Om0M4J5j9o7JK7L2p0Q2n3PJ3N1j01J3O3l5jl5K2k3J0J2k5N1k6j5O1%
1706B4J1l9K0j6J2k4j1L7k9NpJ7K2p5Q5m1J6j3olk1L1Ln6O4%q1P2K7K7o3O5o4
1739a1%L5M1j14N2J3j2K7j7k7L1qn9P4n5J3N2k3Pk6RJ6JJ3m5j9L1Mj1Ll1K6j1
1772b1l4L6K7m6J2N1k8J0rPrj8j0P3%j2qjMk0mM3j7o5M9l8J4O4n2Pl4K7M1J0r0
1807d1J4n5Q8n2M4K5n7j0J2O5k6rkn2N0j0K2J2q6M6Q7r6L7M7l8oO2n7j9J9QNn8
1840c1n6Q1N8n3M7o4K4J9j02O8NK8q1MO2J5%l7K5l8L6k4O1j3nn8MJ2K1j5L6o3
1872c4L8j0l6R2q4R1q2K2L6o9M4k3J8Rl3K3J3k6L9j16P2m0k1R8k0j0o3L8N3ML2
$$ y = [16, -41, -8, -15, 26, -9, 19, -29, -43, 27, 23, -15, -53, 10, 20, -60, -43, -24, 16, 24, -19, -1, -34, 40, -26, 31, 21, 37, -25, -2, 15, 51, 38, 24, 30, -10, 34, 49, 30, -37, -36, -9, 23, -47, 35, -18, -11, 2, 53, -48, -35, 28, -7, -8, -43, -21, -44, -34, -22, -47, 4, -22, -37, 24, 24, 35, -4, 16, 0, 12, -12, -23, 14, -15, -10, -17, 0, 22, -53, 32, -9, 7, -6, -12, -15, -36, -5, -2, -58, 6, 6, -75, -3, 24, 51, -12, 53, -11, -11, 24, 65, -49, 3, 16, 4, 31, 14, -13, 18, 10, -49, 25, -30, -17, 35, 12, 19, -7, 2, 18, 19, 32, -13, -32, -1, 3, -8, -5, -36, -10, -21, -55, -19, 8, -38, -26, 25, -3, 7, -2, 5, -4, -22, -32, 41, 41, 29, 21, 20, 24, 4, 0, 43, 26, -39, 10, -28, -14, 50, -2, 5, -29, -2, 39, 49, -41, -27, -82, 6, -46, -2, 23, -34, -44, -32, 33, 7, -2, -4, -56, -6, -16, 6, 18, -68, -22, 65, -31, 6, 53, 15, 9, 71, 14, -5, 14, 22, 27, -31, -87, -6, 52, -1, 46, -18, 6, 25, -77, -9, -4, 24, -57, -53, 9, 24, 24, -13, 12, -26, 10, -14, 47, 34, 29, -29, -25, -13, 8, -7, 29, -34, 4, -6, -42, 50, -34, 57, -25, -3, 33, -36, 8, -15, 3, 12, -21, 2, 15, -11, 28, -88, -16, -56, -77, 21, 1, -9, -72, -34, 19, 23, 55]
1903E5o6JJOQqk7L2j2j5N9J6l1q0K5K3K1j2M7m3Ml8J9K9K0j5m5j5L5J3j2rmO8
1937E0m3kj2J6k3k0K3ON3n5L9m9L3K6n4j6K1K9j0j8k8N0kn6J5PN3m7PN9o9l7Q0
1970B6l3%O1m9j1K5m5k3M8n7N2j6KJJ5k3lJ5L1j1l1O6l8L8qj3k0O9p6k2M8k8Q2
2003G2p0L9Kj2m4N5m1J5m0J5L5p9N7L4m7mkRMj8L2qj6OM9L3p4K1k5mM6m0l4K5
2037iPk7jM9j9K8J4n6k6L2M9o0N0m8K3j1Jq%P3m6j1j4rpK8N1m9m4L1J2j4K2pn8
2072e4P8k4mk5K8K0j7r7R7J6Kl1N2Kl8o1L8M3o5ML5k6mL4Om4J0MK1LK7Lq0J0M4
2107Go0J7N4m9LM5j0J3J7k6K2l6k0J4l1O7N0p9o8Q5L8m3l7J9k4j4L6L6m6K4l1
2138b7K0N8n9L7m7L8p3M5l6N5k2j9m5M5N0lk4k7%l0P6j9j4O1l3j2M7m3J3k6lO
$$ y = [55, -11, -10, -9, -3, 5, -3, -30, 2, -10, -25, 34, 50, 19, -61, -36, -13, 8, -4, 43, 0, 4, -34, -15, 14, 34, 19, -26, -41, -6, 7, -5, -14, -18, 50, 7, 5, -7, 9, -14, -34, -11, -5, 48, -7, 32, -17, 16, 42, -12, -28, -7, 22, 12, -6, -34, 16, 14, -42, -27, -20, 33, -14, -7, 52, -17, -54, 26, -7, -7, 54, 5, -6, 19, -26, -49, -1, -58, -6, -22, -20, -19, -4, -27, -30, -15, 16, 5, -26, 40, 2, 40, 32, 19, -1, 68, -8, -30, 18, -10, 72, 2, 41, 43, 31, -13, 42, 1, 16, -24, -9, 26, -53, 4, 38, -9, -13, -15, -6, -2, -20, 12, 4, -12, -6, 43, 76, 2, 23, -2, -6, 40, 0, -34, -9, -2, -29, -30, 19, 0, 28, 42, -14, -40, -8, 41, -19, 31, -17, 6, -5, -4, -12, -12, 61, 15, 4, -10, -19, -26, 2, 53, 4, -40, -9, 3, -11, 11, 4, -54, 24, 0, -4, -29, -1, 19, 2, -95, 2, 18, 20, -11, 41, 43, 5, -56, -18, 25, -40, -36, -1, -27, -31, 3, 9, -35, -25, -21, 0, 3, 30, 33, -47, -37, 7, -53, -36, 18, -31, -28, 17, 7, 20, 37, 11, 33, -3, -23, -9, -40, 27, 77, -2, -70, 15, 53, 10, -27, -8, -32, -46, -10, 26, -20, 4, -27, -7, 51, -8, 29, -18, 20, -53, -8, -44, 11, -11, -30, -75, -30, 20, 17, -7, -34, -34, -64, 12, -7, -21, 40, 7, -5, 42, -1, 12, -14, -17, -11]
2170a1K6L0l4l3P6l5j7K9qm8pN0lJ0n5N6m4k2N8l6L4n2L7J0qJ3J1j4j2o8Q1k6
2202a2K6j5J7k2L8j3j6PJ3J2j3k3lL7q3Q4m7k6J5K3j3L4L1l4j4l1j7L2k0L7oL0
2234B8o2J9J4qj1K6l2M5K2j9okk1L7m0K8OJkn7M6Pj1l5J4j9J8M0j7J8p6oO1J2
2268A8k7j4J9Kl1J1Lm1Q2j9K5lj3l3kJ7k6l5J21n3L5k1j1k7J6N5p6P7j9l2K5o
2300A7Jk5l1M4o6P2l0K2m2M6J5qmp6L3jO6m4m0QM5k0k5O9jk6M0j8j2j6k8MJ2j3
2334c2K2J9l4%L4j0N3jk2mJ2k9j5lOl7P3k2l4JK0L6l5nM2j6m4KK4J1nQm9L4lk3
2370b6N1k2M3m6l5J7QP4l1n8N3l3O1J3n3k4PJ4Ko9M1P1k6m4K0m8J1JJJ2l2J10
2402F3n2J2l6k1K9J2j1M5p3K1J2l5P0l3%j0N5j1q6L9M4n9oJ6rN4m2Qj7M4m2J0
$$ y = [-11, 15, 45, 11, -22, 54, 19, 2, 31, 23, -25, -32, 18, 15, 25, -30, 26, -18, -40, 18, -18, 16, -36, 1, 11, 3, 16, 27, 13, 1, -67, 14, -12, 14, -1, 16, -6, 32, 19, 3, 10, 23, 35, 22, -1, -4, 33, -50, 34, -13, -39, -24, -1, -14, 20, 51, 17, 3, -28, -45, -13, -33, 4, -2, 28, -34, -15, -1, -9, -20, 6, -26, 19, 41, 22, 16, 14, -7, 30, -10, 18, 24, 25, 23, -34, 12, 19, 8, -27, -13, -32, -14, 26, 9, 27, -49, -55, 6, 18, -9, -23, -4, -2, -33, -22, -19, -60, 22, 3, 28, 25, 12, -21, -23, -6, -32, -67, 54, 1, 36, 15, 4, -23, -7, 48, -28, 49, 30, -2, 23, 17, 18, -7, -38, 6, -60, 12, -18, 4, -38, 8, 23, 15, 11, -65, -32, -33, 33, -11, -51, -43, 2, -18, -43, 26, 25, -1, 39, 21, 9, -7, -35, -31, -19, -32, -10, 9, -25, -25, 9, -1, 52, 51, 29, 25, 37, 8, -7, -10, -4, -41, 32, 10, -24, -23, -3, 33, -2, -7, 35, 19, -25, -23, 1, 12, 7, 15, -34, 0, -3, -26, 25, 3, 46, 0, -35, -18, -10, 64, 33, -25, 28, -5, 56, 69, 16, -8, -1, 13, 15, -54, -13, 58, 32, -12, 8, -40, -29, -28, -27, -15, -47, 63, 11, 23, -13, -34, -5, 7, -4, 41, -32, -11, 1, -34, 36, 3, 3, -7, 48, 37, -49, -10, 34, -25, -31, -15, -24, 30, -12, -4, -21, 23, -19, -9]
2434ij3k1M3nj2Mk9Q3m3J3m7O5l6M2P0r3J2jJ7J9m1n4kO2k6m4M9L4j8L8o1K4n7
2467c7M7l7Nj8L5rN5Kp3J2n1L2L1qk4mO8m5K7M5q2oJ8J1N8n7MlLk4J9J8k7LK6
2502A4k2j4P1m4k9J4J3K1n9RJ9JL5L4q9RqP7m4lr7Q7L3n2M3m8N7o1M4M6n9j0K4
2535A2j0PLl2%Qj3%O5l2l1L6j0%k3L1n1L3J2noPj0J4K5n2K9k0krN2m3j8nK8J0
2571@P7o5J8k3J5j8Lj2N1mn8Mk5NJ0M0K1k3p0N0m0Q5jk8l4l0P3J4m6lJ5OJ5l2
2605a0j8j6K9jJ2j1Nl2nO6j9J0pm8N4%l5m1R1l4L6ml2L3j4l1oN6j2j9LL1n1k7
2639d7K6N4q5jK2N3ol5J0l0L6m8L2QJ6k9RlKM0l1N6m3K0k8J7j00P0K7J5prK2j6
2673A7J8m2L1l7j0L2n0N3J0l7L1m6L0K1on6J9pN0pn2J7RL4j4QL3pmj7K8o0lkk9
$$ y = [-9, -22, -43, 0, -5, -17, -13, -42, 41, -2, 11, -36, 29, -7, 35, 105, 12, 24, 23, 40, 59, 18, -36, -38, 24, -2, -46, 3, 37, 19, 57, -4, 20, -37, 10, -27, -22, -40, -5, -14, 41, 43, -30, -18, -69, -37, -6, -14, -38, -42, 26, -19, 8, 53, -29, -35, -17, -6, 52, -5, -1, -4, -1, -25, -6, 12, -15, -12, 14, -8, -22, 49, 5, -24, -10, 3, 24, -35, -26, -7, -6, 29, 63, -26, -17, -25, 52, 8, 5, -92, -5, 28, -24, 19, -29, 28, -33, 11, 57, -2, -12, 12, 2, 9, 12, -20, -20, -12, -25, -25, 40, 8, -23, 13, 3, 3, -20, 11, -40, -7, 5, 0, -6, 1, -9, 5, 30, -22, 7, -13, -15, -24, 28, -15, -33, -38, -10, 0, 77, 12, 30, 7, 22, 4, 7, -5, 46, 42, -16, -12, -37, -32, -22, 18, 39, 16, -54, -4, -44, 41, 40, 12, -22, -52, 21, 35, -11, -14, 1, 7, 22, -10, -28, -44, -15, -16, -4, -15, -10, -42, -47, 19, 0, 10, 3, -45, 9, 9, -26, -67, 24, -10, 26, 22, -10, 23, 9, -22, -28, 28, 16, -3, 0, 31, -20, -47, -21, 33, -52, -53, -31, 22, 16, -19, -9, -39, -3, -51, -19, -11, 5, -24, -15, -18, -16, 24, -7, 49, 6, 26, -2, 15, -85, -15, 12, 27, 20, 11, 33, 17, 35, -7, 24, -13, -23, 9, -41, 12, 22, -15, 16, -30, 0, 21, 15, -41, -22, -29, 21, 14, -38, -21, -12, 22, 8, 16, 49, 42, 38, 21, 49, -11, -14, -16, -45]
2708d5N6M7j00M8J5%nk1L7jm2L6Jq0P6n1M7m0mK5J4k2J2Rj2M8n0k6NL9j5k9P4
2741D6n6L3n6JN2l8N2j2J9mm0PP7m2Mm3K6rkk7J2OJ2q5L7J9%J1NNPk0K5l2l4K3
2777b1K4k6K6j3qO6r2M8Jl1L5k5L9K5r6LL6L6Kj3p0N7m5L6%J7n6J0J0J7K8L8n8
2810@j8J6l3K3KpL3m7Q6q0L1J1n8O2l9M2l9Pj4J5j8M4L0l9j0M4m5k0L9k4m4J0
2842d0j8N7J9k4J0Rm0QrL9QJ0j4n3O5m2L8o3L0k6K1N4n1K1l4L1J6J9n3M8lk6j4
2875gj3N4o3J1j4L5j6L6K3q1P4j6o2K9K2Rk8M0p0P7ol2L5m4m6K4PN9l7j4L1o7
2907e0N4j8M1J4j02QK3N7o5P4j4kl6K9rnL7l4l3OK9q7N7M1j9n0M8rQj8L9pl1M6
2941B2m6O7j2K6p5NOM6k0J0n0L0K4j5nk2J1Km2M7o1J28q4M1J4m3M0j01J1K1L2
$$ y = [-45, 11, 58, -42, 6, 21, 21, 16, -5, 32, 31, -11, 25, 26, -54, 22, -29, 18, -22, -26, -1, 13, -9, 3, 12, 0, 48, -2, -28, -23, 16, 1, -28, 46, -10, 23, -33, -32, 20, -18, 34, 22, 41, 37, -3, 4, 81, 39, 43, 0, 26, 17, 15, -12, 0, 6, 18, -67, -30, -11, -11, 0, 5, 10, 17, -3, 22, -10, -44, -21, 3, -23, 3, -10, -18, 48, -44, 4, 5, -26, 9, -16, 23, 48, -48, -45, -9, 27, 29, 16, -54, 3, -42, -6, -6, 11, -45, -35, -25, -8, 20, 58, 0, -18, -2, -35, -12, -10, -17, 16, -31, 55, -25, 6, 17, -41, 21, -18, 24, -15, -8, -22, -7, -25, 19, 49, 10, 0, 44, -1, -21, 18, -6, -50, -40, -58, -1, 18, -6, 4, 13, -27, -19, -28, 11, 19, 29, 15, -38, 27, -15, 23, -40, -10, -36, -15, 39, -12, 9, -25, 6, 22, 41, -12, 36, 33, 7, -7, -20, 34, -29, -18, -32, 3, -13, 23, 46, -35, 39, 23, -39, -10, 12, 21, -7, 33, -37, 40, 34, 2, 37, -7, -53, -29, -22, 37, 0, -14, 17, -50, 4, -14, 27, 41, -61, -53, -30, 27, -38, 36, 22, 20, -16, 13, 4, -1, 36, 2, -31, -25, 4, -83, -26, 15, -4, -54, -6, -15, -7, -25, 14, 7, -24, 22, -24, 43, 31, 57, -18, -13, -7, 39, 19, 29, -21, 9, 33, 18, 13, -9, 2, 4, -38, 9, -52, 76, -8, 33, 47, 4, 44, -57, -46, -25, 7]
2972GMl4L9l6M1K4l6q9L9J5J6N0m2j1k7J8j3j1K3M0k9k4oO1l3K5l4Oo8O0j7N3
3004A1Kj3L5Jm8J7Ol1l4N4Kj4k1K2l6O2j0n4L5K1o1N9L3n8LN1q0L5M3l1rL1p1
3037d8L0j4jJ7nO7Qp2K0j6J6L6ppm9pR3r7L4K4k6kj6JP1o4K1%m2mM2Nj3L0m5N0
3073C0j3k9j3M7Mm0L1j8mKJ8kLo3R6j2n2rK0L1l6oJ6nK6L5j5k7n9k5P8K1l9nO6
3108E2j08K8M2J8r9M8L6Nk8J2k0Pjj3P2k7On5N3m9J5k3J9L3k7NNo9OK7RlJ0j6
3142c0JjK1qL6k5j1K2K0k5npj2N4J2l6j6%l0K4k7L7Mj6M3lj8K4lk2m5K0LK1j3
3177a1L9Nk6k7j0PJ9L3p6P4k4m6N1l7N2J1q1J7l7Q8o1OJ3M9l6KJ8j9pQ0n0n4L0
3210hm6O7p0J6Q1n3Qok2O0p4M1L3p1mL7MrO5o2L4q3J08n7K4j5L5n2J7L0o3O4j3
$$ y = [7, 11, -23, 16, -20, 21, 45, 9, -80, -41, -26, -10, 40, -2, -13, -40, -22, -35, -46, -23, 17, -12, -36, -42, 19, -14, 11, -23, -17, -85, -25, -42, 11, 13, 0, 35, 36, -12, 5, 11, -20, -54, 0, 2, -12, -33, -11, -47, 15, 5, -49, -14, 7, -54, 5, 38, -20, -17, 34, -46, -11, 32, 1, -8, 23, -48, -18, -32, -33, -16, -21, 46, 54, -18, 2, -14, 2, 38, 31, 24, -25, -32, 61, -36, -2, 22, -4, -6, -22, -21, 50, -14, 7, 7, -35, -39, 3, 8, -5, 25, -20, 30, 17, -12, -25, 22, 26, -14, 17, -1, -5, -3, 15, 13, 16, -47, 49, 37, -15, -24, -4, 27, -9, -15, 1, -4, 22, 57, 42, 15, -44, -69, 9, 30, -9, -14, 52, -56, -28, 14, 32, -67, -19, 17, 22, -6, 6, -14, -7, -8, -21, 51, 24, 30, -25, 28, -21, -6, -29, -10, 23, -4, 1, 6, -63, -57, -30, -21, -24, -14, -30, -29, -30, -9, -17, 19, -6, -17, 5, 25, 0, -5, -12, -24, 30, 42, 6, -10, -10, -40, -16, -43, -6, -2, -18, 25, 22, 4, 28, 25, 3, -42, -22, -19, 2, -11, 28, 33, 7, -20, -30, -23, -4, 29, -47, 27, 3, -43, 8, -29, 23, 34, -47, -30, -67, 21, -40, -34, -21, 28, -8, -6, 12, -7, -14, 66, 16, -38, -8, -54, 13, -57, -41, 40, -13, -5, -11, -33, 27, -47, -6, 27, -44, -48, -11, -7, -16, 49, -13, 21, -62, 46, -11, 13, -2, 33, -19, -2, 28, -35, 29, 16]
3243A6m1N6m6N9o2LL6j6JrRkm1J0O1kp0M8L6p5N2J4m3J9j7j4k0N4m2J4k0J8M9
3276C5n1M5l6M3qL3o8kj0n1J03k8m6M3J8p4K0Q1K0o3K6J2k5J6j3K6m0k4j8pL9
3307dm5J6J12j09N0m3o8J12J2j6l1j8k7M2O5r5O8j2pQ3m7m5J4j4K2pk5P0q0L4
3337Glj3mN5m8L3o9%L5OJnJ4k0NL3ppnl6K8m2J8L9l3J8K2o3L6j2k3K2M5n5L0l
3373aj4O5m9k7K4K6Jm4J0k4P7j01P2n3Q1r6P3m6M0no8J8L1l5NJ4J1L0J8J6n4k3
3405b8J8Pj2qpj5N0K6j4J4Ml2K0j9k1J5K9pk9L7J0k3m9P0j01P0Kj9k6M5l0L6j9
3438fj7J3mM1l0j1%K3m5J9K9l5K8kk8j6N8J6o5K3kJ1J5m%l2N5m1J1lJ6k6j9J4
3472a4M9p9R0J5r7qK5J5%pJ1m4O2j9Oj4J0J3%j9J4nn2L1K9j2L6l1m6N7%m6O3l9
$$ y = [16, -25, 31, -15, 44, -18, -15, 21, 5, 6, -3, 6, 4, -37, -27, 34, 32, -38, 10, 46, -29, 23, 37, -6, 13, -4, -18, -38, 16, -26, -12, -32, -14, 35, -16, 29, -7, 36, 28, 61, -7, -9, -19, -70, 33, 5, -41, 2, 20, -54, -34, 47, 67, 4, 30, 42, 17, 33, 20, 46, 6, -18, -36, -43, -4, -49, -33, 79, -30, 20, -23, -91, 21, 33, 17, -14, -32, -59, -17, 48, -47, 21, 9, 2, 85, 38, -7, 7, -7, 15, 8, -17, 53, -27, 7, 4, -9, -13, 42, -6, 27, -42, -42, -7, -1, 0, -5, 9, -11, -6, 27, 20, 13, 8, -28, 0, -42, -24, 15, -18, 0, 22, -41, -5, -17, -40, -18, 27, -28, 2, -1, -15, 50, 1, -26, -2, 24, 25, -19, -9, -33, 44, -57, 15, -38, 43, -53, 20, -26, 14, 9, -59, -41, -10, -45, -40, -26, -15, 15, 33, 49, -5, -28, -10, -3, -15, -23, -30, -45, 5, 31, 17, 31, 35, 3, 23, 4, -17, -2, 27, 20, -9, 28, 38, 15, -34, 36, -65, 5, 7, -12, -38, 7, -23, 13, -6, -23, -10, -14, 27, -3, -14, -14, 9, -36, -17, 12, -23, 5, 3, -25, -41, 17, 33, -32, -9, -11, 0, 15, 11, 11, -21, 34, -7, 4, 1, 17, -9, -28, -14, 35, -44, 46, 61, -36, -44, -19, -4, -4, -11, 0, -44, 18, -1, 5, -9, 1, 14, 14, -5, 9, 4, -48, -17, 12, 0, 36, 5, -41, 16, 16, -30, 33, -6]
3506fJ8l6L4MJj9K7j0o2N8l5M1l5K1m6JR7o9j0kNK8M2p1M6l5Jn5Q2m5P4j5q5N9
3540CL4m3N1k0k3K4l9k6N0Nk6J4o2Q6M7p4NMk2KoK1m8NL1j9j1k8J3O9k0JO6m8
3574A6l5l4O1n5N7ml3Q5q2J7J9K0p1N1KJ4k1mL2l9nQ3q7j5O3l5l7JJ6k4R1r1O3
3607A9jk7k0K1P7p2Ql7LN5J3m1ooj0jL2KoJ8l3K9l8ML5OJ1j2jl8Qn1RN6l7nJK8
3645gN2p3Rk8L7l5L2j6QL4k4K8j7l8K2llJ6J1j3Kj5L0k1KO6k3q5P4M1l6Rk6j0
3679@k4j7k1N3qj4L6m2MRO9n7L0%m4L8m1M1On9O4K5n3M6n3k5O6L1o8jl0L7j9K9
3713Hj8j5RN0j8l1L8n2K8nJ7lKk7Qp1Q0j5k5j1L2L0l4k0L4j8L2kpLk7L5N0m9k
3748Fq8Q1M4n7M1Km4k5L9j3K1M8l0l7l4M8pp3P6l3J3L4ol2N1o7J2L9J8kj05R8
$$ y = [-6, 12, -24, 10, 14, 15, -4, 23, 13, -49, 9, -26, 15, -20, 1, -45, -44, 53, -16, -26, -28, -23, 5, 47, -24, 22, -13, -12, -67, 15, -30, 44, 29, -56, 3, 37, -6, 45, 25, 2, 26, -13, -39, 11, 16, -10, 4, -58, 28, 75, 1, 6, 10, -12, -10, -16, 5, -43, -38, -7, -26, -37, -65, -52, 17, -3, -2, 64, 16, -19, -53, 8, -47, 10, 6, -27, 58, -24, -7, 12, 32, -39, 12, 14, 28, 7, 3, 35, -4, -9, 74, -13, -28, 35, 0, -37, -36, -20, -44, 47, -44, 19, 18, -9, -29, -8, 69, -3, 5, -32, -29, 26, 39, -2, -8, -14, -24, -25, 7, 9, 3, 21, -12, 17, -21, -17, 18, 24, 35, 23, 22, -16, -8, -59, -50, 6, -31, -36, -35, -7, 45, -28, -19, -47, -10, -45, -13, -29, -21, 13, -11, 17, 0, -38, -16, -19, -22, -6, 5, -8, -6, -21, 9, -12, -10, 56, 33, -52, 22, 63, 27, 36, 10, 0, -24, -41, -62, -9, -17, -31, 5, -37, -33, -24, 45, -12, 18, 18, -26, 12, -29, 12, 18, -41, 23, 48, -5, 41, -12, -37, 29, 60, -8, -9, -39, -2, -21, 8, -10, -25, -16, 34, 16, -15, 23, -29, -1, -6, 11, 8, 10, -17, -9, -80, 0, -15, -40, -51, -19, 11, -23, -43, -9, -27, 5, 3, -4, -1, -28, 7, 57, 8, 6, -82, -1, 43, -14, 27, 29, -15, -40, -1, -14, 7, 55, 25, -12, -46, 2, -5, -78, -2, -35, -22, 12, 6, -26, 25, -42, -30, 9, 27, 25, -80, 18]
3780A8k2lkJ3n6O1%k9M9m1L%Qj0K0m5J02o3j6rj3j7M4POJ0o7P0J6J9n1j5J5l1
3814b9J5J3RJ6m2k9L9lnk8N8l1Kk7K3M6p1P2l7N0ln9RJ4K1L1j9lnj9k4Jk9Q1j09
3849g2N7L2m9k5O6n4M2J4Qk8j6n0J3N8k0j2L7J6k8M3qJ1J1n7j8P3l4j4k5K1pL4
3881A9j4J1k4M9m5j0K4ll2N9p0K4O2l9k1k1L4J3lm2L9l8P1m9K3n9P6l2K1l2N0
3912D1n5L6%j9J1k9kJ7J6k0K7j5K9oj5M3m9n7RP5oml9J6k8j4P4K0p3J4j6K0n5
3945e4J4KK7M1q2L2j1kQ1j4lj2q0L2P6l8J0m0L3Nj3j4N6p7K8J1NJ4m2N7j05J3
3977e0J02p7M0j1L1n8J5jM4n0JMK7k5M8n7J3mJ3j1j2l3P4k8K6Jj9L1n4J2p9O7
4009b0N8n9J9Rl7LM9j5k4J6k1QOM6q3J2njP6k9Qk7qML6n2K3J1K0m6j6M4l6J3J6
$$ y = [18, -4, -7, -9, 4, -52, 9, 9, -20, 29, -12, -9, -9, -1, -11, 9, -36, 66, 3, -13, -22, -35, -52, -8, -1, 5, 15, -52, 18, 34, 53, 2, -13, 2, -29, -14, -1, 8, 24, -18, -47, -8, -11, -16, -44, 14, -17, -15, -42, -19, 27, -44, 28, -9, 41, 38, -21, -12, 2, 23, 54, 35, 32, 27, 8, -16, -15, -44, 37, -72, -15, 17, -32, -57, 9, -45, -3, 11, 19, -9, -25, -75, -62, -4, -24, -36, 1, 17, -11, 32, 24, 35, 46, -11, -29, 44, 10, -4, -29, -8, -15, 19, 5, 16, -8, 41, -4, -14, 10, 7, -25, 34, -36, -12, 50, 11, -10, -31, 3, 16, 13, -29, 10, -28, 43, -6, 17, -42, 34, 2, 23, -9, 41, -14, 22, 22, 3, 14, -15, -17, 0, 16, -4, 23, 8, 37, 31, 16, 59, 10, -47, -38, 37, 31, 27, -12, 4, -24, -38, 36, 56, -17, -3, -19, 1, -54, -40, -38, -11, 30, -52, -20, -31, -33, 48, 34, 31, 19, -61, -29, 47, 9, 19, -21, 12, 17, 4, -10, 46, -31, -3, 8, 13, 27, -15, 42, -63, -50, 52, -25, 15, 4, 35, -23, -8, -9, 35, -15, -14, -10, 17, -8, 40, -17, -4, -8, 5, -6, -18, -51, 23, -5, 21, 22, 3, 34, -20, -8, -87, -20, 38, -21, -2, 7, -30, -27, 22, 7, -17, -1, -22, -14, -8, 38, -45, -33, -38, -39, 37, 8, 16, -11, -19, -15, 21, -31, -8, 3, 23, -23, -39, 5, -31, -18, -2]
4044bj2j9L2L1l0L1o3J7n8R3j6j0J6J0k5j7J3J9j9L4l5%j3J9K3j7j2l9Q5Qo7M
4076a9M7k6J4j8m7J6R4o6pk0M0nml4L4lj9L7Kp4N3p7N6k6P6J3o0L5n1qPJ3L3r2
4110h6J14J3m3P%J6%KlMjp1R2k2j0k4L0k0J9m3L6m5POO8l1j0qk7N8p0J6pO7k0
4145A4Km5L0K1o2N2j4k3J7k3j4O0m3J1J7k8K1M5l1qlN2j3pK9m6j5o2Q4k0mQm7
4178d5J7N5m7J5J6n9L7l4J6P5k5l5pK6k8J9l0J3P1l9L6m9J3k8K0N2o8L1J4m1j0
4209a9O3n4j0K4j3K8K5j1j2p1J9j0O2l4L1k2K0j6k7MK0J9pJ3rp6M4j3k8N7n5M0
4241a8OO4o8J8l%j3NJ8L3p4J7J2%K2k9k2L1j7K0M1l0l0J2L2o8N0m0O2q1N0l7O0
4274B3p7N9K6Qm4qJ1K1q9R4J7n5JM1K8j04O9m0K6m3L4l2P1p5m5N3j1Q9j11P0n
$$ y = [-2, -14, -33, -1, 30, 0, 31, -32, -15, -73, 20, 4, -6, 10, 20, -5, -22, -9, 10, -9, 25, -10, -10, -23, -4, 19, 2, -10, -49, 36, 44, -23, -19, 28, 2, 16, -2, -49, -33, 61, -5, -12, -32, 8, 3, -1, -35, -1, -4, -23, 14, 16, -58, -5, -82, -26, -52, 24, 37, -23, 12, -39, -47, -40, -27, 6, -86, 28, 41, -2, 5, 5, 21, 21, 23, 20, 24, 23, -48, 44, 22, 12, -12, 18, -2, 17, -26, 10, -35, -28, -22, 46, 15, 5, -3, -30, 28, -42, -26, -33, 34, 14, 16, -29, 1, 22, -40, 12, -2, -25, -8, -31, -45, 15, -28, -17, 0, -28, -7, 38, 7, -1, -4, 48, 35, 28, 57, 11, -4, -66, 18, -2, -6, 2, -45, -28, 27, -20, -5, 11, -48, -11, -45, -29, 46, 21, -14, -21, 5, -23, -4, -34, -21, 50, 11, 47, -2, 11, -17, 3, 55, -13, 18, 32, -9, -19, 44, -10, -20, 4, -9, 19, 44, 33, 21, -50, -31, -41, 21, -13, 18, -4, 16, 0, -27, -23, -3, 16, 9, 22, 13, -63, -19, -32, -60, -3, -58, -18, -12, 52, -16, 2, -1, -1, -14, -9, 9, 42, -32, -15, -3, -3, 19, -10, -32, -1, -18, 2, 43, 13, -17, -5, 27, -41, 9, -31, 31, -50, 0, -37, 23, -54, 5, 31, 39, -5, -13, -2, 19, -70, 24, 41, -14, -13, 28, 56, -48, 21, -19, 7, -36, -2, -34, 37, -38, -83, -30, -41, 48, -63, 7, 2]
4305Bm6N3n4N2K3j6m4L1j6J7k9%m0N5L9k2k9M8k0L8q3O3Qnln4P3l0m0K2k6M0Q
4338A5lJk6kJ1j7O5ko6N2p9M5M7k3rKnM8l7M3p1%j3LQk4P7m6n8O3oj0L8j9k0K8
4374A0L8n1PkL7k8Mmk0k6N4k4J5n3L3l5O8n3K5K1qRon2RJ3k6JM7Qj8J7o5N0J8
4409A3m0J1J6k6P2o4mL4L2m5J2K2n6PK2Nk9jN9m4QRl8J3m2jK6L4Q2n6o1R8q6K5
4443Gmj2p2J06p0K0LO7o0J4K6m1K6j0rL7n9rL9K2l1O7n6K6l7Okj9O5l4o6K9K3
4476hj7J1m4N1M8k5n8N2j3j8k5L8N6K4p7Rn6P2J0M6n2jl3M5L1o7j4K5j7J1k2K0
4508Bm2Q1j5Rl1NL4k5k2M4m1k8M1l4J6O2j9o3N8q0K4K4k0O4n4K9M3p7K4l1M1j2
4540GJ7pjm6P4Ro0L9o3J4R9q7K8o7kM2m8N6jKl8O2n7L9l2R0n2J6k7o4M9L0l4j3
$$ y = [2, -44, 9, -45, 7, 30, 14, -30, 1, -15, 2, -27, -27, -67, -12, 27, 5, -24, 24, 4, 42, -41, 22, 30, 25, 22, -32, 41, 11, -29, -7, -33, 7, 15, 12, 13, -13, -15, -4, -21, 44, 42, -24, 28, -51, -6, 41, 18, 9, 11, 6, 54, 17, 60, -11, -11, -24, -21, -13, -37, 40, -6, -64, -1, -7, -17, 21, 2, -18, 10, 48, -3, 4, 2, 39, 11, 15, 11, -9, -35, 19, -5, 10, -43, -10, -45, 23, -30, -5, 16, 8, 17, 11, -41, -32, -19, -45, -44, 3, 11, -7, 10, -55, -5, 13, -27, -16, 0, -26, 46, -18, -22, 12, 44, -1, 11, 33, -23, -16, 6, 11, -18, -19, 40, -4, 4, 13, -25, -12, -54, -55, -29, 5, 87, 31, -30, 68, -18, 7, 3, -9, -81, 25, -45, -25, -22, 45, -15, -1, 25, -16, 10, 0, -9, 28, -31, -40, -1, 21, -10, 57, 1, 27, -10, -4, -6, -25, 40, 6, -60, -31, -8, -25, -14, -58, -7, 41, 16, -42, 10, -3, -21, -46, -8, 48, 72, -5, 4, -52, 20, 30, 76, 24, 23, -10, 35, 66, -1, -15, 10, -7, 4, -18, 2, -40, 41, 26, 35, 4, 9, 43, 18, -4, 40, -1, -29, 12, -22, -6, 56, 37, -26, 32, -48, -24, 0, -20, 44, -10, 19, 62, -15, 9, -22, 19, 7, 24, 17, 16, -30, 44, 53, -7, 32, -31, -17, 82, -5, 23, -44, -46, -4, -52, 4, 3, 5, -33, 29, -28, 11, -21, 69, 17, 33, 6, -58, -9, 21, -13, -26]
4574b6L8PLn3N0j7j7ML4K3%m0j1k2M6n0MJ6K4PJ2m5J5nk7L8lkJ3l1J2n8R1k1J4
4609B3J0n6mK4J1k8J8M0m6L1k1p2J14J9m3l2K3k4j9J9k3K2l2K0N7mr0N0J2J2k1
4640a0pM5K3p6K3J3nj2j2J1j2j0RK8mJ5r0O8%M9j5ppJJ8J6j03O1l7P2k7kl2J7
4674AjL1j5rk9P0n6l7J6M5jm8J3M4k8j5O2n8J6J8qj1l0J3l7J20m2m9N7m6K5Mq
4707GRk5K3j6qO1q4N8n1K4lK8j6nl6N6L4p6J3K2J2n0P3k6o0N8k1K7n5o1J02j1
4739ClL2k3J3L3Qn9m4N7jl9N0j3L7J2k4J3m9J2K3j8p4J10r4J9j1M1k3J1J9k9L6
4771B5k1j9K4k9P4p1j7K8nn0M2pJ7K6K8j5n1N7m9j1lL3k8M1%l8M5k9L3n1J6k9
4803c4Q4j4o7l0J24o9p4J00n2R2j48O7j7J7nN1%Jl8k1J9K8kj5K3J1j0n2L0k4L7
$$ y = [-26, 12, 19, 22, -31, 19, 2, -15, -11, 23, 46, 46, 6, -5, -27, 19, -31, -27, -11, 13, 20, 32, -13, 2, -3, -30, 8, 5, 3, 16, -15, -3, -61, 30, 9, 23, 33, -23, -27, -3, 8, -20, -2, 38, -8, 23, 2, -70, 44, 63, 20, -12, 11, -13, -32, -13, -36, -14, -46, -26, 31, 27, -63, -13, -1, 11, -10, -17, 28, 51, -25, -2, 11, 6, -6, -18, -7, -19, -29, -20, 8, 4, 19, -71, -3, -3, 46, 31, 24, 17, 18, 36, 52, -51, 10, -27, 45, 18, 16, -16, 1, 0, 31, 16, 7, -22, 48, -8, -45, -29, 16, 15, -33, -20, 24, -4, -19, 43, -15, 1, 19, 11, 0, -30, -17, -54, 66, 24, -25, 32, -14, 11, 15, 7, 16, -9, 14, -2, -10, 51, -33, 25, -26, -2, -5, 23, 7, 2, -34, 22, 56, -20, -7, 15, 27, -23, 50, 24, -36, 22, 1, 28, -27, -88, 14, 3, 0, 32, 9, 22, 55, 63, 4, -40, 17, 16, -23, 27, 14, 51, 63, 39, 52, 3, 15, 38, 20, -54, 56, -38, -19, -30, 11, -12, -1, 18, -11, 25, 4, -15, 9, -20, 54, -17, -34, -6, -11, -61, -19, -26, -9, 17, 45, 30, -21, 36, -13, -24, -27, 6, -22, 19, 19, -19, 26, -3, 30, -21, -5, -34, 50, 36, -31, -61, 63, -6, -80, 20, -32, 60, -88, -21, -38, -21, -26, 25, 25, 26, -12, -33, -14, 14, 12, -3, 20, 31, 21, -31, -1, -25, 12]
4834A2k1kK1L0n3k0J8J0l0J5OK1l4krJ6j4N3pL3romOl7j7M9j6l9qK2P1m1J0n2
4869b8M9q3J07p5qK8RrJ0Kj5M8p6P1m4L6oro9M5%RMm3L1J4k1J1k5L5J0Pm7J1k4
4904d5J4L5Nm5N5q1R7m9J2RM7l6Nm2O9m0JK8rl2M8n4n2k4O5k4J4oM9o9L6K1m3
4937d1L1L0p9O4Om5M3k1J4K0n5j9K8M8p3M0J3l8M3J8q7M1JL2Km3KK2K9k7kRl7
4970c1M2n0J04p9l7P1q4O5ok1K7n6QN4K7J4l2j7j5l8N1j0j9M9k5K0Lk1J9j7qJ1
5002amj2N8p5O2j3L4p1J9j10P6K4KLj6J5L0j7N2n1m8P7n4L1n7LJ2J5L%o1N0M0
5035A6J3p2k0R9Mk8Ol1L7m1M2k9m3M9p0R6j9Kk0J2k7K9Qjj0nk2K0qK4o0Oj2O8
5069A3l6l5K4J1J4L1M1k8k1j7M3n9j4MK3njJ2J1qm9Q8J2j5m2L4j4n6J4J7%L0K3
$$ y = [12, -9, -11, 10, 40, -13, -33, -15, -5, -35, -20, -14, 7, -27, -29, -38, -22, -36, 17, 10, 43, 34, 28, 24, 30, -7, -24, 25, 9, -30, -38, -16, 55, 14, 24, -28, 21, -62, 45, -30, -38, -10, -1, -10, 0, 2, -13, 35, -41, 30, -14, 22, 16, 7, -62, -17, -17, -8, -4, -47, -16, -2, -23, -12, -37, -2, 8, 15, -32, -21, -45, -31, 4, 9, -36, 19, -62, 35, -14, -2, 7, 54, 18, 23, -19, 50, 10, 11, 39, 30, -2, 46, -8, -60, -84, -19, -43, -29, -35, 14, -55, -19, 2, -41, -10, 20, -59, 5, 11, -34, 9, -12, 2, 22, -33, -52, -24, 24, -49, -9, 4, -34, 9, 27, -60, -19, -18, 14, 16, -27, -25, -3, 26, -1, -3, 6, -31, 11, -39, 65, -14, -51, 20, -64, 1, -5, -26, 1, -55, -47, 7, 34, 48, 16, -1, -16, -54, -3, -13, -32, 17, -8, 12, 15, -6, 13, -4, -12, -1, -5, -17, 41, -34, 28, 15, 49, -22, -3, -113, -37, -13, -11, -8, -24, -9, 21, 4, 56, 5, -43, 34, -20, 11, -46, -43, -31, -16, -13, -13, -74, -24, 16, 29, -43, -63, 36, 40, 12, 18, -13, 24, -17, 25, -4, -47, 2, -68, 28, 9, 11, -9, 3, -24, 5, 13, 12, 2, -3, -25, -5, -13, 11, -49, -43, -55, 13, -23, -58, -34, -23, -9, 22, 63, 35, 14, -3, 40, -19, -33, -29, -6, -11, -12, 0, 11, 3, -46, 42, 54, 39, -3, 31, 17, -39, -25, -8, -8, 22, 45]
5102D5o3l0P8j2n1K8JRl5M9j7q0L1M0J9j7LpN1q6K7K1j7o4M9M3n5M4K5m6M0M6
5134F9l2l2oj4nPLqL5%k9l3J3jJ7k7O7j1qJQm9k3M0PM9l9l3J2N0Jk1N1l5n6K6
5170fjL3l1ML4k4Pnp4M7l6M0MlJ8n1K2P1l2l4MJ0Ml8J3RJ1m8L5l9K3Q2o4J4K9
5205B8l6N1o8J8pj8K2K1qj1L6k9o1L1QK4mj5k7J0QL0N4o1M5qq4R4l6l0K1m2kp
5239e3P6k4p1L1K1KK1l2LPK0P3p4k9J9k0K1k1M1J8k4qM2j4m6L2o1M5M4p4pN3n8
5272d7P2q0M8j9J3m1M8N3q2K1K9k7KM4l0K7l1kL1n4L2mj0J8MK3m1nPk2M8l7L6
5305B4M2J2r0N2n5k5L8l9K2L2l6M9l4LL4k5m2N1k1k7J3L2OQl0M8q9N1N8n6JOm9
5338c6L9LK0j4k9Q4q6N5n2RMO4p8Oj1J2k4M1J2l9L6n3L2Qj0Pj4J0Pl0k5K1K4K4
$$ y = [45, -18, -48, 30, 18, -33, -5, -4, 5, -30, 19, 2, -78, -47, -7, 12, -5, -2, -9, 42, -44, -17, 4, -13, -77, -28, 15, -40, 4, 29, -17, 23, 69, 37, 5, -1, -15, -20, -13, -10, -18, 17, 17, -12, -45, -32, -33, -16, -43, 24, 13, 5, 6, 14, -35, -58, -18, -11, 38, -1, -34, -22, 28, 29, 8, 59, 24, -32, -6, -7, 26, -5, -1, 33, 9, 16, 11, -63, -16, -52, -12, -8, -11, 7, -44, -22, 49, 17, -17, -13, -3, 1, -37, -24, -15, -4, -52, -17, -56, -33, 49, -15, -1, 28, -8, 43, -25, -7, -14, -32, -10, 11, 3, -8, 28, -1, -62, -31, -23, 1, -3, -18, -45, -35, -27, 3, 57, -4, 41, 33, -51, 43, 7, -23, -2, -44, -46, -53, 23, -1, -72, -41, -20, -18, 3, -29, -26, -19, 1, 74, 0, -29, -10, -30, -9, -30, 11, 29, 5, -3, 39, 25, -21, 11, -50, -5, 39, -35, -42, 11, -47, 25, -55, -7, -26, -13, -54, -6, 47, -35, -14, 15, -12, -10, 34, 4, 31, 0, -2, 29, -25, 7, 3, -7, 11, 15, 38, -3, -8, -1, -23, 25, -12, 24, 66, 78, -12, 40, -15, -40, -2, -41, -19, 13, -23, 26, -8, -5, 29, 4, -38, 13, -8, -35, -22, 10, 16, 24, -6, 42, -47, 4, 62, 6, 7, 13, -36, 3, 6, 26, 12, -17, 67, -19, 36, -16, -7, -3, 61, -17, -11, -22, -10, -34, 7, 19, -20, 16, -37, -5, 3, -7, 0, -14, -4, 3, -27, -52, -31, -7, 17]
5372A7J1k6l9M8O3n1q%Lj7l0J5pm7Q6j9j9O2Oj16P0l5K0oJ0qJ7K7l5L4l3Pooj5
5407b7mM7m6M3k8L1Qj6Onl7LN5m0RK1j3o8P9j9m0K0K7Rm1M8k3J8%j7j8NL6m8J6
5442in2M9J7J6RMNk6j4k5M8K6q0K1L9k0M3j09N1J9m4P4n4K1J0l8%K8j9P7r5Qk3
5475d3OP1l2oM3p2L4kJj7lK4l6J5L0%J7l6Ol5P1j4n3Q3j25JN5M5J9k4J1nm3J5
5509AK1m1j8K7J6l1J5L7q2N6k3K2%kJ3l0K4kol8JM7j4m5O0J6k9k7M8K0n2l4J2
5542c8M9kJ1nk3lN4qp7O4m5K2n5L6k6M7l8J8N6k8K2r8J04o6j2qM3j2J6j6J5pj2
5575b2%jO6rj1j8N6n4%K3m5P5p0j4n1M5L1K2J7m0K0m8MmP0Ln5L8p5%O5l8k3K2
5609b1L0%M5n6K7k9L4j7k3MpM9l0L1p7M5j8L3j8Kl2L4No1M8O2n6J2j8Kn3N8Jl1
$$ y = [17, 28, 2, -37, 11, 74, 23, 15, 15, 18, 1, -29, -14, -21, -68, 18, -1, -20, 42, 48, -68, 2, -33, -13, -19, -9, -17, 0, 27, -8, 26, -7, 0, -6, -12, -27, -31, 16, -30, 13, -15, 16, 24, 8, 14, 9, -28, -25, 30, -10, -1, 20, 7, -61, 18, -1, -41, -21, 6, 15, -26, 22, -1, 17, 17, 0, -18, -13, 23, -25, -9, -61, -12, 5, 21, 30, 34, 39, 13, -1, -26, 22, 48, -32, -11, 28, 8, 51, -58, -7, 12, -32, 42, -12, 9, 19, -19, -19, 9, -10, 67, -28, -20, -43, -37, 34, 2, -4, 39, -33, 1, -1, 0, -17, -20, 4, -32, -17, 13, 13, 30, -6, 0, -35, 36, 22, -31, 52, -73, -72, -17, 28, 47, 23, 34, 29, -14, 1, 22, -19, -37, -10, 6, -25, -10, 27, -55, 1, -22, 0, 0, -2, 11, -19, 5, 3, -3, -41, -40, 7, -7, -52, 8, 24, -5, -32, 16, 36, -16, -50, -38, 11, 9, 20, 15, -8, -11, 43, 35, -42, 22, -23, -1, -56, -20, -46, 1, -37, -19, 37, 9, 31, -67, 37, -29, -41, -49, -6, -18, -2, -18, -3, -10, -22, -22, -23, 43, 34, 23, 5, 61, 7, 7, 30, -15, 60, -10, -24, -75, -30, 1, 23, 40, 0, 20, -28, -24, -28, 42, 45, -10, 28, -47, -47, 18, -20, -43, -21, 9, 9, 54, -2, 25, -4, 30, 13, -10, -6, -13, 36, 6, 37, -40, 5, -13, 20, 2, 4, -28, 6, 11, -50, -2, 60, 4, 16, -2, 0, -53, 5, 6, -25]
5643b5L6Rm7O6Kp7N8j9K7j9L4p4KqO4j6k8K1%J2k8M0n0N6l6Jk3qK2K9Rqm3K3L0
5678C2n1Nm3j8Q1n4M4l1l0P2m4N8n0L8j6p0J03k1j8N4k1J9J8j11kJ4N9m6L0J8
5708A9n3RM7o0N0o1K7L0L5j8j9Qj5j1k2N2o1J8L0l2L7l5M6o7N3L2n8N1q6O2K6
5739C4l6K9l1J7K6r4M4J4M6k5q6N0L6j3MJ1L2n0l5L1jK8q6P4l6lnN5m0N7n6j8
5771b7J4J2K2p2N9J3j4K9m8J3j8L2m6P4m7j3QrK4j9k3O1J8l0qK6m2J7J7k3l0k1
5803e1M9O2j43M3M5j2N2n4l1lOK6L9n5M2n3%K4O4nj9n1j4J02n9l1N0m3K7n2M4
5834aj7K8m1N8J6l7L4m7J4J1ok7K1l8m6P0l4P6k4m9M0Lk6K3p0P8J2Qn0k4K9K7
5866A1k7L2LJPn0M7p4O0%o0L7K5o4O4K3l5%j9J3nL2k7M6o1PK0Mp2Q6K5k5n9K5
$$ y = [-25, 11, 20, -27, 39, 41, -36, 22, 3, 30, 11, 45, -29, -27, -35, 29, 13, -15, 6, 6, 18, -10, 30, -20, 36, 0, 1, -22, -30, -8, 21, 30, 22, -21, 2, 32, -19, -14, -57, -75, 6, -48, -4, -35, -65, 7, -37, 21, -29, 9, -7, -77, 26, 5, -13, 41, 20, 39, 57, -54, -56, -42, 17, -29, 1, 19, -34, -25, 22, -38, 12, -49, -22, 8, 43, 25, 6, 14, -1, -12, -34, 18, -43, -25, 5, -27, 10, -25, 21, -46, 7, 39, -19, 32, -54, 8, 34, -2, 27, -4, 13, 39, -55, -11, 3, 49, 24, -62, -12, 24, 11, 15, 26, 58, 8, -27, 4, 3, 31, -55, 19, -17, -20, -25, 30, -10, 47, -9, -27, -13, -1, 21, -51, 8, 21, 7, 36, -12, 1, -17, 15, -31, 43, -4, -17, -9, -18, 6, -13, -36, 25, 43, 13, 5, 31, -11, 6, 23, 0, -30, -51, -2, 60, -83, -40, 5, -7, 45, -9, -40, -43, -37, -11, 28, -27, 15, -38, -38, -14, 50, 45, 26, -25, -39, 63, 4, -27, 23, -20, 7, -45, -1, -18, 10, -31, 27, 43, 6, 40, -7, 7, 18, 12, -15, 6, -32, -78, -8, -42, 34, 10, -39, 1, 4, -22, 1, -69, 9, 21, 29, -21, -45, -16, 11, -16, 16, 19, 20, 27, -23, 24, -50, 10, 10, -50, -13, 12, -52, 12, 35, 0, 0, -19, -6, -11, 21, -6, 40, -21, -14, 6, 10, -62, 24, 49, 24, -35, -10]
5900a0LL2M8m2%qq1O7l8N6kJJ0o7J0PpN5j0k0m4K3N4m7k9N1Ll8M1r5P6J6J4K6
5934E5q5M3L1n0J2m1J5J8j5LK0m3M1o1P6l9j3N8l7J0j4J5j0K3%Km5O7q4P3pp6
5966e8O6PP0j15N1k6nJ7pK2p0L9l1P3m6l4K2O2j4j9l6L3Rk6KK5j3j3m2L2L3rJ9
5999A8J0l5NK6p2O0k5QNl2N0Mj3k5O1n4O0r0M1L5K1ko2LJ5k0L9o0nK4j2K7l3O
6033b2J5J7k2N0Nm0M3n3j7M2l6pL6j3j7l3P2j8j5K3rj6M5m2LM0Kk0o0K9L9l1N1
6066D1k3ok0n0N6m9O7n1O1o5J5J5m0R7n3l4L1j6N2n1J7k7J6O3n0M5k4m2Q2o7J4
6097Dj5rK8J4o3M6m5N8k0oK9n2%K3j3M9l8J2j9K5njj0JL3j01O9k2N2Okj1n2KM0
6132GK7l3jMm8O9r0rJ00pl2qN2j6l4O7q3K3l8k5M0N4L7m8l9L6Nj6j6L0M0K2l4
$$ y = [-10, -7, 25, 73, 31, 31, 23, -58, 9, -29, 27, 25, 26, 36, -31, -21, -14, -21, 34, 24, 4, -40, -17, 37, -10, -39, 12, 15, -23, 18, -77, -1, 15, 29, 55, -30, 13, 44, -6, 6, -35, -20, -2, -17, -14, 6, -37, 4, -57, 19, -20, -33, 25, -12, -2, -16, -1, -11, 12, 12, 14, -31, 36, -48, 25, 18, -58, 8, 15, 85, -30, 21, -5, -10, 7, 0, 22, -48, -9, -40, 33, -13, -47, -25, 37, 23, 4, -32, 1, 10, -16, -14, 11, -2, -15, -57, -25, 8, -1, 18, 28, -7, -2, 24, -48, 12, -13, -5, 0, -32, 18, 22, 9, -16, 45, -9, 51, -39, 2, 37, 58, 56, -6, -3, 12, -8, 31, -29, -34, -10, -22, 5, -28, -22, -7, 10, -12, 38, 43, 3, 46, -7, -24, 18, -18, -25, 11, -2, -19, -52, 20, 2, -13, 10, 1, -15, 30, -12, -9, 31, 33, 13, -47, -18, 21, -10, 41, 18, 12, -8, -58, -2, -51, 16, -35, 26, -39, -24, -9, -49, 48, -5, -39, -8, -24, 28, -23, -6, -33, -17, 46, -4, 41, 17, -25, 57, -10, 4, -11, -20, 8, 22, -41, 5, -40, 18, -2, -8, 21, -31, -31, -8, -21, 28, -10, 2, -17, 8, 3, 2, -8, -7, 26, -75, -6, -28, 24, 30, 28, 17, -35, -33, 7, 34, 1, 0, 4, -44, 25, -65, -74, 26, 19, -13, -21, 31, 15, -19, 48, -35, -12, -50, -75, -35, 19, 56, 8, -31, 5, 10, -6, -22, 8, 48, 70, 36]
6165C6n0J0jL8m7kP5r0J8j7j3N8o1RL5J8kK8l0Mljl5J3J3o5J02m8J0P0p3prL2
6199A5j1K1m9K6l3M4p7Q3K0o5J8j8M2o0R0LNn0Rl6k2M7J7m6k7N7N8o2l0J7rj9
6231d2J0M7j1J5k5m0N2m3L4k5K0J1NK8n3NLL3k2L0j8Lm2N4jm0j2K3J7p2R1q2M7
6264@Mk3L7j6l2N0k3l2M3nLk3L0p0N0JnPP8q8L5l8jK2p7Q6%J0J6m2j6K6nql4N1
6300A1j7l1O4j5J3j6k5j7K1M8l6l4j4O5l5K5L8rn2K0J9o5L0N0o3K8m7P7kl6L6
6331C1k5J1k0KK4N6q2%jJ3OJ5p0M0J7n2O7m4K1k0JJ0k3K6K4l8K6m3P0m3LRk6k3
6365c8K5L8K2p3LJ9qMK5J8k8J7MKo9P2l7L4rm7NlK1J0rQJ2r0O8JPK2m4K7l8j2
6401d1L5n5O5Kk5J4L5j3l4Q2m1n4K8J3j9RrJ6j3K3m2N2qlj0On9J00m1K4k7j6k6
$$ y = [36, -14, -4, -5, 33, -14, -16, 59, -31, -13, -30, -43, 15, -46, -37, -2, 16, 14, 42, 12, 16, 13, 12, -23, -10, 3, -62, 40, -8, 2, 72, -1, -8, -17, 15, 4, 25, -24, 2, -31, 13, -64, 19, 39, -26, -8, -26, 16, -44, 46, 49, 54, 4, 13, -23, -45, 2, 19, -27, -54, 3, 61, -1, -31, -14, -23, -42, -32, 15, 4, 19, -6, -46, 6, -37, -3, -28, -8, 3, 8, 36, -17, -12, -9, 24, 2, 32, 14, 17, -25, 29, 28, -12, -24, -1, 16, -56, 35, -47, 0, 4, -19, 18, 2, -30, 20, -3, -35, 8, 3, 6, -17, 13, -57, -7, -6, -11, -4, 74, -14, 21, -17, -18, 4, -73, 13, 13, 23, 39, -3, -19, 7, 2, -6, -40, 11, -6, -37, 27, 12, 25, 9, -16, -33, -12, 36, 0, -34, -48, 17, -18, 7, 45, 36, -16, 4, 23, -42, -12, 38, -25, 3, -44, 33, 31, -5, 31, 6, 17, -3, -1, 23, 79, -3, -3, -4, 9, 15, 30, -40, 0, 17, -35, 32, -12, 9, -11, -10, 0, -23, 3, 27, -11, 15, -28, 42, -1, 2, 11, -15, -38, -13, 25, 47, -26, -23, -4, -12, -8, 17, 35, 7, 24, 28, 30, -39, 33, -4, 30, 21, -26, -21, -24, -3, 7, -2, 6, 18, -72, -4, -3, 4, 26, -18, 9, -29, -41, -6, -61, 4, 6, -19, -5, 30, 17, -17, 65, 24, -30, -2, 11, -8, 1, -8, 8, -5, 18, -24, 28, 20, 17, 7, 13, -46, 54, 13, 37, 10, -6, -32]
6434c2M2No0R8j1l3LJK0l4j1j5P3r1K4J9j9j1L2k2K3PrL9j17L4J6N7Km7J08o8
6466B3Qk8L6k7n4M0L8n0%P4o3j9nJ2qO5m6j3L0l7j7M3l2K5L7n5J8l3%L1k4qM6
6499GJ0m7K6Ll5P1q7P7m0k4qJ7N2l0J9J6l2m6O4l4Nj4lL3K3j0m7O4l4J3jj9nQ
6533hP7p3J7Lj5j2o3R7k8kN1j8m1O2l1k3l6K4k8J02l7k3J7k0Ll1J2KjRL8qk4m0
6567d8J2L3l2L9K2k2L1m0J4K0l4kj4M4m9L1RNk4L8l5K5k7K1l7M0l8OL6np7pN8
6600gj6L2o2P4n5LRK8K8l4Oo6J05l1j3J3lm4qJ19p7j8N1l6L7j0k8mj6O6m7k6O5
6633C5n8M4n3L1jK4n7K3p7O6k3O9q4M1L8pM2j9J6rN8r2pn0N2J8k4J1o0J21q7O0
6665D1l8l4O6k3MnNj2Oj7m2N3m2PL6p5O3L5k8l6Pj5L8L8m1J2o1J2P6j6k9J07j54
$$ y = [-32, 10, 15, -45, 53, 42, 9, 12, 13, 33, -1, -12, -27, 46, -45, -21, -2, -21, -32, 0, -22, 1, 8, -1, 38, -79, -45, -29, 28, 30, -17, 91, 23, 31, 3, 39, 12, -42, -2, 36, -14, -14, 60, -3, -22, -27, -15, -23, 42, -4, -17, 13, -24, -41, 2, -30, -5, 32, -23, -5, -38, -38, -7, -31, -39, 7, 17, -30, -4, -1, -36, 35, -52, 25, -15, -39, -47, -30, 22, -8, 11, 27, -5, -51, 13, -21, -16, -30, -33, 0, 23, 13, -34, 30, -4, 9, 8, -11, -16, -8, 69, -4, 13, 16, 1, -11, -74, 23, -5, -7, 44, 26, -15, 47, 16, -7, -43, -19, -47, 55, 18, -5, 12, -8, -5, -36, -24, -22, -23, -14, 24, 16, -8, -48, -36, -3, -35, 4, 26, 4, 35, -5, 9, 29, -5, -7, -21, 23, -26, 5, 14, 19, -5, 33, -2, 23, -4, 17, -20, 20, -18, -12, 24, 19, -58, -65, -7, -23, 9, -53, 21, -34, -31, -22, 6, 34, 0, 6, -60, 45, 14, 1, 14, 11, -33, -41, 78, 1, -17, 34, -2, 35, 25, -3, -7, -23, 43, -4, -30, 35, -23, 21, -32, -1, -2, 22, -35, -12, -89, -23, -46, 23, -61, -20, 18, 11, 53, 34, 50, 41, 99, 7, 0, -50, 2, 20, -4, 7, -53, 68, -19, 41, 3, -31, 35, 12, 16, 11, 16, 4, 10, -7, -49, 4, -38, -31, 5, -70, -7, 28, 0, -36, -29, -44, -6, 32, -9, 3, -58, -46, 30, 14, -15, 92, -62]
6698f2M6mL7j0k8N3m7L1O8j00PN0l8K3K5k7l4jK8J7rk6l9P8q9J8K8j6K0%m1P9
6730C7J4m5nN9j12mR6n6N0l6Lj7J4m1N9j7p1M8j6O6l7K5k6nMJ0K0Mm8n4P1M4k2
6763A2l6k5L8M8l5k3nMK8mk8L8J3k5j1oJ3j4J8K3k7Qp7R3J0l3J7j0l3PK0lK9J7
6797D1o7K3J4K9j9n1L3Nm4O8q9Q0J7m3j4J6K9m3j6K9J6OL0o6NK4l2jJ8K8n4K0
6829hPN0j1n8P4qr2M9j9L5j0J5L9j00O1k4l3Q2k8k6lM7p4qN1nJ6p2M2rPL8n3N8
6863C0l9jK6m8L0L2l6j6J2l1K2M5ok8L5j5m3L5K6l6Rrk7K7Qj4M2j4J5l9Nol7J1
6897c5nM4rJ5l9ROL9j8Pj2O0m8Ql3J4l0j1L7J2l4rj4Q5m8N4m8nol9L4L1K2o0J0
6932a6jN4l5J4k0j5nJ8n5M0k3N4j6NMm3M1nL2l4J8k1kO0pK0p3L7K1K5r2QNj5K0
$$ y = [-62, -16, -20, 17, 7, -21, 32, -15, 16, 84, -16, -9, 41, 3, 26, 51, 24, -10, -11, 17, 34, 25, -1, -40, 38, -51, -33, -5, -21, -1, -1, -42, 37, 51, 6, 1, 60, -52, -56, 40, -16, 34, -2, 1, -16, -2, -43, 16, -1, -72, -24, -40, 26, -11, 14, -12, -17, -13, -3, 17, 21, -27, -81, -10, 34, 12, -24, -49, -11, 37, 2, -21, -26, -22, 6, 2, -26, 12, 25, 0, -11, -17, -4, -18, 0, 23, -4, 4, -73, 20, 30, -3, 14, 4, -29, -22, -2, -5, 24, 41, -26, -3, 11, 40, 21, -30, 3, 8, -36, 32, -57, 23, 40, -3, -17, -1, 28, -15, -31, -2, 14, 20, 50, -16, -11, 13, -19, -20, -2, 26, -28, -8, -1, 49, 38, -20, 54, 46, -46, 3, -16, 19, 9, 24, 63, -37, 24, 0, -33, 49, 21, -5, -8, 39, -35, -43, 8, 3, 19, -53, -11, -20, -13, 25, -28, 30, -9, -10, 16, -32, -2, 30, -6, -22, -10, -41, -19, 26, 20, -8, 27, 12, -31, 4, 30, -6, 3, -6, -33, -6, 2, -12, 30, 16, 31, -8, -3, -9, -46, -35, -40, 4, -5, 10, -29, -20, -14, 25, 7, 14, 2, 62, 14, 22, -11, 3, -27, -38, -1, 11, -23, -32, -46, 39, -9, 45, -3, -8, -14, -53, -19, 12, 34, -26, -16, -17, 37, 2, 16, -4, -19, -24, -6, -61, -21, -44, 10, -6, -1, 3, -40, 1, -4, 28, -6, 12, -9, -11, 49, 42, 62, -11, 26, 47, 72, -20, -12, -7, -22, -2]
6967bk8O8k5J6j8kj3n0rP7Mm5J7M6l1rl2K3L2j6pn1L1k3N8n9L7j9QJ8L3k8J3J9
7001C3nJ2o8l4Q7l1p5Q4J4j8LL3r1J0P6k4J3m5P5p9P7m1j6Jl9N2Kj8rJ1J8J0l
7034A5k2L9m5J0J8J0l4k4N2l9L3Mk9L4j5j5Jl1J20n7m4J9J4Jm8Q1o0K2lL7m4M2
7066D2l8m3L5n9O6qj3k9J7PpjN4k8M9j3m8J07n1l1%J4rk0J8l9O7Kr1N7k6J7RN2
7100E9m7m3O0l1MJ4q0N7k5lO5q9M4K2l0qL3M4l8l9K6k7L9j6L9l9P5j4l1j9Nn3
7132d6K3L2J1j5L0j5J6ml0Rj9J2k1M2q9N7QL8p8P7l5K4n3N2nk2K4q3O6Mpl2N1
7165B2l2l9M4j1jJ7O9o8j7L7n0QNM0jKLn6J4L5l1K5m9M9l8j5L6J7pp5P6k3Q6n0
7199B2o4N0m0N5o0%L2l8k0lM6M2l8K9J3k8j6mM2m5M2lk2J5l0k2L8k4k8M5K6l1
$$ y = [-2, -30, 38, 13, 29, 11, 9, -4, -54, -63, 14, 18, -27, -10, 36, 5, -4, -36, -13, 19, 3, -4, -55, -24, -47, 11, -48, -11, -30, -22, -4, 29, 1, 14, 33, 28, 40, -28, -62, 25, -6, -81, 3, 17, -1, 2, 35, -56, -46, 30, 6, 19, -26, 49, -30, 47, 6, -10, -9, -48, 4, 6, -12, -21, -10, 8, 18, 15, -7, 32, -13, -3, 15, 25, -9, -33, 19, -20, 13, 17, -12, 22, 7, -8, -7, -38, 82, 25, -19, 0, 14, 15, -33, 48, -12, 10, 7, 44, 0, 42, 4, -39, -4, -63, 3, -5, -18, -47, -30, -23, -30, -31, 23, -5, 44, 31, -17, 90, 39, 8, 8, 22, 13, -7, 11, -28, 39, 41, -50, 7, -19, -2, 7, 59, 12, -31, 29, -2, 2, 16, -64, -7, -32, -35, 30, -59, -15, 7, -23, -31, 2, 46, 8, -31, -5, -32, 7, -9, 30, -9, 66, 52, 21, 2, 7, -46, -23, 9, 20, 5, 35, 20, 36, 32, 2, 11, -8, 4, -17, 25, -64, -7, 1, 39, -39, 38, 3, 27, -26, 26, 21, -1, 23, -60, 6, 10, 3, -29, 22, -10, -49, -5, -16, -17, 0, 69, 1, -16, 21, -29, -21, -16, 24, 23, 25, 28, -28, -14, 21, -10, 15, -34, 15, -23, -38, -2, 15, 8, -67, 9, -14, 72, 22, -42, 8, -32, 23, -37, -37, -5, -43, -63, -66, -20, 22, -16, 13, 26, -2, -18, -22, 20, -25, 17, 14, -8, 7, -23, -45, -7, -31, -59, -14, 12, -19]
7231a9J3%j6L0r1K3pQ7m7K6n1L1rN8J5n0L1k7Qk8J7K9%K7o9j9O4k8J0l3QL6k7
7264hK2K0k4k7J6j2J2j8J0K2K1o4Lk0J4J07j17%O6Qn4K5k3j0M2pLqj7K2k6nm6
7297g3Q5on0N9l4j6N4J3j07J02j9onl2L7K7p3M5j9PN9m8o6N5OJ3RPl7rQ3m4l3
7330a6L5kr1Q6PL1n0MK0j4j4J8jk3L7K4p3Q3l1K1o5j0J7ok0K3J9l1J7n1N0Nkj1
7364a4j4P8Rl7k3jJ5k9j7N5q9R2o8NL4nMm6O4n4J12p2L6q4N5N9n3l5%J6J7L4p1
7397b7N3j6K9l5l2P3lk4ok2N2omk2j3j2k5J8N0j7k7N6l2m0K1J6l9L8Qj8Qj1Qk4
7431b5J9J4j3kk2M0l5Kj1L4k9K9j1L4J6m9JnJ6OO3j01lLJM2lmJ0K3l4K8m5L8m5
7466a8J8KK8n7N6n1KO7j6q6Q7Pp6J9nk5N2K5K0Qo6j9JM4p5R0J2o7m0P0k6J3K9
$$ y = [-19, -6, -6, -22, 8, -83, -60, -67, 20, -27, -1, -52, -21, -30, 28, 43, -7, 24, -3, 5, -23, -6, 23, 23, 50, -19, -38, 26, -2, 8, -25, -17, 19, -8, 14, 34, 10, -17, -1, -13, -1, -19, -9, 13, 34, -30, -27, -47, -33, 74, -43, -43, 23, 31, -23, 2, -21, -31, 11, 4, 7, -1, -18, 4, -22, -27, -73, 12, 6, -44, 15, -19, -35, 19, 32, -75, 27, 8, 2, -3, -35, 2, 29, -44, 1, -18, -11, 48, 0, -66, -11, -5, 8, 17, 24, -13, -22, 61, 17, -16, 19, 17, -74, 12, 19, 50, 0, 4, 24, 10, -4, 14, 13, -10, 27, 51, -22, 61, 30, 51, -14, -24, -7, -13, -33, -10, 9, -22, -5, -56, -6, -1, -3, -14, -28, 50, 59, 22, -1, -2, 13, -16, -33, 22, -67, 25, -43, -38, -4, -9, -5, -51, 13, -41, 71, -1, 35, -49, 6, 65, 12, -23, -23, -7, 10, 44, -27, 26, 10, 39, 4, -28, 45, 42, 18, 12, -10, 42, 36, 32, 10, -3, -15, -40, -22, 28, 11, -16, 40, 8, -32, -11, 5, -34, 4, 12, -6, 2, -9, -1, -25, -6, 8, -5, -7, -29, 11, -24, -22, -33, 1, -28, 1, -10, 24, 40, -9, -8, -13, 3, 9, 72, -29, -32, -29, -28, 14, 11, 7, 17, 40, 6, 34, -11, 27, -18, 0, 2, 30, -27, 29, -22, -20, 47, 31, -55, 32, 39, -37, -18, -23, -48, 4, 29, 49, 57, -9, -28, -27, 17, -58, 32, 44, -23, -63, 7, -19, -6, 23]
7499B3p7Q8k8K5l1ll7%L7k5M0m8K6JN2n3NQm4L4M4o8K0j5N2k4o2N1J6k6k6J3M
7532b8N9n6M8l8j6R5n3j3NRn4P0k4pn0L2Rj0K4nJl5Q1p1Q0l3pj8j1J4n5Q5k9l7
7566c8N4n4j7Q9n5K6P9j11K4j0L7J5p7O9k5J%j4nL6l3m6R1n4L8p6M1O1m3jj3L2
7598B1J3qK7m3%j2l0K4oJpk2J9M6o2L6JK9j6l0oQK5J1o0j0O6KrJn0J1J9M9K5j01
7634c8K0M4L5q8L8K5n3OQL2J4p4M1k4k3P0m8K6On1J6j6M3n3K0N6m7l2N4L8m1M2
7666D6m7k2Kl7L0M3J9J4L4o9j8m8J4J7j4M2j0M2J4n7L8l7J6o6O9k6OL3o1M6k3
7697a0Kj2K1L5m1J2N4q4l1K3K0jJ0m6O1p1N3qM6l7J0l4L9L3m4J8Kl8M6l3KKlK0
7731A6n1J3rrN1L2m9KmRkl9J7N9k9Ql8K3n2P1n2M6Mk3J0jK5j7L9n8RL9l0LL0n8
$$ y = [23, -54, 34, 6, 31, 0, -3, -40, -40, -3, -28, 12, -36, -10, -9, 43, -10, -5, 3, -41, -7, 37, -31, -11, -26, 26, 2, -60, -9, 7, -19, -45, -32, -28, 31, -25, 23, -15, -31, 64, 11, -2, 3, 12, -42, 28, 4, -3, -53, -21, -12, -22, 2, -3, -2, -37, 44, -27, 53, 20, 13, -5, -16, -2, -57, 28, -1, -38, 16, -38, -55, 34, -21, 5, 84, -27, -3, -13, 24, 39, -38, 31, 6, 7, 7, -7, -12, 24, -9, -55, 36, -18, 20, -56, -15, 46, 3, 2, -11, 21, 34, 26, 53, 10, 10, -2, -32, -8, -14, -13, -20, -42, -23, 23, -39, -3, -2, 27, 11, -19, -25, -17, 8, 19, -41, -51, 15, 17, 8, 9, -41, -30, -11, 38, 63, -38, -18, 26, 61, -27, 11, 36, -17, -11, -3, 29, 43, -31, 10, -14, -37, 33, -15, 11, 17, -34, -18, -34, 9, -44, -24, 32, -15, -47, 7, 45, 4, 46, -1, -23, -21, -58, -28, 15, 34, 48, 82, 13, -5, -53, -39, -22, -36, 6, -4, 38, 52, -5, 33, -4, 12, -54, 15, -11, -5, 28, -33, 13, -10, -8, -20, 1, 36, -5, 7, 61, -23, -54, -31, -11, -12, -2, -48, 13, -58, -5, -13, 33, -4, 6, -28, 11, 44, 0, 18, 20, -18, 28, -5, -3, -1, -4, 16, -35, -22, -31, -40, 11, 43, -6, -4, -8, 1, -1, -40, -23, 36, 7, 15, -23, 0, -52, 19, -33, 13, 17, -6, 4, 3, 28, 11, 50, -8, 1, 40, 10, 13, 43, -15]
7767a5P1l3l4J3Jk5n3Q7m4M8j8lK2k1N%%K8n5l3O1MJ1k4N2m3j8QM0m5j4L0P9l0
7801E2n6M9j5Rp4J0M0k9Po8P8q1M7N7l6L1k8m1M0K5k3l4L5LJl2qP3ol2K1l2L4
7834A7j1l3NrM2NJ6n1L0Om3O2Pk5k8K8j3J1l1J0l6J1l9N2L3K5n5j3J0J0m7N8m0
7867c6mP1On8L4l5qL0JL1j2nj4K3l9J5j0L6j3J0k4P3m7p9N3K7K1o1K5k3m4KO4
7900A0k1RM2o0j5J6o5N2O7nm2rj6K6M3rK2o8MM2q7L6J8m0M8mK1n4jN1NJ5l8J6
7934IoKJk2j8M3m7J0L7j6l3N9q9J09o1k1O0m8k9Q8k4Rj2K0j9j7M0Nk3j8J1L%L
7968FM0p7Q7r9J6L9l6L5k0L0q6J1P0Npl8PQj9N4j3nM5k5RJkq5P7l2j8L3Mj8nO
8004boL6j5j4Jol2M2J2Pm9k3R9n6j%J8pJ6m4l7N0j1J2N2J8k9oJ0Pk9rkk6M3m9
$$ y = [-15, 56, 23, -11, 2, 3, -22, -75, 12, -32, 16, -2, -5, 17, -4, 1, 1, 1, 29, -26, -59, 2, 6, 17, -7, 45, 2, -16, -8, 32, -13, -27, 3, 82, 52, -4, 45, 30, 39, -35, -25, 15, -14, -7, -75, 3, -78, -31, 26, -10, 21, -7, -48, -8, 17, -6, -40, -5, -2, -1, -33, -41, 32, 26, -6, 15, -17, 17, 6, -27, -22, -31, 11, 16, 32, -19, 11, 17, -26, 36, 43, 18, -10, 18, 5, 16, -15, -5, -41, -30, -69, -17, 16, 41, -14, -27, -17, -7, -54, 4, -36, -40, 31, 37, -21, 13, -22, -30, 0, 1, 32, 20, 15, 1, 24, -15, 0, -10, 26, 13, 23, -1, 72, 25, -54, -1, 26, 47, -14, 11, -12, -56, -54, 10, -11, -2, 40, -20, -35, -19, -84, -32, 35, 30, -12, -21, -37, -11, 32, 23, 45, -23, -19, 23, -64, -28, -10, -50, -2, -6, 15, -39, -40, 11, 16, 31, -7, 9, 3, 5, 6, -16, -34, 9, -38, -28, 9, -7, -40, 19, -70, 39, -22, -43, 17, -31, -60, 28, 4, 13, 1, 21, 2, -15, 25, 30, 7, -11, 0, 3, 3, 6, 46, -31, 56, -43, -27, 12, -24, 11, -9, 21, -65, -54, 16, 21, 14, -24, -17, -9, -28, 26, 13, 8, 53, 28, 37, 38, 36, -49, 28, -4, -22, 11, 15, -3, -8, -2, -8, 28, 13, -1, 0, -6, -38, 4, 16, 23, -26, -49, 50, -6, -7, -7, 11, 4, 20, -24, -61, -11, -22, -10, 42, 60, 31, 25, 35, 42, 13, 4, 2, -24, 19, -30]
8040c0M4j5Ql2M1k6J5J3j3MJ0nJJ6o7K0mM7n5K9j2J9r1Q6J1l6k9jqR1o4N1k1M5
8074D2r3OL7qL8k7Jj9j6N1j2m2M3KNJ2j6M4n5OJ0j8J6l0O4n0l6qP1L4j4o3J4k3
8108c4K7J1L9o0K3n0J12p2K9k0lK2j2L4m3J9K6K6j11M5J4n3N0j3M0m7L5k8Ll1
8138b2j3N3k6RJ8j9j4%J8KnKPl0K1JOl7K8k0L6oj7J2m4O9p4J7L8l3N0Ln9L1j8
8173a6J0jOL3rj5l5j4PJ7j0M8rm1K1k6L1k
$$ y = [-30, 14, -1, 7, -25, 16, -10, 5, 18, 5, 9, 19, 14, 15, 31, -36, -16, -20, 27, -28, 1, -11, 8, -83, 3, 14, -22, -51, -52, -60, 31, -33, 18, -3, 42, -51, -45, -8, -16, 22, -5, -4, -23, -39, 12, 0, -42, 1, 3, 8, 20, 4, 48, -7, -1, 9, -9, 7, -23, 41, -9, -45, -53, 18, 52, 38, -25, -11, -34, -7, 4, 43, -17, 6, -44, 68, -4, 25, 5, 2, 24, 12, 46, 3, 22, 48, 74, -37, 8, 22, -31, 19, 6, 46, -1, 34, 6, 9, -22, -35, 18, -8, 1, 19, 0, -14, -14, 4, 6, 1, 3, 10, -20, 1, 2, 8, -29, -1, -21, 15, 9, -8, 4, -40, 29, -45, -28, 10, -23, 27, 30, -29, 2, -16, -6, -7, -1, 32, 23, 8, -27, -41, -34, -17, -27, 21, 12, -29, -8, -34, -3, -5]
8191e
$$ Imaginary data points
##PAGE= N=2
##DATA TABLE= (X++(I..I)), XYDATA
0@%%%%%%%%%Qj6J6k4L2l5M4n7P2q8J05j29J60j87K19k59L00l49M06m69N40o20
31c31P05q00R11j028J158j303J459j634J825k032K260k509K781l078L401l754
47a969M143m567N030n542O105o728P420q195R068j0055J1186j2494J4030j5861
61h429J8089k0872K4459k9289L6178m6870O5896j10017M03677J98289n89515j6788
73g5192L5140n9906o2898J10280j30339j76209O7721K23179N3924Q9956R9628
84A75284j37766k40832J54620L38603M0816j89341o9584n7391q2706R0602J52376
95A74681j48754k56982p780P5318o3371R1132L04325N5549k72909q3774K17992
106H5427J24316p4014p4993r9389j30465M9649J98095M6046q2900K367k1229j57347
$$ y = [0, 0, 0, 0, 0, 0, 0, 0, 0, 0, 8, -8, 8, -16, 16, -19, 25, -32, 40, -48, 57, -72, 88, -99, 120, -139, 161, -188, 218, -251, 289, -331, 374, -426, 485, -543, 615, -688, 771, -863, 962, -1070, 1190, -1319, 1462, -1616, 1785, -1969, 2174, -2393, 2637, -2905, 3200, -3528, 3892, -4303, 4765, -5290, 5896, -6598, 7432, -8429, 9660, -11212, 13247, -16042, 20136, -26734, 39162, -70855, 332822, 531111, -58404, -75192, -40052, -99958, -162856, -52576, -182915, -359124, -291403, -68224, -14300, 75656, 175284, 37518, -203314, -48694, 289909, 330725, 141384, 71800, 14409, -68297, 22305, 174681, 25927, -231055, -238835, -163517, -226888, -135756, 168569, 224118, -48791, -132565, 85427, 209743, 135729, 60736, -38653, -169118, -119469, 78626, 124672, 41772, 44139, 22910, -134437]
118a34437k0844K12610Q0926j81178j17351O1966O0369P4387J42376j1704k13285
129d6165p7481J41205M6126r0118J9534O2077j05069j00839J26117J67219j2277
140A30329j00277q4070p4249K6555J50673N4779j18469n5897P9979J9412m0601
151a1836O5696O8126j13427j44029K8421R4726L3278L3254J3406r6078p0859J09082
163I760J21693n5362j03182p801m120l8603M0390R4026O567o1703l2638j3087
175d4060J1507Q2125M9682j03106j14762N3693J10948N268k4943K4568k1320q0687
187e1087n792P0569K0805l0930j6379k8941l3938N5549J06054k73r5048l9158
199d8569L2382J8886Q554J9772j7000m7135l773L0374J2154K0745L2736l9646
$$ y = [-134437, -155281, 57329, 138255, -42923, -160274, -98308, -37939, 36448, 178824, 167120, -46165, -123646, 17559, 63685, -26433, -6899, 55178, -49891, -150730, -24613, 142606, 130329, 30052, -54018, -128267, -101712, 48961, 103740, -14729, -70626, 9353, 28765, -11836, 53860, 121986, 8559, -135470, -107049, -12323, 20955, 54209, 67615, -28463, -99322, 9760, 131453, 76091, -27091, -34892, -39012, -77615, -37225, 56801, 63368, 1665, -30973, -44060, -32553, 49572, 99254, -3852, -118614, -64921, 46027, 51295, 26352, 50920, 29600, -51087, -56879, 13690, 34495, 3565, -12814, -41755, -75693, -20144, 85910, 85637, -9411, -48569, -16187, 2699, 11253, 31025, 14025, -33110, -36883, -6509, 5645, 26390, 59126, 19480]
211A9480r4601l816R6661M4318m7125l3667Q410J062Q366L6194Q827l9550l0486
224b5927n486o136J8425N3163J0810o0497l8955L6568M7817J0070j0635k6351
236B866l4930K423M0805J5358j8020j986P28l4209j8630M7060M4298l0095n3554
249c7886m683L1486K9938J8312o649l0968j6179J4038J0778k009P520R03l2301
262a7700k7946K2235M1850R026k0113k2657j2789J2092L5335J5804k4977k4162
274a4002O217R210k783R314J7895j1197l5549j4388K0659K7610Q755j6276k7038
287b1573n850K5752K3843m478j3699l087m349q330P378K0896M855j8783k0323
300a7748m587J3549K2528Q201k0295k4928K840K2149J1083l836m261l572p572
$$ y = [19480, -75121, -78937, 17724, 62042, 14917, -18750, -10340, -9278, -912, 35282, 44109, 4559, -25927, -31413, -37549, -19124, 34039, 44849, -15648, -54603, -18035, 29782, 39852, 29217, 2866, -32064, -29641, 11164, 26522, 8502, 6516, 7244, -26965, -45595, 1465, 45763, 15668, -37886, -42569, -11083, 18855, 37167, 30518, -450, -16629, -2591, 8187, 6178, 13698, 14601, -17700, -45646, -23411, 18439, 27465, 7352, -15305, -28094, -16002, 19333, 35137, 10160, -14002, -7785, 1425, -1358, 7956, 25851, 14654, -20895, -35283, -14624, 12986, 21741, 5465, -21573, -27423, -1671, 22172, 17694, 3995, 908, -3441, -11771, -4393, 16503, 21358, 2575, -17748, -22335, -8786, 13742, 21943, 1648, -23280, -20440, 1709, 12792, 8956, 4695, 1123, -6449]
313f449k869J0054J4571L400j4313k1238m980J9845K0778m914k2010j0431P917
326a0639J0892N518K746j072p426q593j78J0808J3070Q01j5801j6752K130J8359
340C863J2179p023j5769p210M890Q164M423J622l6m780q127q60J2358J3481k323
355A4852j7317j3153M954J5403P028p742j0809k086M027L310L573M825m54r075
369b664q502L134J2585R776l185j3493r120O155J2690K553q470p282j311J88K108
384d838O291N617j730p516n776K465J0741Q440n911j4598m405R712Q494j095l970
399A921k569l526k687K751N559K962j759o243n664M610J3421N377r578j0407L73
414e459N070K288N93q61l927l196J166L046L651M408j076r923o350P722J0942
$$ y = [-6449, -9318, 736, 15307, 18707, 4394, -16844, -21824, -1979, 18799, 13885, -8125, -18556, -10639, 253, 5771, 8517, 7445, 19, -8574, -8752, 2056, 15126, 15927, 126, -16626, -14496, 3863, 16042, 9019, -6750, -13960, -9070, -906, 3517, 5139, 5103, 323, -7804, -8664, 3694, 17175, 14852, -2465, -15618, -10664, 4739, 11767, 4025, -6784, -8870, -4843, -1533, 2040, 6865, 6411, -2664, -11166, -8032, 4553, 14329, 11144, -2349, -11469, -5314, 7376, 9929, 1459, -5823, -7134, -6946, -4838, 1453, 7070, 5340, -2176, -7952, -5487, 5254, 13694, 7783, -6815, -11220, -1508, 6986, 5891, 1921, -648, -4174, -6861, -4110, 1449, 4411, 2652, -3591, -9255, -4645, 8776, 14153, 4575, -5832, -5459, -389, 1899, 2492, 1631, -2296, -5492, -4326, -1280, 2371, 6779, 5703, -4220, -10570, -2848, 8094]
429H094m77p697l882O91K471L766J470l288l721j060j408L96P234O588n143r792
445e758M43Q209L715k472m179m533k014L876M723k43j355R89k227m261L105Q395
461F413P46p854m796K107M450L772P91n051n376J240L418j079o83L202k77n833
477d810m97P787N422k312m673l115r32L096M227j891n607o54K706k03j21L928
493B351J616n046l850K263M281K246N58l008m767Q89N917J084n034k237J121j379
509b995j575L677M412j106l170q49Q64K467L399j048o390k661M158K901j647m86
525d9J196j908k634J809L087m4r73j071k402N0N278L578l852m556J082K220o12
542A99n8J127j130k279K77J424Q72J493L48l927l447L023M822o10k986J08J201
$$ y = [8094, 7617, -80, -3962, -3271, -800, 2966, 4436, 1148, -2573, -3633, -5041, -4645, 2589, 9177, 4034, -5758, -5315, 2894, 6609, 4137, -42, -4575, -6589, -2713, 2010, 1767, 412, 1401, -826, -5087, -1982, 6413, 7159, -695, -5491, -3384, 1066, 4838, 5629, 578, -4798, -3558, -140, -1219, -1902, 1300, 1023, -4810, -5307, 2480, 7902, 5590, 917, -2198, -3130, -34, 4193, 2302, -3305, -3959, -1253, -1456, -1577, 2351, 3967, -1079, -4929, -2666, 1615, 3861, 4419, 1411, -3356, -2467, 3450, 4534, -500, -2737, -1616, -2995, -4570, -893, 3519, 2413, -757, -1606, -742, 1725, 5124, 4076, -2314, -4975, -817, 2084, 437, -49, 1147, -761, -3395, -1586, 1501, 1457, 484, -587, -2989, -2939, 2339, 5917, 2065, -2491, -1409, 811, 199, 141, 1268, 138, -2141, -1864, -440, 432, 1925, 2273, -1654, -5101, -2078, 2744, 2134, -852, -744, 457]
559D57p8J092J862q85k471q11o13j174J640K846j538m243J16L945J773q01l44
576G73o00q97J127K038k48r08M10j101l094K05L478L45l826j746J737J720J132
593E45J164l24j626K17J602k49o85J001l45l027j044K653J917j249j574n89k89
610a902J151K172j19k020r8J545l79o84J599J139k307k323R47J846M45l10q69
627a67j353K67K256M95j524m00P11p86r96J390J721q35j592j75M29O97J388K3
645A549k253j106J767J211r06m30P19m36j410M41J412L13o22o64q20J34J888J138
663A925j529j573Q38Q76n17N4P87l79j258j58P90M04L83R5j222j207J128J823
681A260k67j413j05N24j77J68O62r3n43k67k69j89R26J148q88j734R2J621L83
$$ y = [457, 379, 1471, 3333, 2448, -23, -834, -1447, -2621, -981, 1865, 327, -3916, -3800, 145, 1918, 1117, 773, 173, -724, 403, 2441, 2193, 1285, 1695, 594, -2500, -2295, 1183, 1528, -2298, -4044, -2307, -587, 545, 1709, 1385, -241, -24, 1578, 1329, 644, 1645, 1300, -1727, -2771, -118, 1799, 550, -1024, -1613, -1902, -751, 1421, 1302, -718, -816, 729, 350, -334, 1265, 2404, 97, -2226, -1279, 567, 1012, 702, -167, -1520, -1253, 1003, 1498, -26, -426, 285, -501, -1497, -107, 1614, 779, -813, -988, -559, 138, 1526, 1549, -704, -1810, -43, 1168, 262, -168, 551, 115, -1295, -854, 558, 871, 249, -415, -1235, -1101, 787, 1925, 396, -1177, -339, 537, 20, 74, 861, 482, -776, -934, -144, 260, 643, 738, -484, -1691, -563, 1260, 993, -420, -525, -1, -178, -10, 652, 559, 16, -251, -520, -709, 217, 1365, 477, -1257, -1165, 456, 839]
700H39p05j40j3m63P0O15K17j82ml89p44L25J466K14j370p15N64N80J78J11k45
721B09o54k1N54q0n8N83O2j232m90J281R32n49r97m7K06L43M70j18n13j50K38
742c1j47r0O49M54q22q92M24Q13K84k32m43n41J08P20K41n56j72L24j46m93L90
763a58Q99j33p92m41L50N14L32j56p91k73O13L10j98j20L11k22n70J51O75K13
783E14l31k96l49R4O29L98m80o03Q6M08r8j1K02Q8l48k89J70M59K17j12o29l64
805f45M91O36j06n26k3J93o5m6K37J36k12k61j31P7M22L27k29o71m1M93L35j78
827B13k69j6l6kJ26L7J81n4k72l03J29O05J65n20m25K13L32J34j57n9m9j20kJ16
851c3J17J21o7l90j27L35M66p6l95j67Q7J90J10o8j48p2P0o6k9K39J87k04l88
$$ y = [839, 134, -6, -19, -482, -412, 203, 420, 238, 234, -155, -899, -574, 892, 1106, -264, -979, -415, 165, 343, 454, 209, -445, -466, 88, 8, -50, 533, 595, -637, -1127, 154, 1086, 537, -460, -507, -301, 42, 512, 394, -119, -269, -31, -178, -268, 381, 835, 13, -879, -455, 358, 642, 410, -33, -574, -466, 254, 495, -61, -233, 91, -55, -548, -158, 741, 608, -184, -625, -275, 239, 571, 415, -376, -649, -36, 274, 76, -44, 267, 45, -525, -374, 301, 514, 183, -113, -462, -368, 261, 659, 179, -424, -338, 70, -28, -39, 163, 251, -97, -386, -216, 243, 460, 348, -281, -645, -154, 482, 376, -150, -173, 20, -45, -91, 146, 282, 70, -191, -322, -245, 177, 504, 275, -396, -437, 56, 391, 213, -56, -72, -108, -110, 16, 53, 234, 180, -92, -395, -266, 339, 504, -16, -441, -228, 104, 238, 81, 22, -27, -147, -149, -33, 84, 205, 138, -252, -379, -44, 422, 346, -49, -216, -129, 61, 171, 103, -45, -117, -47, -113, -142, 97, 284, 80, -308]
874c08%L42L24j78k36r9O5J99q0nM0o3j24r0J02L03L0k51k48J00K60J00L4k82
898f5j11N6J54O3j6K6l1j43j27J85K08l0k61j86J78J91J03j49j77Q9j8J7K8J30
922A14rp5j64OK17J34j03k42r0R4K26Rq4j12n2J06L8oQ8j9p0j82N2K20J50j51
948I5k25OJ13J18K1j37o7O6lk6M9J73n0k20j08J34J84Jj27j17L6J10R8pj19KP4
975G4j31m9J47M9r0j09mM0K35m1q9k00J12R4P2j11j7J32j05r1O1J50K4p4j65n3
1001a39J44O9Op6j29J04O5M0n3K9k2j02J9K5M9O7q6j12j9J10P7m0r8O0O5m4k3
1028a4N2mm9l0N5J2Q3l8j12o5P1J05L6p8J0J0j23J49p2M2j9J5p1l6R6J02o5j60
1056i8K2N2P3k9l2K0om7O8j8OM4l7o9J8J02j0n0j8%l8O1O2k3m6o1N2k7M8OR3j69
$$ y = [-308, -308, 34, 358, 180, -56, -155, -90, 109, 29, 24, 64, 1, -123, -213, -111, 192, 222, -29, -277, -177, 83, 183, 217, -65, -176, -120, 34, 97, 81, 107, 76, -67, -194, -9, 199, 169, -92, -278, -100, 91, 194, 45, -132, -43, -61, -44, -16, 114, 105, 30, -134, -128, 89, 223, 120, -122, -212, -118, 108, 117, 33, -79, -131, -25, 13, 7, 95, 76, 6, -176, -124, 96, 246, 95, -130, -124, -11, 107, 128, -9, -76, -10, -13, -39, 10, 183, 133, -87, -195, -61, 123, 124, -3, -120, -84, 26, 124, 117, -2, 0, 74, -57, -106, 41, 90, 0, -109, -113, -73, 162, 121, 32, -168, -56, 38, 110, -1, -18, 114, 9, -82, -21, 129, 153, 79, -86, -139, 5, 74, 80, 4, -125, -21, 44, 84, 31, 60, 38, -64, -45, -20, 29, 96, 10, -102, -121, -11, 66, 26, -72, -12, 53, 9, -14, 38, 34, -15, -45, 10, 22, 105, 67, -45, -110, -39, 66, 102, 24, 34, 44, -79, 70, -2, 40, 21, 36, -35, -71, 25, 127, 62, -98, -76, -24, 49, 20, -12, 8, 2, -45, 23, 5, 11, 55, 18, -51, -33, 69, 59, 9, -9, -9, -47, 14, 76, 53, 7, -54, -2, -29, 19, 25, 118, -51]
1088e1M9K7J05q0M0r9q9O6L4Rj11J13j6m2j7L4R1J1j60N3P9k9P2or0p3R8J5Kk1
1118A4J5J5q7k9R6pnl0l5L3L6M6m2o0O7j4kl9O0Jq0K5QqK9j9j4q1Q4K8K9n6K8
1151FK7Kp8Q6N0q7j2qK0j0M9l1r0N0P3j6J4q2M4mK2m1j9j7L7k3j4L7L3k4l7k2
1183f5Q7L1o4l2L3k5L4j9M1l9QJ6m9JL3J2l8O9k0k1j4N2l8L4m5L8k2OL3m9KL3
1215B3m2O6j2n7J7N9o9JK8l6k3M8l2J2LM4m4R5q6pK8Rm2L3lJJ8o4K9Nj9M2J5n1
1249a1M0n2rO8l9Pn5j5J20k7kl9oq5P7K2M6q4QK6k2Q2l6L0n1l1l3N4L6j2oOK7
1282C4m7L6l7L4o0K8mJ6K9o3k6N2k0KJ18l6K4j36J7R0j6mJ7p7oK0K5o4M6nOK3
1314A6k7O8n0j2p9R5j1LN2m9k6qM1jm1P6o0Jl3N5k2J1j5J3q0R0N0K4j24O1m9K3
$$ y = [-51, -2, 25, 130, 50, 90, -9, -98, -32, 2, 11, -100, 13, -3, -45, -62, -28, 63, 74, -86, -33, 46, 17, 89, 83, -7, -80, 18, 33, 35, 14, 29, 44, -43, -72, 24, 17, 12, -18, -53, -20, 16, 62, 20, -40, 27, 13, 11, -28, 32, 33, -47, -22, -14, -22, 7, -12, -26, -107, -23, 5, 34, -22, 6, 33, 35, -43, 43, 93, 6, -6, -14, 6, -4, 45, 14, -76, -26, 47, 31, 45, -37, 7, 3, 25, -16, -35, -52, -15, -38, -52, -15, 18, -6, -43, -65, 22, 53, -11, -43, -10, -35, -1, -20, 21, -18, -10, 6, -43, -42, -9, 3, -35, 34, 14, -7, -21, 31, -7, 27, -18, 20, -2, 4, 37, -12, -10, 23, -19, 47, 35, -22, -5, 54, -15, -14, 14, -22, -45, 3, -29, -17, -14, 30, -14, 81, -5, -12, 16, 25, -17, 16, 13, 14, 32, -32, -3, 2, -17, 25, 40, -11, 29, -23, -32, 36, -3, 4, -51, -66, 54, 27, 25, -14, -20, -105, -28, -6, 40, -44, -36, -10, -32, 50, 14, 44, -7, -38, -71, -17, 19, 7, 1, 7, 34, -13, 23, -14, 20, -40, -12, -16, 0, 29, -34, -60, -8, -28, -26, 92, 56, 80, -56, -39, 51, 35, 31, 48, -29, -35, -15, 10, -54, -8, -13, -7, 16, -11, 57, 7, -5, -84, 11, 0, 3, 55, 6, -20, -28, 13, 12, -29, 47, -13, -12, -45, 10, -12, -1, -16, -3, -83, 7, 57, 81, -43, 18, -31, -8]
1346hn5K7R3o8o0O5j5j2O8l1k8L4l9M5J2l1Kk2L0Ln6J0O3j8k8J0N0Mqn0J6J6P
1379B6j6K7p5O5k8M6o4J6L3l3o1P7K3Jk3m1K9K3k5j7K3K2ll6J3MK3k8k1K7N3j2
1411D8mk2k3J0p6M5N5k8l5OJ0K9Qk4j6M4m7K6mm0QK2j7L9K6j9k8l2qJ3P1Ok8P
1445B2k6L5j5j6J3J5lk1k0L6k9L7l8J9L6k4K4k4m2lj0P4J1l1k1j6K6m6M7m5K9
1476fPj2K1lQk8NK5j1p6Q7r1M9K0K0Kl3j5M1m3M1J6M1l8o4O4j4L1j5Ko3M2J9p3
1510d4J8L4Kpj6J2j3K8L0m2On7P4o7PMO4o2jM8j3M9r3L1l0P0j9JrooL4l2J2Om0
1546b7P6m5L2m7lJ0m3L1kLrpM3k7mL4nj2l4O3k8K4KKj1o9N1L9q8N2J0K2n5QM1
1581B7Lm9M0o4N4L8n5J4Nk6J7j0J3M0j07M6Lj3O8m8MqO5j07L1L8q1P6ok9k4Q8
$$ y = [-8, -63, -36, 57, -11, -71, -6, -21, -33, 35, 4, -24, 10, -29, 16, 28, -3, -1, -23, 7, 10, -46, -36, 27, 9, -19, -9, 41, 45, 37, -13, 3, 19, 26, 10, 37, -38, 27, -1, 45, -19, -3, 30, -3, -64, 13, 36, 37, 14, -27, 2, 25, 0, -17, 6, 28, 25, -11, 2, 6, 29, 1, -20, 7, 60, 48, 44, 22, -1, 9, -67, -22, 33, 5, -30, -24, -14, 15, 23, -1, -17, 27, -20, 6, 2, -38, -30, -8, -25, 14, 40, 21, -7, -39, -47, -34, 37, 43, 15, 22, -4, 31, 16, 0, 13, 28, 25, 4, -16, 20, -9, 28, -10, 9, 45, 21, 45, 21, -21, -24, -34, 40, 51, 20, -1, -17, 9, -37, 10, -35, -6, 1, -11, 10, 7, 15, -13, -8, 17, 6, -70, 17, -74, -25, -5, 15, 17, -16, -31, 10, -33, 8, 24, 65, 27, -37, 27, 13, 44, 29, 31, -32, 10, 29, -44, -26, 8, 10, 3, -13, -1, -14, 14, 44, 2, 8, -49, 25, -42, -35, -31, 33, -29, -30, 18, 5, 54, -39, -8, -38, 32, 13, 14, 5, -1, -7, 27, -5, 7, 13, -27, 49, 4, 36, -11, -14, -4, -47, -16, -18, -15, -24, -31, 12, -15, -19, 15, 10, -2, -36, 27, -1, 23, 25, 27, 16, -53, -2, 37, -51, 1, 11, 33, -22, -14, 27, 30, -19, 21, -43, 11, 49, -6, 8, 13, -13, 4, -6, 7, 47, -60, -14, -11, -24, 44, -4, 0, -8, 57, -50, -19, 19, -62, 14, 8, -21, -45, 43]
1613D3m6N5j05N5N5k8m8N2m6M6nk1M0m6K3p7J7K4M5J3m5K3pkJ5qk3j6J0K7n4Q
1645b6L2j6nJ9Oj0K4m5j3R5o8J1M4qm5pk1O4k0M7k7m8J7J4J1pq6O3K0n0KqJ1M3
1679A3p1k7J16j2P9r2RMM5k1k3k7K8j7k8RJ3j6K6p4O6j6l1L7j7M2j5L3j3l8%k
1711b0L9J6o6O5l0J7j3Om7O4m6N0m4pJ3l5K6L6o8RQ1j5p5N5Mk8Kk6Q2n1j0N0k6
1744Hnk3M0K6p5l0J10o6M5n4L4J4n5N7k1n9J01k6k4L3%K2n5jm2N4n7PM8mj5L9
1776B6J5k5%km3K0m6N3kJ2l3pJ5j1O3k2L6o6l5O6m8O9n6J5j4N8o3J8nl0J1KQ6
1809E7k7k7m9K1L3KJ0K6o5k0M0J1PL9p6J7j9RK1K6n1N3q9%K6R0k7l9J8L7l3N1
1841G2l6j2k6m5KJ6M7K7jp5J6J7p3N3O4n3J7l7M3NLk5m1O3l0NP2m6j8kj4L5l0
$$ y = [43, -3, 52, -53, 2, 57, 29, -19, 33, -13, 33, 28, 7, 47, 1, 24, -53, -36, -12, 33, 46, 1, 24, 17, 15, 30, 22, -1, -17, -7, 20, -34, -26, 6, -10, -15, 4, 10, 0, 24, -21, -34, 61, -7, 4, 48, 40, -5, -12, -33, 31, 11, 58, 31, -17, 0, 14, 25, 18, -68, -5, 15, -35, -33, -41, -30, 13, -58, -85, 31, 19, 98, 6, 15, 19, 64, 43, 20, -7, 21, 4, -24, -15, -2, -18, 8, -66, 0, -16, -47, -10, -27, 15, 0, 33, 20, -18, -18, -20, 19, 35, -31, 34, 4, 21, 8, 14, -33, 31, -15, 35, -9, -16, -3, -38, -12, 24, -44, -35, 46, 31, -44, 11, 15, -13, -11, -37, 45, -6, -16, 34, 8, 3, -20, 20, 46, -29, -59, 51, -15, 30, -24, 10, 24, -31, 26, 5, -54, 47, 21, -3, 30, 30, 52, -3, -4, -46, 8, -49, -42, 6, 2, -13, 26, 41, 16, 16, 14, -29, -9, -55, -2, -4, 8, -25, -32, -17, -28, 35, 13, 49, -17, -52, 14, -34, 35, -21, -6, -20, 38, -25, -7, -12, -42, -31, -29, 57, 30, 3, -46, -25, 8, 10, 20, 46, -19, -39, 1, 12, 19, 58, -18, -1, -20, -11, 10, 36, -15, 38, -51, -51, -25, 65, 38, -1, 17, 54, 21, 72, 36, 24, -2, -47, -45, -29, 18, 45, 44, -31, -15, 2, -71, -18, 46, -7, 10, -27, 16, 21, 24, -1, -42, 21, -9, -4, 68, 22, 4, 2, -12, 23, -7]
1874gNOp9M0N1J9J5l0mn7N8k7K1k5L8m1Lj2P5q0K5J6ol%K2Mj6j4J7m4N7J9m4k8
1909b6J1M3M4n8J6n1nN5l3K2j2k8KJ9M1j3o8N0K4m3mkMj3L7k9O0k5k2l4J8N4j03
1942f9O5K2J7j3m8L2k9N6nl9j3M8l3Pj5J1NJ7L7n6K2M5p0p6M7P6J1p7MJ5m8J2
1974d2Mj5O3j4J2p3P3j1m0J4jN5k1mJ7n3jL3K9k9O3rp2K4j0k1J6JO6k3J7o0N8
2007D6n3L0L2n8pm9J15o8J5K3l4lK0OJ1q4KlK6JJ9K7o9P5m7k1P7j6qj1j3L7j4
2040Dk6QPJ4K2j7%j4j9K8k6PO2l8J9q2mN5LN3l4n6J2J5N8m5k2J5k1J1j8O6k5j9
2074gj3K9j9L4p1N3Rj8K5n4K8K7l2N3l5J1onn0mP9j2m0J7j6j0lP2r8J0J2j3J9
2107b8jJ7m3P2M5o0LPj3L4j3JJ0l5j8M0n0R3rk2lj9K7om1J0K0L1J0m0J1j7Qj7
$$ y = [-7, -2, 4, -75, -35, 16, 35, 50, 20, 16, -41, 17, -10, 11, -14, 24, -17, -14, -26, 49, -31, -6, 10, 4, 1, 1, 23, 27, 11, -3, 14, -30, 27, 46, 2, -26, -15, 28, 72, 14, 30, -21, -26, 29, -4, 18, 6, -22, -20, -1, 40, 27, -41, 9, 33, -10, -14, -16, -12, -25, 12, -17, 43, 18, -4, -38, -20, 34, -69, -4, 18, 35, 22, -26, 6, -23, 33, 28, -11, -24, 24, -9, -2, -17, -6, -1, 16, 53, -3, 19, 64, -6, -82, -35, 41, 52, -25, -21, -6, -54, -42, -38, -53, 10, -4, 8, -65, 8, -3, -43, -29, -30, 25, 4, 0, 17, -36, -37, -4, 25, -4, 59, 50, -22, 2, -8, -29, -13, -12, 54, 31, 48, -12, 46, -7, 23, 55, -3, -10, -59, 56, -12, 3, 26, -8, -11, 9, 15, 26, -58, -56, -59, -33, -32, -13, 14, -55, 20, -27, -48, 29, 13, 5, -6, -19, 18, 4, -22, -14, -7, 7, 29, 12, 12, -2, -21, 7, -19, -12, 50, 12, 31, -51, -55, 0, 3, 56, 22, -34, -22, -7, 51, 6, -16, -1, -22, -11, -29, 37, 12, -7, -20, 9, -10, 24, -47, 6, 15, -3, 22, -32, -4, 23, -9, 44, 9, 20, 14, 9, -41, -45, 34, 22, -18, -1, -17, -27, -30, 42, -56, -46, -34, -47, -28, -29, -12, -55, 17, 62, 2, 5, 12, -1, 33, 20, 21, 31, -4, -22, 18, -32, 61, 52, 30, 27, 8, 35, 29, -12, -2, 18, 49, 59, 19, 30, 13, 21, 4]
2141DJ7m8L4Oor5J11l1kL0m4J8N4m1J8j5Om8RN7o5M3k4MNL2o3K9rQlRK9nn6N7
2177B5j3k3m2L4J9pPK1m8PJ6MJK9l6L1m6M7q8P1l3qJ1O3pk6nk9K5L2ll8M1m4L3
2212B1m4K9KkJj0K0%k5J2Rj9on3P9j4q%j6Pj4M5L4n5J5o2M3O9p9N5l2J3J6J7o7
2247a9L7m1J8l3P1j3J9pn4pLM6j8l3P1l9k9N9o7P2nn4L8j2k6L7Jm7j0O6L5r2L7
2280DM4l5l9j3K4kM7k4j1N7p1J8K6ql3K3Mqn9N6L4k1J6K1q9P3k2n5P8p4NK5L9
2313C0n0NM1l3LJ4j4l1oL7kn1R9q7kM7K1l5L7m0L1q0O0L2l0N2q5O8j0j1Q0m8j06
2346f4K7M0k4O3rq6P6l3K9l3PL7j2l5J9k0N2o1O8ok4j6J6j2L3m7N2o1K5L4p1Q1
2378D5k0k1M0K1n9k2Pj0%JL4m1k4J05o9L2m0J9l5M1j1K3m1K5qN5m6k0nM6j8l2
$$ y = [4, 21, -27, 7, 13, 7, -88, 23, -8, -10, 20, -24, -6, 48, 7, 25, 10, 16, -32, -23, 34, -31, 12, -12, -8, -3, 29, -34, -5, -14, -6, -9, 0, 29, 24, -32, 25, 12, -11, -53, -19, 0, -7, 0, 21, -27, -20, -4, 0, 1, 30, -6, 25, -21, 26, -62, 9, -24, -32, -21, 42, 35, 9, 4, -25, 0, 32, 29, -9, 32, -12, 21, -23, 6, 8, 6, 7, -3, 17, 17, -8, 4, 13, -6, -12, -65, 14, 0, -8, -8, -24, -17, -31, 14, 48, -7, 8, -54, -11, 58, -21, 34, 2, 15, 31, 48, -19, 18, -23, -5, -38, 33, 20, 39, 32, -22, -29, -26, 20, 2, -31, 40, 1, -28, 31, -36, 36, 31, -23, 15, 3, -23, 14, 15, -32, -42, 24, 59, -33, 4, 48, 13, -26, -39, -15, -17, 30, 6, -5, 52, -19, -1, 25, 17, -16, 7, 11, 3, -56, 0, 34, 13, 29, 50, -39, 34, 12, -43, 35, -39, -34, -9, 30, -20, -15, 26, -7, -4, 10, -4, -35, -41, -4, -6, -57, 42, -45, -47, 0, 21, -14, 23, -17, 14, -66, -6, 26, -4, 48, -37, 31, 21, 10, 90, 42, -64, -37, 3, -21, 42, 33, -53, 23, -10, 19, -14, -7, 30, 18, -17, 2, -18, 34, -27, 41, 35, 11, -5, 11, -1, 32, -15, 37, -24, 1, 35, -36, 45, 25, 4, 44, 65, 6, -16, -9, -19, -19, -18, 16, -25, -49, 56, -13, 19, -21, -2, -37, 4, -7, 16, -25, 0, -8, 47, 1, -19, -24, 22, 4, -28]
2410b8J7j2J12q2j8j5k1J6L4J1o0K7K7Mjj6ol3N7k1k7N6n3QN9n8MJ4k3O6j2Po9
2443c6J2L3J9n4k5K2kM9j9j0J3j4Ok3J1L2Pm2N0j8l0L1kK8k5J4JJj8l0O4j5k5
2476Ej3pl2R5l8jp2j3Q3q6P5K4j1pj4L6J8n2K0MqJ2PjJ4n6QL6Pk4l4N1k4J8k9
2511ik7M9l2L9l6kK7j7rN0l5K0m2L1l3oL4j3nOj7M9l6oK4K3k9pOpK8j4Oj7LM7
2547D3m0K2k8j9L5J8p4J5P1m1j3L6l5J5k0Jj0jM1k6J7Oj5k9N1Ppk6K1ol1OJ9K0
2581B3mrOJl7J1nL4L0q1qJ4K5pN9j1m6Pk0rM2j8RqL5n0KM8k8l6M4NMl7L2M2j08
2618d9j9O4L7o0P9l5l0L5l5J3lP1q0J2l5O1m5l0L8L0j8om5O4l0L8j1j0k4O7J3
2649E7o2m0QK3q3O5j2J06o2n3L7OPM0l7K7p9N7l1L1J6n9P7n9j2L2L6m6M0p5N6
$$ y = [-28, -11, -23, 89, 7, -11, -26, -47, -31, 3, 14, -46, -19, 8, 12, 11, -5, -11, -44, 13, -8, -35, 21, -32, -24, 35, -23, -19, -5, -28, 38, 26, 33, -36, -24, 9, 28, -26, -51, -29, -31, 18, -1, -11, 2, -12, -6, -29, -18, 14, 21, -21, 29, 11, -19, 12, 10, 38, 13, 27, 28, 29, 11, -19, 45, 30, 5, -8, -15, -47, 48, 10, 9, -63, -76, 7, -79, -4, 20, 9, 2, -12, 24, 42, -10, 10, 14, 6, 18, 25, 24, 38, -18, -10, 26, 33, 9, -25, 26, 2, 20, -9, -36, 13, -19, 20, -16, -18, 9, -8, -17, 33, -2, 18, -24, 7, -26, -32, 2, -11, -16, -10, -27, 22, -14, -20, 4, 27, -2, -9, -3, -10, 18, 4, 10, -7, -4, 43, 3, 25, -3, -22, 13, 31, -43, -28, 43, 2, -11, 25, -10, 5, -15, -14, -24, -25, 16, -10, 7, 13, -2, -31, 20, 27, 20, -6, 15, 9, -22, -16, 3, 23, 19, 10, 16, 17, -20, -9, -14, 20, 50, -31, -39, -25, 0, -7, 52, 41, -5, 2, -18, -27, 15, -3, 6, -2, 33, -17, -15, 33, 5, -31, 13, 18, 22, -15, 17, 59, -49, -68, -4, 33, -27, 52, 17, -13, 22, -13, 0, -3, 68, -12, 0, -35, 26, -19, -49, -11, 19, 1, -5, -50, 14, -16, 22, 11, 1, -23, 44, 57, -5, -45, -37, -14, -97, -32, -44, 62, 0, -53, -16, -10, -3, 37, 0, 27, -52, 5, -26, 5, 21, -38, 39, -20, -32, 0, 36, -10, 30, -45, 11]
2680A1j4l2Qm1R1Nm1k6N1K2o8M8j5j7Kk3L8l7L8l8k3N4J8nL8l1J5j6K2m1K9J5
2712C7o5QlRJ9m6P0no8J0L8qrK6m7MJ6rO3Or1M3OM4q0N0pk7J6J2j2m5J8M4n7P2
2748C2k5K7k1mj8k4LJ2POJ9RL4n8Oj6%%l9K3R1p0Pk0K6k7NoJ3k2%Q4o6kL7L%l8
2786a2L6o1P5j4J1m7L6l8l4K6L4q1M9NL0m3K5n1O6kl3PKJ8pJ6k7L1p0J9ML3nk6
2820b8L5jj0KOK5jk5Q1q8l8L6J2L0n0qM2j6J4m0M2o4O8p7J05k3m8pMJ04j11O1
2852C2lj1Orm0L9l7O7m0L2m2K3m0O0o2K6o5K3N1J6qqM2j1J2n9J0J4q5J10M3r2
2884fJ2o3M0L7o2L5K5k9j1nM7q7J7mO0j0J6J3J3km8p1R5m6P4p1J4N2n6N1Qo3L1
2917FJ3k9KL2k3k5MM8l8j0qK0l0j1L0L6K8l5k4kRL7K7o4k5N3k5Q0r0R4p1l1N8
$$ y = [11, -3, -35, -27, -68, 23, 28, -13, -39, 12, 34, -34, 14, -1, -18, -16, -39, -1, -38, 0, -38, -61, -7, 11, 6, 44, 13, 28, 12, 34, -7, 22, 37, -28, -20, -23, -14, 5, -41, 29, 24, -44, -34, 4, -4, -13, 13, -34, -30, -14, -23, 40, 46, -45, -2, 4, 48, -32, 18, 11, -16, 0, 12, 0, -45, -27, 17, -40, 32, 7, 34, 13, 9, -9, -33, -30, -18, -11, -5, 14, 23, 57, -1, 5, -11, -11, -11, -50, -27, 64, -6, 1, -19, 7, -20, -15, -21, -8, -30, -30, 54, -12, -14, 23, 26, 26, -12, 24, -37, 38, 24, 35, -12, 24, -14, -48, -22, 12, -69, -20, -15, 15, -28, -3, -54, 12, 10, -23, -16, -14, 4, -3, 13, -14, 17, -53, -34, -30, 3, -2, -28, 7, 6, -4, -2, 4, 29, 28, 3, 84, -4, -42, -6, 6, 36, -14, -22, 20, 4, 18, -22, 20, -44, 24, -53, 52, 29, -19, -26, -22, 82, -29, 32, 29, 18, 24, 15, -25, 14, -23, 44, 4, 36, -6, 17, -23, 37, -25, 1, -64, -41, 10, 26, 18, 10, 52, 41, 53, -6, 4, 18, -67, 43, 86, -6, 6, -57, -17, 20, -42, -7, 18, -11, -22, -27, 20, -67, -50, -54, 6, -4, 12, 25, 38, 36, -12, -83, 12, -34, 40, -31, -17, 35, -21, 30, 38, -25, 6, 19, -10, -8, 24, 1, -24, -20, 28, -10, -20, -28, -8, -38, -49, -19, 17, 45, 10, -14, -16, -7, 30, 57, -7, -32, 21, -4, 76, -14, 80, 9, -22, 36]
2950C6m3pL9l0O2n2k5N0po2K0L5%l6k3L9OL7m0m2OO2p1O3k9o3KM4K8k8M9n7L0
2983gl9k5O2J9M0p3O7nLp1K9m8P1rm7N5n2P3j08O4m9P3m3L4rJ4plM4q4J01r6N9
3016C3k3n9N4l9L4k5Q2j21O8nnl7J9O5l1l3l7O7O4m9jo6M1M9n2Kj9K3mj2N9J2
3048E4J0o7j4pJ5N4j10O5qk3L7rL4n5L3J1o0M9j4l7R4q8L2L0j9O4o5l1N3lm6O1
3080D0r2R2j5J4oj0j1L5k8J0K6q7L7K5Rq4N0rj9J9M1pp3N9lk6K4l2m8J00j2o8
3112d9O0o1LM5M1j01P1%k6pO2k7N6q0j8QR6p0L7m0k3OrP1p7J1N0m8K3m4j6O7k6
3145a5K8k2jK1J5l3m1M3rj5J8l2J2KM8j6N2q8N2Nl8N3k7K4m7J6J4j4%l0J6L5l
3178B3k5M3m4l6M7ml9N2M5l9q0L3JOL4o7LN3O%J7k7K6k6o1QJ27p4K3J4m4N1k8
$$ y = [36, -7, -14, 25, -5, 57, 5, -20, 30, 23, -39, -19, 16, 16, -20, -43, -4, 2, 39, -1, -43, -37, 25, -46, 17, -12, -75, -73, -29, -1, -29, 20, -37, -7, -46, -71, -9, 10, 50, -23, 44, 39, 42, -29, 0, -48, 23, 14, -33, 22, -30, 43, -65, -1, -50, 23, -20, 14, 5, 19, 12, 9, 53, -31, 70, -26, 33, 10, -49, 5, -34, 0, -25, 57, -64, 4, -1, -6, -43, -24, 41, 10, -23, -60, 7, 71, 22, 21, -45, -4, 45, -7, -5, -24, -1, -5, -17, 42, 54, 64, -3, -17, -24, -9, 45, -65, 0, -8, -31, 6, -3, 31, -24, 9, 20, -40, 9, -5, -42, 52, -36, -4, 26, 7, 71, 6, -25, 28, 25, -21, 40, -52, 40, 25, 39, 33, 23, 12, 47, 19, 29, 55, -32, 5, 30, 39, -45, 5, -4, -23, -4, 37, 30, -43, 16, 13, -13, 11, -21, -69, 31, 19, -49, 11, -50, -47, -2, 39, -62, 9, 9, -17, -24, 38, 11, 67, -13, -31, -23, 73, 3, 40, 0, -23, -17, -26, 45, -32, -21, 29, -19, 4, -40, -56, 11, -15, 13, -9, -10, 11, 26, -7, -48, -5, -14, -29, -11, -43, -31, -29, 19, 3, 55, -33, 19, 24, -14, 39, 12, 36, -11, 5, 19, 5, 5, -25, -9, 26, 23, -2, 41, -3, -39, 8, 4, -35, 17, 62, 23, -57, -24, -23, -17, 17, -50, -47, 6, 12, 12, 29, 2, 28, 2, -59, -51, 76, 2, 25, 39, -5, 46, 18]
3211A8k9l2P1J4n2L4l7rJl0O6l5k2jN7l1N4rl3L3p3R2l5JL0p4M2J0k7mL2Kn5K0
3245a1O7o9K9ok0K3j6j9QPNK7J0n7LM3K1o8k7K3L6mm6j8qN5L6nl5j3L0j0pl8N1
3280cO0l7%j2Qml4M2l9nL1K5J1o2K8K6j5n8M4LlK9m8k8lO8o5M1rj0K1qnl3J2J1
3316b1K2M6n6qJ5j2M6j9mnK9L2l6l0m2P7k8qM0k4n1M8j6oQ6k0l6j5J5n6N1p1K0
3349c7M2K0Qn6J9Km4L6J5l2L8k3N1m0j%L2j9K6n4j1Qmk0R4o8lJ%M9q8Q7l5k3L
3384b7jQm6O2l6J7M6n6L6l8N5j7l3K7M0k6j9K0L4o8M0o3O2m5P4m3j1J2k0O2j01
3415e5J5L7m6L8K5M2o7j1K0J6m2lL1N7n9k6L7Jj00L7R3l8l1P4Pl9n8rOQ1p9K4
3447b2M5rn3M5M1k8j3o9O1j1mM8m2O3j6j5qKk8K1K1k6n0M6K8p2J1L7pn1O4j2O7
$$ y = [18, -11, -43, 28, 42, -10, 24, -13, -22, -21, -51, 15, -20, -42, -43, 14, -17, 37, 28, -5, 28, -45, 47, 12, 13, 43, -31, 11, 21, -6, -10, 22, 24, -31, -11, 56, -13, 16, 10, -10, 13, -3, -22, -14, -7, -2, 25, 35, -22, -19, 24, 45, -23, -50, -27, 9, 5, -41, -59, -67, -12, 24, 19, -16, -29, 1, -9, -16, -54, -3, 57, 20, 20, 8, 16, 12, -22, 20, -19, -24, 7, 32, 43, -19, 9, 35, 20, -38, 6, 9, 6, 35, -13, -41, -44, 24, -41, 0, -9, -19, 2, -6, -11, -44, -32, -21, 1, 47, -9, -17, -2, -14, 32, 13, 9, 4, 33, 65, 29, -1, -43, 34, 6, -2, 38, 14, -37, 11, -5, -11, 75, 55, 19, 4, 19, -37, 14, -57, -37, 5, 25, 33, -23, -4, -2, -46, -10, 5, -27, 11, -12, 39, -1, -2, -2, 30, 11, 37, -17, -28, -20, -24, -44, 50, -18, -21, -20, -20, 29, -59, 28, -7, -30, -27, -28, -20, -66, -4, -40, -23, 23, -33, 3, -35, 20, 3, -30, -3, 37, 11, -8, 12, 46, -22, 18, -45, 17, -28, 46, 3, -8, 4, -16, 46, -55, -40, -3, -49, -11, 14, 56, -11, -22, -2, 14, -28, -31, 0, 57, -2, -28, 9, 10, -90, -53, 40, 2, -29, 45, 52, 13, -45, -54, -48, 33, -46, -22, 23, 14, -39, 6, 47, 19, 6, -63, -2, -13, -17, 31, -11, 52, 36, 21, 13, 15, -13, 8, 29, 3, -47, -1, 27, -45, -34, 3, -4, -55, 9, -3, 64]
3480F4q4L7l2O1J5r2N7o6N7LmonL7jq3N5ORj6oJ2j3K8m8RJ7Km8O0%n6J0K0J1k8
3516a8lJ1nJL7m3l7N3Ml4M2LN8q5%N1j0k1L0J7J8o9pJ9j7K1Rj0JL8p2M1k8KJ6
3551A3o0J3Jo2J07rlJ9K9qr0J5M8n7ML0K5n1N1j9k1O6q3M2j8nj4L6M4m7J8oj8
3584a0M9l9k8J3j8RM0jN9j01N0ll5M3m5L3o2K4MlN2m8N1p9O2j8m8M5l6Q4k3j1
3616A0l3M4l4J4mk4J5K9n8J06r9M5oL2o9L5J2on3nP5q0R5m3lPl1J8Pj1J4l7l1
3649f9M9J5K8J7m9L2k0K6k8j2RK1qJ0oj5K0p4O8l5L6m0J5K8l8P6r6K6K5l6J6K7
3681A8j7QK8Nk2n6Q4l8k6lL2j7K7m7K3m2L7m1Q3j4m1L0mpK7j1L8ok9Lj4K1OMJ8
3716E7l5j1l6j7N5kk1Ok1J4j5J6L0j2k7k5N3k3mnM0k6N8r4M8K0p1Q6q5Q1o6O7
$$ y = [64, -20, 17, -15, 46, 61, -31, 26, -40, 17, 20, 16, 10, 5, 42, 41, -42, 13, 19, 28, 12, 6, 18, 5, 33, -15, -6, 11, 13, -35, 25, 25, -31, -21, -1, 10, -18, -21, -10, -15, -14, 23, -20, -57, -4, 0, -34, 8, 11, 69, -16, -16, 35, 25, 4, 34, 51, 69, 0, -7, 12, -5, 16, 25, 15, 16, 54, -18, 23, -5, -3, 13, -47, -34, -33, -95, 12, 3, 0, 19, 48, 40, -50, -35, 13, -44, -40, -10, 15, -36, 15, -4, -25, 41, -42, 0, -18, -23, -37, -1, 43, -4, 14, 8, -10, 39, 0, -28, -15, -33, -24, 16, 15, 74, -27, 23, 20, -15, 28, -17, 16, -46, -22, -18, -21, 31, -17, 34, -45, 17, -1, -49, -4, -40, 44, 21, 10, -23, 21, -13, 1, -3, -27, -12, 17, -41, 65, -34, 11, 5, 37, -32, 3, 15, 9, -44, -49, 26, -54, 41, -2, -5, 2, -29, -11, -4, -15, -1, -38, -69, -20, -5, 23, 40, -9, 23, 3, 29, 1, -11, -2, 19, 11, 21, 15, 0, 20, -54, 14, -21, 15, -25, -10, 18, -20, 56, -40, -14, 11, -25, -9, 18, 1, 9, 37, 42, 20, -36, 48, 10, -16, -19, 13, -4, 23, -24, -1, -43, -6, -47, 36, 22, -19, 11, 7, 0, 27, 16, 54, 48, 19, 22, 8, 29, 35, 39, 57, 22, 11, -25, -42, 13, 11, -10, -4, -25, -11, -26, -10, 20, 8, -19, -44, 9, -14, -18, -23, 17, -9, 49, -45, 3, 23, -48, 38, -47, 34, -32, 35]
3748C5m4m3P5l0J8L0K8q7J2l0O2j7l4J2k3K7J1M2nl0m2N4k6o7M8j1K7k3O3k8j3
3779in2P4l2L3m7O7l0J2mNNl6N9q8P1n6J7J8l2mNK8l8rK5L1n7nL1l2M3jl2L6k
3814fj3J5nk9O7rl2K1j9L8MJ6j11O6M1j01L3O1j1j8m5QJK0o5N0nJ8rK7M1m3j4
3847ho1P7m0K6K3J2rPJ8o3L8k4J5rK0J3K2n9M0l1Po0K0J3N4n2k7j2Q5k7J9k1L2
3880C8j4k0m2K1J3K1l9L9jjqjK2Kl2J3Rk6J4ql3M1m6N8nj7pk3L8k8N4k9M6p0O
3915a5K0J6k1Q4l2j07P3l8N6k3Mm9L6l8L9j7J2k6K9Ll3kO0o8K1K7l3lNk0L3K6
3947A9j0K5p6Q7j2j9%om7M9k1M7j2J0o5Q2Jo9P1m9K8n5j6MN8j9J1J1j0k6J1j1
3979iJ2M7n6JM7Jk2L3m8L3m2j4k3L2L6n0M0J1l6L7K1l3rJ2pJ1j0m0J7O7p5J6m9
$$ y = [35, -9, -52, 23, -7, 11, 41, 69, -18, -6, -36, 26, 9, -25, -13, -36, -9, 2, 44, 39, 9, -33, 21, -5, -72, -24, -35, -8, -31, 32, 4, -9, -61, 13, -19, 14, -33, 34, 4, 16, 12, 17, 22, -14, 45, -43, 28, -28, -11, 7, -25, -29, -24, 4, -34, -43, -18, 13, -44, -49, -18, -50, -7, -8, -40, -4, -6, -19, -4, -9, -38, 29, 20, -12, 9, -10, 28, 32, 48, -63, 3, 44, -57, -24, 37, 26, 8, -37, -29, -28, -8, -73, -23, -28, -10, -19, 8, 49, 6, -8, -69, 8, -32, -6, 17, 29, 20, 27, 45, -18, 20, -4, 11, 2, 22, 35, 57, -2, 38, 7, 14, -46, -26, -13, 41, -11, -38, -50, 35, 8, 27, 6, 38, 24, 4, -38, -17, -4, 17, -22, 17, 16, 15, 7, 6, 28, 30, -2, 11, 20, -6, 8, 0, -33, 8, -38, 20, 15, -2, -9, -32, 6, -22, 32, 3, 49, -21, -15, 5, 21, 0, 84, 52, -55, 18, -20, 36, 13, 17, -32, 4, -34, 5, -12, 0, -26, 3, 6, -27, -29, 31, -37, -16, 11, -22, -25, -20, -40, -7, 19, 9, 34, -42, 45, 33, 14, 14, 8, -39, 10, -11, 36, 24, 34, -31, 51, 52, -17, 54, 5, 33, -22, -38, -34, 24, 5, 16, 27, 17, -9, 2, -9, 3, 50, -6, -5, 42, 43, 21, 54, 6, 39, -3, -17, -40, -8, 28, -22, 18, 29, -7, 30, 51, 18, 9, 21, 14, 25, 15, -25, -8, 59, -16, 0, -49]
4012d9O8M7j0r5L6Pm9J00r5J4N1n2%J5J6J7Rk3k9rP9q6N6J8p0Q0o7L4J3O4q2J5
4044B3j8mm6O6m3J1K1l3NL6k5M3l7o3M2j2K9m4L6K8j4M1p2K5J6j6J1K2l3ppRr
4077a9N2l9RK7jk1N9j14O0L1m2n6K7J0N8m1n3K6L0J4k5K9k8Ok3J4p5R0k4nj6j2
4109e2P7l7rM7M5p4MMJ7k7j8P0j1j5k0l0M0J9Jj7K3l5J5m0N5Mj2j4J7l0JLk8l7
4143f4N2M2mj6J2k6kK3rL5o0N8m2k6pR0p5M6J1n5M7k6j8O3k9l4k2Pj4K1O8j11
4175f5P7Mm3L9k9j0J8l6M2n8Q6rn5K3j4N8k0K7mm3L9K3m9nJ4j7NN9j02PL3j8%
4208b3mR1o1J7j1J0n3M0nJ2ol4j8L2M5j05KN5J2L4k1k3pj9K2rN2NQm8jk1N6m7
4242b3M7m2K3J6Kn0j0NM8pn7M3M3m1M2l6l0K4J8o0ON5l8Q0n2j8Rl1K0K7l1j4M8
$$ y = [-49, 19, 66, 56, -39, -3, 4, -45, 55, -40, -26, 25, -27, -27, -12, 4, 21, 30, 7, -22, -31, 48, -38, 18, 36, -34, 46, -21, 13, 26, 90, 8, 23, 5, 1, -45, 21, -22, -11, 10, -23, -18, 18, -7, 36, -1, -64, -22, -34, -5, -49, -13, 15, 1, 42, -30, -5, 11, -5, 6, 28, -5, -12, -19, -10, -19, 33, -6, 3, 30, 29, 8, 67, -47, 13, 44, 2, -54, -27, -17, 41, 0, -53, -27, 3, 17, -8, 21, -7, -1, -24, -10, -85, 5, -19, -24, -40, -52, 25, -12, -21, 26, 71, -3, 1, 5, 22, -5, -23, 47, 36, 21, 1, -29, 11, 30, 31, 14, 37, 2, 17, -23, 32, 36, 24, 10, 27, -3, -2, 1, -27, -64, -12, 30, 26, 10, 22, -4, -6, 17, 8, 43, -17, 41, -1, -27, -34, 56, -19, 27, 38, -17, 30, 4, -14, 49, 20, -14, -36, -29, -43, -22, 46, -65, 12, 16, -27, 12, -17, -27, -9, -45, -3, -61, 25, 16, -39, -16, -30, 28, 8, 35, 31, -12, 27, 50, 1, -4, 10, -7, -2, 57, -45, -38, -5, -23, -23, -27, 64, 3, 20, 9, 19, -34, 6, 1, 13, 7, -27, -45, -13, 32, -73, -71, -16, -4, 30, 9, -14, -21, -40, -18, -27, 25, 30, 38, -10, -11, -32, 24, -23, 24, -18, 5, 21, 23, -27, -37, -32, 16, 9, -48, -5, 38, -3, 39, 3, -27, -3, 15, -45, -39, 16, -22, 58, 6, -12, -3, -34, -14, 13, -18, -32, 16]
4275A6n5mP1L2l8K0k8M4n6K8lm7O2m2k8O3j4m1K8j1m9N2L2m2Nl8J7lm9N3M3m5
4307b7K7jJ8k2m0N0J4m5K8k6L5j1j1m7K7L2nJ1n0J8mK4K6j1l8M0j1OL4m1K4m6
4339b2M9jm4J14j45K7L3n0Q1p6L6l7O9m2m3P2m2j7j2J7K9o6J23p6L1j7K1pkk4
4369b1L0k3P6m4l6K6pRKO8p6J2n6KM1j6Nl6M2n7K4N7j8m9mM9k9J3J4J7p8J9O3
4402A9Nn2M9J9%m5J9jk2P1m8lj4k1NK4J5kJ5j7l6L6rL1n0jk0J0j8K6M6p3N3l2
4436b1L9Rl4n1K2K5L3l3K1q4Q4on9J07j6l8L7n1J5Om4K5JQ8p7K1k3N9Lo6P%Pk6
4470b0O3r4J4J7Pj9K3k3J21j59Q6J5q5O0k1j3O4Nnk0J8Nn6j4N4Kn7L3KN%Nl3M4
4504B4Kn2N4ml1k3J1J1L2n7K5j2Kk1N1l6Q5n2l5JJ6k3O9o2K6k1K8j5K0k4N0ml6
$$ y = [16, -39, -43, 28, 60, 22, 42, 14, 58, 2, 30, 27, -20, 42, 0, -28, 35, 21, -20, 8, -3, -52, 0, 32, -10, -5, -43, -26, -29, -78, -25, 18, -27, 0, -1, 17, -5, -45, 5, 19, -26, 2, -24, 11, 0, -11, -58, -31, 1, -4, 7, -43, -25, -29, -5, 21, 10, -28, 12, 1, 7, 41, 0, 24, -22, 27, 26, -18, 96, -49, -22, 11, -39, 42, -34, 2, -35, 34, -8, -51, 21, -21, -38, -50, -33, -4, -70, 53, -23, 8, -9, 12, 5, 3, -21, 9, -14, 62, 18, -18, 8, 1, 10, 12, 80, 4, 16, -40, -38, 3, -13, -8, -44, -2, -59, -35, 22, 4, -45, -49, 0, -29, -16, -2, 15, -63, -44, 19, 24, -28, 21, 40, 40, -5, 14, 13, -9, 62, 14, 11, -3, -24, -19, 5, 20, 18, 33, 16, -20, 16, 7, 38, -12, -13, -33, -23, -41, -15, 31, -42, 11, -21, 18, 27, -7, -58, -36, -11, 22, -11, 10, -74, 10, 4, -55, 52, 36, -2, 35, -16, -1, 5, -39, -14, -13, 75, -2, 19, -4, 55, 58, -8, -1, -1, 6, -20, 43, -51, -37, -20, -13, -32, -9, -32, 89, -70, 16, 31, -54, 6, -15, -28, 36, 41, 36, 16, 34, 39, -17, -31, 23, 25, -32, 1, 3, 8, 8, 13, -20, 24, 26, -26, 28, 24, -7, -30, -19, -8, 24, -33, -8, -20, -18, -39, 12, -24, 61, 9, -26, -25, -9, -32, 37, -25, 1, -20, 8, -7, 13, -11, 39, 35, -1]
4537aN0m0Rmk5n4P9j2o8Q7j5PKj2j5J5K9l3k2L0Pj7J3Lojj1L3n1lj0J04p2j5L2
4572A3n3m7J18J0k6l7l6P2J7m2L1J9m2L6K3n7J0lO3q1NL0pj3L0m9n1L5M6j6l7
4603c9OK5k4L5oL4k8p9O2J5l6J8J5Kp2P8O0r1O1rNlM1l4j9K4o4%K8k6NO8n4K5
4637B3l8J8k6j0R3q6kOK8j9K1m0j5O4Opl8J3nrN7%o9O7j8L1k6l2N5q5R4n0J7K9
4671D7m4NnJ6l4j2N4kl5OkLK2n6L7l4L5O0l3o2M9Rm7J7J0K3M%lqk1k6L6J7l7K7
4707A6n3O9r5M3M6n5J8k6M5n2O6lKp0N2m5P2k4qK2j02L4L3K8J3RjL7j06j3O7R
4739B8q9Q6%k6N5l2Pk7m7R4Pn5J4k9j4K3%j8JL7l1k2N6l1k1lK4k4m2Q6Rl6lL0
4773GN0r6O0q2R2l1K8L1k4Mp0L6j8%L4J1k3K8k5N9p2J7J5J6p6M1LK0ol5n3L2J2
$$ y = [-1, 49, 9, 18, 14, -11, -65, 14, 2, -66, 21, 6, 13, 15, 3, -12, 3, 32, -1, -23, 7, 14, -3, 10, 13, 7, 6, -5, 28, -23, -26, -36, 68, -4, -19, 13, -40, -87, 31, 41, 15, -22, -58, 14, 31, -11, 20, 39, -3, 33, 56, -1, 9, 6, 69, -12, -7, 23, 16, 3, 33, -16, -67, -32, 14, -2, -39, -33, -8, -32, 3, -3, 31, 3, -76, -14, 1, -35, -17, -2, 0, -72, 6, 66, -25, 36, 27, 32, 29, 70, 36, 17, 41, -23, -23, 5, -21, -16, 52, -2, 23, -15, 3, -23, -33, 60, -26, -28, -22, 6, -13, 8, -32, -47, 17, 23, 16, -22, -9, -14, -23, 34, 34, -35, 32, 14, 45, 19, -13, 42, -43, 51, 1, 18, 47, 3, 8, 3, 19, -15, -27, 27, 25, -10, -4, -6, -3, 19, -37, 0, -34, 1, 61, 28, -34, 15, 24, -23, -6, 4, 27, 31, 31, 28, 20, -1, -27, 9, 26, -11, 16, -37, 32, -63, -20, 26, -29, -11, -37, 8, -44, 22, 19, 21, -49, 3, -42, 30, 6, -2, 20, -82, -48, -15, 13, 26, 35, 34, 71, -35, -48, 19, 28, -61, 25, 25, -1, 54, 22, 29, 2, -45, 49, 56, 1, 15, -14, -28, -5, -5, -23, -22, 15, -16, -38, 18, -13, -34, -37, -13, -37, -79, 7, 16, -20, -23, 7, 57, -39, 21, -61, 31, 0, 28, 59, 35, 39, -31, 5, -13, -13, 21, 32, 9, 37, 12, 71, -1, 16, 31, 47, -29, 12, 15, 35, 29, -6, -59, -27, -15]
4806a5j4L1M7j22M2L0m0K8Lj0K7l1K9kPj2QJ2Jk4j2K8K3o2R0p3L4Lm1K2J3jl3
4839a4J5J9k3m4M3J4k3Lp3J26n0k1K1Qm6N4L2p7oN6Nl4J1p1L4M2oN3n7j2M3l8
4871a6J3j3N6l5Rn4M1m7P7j9k2K9J7no2O9k2l2J4l6K1l4M4Rl0jL7Mm3j0RO8mk7
4905Em3K9k0JJ4K6l2L7L6l3Qm7j3M8k9mP8n9J9j9K4q%k1oL3n4P6k2k3j6M0m3J7
4939aj0o2L8K5j9M7rJm3oK7m3R5k8ol5O0j4n4P6jjnl0J2k5L9m0j4lK4knM1n3j0
4975c4O8n0%j5J4M7n2N0l2lPL1l6M3l6l0O6Km4O3p3j3Q3m8L4J7l0J4o6N9m3J8
5007A1K1pkk1j5k4R9r9M5m6P5j7m7J6j2K2m3R2n0J7m3M5Q3k5p0j3L8k9J1jOn0
5039c3J3%mpM3O3q5N6Mnp0j1J3m0L7O7o6M6m0Qk4M2J4j06J16k7m4M5p5J4P4k2
$$ y = [-15, -29, 2, 49, -73, -31, -1, -41, -13, -10, -20, 7, -24, 5, 3, 10, -2, 6, 18, 19, -5, -17, 11, 34, -28, 62, -11, 23, 26, -15, 7, 20, 19, -14, 1, 20, -3, -47, -4, 10, -13, -10, -83, 43, -7, -28, -7, 1, -45, 9, 41, -36, -42, 14, 19, -15, -4, -75, -41, 1, -5, 48, -9, -21, 22, -16, -3, -16, 40, 5, 14, -40, 1, -46, 31, 12, -10, 19, 36, 31, -31, 38, 16, -16, -2, -38, -17, -51, -7, 2, -28, -29, 8, 12, -31, -41, -32, 36, 32, 5, -38, -9, -29, -28, -14, 12, -20, 17, 53, 20, 28, -19, -32, 16, -13, -17, 61, 2, 21, 2, 26, 18, 18, -3, -9, 24, -30, 46, 24, 1, -15, 25, -18, -1, -11, -73, -35, -10, -29, 18, 9, 10, -33, -39, -12, -55, 40, 12, 6, -29, 31, 17, -37, 39, 38, 37, 32, 2, 14, -11, 28, -12, -26, -29, -5, -7, -12, 29, -24, -34, 34, -16, -16, -31, -17, 30, -22, 28, -4, -7, 0, 31, -5, 38, 2, -28, 38, 40, -4, 59, -14, -27, 56, 8, 42, 59, 29, 43, -23, 36, -7, 11, 32, 25, 23, 2, -13, -37, 62, -37, 8, -38, 37, 20, -27, -11, -23, -1, -44, 48, -2, 15, -28, 17, 100, 75, 5, -8, 30, 1, 12, 11, 17, -33, -20, -20, -24, -31, 12, 75, -10, 46, 50, 45, -25, -36, -23, -63, -26, 41, -25, 21, -19, -11, -35, 7, 21, -85, 31, 4, -40, 5, -70, -56, 18, -4]
5071dK7llk4O3k7j6%L0n4L3L8nj5Kk9M0k4k3L7p4O1l9j1K8K7l6lJ2k3M7l6Pl4
5105c1M4l6K4J0n8M8l9K7NPlO5j06Q5j6l3OrR0r7J1lj8LJ4mj8M4k5l2M9j1l3L7
5139cQm6L3k5J8%m6M3K1J7rK8k7K0Lm0j0J5k6O7on4J3N2lJ7o5O8k8k2L0m3nK0
5173A5qj3RqK7j0k9K2p1O1K1M3r5L0k5j6N7o4L2J8j6K9k3L9j4k2Q2n9lJ9qJM1
5206F2o1j5J1J3k9L3m3O5k3n2L9J4k3m5P2n9L7L9n2NN8p9j3k6Q0j5qPj5J6j5J4
5238hM3n4J9N8n3J1Pk4Mj1j5M4j6M0J1o3J0q3Q7Q1o8m1J3J3n1R7j02M9Q0j03l
5269b8P6r2O9n4mQL0L7n1K7m8j2M5%Qk4L9j7j8M7o1L6j0k7J3L5k0k1N3n1k7O1
5301A9pk1k9J8N5Mm0j1L4k8k5K9k7K5NL1k0N7p9K3J1m9L2J8q6N2j9P3k9K1m4o6
$$ y = [-4, 23, 20, 17, -7, 56, 29, 13, 13, 43, -11, 22, 60, 55, 40, 42, 13, 53, 29, 6, 43, -31, 30, -9, -20, 8, 35, -1, -4, 8, -15, 32, -4, 3, -31, 13, -23, 1, 11, -47, 1, -38, -11, -6, 1, -2, 63, -43, 42, 26, -7, -1, -10, 80, -17, -6, -9, -27, -24, -10, -14, -32, 12, -13, -45, 4, -7, -40, -3, 5, -41, -8, -33, -15, -15, -61, -18, 3, 20, 11, 39, 12, 32, 35, -5, -15, 0, -26, 41, 35, -19, -6, 46, 43, 60, -5, 63, 35, 13, 43, 0, -5, 15, 7, -6, 3, -5, 22, 12, -17, 5, -66, -5, 16, 59, -36, -6, -31, -47, 10, -54, -22, -4, -20, 9, -14, 25, 11, -11, 71, 12, 9, 28, 20, 21, 62, 1, -14, -3, 10, -19, 14, -29, 36, 13, -39, 0, 14, -9, -54, 18, -41, -4, 35, -17, -12, 46, -33, -46, -72, 8, -7, -15, -8, -23, -7, -22, -8, 35, -19, 0, 58, 5, 16, 23, -1, 3, -8, -23, 21, 5, 45, 56, -7, 3, -80, 7, 88, 20, -21, -8, 5, -46, 51, -51, -2, 78, -25, -28, 48, -44, 25, -29, -33, -25, 5, 42, -9, 18, -30, -42, 3, 3, 11, -13, 26, 9, -9, 38, -23, 13, 3, -24, -11, 24, 4, -17, 36, -15, -42, 19, 12, -9, -38, -20, 35, 39, -1, -12, 22, -6, -31, -2, -29, -4, 1, 32, 12, 69, -10, 13, 24, -25, 7, 25, -61, -9, -28, 45, 16, 37, -7, -73]
5333g3J36J5k6r3M1l6K1M2J1j2n8M9K4r0L2J6j1L2m7L4K8k7Qp4N2Q%pl5P8l9k0
5365b1L3%Qpk1l3O8J0L6k7k7kn9R4m3M9o3k0L9k1kK0k7K0n4R7l0m3L4N7p0l2J9
5398a8J3Ll8L7l8JO1k6m9N1M5k7RL9n4n2OL4Kk4M8J8k9j2l5J3P3m9M7o8j3M6o
5431Hkm9O5j7j2J5j6l6O9j4m5K4K4J5n1K2j0Qo6L4OO9j13K1J17p9L8jk8K7n4Q5
5463E4p6k8O6j7L2m7L1k2J5p1N4k6J7N2l5J5l6L6l1K5k8N4m7NL3n3JK9L8k6K6
5494D0m8j1R4p1L4k6J6k8K1nK9j1k0j1LQp1L9MnqO9o4J0M0k6N1n5K2j8ol3O1m2
5528a8J9lk8K0j8L0jJ7K5kk6M0k7o0J9j3N1k6l0K6kJ2PL7m2l9M2J1OL7o9L2m8
5561b1J8j0K2q9M1oN0j7O8m9p7N7l5L0J8J4l9K3K5K5o8RJ2k0QM0Qrj0j8M3m7j1
$$ y = [-73, 63, 78, 52, -41, 0, -36, -15, 27, 38, 26, -32, 17, 41, -49, -17, -1, -12, 20, -27, 7, 35, 8, 16, -58, -6, 2, 2, -5, -40, 38, -1, -21, 12, 12, 20, 13, -8, -41, 27, 37, 73, 46, 19, 17, -42, 52, 9, 58, -5, -25, 14, -7, -9, 11, -16, 4, -50, 47, 17, -26, 8, 65, -5, -37, -18, -5, -2, -40, -3, -41, -40, 21, -5, -54, -3, 42, 15, 24, 63, 9, -43, -37, -3, -1, -25, 23, 41, 12, 0, -35, -22, 51, 2, 49, -19, -32, 14, 8, 6, -43, 22, 5, -7, 8, -8, -44, 25, 11, -34, -10, 14, 29, -22, 0, -10, -2, -68, -34, -28, 41, -72, -51, 66, -13, 25, 24, -4, 23, -31, 54, -22, -50, 16, -1, 31, -16, 15, -7, 8, -63, -9, -35, -18, 34, -1, 14, -22, 14, -17, 8, -20, 34, -13, -8, 25, -28, -27, 2, 40, 14, 40, -8, -19, 75, 4, 38, 12, 28, 0, 21, 16, 45, 34, 14, 3, 6, 14, -57, -18, -14, -19, -27, 42, -22, -12, 28, 2, 53, -2, 20, 2, -4, -37, 24, -18, 1, -2, -30, -10, -28, 2, 1, 18, 43, 41, 15, 55, 28, -32, -13, -26, 25, -1, -31, -5, -7, 5, 12, 49, 7, -32, 10, 21, 27, 64, -5, 27, -21, -3, -13, 9, -80, -39, -45, 5, -12, 56, 7, -70, -13, -48, -18, 0, 14, -25, -2, 23, 48, -20, -11, 1, -19, -11, 29, 37, 28, 18, 0, 43, -4, -15]
5594a5ol3L4lk0J3j6K2J4L5k1k7O1m6nO1o6K0j2L0m9L0lkN1j3J5j04O1J2L4p3
5626b1N0m5M9l5M2j5p4L3J3l0K8M6q6%O2j3l3K3m0mN1k7J1k2L7J5r5R0L3o2K3
5657Dk6LK4Jk2l6O5Kn4L2J8k0K0l6oL5n2N4rqJ1K5j2k5K9nnl8L9k7j4qK2m2J02
5692D1m8KJ0l7N3j0j8kK5K5l8j6M4rJ5k3K2k1o6N9k6K8k2kR8pr6L6o9O0m3P0o
5725B9o7n7Q5K0j8pL0pq4O3NJ1J0n7L6N2n1K1Mj2l0M3l9N9m7K1k7N1j5j5j8L1
5757B0j1k3j7Kj7M2km4L4k8K7L8k3j8M1omk7K9n6L3O6ml2O2n1Qj7k7j3O5k3mJ4
5791C4l7K2n7R2m8Pj7M1m0J0Nj5%K7j1J8p0Q5l5j9n2L9J4Mmk5P2o1k7N8L9j2k6
5824A1m5M8j7M5m2L5J0m7m6N0Lrj3N3qj3j4Jk1J5J3k4%%M1jJ4n2MN9m7m6M6Ml5
$$ y = [-15, -21, -54, -20, -23, -43, -30, -46, -24, -10, 25, 4, -23, 38, -8, -13, 48, -18, 2, -10, 20, -29, 1, -2, -4, 47, 34, 49, -55, 6, 18, 52, -21, 29, -16, 33, -2, 40, 25, -49, -16, -3, -33, -5, 41, -45, -45, 17, 4, -29, -6, -46, -50, 1, -26, -15, -37, 0, 15, -80, 10, 43, -19, 4, -22, -19, 5, 6, -16, -52, 13, 15, -39, -7, 11, -9, 11, -25, -31, 4, -48, 6, -3, -11, 0, 25, 13, -12, 17, 12, 7, -31, 8, -19, -33, -41, -19, -61, 41, -7, -5, 5, -32, 21, 11, -7, -9, 16, 41, 3, -13, 31, 22, 37, 14, 36, 15, -51, 8, -18, 10, -12, -14, 84, 77, -19, 17, -52, 8, -35, 35, 29, -38, -95, -10, 10, -8, -15, 15, 8, -76, -13, -8, 3, 13, -44, -8, 44, -7, 14, 18, 6, -24, 19, -20, 39, -8, 13, -14, 37, 22, 7, -11, 20, 9, -14, -31, -29, -46, -4, -6, -50, -16, -44, -17, 21, -2, -20, 21, 15, 11, -16, 13, -43, -10, 56, 52, 20, 82, 31, 39, 22, -5, -18, 47, 24, 20, 34, -3, 19, -38, 54, 6, 13, -4, 37, -3, 7, 12, -3, -3, 24, 13, 31, -39, 46, 11, -8, -60, -21, -7, -3, -7, -32, 40, -21, -48, 10, 49, 37, 11, -34, 14, -3, 42, 0, 35, 45, -2, -48, 2, 5, -4, -17, 36, 28, 15, 1, 2, -19, -4, 9, -15, -15, -15, 26, 25, 39, -13, -9, 50, 3, -43, 3, 7, -28]
5859b8K1m3Q6j03J05n2QJ2nJ0O9j4ll9m8N7l8l5R4p8O9ln6L2L2n8K6ql3J0L4r
5891A2jmJ6m4j0P5n6L7o3N1J2p5Q3%k0l3N7n8L7rOjL1%J1o1l7L0qQj2NM3l3O4
5926E3q8JO1Lm5kM5p4n0J16o%qj6K0k8nk5O7p2L1LM4k7k2P7p3L6Ql6L1k9kl2N4
5961A0OjmK3m4K1k3m8L8N1J1k7rk3oN8p1O1l7LJ0k7O9n4Rj3K2j1J8k2n2O9m5J6
5995b2N1l5J9k3rL0mMk5M2J0o5N2n0J18j11%N4m3l8nJ2L2L5on3J4K8o0N8j9oJ9
6028DKl7N0k4K9j5j3Nj0N7n2O7m4Oj7q0J13Mo7j5M8j1k3L9n7N3n7J5O9q4L2j9
6060c2Rn9O2Rk9N2j0N7n6j5J4KjL2k3N1o8oJj9J16m0m9K7jrl5L3qqJ6m7M3j2K4
6095B1n2mL1j9K2J5m8KN0%Kl8k2k2O7J0j3J2K6J3K3m4k8nj8L0k3M4KM3m2m7K0
$$ y = [-28, -7, -50, 36, -67, 38, -14, -6, 6, 1, 11, 80, 66, 63, 24, -24, 33, -5, -40, 54, -24, 45, 42, -14, 18, 50, -8, 18, 10, -23, -13, 21, 12, 11, 7, 23, -21, -31, 44, -12, 25, -38, 13, 25, -50, 33, 33, 13, -20, 37, -21, 16, 7, 13, 12, 43, 43, 54, -7, -44, -14, -22, -14, -26, -21, 22, -11, 53, -35, -34, 27, 30, -15, -17, 28, -46, -96, 20, 14, 14, 6, -10, 10, -18, -23, -48, 19, -53, -22, -19, 25, -2, -24, 53, -20, 16, 24, -12, 19, -10, -12, -44, 10, 16, 15, 11, 34, -10, 11, -12, -60, -22, 29, 40, 13, 4, -19, -25, 33, -38, 23, -14, -11, -1, -28, 41, -13, -4, -17, 5, -6, 12, -10, -62, 7, -38, -22, 29, -6, 13, -10, -19, 11, 7, 11, -14, 28, 38, -27, 25, -25, 93, -18, -18, 36, -7, -45, -50, -38, -6, 29, 23, -30, -16, 12, -48, 10, -9, -15, 4, 6, -31, 19, -5, 24, 9, -4, 1, -9, 48, -4, 63, 19, 25, 8, -72, 41, 45, -22, -37, 11, 0, -23, 16, -41, 12, -45, -30, 39, -45, -13, -32, -23, -82, -20, -11, -40, 12, 2, 59, 3, -12, 2, 4, 3, 35, 12, 63, -5, -11, -10, -29, 87, 47, -2, 25, 24, 15, -20, 13, 5, -3, 13, -34, 9, -3, 21, -31, -35, -4, -23, -1, 14, -34, -32, 18, 18, 20, -18, -40, -62, 5, 15, 2, 14, 40, 53, 76, 32, 4, -1, -19, 11, -12, 32, 34, 77, 35, -12, 8]
6128Hk3M7k1J4p4J6N3J5rj6l9j2L2n5J06m0K1k7j4J6M8p6k4K4K5p8L5O7k8pMK0
6160Hj2mm0M5K4Ro7M2MMOl9L1J5Opl3L2j8k2oK8M8o0m2K7KJ6M5m8L2n0LJ8k4M6
6196A9k6k2K5L7k7L7k8J0j5M6j4k4Lj0m3N4q0N5J6pm3K6L2o1O1pJ4n5L1l1NK1
6228aJ2l1lM2m9mK0rN3l2RNo1L8L8Ql8k6M8L3l4n3M6rk1J1mOl0KL9Pnk5M7o6K3
6265a4J7n7K3PO3k0n0M4j9J0m9O%M9k7J0J5L1k9l3Q2r0M5mK5p8JOJ0L8J8p2L0
6298a2Qk7M9o2O7q8O1J7J4k4P2j13N6l1J9l5pnL6J1l1P9j3k3K2rj5j5j3N9k8j8
6330Am0P8%qll5jJ9j5jl9M9Qn2Q9q5N2Mj0j4K7p7K8N4Nk6o9N9KQl5K7kj7qN2m3
6367a8qL1rj3J8N6n2k3K1j1k5M9j2J5J4K7q7M0qq%K2j9J5Pj3K2q8O1k9j8pO8l9
$$ y = [8, -15, 32, 11, 25, -49, -33, 20, 35, 26, 10, -29, -41, -9, -64, 42, 2, 23, -4, -18, -2, 46, -30, -54, -30, -5, -83, -48, 19, -9, -16, -12, 8, -4, -8, -48, -3, 21, 30, -37, 5, 9, 13, 19, -20, 11, 26, 32, 25, -8, 24, 6, -16, -22, 6, 54, -6, -48, -21, -19, -3, 42, -6, 26, -24, -21, -3, -27, 19, -7, -29, -4, 33, 6, 43, 15, 25, 10, 56, 42, 18, 21, 11, -32, 22, -58, -3, 13, 6, -37, -11, 21, -40, 21, 14, 28, -27, 4, -27, -22, -1, 11, -20, -23, 19, -30, -34, -14, -23, 30, -2, 7, 12, -49, -11, 27, 35, -3, -29, 19, 52, 18, -35, 11, 2, -19, -8, -12, -6, -36, -34, 5, 12, 7, -18, 29, -37, -14, 3, -54, -31, -24, 39, 19, -31, 13, -6, 4, -45, -39, -39, 10, -17, -7, 8, 39, 10, -23, 59, -31, 14, 10, 35, -43, -42, -36, -26, 12, 30, -42, -12, -4, -31, 18, -44, 23, -65, -4, 13, 27, 3, 75, -38, 18, -13, 6, -29, -36, -41, -5, 6, -25, 54, 41, 18, 40, 31, 16, 1, -12, 47, 19, 1, -39, 39, 39, 31, 28, -7, -8, 11, -4, -5, -44, 5, 13, -39, 50, -35, 17, 21, 11, -3, 24, -53, -25, 29, 34, 8, -61, -2, 0, 8, -27, 0, -2, -19, -27, 25, -18, -26, 5, -4, -17, 1, 57, 5, -18, 3, -8, -33, 16, 4, 19, 33, 60, -27, 13, 5, -3, -3, 19, 0, 15, 22, 9, 31, -57, 4, -25, -43, -50, 18, -21]
6401b1L9j1l3Jj0K3K3j0k7M6k5J1k6L2%k2OrJ7l7M9o6P7m7L6l8J5j9L0J2j6o0
6433f0M9k2N7k9pn1O8J0n7O5n6O7k0Qj2k1QM2Qr2L4K4j7K9kN6l9km2%Mk5J07p1
6467A1L4p9K3KkmJ5jN2jj8n0j2k2M4%j3O0q9Q2o3K2rN4m9L8l3L9jk2Pl2mL5l1
6502a7L4k3L2l6n4N4j8j3K0l4P4J3n5K9%nl9%Q7J8q8lL4K6n8P3l3k4K7L4j4ql5
6535b%k7Q5Nl2lk5N4k9l7k%J8J6qj3jL5m9j7P9J1Kp8J6K2j4K9p4M7K0qrl0K7k
6571FJ7j3p2L7M2l9P8l0oj9Rk9N1k9j8Q4n0p3O9o5N8K4Jm2j5J1PL6m2M6n5M3J
6604B3l3j2OM8n8LM9nm1O2l2LoRj1J3L2m5l3L4N1m6o6P5k3pL8Qk4l1RK9p1J7N6
6639B1l1K1oJ5l4J6l2L7kk8Q6n0n5J6J4M0l1Jj5J3O9m4j6l3N7n7P3j04J15q7J3
$$ y = [-21, 18, 7, -26, -25, -35, -12, 11, 1, -26, 20, -5, 6, -20, 12, 12, -10, -4, -13, 4, -33, 16, -50, 27, -20, 16, -22, -7, -26, 4, 16, 0, -60, -11, -33, 24, -5, -12, -63, 5, 15, -42, 23, -33, 34, 14, 22, 10, -11, -3, 39, 47, -45, -11, 13, -4, 25, 23, 79, 40, 38, -4, -4, 0, -25, 82, 11, 45, -34, -11, -9, -11, -15, 0, -1, 51, 50, 32, -18, -30, -52, -8, -8, -21, 39, -50, 32, -31, -9, -18, 36, -13, 25, -8, 31, 30, 8, 15, -17, -21, 14, -17, 17, -6, 26, -10, -64, -10, -28, -41, -21, -55, 19, 32, -23, 6, 6, 1, -38, -38, 49, 67, -21, -24, 10, 36, -22, 51, 18, -6, 21, 55, 41, 33, -2, -2, -29, 56, 61, 29, 26, 1, 55, 26, -11, -13, -13, 5, 21, 13, 0, -1, 34, -15, -32, 47, 58, 60, -18, -2, 20, 6, 35, -39, 8, 28, 20, 11, -19, 8, 6, 23, 10, -62, -25, 17, -22, 56, 26, 20, 1, 10, -19, 32, 3, -15, 69, 19, -54, 15, -50, 8, 32, 33, -9, -24, -13, -6, 30, -12, 34, -21, 22, 23, -10, -22, -16, 32, -26, -23, 26, 21, -20, 42, 10, 13, 7, 16, 5, 18, 50, 5, -28, 6, 57, 11, -55, 20, -3, -10, 28, 36, 12, -19, -10, 19, -52, -35, 21, -10, 11, 5, 20, -14, 2, -30, 7, 5, -23, 63, 13, -42, -26, -12, 28, -3, -2, -17, -4, 65, 21, 5, -28, 29, -28, 45, -59, 56, -31, -18]
6670a8K7L2Qp4jM5m1J6Pj7J5Nj2o9N9j3J9J5jk6J6K9n0M8J2n1K5L0k7K9l9Mr0
6703h8J95j70J43m6k3O4r3O7l7nK6M3j29P3o9O5l6L7Jo3L4L7mK5m6k0n1M0J7R9
6733H6j00J3j8m3O8LJ8l2J4Rn1K3K8J3j9j3J1k1NJ4LK3l8J12r6Jk0j2K5l9J4L0
6765A1K8n8L2K7n6Kl0N5l8M3p4O0L9l5K3Ll7jN4%n2j8M2l1rL5L1rmoj9lK6j9k
6800A0n1O6p5P0Mk8N0n4m7j5L1L4K7m6J4L0j3J9k0PJ0rmn4J14j14O7nk6K4j8O6
6832F4j05N5j5M3l0pj1J7J9p9M8l3J5L7l5km9J03l6K8m6K4JJ3Kl4K6n0N6oj4L0
6864B9l9M9kk0q9O6NNj7K2J5k1m0N6n6J01o8J2K8q7P8J9p3L4n4L6o5J7J42q1j3
6895a1J1P3o5k0l7j0O0Kn5N5OO4o6j5J6QlqK1lkokj1j4OJ8lK2n6j2J0N9n3P1p5
$$ y = [-18, 9, 41, 49, -25, -26, 19, -22, -6, 1, -16, -1, 4, -8, -77, -18, -31, -12, 3, 2, -24, -8, 21, -29, 19, 31, -20, 5, 35, 8, 37, -2, 2, -88, 107, -63, 80, 34, 11, 75, -18, 49, 12, 7, 33, 76, -53, 20, -49, 16, -20, 17, 18, -45, -11, 26, 22, 47, 1, -19, -70, -30, -13, 86, -14, -1, -19, -62, 6, 9, 27, -5, 9, 18, -33, -10, 18, 31, 12, -1, 10, -11, -6, 8, 11, 34, -4, 108, 12, 13, -7, -19, 6, -33, -19, 11, 39, -19, 13, 40, -16, -14, -44, 11, -27, 16, -58, 2, 41, 6, 29, 32, -5, -6, 48, 48, -4, -22, 20, -11, -20, 15, 46, 37, 33, 27, 8, 5, 31, 12, 10, -41, 25, -50, 20, 24, -4, 46, -8, -55, -70, -39, -5, 22, -24, -10, 20, 7, 26, 6, 13, 23, 14, 10, -44, 70, -44, 23, 18, -8, 16, -2, 64, -41, 14, -1, 42, 12, 5, -6, 11, 30, -49, -1, -34, -19, 18, -17, -19, -68, 35, -1, 27, -19, 5, 6, 19, 21, -13, 13, -37, 19, 13, -1, 29, -10, 39, 37, 17, -72, -6, -1, 4, -13, 9, 24, 3, -37, 19, -37, 64, -4, 8, 36, -51, 27, 46, -27, 7, -47, -11, -76, -59, 83, 2, -11, 0, 73, 8, -12, -49, -59, 1, 3, -52, 3, 9, 73, 7, -8, 8, 16, 13, 5, 26, 23, 21, 15, 13, 2, -12, -6, 12, 9, 31, -25, -37, -27, 32, -21, 50, -25]
6931b5qL4jl7L8j6P8m7l4L8o9J6J3k3k1M9N0l1k6K4pM4j4o3L4k4J2L3j1J6j5J2
6963A9L6Om7RLl4j1JJ2J4K0l1j4N1m4M8p2K2LlK0J9J9o4K3Mj0K5n9M3P9r3K1K8
6997D3j5j1OJ3o9j0K3J4J3L4j0m1J0k4N9q2M3K6j9k7K6k9O5m1nj4M6p3Q0m0n6
7028f5j2J11n5k6O0j9J4M2j9j8j0J1k1kn3J16j0o3J0om2J08o5nNk3K5j6M0J2n4
7059c0L1l1K1k7L0K5m3j0N4p2N9Kk6P2j9m7N1k6J4n1J2M1n4L8K4jn1k1J5N8k8
7090A0jL4rk6k2k6L2OPk1LK6Kk7J7Mj3Kl6qQ3r3K3K7m9Q6J1oJ4n0k5J6qJL4k8
7126a0K6J6n0M1j0K3j2M3p5RJ2o0M4j8k9N0l2K6K8k9j8M0J0rL3p4PL6Jk1l9Q7
7158D6Qm1n5O6j2L2p6N2n2O3m2JJ7l8O7n6K6k2L8J6j3m9mL4K7m5N2Nk7L5p8l2
$$ y = [-25, -33, 1, 0, -37, 1, -15, 63, 16, -18, 20, -49, -33, -20, -43, -64, -15, 35, 4, -22, 2, -5, 39, 25, -38, -4, -28, -16, 17, 6, 22, 7, 19, 55, 61, 14, 23, 26, -8, -19, -18, -6, 8, 28, -3, -17, 34, -10, 38, -34, -12, -9, -12, 8, 27, 46, -18, 5, 9, -1, 24, -35, 8, 87, -6, 15, 43, 28, 17, 23, 36, -33, -43, -20, -6, 7, 41, 31, -10, 0, -24, 35, -47, -4, 22, 3, -24, 2, -27, 38, -3, -8, -22, 24, -49, 31, -9, -65, -77, 34, -21, -47, 13, -6, 8, 50, 31, 13, 3, 14, -7, -9, -62, 54, 44, -19, -9, -15, -57, 51, -14, -19, -14, -37, -12, -28, 12, 24, -30, 1, -30, -9, -36, -6, 19, -24, -34, 20, -52, 7, 9, -17, 55, 36, -11, 40, 14, 28, -23, -11, 30, -24, 14, 38, 37, -14, -35, -20, 38, 10, 9, 43, 34, 8, -14, -40, -8, -2, 5, -16, -13, 13, 15, -12, 5, 9, -4, -2, -38, -46, 37, -56, -33, -6, -55, 31, 42, 36, 50, 0, -25, -9, -17, -16, 18, -10, 16, 32, -18, 23, 13, 36, 24, 67, -8, 1, 13, -47, -3, -21, -50, 0, -32, -6, 22, -7, -25, 15, 25, 16, 49, -25, -18, 18, 19, -2, -41, 46, 54, 13, -42, 24, 12, 44, -32, 20, -32, 31, -11, -10, 7, -31, 36, -20, 6, -16, 22, 38, 25, -24, -28, 6, 33, -12, 40, 45, 18, 53, -25, -57]
7190e7L4M3Qk9oK8L8q2K2J3m6N3k7N7j0l1l7NO0o7L3l5M5p7P9k2PJ1j6L5qk8j0
7223a7k8K6j1K6k6l2N8K0nPo7N3L8m9L7m0rkM3k8k0J2J7M1rj9k8LN1m1P%j4K7
$$ y = [-57, -23, 20, 28, -1, -7, 21, 59, -23, -1, 12, -34, 19, -8, 49, 39, 8, -29, -24, 36, -31, 2, -33, 12, -65, 14, -8, -1, 10, -6, 29, 21, -7, -17, -45, -19, -30, -4, -30, -62, -4, 16, 11, 18, -49, 4, 42, -7, 30, -10, -19, -21, 22, -6, -26, -14, 3, 44, 35, 16, -12, -9, 42, 1, 8, 8, -6, 21]
$$ [...]
8191a1
##END NTUPLES=NMR FID
##END=
