##TITLE=1H_AM_NV103
 CDCl3
 8 sc, 
 25.12.2023
##JCAMPDX= 6.0         $$ Bruker NMR JCAMP-DX V2.0
##DATA TYPE= NMR FID
##DATA CLASS= NTUPLES
##ORIGIN= UXNMR, Bruker Analytische Messtechnik GmbH
##OWNER= root
$$ XWIN-NMR		Version 3.5
$$ Mon Dec 25 13:50:45 2023 Russian Standard Time (UT+4h)  she@DPX200
##.OBSERVE FREQUENCY= 200.1313
##.OBSERVE NUCLEUS= ^1H
##.DELAY= (6, 6)
##.ACQUISITION MODE= SIMULTANEOUS
##.ACQUISITION SCHEME= undefined
##.AVERAGES= 8
##.DIGITISER RES= 18
##SPECTROMETER/DATA SYSTEM= spect
##.PULSE SEQUENCE= zg30
##.SOLVENT NAME= CDCl3
##.SHIFT REFERENCE= (INTERNAL, CDCl3, 0, 15.7039)
##AUDIT TRAIL= $$ (NUMBER, WHEN, WHO, WHERE, WHAT)
$$ ##TITLE= Audit trail, XWIN-NMR		Version 3.5
$$ ##JCAMPDX= 5.01
$$ ##ORIGIN= Bruker BioSpin GmbH
$$ ##OWNER= she
$$ F:/spectra/data/she/nmr/H-F/1/audita.txt
$$ ##AUDIT TRAIL=  $$ (NUMBER, WHEN, WHO, WHERE, WHAT)
(   1,<2023-12-25 13:49:49.46 +0400>,<she>,<DPX200>,
      <created by zg, POWCHK disabled, PULCHK disabled
       configuration hash MD5:
       00 E9 B6 7A A2 85 ED C7 34 08 36 98 17 FE 4E 26
       data hash MD5: 16K
       D8 F9 37 BF D3 22 77 4D 2F BA E1 53 36 68 98 50>)
$$ ##END=
$$ 
$$ hash MD5
$$ 0D A8 02 71 1D C0 E3 DB 70 1B 8D A5 D2 F7 02 04
##$RELAX= 
##$RELAX= 
##$RELAX= 
##$RELAX= 
##$RELAX= 
##$RELAX= 
$$ Bruker specific parameters
$$ --------------------------
##$DU= <F:/spectra>
##$EXPNO= 1
##$NAME= <H-F>
##$PROCNO= 1
##$TYPE= <nmr>
##$USER= <she>
##$AMP= (0..31)
100 100 100 100 100 100 100 100 100 100 100 100 100 100 100 100 100 100 
100 100 100 100 100 100 100 100 100 100 100 100 100 100 
##$AQSEQ= 0
##$AQ_mod= 1
##$AUNM= <au_zg>
##$AUTOPOS= <>
##$BF1= 200.13
##$BF2= 200.13
##$BF3= 200.13
##$BF4= 200.13
##$BF5= 200.13
##$BF6= 200.13
##$BF7= 200.13
##$BF8= 200.13
##$BYTORDA= 1
##$CFDGTYP= 0
##$CFRGTYP= 5
##$CHEMSTR= <none>
##$CNST= (0..31)
1 1 145 1 1 1 1 1 1 1 1 1 1 1 1 1 1 1 1 1 1 1 1 1 1 1 1 1 1 1 1 1 
##$CPDPRG= <>
##$CPDPRG1= <>
##$CPDPRG2= <>
##$CPDPRG3= <>
##$CPDPRG4= <mlev>
##$CPDPRG5= <mlev>
##$CPDPRG6= <mlev>
##$CPDPRG7= <mlev>
##$CPDPRG8= <mlev>
##$CPDPRGB= <>
##$CPDPRGT= <>
##$D= (0..31)
0 1.2 0 0 0 0 0 0 0 0.06 0 0.03 0 0 0 0 0.0002 0 0 0 0 0 0 0 0 0 0 0 0 
0 0 0 
##$DATE= 1703497788
##$DBL= (0..7)
120 120 120 120 120 120 120 120 
##$DBP= (0..7)
150 150 150 150 150 150 150 150 
##$DBP07= 0
##$DBPNAM0= <>
##$DBPNAM1= <>
##$DBPNAM2= <>
##$DBPNAM3= <>
##$DBPNAM4= <>
##$DBPNAM5= <>
##$DBPNAM6= <>
##$DBPNAM7= <>
##$DBPOAL= (0..7)
0.5 0.5 0.5 0.5 0.5 0.5 0.5 0.5 
##$DBPOFFS= (0..7)
0 0 0 0 0 0 0 0 
##$DE= 6
##$DECBNUC= <off>
##$DECIM= 32
##$DECNUC= <off>
##$DECSTAT= 4
##$DIGMOD= 1
##$DIGTYP= 9
##$DL= (0..7)
0 120 120 120 120 120 120 120 
##$DP= (0..7)
150 150 150 150 150 150 150 150 
##$DP07= 0
##$DPNAME0= <>
##$DPNAME1= <>
##$DPNAME2= <>
##$DPNAME3= <>
##$DPNAME4= <>
##$DPNAME5= <>
##$DPNAME6= <>
##$DPNAME7= <>
##$DPOAL= (0..7)
0.5 0.5 0.5 0.5 0.5 0.5 0.5 0.5 
##$DPOFFS= (0..7)
0 0 0 0 0 0 0 0 
##$DQDMODE= 0
##$DR= 18
##$DS= 0
##$DSLIST= <SSSSSSSSSSSSSSS>
$$ [...]
##$SUBNAM2= <"">
##$SUBNAM3= <"">
##$SUBNAM4= <"">
##$SUBNAM5= <"">
##$SUBNAM6= <"">
##$SUBNAM7= <"">
##$SUBNAM8= <"">
##$SUBNAM9= <"">
##$SW= 18.0517328524113
##$SWIBOX= (0..15)
0 0 2 0 0 0 0 0 0 0 0 0 0 0 0 0 
##$SW_h= 3612.71676300578
##$TD= 16384
##$TD0= 1
##$TE= 0
##$TE2= 300
##$TE3= 300
##$TEG= 300
##$TL= (0..7)
0 120 120 120 120 120 120 120 
##$TP= (0..7)
150 150 150 150 150 150 150 150 
##$TP07= 0
##$TPNAME0= <>
##$TPNAME1= <>
##$TPNAME2= <>
##$TPNAME3= <>
##$TPNAME4= <>
##$TPNAME5= <>
##$TPNAME6= <>
##$TPNAME7= <>
##$TPOAL= (0..7)
0.5 0.5 0.5 0.5 0.5 0.5 0.5 0.5 
##$TPOFFS= (0..7)
0 0 0 0 0 0 0 0 
##$TUNHIN= 0
##$TUNHOUT= 0
##$TUNXOUT= 0
##$USERA1= <user>
##$USERA2= <user>
##$USERA3= <user>
##$USERA4= <user>
##$USERA5= <user>
##$V9= 5
##$VALIST= <valist>
##$VCLIST= <CCCCCCCCCCCCCCC>
##$VD= 0
##$VDLIST= <DDDDDDDDDDDDDDD>
##$VPLIST= <PPPPPPPPPPPPPPP>
##$VTLIST= <TTTTTTTTTTTTTTT>
##$WBST= 1024
##$WBSW= 4
##$XGAIN= (0..3)
0 0 0 0 
##$XL= 0
##$YL= 0
##$YMAX_a= 71692
##$YMIN_a= -94949
##$ZGOPTNS= <>
##$ZL1= 120
##$ZL2= 120
##$ZL3= 120
##$ZL4= 120
##$ABSF1= 10
##$ABSF2= 0
##$ABSG= 5
##$ABSL= 3
##$ALPHA= 0
##$AQORDER= 0
##$ASSFAC= 0
##$ASSFACI= 0
##$ASSFACX= 0
##$ASSWID= 0
##$AUNMP= <proc_1d>
##$AZFE= 0.1
##$AZFW= 0.1
##$BCFW= 1
##$BC_mod= 2
##$BYTORDP= 1
##$COROFFS= 0
##$CY= 11.3945322036743
##$DATMOD= 1
##$DC= 2
##$DFILT= <>
##$DTYPP= 0
##$F1P= 15.7292609196834
##$F2P= 12.9074282941183
##$FCOR= 0.5
##$FTSIZE= 0
##$FT_mod= 4
##$GAMMA= 1
##$GB= 0.15
##$INTBC= 1
##$INTSCL= 1
##$ISEN= 128
##$LB= 0.24
##$LEV0= 0
##$LPBIN= 0
##$MAXI= 10000
##$MC2= 0
##$MEAN= 0
##$ME_mod= 0
##$MI= 1.114404
##$NCOEF= 0
##$NC_proc= 0
##$NLEV= 6
##$NOISF1= 3.799351
##$NOISF2= 2.8
##$NSP= 1
##$NTH_PI= 0
##$NZP= 0
##$OFFSET= 15.70392
##$PC= 1
##$PHC0= -24502.82
##$PHC1= 10.85273
##$PH_mod= 1
##$PKNL= yes
##$PPARMOD= 0
##$PSCAL= 0
##$PSIGN= 0
##$REVERSE= no
##$SF= 200.130013532006
##$SI= 16384
##$SIGF1= 3
##$SIGF2= 2
##$SINO= 400
##$SIOLD= 16384
##$SREGLST= <1H.CDCl3>
##$SSB= 0
##$STSI= 0
##$STSR= 0
##$SW_p= 3612.71676300578
##$SYMM= 0
##$S_DEV= 0
##$TDeff= 0
##$TDoff= 0
##$TI= <>
##$TILT= no
##$TM1= 0
##$TM2= 0
##$TOPLEV= 0
##$USERP1= <user>
##$USERP2= <user>
##$USERP3= <user>
##$USERP4= <user>
##$USERP5= <user>
##$WDW= 1
##$XDIM= 8192
##$YMAX_p= 0
##$YMIN_p= 0
$$ End of Bruker specific parameters
$$ ---------------------------------
##NTUPLES= NMR FID
##VAR_NAME=  TIME,          FID/REAL,        FID/IMAG
##SYMBOL=    X,             R,               I
##VAR_TYPE=  INDEPENDENT,   DEPENDENT,       DEPENDENT
##VAR_FORM=  AFFN,          ASDF,            ASDF
##VAR_DIM=   8192,          8192,            8192
##UNITS=     SECONDS,       ARBITRARY UNITS, ARBITRARY UNITS
##FACTOR=    0.0002768,     1,               1
##FIRST=     0,             0,               0
##LAST=      2.2672688,     0,               0
##MIN=       0,             -94949,          0
##MAX=       2.2672688,     71692,           0
$$ Real data points
##PAGE= N=1
##DATA TABLE= (X++(R..R)), XYDATA
$$ [...]
1082B078o754M247M707n493j778M603n88k066J438r26l55L151j969l466M264K087
1098C180n275J62M436j951k159K170o28n75K312k167k204M649L47n710K426M737
1114C750m557k094N098r69l690L423Q40l997K063K770l845o20L761j386k170J963
1130C40rj002J709j248j941L600O88m806J431M421l102k626L499K75k071J399
1146E57o19j659L496R7n281K313N411m623m062N740J983n164k76L366k19j051
1162Ip20n00K581P07m369M19N043k075m348L221K504l270m16J905j019L49J124
1179A145k486J92L596k012l287L531J831l947J10L101j637j313K017o24j282J778
1195G13j20j866J277Q67j466M61O67j445J031J491k770m46L859j110l864K530
$$ plain form
1082 2078 -4676 -429 4278 -1215 -2993 1610 1022 -1044 394 -532 -887 2264 295 -3171 1093 3180
1098 3180 -2095 -1933 2503 552 -1607 563 -65 -640 1672 -495 -2699 1950 2297 -3413 -987 3750
1114 3750 -807 -2901 2197 1228 -2462 961 1801 -2196 -133 2637 -1208 -1828 1933 547 -1623 340
1130 340 331 -671 1038 -210 -2151 1449 2137 -2669 -1238 3183 81 -2545 954 1229 -842 557
1146 557 -62 -1721 1775 1872 -3409 -1096 4315 -308 -4370 1370 3353 -1811 -2087 1279 1060 9
1162 9 -711 -1211 1370 2077 -2292 -1873 3170 1095 -3253 -32 2472 -798 -1214 691 -328 21 1145
1179 1145 -1341 -1149 2447 435 -2852 679 2510 -1437 -1327 1774 137 -1176 841 217 -1065 713
1195 713 593 -1273 4 871 -595 -134 533 -912 119 1610 -1160 -1606 2253 1143 -2721 -191
1211a91K925l131j549K564L89j145k02n29R53J627k265j924L668J343m371k69
1227b107M149n41l158P21J944l3j077j237R37K469j575l188K593K966l455k065
1243b657L619R76l085o2J913p3o73l63j31J271K53k077K99K350j196k007J928
1260B85J055k132k2J702q10r14J083Q8p31L61O2j39N67n53o36J406K43k012N35
1279e62K153j345j836J758J200j674o99J052N94l38r51k46J729L92k547J5L103
1296A798o24l137J221K736j453k163J256J572o64j477mJ731M07k227m67K722J26
1313A353k857L64K681p93k030Q59J457n70j039L8R96M58j325p12J785M76k131
1330i90o3K188m85j927Q75J400q63q69O33O16j54p56j15J158J02j627K44J918
$$ plain form
1211 -191 2734 -397 -1946 618 1007 -138 -340 -869 84 1711 -554 -2478 1190 2533 -1838 -2107
1227 -2107 2042 1501 -1657 -936 1008 975 -102 -1339 -402 2067 492 -2696 -103 2863 -592 -2657
1243 -2657 962 1938 -1147 -1209 704 631 -42 -405 -536 735 988 -1089 -790 1560 364 -1643 285
1260 285 1340 -792 -814 888 78 -836 247 335 -396 -35 27 -112 455 -98 -734 672 915 -1097 -562
1279 -562 1591 246 -1590 168 1368 -306 -1005 47 641 303 -648 -894 835 1227 -1320 -1305 1798
1296 1798 1174 -1963 -742 1994 541 -1622 -366 1206 542 -935 -939 792 1199 -1028 -1495 1227 1353
1313 1353 -1504 -1140 1541 748 -1282 -423 1034 464 -575 -537 459 917 -408 -1120 665 1141 -990
1330 -990 -1053 1135 650 -1277 -402 998 135 -734 -101 515 361 -395 -510 648 750 -877 -633 1285
1348A285q27j903J324J473j556j013J438O71j116o06O66R72m35j440N95J912j005
1365D35k037J517J833j867j379J817Q96j471p16R52Q33n22j318M12J883o83k221
1382a636J239K169j648j784J898J198j653p92J136P13o02r97K21J488l10k030
1398a390Q45K120j466j775J911J132j907m42J505O1q36j25K96P02j84j352N41
1415c64J755j253j841J995J302k419n23K278j10j682L10R81R5m88q12N25J584
1432A333j110j914J938J723k666j053K837K15k441L23J557k81o64l79J99J377
1448I94m45k104J193K373k057j936K664J019k604m9J846m58q28K31p5N32L34j494
1466h64R5K116j089j962K087J157k567N9K326j052j422J433L39j002L50P3l61
$$ plain form
1348 1285 458 -1445 -121 1352 -204 -1217 221 892 -224 -830 -164 808 373 -1067 -472 1440 435
1365 435 -1602 -85 1748 -119 -1498 319 1215 -256 -972 -20 813 291 -1027 -615 1268 585 -1636
1382 -1636 -397 1772 124 -1660 238 1436 -217 -1009 127 840 238 -759 -538 950 640 -1390
1398 -1390 -545 1575 109 -1666 245 1377 -530 -972 533 594 -242 -367 -71 631 447 -905 -364
1415 -364 1391 138 -1703 292 1594 -825 -1348 930 820 -862 -552 429 524 36 -776 -251 1333
1432 1333 223 -1691 247 1970 -696 -1749 1088 1303 -1138 -815 742 461 -203 -582 -383 994
1448 994 549 -1555 -362 2011 -46 -1982 682 1701 -903 -952 894 436 -392 -161 -236 296 630 -864
1466 -864 -769 1347 258 -1704 383 1540 -1027 -968 1358 306 -1116 317 656 -346 4 77 -284
1483b84Q85m57j400J648J066k720l3L107j163k670K008J649k023n38J217O0L9
1500C91l25j206J379J656k748j251L684K07l863Q79L114j463j908J164Q07j1l80
1517A26j329R01K301j982k352L082J575l659k71L315r95k076J395N22r33O64k30
1534E4j046J509M94k276O99K092j767j014K245l99j774J546N82j873O68J349j433
1551c44k67J213p65k22J157j283n35K496q57k830K401K254l337j039L395j76k453
1568a192O62J079j97Q3j082m64K469l3l503J157L561k229k796K715J601k272n08
1585i49J008K58M68q19j548K045J705l235j001L791k17l451J196K281j542p66
1601g76R51k89J72O57j401r0K088r20j874J833Q99k081M18J488j479k63J706j020
$$ plain form
1483 -284 601 144 -1256 392 1458 -1262 -1295 1812 649 -2021 -13 1636 -387 -925 292 352 391
1500 391 66 -1140 239 1895 -853 -2104 1580 1787 -2076 -1197 1917 454 -1454 -290 517 506 126
1517 126 -1203 -302 1999 17 -2335 747 2322 -1337 -1608 1707 712 -1364 31 553 -380 284 54
1534 54 -992 517 1011 -1265 -566 1526 -241 -1255 990 591 -1183 363 945 -928 -260 1089 -344
1551 -344 -611 602 -163 -385 772 -511 -1046 1450 593 -2237 164 2418 -919 -1958 1437 1261 -1192
1568 -1192 -530 549 352 435 -647 -1111 1358 1325 -2178 -1021 2540 311 -2485 230 1831 -441 -949
1585 -949 59 317 785 -34 -1582 463 2168 -1067 -2068 1723 1506 -1945 -749 1532 -10 -776
1601 -776 175 -114 58 715 -686 -776 1312 392 -1482 351 1250 -831 -413 1075 -404 -667 1039 19
1619A9j248J826K04j797P58R31j025K55N46j259O92J533j978j022K897K6l033
1636a675R86K341j388j346R23N24N6k51j302P43K141j696k311K667J781l072q58
1653a737K813K9j814K05O50K42K59j239n59K280P8k873P13K754j462k006J762
1670I5R58j365j00N09j79N14j52j156Q97J138j569n67J844m21j418J152M92j387
1688g15N20J040j301k44J438m83j002Q46K68o14M25n9o38R14L41j605L30J800
1706A261j032j475J365Q42j227k84O27J7L03m08r12J117J114j868q19K378K13
1723A212k403M48J889p09j185M85N99J6l28p45N11J192r67j241J475Q31j602k40
1741g62J409k52p80L86P5j49M96m69n80J018K05j307L56J190r28o78J130N5j001
$$ plain form
1619 19 -1229 597 801 -996 -238 693 -332 -77 469 -790 -98 1435 -543 -1565 1332 1358 -1675
1636 -1675 -689 1652 264 -1082 -159 365 421 170 -1132 -389 1752 56 -2255 412 2193 -879 -1737
1653 -1737 1076 1105 -709 -504 146 388 647 -592 -1151 1129 1207 -1666 -953 1801 339 -1667 95
1670 95 1053 -312 -412 97 -82 432 280 -876 21 1159 -410 -977 867 446 -972 180 672 -715
1688 -715 -195 845 -456 -700 738 255 -747 99 367 -247 178 119 -519 395 736 -869 -539 1261
1706 1261 229 -1246 119 961 -266 -550 77 94 397 -11 -923 194 1308 -560 -1379 999 1212
1723 1212 -1191 -743 1146 437 -748 -263 336 352 24 -721 -210 982 15 -1226 249 1080 -522 -762
1741 -762 647 395 -385 1 76 -73 423 -46 -626 392 597 -710 -354 836 -92 -770 360 415 -586
1760e86N45N26p27K6N66l16k25L99k33m3L81m33k88Q94j77j049O77Q04j002l78
1780f39R90k8o77K43J76l3K70m06l96R14K11j314K69J349p48j094R82O23r65j67
1800d40N84l9o7o4l21M14M32p73k84J056n4r81L68O92m60l35K94J8P7p0m12K67
1822i8O40p44n02J080J35j151L55R54o87n08Q36Kn91L08K37m34J54J92l43J59
1842fK49m51kN00l38k97N11J1m70L20J76l13J74J19m33L37L34p01o9R39m27q30
1864f67P73N24r91n8Q09k50m66K95J13r7J51k26r1N15j49o08M77M02o42r3N71
1885B92k16l21L40j45j56M48k25m95O39K80r09K09Q62o01n39Q25M3o67L49K80
1905B93m36Q3K85m06R9L53m64l9N62l31m13O72k9o07M05L88o49Q4N28m94o9N49
$$ plain form
1760 -586 -41 485 -242 -216 350 34 -191 208 -25 -68 313 -120 -408 486 309 -740 -63 741 -261 -639
1780 -639 351 323 -354 -111 65 32 302 -104 -500 414 625 -689 -420 929 181 -913 69 692 -273 -440
1800 -440 144 105 38 -26 -347 67 499 -274 -558 498 444 -537 -169 523 63 -272 22 40 117 47 -365 -98
1822 -98 542 -202 -704 376 511 -640 -285 669 -18 -526 310 312 -279 29 266 -168 -14 178 -165 -6
1842 -6 243 -208 -210 290 -48 -345 166 177 -293 27 203 -110 64 183 -250 87 421 -280 -349 590 163 -667
1864 -667 106 630 -361 -419 390 140 -326 -31 82 -15 136 -90 -181 334 185 -423 54 456 -186 -279 292
1885 292 76 -245 95 -50 -206 242 17 -478 161 441 -468 -259 603 2 -537 288 331 -336 13 293
1905 293 -143 -60 225 -181 -82 271 -193 -232 330 -1 -414 258 229 -378 27 415 -234 -150 378 -116 -185 364
1927C64l91l69P44j11q11O20M90r03j0Q15m16m23N89l5l78L97k7m95N73J19p72
1948d30L49O50p46k59Q60l02n88O44L0o16M80K82p54K75O57p19k05Q81l52o32
1968d95P43O3p29M61L71p53K00O06o41j76P84m18m96P70k9p99O59L71r60K71Q41
1989F44p69l55R71l00o88O91J23p37M75L25q11K57P45q48k19J024l74p50Q03J75
2009C82q19M43M14p62K27O87q27j62J031n22p65R86J24j017N38N69r26J34Q21
2028E56p86k56J084m49q22R45K55j025L82O94q14l9P17n44k71P69l71n51Q01%
2048B75q44O54L89r65L22P84r12j46J157o25q94J268J51j395O48R85j170l00J240
2067F22m94p99R34R9q53M56M50p13J84M55n05N2M44m92J5O54o83l64J099l25j097
$$ plain form
1927 364 -27 -396 348 237 -574 46 536 -367 -377 438 22 -401 188 153 -225 172 145 -350 223 342 -430
1948 -430 -81 569 -177 -436 424 122 -466 178 208 -408 72 354 -400 -125 532 -187 -392 489 137 -495
1968 -495 248 311 -418 43 414 -339 -139 467 -174 -350 434 16 -480 290 261 -538 121 492 -468 -197 644
1989 644 -125 -480 491 191 -497 194 317 -420 55 380 -431 -174 571 -277 -496 528 154 -596 207 382
2009 382 -437 6 420 -342 -115 572 -255 -417 614 92 -673 313 437 -580 -42 527 -399 -265 556
2028 556 -230 -486 598 149 -673 272 527 -498 -116 578 -236 -275 442 -102 -373 396 25 -526 275 275
2048 275 -569 85 474 -491 -169 615 -297 -443 714 89 -805 463 614 -781 -133 852 -318 -618 622
2067 622 128 -671 263 362 -491 -35 415 -298 -114 341 -164 -112 332 -160 -145 509 -174 -538 561 236 -861
2088h61J084N87j527K50J423j081q16J517m5j389Q43Q33j234j9J105o11n76Q21
2106C04j5o15L67J08l39L04m3m14O03K7q85N71P46j169j34J422o83j119J392L79
2126H07j614M95J289j193o06J467l03j162R05M89j025J84P02n33j73M60j72j01
2144h4K74l29N1N59n59m14J028j62j145Q47P50j325n4J347p55q97J284J15j300
2163g69O81Q80j129k08J167m31p32O75K29n88J86J96k90K64l1m95M90L44q57J26
2183b92Q81o85m88J055j61r68Q33M77j220K68J135r22o52J239l8j102N56O39p42
2202a87j10N74l23j20M06l63p2N17l15l16N82j13n46N78J52p96M17O73j002j69
2222e33J211m29j037R07N05j039M4Q61m70l72O06j88l33N28r7n27M29K48n56J37
$$ plain form
2088 -861 223 810 -717 -467 956 -125 -941 576 531 -858 -15 818 -416 -435 670 59 -517 304
2106 304 289 -326 41 149 -190 114 71 -343 260 287 -598 -27 719 -450 -584 838 155 -964 428 807
2126 807 -807 -312 977 -216 -822 645 342 -820 85 574 -451 -267 435 -98 -271 189 17 -84
2144 -84 190 -139 -88 471 -88 -502 526 364 -781 66 816 -509 -563 784 29 -868 416 531 -769
2163 -769 -88 792 -337 -545 622 191 -541 134 363 -225 -39 157 -133 131 100 -395 95 439 -418 -292
2183 -292 589 -96 -584 471 310 -658 175 652 -568 -300 835 -87 -739 500 462 -640 -84 555 -187
2202 -187 -297 277 -46 -166 240 -123 -195 322 7 -309 273 160 -386 192 344 -452 -35 638 -364 -533
2222 -533 678 249 -788 119 624 -415 -371 490 20 -352 254 66 -267 261 164 -363 66 314 -242 -105
2242a05L58m08P9L16m80L7O97n86n12J005R4j163M54R29q54l64Q49j12n63M32
2262A03Q2m39L27J65n28J95M43m98j10N05k60k29M65k24k80N68n2p15N25N03q37
2283b91r3Q33l24n70O47O4o34L84L51o42R8N00l50l06N22m5l26K13K5j47L21j76
2305E4m38N46K54p90O8Q18m43n60O13J74n94K59K37l91J71L45n77MP02l50n29
2326d27N74K55n93K7L38j56m8R0k50J93K79m78j28O79k21n77M89L66o46L5N34
2347C35l63j60M22j81k79M21o0m30L27K35n23J42M09m13j38N28k13l64M49R6m53
2368b13J80K64l32R4J93l18O3L53m06k07O17p3o24L36M16m35j20L68j20q5J33
2389H4k28N6M48l49m33O58K07q12Q3P09l69l95L98J05k83J30m9r6L20o6m39L49
$$ plain form
2242 -105 253 -155 -76 240 -240 -203 494 -92 -604 401 495 -668 -214 715 -139 -503 346 234 -329 103
2262 103 185 -254 73 238 -290 -95 348 -150 -260 245 -15 -244 221 -3 -283 285 233 -482 43 546 -291
2283 -291 -384 449 125 -445 202 266 -368 16 367 -275 -177 323 -27 -333 189 144 -182 31 56 -91 230 54
2305 54 -384 162 416 -374 -306 512 69 -491 122 296 -298 -39 198 -193 -22 323 -254 -250 452 102 -427
2326 -427 147 402 -191 -164 174 18 -30 60 -190 3 282 -196 -324 355 134 -443 46 412 -234 -199 335
2347 335 -28 -188 234 53 -226 195 135 -295 32 267 -256 -114 295 -118 -256 272 59 -305 144 240 -213
2368 -213 -33 231 -101 -7 186 -132 -69 284 -122 -329 288 215 -409 -73 343 -92 -212 156 36 -49 84
2389 84 -144 -88 360 11 -422 236 443 -369 -286 423 54 -341 57 162 -121 9 -40 -136 184 118 -321 28
2411B8L90n83j47O13j13m81L09J95l30R7J02k15K16Q2m28J75M36m52k50O54p6
2432B22o30L80M43n44j05M46j27k14K02r7m9K46k37k18N16m0n92K50N76m92l02
2453c66N32J1l38J65M1n1J87j53l42M58K77p72J6Q33l33o63M91L65m92q7K94p
2475F6l0j8k54K63L35n17j62O68j23o73M70L55n52m1M40k59j30K87j39j61L97
2496B22j95l38M97R7o14J94N87m87l82O55K8m84J21K65j46nq2j16M14n1o38L15
2518a43P51o79n36Q58K75r02Q7O37k03l09J53l3J34J85n01r4P46j92p94M56O68
2539E64o61l24N75L8k84J0NJ09K36l95k42O80O8q26K62P51o15m05O75J8n73L05
2561b9K67l74Q9J74k51J18J97l75O2M93m37l23P13lp69L10O42n73l02N32pk21
$$ plain form
2411 28 418 -165 -312 301 188 -293 16 211 -119 -22 80 -135 81 163 -265 -90 346 -106 -356 298 222
2432 222 -408 -28 415 -129 -234 212 85 -129 73 -24 -73 173 -64 -282 234 194 -398 -148 428 -64 -366
2453 -366 166 177 -161 4 45 -6 181 28 -314 144 421 -351 -335 498 165 -498 -7 358 -134 -221 73 66
2475 66 36 18 -236 27 362 -155 -317 351 228 -445 25 380 -172 -213 227 -32 -162 125 -14 -175 222
2496 222 27 -311 186 283 -331 -137 450 -37 -419 236 264 -220 -99 166 20 15 -67 -183 231 180 -458 -143
2518 -143 608 -71 -607 251 526 -376 -289 348 145 -164 -11 -44 90 275 -226 -320 426 234 -560 -104 564
2539 564 -97 -421 154 192 -92 -82 -77 32 268 -127 -369 311 379 -447 -185 566 -49 -454 221 239 -334 -29
2561 -29 238 -136 -47 127 -124 -6 191 -184 -122 371 -66 -389 324 321 -448 -138 504 -69 -371 161 154 -67
2583f7Q6j70P6M64l91n66P66M26r95j75J074j72q29K87M99j37k85j36J84M85l48
2604G6p00O31P26r53m76J056J18r08K01N63k75j09O6j58K44K31n99p3Q13k89p13
2625e28N36L83n79p0N08k45j62K90j40j22L30j99j99L94r0m02M59J72p51J81Q09
2646E75n69o16Q00L03p95j0N56j28j66j0j04L75J48p01%R49l20r61N33P68o34
2667gm56M73K08j23j91k48L87N17p47n27J087L12j228L5J136l12q06L74M50k50
2687H4j41j16J22M08k80n72N33M42o97j99P43j41n21L77J75l86J57K49l88J22
2707b9K80l92nM20l25k12N51j44n97N12L95p02j14O97j08n20J96K65l4o4l02Q8
2729a44O12l19p79O14P39q76n45R43K76q04o3M87P4j66k58o3O11K0q31J67R89
$$ plain form
2583 -67 19 -151 -75 389 -2 -568 198 624 -371 -546 528 356 -473 -186 313 176 -109 -245 -61 424 76
2604 76 -624 7 733 -220 -696 360 478 -430 -229 334 59 -50 16 -142 102 333 -266 -339 474 185 -528
2625 -528 8 391 -188 -258 250 5 -157 133 -7 -129 201 2 -197 197 107 -295 164 336 -415 -234 575
2646 575 6 -610 190 493 -302 -312 244 116 -50 -60 -164 211 359 -342 -342 607 287 -674 -141 627 -7
2667 -7 -463 10 218 95 -96 -344 43 560 -187 -714 373 685 -543 -508 628 316 -490 -116 334 84
2687 84 -57 -173 -51 357 77 -495 38 480 -217 -416 327 186 -335 42 217 -169 -12 237 -151 -29
2707 -29 251 -141 -146 274 -51 -263 288 144 -453 59 454 -248 -362 335 227 -293 -97 168 134 70 -232 -144
2729 -144 468 149 -630 -16 723 -153 -698 245 521 -283 -346 141 215 49 -209 -272 339 359 -472 -305 684
2750F84m66q35N93N63o16k65L81P8l5j36k15L23L08n84k22Q01k9p99L21O06m74
2771a8k99M76l7k38J19J9p0J41j26j72L86k4n02L63L61n68j71P20j47n86L48L66
2793C41l43j74K12QO0l5l38K61M70n83m23P94K19q61K1P34j34m90P3K92R9j93
2815A0l53K84N53m80n94O95M79q49k23P54K9n62P8K79J1n9k32JM78j15n93L24
2837h5N58n20l75O20J07n45J18L00j68o0M1q4J51O9l26Q2M33l42l23N55Q2n78
2859b90J27N09l19k94L23J12k08qk5J21J68l18j91N30O1o58J08O93l15n25L83
2880a6L44l40j76J56J36J19k88k54M39K99o90j32P41n3o99K61N03k90l03J71J72
2901A00L3j35k12K51K94m40k53O08N8o29J42M63k24k87K58N3j03J5r5K1K69k03
$$ plain form
2750 684 218 -617 -24 539 -77 -342 39 117 82 -54 -269 54 362 -222 -444 357 328 -471 -150 456 -18
2771 -18 -317 159 122 -116 3 22 -48 93 -33 -205 181 157 -345 18 379 -189 -360 360 213 -373 -25 341
2793 341 -2 -176 36 44 104 69 -269 -8 462 -121 -544 250 469 -392 -371 363 229 -261 -188 104 203 10
2815 10 -343 -59 494 14 -580 115 594 -255 -478 276 305 -257 -179 100 111 52 -180 -179 299 184 -409 -85
2837 -85 473 -47 -422 198 305 -240 -122 178 10 -50 -9 -93 58 127 -199 -117 316 -26 -349 206 288 -290
2859 -290 -163 346 27 -267 56 168 -40 -48 -73 48 216 -102 -293 237 298 -360 -252 441 126 -399 -16
2880 -16 328 -12 -188 -32 104 223 -65 -319 120 419 -271 -403 338 285 -414 -153 350 60 -243 -72 100
2901 100 133 -2 -214 37 331 -109 -362 246 304 -325 -183 280 56 -231 27 80 -23 -8 -103 -82 187 -16
2923a6k70M19J52n45Q9N41k76m26M14K16m24%K29n1n5n6l5J90Q3m06M6N26k41
2946A04m81L95L52m65j40L49L5j60o5k9K09J35m17j04N94o8o74K88N86m15m22
2967c93M55J86l19m9J49M0K6j61r3L15N3m20N8M22k52l11L54J05k88Q3J22r5O2
2990D9lj73J38K37l39r7M74j48m75L72L15m90j24M62n1l34R5J98m1r3j20J01K91
3013B44k35l18M07K79n49j04N29o3l99J43K13j50Rm8j13K98L6m15P0M90k29m73
3035c78M02L11m06j38L14J7j22o4NJ68M1l34J8M37k14l54L68J88m75O3L92k38
3057Aj98L03l3k28K24L3j73R1R1k50J11K33l04o8L55j03l06K00J93k14o0J19j1
3080FQ3l8k48K17K95m29j90N50M5n95J18M83k00l13J88J23n5j8j57J12K45j97
$$ plain form
2923 -16 -286 133 285 -260 -171 370 94 -332 82 298 -126 -126 103 52 -3 -59 -94 96 179 -227 -181 345 104
2946 104 -377 18 370 -95 -235 114 149 -11 -76 -105 104 239 -178 -282 312 244 -430 -142 444 29 -393
2967 -393 62 248 -71 -120 29 69 95 -66 -159 156 209 -211 -153 269 17 -294 60 165 -123 -40 82 -13 49
2990 49 46 -127 11 248 -91 -188 286 138 -337 35 350 -140 -264 198 147 -187 -92 106 65 -28 -148 -47 244
3013 244 9 -309 98 377 -172 -276 253 190 -209 -66 147 -3 6 -42 -155 143 179 -236 -166 324 95 -378
3035 -378 24 335 -71 -209 105 122 0 -64 -59 109 150 -184 -166 271 57 -297 71 259 -216 -153 239 1
3057 1 -197 106 73 -155 69 102 -71 20 111 -139 -28 205 -99 -167 188 85 -221 -21 172 -42 -102 17 6
3080 6 89 51 -197 20 315 -114 -304 246 291 -304 -186 297 97 -216 -28 95 40 22 -135 -23 222 25
3102B5l19L77K23m78k9M05r5k47J61K7p4Q6n8j84K55R3m01P6M08k20k54L01O4
3125A42k54R7J35j66L5P9j25N1J06j58K2J99k56o9L60r4l91L11K63m06j49M94
3147B26j20l49K58R8j60P5J0j49J62P7k60L6L11j68k31J87J14j48jj5MJ63j09
3170A1k61K91K58m76r4N55q8n07K59L12l26p2K41r2j07J53p5j07K18k9k20J59
3192CJ23j72PJ18r5kJ00j33J2J98j63j71K76Kl03J99J85l30J0L61k50k01L50Q7
3216B11l99J14K76k17r9K13n2p4Q6j14j5K09j44j98K62P2k99P2K26j80k8J60j23
3239d1j3K12j69j86L35O2m32J40L37k67j94K92N6k44P4Q4q7O5K4j67J17J56k07
3262e3n1K39q2j69J57L0j71J30O3k22Q8J67k48K0K35j46j43K59J0k83J63J39k32
$$ plain form
3102 25 -294 83 306 -172 -201 204 109 -138 23 50 -24 62 4 -180 75 168 -233 -157 251 31 -223 78 142
3125 142 -112 -15 120 -46 -11 68 -57 -6 100 -58 -36 163 -93 -162 198 104 -287 24 287 -119 -268 226
3147 226 106 -243 15 113 -47 28 38 -111 51 128 -132 -96 215 47 -184 3 117 -31 -32 -47 -43 120 11
3170 11 -250 41 299 -177 -271 284 196 -311 -52 260 -66 -138 103 11 -96 57 -18 -125 93 64 -156 3
3192 3 126 -46 -39 79 -16 -18 82 -51 -39 159 -4 -175 101 103 -200 -1 184 -146 -136 225 -25 -226 124 211
3216 211 -188 -74 202 -15 -114 99 47 -27 59 -55 -70 139 -5 -203 59 131 -168 -96 130 -50 -78 82 -41
3239 -41 -54 158 -11 -197 138 200 -232 -92 245 -22 -216 76 132 -112 -38 46 -41 24 48 -119 -2 154 -53
3262 -53 -104 135 53 -116 41 71 -100 30 93 -129 -41 126 -122 -102 133 -13 -156 103 113 -170 -7 132 -100
3285a00M9K02j67j19K44n6j78J42O5j66J07K1j53R0J43k25RK57j75j51K38K5k07
3308a05J41O0k01Q2J56k23l6K89j36k15K21R6k73Q3J77j63LJ17r0l7J42j02j02
3331a16K24l1k34J55J40k50J8K50j72q7J95n2j73J82M2k24J41J19j90j2J97r7
3353B5r8J56n6j02J12j1j40J45Q1k34P8K01k33l0K42j42j73K62L5k55J07J83k07
3376e4l4K24j33j13J70j0j74J68Qj44P2R2j59K0J67j37o8J92r5r8K42n4k09J59
3400C2J07k55L7K26j72j43K75l0k21J73O8k04Q6J30j56nJ57j16q8J87m2j28J19
3423C7N7j95J20Q4k03L7J72j78m4K22j07j46K13K1k08J03J64k09oJ85j10j22J90
3446G7k5j87J75M8k08J11J24j98j5K11r8j34J79nj50J56jj47Q3R6j87K8K12j87
$$ plain form
3285 -100 -51 151 -16 -135 109 53 -125 17 82 -84 23 44 -109 -19 124 -101 -92 165 -10 -161 77 102 -105
3308 -105 36 96 -105 -23 133 -90 -126 163 27 -188 33 129 -144 -61 116 -47 -44 73 -17 -54 88 -14 -116
3331 -116 108 77 -157 -2 138 -112 -94 156 -16 -103 92 40 -133 49 91 -133 8 127 -63 -75 122 25
3353 25 -73 83 27 -75 37 26 -114 31 112 -122 -44 157 -76 -106 136 -6 -179 83 118 -137 -30 153 -54
3376 -54 -88 136 3 -110 60 50 -124 44 52 -92 -20 72 -87 -67 100 -37 -105 87 -8 -106 136 82 -127 32
3400 32 139 -116 -79 147 -25 -168 107 77 -144 29 97 -107 -21 109 -47 -52 105 -11 -99 88 46 -82 37
3423 37 94 -101 19 103 -100 -63 109 -69 -113 109 2 -144 69 90 -118 -15 149 -60 -66 119 9 -113 77
3446 77 52 -135 40 88 -120 -9 115 -83 -98 113 15 -119 60 55 -95 61 60 -87 -4 92 -95 -67 145 -42
3470d2p1K05m8j90J82M9j91O6J55j86mJ85j18q1J59k3j44J42N9k09J13R0j67p
3494g6J56r8j11K21o9j28J30N7j98J18J34k20jK31j51j05K03k0j67J01R3j92M5
3517d7J39j42l2J81j34r6K12m3j81J47J16k16O1J42j91JK08j20j33K28n4j63J50
3540C3O7j90M0J46j36m4J81j09q4J81l5j78J86O0k10P7J28j49l8K00j40q4J57
3563E9j5j90J73R3k13K6J88j63l1J84j06o8J43l5j41J34L8j78O3J54j94RJ98j67
3587c9q6J88k2j94J74N9j82O8J58j05j01J78j02p5J47l7j07R2O9j63K8J30j19
3610d1NQ9j05OJ35r6j16K34l6k50J40K04k09o6K40q7j58J41M9j69P8J30k03M0
3634d5J35r8o4J44m8q8O6Pl4J06m9r0J12K0j98P4K11k02j02K36k9k01J47R8j91
$$ plain form
3470 -42 -113 92 44 -146 36 85 -106 -40 115 -71 -75 110 -8 -89 70 47 -97 45 104 -105 8 98 -69 -76
3494 -76 80 -18 -129 92 23 -105 25 82 -116 2 136 -84 -85 146 -5 -110 93 73 -94 7 100 -92 -47
3517 -47 92 -50 -82 99 -35 -131 81 38 -143 4 120 -96 -35 107 -84 -83 125 5 -128 100 46 -117 33
3540 33 100 -90 -50 96 -40 -84 97 -12 -96 85 50 -128 58 118 -92 -15 113 -36 -74 126 -14 -98 59
3563 59 44 -146 27 120 -93 -67 121 -42 -73 111 5 -63 80 45 -96 38 76 -102 -39 115 -79 -70 128 -39
3587 -39 -125 63 41 -153 21 80 -102 -34 124 19 -82 96 -6 -81 66 29 -78 14 83 -80 -52 78 -41
3610 -41 -36 53 -52 -46 89 -7 -123 111 75 -175 -35 169 -40 -106 134 47 -111 30 79 -90 -12 118 -85 -45
3634 -45 90 -8 -72 72 24 -64 2 9 -25 81 32 -58 54 74 -124 -50 161 -41 -143 93 64 -137 10 108 -83
3659h3K4K21j74j00J69J0j34M6Q3p0K4J0r8R1M4j28K4J41j10j15J82l7q6P3M0
3684D7j41J37J07k78K2K67j13k41K38R1k25OJ84p7r1L5J9NN3q6m6J68m4j40J25
3709B2Q0j59N7P0j05%J55j55m2J73o4j77J32J43k11RJ59q6n6J16mj39J14L8j13
3734d3K5O7m5j3K2q8P4O8j42j8K03n4k23J57J72k37j2J70j9j17M9Pk5J09n6j60
3760a29J61J19k33j9J93pj85Q3N9k3J0p5M1R7n4j72J59J44k21q5K39k7k08J28
3784eQ3j13J1P6p7j0J27j28l9J40l6j26J05O9j31M5J07j02l0R6m0q2O7J2q5Q1
3810A5l6o7J31N1j90J8K43j88j69K38P4k11K1J48m3k6n3MQ9L7j84J2K15q2k01
3835a54J23J63j65n3J07kOj4q9Q2J16j83j18K74L5k59M9K26j18j48J35M2o6j0
$$ plain form
3659 -83 -59 162 -12 -112 57 67 -67 -21 62 -8 16 26 -72 19 63 -65 -41 100 -10 -125 57 20 -66 7 47
3684 47 -94 43 150 -128 -106 161 48 -193 45 136 -89 -83 101 24 -67 -32 -13 -8 45 -41 -87 81 37 -103 22
3709 22 102 -57 0 70 -35 -35 120 -35 -77 96 32 -145 -13 130 -81 -72 87 1 -55 61 57 -82 32 70 -43
3734 -43 -18 49 4 -9 13 -75 -1 67 -75 -93 110 56 -167 -10 162 -75 -87 83 64 -53 -4 3 -22 87 31 -129
3760 -129 32 151 -82 -101 92 85 -100 -17 42 19 29 -46 -5 92 38 -134 25 169 -52 -137 102 75 -133 -5
3784 -5 78 -35 -24 52 -25 -35 92 -36 -75 65 29 -97 8 77 -54 -9 98 -4 -34 62 22 -60 7 19 -66 15
3810 15 -21 -88 43 94 -96 -78 165 -23 -192 46 120 -91 -70 78 35 9 -44 -40 49 86 -98 -86 129 47 -154
3835 -154 -31 132 -33 -86 21 19 25 11 -78 4 120 -63 -181 93 128 -131 -82 144 26 -122 13 55 -11 -21
3859b1%pP3n6p0J22L3j51K8J35o6j33J68J5j64N9J03q9pM3k8KM4r3LJ61q7j54
3887a37J77P6k02kK02k1j75K3Q4L4l3j24L2J89o4k38K14J62k47j26K60M7k00q
3911g7J30rk3p3pJ35J9k12O5K25j71k08K28Q7j65j8J18k2l5L2m7K7Q8j38j1J84
3937A22j00j65J59J03j95j0J74n8j39Q6P7q4L8k0lQ3q8j05J57J06k35rK51o3k13
3962a31J08J23q3p9L6M9L2o0j39J31J71k42r5L01K1k78K3K34q7j30N8M0N0l2j33
3987a12M7J86j19j96K49J11k61k2K10m6j10N9L1j1k4j8qJ16m5j43J33J06k29l0
4011a26K40p6j65J23J04j29k6Q3J9k9n0j3Q2N6j96MK37o2k62J77J66k02r6J73
4035C2M7j08oMN2R2j72q0K29O1k97N7K82j31k17J12J49r9p1jQ5N0j07r1K18N0
$$ plain form
3859 -21 -21 -28 45 -11 -81 41 74 -77 -49 86 20 -113 55 70 -94 -35 68 -21 -28 15 -13 -11 33 -60 -57 104 17 -137
3887 -137 40 116 -86 -88 114 93 -82 -59 25 59 26 -98 -66 123 59 -179 35 197 -50 -176 84 131 -69 -77
3911 -77 53 44 21 -52 -59 76 95 -117 -52 173 2 -206 22 109 -56 -74 44 22 -13 19 -28 -1 87 -51 -62 122
3937 122 22 -143 16 119 -76 -86 88 30 -109 -23 54 -30 8 -12 -15 68 -20 -125 32 138 -97 -106 145 82 -131
3962 -131 -23 100 17 -62 -26 23 55 -5 -144 -13 158 -84 -179 122 143 -135 -112 122 35 -95 -37 3 53 21 -112
3987 -112 -65 121 2 -194 55 166 -95 -117 93 47 -63 -4 27 16 -8 -26 -34 82 37 -106 27 133 -96 -126
4011 -126 114 38 -127 -4 100 -29 -55 28 47 18 -32 -45 37 93 -103 -99 138 76 -186 -9 157 -45 -141 32
4035 32 79 -29 -35 -31 21 113 -59 -139 90 151 -146 -89 193 62 -155 -43 106 7 -64 -65 20 70 -37 -128 90 140
4061A40k58KK67j37j57J40Q3r3m3J02m8pK8q7M3Q1j14l5J60j1j78J00J21j17r9
4086a17J64Mp1rK8O7Oj35jJ87j02k16J97J96k51j22K34N6k25M2J36m2l0n8rJ57
4112H6k4j97N7K54j40k47K12J48j67q7J08P7o0r3JJ51K8k26J4K39q1k03J34J69
4136A53j63j08J76Rj09N1j0K1K4q7l4J34%j64Q1J26j37p3J72K2j66M8J06n7p2
4161e7M1L9K2m6j00J43Q1k29l3K82k3k46J9K01k2j61M4P8N7q7j23R0J91j77j77
4186a93K21J38k33j03K58J3j72k7J17N4q6p5O7J50r2j57J21J32j57r3J85K3j78
4209h7N1Q4m3kLl1M9j7n7L8O1p8l1J21K1j84O1J48r6q8R2N0o8o4jJ10L3j49l5
4238a09J70N1k34M4K09p8k01R8J45n2j34K0J36nj32n1K03L1k06l0K41j5k14P0
$$ plain form
4061 140 -118 -116 151 14 -143 -3 80 -13 -56 46 -2 -9 19 -68 -25 56 -58 -93 67 56 -122 -22 99 -18 -117
4086 -117 47 51 -20 -29 -1 66 72 -63 -64 123 21 -195 2 198 -53 -175 59 115 -110 -68 68 26 -4 -62 -71 86
4112 86 62 -135 -78 176 36 -211 1 149 -18 -105 3 80 20 -73 -72 79 107 -119 -105 134 53 -150 -16 153
4136 153 -10 -118 58 67 -42 9 -1 20 44 -43 -77 57 57 -107 -26 100 -37 -110 62 84 -82 -34 72 15 -57
4161 -57 -16 23 45 -1 -101 42 123 -106 -139 143 120 -126 -107 94 72 -89 -45 33 90 3 -120 -30 161 -16 -193
4186 -193 28 166 -67 -170 88 101 -71 -98 19 73 -13 -88 -21 129 37 -120 1 133 -24 -117 68 91 -87
4209 -87 -36 48 5 3 6 -25 24 7 -50 -12 49 -29 -60 61 82 -102 -41 107 11 -77 15 65 -3 -67 -68 42 75 -74 -109
4238 -109 61 112 -122 -78 131 53 -148 -50 95 43 -91 -71 65 60 -72 -123 80 111 -95 -125 116 101 -113 -43
4262d3J47n5j12J3N5M5m0r6J00R3j04j18J20J02j80k4J79l4j11K9P7j8m8k9N4
4287BN0p4l1J43k0j18J7J32r0j17J26P6j33j5R6l7m0PkO0J3r2RJ14m1j61J38J03
4315A15j09j12J04R3p8r1N1P6j0j23k2K31r0j83J02J63j10j29J28R0r3n2M7L4
4339C2l9l2QM6K7j04K9J14o0r8O1J05r4o4O3L1j4pk1J5N8j13J4J37o1j60J74N4
4367A01j17n8J37k7j02KJ04m0l3L4JL9l7l8N3N2q9n1J23lj04jJ11j5n4j5j6J04
4395F1l6j01M5J39j21j16J50Q7j79j2J28J5j02L5J8Pl3OMN6l6r6R5L6q0m1J08
4422C7mm2RPj1K1m0rQ1j5r2P4N6j15n3J26Lj33P1J20r2n8O0K0k2K7m2K7Rm9k4
4453e3P4Jp4J3R5n0o1M5L8k4J0n8K1J17p1q7J12J9j19j9J65m7j19O9N7m9l5L0
$$ plain form
4262 -43 104 49 -63 -50 5 50 10 -86 14 107 3 -115 5 107 -73 -97 82 48 -63 -34 43 25 -23 -52 2
4287 2 52 -22 -53 90 70 -48 -31 101 11 -106 20 96 -37 -52 44 7 -33 -26 -28 32 45 -47 -38 76 35 -126 12 115
4315 115 6 -106 -2 91 13 -78 -27 49 39 -84 -106 125 35 -148 -46 117 7 -122 6 96 3 -49 -2 32
4339 32 -7 -39 -31 15 42 -62 -33 81 21 -77 -16 89 -5 -69 -6 25 11 4 -17 -2 56 -57 -43 94 33 -127 47 101
4367 101 -16 -74 63 36 -66 -64 40 0 -33 1 2 41 4 -34 19 71 -18 -69 54 51 -53 -54 57 42 -12 -27 -43 61
4395 61 25 -76 -31 108 -13 -129 21 108 -71 -83 45 60 -42 -7 11 18 -15 -9 -5 51 15 -81 14 50 -30 -71 37
4422 37 33 -9 0 7 -4 17 -23 -32 49 34 -58 16 72 -43 -96 30 33 -100 -29 91 -1 -59 1 21 -1 26 -16 11 20 -29 -53
4453 -53 21 22 -52 -39 56 6 -55 -10 28 4 14 -44 -23 94 23 -64 48 67 -52 -71 94 47 -72 -3 54 5 -30 0
4481@k0L5J3r2M6P0p3k4P1k2m2M1K9k6k8N8p8M9K8m2k3P0l1o1R3L3j22L2P3o9
4511a2o6J24k2o0M5PjrJ1k6M0Rr7K7P3p2m8O3O9p9KN1j9mKn1O0L4q6k9J29k8j05
4544f8N8O7p0kK8l2J1N6q0K0N7m9o6R3M3r3j0Q9o3j3O4o5pM7%m5N5k0m3L6J8j5
4576AJ0N0n9m7Q9j4p0N3M3r0J9K7k5L4Nn0k6R4m3q3J16Qm6l6P5k5j9mJ0J4K9o0
4608b0j4O6l2n7N0N0p6QL4rj2J2j3j4M9Rj00Q2M3j04JO6j7m2M5J8o1N4J3o5O0
4639B4J8m3OK0mn3O0Oo5N9j7l1N6J5o6j0N2l7l2P7n6KL0qn0N5N3r9NO1k4l7J9
4672a4L9l4%L6n7N7jn5M4K1l9n3O0%m2K2M6k9P%o9M7M4l9oL5j4j8J5M1n1NL2l9
4706iJK5j2j1K7J0m9K6K8l6JK0m2K5J0j7NK9j0m2K8On6M7J8k5qK4J0m3L2L5p2
$$ plain form
4481 0 -20 15 28 -64 -18 52 -21 -45 26 4 -38 3 32 6 -22 36 -42 7 35 -7 -30 40 9 -52 41 74 -48 -16 57 -12
4511 -12 -78 46 24 -36 9 16 15 6 17 -9 31 40 -57 -30 43 -29 -77 -14 55 -24 -22 29 10 6 8 -43 17 51 -35 -64 65 37 -68
4544 -68 -10 57 -13 -15 13 -19 -8 48 -32 -12 45 -4 -70 23 66 -27 -37 52 -11 -24 40 -25 -32 15 15 -30 25 5 -38 -2 16 1
4576 1 11 61 2 -45 44 30 -40 13 56 -34 -15 12 -13 21 26 -24 -50 44 1 -82 34 42 -4 -40 35 10 -9 -13 -3 11 40 -20
4608 -20 -34 32 0 -57 -7 43 -33 -25 9 0 -12 0 -13 -27 22 31 -69 13 56 -48 -47 19 2 -40 5 23 -38 16 29 -36 24
4639 24 42 -1 5 25 21 -32 28 34 -31 28 11 -20 36 51 -15 -25 27 -10 -42 35 -21 -19 11 3 -47 8 61 -38 -33 28 4 -33 -14
4672 -14 25 -9 -9 27 -30 27 26 -29 15 36 -3 -56 4 4 -38 -16 30 1 8 8 -61 -14 30 -9 -15 20 6 -12 3 44 -7 -2 30 -9
4706 -9 -8 17 5 -6 21 31 -18 8 36 0 1 21 -21 4 14 -3 2 31 21 -21 7 13 -43 4 22 -3 -11 13 23 -20 12 47 -25
4739b5K4M6n7L1j0l7J4L6l4j4K5j4j2J5N5o6K9K1om8N9qm8P4j7o9K8N8o0j4N2
4770B8l4k7M4K3j1l9M5j8j0Rj6J2M7n9k1N1l4j8M5nl8M5om0NJ0qK6Nl6JK5K3k4
4804@K2pj3KMj5Nlm9M9L8Mp5M8J5o8pR0j5n3K4j2k5L1K9l0lM1m0k2L0k6L4ML0
4839C7n9K7K4o8M9J4k9j3M5qj5jOl5J8N0m8QRJ8p4P5k7k9K2K9l8RK1m4K6Qk5P
4873a1M3j8j3NK2m0J1J2l0nL3l1J8K7mk2MJ3k1MN7n9k5N2j2jK6j8l9K4J3n4L5
4906dkj9RL2om9O7ql4J0JpPK6pl6M7k7mL4l6rK3J8n2K1K2m4J5M1k9pK3qk2J9J0
4943A5j8L0J3p6L0LqOK8j9l3O7l8k2K4L9q2L3L4p2K7N3j3m2J9J5m3M5J1m8jJ6
4975gj1K3J2Lj4pj4J7M0m3k3M4j3nl0M2km6L9ol1L7L6p5J4P0n8k4N3nm0M2j0k0
$$ plain form
4739 -25 -1 45 -12 19 9 -28 -14 22 -12 -26 -1 -15 -27 -12 43 -23 6 27 21 -27 32 24 -24 50 33 -36 -8 50 -10 -24 28
4770 28 -6 -33 11 34 23 -16 29 11 1 10 -6 6 53 -6 -27 24 -10 -28 17 12 -26 19 13 -27 -22 -12 -20 6 11 -25 -24 1 24 0
4804 0 22 15 2 4 8 -7 -2 -5 -54 -5 33 37 -38 10 25 -43 -50 40 25 -28 -4 -16 -41 -10 19 -11 -14 27 -13 -35 -5 -31 3 7 37
4839 37 -22 5 29 -39 10 24 -5 -18 27 19 4 3 9 -26 -8 42 -6 2 11 29 -45 30 3 -26 -4 25 -13 -4 17 -27 -1 7 -18 -11
4873 -11 32 14 1 6 28 -12 -1 11 -19 -24 9 -22 -4 23 19 -3 1 14 -7 -3 54 -5 -30 22 10 9 35 17 -22 2 15 -39 -4
4906 -4 -6 -25 -16 16 10 -39 28 20 -14 -4 -3 -10 -3 23 16 -20 27 0 -4 30 -6 -15 8 26 -26 -5 17 -27 -12 29 0 -7 16 8 -14 5 15
4943 15 -3 27 40 -36 -6 -3 -11 -5 23 4 -29 38 0 -22 2 41 -41 -8 26 -46 -19 34 21 -21 -2 13 -30 15 26 -22 -23 -7
4975 -7 -18 5 17 20 6 -1 -15 2 42 -1 -24 20 7 2 -28 14 12 -34 5 -1 -32 5 41 -34 -20 50 -8 -32 21 16 -24 18 8 -12
5009a2K8Pmk3J1l1K4M0m4jL9jm5J8Ro2N3N0n7%K7m0K7pj2l8O4j9j0ML6m5l8L9
5043a3K2l1J9J6l3j3L1PJ1Mk8LJ2k5j4O1J1p8K5L6l5j0L0mk9L5j4J7J9l7j3L3
5075A5%m3K0L8l9j7J8Jj7K9ll1M2J6n3M4ol0MK5%k0K5k6J7rolK2J2n9RM6o3K2
5110b0P4l4m7L1L3m0k2M2ol1K3J4qMk4l6P1j9l4K7L4k2k2K4j8J7k2L1k8L0l3R
5142bK2Mn4J3L8Jj9J2Rm0MJ5k0K3J4l8K4Jj2%K2j7k5mQ2m6k4J3K2k1j2L1j6Or
5177cqQJj9J5K9l9lK8Klk6lQK0k8KK3J8m1j4O1k3l6ON9k4l4K1L2k0j6J7J3j2j6
5213ej2M2k9m1O6Pl9JJ5j1Ql8M1K0j6k3j6O3l2k0pO1m5mL1rj7k3L1j4k1K6L%P
5248@qMqJ7l7K4J8k1j7K6J1k5LJ7Oj2j5K5%j5l3L1L5l6l0O3Nn3kK2M1o7K4KJ4
$$ plain form
5009 -12 16 23 19 -4 7 -24 0 40 -4 -5 34 33 -12 6 15 -47 6 56 -1 -1 26 -14 13 6 -6 -44 20 1 -9 -5 31 -14 -52 -13
5043 -13 9 -22 -3 13 -20 -33 -2 5 16 20 -8 -5 7 -18 -32 29 40 -38 -13 23 -12 -22 8 4 -25 10 -4 13 32 -5 -18 15
5075 15 15 -28 -8 30 -9 -26 -8 -7 -24 5 2 -29 13 29 -24 20 14 -16 -12 13 13 -7 18 -8 9 0 -6 -9 13 25 -34 -25 21 -42 -20
5110 -20 54 20 -27 4 37 -3 -25 17 11 -20 3 17 9 13 -11 -47 24 5 -29 -2 32 10 -12 12 -6 11 -11 20 -8 22 -11 -2
5142 -2 20 24 -30 -17 21 22 3 15 24 -16 -12 3 -17 6 20 -18 6 7 -5 -5 17 0 -25 -29 53 7 -17 -4 18 -3 -15 16 0 6 -3
5177 -3 -11 -3 -2 -21 -6 23 -16 -19 9 11 8 -18 -21 -13 7 -21 -19 4 22 -19 -33 28 5 -31 -25 34 10 -24 -3 29 9 -7 10 23 11 -5
5213 -5 -17 25 -4 -45 21 28 -11 -10 5 -6 2 -36 5 25 9 -14 -30 33 1 -19 -26 35 -10 -14 17 8 -9 -32 -1 -15 -36 -10 -7 -7 0
5248 0 -8 -4 -12 5 -32 -8 10 -11 -28 -2 9 -16 -13 4 10 -2 -17 8 8 -7 -40 -9 26 -10 -40 23 28 -25 -27 -5 36 -31 -7 -5 9
5283Il1%KM5l3l4M1Rl0k5O3L1n8j1K9oK3k8k7M3j2l3L5J4m0j7P4l1k8K0M1k2k3
5316a0j5K6Lj7lK1ml8kM7J6r3N5N4j7m0K1K1o5M2l2J7N1o5J8L6kl8K2J6j2m1M3
5349A5Mpl7K0K5Mn7nO3rm5j8O4j3k3QK2l1K5j2LJ4k3j6N2jn1oR1p0k6J8M9k7k1
5384b1N5J7o2lnL6j9j5J0J6Ro6L8K2j1m7O5J1m5J4RK7j8m8K7M6k5n2JQ3l6k8R
5417fJ1k9k2M2K2k5j0J3J9jm6ML7Pm0J1P6o2k7K2Pj1Kj1L3l4k0J1M3l4kK5L2n2
5451a5j2M6k4j4PJ2k0RPN4k6nm0K7Lk4nN2j3m2kK2J4j4k1K2K4rl0N0K3p3k0M9
5485A2J5n1mO6n7j5QL0J9n1J0L2qj4MjK1k2J8Ok5j8jP6m2j1%L2k1Pj1NL8o4j7
5520c4O1nm9J8M0n0mL4j3K1k4J3Kql8J4L8Rm7J9J8k1k4J4kK2Jk1M3%l4l8M4J9
$$ plain form
5283 9 -22 -22 -20 25 -8 -42 -1 8 -22 -47 16 47 -11 -22 7 1 24 -4 -31 12 0 -33 2 16 -24 -41 33 2 -26 -6 35 13 -10
5316 -10 -25 1 4 -13 -16 5 1 -37 -39 8 24 -69 -14 40 23 -17 4 25 -40 2 -30 -13 38 -27 -9 27 25 -13 9 25 13 -28 15
5349 15 19 12 -25 -5 20 24 -33 -38 25 16 -29 -47 17 4 -19 -11 11 -20 5 -7 -4 10 -13 -29 23 22 -29 -35 56 -14 -40 -22 27 0 -21
5384 -21 34 51 -11 -14 -19 17 -2 -17 -7 9 18 -48 -10 12 1 -46 19 30 -15 -1 8 35 17 -31 -4 42 17 -35 -34 49 13 -15 -6
5417 -6 5 -24 -46 -4 18 -7 -17 -4 15 14 -32 -28 9 16 -24 -13 63 1 -26 -4 3 -8 -6 -17 16 -18 -38 -27 16 -18 -20 5 37 -15
5451 -15 -27 19 -5 -19 -12 0 -20 -11 -4 50 24 19 -21 6 9 -15 -20 32 19 -23 -25 -3 11 -3 -24 -2 22 13 -17 33 56 -17 -37 12
5485 12 27 -24 -28 38 -19 -34 -26 4 23 -28 -18 14 6 -8 -4 -5 16 -6 12 18 -7 -25 -26 50 8 -3 -3 29 8 15 4 9 47 -17 -34
5520 -34 27 22 -27 -9 31 -19 -23 11 -2 19 -5 8 10 2 -36 -22 16 25 -22 -3 15 -6 -30 -16 -18 4 5 -16 27 27 -7 -45 -1 18
5554A8j6k9M2j3j7NN3m5j4J0K4nj9mL5Mn4K5J9j4m3L8Kkl8K6K7j9k1pK3J3k7K5
5588BL5n3j8N3K0n0OkJ3j9nJ5J7Lqj5K5m1J8J9J4k6n0M9L6m6lL1rK5m1qL7k3n0
5623d9K3N2l6J9j2J4k6J1pJ5J2k1JK0mj0KL6n1k0K6J4qk0J8J4l9K6j2%j1K4j2
5656a1KnlpN7n6kL2k5Nk4O8k8mj9OJ5j0k2L8kPrK8pm1j1M2J%k6K8ok3J2KkMj1
5695gK2K0o1J1MJ0l1QK7Pj5m%K0pk3L9j4oqkJ2j0J2j0Qj3kj0K5j6L0Jrl0J9LQ
5733Hj3rJ3J8pJLl6kK8J4j5mJ3Jkm1M5qNk0MJ6k0pJ2R%jmJ1K0m3kJ9%qQJ1J2l7
5774hPJ3j2k1NK3kk5K2JJ0l9J6K1j4k5K2j1J9k0LL6j7K%qopLRk0J6J7Nl0J5K0
5811B0j0rnL1l2M0o0L1k4K4j9KQ%j6N1k6moMKl5K1l3M9plK7m3QKK5J8n0%K7Oj3
$$ plain form
5554 18 2 -27 15 2 -15 -10 43 -2 -16 -6 18 13 -6 -10 25 29 -25 0 19 5 -38 0 2 0 -38 -12 15 -4 -25 -32 -9 4 -23 2
5588 2 37 -16 -34 19 39 -11 -5 -7 6 -13 -18 -3 14 17 9 -6 19 -22 -4 15 29 3 -47 2 38 -8 -11 20 11 36 -5 -13 24 1 -49
5623 -49 -26 26 -10 9 -3 11 -15 -4 -11 4 16 -5 -4 16 12 2 4 40 -11 -31 -5 9 1 -19 -1 13 -26 0 -12 -12 -23 1 -11
5656 -11 -9 -14 -17 -24 33 -23 -25 7 -18 -13 -37 31 3 -1 -20 -14 1 -9 -31 7 5 12 3 31 24 -17 -28 14 15 15 -11 17 11 -12 0 2 0 4 -7
5695 -7 15 35 -26 -15 -11 -1 -32 -24 3 10 -5 -9 -9 11 4 -19 20 6 0 -8 -10 2 -8 4 -6 2 -11 -13 -23 2 -14 16 17 8 -22 -3 0 8
5733 8 -5 -14 -1 17 10 11 14 -22 -24 4 18 3 -1 12 13 11 -30 15 7 12 -8 -4 12 -8 -15 -3 6 6 5 1 12 32 -11 -13 6 6 -2 6 17 29 -8
5774 -8 -1 12 0 -21 -16 7 5 -20 2 3 13 -26 -10 11 -3 -28 -6 -17 2 -18 -15 21 4 6 6 -2 -8 -15 -12 -3 -23 -7 10 15 -15 0 20
5811 20 10 1 -4 27 -5 35 -25 6 -18 6 -13 -11 -3 -3 -19 32 6 2 -4 0 2 -33 -12 -45 4 -3 -6 21 -22 -14 -12 13 31 -19 -19 8 14 1
5849ANj5M1j0n1J4rJ3oL6l9K6PPj0%%j3mQJ2j6J4pk0JL9k2LOj9LJ1j2k1M2k5O
5887dK6%Pj9K0l9J8j2mkJ4J5j9j0J7r%MoLk4J7j4K7ojj2L4k6kJ7m0OL0j8j6%N1
5925B3l0J4k3%J3KK1l6J8jJ7Mk9J7Mnmk4K3j6JMj5K9rLj6L8j0nJ0m2NL0j7j3K1
5962Bk4K7NLOqNlj3L9k7j0j8J7k9J6KL3j8k8M8j4pj6J6MlKk0L3m2L2j5K9m3QL6
5999B5j7k7K7kJ0k0j3K8j8PJj0QlkM2m0nMoPJ1Ok6K3J2pl3J1k3K3JPj3K7k2j3
6036b0J9LJ1nj7MLOnRJ6j7k7NK9qj1LjJ2Nj4k0KL5l4PK9j4mPkk7Rj4K4pJ4n2N8
6076A1k8lK6Lj4j5K6j9J2KOk0J2oJ7j3Ok0K1ooMJ1jj4j1K7l6Qk3N6j6nol4M8l4
6113c4J1J0oMk1K7k0JK3kmMJ4k2K0J2k7J3PJ3k0qK7j5j4J4Lkl2K1J0k9nJ9M4k8
$$ plain form
5849 1 6 -9 32 22 -29 -15 -24 -11 -17 19 -20 6 13 20 10 10 10 -3 -7 1 13 -3 11 4 -16 -15 24 2 5 11 -8 -5 6 -6 -27 15 -10 -4
5887 -4 22 22 29 10 30 -9 9 -3 -7 -9 5 20 1 -9 8 -1 -1 3 -3 0 -24 -7 -21 6 0 -1 -13 21 -5 -7 10 -30 -24 6 -12 -28 -28 23
5925 23 -7 7 -16 -16 -3 -1 20 -16 2 1 18 22 -7 10 14 9 5 -19 4 -12 -11 -7 -22 7 -2 1 -15 23 13 8 18 -24 -19 11 -6 -19 2
5962 2 -22 5 10 13 19 11 16 13 0 39 12 2 -16 1 -28 -12 -10 23 5 -23 25 11 4 -12 4 8 5 7 -13 20 -22 10 -5 24 -19 -11 25
5999 25 8 -19 8 6 16 -4 -17 11 -7 0 1 -9 -1 -4 -6 36 -4 -9 -5 -11 -4 7 13 -13 10 22 15 -18 -7 -30 -7 -6 1 -12 15 -7 -20
6036 -20 -1 2 13 8 -9 -5 -2 4 -1 8 24 7 -20 -15 14 6 -5 -2 -3 9 14 0 -20 -18 17 -17 -10 19 5 1 8 6 -21 -12 -26 -2 -9 5 -47 11
6076 11 -17 -20 6 9 -5 -20 6 -13 -1 1 7 -13 -1 -7 10 -3 3 -17 4 -2 -8 -4 7 6 -8 -19 8 -28 -20 -43 13 -3 -8 -14 -48 0 -34
6113 -34 -23 -13 -19 -15 -36 -9 -29 -28 -5 -7 -11 -7 7 -15 5 17 -10 3 10 23 3 -5 22 7 -7 7 10 8 -24 -3 7 -22 -27 -8 36 8
6149HnNNk0qJ1L4l7Qk7mK9j3mJ1j2J6rlL6j4j1Rj7K2j2pL8j8j3rK9k2lkJJ3Qj7
6188dk5L3K1l9J5lj0L1k6Pl0M1l0J2J7j8L6j2l1J4%%J9m2J4L7m1J4k5KK5m3M6
6221ELnnOk6K7LQj5MNm2L7lNkm0K4J5pK3J8k1j0qqj8K2K0oj3K7m5M3nj4J6j5%
6260CNKj3RMJ4k0MK3k9Nl0NK2j8O%K1%k3j9K3k6L8jJk4K2J3l2J0J9k7QK8n6K7
6297fK7l6mJ9Qpj5J5MJ4n0K5j2M1k8J8J2m8J0L1m0J2j0L1j0oK9j6k0oK1k5K8%
6331Fl3MK1k1K1j8j3J5jK8oJ7j1Kk5j1L5j9lj1K9ml4K4L7j7j6J4jjpJ0j9j6K1
6366cpPJJ7j5J0l3J6Kj4J8Pnj6K1qJ2l8L5J4j8j3pN4l5J2m1OJ5K0k4j6K9Pj4J
6402cK1j6J5k2LK0j0k1pK9j2q%k1J5PK3j9nQlNl7OK4J8k5PJ5j6NqPK0Jk5K4k2
$$ plain form
6149 8 3 8 13 -7 -15 -4 30 -7 1 -26 -30 -1 -14 -18 -7 -19 -3 -12 -15 21 7 -4 5 -12 10 -2 -9 29 11 -2 -11 18 -4 -7 -9 -8 5 13 -4
6188 -4 -29 4 25 -14 1 -2 -12 19 -7 0 -30 11 -19 -7 10 -8 28 16 -15 -1 -1 -1 18 -24 -10 27 -14 0 -25 -23 2 -41 5
6221 5 8 3 -2 4 -22 5 8 16 1 5 10 -32 5 2 7 5 -35 -11 4 -3 20 38 17 7 -1 -9 -27 -5 15 9 -4 23 -22 21 16 2 18 3 3
6260 3 8 10 -3 6 10 24 4 8 31 2 7 -23 -18 4 -14 -8 -8 13 13 -10 -29 -6 -32 6 5 6 -18 4 17 -15 -5 14 -13 -5 23 -33 -6
6297 -6 21 -15 -19 0 8 1 -14 1 5 19 -31 -6 -18 23 -5 13 25 -23 -13 18 -22 -10 -20 11 1 -5 24 8 -12 -18 3 -22 6 6
6331 6 -27 -23 -2 -23 -2 -20 -33 -18 -19 9 3 20 9 11 -14 -25 10 -9 -12 -23 6 2 -32 -8 29 12 -4 10 9 8 1 11 -8 -24 -3
6366 -3 -10 -3 -2 15 0 10 -23 -7 -5 -19 -1 6 1 -15 6 -2 10 -28 7 21 3 -10 -17 37 2 14 -27 -21 -6 14 -10 -26 3 10 -4 -3
6402 -3 18 2 17 -5 -2 18 8 -13 -20 9 -3 -11 -11 -32 -17 -10 13 -6 -11 -3 -6 -1 -38 -32 -8 10 -15 -8 7 -9 -4 -12 -5 15 16 -9 15 -7
6440g%J6j0M0k4%Pj2j6lQJknj8J4K1j4rL1j7l6J2J3%j5K6Ml1J1NJ1j1K2j0J3j
6477A4LKl0J5j9J0J0k4jL1Kk7Rj1L1l3j4J4K6k4j7M3k8K1mj2kJ5J2j5J3Jj9KN
6512alk6K6mR%j7J8j0K6k7oK2j1k7L7knPoj6KLj3kOJ8%Lj3KJ5nj0J5jnl1O4m1
6552i%K6k6k1N0joJ8km7K3%p%J1Ll1PPJrj4L6mk6LJ5L0k0rJ0Ml3J1jJ6Om5M5l
6592HQrQj8lk1J8J9k2K6Pl0j6J0J6j4J8l3L2kk1J1J4Rl2j4L9kj1k5M5k5LQk1J3
6628gJj9K8J2k8PNJ8l9K8L5l3pJ1Pj4l4J5L1%l1QJ0KLj4LOQk5K4k4j2K7j3M6l8
6665cl9N6jl7K0MJ6n8K5L7k6K2J3j6j9QNmJ8k0j9J5L3m8L1Krl9J8L7pl7PK2k3
6700a6oK0K%k7K2L4nq2O2K3l4j1MN4m5J5j1K0l2J4%J1Kl2K4L4j7m9LL7lpk5N0
$$ plain form
6440 -7 -7 9 -1 39 15 15 22 10 -6 -9 -1 0 -2 -7 -25 -11 10 -4 -13 18 1 -35 -23 -10 -10 -25 1 5 -26 -15 -10 1 -10 12 2 15 14
6477 14 17 19 -11 4 -15 -5 5 -19 -20 11 13 -14 -5 -16 15 -18 -32 -18 8 -16 -33 10 -18 3 -1 -13 -15 0 12 -3 10 11 -8 -6 -1
6512 -1 -4 -30 -4 -8 1 1 -16 2 -8 18 -9 -15 7 -4 -31 6 4 -1 6 0 -16 -14 -11 -24 -26 -20 -2 -2 1 -12 -10 5 0 -10 5 4 -1 -32 32 -9
6552 -9 -9 17 -9 -30 20 19 13 31 29 -18 5 5 -2 -2 9 12 -19 -12 -5 -4 -13 -27 9 5 -21 -18 -3 27 7 -2 8 12 -21 -10 -11 5 11 -34 11 8
6592 8 16 7 15 -3 -6 -27 -9 10 -12 14 21 -9 -25 -15 1 -13 5 -28 4 2 -19 -8 6 15 -17 -31 8 6 -5 -30 15 -10 -7 1 -20 -7
6628 -7 -6 -25 3 15 -13 -6 -1 17 -22 6 41 8 1 12 19 5 -29 -14 17 17 -14 -6 4 6 9 -5 -2 4 12 -13 11 -13 -25 2 -11 35 -3
6665 -3 -42 14 13 -24 -4 0 16 -42 -17 20 -6 16 29 13 -6 2 7 3 21 1 -18 -3 30 -18 13 15 6 -33 -15 22 15 -22 -15 7 -16
6700 -16 -22 -2 0 0 -27 -5 29 24 -58 4 27 -7 -18 -14 40 -5 10 -1 19 -13 1 1 12 14 -18 6 40 23 -26 -23 14 11 4 -21 29
6735B9k3j8K8k8OQqPMj2j3M3k1k7J9OLl5N1j9lnm1N6pl0J9K3qk3M6mk1m5M8Jo
6772@j1K0K6j2l8K5JnpNjpj4J0Pk4%M8j9J3k3j8M0l4j0L3Ql1j0M1J1l9LJ7NNl
6809A2qQoj5LL9o4kL9Oj8nJ8Lk8J5NQj7j2L6J6n9j8N2J1m3K4nRj2PM2n2J0k6M7
6846B0J6k5k4M0j9%k6J2J2k8l0P9k8J5l8L1K2qk2J3Lo1K7M4ql0JL9k4lJ7J1pm0
6880a9J1RK0j2j0L8n0RLQMm3K1K4jj8J3J2j5LqJ4jl6K3JKj5j0M8k3k4JK8j0Rk0
6917a4L6j8k2J6M2l2l3J4J4J2l6mN2Lm8oL6Ll7k1K2L1k1qM0l8K0k6M5om4J7J5
6950Dj3rL2NJ8n9J6L5k5k8K2K1nj6PJ7m3KL7K0n8K0jK5l0j2PK4k4l3L8J6j0Rk
6985GJ6k1l5K0M2n4J3K9Qm4Pj0K7Lk1j2O9k0m9J2K3oMj3K2l6oM4J5l0l0K3MJ9
$$ plain form
6735 29 6 -12 16 -12 -6 2 -6 1 5 -7 -20 23 2 -25 -6 0 3 -32 19 0 -3 -8 -49 7 0 -30 -11 12 4 -19 27 23 2 -43 5 6 0
6772 0 -11 9 35 23 -15 10 11 6 -1 4 3 -4 -18 -8 -1 -25 -25 23 4 17 -6 -24 16 -18 -28 5 13 -18 -28 13 24 -15 -12 5 10 15 12
6809 12 4 12 6 -9 -6 33 -31 -33 6 12 -6 -11 7 10 -18 -3 2 10 -7 -19 17 33 -26 -44 8 19 -24 0 -5 4 -8 -1 41 -11 -1 -27 20
6846 20 36 11 -13 27 8 8 -18 -6 6 -22 -52 27 -1 14 -24 7 29 21 -1 12 15 -46 -19 25 17 -13 -12 27 3 0 17 28 21 -19
6880 -19 -8 1 21 9 -1 37 -13 -4 -1 7 11 -32 -11 13 12 -6 7 19 4 7 -1 13 12 -24 -1 0 2 -13 -23 25 2 -22 -21 7 -3 6 -14
6917 -14 22 4 -18 -2 40 8 -25 -11 3 15 -21 -25 27 30 -18 -24 12 15 -22 -43 -21 10 -11 -19 21 -17 3 -23 22 16 -28 -11 4
6950 4 -9 -18 14 19 37 -22 -6 29 4 -24 -2 19 14 -2 5 22 -21 -19 18 38 -20 0 -1 24 -6 -18 -11 13 -11 -44 -6 10 0 9 7
6985 7 23 2 -33 -13 29 -25 -12 17 25 -19 -12 -22 5 8 -13 -25 44 24 -25 -13 10 4 8 -5 17 -19 -25 19 34 4 -26 -3 1 20
7019B0m5L6J2k3J1ljj8j5L4nk4M0Ol2Lk9L6l8M3n2M7Kl9J7L7Rl8JL5j1k0J9Kj5
7054Bj1j5L7K0n4J2L6k2J0k1J0J4j1j6M6n1J7k0L1J9n3kK3K8n1QJ7L2m2nK5k6
7086a3J9j6L1k0Nj9J1L7m7L1LJ5k2j5Jk0J2oJ8Jk4J2J4Lj0j3%K7l4J0K7m2J0J9
7120Enj9J3LJ5k3J7oJ7rj2K0%ok6J3J1jk6J7J6j3Nl6N0ok3jL4k9k1K7Nnkj9L9
7157A9Lk4mjOmJK9l0j4MJ2k0J5NkJ2k0K0J4j3j3k1L3mK6j6j9NqJ0kMj0KNJ0rj9
7196a8J8Nm5J8M8j3mk7N9m4JQJ3k2PK1m4K3j2RJ3lj7JL0j3k1J9Ok5OM7m6nJ1p
7232cK5ol1J8qLj5L2lk8NrK7j0Kmj3MJ7j0j1J1%J3K5m3mJ9%K4j4joj3J5k7L1j
7270A1k4K2nPm3L0Qk9J7J8j7J5qj8K5j0jj4L0k4lQjJ1olMPnJ2J0j8nk2K2Qqk2
$$ plain form
7019 20 -25 11 23 0 11 8 7 -11 -26 8 3 -21 19 25 -7 -4 -33 3 -35 8 -44 3 5 -34 -17 20 29 -9 -8 27 16 -4 15 17 2
7054 2 -9 -24 13 33 -21 -9 27 5 15 -6 4 18 7 -9 37 -14 3 -17 14 33 -20 -22 1 29 -22 -14 3 35 -7 -12 13 -13
7086 -13 6 -10 21 1 6 -13 -2 35 -12 19 22 37 15 0 1 -19 -7 -13 5 6 -18 -6 8 11 1 -12 -12 15 -19 -9 18 -24 -14 5
7120 5 0 -19 -6 -3 12 -11 6 0 17 8 -4 16 16 10 -16 -3 8 7 -19 -2 14 1 6 -30 20 14 -9 -10 24 -5 -26 1 6 1 -1 -20 19
7157 19 22 -2 -6 -7 -1 -5 -4 25 -5 -19 -15 -3 -23 -8 -3 -5 7 -13 7 21 8 -5 -26 7 3 29 13 -6 -1 -9 1 -1 3 -7 -5 0 10 1 -18
7196 -18 0 5 -40 -22 26 13 9 -18 41 -3 -2 6 19 -3 4 25 -19 4 -8 1 14 11 -6 -5 25 12 -9 10 16 -9 -3 44 -2 -7 4 -3
7232 -3 22 16 -15 3 -5 -2 -17 15 12 -16 -11 -20 7 -3 -1 -5 -18 -14 3 -7 -18 -7 -7 6 31 -12 -16 3 3 27 13 12 6 -7 8 -19 12 11
7270 11 -13 9 4 11 -32 -2 6 -23 -6 12 -5 10 2 -16 9 -1 -2 -16 14 -10 -13 -5 -6 5 -1 -4 0 7 2 14 24 6 1 -21 1 9 1 -21
7308b1L0j9j6J7L1j8k4L6k5knLQ%K5l2J3j3K8l3J0j7K9oK2l4qK2J3n0M7m4M6P
7342B0j9pkK5n0M2k8M6j2ll3K8k0J2MJ6oj0j2%pj1J9j4OrL7m1M7k4JJ3Jj3Nk8
7378b7J9Pj5J7j2K5K0j2qjk1J8qlK0j5Pmk0J2RK5j8j0j0Oj5K2j4K5l2LQk2NK3
7414Dj2oqM0l0J4NK3k4j0Ojk4K0jL8k9j6OK1oj2K7l4L2k1RlJ0pjrpJ4l1MK3j3
7452iJM3j4l1lRQj0J3qkMJ6k5nJ6j4JK7l1lM4j8j1rJ3k2j1MRJ1%L6l3J8k3nkJ1
7491ej3K7Oj8J5k0Mj1K9Rn8J1M3l2L2j2JJloj8L1J4k5rM7k5k4L2klNk9KKj0RN
7529BNl4J5J4rk1J9j2QKJ4j8J0J6j3j9K0Pj3%Nj3J0K4j8J1l3J8%MRlj2Qj8K1k4
7566a8QK6jl8K2J8J0m3k2L1j2J5k1J1j2J1k3K1J5Kj6QJ7j5J1lK3m4L2j1j7K8j3
$$ plain form
7308 -21 9 -10 -26 -9 22 4 -20 16 -9 -11 -16 -13 -5 -5 20 -12 1 -12 16 -17 -7 -24 5 -1 21 -13 -21 1 14 -36 11 -33 13 20
7342 20 1 -6 -8 17 -33 9 -19 27 15 12 -21 7 -13 -1 3 19 13 3 -9 -9 -16 -27 -8 -22 -16 -25 12 -29 18 -6 -5 8 9 -4 1 -27
7378 -27 -8 -1 -16 1 -11 14 34 22 14 13 -8 10 2 -1 19 4 11 7 -13 -1 8 33 15 5 -5 1 -14 8 -6 19 -13 -10 -2 -24 -19 4
7414 4 -8 -14 -22 18 -12 2 7 30 6 -4 2 1 -23 -3 -4 34 5 -11 -5 16 10 -2 25 -9 23 2 11 8 18 11 10 1 -6 8 -23 -19 4 -9
7452 -9 -8 35 21 -10 -13 -4 4 -6 7 -1 -3 1 17 -8 -13 3 -11 -10 17 -14 -17 27 9 -2 -11 2 -20 -31 -27 -18 -7 -7 29 -4 14 -9 -14 -16 -5
7491 -5 -18 9 15 -3 12 -8 -4 -15 14 23 -35 -24 19 -13 19 7 8 9 6 0 -18 13 27 2 -7 40 15 -9 23 21 18 23 -6 -4 -2 -12 -3 2
7529 2 7 -27 -12 2 -7 -28 -9 -21 -13 -11 3 -15 -5 11 -2 -21 -1 6 -7 -7 -2 -15 -5 19 1 12 -21 -3 -3 1 10 7 -5 3 -15 6 -18
7566 -18 -10 16 15 -23 -1 17 27 -16 -38 -7 -19 -4 -25 -14 -26 -15 -38 -17 -2 0 -16 -8 9 -6 5 2 25 -19 13 2 -15 13 0
7599@j4J7J8j4J2Qm4%M4rk6K0jqoJ3k3LL3l6J9NrMl2J7Jj7L0j8KlJ3k0J8k1K4
7636@j0K5m7K6Ok1L3%J3l3K3l1K4j4kj4K8J9m6KK8ppJ4j6K0Mk8OnM8k7j1j%MJ3
7673A6l4L3Mj5k1L3pl8KL4oKmOj5J5lj8K5l1K4k7L7Jj7J9k1J2k2L4j6j6Pj0RK
7709folK5jk1M5k1j2Rj2j4j5L6pkjMj4K8k2j1K6kJ4j2Nk1K5rl4mK5PPk5L6j9j5
7747a7N0m1PJ6j8pML0m1J8LqJ2J8k8kJ4j5kJJ5k2K0J5j4j3%qL1k4jJ4l4L8k4l0
7783d3M2%KK1k7PJ3Mm0jRjlJ6J1%m2M0J5nqk5J5mK3j3J6k4k1OL3J6l8J5Mj2J3
7820A4j0jlmoK3j2j0oJ0K7k1k2pJ4NJ0Rl8J6pK2j2J9rJ4j5mN4l2k0J1K0j1k6J9
7856A1LNk3ORk2J7k4L4j9Jj3OK0l3L0j5Rkj9pJ3Oj6K3j2RrL7qqppK4l5K3QMLj3
$$ plain form
7599 0 -14 3 21 7 19 27 -17 -17 27 18 -8 12 11 3 -3 10 -13 -10 23 -13 6 11 2 6 -26 -9 -8 -25 5 -13 -11 -14 -1 -21 -3 -24 0
7636 0 -10 15 -32 -6 0 -21 12 12 25 -8 15 -16 8 -6 -8 -22 6 25 -21 -19 9 2 -5 9 -7 13 17 -11 -5 -10 38 11 0 -1 -1 3 16
7673 16 -18 15 19 4 -17 16 9 -29 -27 7 1 3 -1 5 -10 5 2 -16 9 -22 2 -25 12 13 -4 15 -6 6 -16 18 2 -14 -7 -17 -8 -6
7709 -6 -12 -15 10 9 -12 33 12 0 9 -3 -17 -32 4 -3 -5 -6 -2 -16 12 -10 -21 5 3 17 5 10 -11 14 5 -29 -33 -8 -1 6 -19 17 -2 -17
7747 -17 33 -8 -1 15 -3 -10 -6 24 -17 1 4 -4 8 26 -2 -4 10 -5 -7 -6 9 -13 7 22 8 -5 -5 -13 18 -6 -7 7 -27 11 -13 -43
7783 -43 -1 -1 1 22 -5 2 15 19 -21 -22 -13 -14 -17 -1 10 10 -32 8 23 18 10 -15 0 -4 19 6 22 -2 -23 -17 16 32 -6 9 13 1 14
7820 14 4 3 0 -4 -10 13 1 -9 -15 -5 22 1 -21 -28 -14 -9 1 10 -28 -12 -19 3 -9 10 1 15 0 -4 50 18 -2 9 29 18 -8 11
7856 11 14 19 -4 2 11 -11 6 -18 16 -3 -2 -15 -9 11 -22 8 -7 2 0 -19 -26 -13 -7 -23 0 -12 -3 -12 25 17 9 2 -5 19 -16 7 15 19 22 9
7896IJ1m7RQK4k9Oj0J5OOl1kN0n5N1n3L9j7NJ5J1k2k3K1J4l7L6rj1J6Oj1j7K6
7931A0Qj8K5n6L5JJ6k7RlRQl8K9j0K0n2K7Qj2l6J9N4n9LJ6K0k8j1L2J7k6J8j0
7965bJ8k4j2Pj8M0morpJ7lj0kmO0k6k2jK5qnqj1NjLJ9j4pl2L4K2m5KM0j1k3J9
8004dJ7j8kmM3l4rNMlJ3m5K0M3k4Plj8nK8Nl1J3j5J4j1J5lL0j4j6%Qk1nNLk1K5
8043hnOK1j8j6JJ7lK1p%j8oK9l7L9k6J5qkJ7j1J9l1jOL5l4PJ7k4k5L2J9j2m1K6
8080fkL2m8J7Qj9Nk6N5lj7jL0j3m4K0L6Om0J2J4j3%m5N9k0k3NL6j1J1o%pljj3
8117a5J2l2M0lKk3J1K4k6j4J0L0l3j5O2j5Pl6L1j6Oj2J6K8k0l1L9jl4J3pK1k5
8150fkJ0Jj5J2mj2K1l1K3J4j5noL1k2LmK2Mm1KMJ1J9j8J0j5J4mJ1j0j2K4Kj8q
$$ plain form
7896 9 20 -27 -18 -10 14 -15 -9 -19 -4 2 8 -23 -25 25 -30 21 -32 7 -10 -5 10 21 -1 -24 -3 11 -26 10 1 -10 6 12 1 -16 10
7931 10 18 0 25 -31 4 5 21 -6 3 0 9 17 -21 8 -2 18 -34 -7 1 -11 -47 -28 26 -33 -30 -14 6 -22 -33 -1 16 -10 8 -2
7965 -2 16 -8 -20 -13 -31 9 5 -1 -10 -17 0 -3 -13 -15 -19 41 15 -7 -8 17 9 4 -4 -15 -10 -11 -8 11 -3 -10 -42 -8 14 -31 -29 11 0 -23 -4
8004 -4 13 -5 -7 -11 32 -2 -11 -6 -2 -5 8 -37 -17 26 2 9 6 -12 -17 11 16 -15 -2 -17 -3 -14 1 -2 28 14 -2 -2 6 -15 -20 -15 -12 -33 -8
8043 -8 -13 -7 14 -4 -20 -19 -2 -5 16 9 9 -9 -15 14 -23 16 -10 5 -3 -5 12 1 20 -11 -12 -6 29 -5 2 19 -5 -30 2 21 9 -32 -6
8080 -6 -8 24 -24 -7 1 -18 -13 -39 16 13 -4 -5 25 12 -32 -12 24 30 -10 2 16 3 3 -42 17 -3 -26 -21 15 4 15 9 9 2 -1 -2 -15
8117 -15 -3 -35 5 2 4 -19 -8 16 -10 -24 -14 16 -17 -32 30 15 22 -14 17 1 7 -5 11 39 19 -12 27 26 -8 5 -2 19 -6
8150 -6 -8 2 3 -12 0 -4 -16 5 -26 -3 11 -4 -9 -15 16 -6 -3 -7 15 19 -22 -20 -16 -5 14 -4 6 -9 5 1 12 2 -10 14 16 -2 -10
8187a0j1qK5j7
$$ plain form
8187 -10 -21 -29 -4 -21
8191b1
$$ Imaginary data points
##PAGE= N=2
##DATA TABLE= (X++(I..I)), XYDATA
0@%%%%%%%%%%%%%%%%%%%%%pJ5j6J6j6J6j6J6k4L2l2L2m0M8m8N6o4P1p9Q7r6J05
43E6j18J31j42J54j71J91k10K29k53K81l11L43l80M22m75N38o08O94q06R53j151
64f33J432j861K583m000P716l3208o6978J40378K6263j30989K0143R4970m6053
77I763m5306M3065M057k1458J8696o596j9656K2769R116k1848r8N614N550J2973
91A6641k6541k0684N6870Q769q1040K0518Q6585n6250o6999Q2506K8169q7328
103c8784J6449O6575n1066k8286O3909j3888n4197M4592L0287n5140n230M6720
115B1941p781k8624M498J3856J1552j1489k9479K2692L8002m0550l1228N3465
127A6855J1107n2228J2288L3448k7587l106K6281k7705p873M7866j9872n0139
$$ plain form
0 0 0 0 0 0 0 0 0 0 0 0 0 0 0 0 0 0 0 0 0 0 0 -7 8 -8 8 -8 8 -8 8 -16 16 -16 16 -24 24 -24 32 -32 39 -40 47 -49 56
43 56 -62 69 -73 81 -90 101 -109 120 -133 148 -163 180 -200 222 -253 285 -323 371 -435 518 -633
64 -633 799 -1062 1521 -2479 5237 -27971 -94949 45429 71692 -59297 -39154 55816 9763
77 9763 -35543 7522 11579 -9879 8817 2221 -17435 5334 14450 -7398 -7496 -1882 3668 16641
91 16641 -9900 -30584 26286 35055 -45985 -25467 61118 4868 -62131 20375 48544 -38784
103 -38784 -22335 44240 -6826 -35112 28797 14909 -39288 5304 35591 -19549 -24779 21941
115 21941 14160 -14464 -9966 3890 15442 3953 -25526 -2834 35168 -5382 -36610 16855
127 16855 27962 -24266 -11978 21470 -6117 -9223 17058 -10647 -18520 29346 9474 -40665
139d0665M5838L6533n9368j5064N6577l172m0861R881K0803l388o500j1606L373
152g619K5770j1329l1449K3852K5094l2307r565L0532p246j7056J7680k829j6556
165a3028K1289M751l0718J1893K7680k5432j4912K9141j223k1850J2709O978j5049
178g771Q237Q444j7099K881J6737j1684q613J3268j513o099P569o541n763J8612
192A0665l615k4867J6044K2479k6016j3490K8690K495k3298M979J2477n356j056
205A31p47n877J0535O502j8932j645K2386n127j9910R347J3294q762o558L148
219b215L073M545m747j0701J0390J2365j6890q704K0930J821j9875N397J4306
232I695r438o324Q973r33m778M538j058m079N261M56o166L621L579n851P65N220
$$ plain form
139 -40665 5173 41706 -17662 -32726 23851 20679 -20182 -10301 10502 7114 614 -10992 -7619
152 -7619 18151 6822 -24627 -775 24319 -7988 -17553 12979 5733 -11323 6357 3528 -13028
165 -13028 8261 13012 -17706 -5813 21867 -3565 -18477 10664 9441 -12409 300 7278 -7771
178 -7771 466 8910 -8189 -5308 11429 -255 -8868 4400 2887 -3212 4357 -2184 -7947 10665
192 10665 7050 -17817 -1773 20706 -5310 -18800 9890 12385 -10913 -5934 6543 1187 131
205 131 -616 -6493 4042 10544 -8388 -10033 12353 7226 -12684 -3337 9957 1195 -5363 -2215
219 -2215 858 5403 656 -10045 345 12710 -4180 -12884 8046 9867 -10008 -4611 9695
232 9695 257 -6067 2906 1973 -2805 1733 675 -3404 1857 2313 -3853 -232 3347 -2504 -1739 3481
248C481m444k122N911j350m341L424J310k730J594n43k654M812P94q385K830R601
264G188o994q485R915N770j0642k844R372J271o873j285M772K764l717m513M042
279b59N592n142n535N960M193o014k723M688J715k821j775J008L019K3m558L64
295b265N856j450o189K954N589m066m315M284L099m023k397L328K221l070k583
310c027L241K752l811k516M572J885m779q37M564J49l760K9K822M79k269j553
326b059K288K545l058l158L949L005m778k482N098J736m764j160M127J392l408
341g27j837L173K623l487l064M148K835m914k135N157R34m774j1L694m74k314
357a173R3J230R88q23k051J337K968k372k924L537K168m308q67M078m52l227J026
$$ plain form
248 3481 -963 -3085 2826 1476 -2865 559 1869 -861 733 190 -2464 2348 3142 -5243 -2413 7188
264 7188 194 -8291 1624 7394 -3248 -6092 3280 4551 -2322 -3607 1165 3929 212 -4301 -259
279 -259 5333 191 -5344 616 4809 -1205 -3928 760 2475 -346 -2121 -1113 1906 1929 -2629 -2265
295 -2265 3591 2141 -4048 -1094 4495 429 -3886 398 3497 -526 -2923 405 2626 -444 -3027
310 -3027 214 2966 -845 -3361 1211 3096 -1683 -2520 2044 2193 -1567 -1538 1284 1763 -506 -2059
326 -2059 229 2774 -284 -3442 507 3512 -1266 -3748 1350 3086 -1678 -2838 1289 2681 -727
341 -727 -2564 609 3232 -255 -3319 829 3664 -1250 -3385 1772 2706 -2068 -2079 1615 1141 -1173
357 -1173 -1080 150 1138 315 -1736 -399 2569 197 -2727 810 2978 -1330 -2197 1881 1429 -1798 -772
374g72J889q29r37j75P46J381j537k066L039J934m462n62N319j194m995K936L602
391C317l759j784L107J96j483J27o27Q91K047k961k205N171R05o456J306O372
407D164l180m754M086K520l211o90R17L09J633j838l310M258L148o682j361P772
423C781j472o658L708L951m217m32K493j971J043K326m562k57O603l231o182O285
439A208L323p631M58O192l675k658M633j455k866M257o28m298M112J777n518K187
455e82M051n327J2N887m693l550P770j034p875N379M726p534P3O158m095j612
471b246N306l970k688Q063k436q588P829N546j0867l45R982m327n650N940l42
486A207l707M907j716n981P583L165j1220K156J1046o998o980Q885J345o635L121
$$ plain form
374 -772 1117 288 -649 -824 -78 1303 -234 -2300 739 2673 -1789 -2351 2968 1774 -3221 -285 3317
391 3317 -442 -2226 881 1077 -406 -279 -906 -15 2032 -929 -3134 2037 2942 -3514 -2208 4164
407 4164 984 -3770 316 2836 -375 -1065 -148 161 1794 -44 -3354 904 4052 -2630 -3991 3781
423 3781 2309 -4349 -641 3310 -907 -1339 1154 -817 226 2552 -2010 -2267 4336 1105 -5077 1208
439 1208 4531 -3100 -2642 3550 -125 -2783 1850 395 -2471 1786 1158 -3140 972 2749 -2769 -582
455 -582 3469 -1858 -1846 4041 -652 -4202 3568 2534 -5341 38 4764 -2770 -2697 3461 -634 -2246
471 -2246 3060 -910 -3598 4465 2029 -6559 1270 6816 -4051 -4396 5586 1259 -4391 1549 1207
486 1207 -2500 2407 691 -5290 2293 5458 -5762 -3606 7440 442 -6538 2347 3692 -2943 178
501A78J186l984M823O69q469N049P810j0413l173J2239l336r445Q527K788r573
516e124M968N945j0198J058J0998q147o986J2104L60j1179N399N942p637P41N180
531C424n758M95O357o326k756R081k849p134P522J218p892N826L553j0438M246
546a431J0194j2097m968J6371l083j5302J0132R183j3149j048J0692n452m103
559d061P572l435m677Q607j185q999O839N156r083P13O578n066o16N195o047p43
575c252R683o412q624J2817K906j5159M743J2167j0597m864J1909l289p858Q948
589C118M41r595O903N342j0718J177R473o758m171Q233k419n018O783j376o766
604e351P693K502j0651L902R021r006l385J0248l266o826P706K10p907O438L634
$$ plain form
501 178 1364 -2620 2203 2872 -5597 -548 7262 -3151 -6324 5915 2579 -6866 1661 4449 -5124
516 -5124 -156 5789 -4409 -3351 7647 -500 -7486 4618 4978 -6201 -802 5140 -2497 -1756 3424
531 3424 -2334 -1839 4518 -1808 -4564 4517 1668 -5466 2056 3274 -4618 1208 4761 -5677 -1431
546 -1431 8763 -3334 -8302 8069 4986 -10316 -184 8999 -4150 -5198 5494 42 -4061
559 -4061 3511 76 -4601 4006 2821 -6178 661 5817 -3266 -2553 4025 -1041 -1657 3538 -2509 -3252
575 -3252 6431 19 -8605 4212 7118 -8041 -3298 8869 -1728 -6592 5317 2028 -5830 3118
589 3118 3559 -6036 867 6209 -4509 -3332 6141 -617 -4788 3445 1026 -3992 2791 1415 -5351
604 -5351 2342 4844 -5807 -1905 7116 -1890 -5275 4973 1707 -5119 2587 2797 -5110 1328 4962
619D962j0137K713R123q161m316R995j815p351O242J614o612M622K938q132L070
634a245P522q354l134J0330k726q146O946K735p570L075M114o573J464O187o479
649a854k267Q572k940o719O879K128p366L084M227o212R87N729n810k131P861
664D168k985o412O848K223p745K555N299n671o25N738l830k691O105j636n152
679c811N202J770o173K212M186m906l42M784l584k091N494j925m605N214J457
694B882o199K394M586n014r85N257k594l040M632m48m286L513J754m789J387L686
710B736l700r77L884j805k204L420n80k897L025P53l825K045K768l990k41M101
726B513k360k562L930j22l805K562J955l824N24L367k601j613L489n50k725K131
$$ plain form
619 4962 -5175 -2462 6661 -1500 -5816 4179 2364 -4987 1255 2869 -3743 879 3817 -4315 -1245
634 -1245 6277 -2077 -5211 5119 2393 -5753 1193 3928 -3642 -567 3547 -3026 -1562 4625 -1854
649 -1854 -4121 4451 1511 -5208 1671 3799 -3567 -483 3744 -2468 -1481 4248 -1562 -3693 4168
664 4168 1183 -5229 1619 3842 -3903 -1348 3951 -1720 -2345 3393 -437 -3128 2977 1341 -3811
679 -3811 1391 3161 -3012 -800 3386 -1520 -1862 2922 -662 -2753 2741 816 -3789 1425 2882
694 2882 -3317 -923 3663 -1351 -2336 2921 327 -2713 1919 1471 -2815 698 2452 -2337 -950 2736
710 2736 -964 -1941 1943 138 -2066 1354 774 -2123 902 1655 -2170 -125 2643 -1347 -1588 2513
726 2513 153 -2409 1521 1399 -2406 156 2111 -1713 -1189 2178 -423 -2036 1453 903 -1822 309
742C09J082k322N93J455j473K7J196j263n6J459j369o47K092q76j834K226N77
759A176k740J176K175k551o53L105j126k384K520R91k980N88K458j757j431K066
775F33J85j680N03R22p23k05L76m7J63j02l90N75K30r03L86R15j054m04J460m37
795D03j525J283R17j843j52J943p51j521J330Q47j445j04J228l54p45O14L29n14
813f0J2K51q6j39L8K6K6k05o8L37j22m04L38L79n73j34P11j48o25N28M48o85o4
836b19O13k12m42L16J92l95k5K08k3j65M9J8R5jj20R3J61j59j3J64j4p0M7r7O9
861G0J39k44k44M34M0o37K40N72m94l92O72J42o62K33M66l39o7K55j46kK09l21
883g6r3M80k74l67M60Qm88L26J65n11L60L96q46J95J064q49p52J476Q5j663P28
$$ plain form
742 309 1391 -931 -338 1117 -356 -329 867 -396 -452 1007 -362 -1009 1083 207 -1627 599 1176
759 1176 -1564 -388 1787 -764 -1417 1688 562 -1822 698 1689 -1291 -703 1755 -2 -1433 633
775 633 818 -862 -359 563 -160 -365 11 -36 127 25 -365 210 440 -463 -77 838 -216 -620 840 403
795 403 -1122 161 1078 -765 -917 1026 275 -1246 84 931 -514 -618 610 256 -489 125 454 -60
813 -60 -48 203 117 -22 16 42 68 -137 -205 132 10 -394 -56 323 -250 -384 327 179 -446 82 530 -155 -219
836 -219 394 182 -260 56 248 -147 -172 36 13 -152 -103 -85 10 9 -111 -18 143 -16 -29 135 121 51 98 1 70
861 70 209 -35 -279 155 195 -442 -202 370 -124 -516 156 298 -364 -131 335 -4 -71 184 38 36 245 -76
883 -76 -169 311 37 -330 130 138 -350 -24 141 -370 -10 386 -460 -265 799 -50 -802 674 759 -904 -176
904a76J357j403o91J560j42j274O16N59o44K5K18k47M36Kq86P17Q75j376j96J738
924A068q10j280J597K53j794R63J064j911K89J921j786j103K701k62k761J719
940a32J863k408n27K264n47j224Q71J9k76P51r65o15J992m42k355J768J627k761
958a097r5K726j571j554K604l03k376K211R80l073J052K592k662j024L237j011
974F36k440K419O28k652J187J567k292K40J967j703m81K100j369r27K584j131
990C33k386L173Q31m250J537L653l482j806L988n05k911K102N41k177J907O38
1006A186l325J891L106m068j316M994r98m102K708J920k882M88J321j940J191
1021A74J623l566J64M547k608l705M401J477m554J052K981k535k48K258k289k79
$$ plain form
904 -176 1181 -222 -913 647 505 -769 -153 406 -238 -213 5 -242 194 196 -690 27 902 -474 -670 1068
924 1068 258 -1022 575 828 -966 -3 1061 -850 -561 1360 -426 -1529 1172 910 -1851 -132
940 -132 1731 -677 -1204 1060 513 -711 160 179 -97 654 -311 -926 1066 624 -1731 37 1664 -1097
958 -1097 -1192 1534 -37 -1591 1013 710 -1666 545 1525 -1548 -496 2096 -566 -1590 1647 636
974 636 -1804 615 1243 -1409 -222 1345 -947 -707 1260 -443 -924 1176 -193 -1120 1464 333
990 333 -2053 1120 1951 -2299 -762 2891 -591 -2397 1591 1086 -1825 277 818 -1359 548 1186
1006 1186 -2139 -248 2858 -1210 -2526 2468 1470 -2632 76 1996 -886 -398 923 -1017 174
1021 174 1797 -1769 -1605 2942 334 -3371 1030 2507 -2047 -995 1986 -549 -797 1461 -828 -1107
1037a107L454k415k643M414K67m676K333K966m069l7L819k827j728M327j172l810
1053b904L600J690m255R98K958k655l30K529k334o67L741k141l254M308J220m940
1069b436J184L540k612r05K222j710J37L034l346k264O040j01p024L049N873n121
1085d40l305N288M51l540J252N45j118K234p03l589L241K991m994r26N106j189
1101A304l438K333P12j573J651p50k538L532J380n421J035N471l678l624N126
1116A522N81m627K363K391l896O64L616l152j724M017m89l160J892J068j702J002
1132C66p4k062K499J468m377L45M832k358l666L548J441k969P68Q17j711K116
1148I83J006m575J050N587l609m887N313L007n673j008M383j37k221p3J82J589
$$ plain form
1037 -1107 2347 -68 -2711 1703 1970 -2706 -373 2593 -1476 -1513 2306 -521 -2249 2078 906 -2904
1053 -2904 696 2386 -1869 -871 2087 -568 -898 1631 -703 -1370 2371 230 -3024 1284 2504 -2436
1069 -2436 -1252 2288 -324 -1229 993 -717 -580 2454 -892 -3156 2884 2783 -4241 -1192 4681 -440
1085 -440 -3745 1543 1994 -1546 -294 251 -867 1367 664 -2925 316 3307 -1687 -2613 2493 1304
1101 1304 -2134 199 911 -662 989 239 -2299 1233 2613 -2808 -1773 3698 20 -3604 1522
1116 1522 2103 -2524 -161 2230 -1666 -1002 2614 -538 -2262 1755 1266 -1894 -2 1066 -636 366
1132 366 292 -1770 729 2197 -2180 -1835 2997 639 -3027 521 1962 -1007 -239 578 -1133 983
1148 983 1989 -2586 -1536 4051 442 -4445 868 3875 -1798 -2806 1577 1440 -781 -854 -672 917
1164I17P69l473k39M854j193m872K730L550l444j400K687m97q26J200j454o03
1180a294L165j046l629K857K684l906p81L674r61k268J978L35j760J292O12j959
1196a007P23J476j551k46J218j059P4J621j902j114L431k59m012J904L541k951
1212a13k228K980R19j940k10L24M17J214j626j940L055J703m158q40M380j70l714
1229a947P49K508m20j404n48R07J922j234k881K076L156l072k593L577J513l459
1245a150m69K519n3j329m2J96Q02L06j699k2K297p27k250J647J554k111m84J968
1263I53n13j297R92M31r98K02M32l37K80j43o63R90N12j717J26K177r59k063J641
1282D6J523j792r46J430N37p33o90j0J319L37k177k60K894k97l137R69K960j358
$$ plain form
1164 917 1686 -1787 -2026 2828 1635 -3237 -507 3043 -401 -1801 886 389 -437 763 -691 -1294
1180 -1294 1871 825 -2804 53 2737 -1169 -1950 1724 763 -1505 473 808 -952 340 952 -1007
1196 -1007 -284 1192 -359 -605 613 -446 -372 1249 -653 -1767 1664 1405 -2607 -703 2838 -113
1212 -113 -2341 639 1558 -382 -592 -268 149 1363 -263 -2203 852 2555 -1603 -2443 1937 1767 -1947
1229 -1947 -1198 1310 890 -514 -1062 -155 1767 533 -2348 -272 2884 -188 -2781 796 2309 -1150
1245 -1150 -1619 900 847 -482 -524 -328 474 780 -919 -941 1356 629 -1621 26 1580 -531 -1015 953
1263 953 440 -857 135 566 -432 -230 202 -135 145 2 -661 329 841 -876 -750 1427 468 -1595 46
1282 46 1569 -223 -1169 261 798 65 -625 -635 684 1021 -1156 -1416 1478 1181 -1956 -987 1973 615
1300F15k410J389J867r61j479L09J551K64j978n26K461L09k808Q6K826o30k400
1317a515Q92J768p64j183L52R59K17j069o25J528O71j988l60K216k12k126O99
1334e40J654r40j139Q29P20m24o46K7R33J85j399L0J836m92j933J057J725j488
1352ej285J562P88j298o00Q46P29n13j206M64J697p34j997J241K018j708j616
1369a617J907J151j705q13J250P28p48j060M03J585n11k063Q98K256j481j946
1385a766J794J498j781r41J456O66q28p92L57J251k12j815M93K148j174k016J692
1402C0J450j940p69J749K11j200k9N72M00j94r88K88J635q81j840J625J583k258
1420e56r37K397J40k030K45J364j81p03m09M80J182p47j766J533J902k346j434
$$ plain form
1300 615 -1795 -406 1461 500 -979 -670 881 1145 -833 -1359 1102 1411 -1397 -1311 1515 885 -1515
1317 -1515 -623 1145 381 -802 -450 509 726 -343 -968 560 1231 -757 -1117 1099 887 -1239 -540
1334 -540 1114 174 -965 -136 584 160 -486 -459 474 659 -740 -710 1126 634 -1299 -242 1483 -5
1352 -5 -1290 272 1060 -238 -838 8 737 224 -982 -518 1179 445 -1552 -311 1707 -1 -1617
1369 -1617 290 1441 -264 -1077 173 901 153 -907 -504 1081 570 -1493 -595 1661 180 -1766
1385 -1766 28 1526 -255 -1196 260 926 98 -694 -337 914 702 -1113 -620 1528 354 -1662 30
1402 30 1480 -460 -1229 520 731 -469 -498 74 474 280 -708 -420 1215 334 -1506 119 1702 -556
1420 -556 -1493 904 1044 -986 -741 623 442 -261 -670 -190 992 245 -1521 12 1914 -432 -1866
1437a866K854O23k727J34J998m04j095l7M18Q14k58j785P35K361j622k220K445
1454C68J497k721m61K295k82j305L98L11J32K86j045k08J828n69k150J609J648
1471A631k401n96K566n67j956J377Q85j330R9O12m24L96O2j247J031J308k247
1488h01o33K993n95k981J666K163k112j080J754J89o11o3o53Q19J543k058j542
1505b002L269P83l902L52L616j297k532J373J287o48n26o34N20J905j372k472
1521b280K620K101l522q99L626m02k781J283J296j281J27L98j000Q93Q44j978
1537i55O4K267j276j619K109L34k070J026J241j803P5J723j156q10J458l19q13
1554e24J036n55r39J961j08k806J638K630k960j633L487L80k992N35J802n54m14
$$ plain form
1437 -1866 988 1611 -1116 -982 1016 612 -483 -520 -102 712 454 -1331 -596 1765 143 -2077 368
1454 368 1865 -856 -1317 978 696 -609 -211 100 232 518 -527 -735 1093 524 -1626 -17 1631
1471 1631 -770 -1366 1200 633 -1323 54 939 -391 -292 320 -104 292 354 -893 138 1446 -801
1488 -801 -1434 1559 964 -2017 -351 1812 -300 -1380 374 563 -48 -111 -764 55 1598 -460 -2002
1505 -2002 1267 2050 -1852 -1500 2116 819 -1713 -340 947 299 -227 -861 -341 1564 192 -2280
1521 -2280 340 2441 -1081 -1980 1646 1244 -1537 -254 1042 -239 -112 286 -714 179 1023 -955
1537 -955 -891 1376 100 -1519 590 924 -1146 -120 1121 -682 -607 1116 -40 -850 608 289 -524
1554 -524 512 -43 -982 979 871 -1935 -297 2333 -627 -2260 1227 1607 -1385 -850 952 398 -16
1571a6l93l71J788L66l130N20L663j745l330K624K182k603j001J676K96k11m30
1588a15j088J399J728k620j470L615M62l718P35K918j491j539J328J55m55O06
1604D50q30m71J868l95k128J440J492k082j91J865r82r27J712m05j576J529P24
1621A093j935L16J425j010l57Q94q51L5J509j351j392K552N77l069N36K760j232
1638E00j846J214Q69m79k67p36M03J828j213k348K198K125k978j297L032M10k392
1655i77K06J240r0m2p55m67J751M23k628K39K878j103k480J695J447j633m68R51
1673A87j15O6P7q87N05J262j319q39J773Q2j723Q54R79j341K6J237r59o39J390
1692F16j73j245P26O28q27J46L31o08N53N29j306l8J805p47j688J303J146j381
$$ plain form
1571 -16 -409 -780 1008 1374 -1756 -1236 2427 682 -2648 -24 2158 -445 -1446 230 526 315 -115
1588 -115 -1203 196 1924 -696 -2166 1449 1911 -1807 -1072 1846 355 -1184 144 299 -156 450
1604 450 -380 -851 1017 622 -1506 -66 1426 -656 -847 1018 36 -891 821 416 -1160 369 1093
1621 1093 -842 -526 899 -111 -468 426 -425 -390 1119 -232 -1624 928 1505 -1564 -1028 1732 500
1638 500 -1346 -132 737 258 -9 -745 -342 1486 273 -2075 123 2248 -730 -2027 1005 1415 -977
1655 -977 -771 469 379 337 -418 -885 866 1289 -1339 -1100 1778 675 -1805 -110 1337 -296 -764 187
1673 187 72 138 215 -672 -167 1095 -224 -1063 710 792 -931 -77 902 -439 -413 824 -135 -774 616
1692 616 443 -802 -76 552 -275 -129 202 -406 147 676 -630 -668 1137 390 -1298 5 1151 -230
1710b30n02R40N9j13k14o37P20J090j504j062K222N59k431P0K240n74j593O88
1728b72Q57k45m44l35L14R98p22j285J220J074j588n77J611o0j121L98M35l55
1746i7K65j07n53P24M35j201O1J287o56r96J061L78j105K55P55o59k62P30k36
1765G9l92M70q4k39M03k09l42O59P9j019M63R37r00o04J045J18q81J84M16j93
1785a0O9j40l87O86L58j163L1J422n59j223R28Q44j007l88P74Ll15K8j56K09M06
1806D10n93l92R44J56j068K21Q74m35m94M32J43j02j0k87J27N72m91o34Q83L37
1826E93j134J02J074n66p82Q33L01p53J75M56l99mL04k70%L49l43j36M84j82m23
1847c21M39J21n13J79K93l19K7K43l27R2M55n21k40Q70j78r17O30O88r50k57R12
$$ plain form
1710 -230 -732 208 267 154 -60 -697 23 1113 -391 -1453 769 1328 -1103 -1033 1207 633 -960 -272
1728 -272 585 340 -104 -439 -125 873 151 -1134 86 1160 -428 -1005 606 546 -575 -177 258 -97
1746 -97 168 61 -492 232 667 -534 -473 814 158 -838 223 601 -504 -249 506 -153 -415 315 79
1765 79 -313 157 73 -166 237 28 -314 345 424 -595 -132 805 -95 -699 346 464 -417 -233 183 -10
1785 -10 59 -81 -468 218 576 -587 -556 866 307 -916 12 856 -151 -539 235 238 -77 -49 -205 4 410
1806 410 -183 -575 369 525 -543 -322 552 117 -377 55 198 96 86 -201 -74 498 7 -627 256 593
1826 593 -541 -439 635 69 -713 120 421 -332 -157 299 -100 -104 200 -70 -70 279 -64 -200 284 102 -321
1847 -321 118 239 -274 -95 198 -121 -94 149 -178 -86 369 -152 -392 478 300 -617 13 701 -249 -506 406
1868D06j28o82L42K33k60O6l5j62L84K3o04L24N54n69k52O67j03m25K87O6k86
1889a54L10k7n16M11M21p90p1R54m42p00P55K81p48J35N47m40o5L88l07o4L85
1910B63k99k43N43j34n28M95K35p37K51N26n63j02O02l06l14N90j44n09O16J22
1930C64q30M01O93q21k69Q91k13o81N39J93n41K81J60m64L31L24o97J09P49n55
1950c6m58Q42n7p55N20L35p40K28N29o98MP49n10m82Q56p8q08O14L50p79K38O24
1972D88o92r2P99m75m73P90r5p44O37K75q62L40O25q47p0R54n47o29R47Lq63N42
1994A1M34p49K02N55p23k4Q49o29m94R68o9r58O33M91q89J66O85o72r6Q02n58
2015f5m46R99j65r75P98M67j071K12Q43p80k06Q74n03n64R84r4j003P30N53j048
$$ plain form
1868 406 278 -404 -62 171 -89 -23 -58 -220 164 187 -417 -93 461 -108 -360 307 204 -221 66 132 -154
1889 -154 156 129 -387 24 445 -345 -416 538 96 -604 151 432 -316 -181 366 -74 -139 249 -58 -122 263
1910 263 -36 -279 264 130 -398 97 332 -405 -154 372 -191 -293 309 3 -311 279 135 -374 242 364
1930 364 -466 -65 628 -193 -462 429 216 -465 74 267 -274 7 167 -297 34 358 -339 -230 519 -36
1950 -36 -494 348 291 -464 56 391 -349 -121 408 -290 -286 463 -47 -529 327 249 -559 55 405 -374 -136 488
1972 488 -204 -296 503 28 -445 345 250 -494 143 418 -444 -104 521 -326 -396 558 11 -618 329 332 -531 11
1994 11 445 -304 -102 453 -270 -294 555 -74 -568 400 331 -627 6 497 -392 -226 459 -213 -309 493 -65
2015 -65 -511 488 323 -652 146 613 -458 -246 597 -183 -389 485 -18 -582 402 308 -695 35 588 -460
2035d60J18R20o44l73Q29k63n45O96m7p23O14K85q89L33O87q49p2R23o60m95J114
2056D99k38j047R76N70j395K89J267j004o39J280j65j049P37M41r49K15O80o51
2074a83j31O61m05k26N39l05k55O63l20n66R24M4j157O91R15j356j86J532o89
2093A90j190J337L80j511M71J189j118m11J245l16q77P65L13p77K35L81m25J25
2111FJ53l90L19K50p70K48Q56r07m71J348k78j334J088P80j539R5J487q77r70
2130i06J376J48j336O01Q56j027j76R42m10m79N50nl26L04j47j71N37k75n50P87
2150B93J89j146N31R93j129m52J441l93j209J074N09j340K87J128r15n73J181
2167D69j32r82O15M91p06R9L81k63K1J72m03K22M57p23q4Q63m27p05R19J33j023
$$ plain form
2035 -460 -342 578 -66 -439 390 127 -418 278 231 -492 122 407 -482 -149 538 -311 -383 540 -120 -615 499
2056 499 261 -786 190 760 -635 -346 921 -83 -722 558 393 -656 81 522 -427 -212 468 -183
2074 -183 -314 347 -58 -284 255 -50 -305 358 38 -528 396 440 -717 -26 889 -467 -653 879 190
2093 190 -1000 337 717 -794 -323 866 -252 -663 582 266 -611 154 467 -310 -75 306 -119 6
2111 6 159 -231 88 338 -432 -184 672 -235 -706 642 364 -970 118 898 -641 -546 941 64 -906
2130 -906 470 618 -718 -117 739 -288 -464 478 68 -411 139 134 -192 112 -35 -206 331 56 -494 293
2150 293 482 -664 -133 860 -269 -721 720 327 -882 192 701 -639 -352 776 -139 -712 469
2167 469 337 -645 -30 461 -245 -146 235 -28 -7 165 -238 -16 441 -282 -366 497 70 -635 284 417 -606
2188f06M94P73j044q9J199n84r16J123L07j214L08Q75o77l67P10j53l69L64j56
2207b2k42M61j31m69N29J37o61L83M18p18J11Q13p40m43J103j10j165P04P82j031
2227b91k22R94l39o03O10M4m79M00R1n36L00M15n47n2N02k74j76L66k74j47N92
2248C74k95o75Q52K85j120K06J041o57o58Q84J61p73L18L66m95J67L27m78KN37
2268C69l93k66N11p5l84L45K3m15M13J49o63K57O66o91l15Q63j56p13N56L29p18
2289c08K02M70n22j77O65k42m69M72J08l78J11J40j84K18Km05L33M18p10j36Q68
2310D76k35p37N36L97o45L8M31l43l0L78l92j83O44j49o72N17M05n98j27N11j41
2331H1j76J55j63O2K78l65k10O46r2o69L83N01o26j06N77j91l76M46j9l58L37
$$ plain form
2188 -606 -112 661 -383 -472 727 143 -773 350 657 -557 -249 626 -51 -418 292 139 -230 134 -22
2207 -22 -264 197 66 -403 126 263 -398 -15 403 -315 -204 609 -131 -574 529 419 -746 -42 740 -291
2227 -291 -513 481 142 -461 149 193 -286 114 205 -331 -31 384 -163 -215 287 13 -163 203 -71 -218 374
2248 374 79 -596 256 541 -579 -373 668 11 -647 237 398 -375 -57 309 -186 -19 308 -170 -168 369
2268 369 -24 -290 221 146 -238 107 130 -285 128 277 -386 -129 537 -154 -469 394 238 -475 81 410 -308
2289 -308 -106 364 -158 -335 330 88 -381 91 199 -179 -68 72 -112 106 108 -297 36 454 -256 -392 476
2310 476 241 -496 40 437 -208 -170 261 -82 -112 266 -126 -309 335 186 -486 31 436 -162 -289 222 81
2331 81 -95 60 -103 -41 237 -128 -338 308 216 -453 -70 431 -195 -301 276 85 -291 155 136 -222 115
2352A15J09m60K04L45m53l9M69k91k71M84m7m85L30K61m90M6L70k38n6K48k22
2373g1o5M03k43l47N39P6o50K06N45m50k53M22k3k22J36p2n4L74k10m39N17L42
2395D61p65pP49k53n67M21K40l56J2J14j61J66Q6m47K21M66n17k73O53qn90L01
2417e4L09l14l1K30k12Q5J48l09mM39l04l67N75J24p04K42N11m34k79N45m5l55
2439b04K40M6j44J78n5l08L90J71o03Q2O31l79m57N11J93n05J03K09j25P5j9l02
2461b72L45L34o35j51Q26j83p80M85N11n14k67M18Nj83N0j53J29L03l84k34O31
2482B81oo69L11N24n00k32N46j19l31K85j6k38K83j0m07L22K90o06K9O46l48m97
2504d62O02J92n72J11L55j66j11J4m5K22O8n23J35P32n18o76Q28L62r12l3P70
$$ plain form
2352 115 224 -236 -32 313 -140 -179 290 -1 -272 212 165 -320 10 271 -219 -173 197 -41 -97 151 -71
2373 -71 -136 267 24 -323 216 292 -358 -152 393 -57 -310 112 89 -133 3 -69 -123 251 41 -398 119 461
2395 461 -304 -311 438 185 -382 39 279 -77 -65 49 -112 54 140 -307 -86 380 -137 -410 243 235 -355 -54
2417 -54 255 -59 -90 140 -72 13 161 -148 -152 287 -17 -384 191 315 -389 -147 364 -70 -349 196 151 -204
2439 -204 36 82 -62 116 61 -247 143 314 -289 -207 424 45 -412 99 292 -213 -110 99 -26 49 30 -272
2461 -272 73 407 -228 -379 447 264 -516 -31 480 -34 -301 117 122 -61 -11 -164 -35 268 -116 -350 281
2482 281 275 -394 -83 441 -59 -291 255 136 -195 90 74 -164 119 109 -298 24 314 -292 -263 383 35 -462
2504 -462 140 332 -240 -129 226 60 -51 -37 -82 140 208 -315 -180 552 34 -642 186 548 -364 -397 373
2525C73j70m93K39R4j6J43k83j58O49m1q66L65P48n60n31O23J81m48K0J08K7J60
2547A64k09l30N83J98q05J04Q36m31o23O67K29o75J54M11l53p1K92j54p0K47k69
2568a05o0M43k52l95N72J43p38J65P35m45m98N74J21l69M5K9l7L39k44n32N57
2589D8N56r25l11J107rr85K54P02k83l45M1J54L53k52o50M79P52p90o33J012L22
2610E97j014M3P56k61l34J90j4Q1K14m38j59P15q5p73L97N82o37j97N44j12l25
2631b30K58M8k28K41j4k74L06L7m03K93L31o00p2P97l61p07O75M76q32j15O56
2652B82p9l76N0N6J62J56n55j05Q85j27j002M50Q78o34n50N50L12l36j67p3K87
2673F4M00o13n11R37L83j143j27J183j80r87L89O39l06k54PJ19K59j70m49L44
$$ plain form
2525 373 203 -290 -51 43 27 170 -113 -271 378 337 -529 -164 584 24 -507 116 297 -151 -131 -23 4 164
2547 164 -45 -375 208 406 -399 -295 541 110 -513 154 383 -292 -138 273 -80 -151 141 -13 -83 164 -105
2568 -105 -165 278 26 -369 203 346 -392 -227 508 63 -435 139 260 -109 -64 -35 -72 267 23 -509 48
2589 48 604 -321 -632 475 466 -519 -265 437 154 -191 -150 4 357 105 -545 -66 686 -104 -737 275 597
2610 597 -417 -374 382 121 -213 -23 -37 44 258 -180 -339 376 291 -482 -85 497 -140 -337 207 95 -230
2631 -230 28 76 -152 89 75 -199 107 144 -259 34 365 -235 -307 490 129 -578 97 573 -259 -374 282
2652 282 203 -173 -123 -67 95 251 -304 -409 476 349 -653 -203 675 41 -509 41 353 17 -150 -223 64
2673 64 464 -149 -660 277 660 -483 -610 573 393 -594 -205 434 128 -126 -119 0 259 89 -360 -16
2693a6N26o51l25P28L0o54K76L58m45O7L18l14k7L57k32k17M14j10l47M52L7o16
2715c91L61N00o65k46P24jo36J94L71j61q1j14L0M70j37p49M53P98p58o75R70
2736B57L71r21j19O58L0l39j63N0M16O2p33P5R33l12r20N38P44o56l99N17J64
2757B53k27j19p9J98L10m59l21P28J27q69J99P40m22m44M76J49l86J16J13j15
2777c2J16l2j98K22J10m22J38M48m57k68O42J1p01K87M85l63k58L11L6n3M4k78
2799b12J66M40m08m90O88L47q59p9P89r8o05J34L82l7k22j99K16M70l51n89N77
2820F0N33p66l53Q36Q6p10Q4M37p4k13o8K6L25l3n61K15O08m05m71N55K58n79
2842b10pM45j24k18J43k4NJ15k58QL88k19m04M87K14o09N0N82k96l99L39K42k98
$$ plain form
2693 -16 510 -141 -466 262 292 -362 -86 272 -173 -106 212 -102 -129 228 -4 -221 193 83 -264 188 225 -391
2715 -391 -30 470 -195 -441 283 282 -354 -160 211 50 -31 -145 -115 355 218 -531 -78 720 -38 -713 257
2736 257 628 -293 -412 246 276 -63 -226 -176 240 302 -431 -356 577 265 -655 -117 627 -29 -428 89 253
2757 253 26 -93 -172 26 336 -123 -444 284 411 -458 -259 481 59 -385 91 240 -146 -30 83 -32
2777 -32 84 52 -146 76 186 -236 -98 350 -107 -375 267 278 -423 -136 349 -14 -272 39 75 22 66 -212
2799 -212 -46 394 -14 -504 184 531 -328 -407 382 284 -321 -187 195 158 -64 -263 -47 423 72 -517 60
2820 60 593 -173 -526 310 396 -314 -230 207 133 -80 -148 -122 203 170 -391 -176 432 27 -444 111 369 -210
2842 -210 -217 228 104 -114 29 5 10 125 -133 -125 263 44 -360 127 341 -268 -218 364 68 -331 8 250 -48
2865d8o3J38J0J30k13k25M16J90o32%O94j99o64L81M45l75k48K60J28j1j66k25
2887b77L70L07n96k26P50O1q02K07O06k77l90K02K39o9j32j47K00K67l66k88N54
2908A93J50o20P1N28j95l73K63J54j93j8J2k5J80j08k76K89K58n07m7N73j67m78
2930c36L36L54m62j07L66rk01N4k5J23P1l51k4N12j56n33L69L86m42k12M22L7
2952A72k30j2M2R9J20l17j42N28K1o89J99O24l29n33M59K90l81j28K60M7n7j08
2974f5o1K69P3l87oM69j67l74K97K11l31n1K35j35%P1j41M9K11k35j80M66n4m71
2998c07K78L94m31k18M63M6m06K7L00j08j11l5M9K32j53l29L49L31n05j90N46
3019B22L8n09J41L06j71p0N4p0J25J21m07J1N11j71n03L34L97m28k01L44Q3k10
$$ plain form
2865 -48 -111 27 37 167 -46 -271 145 335 -297 -297 397 198 -466 -85 360 -15 -263 -3 125 114 -52 -277
2887 -277 93 400 -196 -422 328 389 -413 -206 400 123 -267 -65 174 105 -27 -174 26 293 -73 -361 193
2908 193 343 -277 -206 322 127 -246 17 171 -22 -40 -28 -53 127 19 -257 32 290 -217 -264 309 142 -336
2930 -336 0 354 -108 -215 151 142 -59 -5 -30 93 164 -187 -211 301 145 -388 -19 367 -75 -287 135 172
2952 172 -58 -70 -28 71 191 -126 -268 260 281 -408 -209 415 86 -447 12 302 -79 -207 53 100 43 -65
2974 -65 -126 143 216 -171 -177 292 125 -249 48 259 -72 -123 112 -23 -23 48 -93 -44 167 -68 -248 218 164 -307
2998 -307 -29 365 -66 -284 179 225 -181 -154 146 38 -73 -108 -59 173 20 -309 40 371 -134 -324 222
3019 222 260 -249 -108 198 27 -43 11 -59 66 187 -220 -209 302 131 -372 -38 359 -69 -270 74 157 -53
3041e3m6M4J37N5k82k4M11j29m15L14K94m53o3M13j40k81K91R0l23J30J81k31
3063h0M4J93j99k6K67k12j64L32j4l25J25K58k23j21J81J0k1jk00J48K70l06k58
3086c22N17J61o38O3N38j82m10K18K42j49p9k4L0K05j12l47L08L00m44j10M42
3107B07m6l38J42J34j10O3K2j89J69J52l40k1L82j49l35L15J12k89L1K18j64l9
3129g3J38j02j0J34j23n5K00j21j63L25J6m12K26L53m17j94M42K3m06J42K65j95
3151go3J08p7O8J24k62k0L13j02k91K00J64j90m4O3rJ05m3k72K48K61m16j87N71
3175B42k2n33K08M10l26k16L48j9k13J58J6j48J59M4k20P4J73j91j8J64r3m5J15
3198F7n4r6K14j00j90K36N7l33J35K42k67n8L37j35k92K89J22l52O6L02j71j71
$$ plain form
3041 -53 -99 -55 82 137 -145 -169 242 113 -302 12 306 -147 -210 203 63 -218 73 163 -160 -30 151 -80
3063 -80 -36 157 -42 -68 199 -13 -177 155 141 -184 -59 199 -24 -145 36 46 25 24 -176 -28 242 -64 -322
3086 -322 195 356 -282 -219 319 137 -273 -55 187 38 -41 -65 -35 170 58 -289 19 319 -125 -235 207
3107 207 161 -177 -35 99 -11 52 74 -115 54 206 -134 -155 227 78 -257 58 170 -119 -88 130 -34 -73
3129 -73 65 -37 -47 87 -36 -91 109 -12 -175 150 166 -246 -20 333 -84 -278 164 187 -219 -77 188 -7
3151 -7 -70 38 -39 29 153 -109 -129 184 82 -209 -9 155 -35 -79 -16 -25 80 37 -235 13 274 -142 -329 242
3175 242 220 -313 -105 305 -21 -237 111 92 -121 37 53 -95 64 108 -112 -38 135 -56 -74 90 -3 -48 67
3198 67 13 -83 131 31 -159 77 134 -199 -64 178 -89 -147 190 55 -237 52 174 -178 -112 190 19 -152
3220a52K08L8j56P6%n3J55p0j85J84J25k95QK55q9j73J85l8r3J75p5k14K60J34
3244B10l89O1L63k14k98L18J25l01L9K02j45k1Q1j21L8J42j26j01K38Nk17J27
3266A6J21j79N5R8j68L3J64j70r2K59r4k08K10J20k92M9K36k00p9K59r0k13K57
3289I2J1j98Q6J22j63K8R1j39J7J29j24j20K89n9k12J63R2k11M4K11k12JJ95j44
3313a1r7K76p8k53K04J31k75J2K18j33r4J37k2r0J35o0j24J92L1k51J03K15k22
3336e6q9K72q1j83J69L3j97J53P2k15P1J93j82r0K23n2j36J56oj40J22M9j60R5
3360B1J13k08J6K14j63j34K44l1k35J64J57k98O1K31j77r9K16l3j81J51O2j80
3382h9N7J15j28OJ33j42PJ44j02r1J80m4j64J42R1k14Q5J88k36l2K73j08k15K31
$$ plain form
3220 -152 56 94 -62 14 14 -39 116 46 -139 45 170 -125 -117 138 49 -124 61 23 -70 105 30 -184 76 210
3244 210 -179 -118 245 31 -267 51 176 -125 -86 116 -29 -50 31 -90 -52 90 -36 -137 101 106 -111 16
3266 16 137 -42 13 111 -57 -24 140 -30 -122 137 43 -165 45 165 -127 -78 158 -42 -121 138 48 -165 92
3289 92 103 -95 -9 113 -50 -22 69 -70 -53 76 -48 -168 121 62 -150 13 105 -106 -62 149 -63 -62 133 -11
3313 -11 -108 168 90 -163 41 172 -103 -91 127 -6 -100 37 15 -75 60 0 -124 68 99 -152 -49 166 -56
3336 -56 -145 127 46 -137 32 65 -132 21 93 -122 -51 142 -40 -130 93 41 -95 61 55 -85 37 86 -74 21
3360 21 134 -74 -58 156 -7 -141 103 72 -163 1 158 -140 -79 152 -25 -124 92 59 -122 29 91 -89
3382 -89 -32 83 -45 -39 94 -48 -41 103 1 -90 90 46 -118 24 115 -99 -14 174 -62 -94 179 71 -144 87
3406H7K5k32Q9J73j85o0K10j28j15K06o1j54J92J1j70J06O2j20jJ54j12o8K10
3429A19j33j01K08J2k45J49J28k48L8K43k03p6K07r0j15J38P4j91J09J07k00L5
3451c5J70j48r6J91n4j29J31N2k00J05J07j87L3J63j63n4J88m0j42J73L5k13J15
3474BJ12j92MJ96j41r7K37r0j76J95N3j97Q9Q9j39j4J84j25o5J64m3j68J79nj81
3499a29J31Q9j71LJ86j52r2K42p3j74K05K9k14J03J38j63oJ57q4r9J61m4j38J36
3523D1L0j73J12Q8j45j5J67j23q5J98o5j46J76L9k22J29J16k07k0K13j20r2J58
3546E4l3j67J77O7k03Q1J13j62K4J49j19o8J70j9j62J61N4k35J12J42j75m9J94
3569A06q5j16J69m3j10J10M7j77J18P8j69L5J60j76l4J85p1j66J75M0j98P3J94
$$ plain form
3406 87 112 -120 -31 142 -43 -103 107 -21 -136 70 9 -145 47 58 -112 -6 56 -64 -65 89 -23 -91 119
3429 119 -14 -115 93 105 -140 9 137 -111 -73 170 -33 -109 98 8 -107 31 105 -86 23 130 -70 -35
3451 -35 135 -13 -109 82 28 -101 30 82 -118 -13 94 -93 -60 103 -60 -114 74 34 -108 65 100 -113 2
3474 2 114 -78 -74 122 -19 -116 121 31 -145 50 103 -94 -5 84 -55 -69 115 -10 -75 89 46 -122 57 52 -129
3499 -129 2 91 -80 -77 109 -43 -135 107 34 -140 65 94 -120 -17 121 -42 -48 109 25 -74 87 43 -95 41
3523 41 71 -102 10 98 -47 -62 105 -18 -103 95 30 -116 60 99 -123 6 122 -85 -105 108 -12 -104 54
3546 54 21 -146 31 98 -105 -24 89 -73 -49 100 -19 -87 83 64 -98 63 117 -118 -6 136 -39 -88 106
3569 106 21 -95 74 31 -79 31 78 -99 19 97 -72 -37 123 -53 -87 98 27 -139 36 76 -122 -49 145
3592A45k31k9K33j17j21J82j1j49J32M2j22L9J07j29pJ25q3n4J03m6n3J09k0j70
3616a25J63R4k66N8K41j79j42K39Kk15J20J37j67oJ32j13k8J11n3j17J31K9j13
3639f7P8Ol7QQ4j08N1R5j72LK07j33j54K08M7k41R3J97k57j8K28p1j96J80N6j62
3665g5J8J02o0pM8n5J5Q4j01l6J29k6j22R1N6j15M1P7j37M0J43j83n3K76j05k14
3691a69J93J72k56n8K33m7j28Q1K4m2L3o5o1J32j3j60J13J02j55PJ33p5o0J50
3715H4n6j09J42J6j76O3J74j80n8K12q5j25J25M3j32M4J22j53KJ01l8l2N2o7L8
3740GP1j16n6K03l7k33J29J97k07j34K52nj45M2K6n5R7j0j09O6J78k12o9K46k7
3765I9j91L6J51m9p6MjJ17m0j69R3K13j92j37K39K0k08L0J50r6j8N2l0o4R9l7
$$ plain form
3592 145 -86 -115 118 1 -120 62 51 -98 34 76 -46 -7 100 -29 -36 89 6 -48 55 9 -44 65 45 -125
3616 -125 38 132 -134 -76 165 -14 -156 83 85 -130 -10 127 -40 -46 86 -27 -55 56 3 -114 17 46 -67
3639 -67 11 17 -20 -12 72 -36 15 110 -62 -59 148 15 -139 69 116 -125 -32 165 -92 -110 118 47 -149 31 87 -75
3665 -75 -57 45 -15 -22 26 -29 -14 70 -31 -67 62 36 -86 5 61 -54 -13 64 -73 -33 110 -73 -126 150 45 -169
3691 -169 24 196 -60 -118 115 68 -60 21 45 3 36 -29 -90 42 29 -131 -18 84 -71 -64 69 -6 -66 84
3715 84 28 -81 61 77 -99 -36 138 -42 -100 112 27 -98 27 70 -62 -18 104 -49 -47 54 16 -16 36 -31 7
3740 7 78 -38 -94 109 72 -161 -32 165 -42 -176 76 71 -74 -32 -6 -61 36 26 -83 -17 161 -51 -120 126 99
3765 99 -92 -56 95 46 -30 -26 -27 90 50 -119 -26 187 -5 -142 97 117 -91 -61 89 -7 -25 27 -3 -67 32 -5
3791eo4J12j1j22P1Q6j54K7J24r6n2J49m1j05J08J6p7M5Jr0J24P2j92J5K15j31
3817B5k12K12J09k04l5J83rj03K2J2N5K3j72kK02l1k68J62J79j74q4J07P2n7o0
3842d8j9M5J26j05j59K23Q4k64K0K58r1k00J42Q6j24K0%J4J9j7q7R6P4j44l9J98
3868A08r6j31J37O4j46L5J23j08m7R7m7lJ4l2m2J36m6j61J39J74k29j00K65j9
3892H5j63K3J16rn3n4J6J47m1k37J37K32k25j71K46R9k58kJ73Kn8l3OP8M1k18
3918a21M5K16j01k24K03J05j76l7J28np8L1k0M0O2j03m4J65j4j84J19J44j72q6
3942a07K18m6j96J41N4q0QJ7l5Q5n8r0Q2J28j90o6K50k2k41Q8J96j14r8N8O8l2
3968A8k9q9J25J16k13j15K45J31l20J0K62n6j73M5J11Ko4p4N0J61j35j53J55J53
$$ plain form
3791 -5 -69 43 32 -90 -19 67 -87 -60 64 -32 -84 65 24 -81 27 43 -34 11 12 -78 46 118 -74 -59 156 25
3817 25 -187 25 134 -70 -105 78 69 -34 -12 0 55 78 -94 -96 106 75 -193 -31 148 -26 -110 -3 69 12 -48
3842 -48 -67 -22 104 -1 -160 63 147 -117 -97 161 70 -130 12 98 -26 -6 -6 8 27 10 -77 19 93 -51 -90 108
3868 108 12 -119 18 82 -64 -29 94 -14 -61 36 -11 -14 0 -32 -74 62 16 -145 -6 168 -61 -161 104 85
3892 85 -78 -55 61 52 -1 -55 -39 108 67 -170 -33 199 -26 -197 49 148 -110 -112 61 63 5 -28 -22 56 97 -121
3918 -121 -76 140 39 -185 18 123 -53 -90 38 33 -45 -14 -34 6 68 -35 -79 86 72 -112 7 151 -21 -107
3942 -107 111 65 -131 10 64 -16 -8 9 -26 59 1 -89 -7 121 -69 -135 115 93 -148 -60 136 22 -76 -18 50 18
3968 18 -11 -100 25 141 -72 -187 58 189 -131 -121 141 85 -88 -43 68 70 6 -68 -18 143 8 -145 10 163
3992A63k35p3K39m3j48M8J07l6j7m3j6J13j3j40P9J59j86p8K23k8k08J03J40j25
4016a5o5J09jm6JQN1N9j40o3K37l5k44J16K23j72j45J49N9j08k6K2P0J5q7j04
4042a32J97N7k63KL07q4k74J66J69j26j37P0J30qj24m1J38J01k56RK71j09k13
4065a50J25J78j49r2J33k9k3L0l6k5J27q8j08J49M9j97L6J74j11r9J43J1q4m1
4089g7O4M4l5p2mJ84l1k32J41J96k37j31K78O9k69K3J80k1r9QJ4Q2Nk00O0K02
4115A42q1k10J13K12j89j53J77J08j07j03L1J29K3j90j3K27n3k26J26J80j36j14
4137a07J47J6j31M7O0k7M5n1q0J21L5j83R5J61j67r6J64O8k00O8J10p5o1RN9N
4163C2n6n1Q4R1j70o9K15M9k78K1K61o9j64L8J05Qp0m9O0J57j34j65J66J80k53
$$ plain form
3992 163 -72 -145 94 51 -97 -49 58 22 5 -38 -54 59 46 -94 -15 144 -42 -120 103 75 -133 -30 110 -15
4016 -15 -80 29 28 -18 -17 -9 42 101 -39 -102 135 100 -144 -28 195 23 -122 27 86 -22 -48 -26 44 59 -28 -132
4042 -132 65 122 -141 -139 168 84 -190 -24 145 19 -118 -48 82 74 -50 -91 47 148 -108 -99 172 63 -150
4065 -150 -25 153 4 -88 45 16 -7 23 -13 -38 89 1 -107 42 91 -106 -70 104 -7 -106 37 48 -36 -77
4089 -77 -13 31 -4 -76 -80 104 73 -159 -18 178 -59 -190 88 157 -112 -89 91 70 -29 -21 -7 75 80 -120 -60 142
4115 142 61 -149 -36 176 -13 -166 11 119 12 -91 -60 69 92 -98 -111 116 63 -163 -37 143 7 -107
4137 -107 40 56 -75 -28 32 5 50 -1 -81 40 75 -108 -13 148 -19 -115 49 117 -83 -15 95 20 -41 -32 27 32
4163 32 -24 -75 9 100 -70 -139 76 125 -153 -132 129 60 -104 -66 39 47 -23 -72 -12 145 11 -154 12 192 -61
4188f1j07K51N1j85j6J07N4j17m4O9J04n6k00J43J65j72j17J89L5j69LJ55p4n1
4212d3L0J0J5J3q2K8P0n8m4R8K5j61M5J46n5j12R8N9o2m1kN6J7q1o8J77J4j82
4240i0j3K40p6k27J21J52p5j24N6R7J9j20m3J41M5k01l6K69n8j96M2K01q5j16
4264g7M3N5Rm7o3Q1J25j16j26J32J11j62m4J75oj56P5N8m4m1rM2L5o5m6Q5Nr4
4292f5RJ56o0j48J28O9j15k1J13oj01K4L6jJ3m9m8J42m0j15O8J40j29j10J06J00
4318I6q6p4N7R7m1j19K3J53l3j91O9J88j03j76J48J14j46n9J17J1m5k7J3M3K9
4343E8r7j4R6K6j39M4J05n9n6L6L4rk5l2O5M0j01mR2J2j48Q0R2j07o8J55oj28
4371e8M0R6m2p1J8L0J2j3q5O0J06r2o9J29J1j06j6P9K5p9MJ2N9j2r9J7J40o2j63
$$ plain form
4188 -61 -168 83 134 -51 -67 40 94 -23 -67 2 106 50 -150 -7 158 -14 -131 58 93 -76 -73 82 8 -43
4212 -43 -13 -3 12 25 -57 -29 41 -17 -61 37 62 -99 -54 92 37 -75 23 82 20 -21 -23 33 50 -31 -99 78 92 -90
4240 -90 -103 137 61 -166 -45 107 32 -92 -36 61 80 -40 -83 58 103 -98 -134 135 77 -119 -77 124 39 -77
4264 -77 -34 21 30 -17 -80 1 126 10 -116 16 127 -35 -79 96 90 -66 9 67 23 -18 -27 15 50 -15 -61 24 29 -65
4292 -65 -56 100 40 -108 20 89 -26 -47 66 60 -41 -17 19 18 31 -18 -66 76 36 -79 -11 129 0 -110 -4 96
4318 96 10 -64 -7 90 49 -70 -47 106 73 -118 -49 139 36 -140 8 122 -24 -83 34 45 0 -27 -14 29 58
4343 58 -39 -53 43 69 -70 -26 79 20 -36 0 34 25 0 -32 33 73 -28 -32 60 72 -76 4 96 -11 -79 76 70 -58
4371 -58 -18 78 36 -35 -17 13 25 12 -73 -13 93 1 -68 61 72 -34 -50 29 54 -25 -21 -9 50 38 -61 -44 96 34 -129
4400a29J54R4j36p9J54%j07oR9l8Qk2m5R6l7l5JQ7p5n5J14j3n4J2L8m3L3j3l1
4429b8P0l5m4L0R1r3q8J57mj25L7J32r8n2P9J3m9j1M3J2jj0p8P3K2q3L0O4n4q0
4459h0P8M3l3m5L5pP1n8j06J44M9j30k8J51Oj75P0J14p3l9KJ3MJ3m4K0P4o1n6
4488d8J19k3q5J8O2k8j4L1m8K8L8n6rN0m3m8P9N0j33J7R7p6m1P0L0q5K6M6l7P
4518fJ3kQK1o2qJ00qj21O6P1j16K3N7j0j6k0m5Q1M3p3l5R1j8r3N6N7m0o7P8k7
4549brJ3l8j5R0n5o4R3L9q7JQ8l1m3N2qm3N4k5k9K8L0p1L6K2l9k8R9o0l9P6ro5
4582c9L5K6n1lN0l5mM0j9l1P8pj14J02L8j22oJ03j2l5KL0ojl1mP9j2r5L5N6l8
4614Il0M5k0l7O9j7o1P3rp1L7O8r0k1J10l4o4M2K9m3jL2n0K2K8l8k3O9Jl1M4m0
$$ plain form
4400 -129 25 119 -17 -96 58 58 -49 -55 44 6 14 -8 -53 43 6 -29 -28 59 -16 -71 43 30 -24 -12 26 -17 16 3 -28
4429 -28 42 7 -37 -7 84 -9 -97 60 56 -69 -32 100 2 -50 29 42 -7 -18 25 37 36 26 -52 21 43 -40 -10 54 0 -80
4459 -80 -2 41 8 -37 -2 -9 62 4 -102 42 91 -39 -67 84 90 -85 -15 99 26 -13 -11 2 6 19 -25 -5 69 8 -48
4488 -48 71 48 -37 -19 43 15 1 32 -16 12 50 -6 -15 35 -8 -56 23 73 -60 -43 54 -22 -63 7 37 -48 -22 24 -13 -6
4518 -6 7 5 13 34 -28 -36 64 56 -65 1 72 -44 -21 36 26 10 -10 -55 26 69 -4 -39 52 34 -59 -3 54 14 -53 25 -2
4549 -2 -11 2 -36 -51 39 -16 -80 13 52 -35 -34 54 23 -20 32 24 -19 35 10 -19 9 39 -32 4 26 -13 -41 58 -2 -41 35 26 -39
4582 -39 -4 22 -29 -32 18 -17 -21 19 0 -31 47 40 -74 28 66 -56 -62 41 29 -6 -4 26 20 19 -12 -16 63 51 -44 -9 47 9
4614 9 -21 24 4 -33 36 19 -42 31 22 -49 -12 56 -34 -55 55 21 -43 -1 28 -15 -16 16 -34 -12 16 -22 -45 24 25 -6 38 -2
4646bm3N9J9n4L2K7m6k8Q8l1l1L3l3rK7K0p9L9O0o6k2O7pn0L5K9n8mN4k3kK5n2
4679b6k0R0o0k5K5N5p1N7Lk6QK8m8L7M6j02J6K7M4p9J9K6m3LL7k2k9L0j1K4k5
4710a2L6n1J1L9o3PO8n3J2K6J9k6Qjl6K2J2n6L2M6m8K0K3Nn4OM6k3l5O0j9j5P
4743A3k4OL2j8k9K1rk0K6J0j8oK3J2k2QQl9L9pk6RL5l0k3N6Jl9J2N0m6rK5qj8
4778eL7l0OL8l1oK2oo1M1K3n9J8M9k4m8N3m4PK5lm0L5J1k8j0N2n0J3J8K0l4L0
4811A9jk2M3l3l4j5Q8m9j5L3ml1L1K0l5j1L3j3j4K1k5PK0l4LN0nm7L0Nm0KL9j5
4845Ak4N1k4k3pM1m4K4L7n7QN7j2m3K8Pl5K4J4m0mK8lj5K7m0K0K0ql7M0J0l5%
4879a4M7k8o1O3J4n4N5j8l1L0L2n7RL2k7rM0k5j7M9mk7K5qmJ4K2m1k4K3j4NK3
$$ plain form
4646 -2 -45 14 33 -21 11 38 -8 -36 52 21 -10 23 -10 -19 8 28 -51 -12 48 -18 -40 27 20 -30 5 34 -24 -28 26 3 1 26 -26
4679 -26 -46 44 -16 -41 -16 39 -32 25 28 2 10 38 -10 27 73 -29 -13 14 58 -21 -2 24 -19 -16 21 -1 -30 0 -11 13 -12
4710 -12 24 -27 -16 23 -40 -33 35 -18 -6 20 39 13 21 20 -16 6 18 -38 -6 40 -8 12 35 40 -14 -8 38 15 -20 40 21 6 13
4743 13 -11 -5 27 9 -20 1 -8 -28 -2 8 -10 -16 7 19 -3 5 13 -26 13 6 -20 -11 24 -6 -29 27 28 -11 1 51 5 -4 21 13 -5
4778 -5 32 2 8 46 15 9 31 25 -36 5 28 -31 -13 36 12 -36 17 -27 -20 5 2 -38 -3 8 -20 -30 22 -28 -15 3 23 -11 19
4811 19 18 -4 39 6 -28 -43 45 -4 -19 14 10 -21 10 30 -5 -16 17 4 -10 11 -14 -7 13 -21 -18 32 27 -20 10 15 -25 -23 16 1
4845 1 -23 28 4 -19 -26 15 -29 -5 32 -25 -17 40 28 -15 13 20 -15 9 23 -17 -21 7 4 -11 16 -24 -4 16 8 -29 11 21 -14 -14
4879 -14 33 5 -56 7 21 -33 22 4 -27 3 35 -22 -13 19 -8 -17 23 -2 -19 30 26 -1 24 16 12 26 48 7 -17 6 -8 -3 20
4912B0rn3O2J3r1M5J4%k2J6Qm0N3j9l3L4Pj7j3P2n1k3N6l4K%J8ppL5n9K3K0j6
4946DJM6n0l3N0Kk6J7Nm9K4L4m5LM8k6l1L2j8rj5O4l8k3O0l8j2P1m7l3L3J7pj
4980A0J2l3K3Rm8M9K4m5n7Q8pm1L0K1l8K9j3j6l3K4j5MJ7J8j3j4K1j7j5J8K3l0
5012a5J3Ol0N7l9j7L4ll7L3L2l1j5L5l0MPqm9M0N9n6kK4k1RJ5m2NL0jm7L7J1m6
5047c8L9Kj5J8j1J1n5R4m0k5J2M3o2RN5ql3J8kJ1pnj9M9l2m0O3%n4LM6po8M9P
5082Hn0J8J5k4L7Qo8L6M5j3k%j4mK8lj8j3K5kk1J5MNJ2k0l6N7mn7N2K2k7j8M3
5117C6l2J2J6k9Lkpl8K4L5l2j2P5p2j0K9pnOoK1Rlj7k6K4k6N0K7l6moK1j3k8L8
5153A5k0J4J4k8RK5k1n6P6J0o1L9%j6QK0oj8k1j4K7kk6K1M0l5j9K6M6n8k8M9m
$$ plain form
4912 20 11 -42 20 33 -58 -13 1 1 -21 -5 3 -37 16 -3 -36 -2 5 -12 -25 47 -4 -27 29 -5 -3 -3 15 8 1 36 -23 0 20 4
4946 4 5 51 1 -32 18 20 -6 11 16 -33 -9 25 -20 -17 31 5 -26 6 -12 -21 -36 28 -10 -33 27 -11 -23 48 1 -32 1 18 11 10
4980 10 22 -11 12 21 -27 22 46 1 -56 32 25 -16 14 35 -3 26 13 -3 -36 -12 -27 -23 -6 12 -1 -15 6 -11 -26 -8 15 -15
5012 -15 -2 4 -26 31 -8 -25 9 6 -31 2 34 3 -12 23 -7 -3 4 -4 -53 -13 46 -10 -12 12 -9 0 15 -27 -22 8 7 -40 -3 8 -38
5047 -38 1 3 -12 6 -5 6 -49 45 5 -20 -8 35 -27 -18 37 29 -4 14 12 23 16 11 -8 41 9 -31 32 32 -22 -19 27 20 -48 1 8
5082 8 -42 -24 -9 -33 4 12 -56 -20 25 12 10 10 -4 -8 20 17 -1 -14 11 9 -12 3 7 12 24 4 -32 25 21 -36 16 38 11 -7 36
5117 36 4 16 32 3 6 4 -3 -41 -17 18 -14 -26 49 -23 -33 -4 -11 -16 -10 -16 5 14 11 -6 -32 -8 -34 16 43 7 3 -3 18 5 -23 15
5153 15 -5 9 23 -5 4 29 8 -48 28 38 -23 16 16 0 8 28 22 4 -17 -31 -4 -6 -32 -11 29 -6 -25 1 47 -11 -39 10 6
5186FrPPK0j8l9L6K0j5kk7M9l1l3L1L7n2k5N4oprK6K0Pp1mN2l4qKJ5J5n1M9Ql3
5223a3mJ6j3J3Oj2qPj9K8K4k0k1K5Jj4LKK1k3oNK8k1m0%M9l2NM1j1l0m1Q3j3m3
5259b7j3M0j1K1m8N1rj5oJ2M4n2l8N4L9l9kJ6J7n3nN0Jj9j5J8L4o2K3RJ2k9l8
5292d0N2Lk7J5Jlk0K4k3M6l0k4K6M7m6l8N9J4l9RJ7ol3K8Llj0k4N0jl1jL7j3k5
5327fj9M2k3j0K4j8J9k4j3J4J6j1k9O1jj7j2M0lp9L6K6Rl4NN4n4J4lLM8n8j3N5
5361C9Jo0K1LNk6nL9qj4RJ3kl4j6L5K4o4L2J8k0j5L3pl2K4l6P5k5j2k2M7k0m6
5395d6L9K8l7j2N4Nl5%K9J3k6k6L5lk1k2mM1Qo1P3J2n9mN2j1k5l2J9J9kk6rQ0
5429D6m2n0N7Jqj0LJ7k7K4j6J7J2k8J5j5K4l8L8Km1j0N6mm5L8PJ1k8k2K6J6l7
$$ plain form
5186 6 -3 4 11 31 13 -26 10 30 15 13 -14 35 4 -29 2 39 -13 -38 16 10 3 -6 20 40 47 -24 -28 24 -10 -18 -16 -1 14 -37 12 20 -13
5223 -13 -17 -1 -14 -1 5 -7 -15 -8 -27 1 25 5 -16 9 10 -4 -1 1 22 -1 -7 -2 26 5 -35 -35 14 -18 -13 28 17 -13 -54 29 16 -27
5259 -27 -40 0 -11 10 -38 13 4 -11 -17 -5 39 -13 -51 3 42 3 1 17 34 -19 -24 26 27 8 -7 11 45 -17 6 15 27 -2 -40
5292 -40 12 15 -12 3 4 1 -19 5 -18 28 -2 -26 0 47 1 -37 22 36 -3 6 23 17 -16 12 15 12 2 -22 28 27 -4 -5 32 19 -6
5327 -6 -25 17 -6 -16 8 -10 9 -15 -28 -14 2 -9 -38 23 22 5 -7 33 30 -49 -13 13 22 -12 -7 47 -7 7 4 7 55 -3 -16 39
5361 39 40 -20 1 4 9 -17 -22 17 9 -5 4 17 15 -19 -35 0 24 -40 -8 10 -10 -25 8 1 -31 -7 -43 32 7 -5 -27 20 0 -46
5395 -46 -7 21 -16 -28 26 31 -4 -4 25 38 12 -14 21 18 -3 -25 -29 12 20 -41 32 44 -15 -19 33 22 -3 -35 -16 3 1 -25 -34 46
5429 46 4 -46 11 12 4 -6 -3 14 -13 11 -5 12 24 -4 11 -4 20 -18 20 22 -19 -29 27 23 -22 16 23 34 6 -16 10 26 -11
5462a1j4M6k3j2JJ6K6o8K2K0j1k7L7K1Pj0l9K1L7l0m1P5J4p9qQ1k7m0JK1jqn3
5495e6P2Lj7m2M6j3j1K5rL8n1J4N%j2Ol2K2KoJ7Ql5K5K7j5j7j4M0j5%j0M5l5J8
5530B3j4QJk9J6L6m6j2NK7ml3M5jj3m1J4J0L2m0pO8l2m8K6M5l1m0J8L3j7j8J8
5563alJ3pj5L6j0l0kN5m5J2nK1mj0jKOj9j8J3L2n4K8J3J5m1%N4m1K1pJ6k8kK0
5599A4J7l4kOK9j8j6J7Pl3j4K4K1k9kM0k3K9l7lL1j2l5K2K6j6l0L2J8o3RL9K5
5632C9n6KJ1%mJ3j1J1J0k2jK9j6k6M4k3L1m0K5J0k2J1J1J0k9j4J7J3l0j5L0kJ5
5665B1qljj0j0LJ2Jj2QL5n2qN3j1m4J0K2mJ0j8jJ8j7J7mjk2jM1Lj7j5L2j3nj9
5702a0K8Pnk2OPpl7M4J0j8l7M8j2MJPk4jJ6lk5OJ1j6L5j4qJ2L2l8JJ5K0l3oRl
$$ plain form
5462 -11 -25 21 -2 -14 -13 3 29 -39 -17 3 -8 -35 2 23 30 20 -19 2 39 9 -32 43 57 -22 -30 51 24 -16 -15 6 5 -3 -56
5495 -56 16 19 2 -40 6 -7 -18 7 -2 36 -15 -1 4 4 -8 -2 -34 -12 -10 -16 1 9 -26 -1 26 11 -6 -20 20 5 5 -5 40 5 23
5530 23 9 17 18 -11 5 41 -5 -17 -12 15 11 -22 23 22 9 -32 -18 -8 24 -16 -23 45 13 -35 -9 36 5 -35 -17 16 -1 -19 -1
5563 -1 -4 9 2 -13 23 13 -17 -19 36 -9 3 -2 19 15 5 4 6 12 -7 -25 -12 20 -34 -6 7 22 -19 -19 35 -6 15 8 24 -4 -6 14
5599 14 31 -3 -5 1 30 12 -4 13 20 -13 -27 -3 18 -11 -13 27 4 33 -4 -7 24 12 -23 -1 25 9 -21 11 29 -34 -25 14 39
5632 39 -17 -15 -4 -4 -8 5 -6 5 15 -7 -8 21 5 -21 23 0 31 -9 16 26 4 15 26 36 7 -7 10 23 -7 -22 8 6 21
5665 21 13 10 9 -1 -11 -8 4 5 -7 1 36 -16 -24 29 18 -26 -16 6 2 12 -6 -7 11 -6 11 7 6 -16 -17 24 27 10 -5 27 14 9 -10
5702 -10 18 25 20 -2 4 11 4 -33 11 21 3 -34 14 2 6 7 14 -10 -11 5 2 -23 -17 -6 -22 13 -1 -9 3 35 -3 -2 13 33 0 -6 3 0
5740@qJ1K0J8j2k2L8l1l8L2jj7j9PM1pl3K8J5l9nK9J0j2ok2L4%k5LK4j0JK9J1
5775D4k6j8L3k3rK8k3J1J0n0K5pK6l9L4Ll0RJ6j8oj3L1pK4l4nJ2Ml5M0mk0nK9
5810GK7k0%J7j0j8KjK6ppj7L5k7kpK7j9j0L1j8jjo%j1jK1rj9K7qj8QlJ2NKlK0
5850B4j0m1J0K4Pk2J1JKJj7K9Nj6LJ6jmmj4Nlj3J1j8PqpM1Jm1KJ6k3L5l2J4qJ2
5889eKPOj0RokjK8l8J0K2k9J1j5kK3J0ol0K9j6K1%j4K0j1K%j0j1J1j3%J1Mj0J6
5927A3Jk6pJ3J1Kj8J9j6LkK2k0K8k0LpJ2kj1J8oMJ2j1pL%pLK9j8nj4j7J9JJ8j7
5966Cj8MJ7qlJ0k6J9Mj4OJ6mk1KM1oj0KpJ4k5QOK4n3J3k4L2Mj3J3k2P%L2k4j7
6004a8J2rK0mk1jM3n5L7j5j1K9k0K7qJpj0QM5l0j1J7k8JK2Qj5J0nJ6k6K8k1J1
$$ plain form
5740 0 -8 3 23 41 29 7 45 14 -24 8 7 -10 -29 -22 19 12 -21 7 22 -17 -22 7 17 5 -1 -23 11 11 -14 -11 13 3 4 33 44
5775 44 18 0 33 10 1 29 6 17 27 -23 2 -5 21 -18 16 19 -11 -2 14 -4 -10 -23 8 1 25 -9 -14 -2 2 -33 7 3 -17 -22 7
5810 7 34 14 14 31 21 3 5 4 30 23 16 -1 34 7 5 -2 25 6 -4 27 9 8 7 1 1 -10 -11 10 1 -18 9 1 -17 -9 -12 0 5 7 4 24
5850 24 14 -27 -17 7 14 -8 3 4 6 7 -10 19 24 8 11 27 26 22 18 4 9 6 -7 4 -14 -7 -15 -22 19 20 -21 -19 -3 -26 9 -23 -9 -17 -5
5889 -5 -3 4 10 0 9 3 1 0 28 -10 0 22 -7 4 -11 -13 10 20 14 -16 13 -3 18 18 4 24 13 15 15 5 -6 5 -8 -8 3 7 -3 13
5927 13 14 -12 -19 -6 5 7 -11 8 -8 -5 -7 15 -5 23 3 6 -1 11 9 -2 16 10 14 26 15 8 11 11 4 7 36 18 13 -1 -18 1 2 20 3
5966 3 -15 -11 6 -2 -5 5 -21 -2 2 -12 -6 10 6 -15 -13 28 22 12 14 7 21 -4 4 10 34 -19 -6 -30 2 6 -7 6 -16 -9 -9 23 -1 -18
6004 -18 -6 -15 5 1 -20 -21 22 -33 4 -11 -22 7 -13 14 6 7 0 -10 -2 43 13 2 19 -9 -8 14 22 7 17 12 28 2 30 9 20
6039B0j5Qoj8k6L6K3rj1J3k1qrJ8J3j8K8pj7Pjk7K9rmJ8J2j0j7J9rj0J8j1J0J6
6075B5k1Rk3j2K4j8O1k1J3j6k6j1L3rj8K0j2J3k5K1j7j6K2j3l0L5M2l0J9j3L2
6106C8l8OmJ4j0j6K3pK8j3LK5l4lKkj8LNll5L3nJ8k0j5K6j0kJ9j4oj4kk3N5Oj0
6144@Kj1jK3j5oK5Qk5K3mJJkj1L5l7Jj0j8J1L2j4oj0J4nj5J6mk0N3j8k8Pj8K2
6181dOJrqMM6o3M5k6OKL2k8j4J1J7Nk7KJ5J9qj1Nk6J5pK6k7J8k5LK3k1qpj3J5
6219a6OJ1j2J3Pk6K1j4N3k4k8M1k7knL1j8J4k0PJ4j6J4m5J8K6k5oK0j6K3k5Ml
6253emOJj2Pj8MpK8Ok0J5j2%kPk3K4K6j5Nkj3KJ8%j7%J3Ljk0M3j0k4POK3n0LO
6294bL7m7J9Nk8J5j6J6k1K9j2K9l6PrL1Jj2qMR%m4J1J8J9J1noJ3k7QQj3nJ2j7
$$ plain form
6039 20 5 13 7 -11 -37 -1 22 13 2 15 -6 -14 -23 -5 8 -10 18 11 -6 1 0 -27 2 -7 -11 7 19 9 -8 11 2 -8 10 -1 9 25
6075 25 4 13 -10 -22 2 -16 45 24 37 21 -5 -16 17 8 -10 10 -2 11 -14 7 -10 -26 -4 -17 -47 -12 30 0 19 6 38
6106 38 0 6 2 16 6 -10 13 6 34 21 24 49 15 12 14 12 -6 -3 2 -1 -36 -3 -8 10 -10 -25 1 -9 -11 8 -6 -12 -26 -28 -51 4 10 0
6144 0 2 -9 -10 13 -2 -8 17 25 0 23 19 20 21 19 8 43 6 7 -3 -21 -10 22 8 2 -8 6 1 -14 2 -2 -22 31 13 -15 -8 -26 -4
6181 -4 2 3 -6 -14 -10 36 -27 18 -8 -2 0 32 4 -10 1 18 23 -4 -2 13 32 24 13 18 -8 7 0 26 -1 17 -8 -5 18 -3 -11 -18 -31 -16
6219 -16 -10 1 -11 2 9 -17 4 -10 43 19 -9 32 5 3 -2 29 11 25 5 12 26 10 24 -21 -3 23 -2 -8 12 -4 19 -6 -2 -5
6253 -5 -9 -3 -2 -14 -7 -25 -21 -28 0 6 -14 1 -11 -11 -13 -6 -29 -5 21 6 11 9 -4 -2 16 16 -1 -1 12 15 14 -6 37 27 3 10 16 39 -11 -8 -2
6294 -2 35 -12 7 12 -16 -1 -17 -1 -22 7 -5 24 -12 -5 -14 17 18 6 -2 2 11 11 -33 -22 -4 15 26 21 15 28 1 9 17 4 -1 11 -6
6331f%NjQj5K0oJ0k3J8qNk1J1jpj0K9j2j2L5j5k6L4k1oQJ6j9qL5J6l8J7oJJ9%
6369B6k7J1Ok5L0m2JK1qk%JqJ3J3k9QJ8k3KOQrj2J2K9k1kJ6Qqj0J4j3J0j3K2k9
6407fJ5olnnqK3k9j3N1Jl0nK6k5J8Rk1LJ5Rk7rPJ2J4l7L6k6J6j1K6m4K9oJ3J9
6444B6k5lJ1J8Ml0NK1k8RJkkmk9M0n2J7J2L0l7K2nJj6OmMj2K4rQnJ1J0j9Kj0J6
6483Fj8J5J7j5K0l2nL6pj7J8K7l0l0L7j5j0KK2n%l7mL7p%j7L2k0qJK7k2PrnJ8
6520Ik1J1j3K5lk3N7m0JL5m3k%K0MJ4j8Jk2L8l4NJ5m7K8l2K1j4K0J1oLk0K4kl
6556apRj4J8l1N2k0j6j8M7nk4PM1j9l6QJ9K3k1l4L4pj8k5N2jj6JpJ1k5L7qNl%
$$ plain form
6331 -6 -6 -1 -2 6 -9 11 5 15 -8 10 2 7 -14 -3 -4 -11 -21 8 -4 -16 19 4 -22 12 -9 -15 -7 9 -10 -18 17 33 -5 12 6 7 26 26
6369 26 -1 10 16 -9 21 -21 -20 1 -7 -9 -9 -8 -16 -3 10 -19 -11 7 -16 -14 -8 0 -9 -21 -9 20 -1 -3 13 21 13 3 17 4 14 1 23 -6
6407 -6 9 3 0 -5 -10 -18 5 -24 -37 14 15 -15 -20 6 -19 -1 8 -13 -10 5 14 -13 -22 -15 -3 11 -26 10 -16 0 -11 15 -29 0 -6 7 26
6444 26 1 -2 9 27 31 1 6 27 -1 8 9 7 5 1 -28 12 -40 -23 -11 19 -18 4 -1 0 -16 -10 -14 -10 -22 2 -7 1 -4 7 17 -2 0 -10 6
6483 6 -12 3 20 5 25 -7 -12 24 17 0 18 45 15 -15 22 7 -3 -1 21 16 16 -21 -25 12 5 5 -12 20 0 -8 -7 20 -2 5 -4 -9 9
6520 9 -12 -1 -14 11 8 -15 42 2 3 38 -5 -7 -7 13 17 31 13 14 -8 30 -4 1 16 -31 -3 -35 -14 -28 -8 3 -3 0 -20 4 2 -1
6556 -1 -8 1 -13 5 -26 26 6 -10 -28 19 14 -10 -3 38 19 -17 -9 10 33 12 -22 12 5 -13 -38 14 13 -3 -2 -9 2 -23 14 6 11 8 8
$$ [...]
8191b
##END NTUPLES=NMR FID
##END=
