##TITLE=1H_AM_NV102
 CDCl3
 8 sc, 
 25.12.2023
##JCAMPDX= 6.0         $$ Bruker NMR JCAMP-DX V2.0
##DATA TYPE= NMR FID
##DATA CLASS= NTUPLES
##ORIGIN= UXNMR, Bruker Analytische Messtechnik GmbH
##OWNER= root
$$ XWIN-NMR		Version 3.5
$$ Mon Dec 25 13:57:12 2023 Russian Standard Time (UT+4h)  she@DPX200
##.OBSERVE FREQUENCY= 200.1313
##.OBSERVE NUCLEUS= ^1H
##.DELAY= (6, 6)
##.ACQUISITION MODE= SIMULTANEOUS
##.ACQUISITION SCHEME= undefined
##.AVERAGES= 8
##.DIGITISER RES= 18
##SPECTROMETER/DATA SYSTEM= spect
##.PULSE SEQUENCE= zg30
##.SOLVENT NAME= CDCl3
##.SHIFT REFERENCE= (INTERNAL, CDCl3, 0, 15.7039)
##AUDIT TRAIL= $$ (NUMBER, WHEN, WHO, WHERE, WHAT)
$$ ##TITLE= Audit trail, XWIN-NMR		Version 3.5
$$ ##JCAMPDX= 5.01
$$ ##ORIGIN= Bruker BioSpin GmbH
$$ ##OWNER= she
$$ F:/spectra/data/she/nmr/H-F/1/audita.txt
$$ ##AUDIT TRAIL=  $$ (NUMBER, WHEN, WHO, WHERE, WHAT)
(   1,<2023-12-25 13:56:13.90 +0400>,<she>,<DPX200>,
      <created by zg, POWCHK disabled, PULCHK disabled
       configuration hash MD5:
       00 E9 B6 7A A2 85 ED C7 34 08 36 98 17 FE 4E 26
       data hash MD5: 16K
       3D BB 53 9D 0D 5C FD 69 36 C8 F5 96 59 2D A3 27>)
$$ ##END=
$$ 
$$ hash MD5
$$ A4 9C 4C E2 66 57 A3 19 73 8F AE C7 71 84 50 E1
##$RELAX= 
##$RELAX= 
##$RELAX= 
##$RELAX= 
##$RELAX= 
##$RELAX= 
$$ Bruker specific parameters
$$ --------------------------
##$DU= <F:/spectra>
##$EXPNO= 1
##$NAME= <H-F>
##$PROCNO= 1
##$TYPE= <nmr>
##$USER= <she>
##$AMP= (0..31)
100 100 100 100 100 100 100 100 100 100 100 100 100 100 100 100 100 100 
100 100 100 100 100 100 100 100 100 100 100 100 100 100 
##$AQSEQ= 0
##$AQ_mod= 1
##$AUNM= <au_zg>
##$AUTOPOS= <>
##$BF1= 200.13
##$BF2= 200.13
##$BF3= 200.13
##$BF4= 200.13
##$BF5= 200.13
##$BF6= 200.13
##$BF7= 200.13
##$BF8= 200.13
##$BYTORDA= 1
##$CFDGTYP= 0
##$CFRGTYP= 5
##$CHEMSTR= <none>
##$CNST= (0..31)
1 1 145 1 1 1 1 1 1 1 1 1 1 1 1 1 1 1 1 1 1 1 1 1 1 1 1 1 1 1 1 1 
##$CPDPRG= <>
##$CPDPRG1= <>
##$CPDPRG2= <>
##$CPDPRG3= <>
##$CPDPRG4= <mlev>
##$CPDPRG5= <mlev>
##$CPDPRG6= <mlev>
##$CPDPRG7= <mlev>
##$CPDPRG8= <mlev>
##$CPDPRGB= <>
##$CPDPRGT= <>
##$D= (0..31)
0 1.2 0 0 0 0 0 0 0 0.06 0 0.03 0 0 0 0 0.0002 0 0 0 0 0 0 0 0 0 0 0 0 
0 0 0 
##$DATE= 1703498173
##$DBL= (0..7)
120 120 120 120 120 120 120 120 
##$DBP= (0..7)
150 150 150 150 150 150 150 150 
##$DBP07= 0
##$DBPNAM0= <>
##$DBPNAM1= <>
##$DBPNAM2= <>
##$DBPNAM3= <>
##$DBPNAM4= <>
##$DBPNAM5= <>
##$DBPNAM6= <>
##$DBPNAM7= <>
##$DBPOAL= (0..7)
0.5 0.5 0.5 0.5 0.5 0.5 0.5 0.5 
##$DBPOFFS= (0..7)
0 0 0 0 0 0 0 0 
##$DE= 6
##$DECBNUC= <off>
##$DECIM= 32
##$DECNUC= <off>
##$DECSTAT= 4
##$DIGMOD= 1
##$DIGTYP= 9
##$DL= (0..7)
0 120 120 120 120 120 120 120 
##$DP= (0..7)
150 150 150 150 150 150 150 150 
##$DP07= 0
##$DPNAME0= <>
##$DPNAME1= <>
##$DPNAME2= <>
##$DPNAME3= <>
##$DPNAME4= <>
##$DPNAME5= <>
##$DPNAME6= <>
##$DPNAME7= <>
##$DPOAL= (0..7)
0.5 0.5 0.5 0.5 0.5 0.5 0.5 0.5 
##$DPOFFS= (0..7)
0 0 0 0 0 0 0 0 
##$DQDMODE= 0
##$DR= 18
##$DS= 0
##$DSLIST= <SSSSSSSSSSSSSSS>
$$ [...]
##$SUBNAM2= <"">
##$SUBNAM3= <"">
##$SUBNAM4= <"">
##$SUBNAM5= <"">
##$SUBNAM6= <"">
##$SUBNAM7= <"">
##$SUBNAM8= <"">
##$SUBNAM9= <"">
##$SW= 18.0517328524113
##$SWIBOX= (0..15)
0 0 2 0 0 0 0 0 0 0 0 0 0 0 0 0 
##$SW_h= 3612.71676300578
##$TD= 16384
##$TD0= 1
##$TE= 0
##$TE2= 300
##$TE3= 300
##$TEG= 300
##$TL= (0..7)
0 120 120 120 120 120 120 120 
##$TP= (0..7)
150 150 150 150 150 150 150 150 
##$TP07= 0
##$TPNAME0= <>
##$TPNAME1= <>
##$TPNAME2= <>
##$TPNAME3= <>
##$TPNAME4= <>
##$TPNAME5= <>
##$TPNAME6= <>
##$TPNAME7= <>
##$TPOAL= (0..7)
0.5 0.5 0.5 0.5 0.5 0.5 0.5 0.5 
##$TPOFFS= (0..7)
0 0 0 0 0 0 0 0 
##$TUNHIN= 0
##$TUNHOUT= 0
##$TUNXOUT= 0
##$USERA1= <user>
##$USERA2= <user>
##$USERA3= <user>
##$USERA4= <user>
##$USERA5= <user>
##$V9= 5
##$VALIST= <valist>
##$VCLIST= <CCCCCCCCCCCCCCC>
##$VD= 0
##$VDLIST= <DDDDDDDDDDDDDDD>
##$VPLIST= <PPPPPPPPPPPPPPP>
##$VTLIST= <TTTTTTTTTTTTTTT>
##$WBST= 1024
##$WBSW= 4
##$XGAIN= (0..3)
0 0 0 0 
##$XL= 0
##$YL= 0
##$YMAX_a= 33579
##$YMIN_a= -43920
##$ZGOPTNS= <>
##$ZL1= 120
##$ZL2= 120
##$ZL3= 120
##$ZL4= 120
##$ABSF1= 10
##$ABSF2= 0
##$ABSG= 5
##$ABSL= 3
##$ALPHA= 0
##$AQORDER= 0
##$ASSFAC= 0
##$ASSFACI= 0
##$ASSFACX= 0
##$ASSWID= 0
##$AUNMP= <proc_1d>
##$AZFE= 0.1
##$AZFW= 0.1
##$BCFW= 1
##$BC_mod= 2
##$BYTORDP= 1
##$COROFFS= 0
##$CY= 11.3945322036743
##$DATMOD= 1
##$DC= 2
##$DFILT= <>
##$DTYPP= 0
##$F1P= 15.7292609196834
##$F2P= 12.9074282941183
##$FCOR= 0.5
##$FTSIZE= 0
##$FT_mod= 4
##$GAMMA= 1
##$GB= 0.15
##$INTBC= 1
##$INTSCL= 1
##$ISEN= 128
##$LB= 0.24
##$LEV0= 0
##$LPBIN= 0
##$MAXI= 10000
##$MC2= 0
##$MEAN= 0
##$ME_mod= 0
##$MI= 1.114404
##$NCOEF= 0
##$NC_proc= 0
##$NLEV= 6
##$NOISF1= 3.799351
##$NOISF2= 2.8
##$NSP= 1
##$NTH_PI= 0
##$NZP= 0
##$OFFSET= 15.70392
##$PC= 1
##$PHC0= -24501.86
##$PHC1= 9.05273
##$PH_mod= 1
##$PKNL= yes
##$PPARMOD= 0
##$PSCAL= 0
##$PSIGN= 0
##$REVERSE= no
##$SF= 200.130013532006
##$SI= 16384
##$SIGF1= 3
##$SIGF2= 2
##$SINO= 400
##$SIOLD= 16384
##$SREGLST= <1H.CDCl3>
##$SSB= 0
##$STSI= 0
##$STSR= 0
##$SW_p= 3612.71676300578
##$SYMM= 0
##$S_DEV= 0
##$TDeff= 0
##$TDoff= 0
##$TI= <>
##$TILT= no
##$TM1= 0
##$TM2= 0
##$TOPLEV= 0
##$USERP1= <user>
##$USERP2= <user>
##$USERP3= <user>
##$USERP4= <user>
##$USERP5= <user>
##$WDW= 1
##$XDIM= 8192
##$YMAX_p= 0
##$YMIN_p= 0
$$ End of Bruker specific parameters
$$ ---------------------------------
##NTUPLES= NMR FID
##VAR_NAME=  TIME,          FID/REAL,        FID/IMAG
##SYMBOL=    X,             R,               I
##VAR_TYPE=  INDEPENDENT,   DEPENDENT,       DEPENDENT
##VAR_FORM=  AFFN,          ASDF,            ASDF
##VAR_DIM=   8192,          8192,            8192
##UNITS=     SECONDS,       ARBITRARY UNITS, ARBITRARY UNITS
##FACTOR=    0.0002768,     1,               1
##FIRST=     0,             0,               0
##LAST=      2.2672688,     0,               0
##MIN=       0,             -43920,          0
##MAX=       2.2672688,     33579,           0
$$ Real data points
##PAGE= N=1
##DATA TABLE= (X++(R..R)), XYDATA
0 0 0 0 0 0 0 0 0 0 0 0 0 0 0 0 0 0 0 0 -2 8 -8 8 -8 8 -9 16 -16 16 -24 24 -25 32 -33 40 -48 49 -57 65 -73 81
40 81 -89 98 -111 121 -136 147 -163 179 -200 219 -242 267 -293 323 -358 396 -441 490 -548 616
60 616 -697 797 -922 1085 -1305 1621 -2114 3000 -5074 20373 -8594 -41507 28669 24703 -25994
75 -25994 -11996 22379 -1756 -11266 3047 -303 -4846 6123 -1781 -7915 2637 5626 -1280 -1170
89 -1170 -3625 3584 12480 -6328 -15863 16833 15971 -24841 -9486 28781 -2939 -27899 11871 17196
103 17196 -20129 -5298 19024 -7525 -12607 16423 4097 -17244 5594 15490 -8430 -9033 8171
116 8171 5591 -3594 -5876 -2101 8507 3159 -14873 -2576 17156 -3040 -16559 8230 11309
129 11309 -9866 -2007 8434 -4821 -500 9960 -8062 -9145 15849 4039 -20235 1702 18354
142 18354 -7484 -14338 8232 8214 -5815 -4205 1124 4015 4199 -5665 -5708 9687 4872 -11679 -1146
157 -1146 10668 -3318 -7141 4867 694 -4352 4297 213 -7099 4984 6673 -8462 -2637 10091
171 10091 -1194 -7454 4500 3148 -4911 1238 2166 -4758 834 4350 -4442 -2774 5079 26 -3229
186 -3229 2098 433 -816 3784 -1149 -5127 5337 4943 -8519 -2879 9149 -852 -8708 2150
200 2150 4983 -2957 -2187 805 -6 2514 902 -4597 1283 7066 -2354 -6025 4459 4770 -4499 -3174
216 -3174 2515 1191 -1257 -2461 -1876 2976 2077 -5263 -1572 6809 397 -6008 2546 5629 -2720 -2270
232 -2270 3522 517 -2080 859 -200 -1811 782 -167 -2665 305 1324 -1890 -519 2006 -369
247 -369 -588 2046 708 -774 1229 1050 -570 218 -15 -847 611 -291 -2772 200 2268 -2461 -2943
264 -2943 3046 2014 -3469 -691 4015 924 -2351 364 2650 784 -1488 -995 1353 1132 -2194 -2155
280 -2155 1415 893 -2496 -1344 1600 656 -1105 -292 951 1258 390 -834 357 2090 48 -2010
296 -2010 511 1952 -1297 -2276 839 1067 -1673 -1537 953 954 -1026 -902 1325 1464 -845 -698 1792
313 1792 1200 -1453 -555 1613 189 -1709 -396 928 -168 -1229 -562 686 566 -876 -821 1251 1258
330 1258 -1074 -719 1720 996 -1359 -594 1239 488 -1216 -905 643 715 -983 -1294 888 1336 -1071
347 -1071 -1122 1548 1208 -1296 -598 1373 519 -1025 -463 520 370 -584 -966 219 989 -692 -1285 982
365 982 1218 -1104 -600 1655 630 -1108 153 1041 -225 -694 -121 45 -16 -508 -832 289 662 -963
383 -963 -672 1461 548 -1270 506 1754 -327 -728 926 525 -556 -165 -269 -340 328 -747 -1492 716
401 716 995 -1805 -821 2289 437 -1800 753 2073 -223 -700 598 639 328 -520 -1247 519 1079 -1954
419 -1954 -1812 1836 508 -2616 -19 2155 -555 -856 1300 507 43 1204 -278 -745 1757 400
435 400 -2530 228 1880 -1887 -1941 1486 16 -1843 465 579 -879 820 921 -985 863 1912
451 1912 -1037 -384 2105 -488 -1616 1417 48 -2472 701 1149 -2607 -681 2277 -1028 -1705 1852
467 1852 621 -1119 1310 632 -1133 1731 1280 -2659 309 3079 -2097 -2742 2593 611 -3251 272
483 272 1431 -1571 164 1182 -1706 487 2975 -1695 -1880 3561 1122 -3469 577 2634 -1546 -1199
499 -1199 904 -809 -56 1007 -2163 -795 3279 -831 -3374 2730 2541 -3288 -59 3400 -1593 -1449
515 -1449 2846 -862 -2604 2718 672 -4028 1023 3159 -2872 -1668 3104 -220 -1917 1645 315
530 315 -1316 1720 256 -2305 1555 1690 -2789 -228 2449 -1776 -1197 2485 -1355 -2052 3388 216
546 216 -4134 2449 3776 -4110 -1589 4887 -612 -3802 2232 1462 -2765 564 1199 -2404 584 2248
562 2248 -2594 -1012 3484 -457 -2504 2123 1237 -1674 991 616 -1817 1540 1295 -3666 -4 3860
578 3860 -2570 -3417 3646 1007 -4011 1277 2781 -2478 40 2975 -1765 -960 3540 -697 -3028 2580
594 2580 1354 -3417 203 1941 -2252 -662 1737 -1770 -825 2773 -1033 -2240 3041 1301 -2904
609 -2904 1245 2641 -2057 -404 2378 -1615 -1349 2467 -1200 -2998 2318 1000 -3645 407 2825
624 2825 -1932 -1045 2654 -369 -993 2344 -120 -1829 2387 1017 -3170 581 2487 -2492 -1655 2249
640 2249 -802 -2040 1490 -12 -1835 1740 1116 -2292 1017 2693 -1743 -836 2813 -335 -1902 1554
656 1554 273 -2027 855 604 -2448 279 1797 -2089 -998 2593 -393 -1836 1927 1088 -1659 980
672 980 1511 -1599 83 1825 -1404 -1232 1778 -408 -2035 983 620 -1681 352 1048 -1229 146
688 146 1594 -979 -512 2021 -226 -1515 1449 730 -1841 328 1185 -1524 -500 1443 -891 -1163
704 -1163 1462 108 -1494 956 1070 -1158 91 1247 -613 -366 910 -449 -634 849 -312 -1035
720 -1035 837 258 -1341 447 1076 -1069 -212 1459 -408 -891 1256 337 -1323 507 954 -1186 -476
737 -476 1029 -439 -943 629 260 -707 216 479 -187 204 323 -162 342 355 -491 59 553 -657 -555
756 -555 680 -260 -1062 460 486 -1044 -14 1111 -384 -548 1121 482 -766 410 851 -523 -428 511
774 511 -86 -684 -118 -10 -378 -262 -124 -49 120 -28 -3 464 347 -49 379 566 -164 -68 500 -192 -617
795 -617 130 30 -844 -365 295 -385 -578 285 256 -232 161 543 199 161 393 271 119 147 -7 -140 -130 -247
817 -247 -326 -269 -279 -285 -127 -101 -113 137 245 104 253 448 253 126 356 225 -119 -35 16 -276 -328 -172 -271 -316
841 -316 -144 -87 -152 18 135 107 199 320 249 188 238 196 49 -43 -57 -84 -229 -297 -147 -113 -326 -263 90 19 -240
866 -240 155 394 28 9 426 303 -94 102 182 -88 -168 -57 -175 -180 -110 -195 -124 54 -78 -39 197 85 28 263
890 263 144 -87 222 196 -317 -38 352 -331 -509 308 128 -602 -38 486 -234 -291 452 227 -195 112 233
911 233 -24 79 -29 -173 152 -41 -482 53 308 -453 -275 541 -13 -400 457 298 -383 317 515 -489
931 -489 -28 686 -429 -687 630 101 -1003 17 629 -519 -434 548 142 -135 321 57 99 564 -127
950 -127 -416 640 229 -937 12 617 -725 -595 555 -257 -657 564 137 -628 624 661 -695 263
968 263 1182 -398 -560 971 67 -971 341 296 -974 -146 421 -756 -295 618 -368 -348 837 62 -432
987 -432 986 410 -771 679 949 -1047 -360 1146 -539 -1164 540 57 -989 211 119 -814 556
1004 556 743 -1053 135 1742 -418 -1063 1399 795 -1227 28 769 -640 -271 187 -892 -120 829
1021 829 -1007 -977 1462 337 -1514 585 1430 -590 -237 985 -106 -81 716 -607 -621 1162 -299
1038 -299 -1704 698 924 -1557 -378 1311 -596 -718 1250 1 -873 1198 632 -1247 479 1218
1054 1218 -977 -531 1005 -484 -770 713 -389 -1006 931 283 -1401 419 1319 -805 -477 1090
1070 1090 -47 -293 699 -468 -474 1394 -244 -1991 999 1697 -1980 -1138 2069 199 -1742 496 972
1087 972 -453 137 161 -646 798 858 -1532 -439 1759 -333 -1724 637 883 -794 -256 225 -200 672
1105 672 248 -1314 491 1753 -1105 -1332 1799 575 -1891 277 1239 -1088 -474 1017 -643 -708 1195
1122 1195 -1 -1163 770 909 -826 -37 756 -301 78 452 -829 -194 1057 -650 -1300 878 580
1139 580 -1237 -75 761 -381 137 584 -763 164 1724 -686 -1537 1641 1286 -2070 -742 1773 -120
1156 -120 -1561 -60 552 61 -190 -712 0 1406 -65 -1455 849 1759 -829 -938 1178 504 -751
1173 -751 -58 -106 -280 452 -421 -1303 588 1001 -1339 -814 1562 345 -1160 464 1018 -261 23 450
1191 450 -218 39 401 -539 -393 475 -319 -690 312 -129 -701 517 402 -917 216 1317 -363 -785
1209 -785 1041 771 -702 -185 469 -2 -60 -336 -670 347 504 -1155 -739 1235 361 -1294 -7 1237
1227 1237 133 -560 55 556 524 -162 -860 289 1113 -699 -1440 718 983 -1178 -907 909 489 -676
1245 -676 -256 388 476 151 -462 -41 913 168 -966 131 914 -490 -859 466 325 -638 -192 306 -107
1264 -107 -67 133 -61 122 259 -159 20 434 -168 -367 417 161 -652 -57 507 -267 -524 224 280 -109 -151
1285 -151 -14 286 417 -319 -391 674 478 -902 -393 952 122 -1095 -106 795 -37 -734 -96 585 323
1304 323 -455 -367 700 647 -696 -502 890 412 -932 -354 683 70 -660 -263 276 189 -267 -385 316
1323 316 660 -231 -495 621 662 -499 -374 618 265 -557 -247 275 42 -384 -395 101 320 -330 -445 502
1343 502 540 -467 -177 837 290 -551 78 613 -81 -528 -84 237 -72 -539 -376 298 148 -679 -262 751
1363 751 209 -644 188 862 54 -411 225 507 64 -380 -234 309 204 -701 -564 528 207 -905 -245
1382 -245 821 113 -588 133 701 227 -266 -62 506 397 -458 -496 536 308 -930 -452 665 -53 -861
1401 -861 -14 552 -61 -320 122 378 309 -108 -162 539 471 -567 -298 742 -9 -934 20 559 -425 -582
1421 -582 212 264 -136 -196 -47 349 395 -341 -212 815 303 -872 8 879 -265 -815 224 406 -307 -415
1441 -415 -75 274 309 -410 -430 772 570 -881 -248 1177 83 -987 216 719 -312 -483 70 126 81
1460 81 -190 -445 321 576 -557 -429 853 296 -775 159 745 -332 -379 356 -10 -278 110 -121 -145 324
1480 324 -168 -440 521 322 -688 92 877 -338 -610 657 369 -665 -145 359 -82 -145 -185 -293 411
1499 411 258 -914 -53 1232 -184 -1121 661 1105 -666 -595 694 335 -296 -334 -228 319 310 -899 -563
1518 -563 1080 229 -1298 97 1207 -268 -697 561 468 -136 87 -115 -50 564 -136 -910 307 670
1536 670 -889 -636 796 22 -744 271 408 -281 155 355 -177 197 408 -305 -12 445 -356 -352 533 -288
1556 -288 -913 474 444 -1039 -258 1045 -145 -747 471 551 -119 71 16 6 635 9 -966 309 973
1575 973 -883 -1003 754 469 -940 -337 461 178 8 -253 -209 838 564 -967 -157 1429 22 -1359
1593 -1359 335 998 -594 -722 241 135 -107 -129 -430 127 691 -369 -637 800 616 -727 -35 793
1611 793 -145 -337 348 -93 -334 357 -112 -590 235 260 -543 -46 458 -272 -72 528 -221 -326 749 214
1631 214 -790 190 714 -403 -500 298 113 -165 -86 -356 52 613 -346 -725 740 768 -872 -426 982
1650 982 272 -739 -61 367 104 -99 -407 -185 666 60 -972 70 1057 -265 -848 537 674 -424
1668 -424 -320 263 150 35 -162 -379 240 439 -611 -465 657 178 -693 116 507 -232 -109 313 -36
1687 -36 -43 351 -135 -269 292 26 -434 55 128 -360 -29 265 -326 -107 540 -9 -438 310 470 -221 -132 277
1709 277 91 22 -70 -317 108 356 -517 -580 544 278 -734 -147 746 65 -423 147 391 124 -2 -183
1729 -183 67 467 -102 -631 131 477 -503 -584 322 190 -361 -162 161 154 162 -60 -70 464 344 -407 -55 599
1751 599 -114 -553 174 239 -411 -223 115 -157 -177 121 -75 -75 226 48 -34 270 149 -135 169 228 -234 -86
1773 -86 253 -154 -320 68 13 -255 -37 -5 -91 109 47 -165 222 358 -207 -108 513 168 -403 86 352 -196
1795 -196 -303 68 -24 -99 -56 -169 -10 240 -101 -277 315 334 -213 -127 375 111 -160 -1 79 1 -74 -222 -73
1818 -73 225 -103 -360 152 303 -252 -164 383 96 -242 115 189 -85 13 116 -101 -34 115 -190 -111 185 -49
1840 -49 -201 92 124 -140 4 156 -12 3 85 -42 30 12 -145 -48 148 -153 -263 223 115 -317 2 330
1862 330 -91 -179 223 153 -131 52 101 -42 -10 3 -180 -9 104 -206 -134 178 18 -188 69 120 -23 73 63
1885 63 -3 181 110 -193 55 266 -221 -288 188 40 -398 -32 170 -156 -132 156 12 -6 189 60 12 216
1907 216 70 -116 138 108 -206 -71 90 -198 -169 65 -124 -172 131 28 -141 197 188 -138 168 304 -114 -61
1929 -61 296 -18 -278 107 73 -264 -84 54 -227 -72 81 -161 -12 245 -47 -92 334 168 -185 159 243
1950 243 -178 -31 167 -164 -164 118 -197 -245 161 -23 -307 114 228 -195 6 342 -20 -39 284 4 -135
1971 -135 193 39 -275 52 106 -326 -107 188 -230 -163 242 -66 -199 273 142 -208 195 280 -157 17 257
1992 257 -131 -138 204 -134 -262 190 47 -367 53 276 -248 -78 325 -38 -143 241 33 -140 209 75 -266
2013 -266 103 174 -329 -107 276 -171 -208 244 -26 -214 222 118 -307 191 325 -309 -92 390 -97 -327 227
2034 227 94 -336 22 177 -195 -5 179 -137 -6 254 -81 -88 241 3 -195 249 32 -340 135 195 -404
2055 -404 -77 415 -205 -362 371 166 -440 150 452 -249 -116 398 -42 -285 237 82 -260 7 76 -177
2075 -177 -40 35 -134 71 93 -196 103 337 -198 -74 512 33 -390 328 311 -494 -52 441 -295 -447 341
2096 341 57 -510 110 309 -287 -78 364 6 -134 214 121 -33 104 -5 -48 127 -122 -259 166 2 -434
2117 -434 59 304 -367 -192 514 -5 -376 387 379 -364 53 507 -206 -249 336 21 -398 73 121 -282 -114
2138 -114 109 -101 -66 92 -74 91 201 -96 35 356 -43 -247 320 152 -397 31 279 -349 -240 332
2158 332 -113 -414 253 193 -358 71 409 -134 -130 331 109 -153 112 71 -132 35 -58 -202 82 51 -293 22
2180 22 200 -212 -86 281 -36 -225 312 144 -301 167 311 -306 -185 382 -62 -387 179 168 -262 -54 183
2201 183 -95 -26 165 -101 37 187 -45 -90 195 -17 -150 171 26 -260 105 123 -293 -65 325 -137 -293
2222 -293 296 185 -322 36 273 -141 -67 189 -67 -139 141 -43 -204 104 72 -177 46 107 -87 66 109 -99
2244 -99 97 264 -129 -147 290 67 -378 58 231 -216 -212 187 -14 -188 119 58 -100 143 124 -138 76 214
2266 214 -59 -36 130 -21 -106 54 -136 -118 92 -87 -264 127 176 -254 -20 309 15 -180 254 138 -110
2287 -110 110 182 -115 -71 138 -123 -176 57 -55 -122 20 -31 -38 105 27 -139 167 186 -134 8 294 -27 -181
2310 -181 138 57 -212 16 21 -236 -14 126 -187 -132 248 29 -180 122 224 -22 1 123 72 43 26 -110 34
2333 34 117 -192 -226 146 1 -276 17 140 -96 -51 147 14 16 151 12 -72 149 31 -181 75 101 -187 -90
2356 -90 87 -104 -139 72 -8 -79 81 84 -69 108 120 -69 62 155 -69 -70 166 -24 -203 65 56 -177 -75 99
2380 99 -53 -56 41 -35 1 126 -69 -45 212 46 -210 61 198 -170 -140 114 3 -137 6 -14 -22 95 -23 -77
2404 -77 162 132 -160 -40 246 -22 -200 90 91 -110 -22 18 -38 45 13 -103 112 158 -119 -81 247 52 -172 68
2428 68 123 -115 -88 73 -79 -82 30 -69 -24 98 -82 -99 158 85 -153 77 242 -89 -89 180 20 -103 -6 9
2452 9 -46 -10 -56 -126 101 79 -173 -2 268 -40 -190 169 203 -123 4 89 22 -29 -36 -80 28 83 -211 -163 162
2477 162 -14 -275 75 221 -93 -61 158 71 8 56 0 8 126 -70 -186 120 7 -261 -64 175 -124 -177 168
2500 168 73 -121 54 136 36 62 71 -8 70 56 -148 -19 174 -151 -254 139 60 -264 -64 169 -18 -79 48
2523 48 27 66 135 -56 -26 243 42 -260 85 251 -197 -234 134 70 -163 -74 51 52 72 -90 -69 236 125 -229
2547 -229 35 348 -47 -220 135 128 -156 -75 26 -50 4 -1 -84 16 131 -112 -74 193 38 -171 77 159 -120
2570 -120 -7 133 -72 -76 100 -26 -107 75 -31 -89 141 32 -183 131 252 -165 -118 307 80 -272 -7 199
2592 199 -47 -131 -20 34 100 -26 -206 99 283 -162 -257 280 212 -255 -50 215 27 -106 -9 -35 78 87 -192
2615 -192 -92 281 37 -294 74 351 -110 -195 174 175 -33 -27 26 20 114 -93 -155 122 67 -227 -29 216 -81 -176
2639 -176 199 78 -156 139 158 -89 -20 144 -8 -64 42 -69 -53 105 -97 -166 146 85 -268 -22 258 -31
2661 -31 -130 149 168 24 -10 11 72 184 -72 -251 160 263 -312 -238 288 80 -314 -79 227 66 -93 -55 85
2684 85 198 52 -211 97 307 -100 -284 129 160 -230 -151 101 12 -48 -33 -42 74 154 -75 -68 278 132 -184 82
2708 82 234 -83 -96 138 5 -132 32 9 -121 -14 32 -50 49 25 -73 93 145 -135 -39 255 42 -253 60
2731 60 199 -121 -150 77 60 -93 -65 -109 90 163 -152 -138 272 195 -232 -33 296 43 -186 24 129 37 -73
2754 -73 -122 -13 188 -72 -254 156 257 -164 -192 247 126 -193 -35 115 46 -30 -60 -10 81 3 -143 -4 153
2777 153 -93 -129 130 97 -94 18 109 -40 -55 90 11 -20 69 -41 -24 68 -32 -94 117 83 -173 -18 216 -46
2801 -46 -141 119 162 -37 -44 44 70 23 -75 -83 111 86 -225 -112 242 3 -252 50 227 -34 -128 51 116 85 -26
2826 -26 -101 69 163 -146 -164 175 90 -232 -91 152 16 -146 23 91 35 -12 -42 65 153 -26 -113 112 129 -172
2850 -172 -112 112 -15 -149 -6 28 -68 -33 47 4 45 35 -14 83 125 -80 -31 144 43 -183 50 122 -115 -118 44
2875 44 29 -55 -51 -15 67 72 -78 -40 179 75 -158 20 240 -52 -168 66 106 -77 -101 -32 35 35 -70 -91 89 104
2901 104 -142 -43 204 50 -151 56 172 -3 -64 -2 15 37 -47 -135 44 114 -138 -108 154 56 -136 12 171
2924 171 -15 -81 52 48 -30 -9 -25 -35 40 -73 -81 84 45 -138 -19 145 -10 -110 89 97 -43 -2 53 38 8 -51
2950 -51 -43 108 59 -143 -49 174 -42 -168 89 165 -67 -73 92 62 -6 -33 -3 55 74 -61 -65 132 61 -168 -26 133
2976 133 -33 -93 44 85 -9 -19 -5 67 82 -29 -84 106 80 -159 -44 141 -27 -125 77 83 -86 -31 81 -7 8
3001 8 54 50 63 59 -46 -4 99 -13 -133 51 56 -104 -73 66 20 -76 -27 5 13 58 -22 -45 141 67 -135 13 156
3028 156 -73 -128 71 85 -113 -83 54 55 -21 0 -10 105 69 -74 12 150 2 -106 84 90 -81 -41 25 -37 -21
3053 -21 11 -81 -19 99 -49 -86 88 82 -66 29 122 -2 -36 92 31 -26 40 3 -47 -10 4 -63 34 12 -88 40 120
3080 120 -36 -54 137 90 -54 26 155 1 -61 7 11 -25 -12 -109 -20 85 -48 -144 83 90 -87 -32 97 50 -24 24
3106 24 17 19 72 -43 -85 62 44 -135 -39 157 -40 -137 60 91 -35 -11 20 30 44 0 -10 68 52 -84 -35 80 -31
3133 -31 -80 43 27 -84 16 60 -79 -10 104 -37 -29 47 39 -68 25 71 -60 7 77 -45 -54 63 26 -56 -1 63 5
3160 5 -10 -27 28 90 18 -77 71 102 -104 -90 126 57 -145 28 77 -28 -33 29 -44 13 80 -32 -39 78 39 -82 -5
3187 -5 92 -46 -63 2 -5 -22 -20 -37 6 80 -16 -35 74 58 -37 46 108 -14 -23 62 -14 -56 24 29 -86 -20 22 -74 -42 59
3217 59 -17 -32 87 4 -28 63 85 -23 31 73 -30 -23 0 -41 -29 23 -45 -29 36 -15 -72 84 71 -59 -18 98 9 -56
3245 -56 88 50 -19 11 2 -79 22 0 -74 -13 65 -54 -96 43 48 -51 5 50 0 24 42 -27 31 76 -47 -50 56 -21 -87
3274 -87 6 13 -74 -31 43 -20 -3 71 22 -4 74 63 -49 63 52 -15 -9 48 -62 -42 36 -14 -46 52 18 -47 25 56 -33 25
3304 25 44 -46 5 58 -14 -67 41 11 -80 -22 42 -57 -47 29 -44 -5 42 -11 -16 44 -2 -49 56 51 -52 -19 81 -22 -44
3333 -44 57 -20 -65 37 -5 -54 35 59 -44 -35 95 26 -37 23 28 -48 10 -5 -41 -10 7 -46 28 48 -56 -18 49 -28 -4
3362 -4 53 42 -20 17 69 -54 -7 90 -11 -48 24 2 -60 44 20 -14 -13 72 -7 0 74 -14 3 -6 9 -53 -5 -7 -54 13 33
3393 33 -59 -46 51 -8 -37 56 37 -52 69 66 -31 12 69 -8 -46 44 -4 -54 33 14 -58 13 31 -32 22 30 -10 31 60 3 -13
3424 -13 34 16 -40 0 20 -59 -20 20 -64 -42 25 5 -74 34 14 -37 48 69 -14 5 64 -5 -28 61 41 -42 21 21 -49 -2
3454 -2 13 -40 -6 47 -21 13 50 -3 -3 43 35 -35 5 42 -32 -20 35 -38 -59 34 -43 -39 23 13 -48 16 51 -13 -13 43 -1 23 44
3487 44 33 -43 58 -1 -53 -10 31 -30 -14 52 -21 -50 29 17 -29 32 43 -38 4 53 -6 -25 29 0 -58 15 8 -38 11 19 -39
3518 -39 2 56 -32 -29 67 30 -32 19 39 -31 24 12 -22 17 26 -23 -15 50 1 -15 20 34 -18 26 52 5 -10 35 -25 -24 3 -2 -36
3551 -36 21 1 -50 16 7 -71 -2 44 -34 -42 37 39 -50 32 2 -27 7 10 0 -17 24 -34 -11 43 23 -45 49 12 -18 55 63 -15 27
3584 27 72 -10 -25 63 -10 -61 21 11 -56 -1 21 -36 -8 63 8 -16 59 -2 -18 50 31 -40 12 11 -17 15 10 -47 -14 38 -46
3615 -46 -54 46 63 -50 36 94 -15 27 60 23 -27 58 26 -35 8 8 -26 -34 23 -17 -32 1 -5 8 24 -8 -3 35 3 -42 47
3646 47 44 -25 -10 52 -11 -34 29 13 -69 10 35 -35 20 33 7 -14 32 32 -3 3 26 0 18 16 -24 -14 10 -35 -13 23 -27 -25 24
3679 24 -23 1 70 22 -53 26 90 -30 -20 51 31 -25 -3 4 4 -15 18 -26 24 18 -23 -1 60 17 -13 -3 17 31 -9 -20 -34
3710 -34 21 18 -58 -23 59 -15 -62 27 45 -33 -11 58 7 -5 12 -16 -31 5 -33 -4 3 8 -12 7 -11 -30 14 7 -29 7 33 -2
3742 -2 -22 41 23 -37 14 12 -31 -22 22 -42 -35 51 19 -39 -1 28 -28 -18 18 30 -27 -20 -14 11 4 -41 -32 39 -2 -74 -1 43 -13 -30
3776 -30 19 11 26 21 30 23 54 22 -37 32 58 -18 -18 40 11 -51 -23 12 -23 -12 -12 22 6 25 -9 2 21 0 -33 13 27 -43 0
3809 0 -1 -40 -70 -16 -4 -36 3 18 -12 -1 24 0 30 36 -24 -6 55 4 -41 25 25 -16 -25 19 -4 28 -19 -5 22 33 -30 -11 79
3842 79 6 -63 30 48 0 -32 28 -15 -16 2 -38 -1 14 -38 -38 6 7 -34 -5 37 49 -31 25 25 -5 26 -20 -4 21 -5 -33 10
3874 10 35 -44 -2 50 2 -24 5 26 -10 -15 0 -23 16 13 -31 -2 3 -41 -27 31 -13 -75 47 45 -27 -28 59 36 -9 -2 -5 16 -15
3907 -15 -3 7 45 21 -35 12 63 -46 -51 25 52 2 -14 -10 18 28 -26 -13 28 18 -48 -33 74 18 -69 -20 18 -4 -33 15
3937 15 -7 5 0 0 27 56 -39 -26 33 2 -49 2 51 -14 -45 35 -4 -33 2 14 -4 -1 -9 11 34 46 -20 -23 62 -45 -60 22
3969 22 8 -65 -33 20 -36 -38 3 -16 31 4 -17 7 48 -2 -57 -1 66 -18 -55 21 16 -5 -5 -5 3 19 -33 -10 53 -6 -48 18 62
4002 62 8 -28 18 45 -55 -24 -5 -14 -17 -32 -29 -14 -10 -42 -16 15 -14 -40 28 22 -18 4 42 24 -11 17 4 -10 -9 -42 -9 49 -2
4035 -2 -58 37 46 -34 -25 78 46 -49 19 64 7 -17 -7 10 18 -8 -48 -23 39 -25 -37 16 3 -40 -8 22 4 12 -8 -20 28 -1
4067 -1 -60 -6 50 -1 -33 5 30 -16 -2 43 57 -3 8 20 25 31 -10 0 45 0 -44 15 49 -13 -25 16 -10 -32 21 49 -28 -11
4099 -11 -4 9 25 23 -20 24 21 -52 -30 14 7 -41 -2 57 -3 -34 4 9 31 4 -17 30 50 -13 -34 47 19 -41 -45 24 -4 -40 -8
4132 -8 7 23 -10 -40 -21 45 4 -65 -4 55 -47 -30 0 17 -19 -20 17 7 -36 -4 -19 17 51 -38 -7 43 5 -23 37 32 -15
4163 -15 4 49 33 -21 10 8 9 12 -29 10 -10 -45 -36 55 24 -41 -14 53 8 -32 10 38 4 -26 -5 5 24 -17 -40 39 47 -40 -28
4196 -28 31 50 -8 -9 19 33 22 -10 10 31 -12 -31 -14 5 -9 -34 11 9 -19 -37 24 -9 -25 -7 9 9 8 -17 17 14 -1 -17 -7
4229 -7 6 -37 -26 12 -11 -21 2 60 35 1 39 45 39 1 -1 15 35 -22 -2 30 -16 -32 -13 18 24 -23 -16 13 14 -20 6 21 49 -64
4263 -64 -49 41 41 -48 -33 43 6 -26 -12 27 11 -13 -8 2 12 -38 -4 15 38 1 1 56 32 -26 -30 -20 12 -20 -27 10 20 -10 -17
4296 -17 5 18 -2 -32 9 3 -44 -32 10 18 -24 -5 1 -29 -42 2 30 19 -2 9 6 22 -26 -21 60 12 9 30 21 -9 -13 8 28 -16
4330 -16 5 3 17 36 -29 -29 45 8 -38 -11 42 26 -26 -31 11 -3 -10 -2 -11 7 -52 -18 43 25 -38 -3 27 3 -7 1 46 7 -21 29
4364 29 29 27 -16 12 10 14 -9 12 21 4 -24 -25 20 -6 -30 38 0 14 13 -9 7 20 -16 -21 14 -18 -43 10 17 -6 -24 41 23 -18 -4
4399 -4 12 31 -4 7 -30 43 33 -32 15 63 -2 -13 -8 3 -3 -51 3 29 7 13 1 12 38 -14 1 28 11 -8 -8 22 -14 -27 6
4432 6 -3 -10 19 11 -17 21 10 -12 30 27 -19 4 13 1 -8 9 37 -20 -9 11 31 5 9 -5 14 6 0 4 24 22 -20 11 8 -28 -16 -2 20
4469 20 -30 -47 -25 -29 -16 -39 -7 26 15 -24 -5 34 -6 -24 10 13 2 -7 -2 12 -11 -16 -9 22 2 -14 -25 24 18 -13 55 6 -26 17
4503 17 8 9 -1 2 -35 11 -15 9 -32 12 3 -32 -21 22 -17 -26 29 -3 -11 23 -14 -1 3 13 -22 14 -3 -38 21 -4 9 -2 26 4
4537 4 -7 30 44 17 16 2 -7 13 6 -27 -16 -9 -37 -33 -8 13 -37 -4 9 -4 12 -4 -12 -20 26 5 -35 -1 10 -36 3 -3 -15 17 -9
4572 -9 -26 -10 9 -10 -2 -5 7 -2 24 42 5 2 20 -2 -3 5 -21 -43 -12 13 -26 36 17 -11 5 25 -11 -11 14 11 13 27 37 -1 -2 3
4608 3 -15 18 18 -21 -14 -1 -15 -8 27 15 -25 21 24 11 10 3 -8 -27 -16 -10 -17 2 -30 -21 6 23 -22 -16 7 -28 -20 3 11 -11 7 -11 24
4645 24 -14 13 -27 -5 14 -1 3 18 -6 -9 1 11 11 31 47 4 4 30 -17 9 14 10 -6 -12 31 4 9 11 6 8 40 -21 0 23 8 -2
4681 -2 23 -5 0 -23 -26 -35 -33 4 -27 -29 -11 2 -5 20 18 2 10 6 11 6 9 4 -9 5 8 -13 18 0 -8 4 11 -26 -16 22 -12 -3 0 -6 -9 15 40
4722 40 1 -21 11 12 -19 4 -18 -21 -5 -28 -10 3 13 -4 -12 49 5 33 2 15 -11 -5 -5 -14 6 8 -13 -11 -8 5 11 14 12 -36 -6 -6 9
4759 9 2 10 22 1 -10 -8 -19 -20 -3 15 -20 -16 -8 -16 35 -4 -6 -2 17 9 22 17 6 13 18 8 -17 31 -28 21 12 9 17 -39 -15 -19 20 0 10
4798 10 -1 24 -10 6 0 -13 19 -5 7 -42 15 -1 -3 -1 -1 10 -12 10 -15 15 14 19 19 15 23 3 15 17 -4 24 1 -1 18 15 0 0 -16
4835 -16 -7 18 8 -8 -9 -13 -12 -3 -6 -12 5 -22 -21 -3 -12 -14 -10 21 4 21 15 10 11 7 28 6 27 26 3 1 14 -19 22 1 -11 -1 33 -7 12
4874 12 26 11 1 22 3 -9 0 -9 -29 -8 -17 21 -22 -19 9 -16 -17 -5 -1 -1 8 -18 17 20 28 1 33 7 9 -8 -19 23 -19 27 6 11
4910 11 -24 14 -10 -1 16 7 37 20 14 13 9 -8 -9 -3 -21 13 4 -11 -23 6 -27 -36 5 3 13 -24 9 12 0 21 1 -5 5 -7 13 -16
4946 -16 22 -26 18 -5 7 6 25 -10 -3 5 7 6 31 19 -9 10 8 12 9 6 -19 -10 -11 11 -21 -23 -3 10 13 -5 -35 3 -28 -3 -21 28 12
4983 12 -18 16 34 16 -19 15 -11 26 21 -9 -35 22 19 1 23 20 4 3 -5 12 14 21 3 -22 23 4 9 3 11 -19 -29 -26 14 11 -6 21
5019 21 4 0 -1 19 24 9 9 -2 -2 6 2 9 13 15 27 -8 33 30 19 -4 3 -3 -9 -20 22 22 6 2 -4 -9 -9 21 -15 -24 17 -15 -22 9 -2 12 18
5060 18 7 1 -15 -12 -4 14 -13 -6 1 8 14 -11 -11 -1 4 12 16 2 -1 18 -17 9 14 14 -30 4 -14 -1 4 15 -21 -29 -3 -10 -23 26 6 -4 -1
5099 -1 3 -19 -18 2 -20 -6 24 -30 -32 -17 -6 -21 -3 -15 -20 27 40 15 -7 18 -2 -21 -5 3 -19 -5 15 2 -5 -21 -5 -4 6 -10
5133 -10 -18 17 8 -28 -18 21 -20 19 -7 31 8 7 -18 8 -1 -19 -1 -15 -15 -6 -4 24 46 17 11 5 31 39 25 13 11 -6 10 3 -12 0
5169 0 -11 11 11 -15 0 14 -11 14 -1 -12 -3 1 0 -17 10 18 -16 -11 5 -9 16 -4 10 6 9 -16 -3 24 10 -6 8 16 17 -4 19 3
5205 3 -6 43 -23 12 -32 -7 6 -15 4 13 -5 -22 3 7 9 -3 -15 18 -1 -29 -10 -2 -16 -32 3 19 9 -7 10 8 13 2 -25 25
5239 25 27 -14 17 45 0 -23 4 17 -2 -4 10 -11 -10 3 3 2 -1 -3 4 19 14 -17 -10 -25 -14 -19 -14 -13 -25 -13 5 -29 9 7 13 29 42 -18
5277 -18 2 14 18 -21 12 31 13 28 -1 35 16 -11 -7 -3 -2 -17 -11 40 5 -26 18 20 -1 20 -11 16 -28 -1 -26 -12 -19 -19 -37 -5
5311 -5 -28 -28 5 -16 -12 -3 6 19 -5 -24 13 -13 23 16 -7 -18 14 -14 -7 11 20 -20 -3 -20 -11 -15 10 13 -11 -4 -3 -34 -8 -10 -18 17 -22 -24
5349 -24 5 7 -16 -43 12 -7 -4 -28 -2 0 1 -13 2 24 15 7 5 34 3 -22 5 17 5 -1 11 1 16 -12 -6 -2 20 8 8 19 -6 -35
5385 -35 1 3 5 -1 -5 -1 -23 14 -13 -8 22 -29 -5 -16 -4 7 35 7 2 7 12 30 -3 -17 -12 16 2 14 17 41 17 -13 -5 29 -3 -35
5421 -35 48 15 -1 -9 4 -7 -34 -11 -19 2 20 -21 12 -3 5 11 -23 10 -9 -9 -3 28 -1 -29 9 31 5 0 -2 2 21 -18 1 22 12
5456 12 -4 -1 -3 -22 -22 -3 12 7 23 2 -18 -2 -21 -6 -29 -25 -10 -28 7 5 -7 -30 29 -11 13 11 18 7 -8 -20 17 -6 -5 -13 16
5491 16 15 -33 39 22 -14 10 21 -9 -1 -29 9 -3 11 -32 32 -4 -14 -6 -15 8 -13 -20 -16 0 11 -3 17 3 21 -15 9 -6 3 4
5525 4 -7 17 1 19 1 10 -30 -21 32 34 4 -19 2 5 2 24 7 13 -28 7 -7 -16 -28 13 -15 -3 -23 -1 12 -16 12 -8 2 3 -25
5560 -25 -17 17 15 0 -9 8 12 20 6 11 6 31 5 18 7 27 -19 38 4 27 24 -9 23 -5 25 -1 29 -23 -41 -10 6 -21 -22 -10 4
5595 4 -20 -14 -18 1 -8 -20 20 -11 -35 -3 5 9 17 19 25 17 2 -6 8 -2 -6 -1 7 8 8 18 3 15 3 14 8 16 -7 -18 9 0 -13 -11 -4 -27 -6
5636 -6 -26 2 -2 -26 -23 2 5 -11 -9 -3 21 -4 -9 -1 -4 -11 0 32 0 0 -5 37 13 4 24 17 6 18 21 -3 1 -11 10 3 -38 2 -15 24 -19
5675 -19 -1 -3 1 -5 -14 -3 11 14 -3 2 -3 -12 -8 -9 -6 -26 -14 -29 0 9 -1 21 36 21 19 15 9 -4 12 -4 7 7 -19 12 -10 23 -22 -5
5713 -5 -10 -4 -29 34 25 7 7 -43 3 10 -36 -18 -10 -1 -17 4 -2 -12 14 10 13 -9 1 -2 36 2 15 9 8 0 10 4 -2 -1 6 -20 -9 16 3 4
5753 4 11 -14 -20 -6 6 8 -24 -26 21 -8 -27 -26 11 -14 -21 8 5 -9 -35 -14 0 -3 -23 1 -5 26 -8 34 9 8 -12 11 16 20 22 -8 2
5790 2 1 -16 -9 16 8 -3 -13 -2 2 1 -42 6 -20 12 -8 5 -6 -23 -17 -2 -6 -1 12 13 0 -17 2 -1 1 -21 -1 -14 -6 26 5 16 35
5827 35 -17 15 10 16 10 -7 21 3 13 6 27 6 -9 -4 -23 -18 -24 -4 -12 -13 -30 1 -21 10 -3 11 15 7 -31 -22 3 4 9 -4 15 24 11 0
5865 0 12 -15 17 2 -3 2 7 -5 8 6 0 -21 1 17 23 6 11 6 7 -5 -21 -5 -11 -14 6 15 18 13 10 12 6 17 29 -1 -1 2 14 1 2 25 20
5906 20 13 16 2 22 1 5 18 -4 7 -7 2 -4 -11 9 28 -5 1 -29 2 -10 -23 -27 -30 -12 -30 -21 -21 -32 -4 5 0 -12 1 6 27 -5 7
5943 7 16 -3 6 13 17 17 0 6 0 -18 -14 28 20 1 6 5 -18 2 -4 -12 -25 -24 -13 12 -24 20 -5 -11 15 -25 -34 -8 -5 -9 35 11 18 24 1 2 3 -16
5985 -16 22 14 -15 8 24 5 8 -4 -1 23 22 -3 21 14 10 4 0 6 -12 -18 -17 -14 -22 -1 -7 2 -7 2 -20 -14 15 -14 8 -2 24 -13 2 -31 -8
6024 -8 3 -22 28 27 -18 -1 35 -6 13 26 -1 11 -15 23 16 4 31 2 0 -9 13 -1 -9 -4 -13 -21 -34 -18 -8 -9 -2 -2 1 3 -6 -11 -12 -16 -14 -22
6064 -22 5 10 12 5 10 -3 -13 4 8 42 17 -12 10 32 2 -7 -8 33 -13 -3 -9 -20 -11 -16 -17 -11 -18 -20 -6 1 -9 -18 -10 -15 -3 16 5 -5 -15
6103 -15 -43 -2 -14 0 -24 6 8 -6 -15 18 3 8 0 27 34 33 -9 -6 12 -19 -10 18 -5 1 -12 -6 -17 -8 -19 -15 4 -5 -13 -28 -25 -20 -35 10
6141 10 5 -22 -3 -24 17 -5 -1 -11 1 -26 1 -22 -3 -1 -8 9 27 -3 -6 4 4 20 10 -11 0 16 -11 -5 -17 -8 8 29 18 23 6
6176 6 -6 -32 6 -22 -20 -14 -21 -8 -16 -18 -22 -13 5 3 25 5 -4 17 8 20 3 -9 -17 21 -7 -2 2 20 -16 14 2 1 15 -3 -41 7 0 7 -17
6215 -17 10 -13 2 -3 7 -10 11 15 -18 -17 -18 -8 -44 -16 -6 -6 -11 -14 8 -3 0 -4 53 21 4 -24 19 24 -7 5 5 -10 -13 1 -5 -2 5 -35
6253 -35 3 -19 24 0 17 14 -1 4 16 -8 12 -12 0 19 -14 21 -13 -14 -5 -3 17 22 -4 14 4 26 2 13 13 8 -11 1 21 2
6287 2 27 -12 11 -8 14 -16 -8 2 -2 -10 -5 7 -10 -5 8 -22 1 -11 -3 -17 -27 -12 2 1 0 -7 -11 -26 -22 4 16 11 -11 31 -5 8 -1
6324 -1 45 5 14 19 23 17 15 0 -1 0 18 -17 6 -6 -5 3 -18 12 7 -16 -29 -8 -49 0 -3 -1 -28 -30 2 0 -14 1 15 37 1 9 17 3 14
6363 14 17 26 26 26 -4 6 9 8 -14 -12 21 15 -4 8 5 4 3 3 -8 -7 -18 2 -1 3 -5 -14 -1 -14 -15 -11 -29 -14 3 2 -4 -20 19 8 -8 -16 -6
6404 -6 8 28 -10 9 13 -23 -19 6 16 -5 15 12 19 13 -5 -19 -10 13 -8 -14 -23 -10 -10 -23 5 -29 -16 -14 -3 7 3 10 -2 0 -13 4 1 7
6442 7 -20 8 10 -10 -8 -2 0 -2 -36 15 12 13 -8 0 3 2 15 12 -15 -9 9 3 -2 -19 -1 7 -15 -27 -1 -18 -15 -4 -13 10 3 -2 -18 -21 -4 12 37
6483 37 21 7 7 8 14 10 1 2 11 12 12 -2 18 17 -28 -18 -3 16 -11 6 10 23 -26 -34 -7 -2 -12 -3 -4 -10 -24 -7 -17 -6 3 10 9 -4 4 -11
6523 -11 24 -7 0 -9 11 3 -7 19 11 -20 33 19 10 19 3 -13 9 15 7 -12 6 -6 -40 7 -13 -14 -1 -15 18 10 4 -3 -12 -19 -6 -10 -11 -13 -15
6562 -15 -18 7 21 -15 8 31 -10 -10 4 20 19 -16 24 25 17 1 48 2 -9 17 1 25 6 -31 14 -2 -11 -34 -13 9 -11 -15 4 24
6596 24 6 -6 -3 30 28 -31 -14 7 -13 -9 -11 1 -27 -7 15 -1 27 -12 -13 24 33 6 19 19 -9 13 10 13 9 7 13 -14 -2 4 -21 4 -52
6633 -52 -31 10 -2 -40 -20 20 8 -10 -6 -10 8 -12 0 22 -1 -1 -2 7 4 -15 -1 19 17 9 -3 3 0 3 -4 -6 15 2 19 -5 -7 -14 2 20
6671 20 2 0 -40 -3 -9 -7 -8 -9 -20 8 12 -26 22 2 12 -4 20 22 -4 22 32 8 -19 -10 0 21 12 23 29 16 11 7 10 21 1 10 19 -1
6709 -1 -25 -1 10 -17 8 4 12 -16 -11 6 3 13 3 -23 0 -45 -5 5 -10 5 -32 36 5 16 8 11 11 4 -9 29 14 11 17 20 32 31 -3
6746 -3 -2 19 -2 5 49 11 -4 -15 26 -16 -23 9 -7 -41 -15 -2 -7 3 -52 -21 0 -12 -16 0 -20 25 20 28 27 6 2 4 25 44 18 10
6782 10 37 12 5 18 37 16 10 13 16 1 1 2 27 -4 26 -9 15 -15 -27 -27 -7 -12 -6 -19 1 10 -20 -20 -13 -3 2 4 16 22 -3 28 11 28
6820 28 20 24 32 20 -9 20 19 22 -6 9 8 19 4 -27 7 6 17 -6 14 24 -26 -17 8 -1 27 -28 -9 -1 -19 -29 -1 -21 4 25 1
6855 1 -4 -19 7 38 25 5 1 37 26 14 38 33 20 21 -16 29 9 -12 12 14 21 -32 27 16 0 1 -22 3 -21 -19 3 3 -2 -37 12 2
6891 2 -7 -19 -26 9 32 19 1 11 14 5 -32 7 23 0 -18 -6 3 7 4 23 31 -18 23 43 10 5 -21 -9 15 -18 -17 27 -5 -33 11 -13
6927 -13 -19 -22 -8 -17 -17 -22 11 3 5 -3 -4 34 5 -26 -11 1 -11 17 -10 12 -3 2 20 30 1 -26 7 9 8 5 -1 27 38 -10 37 -19 -21 -23
6965 -23 -5 9 -10 -33 -9 -1 -18 11 3 23 10 -11 -4 6 16 25 6 32 8 -14 -20 6 12 4 10 14 45 -9 26 9 17 -14 25 -5 9
7000 9 1 14 11 3 11 -8 7 16 -16 -21 4 -34 -16 -20 17 -37 1 -5 29 8 12 8 4 -3 6 -23 23 24 17 20 31 16 -15 -7 25 14 -8 48 9
7039 9 25 15 1 18 17 -11 11 11 -15 -18 -10 -19 -21 -6 -3 -13 -35 -35 23 -12 -14 4 12 8 15 1 -4 3 -16 -9 10 19 -9 5 -10 25 -19 1 27
7078 27 31 20 -41 -4 45 -2 3 3 27 -20 -11 -11 0 -13 3 1 -9 -23 -34 6 -10 11 3 31 -4 -17 -21 8 6 -2 8 1 -5 -13 -16 20 3
7115 3 21 10 19 16 -4 -9 -12 -9 16 4 -11 2 3 1 -14 20 6 -2 3 16 -8 -10 -2 10 -14 -13 -9 -1 -3 -7 -10 20 -5 -16 -4 21 21 22 11 -10
7155 -10 8 -1 20 9 7 2 -3 8 26 -9 0 12 -19 -25 -14 19 -2 -1 7 -14 0 -19 4 -17 16 -22 -9 -8 -17 -8 -11 31 8 -17 21 -3
7191 -3 -9 7 25 -15 13 49 24 12 20 0 22 12 23 7 11 2 -8 -14 24 3 -21 -12 3 -7 -15 14 -11 10 -36 -10 -9 -19 -37 -19 -14
7226 -14 7 -1 -14 2 -23 -10 -4 -3 16 10 1 4 18 10 -3 17 29 28 19 25 0 25 -10 -4 7 -16 -7 -3 5 13 -11 -6 -14 11 -20 -2 1 -3 4 20
7266 20 14 2 23 -25 11 -9 5 -14 10 9 26 17 -3 14 13 25 7 -2 -25 0 -7 16 -2 6 32 13 -1 3 -15 22 8 10 -3 -20 -7
7301 -7 -27 -19 -12 -17 -1 -2 4 -8 21 -8 -4 16 -3 14 -11 17 15 37 -15 -11 5 2 -9 -13 9 -4 8 2 8 -1 3 18 -6 -13 -23 -4 -3 -15 -26
7340 -26 10 -10 -26 -9 -21 -32 -25 -13 -1 2 -9 -13 21 14 13 26 22 1 26 23 -1 -4 6 6 11 28 -11 30 -28 -17 -2 13 12 0 6 19
7376 19 3 2 2 -15 -12 0 -26 7 -9 -13 -9 -20 -10 -28 2 -8 9 1 4 6 7 6 -18 8 -12 17 -9 15 4 -21 7 -8 4 1 6 1 4
7413 4 13 5 0 7 16 13 0 -2 -7 5 10 1 -13 -29 -26 7 1 -23 -4 -16 1 21 3 -4 8 1 25 1 3 20 -1 22 40 7 23 18 6 30 0
7452 0 1 9 0 -22 -14 2 -7 -10 -7 -7 11 8 -6 2 -16 1 -2 -7 -16 2 -3 -14 -1 0 -4 10 13 20 26 -14 5 1 -14 5 -10 3 -22 14 19 45 13
7493 13 5 -5 9 7 -2 34 7 6 -15 -16 -10 -11 -18 -12 0 15 12 -9 17 12 8 -5 -13 11 -12 10 7 11 35 9 22 -2 13 -8 28 9 6 5 27
7532 27 8 11 0 4 0 37 24 11 -5 16 18 9 -25 -12 -16 7 -26 -16 13 -10 8 -23 10 3 -1 10 -4 -13 -12 -1 11 10 18 3 33 15
7568 15 -4 5 1 -6 -18 26 20 5 10 17 11 9 7 2 15 -26 21 -9 18 -13 -12 -16 -17 -28 -16 3 -23 -14 -52 -3 -23 17 -1 -7 -18 4 -10 -4
7606 -4 6 0 -14 13 12 -3 8 9 13 22 36 -4 29 39 32 -5 1 1 0 -9 -18 -22 -7 -15 10 -11 -25 -4 2 -12 2 15 8 -9 2 4 -6 -1 -17
7645 -17 19 -3 6 2 37 -3 3 42 9 -9 9 -9 31 -1 24 -14 -5 -1 -11 17 22 8 -7 -8 4 -8 10 -9 -4 -5 -23 -3 -14 8 -17
7680 -17 -12 17 -12 -16 5 15 -21 -5 10 9 3 11 -4 -3 2 4 -7 7 33 3 4 6 -11 -1 7 12 28 0 -4 19 9 -25 15 18 -7 -10 -15 -11 8
7719 8 -8 -25 9 -18 6 -13 -7 -10 -28 12 6 -8 17 22 4 25 18 26 11 15 16 35 9 6 2 -7 -12 -3 10 -13 -21 19 -15 7 -5 -23 7 -9
7757 -9 -18 -6 2 -14 -1 2 -40 3 -33 -3 -19 7 -7 10 -20 -9 7 8 10 10 10 12 17 -1 12 24 10 -7 1 -14 -19 -8 10 -9 20 -9
7793 -9 4 -7 -3 3 -14 -36 -10 -13 -20 7 -7 4 -11 -14 -12 -5 -27 1 -17 17 -19 -25 24 -18 -7 27 17 -19 11 3 -6 -9 10 14 -10 4 7
7830 7 4 1 1 18 3 -4 -7 8 22 4 0 -14 -3 18 -16 -22 -21 -30 -2 -14 11 -4 -2 0 -14 18 9 -14 -8 9 -19 3 -1 -12 0 19 -5 -9
7868 -9 19 9 -2 -5 21 -9 7 8 25 1 11 13 -12 -10 -11 -16 5 -17 -17 13 -4 24 26 -7 -13 2 19 -1 18 2 18 21 -1 5 1 12 7
7905 7 3 -5 -7 26 -4 -5 1 26 17 4 -2 9 -13 -13 -3 27 21 -33 -30 -5 6 -27 -21 -16 -7 -8 -7 0 -2 11 16 10 23 0 7 36 14 11 -9 -13 10 -24
7947 -24 -15 -3 17 -10 5 3 -7 -15 8 6 2 -13 -27 13 -10 20 -23 2 -31 -35 15 20 8 -14 -19 -2 -21 -10 -4 4 -5 -6 21 40 1 -28
7983 -28 7 -33 -14 1 -12 14 -31 -24 13 19 11 -32 7 31 13 11 20 16 3 -4 14 -32 -40 -14 -3 9 -38 -29 -30 21 2 -17 -1 9 -26
8018 -26 -2 13 33 -17 11 3 -23 -2 1 12 9 3 24 2 22 3 8 17 15 -8 -18 -13 -17 -13 -10 -4 13 -13 -14 -11 -6 -5 -2 -10 6 -16 -15 -26 -17 5
8058 5 8 -9 -19 -3 -24 -28 -15 -20 -17 14 15 3 4 9 6 -2 21 29 12 4 3 -23 14 18 -15 2 -2 -30 -53 -1 -5 -44 -26 -17 4 -21 2 -9 -12
8097 -12 -4 -7 5 9 14 -22 -13 -7 -27 -34 -6 13 -1 -1 14 18 -47 13 29 -2 20 -6 26 35 15 10 -12 -6 -15 -31 -6 -13 -40 -25 -10 1 -3 -14
8135 -14 0 6 -3 -24 3 10 -8 -13 26 20 -4 1 26 2 -23 -16 8 26 -3 -1 7 29 32 -13 12 22 15 1 20 24 -10 23 -4 9 -1 -15
8171 -15 -13 5 6 9 8 -3 -30 -6 20 0 -34 -13 16 0 -28 -2 11 -12 -1 24
8191B4
$$ Imaginary data points
##PAGE= N=2
##DATA TABLE= (X++(I..I)), XYDATA
0 0 0 0 0 0 0 0 0 0 0 0 0 0 0 0 0 0 0 0 0 0 0 0 0 0 0 0 7 -8 8 -8 8 -8 8 -8 9 -16 16 -16 16 -22 24 -24 27 -32 33 -38
46 -38 40 -46 49 -55 62 -65 72 -80 88 -101 111 -126 142 -160 183 -215 255 -310 393 -521 739 -1203
68 -1203 2510 -13264 -43920 21640 33579 -26623 -17159 26886 5543 -15714 3991 5847 -4634
81 -4634 3568 689 -8727 1203 5730 -3972 -4260 -1706 1331 7931 -4009 -14093 12290 17824 -19854
96 -19854 -12237 28667 4363 -28677 7936 23162 -17267 -12235 19446 -2556 -17611 11674 7617
109 7617 -18187 868 16941 -7262 -11631 9791 7927 -5138 -4288 1331 7344 3306 -11720 -3623
123 -3623 15932 -682 -18224 5016 13738 -10194 -7271 9530 -1691 -4722 8378 -3187 -9546
136 -9546 12975 7597 -18181 -856 20024 -4992 -16875 8029 10759 -7942 -6336 3194 3336
149 3336 1552 -4621 -5244 7938 6081 -10558 -2788 12002 -878 -9030 4531 3965 -5176 1718
163 1718 2199 -6506 1977 6957 -7231 -5050 9728 850 -8867 3500 5868 -4660 -497 4066
177 4066 -3151 -680 4781 -3059 -4117 4642 898 -4921 873 1688 -1939 1774 198 -4402 3640
192 3640 5821 -6522 -3520 9590 1349 -9020 1662 6787 -3193 -4047 1537 273 167 162 -4028
207 -4028 -154 6058 -1614 -6397 4050 6148 -3984 -3267 4246 2493 -1662 -1594 -573 2254 1626 -4806
223 -4806 -2747 5405 379 -7162 763 5861 -2636 -3691 3800 2036 -2162 1120 1719 -917 1003
238 1003 1096 -1952 -45 1661 -1861 -1721 1262 -690 -2013 831 377 -1543 541 1407 -413 324 1185
255 1185 183 993 911 -1378 270 2481 -1677 -3272 2158 1800 -4113 -2041 3258 388 -3393 -182
271 -182 2763 606 -1406 -189 2071 1763 -1164 -1253 2039 1586 -2208 -1477 1582 358 -2055 -1058 447
288 447 313 -504 -1102 102 1803 341 -1558 830 2620 -414 -1692 1342 1749 -1338 -1506 961 742
305 742 -1482 -1417 712 804 -1299 -1213 1346 1127 -1346 -481 2003 781 -1294 75 1537 197 -1047
322 -1047 -335 652 237 -1122 -1051 725 813 -1313 -1038 1467 1037 -1313 -493 1651 764 -1016 -475 1003
340 1003 784 -858 -1164 699 1086 -1245 -1487 1136 1049 -1473 -859 1494 721 -983 -181 997 584 -388
358 -388 -624 338 855 -614 -1407 518 1021 -1268 -1108 1304 633 -1304 -13 1374 95 -552 377 600
376 600 177 -144 -472 241 525 -945 -1076 843 239 -1720 -230 1443 -386 -1063 963 1011 -368 126
394 126 578 238 553 -18 -1009 530 988 -1689 -1443 1600 180 -2520 -107 1847 -516 -1248 766
411 766 1094 345 3 -218 956 1564 -1019 -1535 1811 927 -2696 -812 1919 -874 -2056 600 382
428 382 -818 487 114 -704 1535 1234 -1679 413 2791 -783 -1843 1760 815 -2082 -195 705 -1367
445 -1367 -470 492 -1332 -262 1499 -848 -942 2101 510 -1421 1569 1418 -1635 563 2015 -1832
461 -1832 -1210 2203 -679 -2651 994 674 -2054 112 828 -1337 752 1662 -1853 -55 3536 -742
477 -742 -2645 2771 1890 -3027 -248 2221 -1379 -1108 1067 -1445 -819 2194 -1261 -2632 2806 1779
493 1779 -3365 163 3552 -811 -1627 1637 302 -515 992 -1224 -1288 2506 -291 -3815 1552 2877
509 2877 -3283 -1419 3586 -683 -2389 2640 600 -2654 2111 1915 -3462 175 3669 -2176 -2666 2976
525 2976 486 -2865 934 1064 -1670 833 1011 -2014 808 2382 -2108 -912 2895 -776 -1978 2202
541 2202 -182 -2637 2283 1079 -4113 986 4106 -3408 -2713 4867 631 -4336 1770 2935 -2534
556 -2534 -278 2174 -1678 -490 2299 -1908 -2014 2938 41 -3349 1287 1934 -1982 77 1508 -1284
572 -1284 767 2072 -2422 -557 4024 -1280 -3893 3044 2044 -4379 -208 3192 -2340 -1684 2762
587 2762 -1034 -2054 3068 417 -3126 2117 2693 -2792 -278 3047 -1288 -1462 1972 -893 -1811 1993
603 1993 -523 -3076 1817 1646 -3295 -9 3122 -1497 -1216 2830 -190 -1526 2562 396 -2768 1864
619 1864 1991 -3408 -663 2987 -1736 -2490 2031 -14 -2175 1410 576 -2024 1668 1945 -2457 226
635 226 3395 -1278 -1945 2599 380 -2457 950 696 -2282 495 1167 -2529 -323 2528 -1462 -1736
651 -1736 2683 602 -2102 1452 1566 -1571 639 1581 -1744 -268 2074 -1526 -1883 2058 -79 -2685
667 -2685 941 1363 -1972 47 1822 -1148 -465 2187 -436 -1321 1944 603 -1931 711 1267 -1666
683 -1666 -410 1139 -1194 -762 1298 -733 -1232 1576 232 -1700 1133 1438 -1484 34 1819 -873
699 -873 -805 1574 -302 -1528 1082 457 -1785 287 1169 -1234 -554 1304 -326 -737 1009 127 -651
716 -651 812 263 -960 597 638 -1263 -66 1077 -946 -825 1253 -140 -1245 938 769 -1218 266
733 266 1343 -762 -608 1245 16 -1085 484 463 -915 -185 442 -398 -229 236 -213 59 410 -202
751 -202 62 814 -162 -428 821 221 -955 266 652 -1027 -529 838 -426 -1080 636 450 -960 85
769 85 1020 -233 -365 879 455 -394 196 426 -190 -211 -67 -201 -184 -289 -416 -50 -44 -380 6 410 -93
790 -93 -14 686 299 -228 489 611 -352 -164 521 -224 -725 5 22 -685 -402 110 -185 -279 132 195 96 264
812 264 317 278 322 296 141 112 47 -138 -147 -198 -343 -272 -186 -350 -257 17 -43 -117 257 304 100 267 471 236 109
837 109 220 94 -136 -83 -121 -310 -250 -210 -303 -264 -95 -81 -84 101 186 161 179 282 283 152 73 155 142 -132 -250 9
863 9 -110 -472 -208 114 -222 -340 189 214 -170 125 379 137 56 211 149 14 79 -40 -129 -46 -144 -276 -69
886 -69 -93 -208 -8 89 -162 133 303 -128 35 524 12 -378 346 304 -521 -204 433 -236 -552 244 188 -351
908 -351 -36 264 -5 47 124 -17 208 207 -299 37 396 -321 -448 336 -25 -648 141 286 -480 18 527 -323
930 -323 -143 777 -13 -551 689 498 -811 -44 779 -445 -724 370 68 -529 -29 33 -151 289 9
949 9 -354 595 576 -572 106 995 -280 -614 643 56 -814 165 143 -903 -2 504 -830 -304 1012 -235
969 -235 -751 988 619 -739 409 879 -537 -121 733 -435 -595 457 -305 -820 360 -59 -854 370
987 370 435 -843 339 1173 -635 -376 1481 177 -962 730 702 -887 -37 349 -854 -141 489 -1126
1005 -1126 -573 1286 -368 -1450 1059 1180 -1112 -64 1374 -68 -293 679 -247 -206 830 -620 -1194
1022 -1194 1008 384 -1864 -144 1327 -762 -946 915 175 -390 720 34 -431 1214 397 -1357 531
1039 531 1354 -1275 -865 1301 -388 -1334 732 167 -1266 555 776 -1207 50 1502 -551 -671 1266
1056 1266 154 -836 722 221 -987 571 549 -1455 -172 1257 -840 -1015 944 195 -693 546 68
1073 68 -512 1124 331 -1651 718 1929 -1541 -1515 1998 570 -2102 75 1256 -641 -452 341 -437
1090 -437 361 911 -1071 -614 1822 167 -1785 529 1335 -834 -632 462 -144 115 224 -1097 35
1107 35 1614 -733 -1549 1613 1115 -1770 -30 1750 -690 -899 1094 -206 -1072 828 240 -1427 300
1124 300 987 -891 -444 895 -64 -228 623 -255 -207 1124 -136 -1217 796 918 -1237 -488 859 -382
1142 -382 -555 362 -591 -330 1262 -366 -1561 1372 1678 -1668 -777 2172 462 -1612 76 997 -97
1159 -97 -481 -595 -227 838 -186 -1657 345 1596 -822 -1293 1226 955 -762 -17 559 43 449 43
1177 43 -973 378 1050 -1222 -1227 1232 333 -1626 -66 1039 -441 -436 561 101 37 619 -60 -164 691
1196 691 153 -576 307 183 -714 106 340 -1032 -366 952 -438 -1116 762 869 -749 -254 834 307
1214 307 -61 85 -174 400 630 -797 -797 1035 323 -1527 -378 1142 -92 -991 -30 597 338 -128 -501
1233 -501 414 1217 -310 -1137 831 1260 -1015 -1041 959 527 -991 -511 380 220 -187 -488 -114 756 248
1252 248 -833 105 1132 -181 -802 537 605 -597 -311 378 -118 -331 49 -124 -115 124 -148 -128 397 8
1272 8 -318 400 379 -481 -57 625 -123 -547 203 311 -292 -275 -18 135 157 -279 -389 531 552 -722 -362 1033
1294 1033 305 -993 -112 916 -62 -842 -123 525 96 -602 -434 539 520 -659 -484 941 592 -781
1312 -781 -256 910 250 -640 -158 449 109 -409 -414 147 416 -365 -647 416 635 -473 -410 712 473 -449
1332 -449 -105 520 239 -285 -198 170 220 -388 -568 197 308 -629 -496 582 240 -648 11 777 100 -372
1352 -372 213 536 131 -308 -142 395 157 -664 -401 524 42 -915 -160 685 -81 -632 201 606 122 -214
1372 -214 47 521 379 -386 -372 589 309 -863 -422 669 -77 -932 -189 516 -33 -514 -80 482 424 -241
1392 -241 -245 703 594 -591 -290 844 182 -893 -114 507 -246 -651 -56 182 0 -260 -206 346 473 -416
1412 -416 -203 837 340 -704 122 797 -261 -652 226 301 -333 -380 -106 111 139 -421 -328 633 332 -760
1432 -760 -21 1023 -21 -763 350 681 -268 -413 37 222 67 -427 -520 460 454 -875 -437 1081 237
1451 237 -1033 176 958 -197 -513 251 314 -11 -171 -317 146 430 -488 -620 656 360 -877 -40 823
1470 823 -189 -493 434 263 -293 98 82 -192 201 -44 -462 266 348 -693 -157 798 -216 -755 591
1489 591 587 -617 -163 604 41 -218 -32 -129 242 215 -785 -315 978 -148 -1291 385 1144 -702 -787
1508 -787 778 571 -375 -170 164 363 335 -607 -517 900 309 -1362 -205 1177 -332 -1095 376 563
1526 563 -361 -72 139 62 507 146 -620 330 912 -590 -709 800 228 -968 -42 416 -475 -264 228
1545 228 -259 -95 386 -141 -105 552 -3 -265 600 151 -688 379 668 -868 -509 891 -138 -1099 170
1564 170 520 -369 -261 129 23 448 199 -618 330 1155 -454 -914 905 758 -962 -491 553 44 -405
1583 -405 -376 -260 398 362 -936 -380 1338 205 -1279 344 1351 -348 -766 486 418 -226 -195 -270 -50
1602 -50 437 -365 -853 473 611 -830 -309 837 6 -456 424 272 -249 331 178 -472 176 418 -513
1621 -513 -302 401 -265 -376 345 -143 -478 508 313 -733 107 858 -260 -536 455 332 -253 -93 -110 -8
1641 -8 400 -275 -799 477 743 -851 -610 983 402 -826 -68 626 132 -158 -173 -78 537 116 -893 -50
1661 -50 990 -261 -1047 411 792 -487 -445 395 266 -36 -53 -191 222 462 -419 -518 615 260 -776
1680 -776 -132 558 -243 -365 280 -3 -161 273 28 -233 337 295 -329 60 321 -233 -117 251 -234 -351
1700 -351 361 -22 -582 135 429 -291 -267 378 200 -1 68 -32 171 409 -264 -471 488 343 -775 -374
1720 -374 642 -43 -689 -17 360 -17 -130 -47 117 451 62 -414 250 678 -257 -524 408 295 -483 -271
1740 -271 127 -21 -139 -189 -227 231 241 -397 -77 647 124 -419 276 501 -189 -180 289 -28 -234 25 -87 -236
1762 -236 14 -92 -251 75 131 -210 66 321 -47 -13 382 88 -189 196 206 -179 -63 63 -130 -85 -83 -275
1784 -275 -41 208 -260 -276 379 219 -365 78 523 -8 -241 200 191 -96 -44 -106 -63 134 -155 -386 116 234
1806 234 -308 -229 350 173 -191 36 236 104 2 -61 9 244 2 -331 66 288 -263 -322 255 85 -327
1827 -327 61 245 -58 -62 161 -12 9 188 -54 -142 163 24 -255 0 147 -195 -147 138 4 -78 76 32
1849 32 28 119 -23 -11 242 -14 -216 157 145 -326 -129 285 -113 -308 159 179 -191 -6 165 -22 40 122 -53
1872 -53 47 167 -111 -179 169 14 -271 -10 92 -119 -94 30 -43 79 110 -136 60 341 -45 -216 283 207
1894 207 -270 -44 249 -127 -242 81 -32 -197 -4 -12 -117 125 111 -99 154 248 -74 38 252 -16 -100 152
1916 152 -20 -209 26 -33 -294 -17 88 -256 -69 222 -142 -143 324 138 -168 212 298 -129 -29 215 -87
1937 -87 -140 58 -166 -195 90 -128 -287 129 102 -243 54 328 -81 -21 306 60 -60 217 26 -169 163 70
1959 70 -338 -26 141 -290 -211 201 -89 -218 187 93 -163 212 213 -142 131 291 -137 -80 264 -110 -236 137
1981 137 -45 -344 64 121 -303 -22 272 -148 -74 293 14 -140 248 80 -227 173 152 -318 -25 267 -260
2002 -260 -247 218 -44 -289 133 109 -189 111 193 -188 83 301 -148 -125 324 -35 -291 213 62 -310 108
2023 108 175 -313 11 320 -249 -190 425 41 -340 199 262 -322 -24 259 -140 -165 146 -109 -170 174 -45 -196
2045 -196 184 58 -212 158 161 -238 87 325 -281 -157 400 -88 -471 283 214 -485 -28 402 -213 -281 401
2066 401 108 -282 225 268 -174 43 233 -72 -61 84 -113 -48 82 -226 -75 177 -193 -305 356 76 -432
2087 -432 233 464 -335 -99 572 -69 -421 356 206 -515 -38 332 -308 -307 245 -34 -303 107 116 -106 103
2108 103 102 11 175 75 -136 199 192 -310 -29 343 -289 -363 347 -15 -563 112 353 -387 -144 503 -71 -314
2130 -314 371 263 -289 94 328 -184 -135 152 -72 -182 16 -109 -114 54 -147 -129 235 11 -228 268 295 -263
2152 -263 40 476 -137 -248 379 67 -409 87 240 -349 -137 327 -149 -275 229 142 -204 96 166 -59 71
2173 71 97 -91 106 114 -214 -45 196 -167 -235 202 -42 -300 161 185 -272 52 392 -160 -198 439 123 -327
2195 -327 163 290 -237 -119 206 -93 -128 98 -74 -82 157 -48 -159 156 66 -145 112 141 -186 45 227 -198
2217 -198 -113 286 -74 -360 165 207 -340 -74 292 -70 -174 207 40 -124 169 65 -175 76 157 -168 -58
2238 -58 109 -102 -59 80 -124 -75 186 -68 -206 276 172 -322 14 354 -135 -239 219 50 -261 17 32
2259 32 -160 33 85 -198 -46 179 -62 -132 162 97 -51 111 53 -69 141 45 -251 35 177 -242 -204 231
2281 231 -49 -298 112 172 -161 -1 241 -31 -44 246 43 -102 121 100 -131 -44 -21 -134 -8 -43 -204 -6
2303 -6 120 -188 -100 250 43 -170 156 213 -100 55 156 -118 -20 162 -128 -201 135 20 -324 -17 148 -110
2325 -110 -108 116 35 37 77 -6 81 216 -25 -155 173 79 -269 -40 151 -163 -211 44 -44 -117 57 -26 -63 153 113
2350 113 -140 69 219 -75 -70 169 26 -138 49 15 -154 -2 35 -122 1 75 -65 -33 117 -30 -83 170
2372 170 48 -125 66 134 -123 -82 123 -55 -128 6 -36 -80 31 -72 -114 133 71 -170 77 238 -88 -119 149
2395 149 75 -150 -18 31 -44 15 0 -141 36 125 -155 -72 219 39 -179 83 150 -73 -47 64 -39 -17 16 -117
2419 -117 -23 116 -102 -145 141 79 -186 24 193 -52 -59 141 9 -54 67 -10 -59 75 -40 -125 85 56 -180
2442 -180 -22 173 -72 -116 200 106 -104 27 132 -13 16 12 -79 40 51 -180 -127 161 -102 -264 95 161 -149
2465 -149 -94 183 58 -60 49 -2 64 119 -98 -129 192 27 -254 -16 164 -127 -170 87 39 -84 42 36 30 144
2489 144 33 -104 136 155 -187 -74 212 -89 -231 61 49 -206 -85 72 -96 -49 61 -12 66 130 -47 1
2511 1 215 -7 -169 132 142 -234 -86 166 -48 -187 18 22 -32 36 -78 -74 219 109 -203 93 337 -109 -193
2534 -193 179 175 -201 -121 69 -14 -47 -131 -122 118 71 -272 -69 288 -19 -263 173 223 -112 -56 106 21 -19 9 -91
2559 -91 -49 84 -120 -166 169 45 -185 38 208 -85 -81 190 5 -93 111 63 -54 59 12 -106 59 34 -178
2582 -178 15 189 -154 -202 254 91 -253 -12 240 -19 -135 8 70 80 -30 -188 21 223 -151 -279 232
2603 232 241 -253 -114 286 72 -150 31 73 75 83 -140 -113 212 72 -338 -38 286 -114 -311 103 172 -72 -62
2626 -62 66 66 65 -12 -98 100 115 -193 -84 198 -69 -212 95 66 -194 11 184 -105 -48 178 42 -58 99
2649 99 53 -54 91 -16 -124 110 85 -250 -83 200 -99 -248 36 122 -70 -45 -8 75 171 -14 -190 178 297
2672 297 -241 -254 282 146 -348 -134 200 -7 -231 -87 52 105 27 -187 46 294 -28 -238 196 308 -151
2693 -151 -140 159 51 -127 -32 -35 -43 55 -136 -179 161 61 -221 14 244 -65 -126 157 83 -110 64 80 -86 -24
2717 -24 44 -80 -44 -15 -126 -2 112 -133 -106 236 72 -211 56 265 -89 -158 116 120 -68 -85 -30 47 104 -140
2741 -140 -168 171 132 -301 -125 282 59 -207 15 182 43 -61 -71 54 172 -73 -268 99 232 -220 -238
2762 -238 205 161 -212 -86 193 46 -29 -11 44 88 27 -143 -37 174 -31 -190 74 91 -159 -56 109 -39
2784 -39 -55 73 53 -49 41 0 -52 89 -19 -100 86 74 -201 -72 159 -49 -204 29 136 -123 -65 49 63
2807 63 22 -9 -50 120 152 -168 -95 214 36 -263 -28 205 -74 -176 36 96 3 -8 -60 97 198 -70 -145 195
2831 195 156 -214 -115 186 23 -210 -33 39 -28 -64 -40 15 119 -12 -138 122 183 -86 -90 167 77 -162 -4 104
2855 104 -62 -73 -1 2 -50 -27 -68 35 92 -84 -49 155 88 -123 56 183 -50 -136 103 25 -94 -48 -27 -33 -19 -108
2881 -108 -112 136 54 -183 -44 238 20 -159 50 189 -17 -78 41 43 13 -88 -102 51 64 -179 -133 167 25
2904 25 -165 4 179 -14 -87 58 74 41 -7 -60 34 108 -93 -158 103 48 -202 -66 133 -41 -130 40 90 -49
2928 -49 -3 68 28 66 5 -80 71 49 -119 -16 140 -9 -150 62 87 -85 -41 84 21 -7 5 0 101 53 -91
2953 -91 -63 134 -10 -182 18 122 -101 -151 94 52 -78 -39 0 43 66 -53 -57 118 79 -133 -27 144 -28 -170
2977 -170 23 61 -27 -58 -21 38 61 -20 -65 82 99 -94 -52 150 6 -149 45 93 -104 -65 51 -29 -56 25 -7
3002 -7 -17 36 -3 -39 92 35 -97 28 107 -53 -54 77 2 -88 -13 24 -9 -5 -39 -82 90 35 -122 34 189 -9 -131
3029 -131 100 153 -78 -79 48 32 -63 -52 -41 36 13 -93 -62 124 -13 -148 64 137 -30 -31 64 8 -17 15 -17 -34
3055 -34 24 -38 -103 40 40 -94 -41 83 -10 -99 77 60 -29 47 71 -10 28 8 -42 1 28 -89 -62 64 -71 -139 38
3082 38 66 -159 -43 135 -4 -73 20 44 46 13 -40 36 80 -25 -131 22 72 -144 -77 86 21 -91 1 34 27 67
3108 67 -6 -49 111 96 -103 -43 141 6 -144 11 77 -45 -63 2 -8 -37 2 -39 33 55 -79 -11 103 11 -61 78
3134 78 52 -83 20 55 -77 -79 102 -47 -89 42 35 -79 -23 99 -29 -18 105 -12 -70 61 32 -104 -14 52 -13
3159 -13 -41 -22 -15 54 -13 -89 28 98 -89 -86 138 64 -134 -13 92 -39 -54 27 -17 -32 11 -41 -48 79 26 -77 42
3186 42 122 2 -76 36 40 -2 -18 -13 10 42 -27 -86 47 50 -76 -1 91 -12 -30 93 43 -70 38 45 -78 -23 56 -38
3214 -38 -87 12 -37 -91 -1 -19 -61 44 41 -36 -8 78 4 -16 86 39 2 25 -12 -46 17 -41 -85 -13 38 -94 -60 72 -11
3243 -11 -79 48 71 -39 21 75 3 2 19 -72 -7 61 -58 -90 12 16 -62 -59 37 -26 10 48 6 11 64 -8 -11 85 27 -39 22
3274 22 67 -59 -47 31 -27 -51 24 -20 -77 30 19 -52 5 43 -34 9 82 -3 -33 31 -3 -68 40 12 -59 -34 22 -66 -14
3303 -14 24 -33 -25 52 12 -21 19 57 -43 18 94 -24 -34 34 -6 -24 -10 -5 -22 49 20 -36 -24 49 -52 -17 77 9 -62 8
3333 8 27 -75 -8 29 -66 -25 29 -46 -31 65 9 -56 52 41 -15 -11 23 -13 18 22 -43 2 40 -33 -54 45 1 -55 44 51 -29
3364 -29 -4 56 -30 -25 59 2 -53 39 31 -81 -48 8 -28 -36 54 -38 -74 30 -30 3 -2 37 -27 13 20 -38 3 55 -31 -56 32 -19
3396 -19 -63 19 -6 -79 -1 36 -46 -9 43 -6 -14 44 17 -43 11 13 -53 -42 -2 -62 -52 -20 -33 -42 7 -26 -25 29 14 -21 19 55
3428 55 -11 2 23 15 -31 50 23 -57 -2 -2 -49 2 45 -41 -7 63 20 -43 51 51 5 22 59 -31 -16 35 -47 -40 1 -30 -88 21
3460 21 2 -58 10 23 -61 15 36 -27 -32 61 30 -37 31 31 -55 13 11 -104 -8 26 -51 -46 29 -16 -35 33 21 -17 45 48 -3 20
3492 20 34 -31 -26 26 -20 -81 20 -15 -115 -21 -20 -55 -7 49 -5 -32 28 8 -21 24 -1 -52 21 36 -47 -7 24 -28 -40 37
3522 37 8 -16 25 38 -27 15 35 -41 4 19 -19 6 33 4 -74 -1 17 -53 -4 16 -48 5 19 -14 -34 53 6 -65 19 27 -39
3553 -39 -6 30 -36 -50 28 -24 -32 44 14 -33 12 28 -19 -15 24 1 -2 32 14 -4 22 -4 -36 8 19 -43 -11 26 -29 -33 63 -15
3585 -15 -26 48 16 -55 52 50 -45 -8 42 -30 -36 14 -14 -35 -3 19 -9 25 1 -13 30 25 -11 22 60 9 0 20 -20 -57 24 1
3617 1 -49 -14 26 -34 -27 57 25 -9 37 37 -45 -14 74 -21 -30 42 8 -47 -12 30 -20 -7 -28 -33 25 28 -33 40 35 -11 2 90 20 -39
3651 -39 42 29 -47 -29 19 -48 -41 50 -7 -59 5 5 -50 15 17 -29 -6 3 -15 30 39 -17 -16 11 2 -44 31 1 -49 -8 40 -64 8
3684 8 72 -24 -46 55 39 -19 -8 51 -15 -12 9 -4 8 6 -40 -43 19 11 -17 -13 44 -21 1 19 -22 12 29 -52 -29 62 -23 -77 10
3717 10 46 -42 -34 57 1 -24 41 19 7 33 13 -17 21 24 -8 2 3 -16 -12 38 -23 -8 24 31 -31 18 49 -18 -9 21 3 -11 14
3750 14 -22 -28 24 -1 -43 -22 16 -37 -35 37 21 -19 18 1 21 55 5 9 31 28 -17 -9 43 -16 -63 8 25 -34 19 -17 -11 16 18 -16
3784 -16 5 63 -6 -36 30 43 -42 -32 26 -27 -31 -37 -40 -5 -1 -17 -33 23 16 -40 19 34 -11 35 64 -22 6 19 19 -25 -11 -8 -38 -1
3818 -1 -16 -1 -11 10 -19 -24 54 18 -18 24 41 -19 0 16 22 -2 -36 -48 -30 4 -49 -37 53 9 -75 4 66 -5 -35 21 42 22
3850 22 1 12 16 25 -10 -46 35 43 -68 -32 46 -1 -43 -12 8 4 26 6 1 19 -22 -33 -3 24 -27 -25 31 -3 -98 10 1 -35 3
3883 3 8 -23 -34 0 2 12 5 11 -29 20 8 -46 32 16 -30 -40 36 40 -32 -42 25 4 4 1 -10 50 14 -66 -14 31 -5 -88 19 61
3917 61 -34 -57 7 27 -5 -9 -20 32 27 6 -38 59 32 -51 -20 45 -22 -41 26 -8 7 -22 4 6 29 24 -14 23 37 -29 -5 9
3949 9 3 3 20 19 -46 -11 -10 -32 2 -13 -3 3 8 -26 -6 27 -36 -46 58 36 -22 -30 35 10 -34 -12 -11 -1 14 -28 -2 41 -20 -42
3983 -42 24 61 -23 -44 60 41 -8 -20 6 -2 -22 -59 -37 13 -8 -70 -33 67 -25 -68 32 32 -7 -10 -1 -5 -4 -19 -4 33 4 -46
4015 -46 -12 36 -20 -58 -3 20 -9 -10 50 44 -7 25 37 32 17 -13 9 25 9 -47 -6 14 -62 -41 58 1 -38 -18 20 13 -17 -19 24
4048 24 19 -17 -35 -6 42 -52 -44 13 29 -49 -17 33 1 -23 -34 -10 44 29 -48 -14 47 24 -57 5 67 -40 -51 24 2 -48 -1
4079 -1 2 -3 29 -21 -2 14 19 -15 4 27 -21 -36 21 1 -33 -20 32 22 -18 -18 -9 23 41 -32 16 43 -7 -19 41 18 -69 -38 34
4112 34 28 -46 0 32 8 -6 -9 20 23 -7 -34 21 37 -49 -41 72 21 -13 -35 -4 0 -35 -38 -17 0 -5 -58 5 43 10 -66 23 48
4145 48 -10 -1 22 -1 -2 21 -7 3 -13 -40 -39 6 -10 -43 0 22 -21 1 37 -2 -14 8 23 10 -22 4 6 10 -64 -34 12 34 -59
4178 -59 -10 32 -2 -56 6 33 13 -8 27 19 53 -11 -36 40 26 -33 -26 12 41 -51 -20 20 22 -35 -11 27 17 3 -38 11 71 -6
4210 -6 -64 36 42 -32 -36 14 6 -18 5 -1 2 11 -20 -7 31 27 -29 1 54 -4 -14 58 12 -20 -6 28 -9 1 -1 5 -21 14 -4 6 27
4245 27 -20 -16 44 44 -47 10 34 -9 -55 -19 -2 15 1 9 22 37 -16 -54 34 29 -35 -47 63 10 -49 0 44 35 -36 11 -10 -1 6
4278 6 -36 20 11 -21 -20 18 32 9 -33 -1 0 -6 8 -30 -16 1 -32 -45 -4 -39 -24 -16 26 -33 -9 19 9 -36 13 20 -9 -33 -9 32
4312 32 -2 -20 -11 13 17 -31 -18 38 30 -20 -9 62 -19 -2 36 14 -33 -20 -7 -4 -6 -45 -48 -3 -2 -46 -28 17 27 -46 17 26 23 -14 24
4347 24 -1 20 15 -20 19 20 -47 -26 26 15 -18 -15 2 -2 6 8 11 13 -8 -2 7 17 -2 -12 -15 1 -43 -15 6 -24 -37 -13 15 -23 -17 5
4383 5 30 -6 -2 -5 28 22 -6 9 33 -4 -35 17 30 -41 -33 11 16 -1 5 -12 29 31 -2 -18 47 5 -48 -6 56 -9 -62 0 -14 1
4417 1 -35 -30 2 12 -25 -28 17 9 -7 -20 36 29 -26 17 -18 -16 14 21 -14 31 8 2 28 19 -2 -4 48 27 -25 -6 41 -26 -27 16 21 -29
4453 -29 -14 -24 12 0 -12 -4 12 -1 -38 -4 16 -11 -14 11 -19 -7 -22 -32 7 -10 -4 -32 20 21 -13 8 48 15 -13 35 23 12
4485 12 -10 -1 10 23 -9 -11 28 -17 -49 2 10 -19 -21 -31 -18 -22 -1 5 -20 16 0 20 -13 1 8 -21 -3 36 -44 -7 -7 -19 -3 22
4519 22 6 -3 15 37 18 23 7 -42 18 -6 2 -31 10 -11 -28 -25 17 -28 -42 9 -10 -5 -31 -10 5 8 -14 -2 33 -16 -29 0 14
4552 14 -25 -23 -25 -8 -6 1 -11 -11 18 19 -13 10 40 -8 14 13 1 -8 -15 3 -8 4 16 -18 5 -13 -6 30 14 -24 -4 4 -32 -5 -7 12
4588 12 -20 31 35 -18 2 25 -30 -18 12 -16 3 -2 -15 -28 12 31 19 3 11 18 3 -9 6 -21 -1 -24 -24 8 -17 -11 1 -6 6 -8
4622 -8 20 -3 -23 8 15 37 5 10 -6 11 -13 1 -1 -11 -14 0 6 -11 5 5 6 11 6 28 30 -7 20 0 -19 8 5 -9 8 16 -37 -17 -13
4659 -13 5 -18 5 4 -29 -3 -9 -11 -14 12 -9 -12 2 -17 -6 1 -9 21 -3 -7 -6 0 0 -11 1 -1 12 -5 22 -6 -23 19 17 -3 -11 18 20
4696 20 -17 -4 10 4 18 17 -8 -3 12 -23 -15 7 16 -16 -30 -20 -29 -9 10 -12 -11 4 0 -5 3 2 -5 -17 2 -6 21 5 7 -3 17 30 -16
4733 -16 18 17 1 16 0 -20 6 11 1 8 -11 1 14 9 20 -13 23 0 -12 1 -19 -39 10 8 -34 -13 18 -8 8 -1 29 4 22
4766 22 8 23 5 12 24 -16 -15 0 -19 25 -13 3 -14 2 -35 19 12 -13 -22 -11 -9 -24 -9 9 -20 -30 -27 -16 -28 10 7 -17 -25 5
4800 5 -23 -4 -11 -22 -8 18 -15 -1 17 8 -7 -16 -3 -16 -18 -20 -6 -4 28 -12 -7 9 8 -15 23 -6 -24 -20 6 -7 -26 -4 -10 -23 -18 -25 -15
4837 -15 -12 -7 13 7 -12 -18 15 -2 13 16 2 -9 -20 33 21 -24 12 -7 4 -2 6 -2 8 2 11 2 15 -3 -18 1 7 -42 -8 10 -18 -13 -21
4874 -21 11 -12 -10 -4 -27 2 4 12 3 13 7 -5 -20 5 19 -3 6 -4 6 22 -33 22 20 19 -18 6 8 -6 -17 -11 7 -12 -7 -35 -30 -11 -18
4911 -18 -25 23 -18 -20 11 -25 -5 -18 7 0 5 -11 -17 -23 -8 -15 -13 19 -16 -34 -26 9 -3 -14 12 5 -4 18 16 -5 -15 -10 -2 2 -15 -23 4 5 24
4950 24 -34 -12 -1 -29 -11 -9 -40 -16 -15 -9 17 -13 7 -10 0 36 -15 1 24 -22 1 -4 -11 -17 -1 -25 -11 6 -3 -19 13 11 34 14
4984 14 2 7 4 8 -4 -1 7 4 -14 -25 -16 -7 -9 -3 -38 -16 0 0 -24 -2 13 -6 -3 15 -13 -10 7 24 -5 3 6 -12 -2 2 -8 8 -10 3
5022 3 -4 13 0 6 -3 21 4 -13 14 -22 5 6 15 -9 1 -1 -29 0 -3 -26 12 9 -21 -5 2 -24 -3 22 -9 -12 7 2 -8 12 22 -5
5058 -5 35 -5 -21 0 24 3 8 12 -20 -5 -23 -14 -13 -14 -19 -19 -27 -26 -10 4 21 -3 -27 12 -19 -30 -1 -1 17 -12 -19 -9 -25 -4 -7 25 -8
5095 -8 7 2 5 26 -11 23 39 41 4 18 12 38 -11 5 -9 -16 11 -29 -15 22 11 -22 -4 -15 -19 -12 20 5 22 11 0 26 -8 -27
5129 -27 11 -6 10 10 8 10 -8 -19 -5 9 -10 6 12 7 4 -9 -3 39 10 -43 4 19 2 1 5 23 -19 -31 -16 -3 -17 3 2 -33 -2
5164 -2 -19 6 2 -11 -22 -10 11 -18 -3 -1 36 6 16 27 17 -2 27 14 31 23 -24 9 -2 -15 10 1 30 -8 9 -15 15 -1 19
5197 19 8 -8 -20 -18 -7 -13 -30 -8 -1 1 -8 3 -2 -11 -11 -4 -11 6 1 19 -10 2 -1 16 6 -3 4 7 15 18 -40 -10 15 -7 0 2 8 -13 -33 -12
5237 -12 0 3 -5 -17 10 -1 -18 6 18 -12 -24 -26 -9 7 -3 -15 -9 -18 -39 -10 -2 -8 -3 0 9 -2 -5 -10 23 -11 14 0 -6 18 6 -2 -16
5274 -16 -5 -5 -17 0 13 -11 8 1 0 -10 -4 11 -9 -31 -22 -17 -15 -27 -22 4 19 -14 -14 0 -13 -22 -2 29 9 -1 32 17 11 -11 1 15
5310 15 6 -17 -13 -3 1 0 35 -3 -17 -11 -11 8 5 -12 -5 10 -9 10 -21 0 0 -24 -14 3 -41 -25 -24 -11 24 -17 -9 -18 -2 10 -15 31
5346 31 16 9 -11 3 9 4 -1 30 -34 9 1 -3 -5 -17 -20 -7 -6 6 26 -11 -16 -15 2 14 -21 -11 -10 -3 -7 -26 11 -29 8 -42 -9 -28 4
5383 4 7 -5 13 0 -24 -21 14 -7 -7 14 -12 5 9 -1 22 13 -33 -5 14 9 -2 12 -8 -11 -9 -2 3 -25 -10 16 1 -8 -29 10 8 23 -5
5420 -5 0 29 -24 4 0 28 2 -37 34 -38 0 4 12 12 -8 -17 -10 17 20 -10 4 -2 -10 31 -6 -3 -27 -17 -41 -3 -14 -25 -16 9 -2 -13 -14
5457 -14 -18 -3 -4 -19 18 11 -5 5 6 -4 -11 11 15 -13 -3 12 8 -28 -14 14 -23 6 -11 -1 31 15 6 14 41 17 -19 -1 12 -3 -33
5492 -33 -2 -32 -17 -14 13 -14 15 -26 -8 21 -23 -32 -14 -4 -1 -17 13 -8 2 -15 -20 9 -3 27 -11 26 32 9 26 21 -3 -17 6
5525 6 15 2 5 -18 9 -21 -3 2 14 -3 -23 -31 3 6 -9 -4 7 -17 -37 -4 16 26 -22 -30 -31 -2 -3 -11 -5 -8 -25 12 5 2 -24 31 15 21
5563 21 -8 18 2 -15 20 5 0 1 -4 2 -17 -39 -27 3 -5 -7 -5 32 8 -7 1 17 5 -1 -5 -3 -10 -15 -7 -15 6 -22 -1 -2 1 -4 -13 2 21 -18
5603 -18 -19 4 4 1 6 4 -10 -22 -27 16 18 -23 9 13 -6 -28 4 1 -18 12 -18 -11 -21 -10 -21 -17 -14 -16 -20 27 30 -32 -35 23 1 -12 -1 11
5641 11 25 -13 -30 -12 -2 16 -17 3 -7 -16 21 -5 -5 -2 -26 -12 6 0 -7 8 -7 -40 18 19 24 -15 -15 -6 -22 -22 -19 -12 11 -10 7 -1 22
5678 22 -15 -7 31 5 -1 3 25 29 1 16 9 28 15 -35 1 -23 -9 11 -14 -1 5 -11 9 -5 -1 -8 1 -3 1 -9 3 -11 -24 3 -13 -6
5714 -6 -6 -4 4 -6 -20 24 3 5 -18 -2 21 14 7 -8 17 17 -1 -7 -7 -10 -31 -4 8 10 6 -7 8 -4 -14 -31 -10 -27 19 -8 -13 -7 -8 -2 -1
5753 -1 -2 -19 6 11 -15 -15 9 0 1 2 18 8 37 17 -9 14 9 -12 -14 19 9 -7 -1 24 22 -6 10 6 1 -27 14 -14 12 4 -26 -26 20 -15
5791 -15 -17 1 -9 13 -9 -1 -12 -13 -12 -8 8 8 15 -2 27 -3 -7 -7 -21 0 13 -19 -8 -6 -42 -23 12 -7 -9 11 8 2 -7 -14 20 -7 -5 7
5829 7 -20 -19 -29 -6 -15 -5 17 9 1 -1 -3 -20 25 -5 20 -9 -5 -10 10 34 24 -27 2 -4 -27 2 -13 -14 27 -20 -20 -1 -5 18 0 -23 -7
5866 -7 -31 -32 -7 -2 -12 -8 13 -13 -7 -15 -25 7 6 21 -3 -10 10 2 -6 -1 -13 -30 5 35 -13 6 24 -15 -9 -12 -19 -16 -16 -3 10 15 -21 16 -6
5905 -6 -3 -10 -3 -13 1 -9 -4 26 -13 -16 9 7 -19 -23 -22 -20 -14 -10 6 2 -19 -6 -23 28 -13 -2 -3 16 -13 7 14 -12 1 -9 0 -6 10 8 -11
5944 -11 -23 18 -4 6 -19 -12 10 6 1 -1 -35 -64 -12 -7 -24 -12 -24 1 4 5 22 -12 -21 20 8 -11 14 -5 -26 0 -17 1 22 4
5978 4 -5 -13 21 -13 -15 2 -8 -8 -4 8 -3 -9 -9 -13 -9 5 -37 0 30 -13 8 11 20 -13 -27 -40 4 8 5 1 12 6 -16 -2 -4 20 -7 -20 16
6017 16 -10 -6 -25 -2 7 25 7 0 1 -45 -3 -28 -28 -16 -8 -30 2 -43 -37 11 -24 7 9 12 -8 -13 -38 -6 -14 -14 -16 12 -4 -18 -10 9 -19
6054 -19 12 -19 10 -13 3 0 16 0 9 30 -2 13 -3 23 -16 0 5 -26 -32 -56 -22 11 -13 -5 32 -21 2 -19 -9 12 7 -9 -15 10
6088 10 28 9 1 -1 7 11 19 20 -51 31 1 -10 20 7 -21 -7 11 -22 -4 4 -6 10 12 -11 -17 6 10 -8 12 -8 -16 -15 0 -20 -23 -5 14
6125 14 -9 2 21 8 -2 -9 -2 -18 16 -1 -11 -10 1 -17 9 28 2 14 9 3 3 29 17 -7 -17 -16 9 16 -9 5 7 -9 -2 -13 3
6160 3 0 13 4 -20 2 -3 -10 4 -32 -23 0 -17 -1 -12 -24 -7 -14 16 18 4 1 26 0 3 -3 0 -3 25 6 -1 -12 0 -1 -6 8 2 8 -38 -15
6199 -15 -10 6 -13 24 -23 4 17 -7 -15 24 -5 -2 -15 -18 -32 -12 -5 -3 4 33 11 5 33 19 -6 14 1 -8 -2 21 -12 -18 -4 17 -13 -20
6235 -20 -23 12 9 -5 -6 -12 19 -5 -10 -5 -18 -41 -2 -13 -12 -27 -2 -30 -8 -23 -14 -6 1 9 19 3 12 9 2 6 -4 -9 0 -6 -15 3 -51 -5 -11 -23
6275 -23 -21 -41 -1 -9 -17 8 21 -11 -10 -20 -8 -18 -5 -11 -16 -35 -35 1 -9 4 -13 23 -15 7 14 25 0 -14 -12 8 11 15 7 20 -18 3
6311 3 28 -32 8 -27 21 -16 -14 -34 -26 7 1 -3 -2 -19 -1 4 3 -8 7 -27 -17 1 -36 -16 -8 3 23 1 -1 0 14 9 12 -7 4 -8 -18
6348 -18 4 26 -8 -17 -9 -11 0 -11 -2 24 -3 -7 9 -20 -35 2 -13 -3 -2 -34 -10 10 -24 7 -11 -3 17 8 1 4 29 11 5 0 -19 -14 12
6385 12 8 6 -17 7 15 11 -2 -4 -13 -11 -19 -5 -6 -27 -13 -20 21 -25 -27 3 -32 11 4 -6 22 -9 7 2 -12 1 -20 -38 -1 10 -28 -26 12
6422 12 -4 0 -13 -8 -6 5 -7 38 16 -4 4 -8 -13 -4 9 6 -2 -10 7 -24 7 12 9 -9 3 1 -32 -15 -4 -11 -29 -25 -36 8 -3 -35 -1
6459 -1 -14 -2 5 39 13 4 5 -2 4 -2 11 -3 15 4 -17 -15 7 -6 -12 17 9 -4 -11 5 6 -1 -2 1 11 -3 -9 -14 1 5 -30 -15 -1 -2 -1 17
6499 17 10 -6 3 15 -24 0 13 -5 10 16 17 6 1 -8 34 -18 11 6 -4 20 24 -36 25 7 1 12 -18 42 -9 1 12 14 -19 -40 -11
6534 -11 -6 -16 -2 -21 8 -9 -19 -1 -26 -6 0 24 -7 11 -7 -6 9 18 23 -11 14 23 -7 -14 -5 0 -1 -12 -3 28 -29 -16 8 -16 26 -6
6570 -6 -7 -15 -9 8 3 -25 1 8 4 18 -7 9 16 2 -8 -2 39 16 -10 1 7 3 -17 1 4 0 3 23 9 33 -7 -3 25 9 -14 10 1 -15
6608 -15 4 4 -5 -12 -32 -13 -8 -13 -11 15 -14 -1 -16 19 -7 -9 10 -7 3 4 -8 -7 -12 14 -9 -11 -24 -3 -39 5 25 6 -11 -22 17 27
6644 27 4 -9 4 9 7 25 -14 11 -25 -3 -2 -5 -4 30 5 14 -13 -8 4 -13 -21 5 3 13 3 -25 2 -11 -13 -16 26 17 3 -15 4 -11
6680 -11 2 6 6 -1 33 -10 5 -10 6 4 14 8 2 12 0 30 -7 -7 9 7 -23 18 10 -33 10 27 24 -12 -31 -6 15 -9 -3 -9 -10 -2 20
6717 20 30 7 -13 7 3 23 19 -17 16 -3 12 13 13 1 -12 -4 -21 -7 11 -16 17 -15 -19 -3 -20 -16 -10 3 7 3 -21 8 2 -31 -29 -30 -8
6754 -8 3 3 5 -9 6 -12 5 6 17 -15 12 47 20 -21 7 34 -5 -8 -14 12 -1 24 -29 -30 5 -9 -3 -1 -8 -32 -39 -20 -7 -9 -26 25
6790 25 12 -3 -11 20 12 -18 -6 -7 9 -8 -9 22 28 5 15 25 0 -7 18 -9 16 -2 16 6 15 -8 -3 1 23 -11 -1 29 16 -5 -10
6825 -10 17 -28 6 -23 20 -6 11 5 -8 -10 -16 5 13 11 -19 15 18 11 12 2 24 24 -12 9 -21 5 1 0 19 -3 -6 -14 7 -33 -18 -4 -1
6862 -1 -16 10 -8 2 9 -9 -26 18 -23 -16 -2 10 -2 -43 24 3 19 -22 15 -16 -13 -26 -9 12 38 2 12 -8 14 8 13 31 -8
6895 -8 -26 -2 -8 11 -25 -7 25 1 -4 -26 -26 -10 -25 -4 3 -23 -2 -14 5 -5 -26 -20 13 3 -2 20 -1 20 -13 -1 22 0 -6 -9 22
6930 22 18 -22 5 7 5 -23 13 8 -22 -24 -13 -10 -14 -30 -14 -14 9 -5 -3 1 -9 1 -44 16 -27 -21 -36 10 14 0 -35 -1 5 -6 4 -13 30
6967 30 -13 -15 -10 -2 7 7 -9 -13 -18 6 -2 -3 -13 58 16 -10 -2 25 29 19 -23 -10 6 -15 -25 -26 22 -20 -41 -9 5 -30 -19 11 -9 21
7003 21 -27 -7 12 -5 -38 -14 25 11 -32 -33 7 -7 1 8 -3 -8 -21 -8 -14 19 14 1 -8 5 -35 -8 -13 -41 -2 -8 -15 -21 10 13 2 -31
7039 -31 -18 -12 -3 2 -20 1 15 13 9 6 3 -23 7 -2 4 29 17 -12 8 28 -23 4 9 -5 -11 12 4 -41 -23 -14 -8 -13 -16 -20 -28 -8 -7 -6 7 9 -9
7080 -9 8 28 20 -7 23 20 0 -4 -20 17 15 -11 -4 14 5 -1 10 11 -8 -13 0 4 -7 18 10 13 11 15 3 -6 -25 -13 -28 12 -24 -21 -7 14 -37
7119 -37 -8 27 7 -11 -15 -1 14 34 3 19 7 4 -3 -13 21 -13 -9 14 -4 -23 -13 9 -21 2 -17 5 19 -5 -18 -2 5 -21 -28
7152 -28 1 1 -9 -17 11 -5 -11 -23 13 5 -9 13 1 -8 5 -4 -7 46 2 -26 -20 12 17 -17 -4 -8 12 9 13 24 21 0 -14 9 -21 18 8
7189 8 -8 -17 -4 -19 -10 -9 3 -13 -22 -14 16 9 25 8 -14 10 31 -3 -31 15 4 -6 -17 8 10 0 -4 4 -5 5 -26 1 2 10 29 9 18
7226 18 44 22 10 -2 -14 -8 12 -16 -45 -26 -21 -10 -19 4 -18 9 6 -19 -10 -7 -7 -21 4 -8 0 -10 -15 -11 -9 -18 7 9 -16 -18 27 3 13
7263 13 0 -1 8 3 -13 1 20 -8 -48 -25 12 9 21 3 10 -4 22 -28 -23 -11 -20 -11 -28 1 -26 -10 11 3 -32 -5 -2 -29 2 24 16 -13
7299 -13 -8 -21 0 36 5 -10 24 10 -19 8 -18 0 -21 -26 7 -29 -7 0 -25 -21 -16 1 -21 3 -10 6 14 2 14 -13 -2 4 -9 -16
7333 -16 -26 -28 -14 -20 11 -21 1 13 16 2 -24 6 -3 0 18 -5 24 5 -3 4 -22 14 -25 -10 -16 -25 14 -10 0 -9 15 -5 -11 -37 9 2
7369 2 -2 -3 -1 18 -27 3 -4 9 -5 1 -7 4 -10 10 -8 15 3 1 7 -16 -6 5 -12 6 -34 6 2 -6 32 11 -8 -18 -8 0 -1 -1 -14
7406 -14 -14 -10 0 -37 -3 6 -16 -19 4 -16 8 -3 10 2 24 15 18 17 29 -7 -18 9 15 24 7 19 -14 -16 -38 20 6 -12 -9 -20 -16 -4 10
7443 10 6 -9 -4 -10 -17 5 -1 -5 -8 12 18 -2 -3 -3 7 16 3 6 25 5 -13 13 0 23 -6 7 -2 -6 32 -27 0 -7 -15 -3 5 12 -9 -21 23
7482 23 7 -2 21 -18 0 -3 -17 12 0 -13 -13 14 -6 16 13 16 -11 -12 -1 -20 -16 8 2 -18 -7 1 -5 -24 9 1 -27 -6 -23 27 18 -6
7518 -6 -15 4 2 28 -8 -12 -1 -2 -2 -4 -3 -7 -11 1 -17 6 -13 16 24 10 3 -11 35 18 3 21 -3 16 26 -1 6 -15 -21 -13 -21 6 -7 -18
7556 -18 22 -7 8 -19 30 23 -7 7 -8 -6 16 -5 -31 6 0 -29 -20 -23 -4 -13 2 -3 0 4 -12 13 -5 16 -20 15 8 14 -14 -13 -15 3 5
7593 5 4 -18 -4 -13 -15 10 -4 0 -9 -21 -3 -13 -6 12 -32 -1 26 -11 -16 -10 0 8 15 8 -10 -9 -9 -31 -18 1 15 18 14 2 -7 -1 -10 -18 -12 23 5
7634 5 23 -4 -9 28 1 -10 -8 23 15 -13 -10 -22 -9 -11 -4 8 -10 4 -15 -31 2 -12 -27 -4 -2 -23 23 -1 1 3 15 -21 -13 8 -28 3
7670 3 -2 -13 -15 11 14 1 14 -18 -3 -9 -12 24 -4 14 4 -2 19 7 -19 -39 -1 -9 7 -12 2 -10 6 -1 -15 7 9 -4 -12 29 -2 9
7706 9 25 -13 9 -6 11 -7 3 19 10 7 10 8 3 24 11 9 16 21 -13 -4 25 6 2 2 3 -10 -5 14 -13 -14 9 -10 3 25 -15 18 -2 5
7744 5 -2 -2 10 5 -6 -5 -3 23 -2 -10 -22 -4 15 9 2 31 10 19 -24 3 16 13 -9 2 -10 -8 -29 10 2 -13 -1 -27 -33 3 -14 -11 11 -16
7782 -16 -18 -4 -7 13 -18 -13 3 -12 10 0 -2 -19 7 -11 -25 -12 15 8 5 14 3 8 -14 -4 33 -1 9 4 13 -4 -10 -2 7 -7 -12 8 -12
7819 -12 -14 6 -3 -5 -8 26 5 4 16 -7 -11 -23 3 21 4 -5 17 14 -6 -1 16 21 -14 -5 -8 4 -5 0 -4 12 -35 -1 15 23 -12 -27 -16 -16 0
7858 0 11 -4 4 -15 -5 5 2 -12 -22 2 -4 6 6 9 20 7 29 10 13 -7 9 31 -1 -1 16 9 11 -9 -1 -8 -19 5 -25 -22 -2 -29 2
7895 2 -8 -1 -4 6 30 -18 -9 7 -6 40 10 11 5 12 -8 7 -20 -28 -19 -6 10 16 -13 28 1 2 41 26 6 15 25 -13 -3 -18 -5 -19
7931 -19 1 -9 1 -5 4 17 -13 2 15 4 -24 10 -14 -11 -7 12 8 12 -29 -3 5 -25 -23 -30 35 -5 -20 -7 29 -8 20 -8 0 12 -3
7966 -3 20 10 -1 -2 16 9 25 -3 -6 3 -5 1 -6 26 -16 -22 -6 10 -10 -27 -23 9 -41 -27 -19 -27 7 -29 -23 -13 -15 0 -10 13 7 -27 -3 -10
8004 -10 -13 18 -19 6 -4 -13 5 1 4 0 16 7 12 -4 -1 1 -13 -1 13 12 -16 -9 5 13 -2 -29 13 -7 10 -31 7 5 -8 -31 11 4 -5 -10
8042 -10 8 9 16 23 -13 16 -11 -1 -16 27 0 -24 7 29 4 6 -3 7 1 13 -14 18 21 15 17 -8 -9 -9 -32 -11 -13 31 -9 12 5 -19 4
8079 4 -4 -2 -14 23 -6 2 3 18 32 -9 6 49 11 -2 6 21 7 19 5 -7 6 16 -3 24 15 14 -22 -20 0 -16 -28 2 -1 -27 -10
8114 -10 4 2 9 -15 20 24 24 -9 15 -2 22 -10 39 5 -10 -34 5 40 2 -8 0 5 12 27 2 27 7 -31 3 11 -19 7 22 20 -15
8149 -15 -5 4 -4 -15 2 -8 8 -4 -37 -7 13 15 -4 19 8 -18 0 -8 11 -2 -3 -4 7 -6 -17 -13 12 -28 4 20 29 -9 -3 19 30
8184 30 -22 5 31 4 -10 28 -5
8191e
##END NTUPLES=NMR FID
##END=
