##TITLE=1H_AM_NV101
 CDCl3
 8 sc, 
 19.12.2023
##JCAMPDX= 6.0         $$ Bruker NMR JCAMP-DX V2.0
##DATA TYPE= NMR FID
##DATA CLASS= NTUPLES
##ORIGIN= UXNMR, Bruker Analytische Messtechnik GmbH
##OWNER= root
$$ XWIN-NMR		Version 3.5
$$ Tue Dec 19 14:09:41 2023 Russian Standard Time (UT+4h)  she@DPX200
##.OBSERVE FREQUENCY= 200.1313
##.OBSERVE NUCLEUS= ^1H
##.DELAY= (6, 6)
##.ACQUISITION MODE= SIMULTANEOUS
##.ACQUISITION SCHEME= undefined
##.AVERAGES= 8
##.DIGITISER RES= 18
##SPECTROMETER/DATA SYSTEM= spect
##.PULSE SEQUENCE= zg30
##.SOLVENT NAME= CDCl3
##.SHIFT REFERENCE= (INTERNAL, CDCl3, 0, 15.7039)
##AUDIT TRAIL= $$ (NUMBER, WHEN, WHO, WHERE, WHAT)
$$ ##TITLE= Audit trail, XWIN-NMR		Version 3.5
$$ ##JCAMPDX= 5.01
$$ ##ORIGIN= Bruker BioSpin GmbH
$$ ##OWNER= she
$$ F:/spectra/data/she/nmr/H-F/1/audita.txt
$$ ##AUDIT TRAIL=  $$ (NUMBER, WHEN, WHO, WHERE, WHAT)
(   1,<2023-12-19 14:08:11.00 +0400>,<she>,<DPX200>,
      <created by zg, POWCHK disabled, PULCHK disabled
       configuration hash MD5:
       00 E9 B6 7A A2 85 ED C7 34 08 36 98 17 FE 4E 26
       data hash MD5: 16K
       E9 C8 ED 2C 35 57 60 8D 4D D0 CD 63 AB 3E 0D 4F>)
$$ ##END=
$$ 
$$ hash MD5
$$ E2 63 BA 63 9F 7C BD 7B 18 1C B3 87 CC 15 F3 5B
##$RELAX= 
##$RELAX= 
##$RELAX= 
##$RELAX= 
##$RELAX= 
##$RELAX= 
$$ Bruker specific parameters
$$ --------------------------
##$DU= <F:/spectra>
##$EXPNO= 1
##$NAME= <H-F>
##$PROCNO= 1
##$TYPE= <nmr>
##$USER= <she>
##$AMP= (0..31)
100 100 100 100 100 100 100 100 100 100 100 100 100 100 100 100 100 100 
100 100 100 100 100 100 100 100 100 100 100 100 100 100 
##$AQSEQ= 0
##$AQ_mod= 1
##$AUNM= <au_zg>
##$AUTOPOS= <>
##$BF1= 200.13
##$BF2= 200.13
##$BF3= 200.13
##$BF4= 200.13
##$BF5= 200.13
##$BF6= 200.13
##$BF7= 200.13
##$BF8= 200.13
##$BYTORDA= 1
##$CFDGTYP= 0
##$CFRGTYP= 5
##$CHEMSTR= <none>
##$CNST= (0..31)
1 1 145 1 1 1 1 1 1 1 1 1 1 1 1 1 1 1 1 1 1 1 1 1 1 1 1 1 1 1 1 1 
##$CPDPRG= <>
##$CPDPRG1= <>
##$CPDPRG2= <>
##$CPDPRG3= <>
##$CPDPRG4= <mlev>
##$CPDPRG5= <mlev>
##$CPDPRG6= <mlev>
##$CPDPRG7= <mlev>
##$CPDPRG8= <mlev>
##$CPDPRGB= <>
##$CPDPRGT= <>
##$D= (0..31)
0 1.2 0 0 0 0 0 0 0 0.06 0 0.03 0 0 0 0 0.0002 0 0 0 0 0 0 0 0 0 0 0 0 
0 0 0 
##$DATE= 1702980490
##$DBL= (0..7)
120 120 120 120 120 120 120 120 
##$DBP= (0..7)
150 150 150 150 150 150 150 150 
##$DBP07= 0
##$DBPNAM0= <>
##$DBPNAM1= <>
##$DBPNAM2= <>
##$DBPNAM3= <>
##$DBPNAM4= <>
##$DBPNAM5= <>
##$DBPNAM6= <>
##$DBPNAM7= <>
##$DBPOAL= (0..7)
0.5 0.5 0.5 0.5 0.5 0.5 0.5 0.5 
##$DBPOFFS= (0..7)
0 0 0 0 0 0 0 0 
##$DE= 6
##$DECBNUC= <off>
##$DECIM= 32
##$DECNUC= <off>
##$DECSTAT= 4
##$DIGMOD= 1
##$DIGTYP= 9
##$DL= (0..7)
0 120 120 120 120 120 120 120 
##$DP= (0..7)
150 150 150 150 150 150 150 150 
##$DP07= 0
##$DPNAME0= <>
##$DPNAME1= <>
##$DPNAME2= <>
##$DPNAME3= <>
##$DPNAME4= <>
##$DPNAME5= <>
##$DPNAME6= <>
##$DPNAME7= <>
##$DPOAL= (0..7)
0.5 0.5 0.5 0.5 0.5 0.5 0.5 0.5 
##$DPOFFS= (0..7)
0 0 0 0 0 0 0 0 
##$DQDMODE= 0
##$DR= 18
##$DS= 0
##$DSLIST= <SSSSSSSSSSSSSSS>
$$ [...]
##$SUBNAM2= <"">
##$SUBNAM3= <"">
##$SUBNAM4= <"">
##$SUBNAM5= <"">
##$SUBNAM6= <"">
##$SUBNAM7= <"">
##$SUBNAM8= <"">
##$SUBNAM9= <"">
##$SW= 18.0517328524113
##$SWIBOX= (0..15)
0 0 2 0 0 0 0 0 0 0 0 0 0 0 0 0 
##$SW_h= 3612.71676300578
##$TD= 16384
##$TD0= 1
##$TE= 0
##$TE2= 300
##$TE3= 300
##$TEG= 300
##$TL= (0..7)
0 120 120 120 120 120 120 120 
##$TP= (0..7)
150 150 150 150 150 150 150 150 
##$TP07= 0
##$TPNAME0= <>
##$TPNAME1= <>
##$TPNAME2= <>
##$TPNAME3= <>
##$TPNAME4= <>
##$TPNAME5= <>
##$TPNAME6= <>
##$TPNAME7= <>
##$TPOAL= (0..7)
0.5 0.5 0.5 0.5 0.5 0.5 0.5 0.5 
##$TPOFFS= (0..7)
0 0 0 0 0 0 0 0 
##$TUNHIN= 0
##$TUNHOUT= 0
##$TUNXOUT= 0
##$USERA1= <user>
##$USERA2= <user>
##$USERA3= <user>
##$USERA4= <user>
##$USERA5= <user>
##$V9= 5
##$VALIST= <valist>
##$VCLIST= <CCCCCCCCCCCCCCC>
##$VD= 0
##$VDLIST= <DDDDDDDDDDDDDDD>
##$VPLIST= <PPPPPPPPPPPPPPP>
##$VTLIST= <TTTTTTTTTTTTTTT>
##$WBST= 1024
##$WBSW= 4
##$XGAIN= (0..3)
0 0 0 0 
##$XL= 0
##$YL= 0
##$YMAX_a= 228003
##$YMIN_a= -247392
##$ZGOPTNS= <>
##$ZL1= 120
##$ZL2= 120
##$ZL3= 120
##$ZL4= 120
##$ABSF1= 10
##$ABSF2= 0
##$ABSG= 5
##$ABSL= 3
##$ALPHA= 0
##$AQORDER= 0
##$ASSFAC= 0
##$ASSFACI= 0
##$ASSFACX= 0
##$ASSWID= 0
##$AUNMP= <proc_1d>
##$AZFE= 0.1
##$AZFW= 0.1
##$BCFW= 1
##$BC_mod= 2
##$BYTORDP= 1
##$COROFFS= 0
##$CY= 11.3945322036743
##$DATMOD= 1
##$DC= 2
##$DFILT= <>
##$DTYPP= 0
##$F1P= 15.7292609196834
##$F2P= 12.9074282941183
##$FCOR= 0.5
##$FTSIZE= 0
##$FT_mod= 4
##$GAMMA= 1
##$GB= 0.15
##$INTBC= 1
##$INTSCL= 1
##$ISEN= 128
##$LB= 0.24
##$LEV0= 0
##$LPBIN= 0
##$MAXI= 10000
##$MC2= 0
##$MEAN= 0
##$ME_mod= 0
##$MI= 1.114404
##$NCOEF= 0
##$NC_proc= 0
##$NLEV= 6
##$NOISF1= 3.799351
##$NOISF2= 2.8
##$NSP= 1
##$NTH_PI= 0
##$NZP= 0
##$OFFSET= 15.70392
##$PC= 1
##$PHC0= -24754.13
##$PHC1= 15.85272
##$PH_mod= 1
##$PKNL= yes
##$PPARMOD= 0
##$PSCAL= 0
##$PSIGN= 0
##$REVERSE= no
##$SF= 200.130013532006
##$SI= 16384
##$SIGF1= 3
##$SIGF2= 2
##$SINO= 400
##$SIOLD= 16384
##$SREGLST= <1H.CDCl3>
##$SSB= 0
##$STSI= 0
##$STSR= 0
##$SW_p= 3612.71676300578
##$SYMM= 0
##$S_DEV= 0
##$TDeff= 0
##$TDoff= 0
##$TI= <>
##$TILT= no
##$TM1= 0
##$TM2= 0
##$TOPLEV= 0
##$USERP1= <user>
##$USERP2= <user>
##$USERP3= <user>
##$USERP4= <user>
##$USERP5= <user>
##$WDW= 1
##$XDIM= 8192
##$YMAX_p= 0
##$YMIN_p= 0
$$ End of Bruker specific parameters
$$ ---------------------------------
##NTUPLES= NMR FID
##VAR_NAME=  TIME,          FID/REAL,        FID/IMAG
##SYMBOL=    X,             R,               I
##VAR_TYPE=  INDEPENDENT,   DEPENDENT,       DEPENDENT
##VAR_FORM=  AFFN,          ASDF,            ASDF
##VAR_DIM=   8192,          8192,            8192
##UNITS=     SECONDS,       ARBITRARY UNITS, ARBITRARY UNITS
##FACTOR=    0.0002768,     1,               1
##FIRST=     0,             0,               0
##LAST=      2.2672688,     0,               0
##MIN=       0,             -247392,         0
##MAX=       2.2672688,     228003,          0
$$ Real data points
##PAGE= N=1
##DATA TABLE= (X++(R..R)), XYDATA
0 0 0 0 0 0 0 0 0 0 0 0 0 0 0 0 0 0 0 0 0 0 0 -8 8 -8 8 -8 10 -14 16 -16 21 -24 26 -30 34 -38 45 -50 55 -63 70 -78
42 -78 87 -99 108 -119 133 -147 161 -178 196 -217 239 -262 287 -317 349 -383 425 -467 517 -572 632
63 632 -699 764 -812 789 -462 -1384 21166 228003 10954 -226460 47069 183004 -83258
76 -83258 -133210 109220 67461 -112749 -3146 103319 -57581 -77894 102092 44500 -131873
87 -131873 -4983 142364 -31612 -136891 64040 118248 -84279 -89855 93979 54949 -92671
98 -92671 -19753 84190 -11066 -68993 33462 49070 -49690 -30506 56205 14504 -54866 -1761
110 -1761 48365 -5485 -37379 9049 25058 -9111 -12604 6943 622 -3864 10602 751 -21936
123 -21936 785 31515 -1826 -40537 1709 47739 -1015 -52141 953 55038 752 -53029
135 -53029 -1309 48555 2754 -41165 -5693 30313 8184 -19539 -12926 7508 17516 2548
147 2548 -23616 -11522 29064 18229 -32375 -20526 35140 21208 -34018 -17573 32209 13842
159 13842 -27397 -9939 19517 4702 -12538 -2310 3870 -224 2093 301 -6476 1126 9310
172 9310 -2171 -8685 4715 7615 -4895 -2800 6793 -1206 -7965 4617 7859 -8152 -9236 9088
186 9088 9364 -10266 -11796 8732 13631 -6933 -15825 5377 19438 -2245 -21313 799 23431
199 23431 1140 -23755 -2400 22548 3635 -19977 -5524 14799 6815 -9776 -9789 3183 12706
212 12706 2929 -15728 -7579 19455 11476 -22039 -12960 24437 13512 -24788 -12022 23913 9261
225 9261 -21894 -6592 17635 3239 -12940 -1027 7015 -1070 -1466 1667 -3749 -1336 7892 210
239 210 -10055 2795 11847 -5219 -11343 8086 9188 -10785 -5913 13356 2348 -14978 1286
252 1286 15076 -5428 -15049 8202 13625 -10538 -11914 11250 9283 -10626 -6141 9028 3390
265 3390 -5489 -159 1834 -1696 3463 3208 -8883 -3993 14043 3707 -18585 -2900 21151 281
279 281 -23252 1709 22921 -4000 -20795 6150 17580 -6857 -12406 7369 7446 -5889 -1909
292 -1909 3794 -2679 -555 6041 -3666 -9007 6895 9579 -10673 -9206 12911 7069 -14644 -4309
306 -4309 15361 1810 -13956 1696 12701 -3648 -9696 5848 7053 -6688 -4488 6172 1690
319 1690 -5738 -257 3588 -1905 -2465 2153 417 -2206 1736 2031 -3160 -1031 5107 966 -5417 623
335 623 6859 -1039 -7402 1474 7512 -2241 -8076 1883 7203 -2759 -7324 2452 6330 -2660 -5666
350 -5666 2430 5092 -1416 -3214 1554 2628 -301 -1280 -304 566 1433 -69 -2917 -1090 3079 596
366 596 -4358 -1198 4511 965 -4931 -997 5332 1354 -5000 -995 5684 1744 -5008 -1171 5459
381 5459 1193 -5669 -1160 5217 277 -5452 -74 4170 -1258 -3574 1733 1932 -2404 87 2902
396 2902 -1665 -1957 4394 1545 -5622 481 7172 -2213 -7501 4338 6527 -7021 -5731 8063 2799
411 2799 -9572 -497 9086 -2676 -8007 5475 6185 -7087 -2917 8709 406 -7772 3396 6783
425 6783 -5801 -4532 7218 1012 -8092 2088 6918 -5932 -5959 7800 2949 -9572 -80 9941
439 9941 -2613 -8660 5464 7253 -6376 -4249 7230 1758 -6178 1134 4720 -3265 -2826 3865
453 3865 -354 -4684 2370 3912 -4572 -3211 5356 1651 -5661 13 5655 -642 -4186 1875 3237
468 3237 -1657 -1513 1496 -1 -1203 575 263 -1249 248 826 -1481 -1084 1271 508 -1055 202
484 202 966 -127 -11 584 -17 194 889 -285 -796 724 528 -1215 -517 664 -849 -1065 952 276
502 276 -1774 -31 1686 -790 -1454 1787 1688 -1411 -388 2013 -16 -1431 1064 1049 -1614 -367 1517
519 1517 -824 -1869 1203 893 -2646 -902 2615 -27 -2553 1062 2528 -1382 -1486 2279 1117 -1789
535 -1789 465 1893 -1222 -1360 1671 379 -2350 -55 1750 -1184 -1931 1305 1003 -1838 -634 1887
551 1887 399 -1148 705 1546 -326 -792 578 645 -337 -237 365 -26 -806 -577 204 -58 -872 -419 700
570 700 41 -880 414 1252 -320 -749 1190 1061 -1023 -205 1751 -12 -1844 288 1374 -1179 -1441
587 -1441 1107 401 -1955 -247 1599 -729 -1440 1354 1281 -1394 -58 2168 -90 -1510 1111 1293
603 1293 -1507 -565 1784 -228 -1972 495 854 -1700 -788 1602 -303 -1665 1055 1286 -1484 -453
619 -453 2138 190 -1497 1159 1533 -1358 -467 1838 -414 -2099 914 1369 -2097 -1088 2190 -187
635 -187 -2839 657 2464 -1544 -1589 2503 1159 -2470 219 2767 -879 -1937 2117 1357 -2639 -412
651 -412 2807 -902 -3252 1288 2278 -2395 -1768 2717 716 -2921 179 2737 -851 -1751 2093 1549
667 1549 -2088 -285 2554 -357 -2336 969 1791 -1868 -1560 1966 663 -2490 -461 1961 -457 -1741
683 -1741 1158 1515 -1229 -595 1737 304 -1433 707 1653 -939 -1175 1319 752 -1775 -657 1220
699 1220 -239 -1502 282 1003 -628 -816 674 273 -650 312 1019 -104 -196 820 343 -815 -103 861
717 861 -8 -845 -71 354 -398 -583 67 148 -238 -205 78 171 195 277 261 73 35 177 354 103 -156 30 197
740 197 -334 -687 1 299 -442 -679 180 302 -410 -103 435 37 -144 417 417 -168 240 720 -180 -587 484
761 484 523 -542 -559 234 34 -606 -253 121 -149 -216 23 -34 55 385 297 -106 184 435 112 -63 248 62
783 62 -290 9 7 -346 -142 224 -268 -790 -10 450 -347 -420 455 453 -255 62 523 124 -40 435 67 -445
805 -445 72 532 -261 -666 113 160 -613 -568 198 292 15 -220 -239 267 477 -171 -180 693 647 -506 -215 675
827 675 -19 -798 206 308 -799 -295 862 -375 -1330 545 1050 -1140 -931 1731 913 -1630 -44
844 -44 2033 -192 -1637 1028 1418 -1356 -795 1700 76 -2092 280 1557 -1422 -1725 1672 1108 -2065
861 -2065 -525 2148 -19 -1904 829 1839 -855 -945 1420 570 -1373 133 1231 -833 -1323 995
877 995 711 -1533 -551 1401 -83 -1560 165 1419 -171 -783 626 749 -454 -239 694 231 -303
894 -303 265 194 -583 -248 457 -238 -864 -37 510 -288 -588 329 462 -199 -149 391 195 -9 366 169 -321
915 -321 122 459 -215 -650 321 458 -721 -805 438 205 -820 -234 722 32 -581 467 556 -530 24
934 24 1105 4 -930 667 1112 -1010 -1112 1063 639 -1567 -544 1344 -199 -1525 316 1061 -858
951 -858 -607 1316 370 -1207 547 1548 -691 -1106 1387 1009 -1568 -627 1772 79 -1932 -4 1285
968 1285 -782 -1191 996 654 -1219 -175 1272 -271 -1023 961 1153 -978 -571 1501 507 -1384 -161
985 -161 1216 -418 -1250 460 769 -758 -597 534 -43 -747 377 600 -470 -293 977 437 -714
1002 -714 96 991 2 -693 202 582 -248 -467 -26 -93 -277 -69 -81 -208 62 326 -167 -196 379 424 -158
1023 -158 56 374 179 -89 46 -37 -211 155 36 -530 -269 514 -117 -838 -84 696 -223 -693 416 800
1043 800 -341 -216 614 204 -434 364 598 -565 -438 712 193 -1125 -134 951 -338 -1186 303 971
1061 971 -610 -661 737 533 -552 42 833 76 -411 435 364 -568 -223 630 -8 -842 -53 540 -283 -860
1081 -860 66 468 -228 -488 231 563 26 -232 186 329 61 -85 254 190 -171 -91 139 -245 -507 62 303
1102 303 -492 -501 510 361 -724 -316 833 273 -658 152 840 47 -493 278 392 -453 -243 449 -38 -578
1122 -578 0 295 -495 -546 331 294 -529 -218 562 232 -357 109 538 99 -157 140 298 16 -135 -63 -76
1143 -76 -89 -142 -100 -71 -7 -166 -111 80 -23 -149 227 338 -227 -56 564 266 -461 43 569 -136 -571 274
1165 274 444 -501 -577 342 126 -665 -137 582 -46 -562 321 571 -346 -260 763 350 -539 53 817 -155
1185 -155 -706 253 432 -671 -515 589 180 -727 -177 459 -156 -442 409 500 -187 -97 456 122 -227 205
1205 205 365 -196 -273 202 155 -338 -247 114 -162 -337 -101 217 69 -126 31 119 170 83 57 231 275 67 -139
1228 -139 21 127 -141 -173 56 -127 -319 10 107 -361 -239 240 31 -333 139 559 85 -332 267 386 -215
1249 -215 -145 446 105 -413 -42 258 -307 -454 134 74 -526 -223 456 44 -499 113 638 -79 -368 423 558
1270 558 -226 -247 424 159 -544 -38 392 -307 -520 319 163 -714 -207 679 -30 -782 350 838 -278 -499
1290 -499 641 601 -532 -236 664 137 -584 36 425 -425 -520 375 116 -645 -161 649 -117 -607 197 670
1310 670 -283 -349 527 390 -310 -98 384 42 -309 -25 146 -125 -235 1 -17 -284 -213 66 140 -218 -211 322
1332 322 301 -258 -170 522 407 -398 -135 637 239 -602 -123 451 -186 -550 138 258 -390 -338 406 -61 -598
1353 -598 295 714 -310 -507 780 716 -696 -368 983 225 -1046 -43 873 -220 -907 301 403 -771
1371 -771 -368 661 20 -641 248 716 -377 -462 783 598 -658 -132 901 44 -707 147 570 -409 -596
1390 -596 341 162 -543 -125 336 -267 -438 389 301 -347 -4 670 84 -385 176 403 -125 -113 111 -46 -234
1411 -234 -10 -90 -345 -65 130 -288 -262 398 275 -331 -33 430 131 -195 268 393 -121 -100 229 -65 -310
1432 -310 103 156 -472 -333 304 8 -533 23 381 -57 -314 270 371 -161 11 356 35 -251 193 300
1452 300 -242 -201 290 26 -458 -185 172 -82 -230 56 120 -56 42 122 1 42 291 101 -175 182 316 -57
1474 -57 -256 138 216 -275 -246 193 -5 -314 -17 7 -205 12 306 17 -232 320 340 -292 -177 506 199 -515
1496 -515 90 604 -204 -638 231 350 -576 -361 463 83 -622 20 603 -220 -457 545 478 -521 -80 658
1516 658 88 -578 256 543 -446 -451 457 185 -738 -116 592 -285 -743 380 587 -560 -359 759 217 -735
1536 -735 150 885 -40 -590 360 504 -444 -362 457 -20 -531 5 327 -346 -316 422 141 -514 36 623 -36
1557 -36 -359 492 430 -427 -203 434 158 -445 -5 295 -211 -380 47 20 -299 -26 137 -107 -27 166 -21
1578 -21 -138 307 326 -268 -12 510 3 -439 174 418 -398 -455 361 75 -515 31 386 -316 -395 358 89
1599 89 -484 201 718 -320 -492 678 505 -809 -112 939 -40 -960 306 736 -787 -769 750 261
1617 261 -996 -73 874 -267 -716 658 545 -741 -104 927 -44 -733 534 648 -851 -488 916
1634 916 88 -1130 166 922 -592 -881 752 544 -762 -186 920 74 -678 405 647 -506 -248
1651 -248 631 7 -537 340 398 -646 -305 657 -83 -835 204 709 -512 -557 674 358 -683 -15 765
1670 765 -61 -472 432 409 -433 -93 436 -161 -449 384 162 -613 -96 518 -224 -621 364 474 -504 -243
1690 -243 653 117 -513 57 577 -120 -394 378 172 -387 -80 234 -216 -283 285 43 -455 48 376 -259
1710 -259 -410 419 325 -411 -64 623 50 -470 204 444 -297 -363 294 102 -464 7 240 -326 -319 305 87
1731 87 -357 145 477 -212 -327 452 292 -488 10 658 17 -581 153 464 -355 -403 358 220 -444 -123 324
1752 324 -193 -311 222 268 -264 3 499 -60 -299 351 340 -308 -98 469 19 -495 51 346 -304 -381 164
1773 164 43 -392 -22 271 -23 -159 140 86 -82 125 267 -105 -28 283 28 -293 58 194 -239 -344 133
1794 133 42 -370 -83 286 -63 -253 185 236 -174 67 345 -76 -208 304 245 -322 -64 378 -124 -480 36
1815 36 352 -301 -420 312 125 -418 -101 415 58 -359 225 334 -140 -140 350 178 -319 -26 286 -185 -313
1836 -313 235 220 -370 -261 313 38 -423 12 430 -97 -295 300 367 -267 -147 314 115 -289 40 317 -148
1857 -148 -305 95 94 -298 -123 220 -26 -329 58 266 -213 -108 310 164 -238 -10 304 -22 -228 70 114
1878 114 -208 -138 171 0 -183 10 65 -156 -13 114 -17 -118 132 141 -101 85 237 0 -124 158 103 -144
1900 -144 -55 132 -100 -197 73 31 -187 -45 212 -85 -242 165 203 -167 -63 305 148 -269 112 342 -83
1921 -83 -218 146 125 -248 -127 163 -43 -278 68 130 -224 -21 233 8 -132 170 183 -178 -3 279 86
1942 86 -209 125 121 -212 -131 160 -66 -291 -14 92 -260 -144 167 -37 -251 218 252 -205 -120 455 72 -397
1964 -397 126 464 -273 -425 343 246 -561 -275 512 -178 -655 225 566 -394 -298 561 161 -606 144 717 -215
1985 -215 -488 554 378 -745 -244 738 -65 -929 240 691 -644 -649 707 343 -769 -119 898 -124
2003 -124 -735 459 660 -557 -406 784 113 -738 131 703 -422 -663 466 322 -726 -181 714 -156
2021 -156 -700 367 542 -497 -348 759 164 -593 154 664 -242 -440 422 316 -522 -167 448 -126 -503
2040 -503 225 234 -377 -124 376 39 -362 202 425 -258 -200 428 172 -321 -4 358 -98 -323 167 112 -304
2061 -304 -114 242 -25 -188 57 146 -213 -33 285 10 -151 182 165 -136 -28 166 -14 -220 54 154 -105
2082 -105 -143 109 -33 -178 -10 70 -18 -13 150 53 -11 69 60 -16 124 149 -47 -92 151 93 -183 -30 166 -103 -267
2107 -267 152 124 -195 21 151 -44 -127 214 137 -177 57 396 -78 -289 243 214 -369 -162 387 -58 -514
2128 -514 91 408 -294 -378 353 244 -450 -18 551 -114 -424 343 376 -385 -172 477 18 -505 156 398 -354
2149 -354 -353 440 96 -591 29 557 -216 -533 294 404 -403 -253 557 217 -458 44 410 -130 -390 236 168
2170 168 -295 -69 246 -141 -298 202 126 -287 -133 320 -14 -302 81 321 -114 -178 263 182 -209 -135 149
2191 149 36 -176 -56 112 -15 -156 -74 -43 -15 4 25 -5 84 71 -130 -12 129 33 -158 6 145 -8 -157
2214 -157 3 71 -120 -127 -10 20 48 -7 17 -25 129 150 -114 -81 159 150 -160 -36 210 27 -273 -20 125 -81
2238 -81 -210 5 167 -74 -194 4 82 -50 -31 72 68 31 45 28 -15 100 58 -125 -33 174 3 -232 -31 160
2262 160 -50 -244 72 176 -79 -96 147 203 -56 -66 131 190 -11 10 42 54 7 -76 -132 25 43 -115 -167 -44
2286 -44 106 -62 -260 56 261 -13 -207 154 312 -56 -137 140 232 -7 -162 115 95 -90 -125 9 37 -27
2308 -27 -46 -19 9 43 65 -119 9 132 85 -74 22 217 40 -189 -22 196 12 -206 13 145 -103 -227 53
2331 53 129 -86 -90 46 64 -34 -18 25 88 22 -62 -23 124 137 -86 -100 99 47 -160 -129 65 16 -133 -111 36 29 -33
2358 -33 -29 -46 135 162 -41 -85 136 140 -194 -131 170 96 -256 -99 195 -36 -281 9 142 -62 -91 110 122 -94
2382 -94 41 92 -56 -28 217 -36 -248 124 205 -206 -221 233 76 -300 -96 320 -20 -365 79 302 -102 -189
2404 -189 228 160 -129 -10 193 -16 -128 96 37 -127 -8 152 -121 -144 146 117 -191 -164 238 101 -263 -26
2426 -26 256 2 -227 63 242 -7 -91 55 117 -84 -153 20 23 3 -47 -51 18 -23 -50 -82 14 -48 13 9 17 126 58
2453 58 -13 -107 42 55 -86 -95 25 -4 -84 -109 45 146 -112 -113 106 198 -116 -107 192 132 -125 10 229 18 -159
2478 -159 85 160 -98 -171 129 5 -145 5 89 -140 -154 123 71 -176 -13 293 -122 -217 105 244 -147 -158
2500 -158 236 151 -240 -159 185 -72 -232 38 156 -64 -103 100 9 -101 37 107 -67 6 142 84 -86 41
2522 41 62 -66 -103 57 8 -131 -52 10 -68 -68 12 -10 -18 44 -9 -87 101 103 -54 -1 195 11 -128 -14 147 -48
2548 -48 -139 43 35 -123 -48 103 -6 -175 11 142 -105 -80 219 79 -173 46 206 -137 -145 151 82 -298 -123
2571 -123 244 -16 -243 35 256 -170 -185 206 110 -255 -46 254 -65 -115 172 184 -194 -56 208 6 -233
2592 -233 -13 197 -137 -206 141 84 -210 -104 190 2 -186 90 243 -116 -77 180 89 -173 0 184 -12
2613 -12 -180 44 139 -100 -101 62 47 -166 -31 121 -29 -137 98 87 -80 -70 142 100 -143 46 137 -14 -89
2636 -89 51 42 -49 -32 50 -51 -97 -8 -13 -137 -33 10 52 -7 31 101 57 14 -31 20 8 -30 -13 4 -34 -74 -14 8 -91
2665 -91 -61 -23 28 -43 0 31 33 51 60 38 7 -4 18 29 -66 66 -43 -42 9 40 -33 -28 -11 -6 -46 -13 77 -7 37 90 48 29
2697 29 -39 32 28 -23 20 63 -27 -35 11 -80 -84 -7 19 -46 -138 36 38 -69 -13 79 29 -67 14 99 -46 34 44 -13 -61 -7 44
2728 44 -34 -88 24 -5 -103 -38 45 2 0 47 47 39 -2 -13 22 35 -30 4 21 -11 -17 -24 36 -51 -39 9 -50 -68 34 26 25 -62 -17
2761 -17 93 11 -19 115 46 -17 -7 69 33 -89 54 15 -84 -90 -12 12 -146 -26 122 26 -74 4 66 -82 -41 76
2787 76 67 -90 -13 102 -28 -126 48 28 -13 -58 13 37 -73 -28 87 -47 -111 10 85 33 -28 54 62 -5 -13 100 99 -74
2815 -74 -10 62 -45 -69 79 -14 -87 -32 86 -2 -62 30 62 -32 -81 26 54 21 -37 20 22 -47 3 44 11 -59 -86 46
2843 46 -6 -76 -51 72 14 -3 0 13 20 -25 58 24 -52 -27 68 -42 -77 19 4 -100 -50 94 -12 -128 -8 35 -37 -62
2871 -62 103 91 -105 -62 91 84 -86 44 50 -60 -71 44 16 -104 -55 12 -87 -69 52 15 -88 -57 49 15 -69 43
2897 43 103 15 -51 -8 22 -18 -42 4 -66 29 -8 -9 -32 -5 -39 -38 29 -2 -9 20 80 28 -7 -21 53 46 -54 4 -16 -33 5 7
2929 7 14 -20 13 -31 -55 19 -5 -37 -28 74 83 -27 1 31 41 -29 -17 3 -7 -37 18 -23 -12 -49 30 37 -11 -31 -7 -13 -32 5
2961 5 41 -34 16 53 25 12 -72 43 17 -38 -25 14 -65 -11 14 -14 -74 -65 5 7 -6 -24 57 -14 -56 42 62 -52 -43 58 18
2992 18 -46 -1 8 -16 4 42 -18 -58 37 68 -2 -59 24 38 -59 -17 61 31 -64 -12 61 -12 -21 -22 36 -11 -96 28 -6 -67 12
3023 12 29 -10 -41 33 44 25 -7 63 35 -12 21 72 9 -44 5 -9 15 -36 12 -70 -58 -1 50 -5 -25 -31 19 3 43 21 65
3054 65 32 64 -2 21 40 66 -3 -17 -4 25 -68 -49 45 -19 -61 -11 30 12 -31 40 51 -25 20 19 44 -40 24 -7 -63 6 43
3085 43 -16 -23 19 14 -36 -3 17 43 -102 48 114 -22 -68 48 -21 -51 16 106 -18 -32 22 35 -73 -107 66 48 -74
3112 -74 20 76 -48 -24 59 50 -70 -39 98 15 -74 9 46 -46 -95 12 8 -72 -58 55 -15 -129 -37 28 -59 -46 72 68
3140 68 -14 -2 74 15 -10 55 -6 -37 -64 12 -21 -110 9 0 -70 -32 33 -36 -43 22 38 -54 -77 28 2 -45 30 36 -28 -45 49
3171 49 -1 -56 -10 86 -44 -44 42 -35 -56 -1 47 -6 -32 44 94 -57 -26 65 44 -16 19 79 -25 -72 8 93 -85 15
3199 15 81 -19 -53 -3 71 -27 -75 79 74 -66 -8 64 2 -50 26 79 -100 -31 33 -47 -37 32 23 -40 -12 47 41 -77 -62
3228 -62 47 11 -40 39 61 -7 7 74 23 -95 55 61 -50 -18 59 -5 -6 -2 62 -5 -56 45 43 -57 -1 53 5 -68 60
3257 60 108 10 -21 31 44 -13 25 -32 -20 -37 4 -16 -64 -13 19 1 0 62 58 24 -12 46 43 -4 3 13 -10 -67 1 14 -50 -54 76
3290 76 -2 -75 -8 38 -19 0 26 31 -27 -18 26 6 -16 1 -43 -6 -5 -28 10 -64 5 -24 -13 0 -23 13 -2 8 8 24 -17 62
3322 62 11 -48 14 40 -9 5 -33 31 -14 -53 6 -2 -2 10 -27 -89 6 23 35 29 7 45 -19 55 49 0 -53 37 -41 -14 -9 -28 -26
3355 -26 -66 -16 -3 -31 -53 -45 23 -1 -24 47 12 79 7 17 -47 20 57 -13 -52 -23 48 -12 65 -16 0 -25 7 12 -12 30 45
3386 45 -36 -69 30 61 -52 -28 -40 -4 -49 -21 76 15 -42 -5 34 -47 -57 -22 35 -12 4 47 19 -18 68 -6 -69 8 27 -57
3416 -57 -56 16 46 -30 -46 -21 -60 -73 16 -62 8 -41 28 -1 -1 9 24 -39 -25 35 46 20 -16 8 -6 -16 17 -7 23 -2 -7 13
3448 13 -11 28 -15 -8 -15 41 16 -49 24 -17 3 8 -49 -11 -28 49 8 -2 -25 13 -38 -13 9 -62 23 -3 17 -11 72 6 11 10 -19
3481 -19 -22 -4 -12 -20 50 38 -7 -58 -62 -2 -70 -29 44 11 -3 -36 -57 1 -11 -6 15 -27 -17 -42 68 53 -26 -12 -16 -5 25 4 11
3514 11 -12 17 26 -21 -39 1 -15 19 -29 26 34 4 -50 9 72 -55 -4 15 24 -28 -9 6 -1 -41 23 72 -11 -34 -66 -16 -13 -23
3546 -23 30 9 -62 -12 -11 -1 -45 1 -51 -114 -10 -17 -47 -32 -12 48 1 30 -11 1 -20 -38 21 -31 37 3 30 -13 -9 -7 -76 -30
3578 -30 4 4 -58 -25 -16 1 26 5 9 -58 -49 -1 -29 1 23 -4 -33 -115 46 34 11 -60 56 -39 -15 20 37 -74 -27 -2 35
3609 35 -32 6 78 4 7 4 53 -12 -28 -30 -13 -13 34 23 -58 -7 11 -26 -16 46 55 -91 -19 37 -35 -2 9 17 -3 -60 42 89
3641 89 -22 -11 -14 21 4 14 45 -1 -42 22 31 -29 -40 46 38 -31 10 81 -18 -35 11 -15 -45 -39 -14 -64 -35 3 34 -70 -21
3672 -21 34 -14 -7 48 56 46 -62 24 9 -62 -10 9 4 -36 24 -4 -32 -22 59 8 -21 18 -4 -57 -20 5 35 26 8 15 -45 76
3704 76 0 -2 13 -11 -50 -19 -59 18 44 -20 19 7 -23 -19 34 -10 105 -20 -26 5 29 -21 5 -52 21 12 -42 13 -15 -11 12 66
3736 66 0 16 -36 15 -27 29 1 52 -9 -2 18 58 -48 17 -22 -35 -29 4 -32 -35 62 2 -17 -84 -67 5 -47 -11 -29 -21 -25 -9
3768 -9 -13 30 10 -28 9 5 -20 13 25 -65 -4 30 -59 11 -1 23 -21 48 -20 31 -65 12 16 21 -1 -20 2 -5 20 36 15 -14 3
3801 3 35 6 -20 -7 6 -71 -51 55 -7 -11 99 57 -13 -39 28 6 9 16 22 -1 28 -3 1 -28 0 18 19 -46 -84 38 38 -21 -3
3834 -3 37 -88 -21 -17 -20 -25 48 -16 -10 -24 -2 -16 -10 11 37 -28 19 -28 -11 5 -13 29 -15 -66 -29 -7 -14 -3 19 22 17 11 30 -58 8
3869 8 8 -26 -25 -60 9 -36 -9 0 42 -37 29 26 -19 2 43 -36 -17 24 -39 -41 -15 -25 28 -9 -26 0 7 -49 42 7 22 -60 2 -18
3903 -18 -50 6 -33 12 -27 31 22 22 38 -10 -1 -9 -38 18 -4 -4 5 9 0 -2 -45 6 -19 -22 -4 -41 -30 11 -42 -21 49 56 1 -23 -22 -17 6
3940 6 -12 -3 -17 11 60 -7 -8 -9 43 22 2 24 -26 49 58 -8 -21 -7 -12 17 -14 6 -26 26 22 13 0 2 -31 -63 -12 18 -18 52 -16
3975 -16 -4 14 -24 -42 -44 -15 35 -17 14 5 11 -5 -14 10 -43 24 0 -36 -24 -17 13 -29 -30 15 -15 -27 13 44 -53 -17 4 5 -35 16
4009 16 -53 14 46 34 8 -13 -10 41 -37 20 -8 -34 -2 -11 22 14 -13 -15 56 -22 21 51 -8 -15 -1 -12 17 -54 -5 22 45 -33 -3
4042 -3 11 -11 3 -7 -29 -19 -16 13 -16 -29 17 -8 -23 18 59 -64 -44 -12 25 -13 28 -14 -4 -33 -22 40 -32 19 -15 -61 -42
4073 -42 26 46 6 8 -10 67 -31 28 44 -11 20 -10 -11 -70 32 -33 38 -46 -40 27 -47 -81 15 -20 -21 34 45 -20 12 31 17 -8
4105 -8 27 23 73 66 18 -9 -11 -22 12 34 -26 -12 0 -20 10 16 7 3 -13 91 0 27 38 17 30 8 9 -34 22 -15 -9 -18 -19 -23 -32 28
4141 28 -36 -24 39 -13 -9 -36 20 -18 28 -32 -12 -35 -36 7 -30 26 24 -1 -9 36 3 0 -37 46 2 35 -11 75 -18 16 -53 -81 -2
4174 -2 4 -14 42 -12 7 5 3 9 -75 26 -22 -11 -38 33 17 -3 50 12 46 15 29 23 18 -33 41 35 -16 -8 -21 15 -5 45 35 17
4208 17 0 45 43 24 -57 -21 -27 -29 14 12 28 -1 2 15 -45 -2 10 47 51 -13 72 23 1 13 17 10 21 16 -18 -18 38 -18 51 53 23 -13
4244 -13 13 -6 -26 -1 19 11 -9 -9 -17 0 4 -45 -8 14 26 6 6 34 -29 8 -41 18 37 5 7 -19 -5 -10 -17 -15 -3 11 36 -20 15
4279 15 44 -10 3 -18 11 31 -73 0 11 1 14 43 -1 -12 -34 -4 -7 19 32 72 38 -15 0 12 16 -27 -10 36 0 -41 49
4310 49 -23 9 11 -19 -9 -41 1 19 -28 16 -15 12 -33 -19 -2 9 46 -14 -9 21 4 8 -4 17 -19 -30 2 4 -3 -8 46 -25 14
4343 14 23 16 49 23 -19 -43 76 39 88 25 -8 71 6 43 46 -55 -1 -12 -5 57 21 -30 -15 34 33 -50 44 90 -14 23 -41
4374 -41 32 -24 64 40 -25 2 -20 0 73 -14 -24 38 16 -19 12 7 94 5 4 16 -8 48 8 19 27 -15 0 -8 -9 5 32 -31 29
4407 29 -75 -40 -96 -26 54 -36 2 9 36 -36 46 -9 24 -19 14 5 7 7 -8 -1 9 -16 -32 31 -2 -22 16 9 47 22 -34 23 32
4440 32 14 -13 47 2 28 -7 -21 1 -55 -47 17 16 -25 -44 9 6 4 25 34 -7 3 -7 -31 11 -15 -9 7 -12 -36 -48 -31 12 24
4473 24 49 36 30 -4 12 -31 -15 17 25 -66 4 -33 65 -44 39 18 -17 52 0 73 15 -31 1 28 36 -48 3 -54 31 -21 -43
4504 -43 -20 36 -8 -6 6 14 -19 -26 21 2 21 -32 35 40 20 5 32 -23 16 13 -8 -5 -7 -24 53 19 13 35 -17 -23 19 32 0 -60 34
4539 34 35 15 -8 36 35 19 14 28 -3 -44 -58 -28 -9 28 58 -42 -27 -13 18 -38 56 16 24 -2 -9 -4 41 64 -29 -19 0 46 -23
4572 -23 29 7 32 -18 -2 -5 -1 15 -17 34 8 -85 23 21 39 -6 25 14 36 3 -4 -24 4 12 -5 -28 13 23 -14 54 21 -36
4604 -36 26 -37 25 -24 -12 13 11 2 0 -59 42 -36 6 31 -32 78 11 23 -36 3 -48 -43 38 -49 21 8 22 19 -29 57 26 19
4636 19 25 -6 -7 8 22 -36 12 53 21 29 -39 11 0 1 -20 42 10 6 26 38 -15 -36 -9 34 11 -33 24 -36 20 6 15 63 -29
4669 -29 -39 -1 -31 6 -20 -14 16 29 -18 21 3 26 -40 2 -7 -21 -20 30 12 -20 -2 -57 56 -39 21 -4 -10 -7 10 -66 -15 -11 -14
4702 -14 -22 16 -11 11 4 -20 7 55 -1 -2 -32 9 -3 24 34 8 68 28 22 -38 -3 47 -10 19 15 -6 -21 -6 16 30 -21 -9 -16
4735 -16 2 -1 6 25 23 14 61 -22 -44 57 25 0 7 24 6 -47 41 -6 -39 -32 20 -12 4 9 35 23 -15 -20 8 2 -3 25 20 11 -32 71
4771 71 -3 17 64 -1 6 -13 40 -22 47 44 -48 -22 0 31 -14 2 -10 -10 29 13 18 27 -35 33 21 -36 13 22 44 -14 -20 44 40 -22
4805 -22 58 41 33 -14 11 -17 -34 20 -35 -11 54 11 -11 28 60 37 -15 40 17 13 -3 -22 11 18 -14 -5 -31 -5 45 -42 31 7
4837 7 -11 2 -41 -33 10 2 -10 -34 16 21 48 -9 21 2 -7 24 -27 30 -5 36 -1 11 -12 -14 15 34 56 17 45 -8 35 -3 -28
4870 -28 13 -47 2 42 -24 -6 6 3 14 53 4 29 27 -62 9 18 -51 53 -11 42 50 1 62 -29 37 -2 -26 -37 9 33 12 -38
4902 -38 2 -22 -4 49 -40 -57 14 10 -2 -11 44 -28 -45 -2 11 -12 -2 -33 8 15 -38 37 -15 6 5 -30 3 -17 -34 7 4 -25 19
4935 19 -2 4 -46 -4 33 31 -67 53 -9 -58 6 -7 -48 27 -13 26 13 -6 8 -4 43 14 37 -41 4 -19 10 -41 -17 12 -11
4966 -11 27 31 36 15 23 -5 9 -48 3 -47 2 6 -40 -23 21 10 -74 17 9 40 -33 59 33 32 6 49 -37 54 3 52 0 21 39
4999 39 -15 3 6 27 30 -11 44 17 -55 -39 31 -30 -50 45 -67 41 -16 -9 14 -15 -1 8 -46 -23 -8 8 16 2 21 -4 9 -7
5031 -7 -31 -15 20 -11 5 -45 36 38 -24 58 -26 53 31 42 -30 22 49 -14 42 -4 1 39 0 -22 -16 -15 19 23 2 -70 6 -1 -8 -6 -26
5066 -26 11 -37 9 -60 -33 22 4 -2 12 19 14 14 18 -41 -18 4 -14 1 54 5 72 -9 26 48 8 3 46 -26 -20 29 -1 -15 -5 -54
5100 -54 18 -10 -42 -36 -10 -41 -14 6 -30 -31 -17 -10 24 29 -17 32 -4 7 16 34 -29 16 -21 -26 86 41 8 -8 37 -66 -56 -9
5132 -9 -76 -1 5 19 -18 29 -4 -20 -12 18 34 23 0 -25 -27 16 25 12 -50 1 -1 -2 -4 28 -35 -66 35 13 -2 18 38 -40 44 38
5166 38 12 29 -12 -65 2 19 -25 29 0 5 0 -16 -28 -5 52 -10 34 22 5 -44 -20 -10 -21 58 21 18 21 -7 4 -22 41 46 24
5199 24 6 -27 20 -17 -15 46 27 -2 -13 45 10 5 13 -33 -31 42 -9 -33 -22 18 11 33 22 24 16 48 -37 -27 16 -68 -13 -15 28 5
5233 5 -15 6 -61 -65 2 2 9 -62 -39 2 -12 -22 -1 30 -48 7 -28 -74 10 -9 -11 -2 -37 27 22 -8 -6 4 -20 45 16 10 -28 -45 -25
5268 -25 -15 13 28 5 49 28 17 -42 -10 -38 -13 -46 11 -26 33 -40 -41 39 47 0 15 32 -5 30 -10 -26 17 18 -6 1 -6 2 26
5301 26 64 -34 -30 -43 23 19 3 23 -30 -60 22 -11 2 4 16 -37 -8 -15 4 29 29 -12 -57 19 -37 -19 18 -7 -19 -29 -35 -4 -5 -17
5335 -17 -49 37 -10 -11 29 -7 34 19 39 12 4 13 -30 9 -49 19 -26 -23 -3 -21 7 -14 -8 2 -16 18 11 -37 -14 44 6 -38 50
5368 50 26 14 16 -44 10 -18 -8 65 -67 -12 -13 2 -27 1 -9 -19 19 6 23 -10 -21 5 -49 -25 -15 26 -12 -44 9 -30 36
5399 36 -5 3 -7 12 9 -35 -8 -8 34 -2 30 -49 63 -7 -2 -36 29 16 18 27 -28 62 -30 -16 -13 -19 -14 -25 5 -10 25 -17 -36 -7
5433 -7 2 14 -37 -4 -14 -60 -11 -24 -53 11 13 0 49 -8 18 23 39 -20 -7 22 11 10 4 23 43 -17 53 -45 -21 36 -11 14 0
5466 0 18 -8 12 -35 16 4 -36 1 -3 -13 -7 -25 -38 18 -8 4 -26 7 3 -56 29 23 1 4 7 18 30 -34 -9 -12 -10 -4 -21 -7 15
5501 15 13 -13 -21 2 -37 -9 -12 -46 47 28 -9 -12 -2 -41 -22 -15 -35 34 -16 -2 19 -6 3 -26 -12 84 -39 -8 44 33 -19 21 20
5534 20 -9 29 -14 -20 13 7 -23 -31 -17 35 -21 2 29 57 -11 35 -13 -18 -9 -10 -62 39 18 -27 -21 -13 -47 -26 26 -24 -3 14 -42 -3
5568 -3 -25 -3 -15 0 53 -8 -45 -15 -1 -6 -38 20 27 -22 2 3 -42 21 3 5 -19 9 -48 8 -37 13 29 -41 78 30 13 -27
5600 -27 -31 30 -16 -31 23 43 36 -8 -37 -30 17 55 -52 0 41 20 -4 -10 -3 -18 -29 -12 -13 -33 62 14 22 46 1 -24 18 -25 -10
5633 -10 20 51 37 -23 -19 52 -39 3 -18 -4 8 -9 0 -52 1 7 -23 -14 -9 19 19 15 -29 -38 -19 -17 -29 31 57 -9 -33 89 5 -6
5667 -6 16 -34 6 -32 -7 -61 14 -77 18 -29 -17 -40 77 -19 -58 -7 -40 -46 -65 -26 -29 55 -48 -11 -47 4 9 -4 -5 -5 -48 -6
5699 -6 10 -29 -13 16 -42 14 -17 -6 6 -42 -27 -35 0 48 -39 17 2 13 8 -17 12 -19 -6 -33 3 -9 3 -36 41 -16 16 -7
5731 -7 24 -23 -41 -19 -2 -41 -26 -20 23 -8 -12 4 28 4 -34 61 11 -57 24 -2 12 31 -35 8 44 -33 -8 -20 3 -14 -41 15
5763 15 2 -30 18 -8 12 19 -18 -19 -33 -39 24 64 -24 7 -46 18 -22 13 -36 -2 -13 36 12 17 14 38 12 -8 -1 5 27 4 -54 0
5797 0 5 22 -45 34 -17 -8 46 -11 -22 28 2 18 -54 10 -30 -19 -2 1 -17 -36 22 12 24 -4 23 15 10 -35 35 -23 -11 6 -10
5830 -10 31 20 -31 -34 15 14 4 -31 10 13 -5 -15 -12 39 2 -32 -37 -20 -39 2 35 -37 18 5 43 -47 18 -3 42 4 -15 -31 -18
5863 -18 -11 -33 2 -13 -7 -61 -29 12 54 -3 45 -33 -12 11 0 0 3 -40 -2 0 -10 -19 7 44 -17 46 2 1 -13 -43 35 3 21 -31
5897 -31 11 18 5 -12 11 1 -40 9 -13 38 4 1 -6 33 -19 -3 -8 -29 -12 -14 44 2 48 -9 -37 34 26 36 -20 -35 -36 33 -23 -59
5931 -59 -21 28 14 -74 1 7 -15 -6 16 -21 -21 37 9 -55 -50 15 17 5 -7 38 -22 28 -11 -7 -16 5 11 -39 44 -1 -64 3 7 40 18
5966 18 -45 -7 10 -8 -39 21 -15 35 -19 42 4 22 3 -39 -18 -12 39 -31 33 -31 -13 -62 26 -3 15 44 4 -15 -29 22 36
5997 36 -37 34 0 -28 40 26 -41 41 -32 -19 -7 -14 24 3 17 27 10 -12 18 20 15 -54 2 -23 46 -24 -50 15 8 75 17 8 33
6030 33 -30 22 -3 44 12 30 28 43 -43 26 -48 -40 -55 -14 34 -30 -13 12 49 4 21 33 23 21 -70 -22 46 20 -38 -6 -49 25
6062 25 18 -14 31 -20 87 -21 12 -4 -77 14 -64 -6 -75 21 19 -49 46 12 41 -11 43 -12 -44 22 -9 -3 36 20 22 19 -6 13
6094 13 -46 8 -7 51 -9 -19 11 7 36 6 -14 28 -1 -49 -21 13 -7 20 -22 56 -36 -31 -2 40 -63 0 -9 -46 67 -13 -3
6125 -3 -17 -10 50 38 -2 5 -11 13 -52 12 9 33 48 10 23 -6 8 -3 -16 -43 41 -22 22 18 14 -3 26 17 32 14 26 4 26 -7
6159 -7 30 -10 18 -1 20 7 42 -23 8 17 41 29 -4 0 -28 43 14 -45 -10 28 -5 23 -14 24 3 1 -4 17 11 -16 10 -21 -14 -58
6193 -58 4 -1 30 47 -29 -31 -9 14 -4 32 -29 -4 -36 -32 11 -1 25 70 -37 1 35 2 6 -3 -32 -41 6 23 -65 -25 -13 -81 36
6226 36 28 -65 -7 -24 -7 -11 -4 36 7 55 54 -16 -62 29 -6 -15 24 -29 -34 -43 -17 -37 28 23 47 -3 5 -46 10 -9 -10 -6 -28 4 -18 -19
6262 -19 3 8 3 5 2 58 -36 -3 48 37 -56 -24 10 11 50 15 12 64 -53 -60 -11 8 -18 25 7 16 -38 0 -62 -9 -34 -13 -41 -7
6296 -7 18 -44 -36 -48 16 39 7 -1 -40 -24 49 -26 10 -17 26 2 -21 -52 -3 6 58 5 8 16 3 3 -28 -4 -86 -12 -12 -10 13 37 65
6331 65 9 31 -28 -12 52 -16 63 -6 16 43 17 -15 21 1 2 18 16 -7 -51 5 -2 -20 -5 29 43 24 -44 -6 -26 -32 -9 45
6363 45 19 25 23 -47 -66 -4 20 57 -34 57 26 -13 -51 -78 46 11 -13 54 -11 56 -11 -6 5 -16 15 -8 13 11 8 12 -22 -1 9
6396 9 23 -9 -41 -15 2 -15 -11 0 -90 -2 -4 31 -27 -11 11 -33 25 18 -32 14 -38 -2 -43 5 -5 -10 0 -50 7 33 -17 -19 -93
6429 -93 50 22 -11 -33 -33 27 29 -17 3 15 39 -21 4 8 55 -24 -46 -1 7 15 -3 20 -11 -38 -1 -28 -3 -3 13 -20 -7 -40 -1
6462 -1 -47 -30 23 44 3 0 -2 -47 -27 -37 -27 -7 41 -43 -2 -10 13 -43 -39 -6 -16 -48 20 6 7 24 15 -28 14 -59 63 -49 21
6495 21 -46 -34 -1 -25 -27 -22 18 5 -19 17 -35 -17 -54 -12 -37 25 12 -24 -7 -5 47 -56 -59 -95 27 45 29 17 -18 -30 -2
6526 -2 -40 -38 -44 16 8 -18 1 22 6 -60 -7 -15 21 48 29 3 21 -23 -37 4 -14 -14 13 11 -2 22 -11 -10 -50 -19 3 49 29 39
6560 39 31 22 38 -31 35 -40 -15 -38 -30 -35 44 11 15 -64 -7 -27 -20 -44 3 -7 7 28 15 34 -49 -11 1 36 -12 17 24 -57 41 18
6594 18 64 18 2 -54 -18 -29 -32 23 -13 -46 -60 -25 47 5 49 31 -53 -1 3 1 16 -26 -25 -48 -5 -37 23 -32 7 16 -7 -13 13
6627 13 -1 -33 -19 38 -21 26 -5 13 6 -21 1 -20 7 5 34 44 15 -13 39 -2 -33 17 9 -27 -31 -16 -42 -18 -54 -59 13 -27 22
6660 22 -27 -15 29 -10 20 -47 10 15 18 1 42 18 1 49 -6 2 -28 -6 7 2 -28 23 42 50 17 40 66 32 48 34 -33 -14 34
6693 34 -20 5 -47 -65 -4 12 12 -15 0 -21 16 58 0 -8 26 45 4 31 3 -39 -20 60 -4 8 29 -19 -8 -8 -38 -53 -10 42
6725 42 -15 8 -23 -76 11 0 -34 -11 -52 -30 17 -28 -20 -14 16 0 46 21 -35 30 -18 53 53 -9 22 2 -19 -44 26 17 -4 53
6757 53 -26 -24 10 -17 33 2 9 7 11 38 21 13 16 6 21 8 5 20 -10 28 -33 6 -49 -50 -18 -3 5 28 -1 -32 5 -1 10 -15 -37
6792 -37 -63 -58 19 -49 13 -13 -8 23 -12 6 -7 -9 7 -47 -2 7 11 23 -24 9 10 -12 15 -27 -19 -23 -14 9 -12 -4 38 -23 15 -1 20
6827 20 -37 18 -16 24 68 15 7 -13 -14 -39 21 -27 -28 -21 27 -54 -45 34 -1 52 80 -21 -49 -16 21 41 1 62 -22 7 28 18
6859 18 1 -19 -40 14 -39 12 6 -66 -47 22 -20 -11 -5 -32 94 -11 19 35 -29 13 -4 13 24 -4 23 -11 11 2 -40 1 -38
6890 -38 -13 18 25 -36 -25 -61 25 26 -34 -5 10 60 -32 38 -45 6 -4 33 0 31 -45 12 -28 -53 24 24 -46 -24 7 -5 78 19
6922 19 -9 24 50 24 6 2 -7 48 -7 -47 3 60 -6 -11 23 -28 40 59 -10 9 -11 -18 4 -32 -10 6 -38 -23 26 -41 -13 39
6954 39 7 17 4 67 -48 11 -81 18 27 13 20 -46 -12 -5 5 -46 -31 32 29 -5 22 47 -14 -24 41 60 -33 34 -4 -30 41 50
6986 50 55 22 32 -3 80 14 26 -61 -6 35 17 5 13 -25 5 59 20 26 33 14 -41 -13 -8 61 -12 38 28 42 3 44 41 -24 -32 -3
7020 -3 4 41 -2 -4 25 17 -5 11 -47 -26 -39 -42 14 0 2 19 48 -13 22 -42 -43 35 51 29 -14 36 30 -8 53 -13 45 5 5 -22 -11
7055 -11 -25 -1 -24 -4 23 -6 52 5 -6 -26 -31 6 -6 28 21 4 25 21 -6 -11 -14 2 -22 -19 22 -6 -21 -26 -4 -5 21 14 -30 14 22
7090 22 -41 -24 27 -35 34 14 61 -5 -2 35 -4 -45 13 35 -30 -19 -11 -15 -35 15 -10 18 -21 25 -52 4 -75 22 -17 -19 -19 -105 46
7123 46 11 -20 11 25 -49 78 50 25 7 -27 7 54 -12 15 -15 -12 -28 -12 12 -51 27 38 24 -30 18 -18 2 -44 17 40
7153 40 -22 -5 17 -10 -17 -1 -10 63 -66 -26 -1 -13 1 -31 -11 14 7 -43 49 -3 -47 -21 8 -23 -15 21 21 0 -12 -69 -7 -16 -14
7186 -14 21 3 12 -33 24 33 -2 -4 31 -27 10 14 3 -19 -29 23 30 3 -11 21 -20 41 -45 -29 42 -14 -2 34 -22 7 -1 36 -21
7219 -21 -37 51 -3 -4 19 31 -2 13 -13 -15 -63 -5 -49 -17 -37 -3 -4 52 -2 1 6 -22 -57 39 45 47 -1 5 4 -4 -5 -14 -7 1 -12 9 -16
7256 -16 10 11 23 47 -12 -12 27 33 39 -54 4 15 14 15 47 48 22 24 -22 13 8 -6 37 10 39 -28 -45 9 40 -3 -2 -2 20 23 6 -6
7292 -6 -45 27 1 25 26 53 28 24 29 -47 1 28 21 -7 -24 6 -10 -5 -15 -6 -28 94 -7 22 -10 -39 -14 8 -39 1 -13 -15 -36
7325 -36 11 9 -14 7 -58 110 -36 -31 -33 62 25 -1 25 38 -9 45 23 -31 -20 14 -18 -10 36 19 -52 -27 19 22 8 -10 8 41
7357 41 -7 42 41 16 14 16 -53 9 20 -17 -21 3 15 -14 -16 -42 13 -48 -9 10 23 -31 -32 19 26 -20 -31 11 -78 48 -15 45 16
7390 16 15 5 25 -23 40 21 24 -13 35 19 15 -9 -10 -12 24 4 35 37 -9 -2 -15 -11 23 -6 -7 28 -25 -18 8 35 -16 -12 39 -39 2 -13
7426 -13 30 43 17 23 -23 7 20 -27 -50 9 8 -32 2 -11 2 56 -24 41 -47 -9 -10 -3 -23 -2 -50 -30 -30 9 -40 -16 59 23 -8
7459 -8 6 5 -29 -6 9 24 -13 -45 10 -35 -32 7 -5 4 12 -5 2 -33 16 -20 -27 44 -12 -6 -9 -34 13 -40 -30 28 7 -32 37 24 -45
7494 -45 -2 17 37 23 -19 8 1 36 13 -14 3 59 -8 -25 5 46 5 38 10 -10 -26 -8 46 16 40 -1 45 -5 -7 16 -8
7525 -8 -29 -31 15 43 1 -22 2 -2 36 -2 -6 22 -16 12 -58 -34 -28 -24 -4 -18 -19 -11 60 59 -12 -16 9 -10 46 47 40 -34 17 -42 -24 19
7561 19 -9 46 34 17 20 13 -7 0 -57 16 -34 -24 -18 -27 15 -1 49 -12 -42 -16 7 -5 -17 -20 46 27 30 11 42 -15 27 -26 -40 0
7595 0 0 0 39 30 -22 31 -8 -10 -2 10 16 30 16 7 -14 10 17 32 -45 5 -18 16 33 -16 11 16 -4 -31 7 -11 6 -24 -32 -18 26 1
7631 1 -2 -2 -34 45 -23 3 1 28 26 39 -41 27 30 32 10 12 -15 -9 -16 62 -7 27 -11 26 -11 -2 25 -5 70 5 -34 20 26 -28 23 7
7667 7 -18 14 -9 26 -36 -13 33 -5 -2 -33 13 -3 13 -64 8 -10 26 40 -39 -3 22 -9 -9 -35 14 -1 10 0 34 13 57 -13
7699 -13 -48 17 -9 5 -5 20 -5 18 8 -6 -1 19 -58 2 20 -35 -29 -6 2 -7 -25 -67 -1 20 -14 7 32 10 -23 20 28 -18 25
7732 25 48 34 42 -30 43 -17 42 -20 -7 14 -11 -11 -29 -19 -14 -36 -8 21 -21 58 -50 16 36 27 -28 25 23 10 -1 -2 28 -3 14
7765 14 -25 -1 5 58 -12 48 19 -8 -24 8 43 13 -57 63 46 -27 14 -35 -13 -3 39 15 -1 5 -5 9 35 -57 4 -22 -35
7796 -35 21 7 -14 -19 30 -29 12 -24 45 -35 -53 27 -25 -48 -25 -30 14 26 -20 -2 58 10 -25 5 -3 -24 31 -55 26 7 -10 -2
7828 -2 -22 -67 -26 -13 15 5 -41 15 23 6 -39 4 11 -11 -28 -27 20 -15 15 -12 -24 44 -39 -2 -35 14 -3 5 25 40 -5 -19 52
7861 52 50 26 -6 -3 -44 3 -50 17 -45 -15 -15 5 7 14 -10 -28 -18 11 23 -15 9 0 51 38 -17 -30 24 20 -66 -19 -7 40 -1 17
7895 17 -3 -13 9 -4 18 13 -3 -18 -13 -54 17 47 15 -26 13 -26 -36 14 10 33 -1 -2 -34 -3 58 -1 28 23 -18 -11 -16 -3 27 -44
7929 -44 -5 12 42 46 -8 -25 48 -24 57 -36 80 -37 -12 -3 19 -22 64 -40 47 -28 -10 -9 48 8 24 23 -15 52 46 -10 -13 34
7961 34 -45 -15 -49 -23 -31 11 11 14 -1 -27 -4 57 -16 -10 42 -4 14 23 -28 2 3 12 -28 -12 -15 -25 26 3 25 17 21 40 20 42 62
7996 62 88 -17 -4 -21 39 63 -25 16 -21 -36 -27 30 -8 31 -34 12 68 -3 21 14 -29 0 -26 -2 29 -17 16 -24 -9 18 13
8027 13 -14 -10 -12 -12 40 8 -17 30 33 15 14 6 0 10 0 45 0 -11 -1 67 -1 44 58 -7 4 25 -12 -51 34 -15 -20 -2 37 5
8061 5 35 19 -79 20 -23 -21 13 -23 16 -51 24 67 18 12 -37 18 29 1 -34 -38 -60 6 -14 45 33 -2 -28 0 23 -14 24 -45
8093 -45 -67 -12 16 22 -29 19 18 -35 25 6 22 43 -46 26 -17 26 -16 8 28 -45 25 24 75 5 52 66 2 30 63 2 80 -29
8125 -29 -15 57 19 25 48 16 -1 -4 -24 -33 60 14 -15 -33 -21 13 -34 36 14 7 22 15 21 15 -22 9 18 25 30 24 17 -45 40 -10 25 -36
8161 -36 -2 -13 -35 -21 -5 35 8 15 -8 8 6 12 -3 20 -16 13 -29 -33 17 -7 45 -8 -34 -2 32 -21 0 -21 -16 68
8191F8
$$ Imaginary data points
##PAGE= N=2
##DATA TABLE= (X++(I..I)), XYDATA
0 0 0 0 0 0 0 0 0 0 0 0 0 8 -8 8 -8 8 -16 16 -18 24 -32 33 -40 48 -57 66 -80 89 -105 121 -137 154 -175 196
34 196 -226 252 -283 317 -355 395 -439 488 -543 600 -662 732 -808 891 -983 1081 -1191 1312
52 1312 -1447 1596 -1765 1953 -2168 2417 -2706 3045 -3455 3959 -4594 5424 -6560 8215 -10856
67 -10856 15732 -27660 117176 56143 -247392 31515 198787 -60098 -165783 102438 96034
78 96034 -111002 -39604 111066 -32479 -91286 78756 63076 -121213 -23352 138491 -11645
89 -11645 -141309 51296 129528 -73547 -104739 91978 72697 -93888 -37765 89211 2271
100 2271 -77888 21842 58545 -43750 -40073 53229 21830 -56716 -7236 52549 -1616 -42372
112 -42372 8845 32322 -8397 -18150 8734 6685 -5551 4668 1602 -17099 -560 26061 -2267
125 -2267 -36958 1138 43757 -1645 -50310 1218 54542 612 -53601 -113 52062 2696
137 2696 -44552 -3688 36175 6811 -25226 -10795 12848 14426 -2971 -21341 -7998 25894
149 25894 14703 -31366 -19954 34183 21608 -34294 -18908 34145 16452 -29447 -11378 24012
161 24012 7474 -15924 -3410 7924 586 -1159 -3 -5196 -405 7468 -2225 -9725 3218 8320
175 8320 -4663 -4994 6340 1277 -6820 3625 8551 -5904 -8050 9149 9417 -9855 -10601 9429
189 9429 12235 -8545 -15381 5431 16915 -4452 -20983 1201 22394 391 -23399 -1242 23964
202 23964 3610 -20908 -4034 18039 6479 -12125 -8073 6495 10949 -400 -14727 -6094 16917
215 16917 9164 -21368 -12863 23210 13499 -24646 -12584 25022 11244 -22478 -7326 20558 5465
228 5465 -15002 -1834 10074 -300 -4541 939 -1820 -2360 5298 258 -9751 764 10850 -4080
242 -4080 -11635 6947 10969 -8785 -6956 12829 4816 -13755 -181 15407 -3222 -15297 6601
255 6601 14035 -10109 -13579 10389 9962 -11641 -8136 9734 4678 -7333 -1473 4150 -463 1255
269 1255 3177 -5588 -3206 11955 4355 -16377 -3552 19733 1250 -22886 231 22805 -3442
282 -3442 -22528 4809 19199 -6685 -15016 7486 10302 -6309 -4224 5499 20 -1845 4818 -1268
296 -1268 -7642 5229 9236 -9228 -9997 11348 7691 -14376 -6172 14896 2940 -14920 32
309 32 13561 -2429 -10860 5261 8908 -5897 -5403 6927 3273 -5980 -940 4529 -1223 -3403 1637
324 1637 1002 -2659 259 1755 -2753 -1633 4193 1102 -5052 174 6545 -481 -6685 1717 7843
339 7843 -1537 -7624 2126 7599 -2483 -7591 2185 6498 -2953 -6472 2233 5153 -2144 -4204 1476
354 1476 2986 -760 -1625 414 1330 1292 46 -1966 -409 3055 879 -3850 -1149 4180 804 -5119
370 -5119 -1300 4823 828 -5429 -1315 5384 1402 -5137 -1213 5570 1573 -5207 -828 5759 986
385 986 -5247 -227 4690 -739 -4177 1217 2472 -2480 -1295 2472 -1093 -2707 2891 1834 -4889
400 -4889 -327 6876 -854 -7102 3610 7425 -5476 -6078 7671 4302 -9082 -1922 9211 -1390
414 -1390 -9017 3769 6838 -6704 -4773 7954 1705 -8288 1706 7730 -4371 -5434 7017 3155
428 3155 -7558 728 7675 -4077 -6677 6806 4321 -9168 -1898 9554 -1659 -9768 3805
441 3805 7919 -6108 -5748 7148 3255 -6449 67 5877 -1990 -3552 3881 1387 -4236 1371 4295
456 4295 -3788 -3934 4751 2112 -5932 -1106 5542 -541 -5047 1415 3848 -1588 -2076 1969 1030 -1093
472 -1093 563 890 -835 38 989 -1130 -1181 1198 467 -1589 -559 699 -462 -672 357 174 17
489 17 698 129 -542 847 1092 -677 -303 1153 -44 -902 766 500 -1672 -570 1370 -741 -1999
506 -1999 991 1378 -1691 -1048 1807 376 -1446 853 1625 -1042 -480 1843 -24 -1609 1054 1375
522 1375 -2104 -1142 2359 137 -2987 182 2300 -1450 -2177 1894 1424 -1857 -126 2088 -593 -1409
538 -1409 1803 1159 -1880 -44 2135 -685 -1948 1084 1205 -1965 -1161 1627 282 -1685 78 1294
554 1294 -517 -983 656 1003 -177 -171 662 322 -401 -158 583 279 -638 -332 507 -126 -1020 -126 773 -567
574 -567 -1151 770 986 -1026 -498 1628 330 -1619 408 1937 -491 -1271 1288 971 -1658 -519 1524
591 1524 -511 -1811 782 1150 -1655 -842 1744 -75 -1830 728 1656 -990 -656 1946 446 -1676
607 -1676 550 1536 -1075 -923 1553 45 -1944 380 1162 -1592 -1136 1694 213 -1909 566 1631
623 1631 -1104 -798 1910 367 -1724 1000 2078 -1385 -1225 2104 299 -2784 255 2458 -1457 -2330
639 -2330 1797 1130 -2681 -522 2639 -492 -2225 1706 1951 -2143 -660 3102 -44 -2977 1179 2865
655 2865 -1943 -2232 2452 966 -3161 -569 2595 -720 -2387 1430 1610 -2075 -814 2566 237 -2170
671 -2170 991 2429 -1143 -1519 2036 1099 -2348 -761 2084 -226 -2052 588 1357 -1458 -1304 1366
687 1366 422 -1563 337 1715 -579 -1124 1491 1181 -1321 -518 1667 212 -1428 217 1174 -665
703 -665 -1189 397 225 -908 -128 742 -337 -586 507 448 -618 32 1181 379 -599 136 769 -69 -500
722 -500 162 225 -368 -406 -111 -55 -175 -149 -183 -212 -132 109 339 131 0 229 447 34 -218 340 562 -277 -560
745 -560 202 330 -514 -420 157 -170 -532 43 186 -385 -60 551 -3 -445 551 878 -239 -426 559 502 -373
766 -373 -127 319 -130 -447 -142 -186 -303 11 -100 -402 -110 308 32 -99 280 302 -67 169 345 76 14
787 14 386 -36 -568 -66 470 -318 -615 125 177 -568 -311 397 46 -260 254 280 -201 254 751 35 -430
808 -430 288 518 -280 -404 321 309 -320 -568 -402 17 115 -336 -374 396 455 -488 -357 786 340 -503 289
829 289 835 -329 -220 925 -26 -1294 191 1013 -1055 -1224 1241 748 -1884 -609 1846 -40 -1779
846 -1779 753 1748 -955 -928 1816 624 -1783 225 1914 -922 -1691 1471 1244 -2129 -1089 1860
862 1860 28 -2208 322 1843 -889 -1384 1276 929 -1251 30 1590 -289 -1067 1124 1097 -1305
878 -1305 -719 1311 87 -1721 -107 1370 -390 -1341 209 715 -567 -473 662 377 -311 159 460
895 460 -194 18 669 130 -635 61 629 -350 -755 47 369 -513 -509 180 84 -166 71 149 -253 149 590 96
917 96 -341 501 731 -417 -566 583 402 -733 -449 573 -129 -845 39 357 -624 -291 831 65 -927
936 -927 459 1307 -582 -971 1222 1050 -1184 -503 1454 91 -1652 45 1005 -739 -1065 915 320
953 320 -1449 29 1294 -559 -1339 1130 1300 -1229 -554 1900 519 -1686 26 1631 -409 -1322
969 -1322 786 829 -1311 -682 1021 -224 -1350 529 1087 -1023 -805 1395 746 -1288 -160 1502 62
986 62 -1155 552 1016 -537 -762 501 124 -841 83 530 -583 -688 600 244 -871 -101 1039 123
1004 123 -624 298 877 -38 -421 217 263 -168 -46 23 -257 -77 81 -354 -482 87 145 -290 -157 318 149
1025 149 -88 86 205 26 325 242 -225 -69 549 52 -785 -130 633 -284 -897 176 574 -533 -628 446
1045 446 218 -483 251 672 -278 -319 767 514 -791 8 1023 -130 -1120 235 948 -665 -1060 405
1063 405 482 -754 -371 717 81 -540 212 466 -285 -151 865 343 -589 86 737 -149 -693 83 539
1082 539 -287 -698 3 332 -249 -541 24 242 -20 -73 332 328 -9 27 297 64 -226 232 430 -335 -488
1103 -488 346 283 -778 -578 587 197 -875 -102 795 -30 -656 334 566 -290 -138 678 219 -400 103
1122 103 503 -317 -467 361 250 -596 -431 372 37 -586 -119 417 19 -312 102 374 69 -27 172 186 115
1143 115 68 46 53 -28 -142 -167 -29 -182 -322 -30 68 -363 -230 335 217 -469 41 650 57 -374 418 667
1165 667 -259 -470 404 323 -551 -221 454 -136 -735 19 391 -468 -527 570 328 -570 25 847 15 -623
1185 -623 365 747 -283 -412 583 347 -724 -275 478 -139 -663 133 319 -389 -387 317 99 -320 117 427
1205 427 -10 -122 371 345 -213 -134 258 64 -231 -27 135 -31 -289 -206 -61 -48 -59 -77 44 151 16 -62
1227 -62 157 267 5 73 233 160 -128 56 169 -238 -288 173 45 -510 -129 327 -218 -553 130 370 -223
1248 -223 -208 436 325 -241 106 432 -12 -275 221 246 -445 -217 397 18 -662 -140 401 -185 -604 263 528
1269 528 -316 -393 437 298 -306 69 605 -69 -371 439 283 -560 -285 637 -67 -860 12 667 -374 -791
1289 -791 396 528 -543 -288 754 321 -450 146 666 -115 -463 466 379 -554 -220 496 -98 -739 36
1308 36 505 -381 -573 298 368 -387 -197 411 191 -154 159 407 62 -73 170 131 -147 -176 92 85 -322 -373
1330 -373 75 125 -362 -308 405 283 -404 -214 718 387 -472 -73 604 129 -380 202 431 -353 -383 308 23
1351 23 -671 67 546 -467 -741 543 616 -649 -490 937 430 -873 -20 1128 30 -825 303 639
1369 639 -532 -485 676 128 -740 -35 598 -412 -682 547 543 -715 -276 781 200 -689 233 810 -172
1388 -172 -526 439 380 -399 -154 414 -184 -554 259 247 -504 -258 399 4 -524 -1 473 -25 -161 219 191
1409 191 -57 161 147 -118 64 219 -161 -261 202 145 -528 -273 291 5 -362 90 288 -153 -174 246 78
1430 78 -109 266 384 -226 -142 343 121 -441 -147 347 -174 -519 113 212 -349 -227 178 27 -289 123 399
1451 399 -45 -130 402 225 -277 -70 434 92 -333 -20 129 -167 -206 -12 -103 -129 102 -15 -249 46 332
1472 332 -48 -208 262 356 -106 -102 272 181 -202 -21 77 -174 -135 121 -84 -329 63 165 -327 -288 450 235
1494 235 -400 60 660 -45 -482 305 557 -367 -309 522 181 -676 -106 485 -273 -542 268 342 -551 -259 629
1515 629 131 -579 166 666 -286 -438 551 419 -621 -133 605 -171 -682 218 539 -571 -554 583 223
1534 223 -796 -140 812 -61 -693 324 665 -302 -298 579 310 -460 53 509 -203 -437 287 160 -609 -133
1554 -133 486 -137 -494 220 426 -455 -243 550 293 -382 68 546 -21 -273 151 217 -182 -83 176 -148 -154
1575 -154 64 -125 -279 114 168 -291 -122 425 58 -347 220 520 -175 -359 448 307 -406 -59 394 -273
1595 -273 -482 311 192 -517 -77 536 -273 -631 439 512 -707 -263 955 165 -879 319 947 -493
1613 -493 -711 754 535 -946 -273 846 -241 -930 275 508 -718 -363 847 86 -790 330 806
1630 806 -588 -499 980 450 -926 64 999 -426 -977 530 631 -944 -455 800 31 -902 225 619
1648 619 -506 -387 686 184 -505 296 604 -434 -310 714 180 -725 126 724 -467 -685 521 400
1666 400 -793 -255 614 -37 -637 306 536 -339 -149 545 118 -329 279 350 -389 -150 493 -158 -614 206
1686 206 459 -567 -502 493 170 -724 -42 633 -139 -427 383 461 -267 -2 413 -39 -231 229 149 -399 -69
1707 -69 324 -284 -486 250 282 -485 -257 519 116 -542 124 617 -117 -249 432 273 -316 -40 334 -175 -319
1728 -319 239 25 -440 -61 310 -324 -508 331 227 -503 -174 599 90 -498 147 621 -159 -425 332 314
1748 314 -423 -219 366 -178 -450 71 188 -324 -132 329 -94 -369 210 392 -288 -191 534 191 -411 94
1768 94 462 -175 -355 220 182 -376 -164 190 -91 -301 1 39 -105 18 208 -71 -24 253 103 -215 136
1789 136 362 -95 -222 264 193 -294 -154 211 -103 -350 64 172 -221 -94 299 -41 -270 194 317 -245
1809 -245 -90 487 32 -401 108 456 -245 -380 278 215 -430 -225 314 -14 -470 24 360 -155 -180 282 217
1830 217 -249 -1 403 26 -242 249 313 -323 -322 311 95 -456 -66 361 -162 -449 172 343 -272 -219 330
1851 330 236 -350 10 431 -81 -274 173 205 -236 -121 286 -14 -388 -2 161 -198 -287 227 169 -284 -75
1872 -75 335 47 -195 139 315 -83 -73 211 59 -127 -5 71 -156 -150 41 -85 -161 -31 50 -168 5 179
1894 179 2 -85 119 247 -39 -74 229 74 -165 56 127 -148 -123 122 -114 -323 -2 158 -215 -216 249 107
1916 107 -287 44 359 6 -140 241 262 -196 -82 231 23 -272 -11 82 -200 -165 96 -98 -230 -18 81
1937 81 -135 -51 236 97 -179 76 234 -125 -126 194 13 -259 24 118 -235 -203 198 -57 -241 30 184 -201
1959 -201 -159 322 83 -381 87 540 -91 -369 347 430 -447 -190 554 11 -636 93 539 -408 -510 453 259
1980 259 -679 -20 698 -167 -599 427 482 -609 -244 845 122 -811 196 809 -462 -764 641 445
1998 445 -897 -288 796 -38 -835 291 749 -529 -508 758 324 -611 99 791 -276 -733 517 462
2016 462 -693 -251 691 -71 -842 203 604 -530 -543 607 276 -711 -77 697 -130 -545 377 467 -418
2035 -418 -190 488 38 -541 137 330 -344 -321 318 35 -442 56 360 -195 -296 329 248 -329 -42 460 -5
2056 -5 -237 168 240 -203 -174 213 -24 -279 19 60 -226 -125 192 -47 -204 113 192 -144 -64 259 42 -145
2078 -145 72 175 -10 -93 136 53 -171 -36 89 -61 -46 45 -41 -114 24 22 -52 13 184 -43 -72 157 165 -145
2102 -145 -1 232 -45 -242 61 145 -247 -132 124 -75 -201 127 119 -231 -98 233 -68 -261 229 311 -245
2123 -245 -178 373 96 -412 43 441 -195 -398 314 270 -531 -140 494 -48 -519 151 427 -315 -216 417 139
2144 139 -443 101 490 -219 -323 376 189 -540 -111 521 -148 -653 187 510 -380 -436 438 264 -481 -45
2164 -45 536 -26 -344 311 310 -236 -100 317 4 -297 108 216 -278 -124 270 71 -391 30 263 -129 -265
2185 -265 242 241 -125 -96 277 89 -175 -53 151 -4 -88 -59 -43 -45 -29 -119 -63 18 22 -75 -30 140 -21 -104 43 201
2211 201 70 -71 63 113 -25 -49 45 4 -42 45 -36 -104 43 28 -110 -81 141 56 -134 -17 286 54 -249 6
2235 6 291 7 -165 57 180 -86 -194 -26 91 -79 -132 6 -58 -19 51 -40 -45 68 41 -73 38 226 51
2258 51 -105 -35 196 -13 -216 66 187 -164 -190 63 76 -131 -105 131 43 -120 -82 44 98 10 -53 -26 2 116
2282 116 12 -135 60 115 -80 -231 38 239 -90 -268 65 163 -26 -211 65 155 -20 -193 102 154 -42
2303 -42 -81 85 93 -89 -45 -65 -24 -7 10 -90 -62 123 23 -156 -79 216 33 -215 21 271 73 -184 64 180
2327 180 -41 -237 50 190 -110 -160 12 53 -48 -67 -20 56 64 1 3 128 135 -32 -119 139 69 -107 -43 112 47
2352 47 -136 -41 39 1 -66 -52 -33 6 57 -133 -76 66 177 -121 -106 278 179 -169 -86 217 1 -264 -94 214
2376 214 -68 -188 31 93 -164 -13 82 -90 -59 177 54 -145 67 202 -141 -192 281 140 -280 -154 297
2397 297 6 -351 -12 212 -152 -237 115 115 -141 -111 221 11 -114 50 80 -68 47 216 -3 -210 112 125
2419 125 -223 -155 214 30 -297 -98 192 44 -187 63 225 -3 -106 59 141 -65 14 88 88 -22 4 -20 -20
2442 -20 -8 -14 -93 -35 2 0 -50 -85 73 3 -102 -4 114 1 27 -46 62 81 -45 -135 79 130 -71 -154 57 107 -140
2469 -140 -165 127 122 -168 -67 212 34 -181 30 169 -12 -123 125 116 -80 9 74 -89 -205 97 67 -188 -82
2492 -82 225 -41 -247 126 250 -109 -173 221 150 -180 -67 262 13 -255 -17 173 -44 -96 85 30 -160 29
2514 29 115 -81 -82 147 8 -107 23 94 -67 -37 111 50 -107 -13 91 -34 -67 14 -2 -62 -17 32 -65 -17 85
2539 85 -86 -15 152 60 -127 16 193 35 -124 98 191 -62 -121 106 36 -196 -23 119 -132 -128 139 71 -162
2562 -162 -21 197 -25 -218 174 190 -147 -83 278 30 -241 25 199 -143 -236 146 122 -247 -88 138 -15
2583 -15 -244 59 190 -136 -123 223 118 -206 49 266 -22 -188 170 146 -199 -94 198 33 -226 -34 181
2604 181 -106 -188 152 140 -196 -48 194 9 -119 121 160 -57 -103 149 40 -137 1 127 -53 -150 45 126
2626 126 -167 -61 133 46 -48 4 121 6 -92 47 97 11 -67 123 13 -158 52 38 -45 -69 -1 -11 -13 -69 30
2651 30 -10 0 39 55 96 -27 29 62 92 -10 -1 7 3 24 1 -52 -47 -30 -9 19 -73 16 25 8 0 2 15 -18 4 50 15 -21 89
2684 89 36 -64 -6 -8 -43 -6 16 -17 -84 -5 2 -47 -49 86 64 -49 12 55 -61 17 54 -4 -85 -31 65 -79 -102 39 24
2713 24 -65 -19 29 -14 -74 -18 33 20 -33 66 37 -7 23 94 -13 -63 11 56 -34 -24 -1 -20 -69 -51 14 -26 -45 -9 45 39
2743 39 77 8 28 23 -24 7 44 -7 22 -22 89 -1 -3 -4 50 -23 -64 114 -21 -41 28 127 -12 -21 78 37 -93 96 60
2772 60 2 -86 42 30 -118 -34 92 -59 -93 -21 19 -47 -76 63 96 -95 -56 107 18 -59 62 100 -17 -60 87
2797 87 41 -80 -34 65 75 -115 17 87 -24 -40 40 58 -69 -16 88 45 -48 -22 22 -28 -91 -11 4 -42 -40 6 -24 -82
2825 -82 -14 23 1 -89 -8 9 3 -7 61 -1 12 -26 52 77 -24 -39 33 -22 -65 -34 -4 -13 -78 -4 54 -76 -47 -13 37 -59
2855 -59 23 38 41 -43 24 -28 -72 -23 97 53 -46 -48 46 -47 -83 47 39 -47 -32 115 21 -116 -2 69 37 -80 56 25
2883 25 -4 -15 61 -47 -91 79 -8 -65 -24 53 -76 -79 15 36 -70 0 89 44 -10 -8 -23 -67 -26 29 9 -13 72 16 -32
2912 -32 -84 44 -43 -46 -51 -82 25 -9 5 -10 -39 9 75 15 32 80 59 -41 16 -31 -26 26 -7 -53 -53 -13 1 -21 -66 26 11
2943 11 -24 -3 8 77 15 40 -6 25 18 -13 37 -5 -58 -16 -8 -28 -29 0 -6 -17 -30 -5 -22 15 70 -12 1 30 48 16 -26 18
2975 18 50 -10 -45 49 -5 -84 -24 88 20 -68 2 69 -65 4 14 48 -70 15 81 -3 -27 -12 -11 27 -54 33 17 -102 -2
3004 -2 65 -60 -93 32 42 -25 -11 79 9 -32 13 43 -28 6 21 -23 -27 -33 1 33 -94 5 -28 -26 -76 -18 7 -22 6 54 -60
3035 -60 -33 12 21 15 -32 29 -61 -94 -22 0 -8 -50 -15 15 -28 -66 -24 23 -25 19 84 -1 16 7 38 -58 22 3 -60 -31 50 9
3067 9 -41 2 -9 -20 -3 8 21 -61 4 62 -82 -78 34 67 -22 8 51 22 -71 36 53 -69 -53 44 -8 -16 35 13 -53 -63
3097 -63 39 96 -51 -12 65 -5 -68 10 62 -13 -35 111 -3 -88 27 108 -9 -70 60 2 -100 -47 13 -16 -61 -14
3123 -14 79 6 -61 48 -5 -27 -26 80 -12 -102 4 31 -31 -34 12 -10 -91 -7 26 -26 -60 42 17 -42 43 90 12 -66 -16
3152 -16 33 -11 -72 12 13 -37 5 -17 -16 -45 33 -1 -46 2 80 -44 -19 31 14 -52 -10 47 -32 -53 4 17 -46 -40 89 10 -89
3183 -89 44 77 -51 -78 33 44 -79 6 86 -7 -42 11 57 -48 -62 0 34 -84 -48 -15 -58 -71 6 56 -101 1
3209 1 46 4 -77 8 101 -48 -20 88 56 -76 6 92 -44 -101 17 2 -55 -84 26 35 -97 15 47 9 -60 35 24
3236 24 -40 -38 62 29 -87 20 46 -69 -37 20 -10 -83 16 33 -87 -43 79 16 -28 23 100 -26 -25 21 19 -31 33 101
3264 101 -48 -52 13 25 -4 -52 78 -69 -37 1 -8 -97 -32 -1 19 -17 33 5 15 81 23 13 1 -2 7 -36 -31 -44 -40 13 -16
3295 -16 33 32 37 -17 -27 11 20 -31 -2 -18 11 -6 20 22 15 26 6 -22 -31 -5 -1 20 35 -4 23 35 -3 -10 15 -10 39 22 26 -34 -36
3330 -36 -36 36 34 -44 35 -12 -27 -46 -1 33 -31 12 55 -31 -68 14 -14 -25 -2 57 8 57 -2 -6 25 -63 20 -2 -59 56 -5
3361 -5 -50 6 -51 28 -34 58 16 -23 -28 40 2 -62 51 23 -21 -12 5 -27 -87 25 -1 -5 -11 2 -29 3 37 26 -32 -40 66 -2
3393 -2 18 -29 74 -47 -64 10 25 -28 -12 37 -19 -18 -14 42 -88 -27 78 63 -5 -20 66 -23 -30 -3 68 4 -42 64 -2 -10
3423 -10 -15 46 18 -60 28 22 34 -34 21 -13 -13 -9 -14 52 -21 56 69 -19 2 35 31 -91 -6 23 -29 39 -13 -1 -17 46 -21 -52 -24
3456 -24 11 4 -7 -43 44 -24 -13 15 6 -6 1 -3 -10 -23 -22 10 -7 14 24 4 -42 7 17 8 -34 20 37 35 16 -16 4 5 20 50 -50
3491 -50 12 43 -44 -7 -44 30 -16 19 18 14 11 16 38 7 9 5 -17 -22 37 57 42 6 -17 6 10 -16 -54 0 -58 3 -41 3 26 0
3525 0 35 20 7 -35 -22 25 26 -20 -6 17 -31 -16 -52 19 -15 -7 -15 36 -38 -34 27 26 -49 53 87 -44 -22 6 -8 -43 22 32
3557 32 2 -28 44 -3 -50 -17 10 -70 -4 61 13 -29 3 23 -26 -42 44 59 23 -32 3 92 -30 -52 32 -20 -26 41 25 -3
3587 -3 -60 48 30 -4 54 30 25 0 40 33 -113 -12 13 17 -10 -7 0 -13 -13 -37 -14 -47 -50 20 -35 -34 -15 -10 -21 -13 79 -13 -59 -31
3621 -31 15 -27 -58 29 -25 -65 -54 14 2 -26 -84 -22 1 -46 19 19 -41 36 35 -45 0 14 106 -52 90 58 11 -77 -20 -39
3651 -39 -26 -60 14 20 5 -5 21 -21 2 20 -10 23 -15 21 19 54 -56 -7 -20 -35 37 -4 -20 9 15 -18 -44 27 28 17 20 37
3683 37 -9 -6 -13 -15 21 -38 13 25 -16 0 29 -29 -49 -37 -4 15 -61 -15 -43 -19 37 31 12 6 4 11 12 22 -10 -43 5 18 -20 -24 34
3718 34 -29 -20 1 -24 37 12 -36 41 14 -12 10 -17 -22 -3 -32 -10 -11 19 6 -32 -7 -36 78 16 -14 -32 -3 49 -33 -36 13 64
3750 64 -22 -24 13 -30 -17 -65 25 -15 -56 -21 9 -47 66 14 -16 -25 -19 -66 17 10 31 12 1 11 8 -27 34 -34 11 -24 -46 4
3782 4 -18 -64 -9 -9 -6 -36 11 72 1 -40 35 75 -16 10 33 -25 -2 -12 46 35 -18 30 42 0 -1 3 0 7 -44 -40 0 70 44 45 -43
3817 -43 7 1 14 -45 27 61 -4 4 48 39 0 -32 -21 -18 -49 25 -12 5 11 11 -6 27 13 22 -6 22 30 -63 47 11 14 48 3 -23
3851 -23 4 -16 20 10 -23 -21 2 -3 -15 -30 60 -20 -7 -5 28 -39 -5 18 25 -27 -4 1 0 -3 -19 38 -38 56 -3 -18 -51 -14 1 -16
3885 -16 -3 11 49 33 3 -45 -25 10 -36 3 -60 -36 70 16 28 -65 33 8 16 11 12 -6 -33 36 -9 -28 -37 52 25 13 2 28
3917 28 7 56 -18 -29 7 3 -14 58 22 26 13 -4 31 36 1 27 28 -47 -28 -32 22 -10 0 17 -30 28 20 17 -8 7 22 -50 36 35
3951 35 43 51 -16 -29 32 -3 -55 -12 60 -36 -19 38 14 -20 -40 -12 49 3 15 58 5 69 -7 30 -55 56 7 -23 7 -20 24
3982 24 12 8 -13 7 62 -60 31 25 -10 21 67 -38 -31 45 12 24 1 -5 -28 25 -53 46 31 -24 -92 -10 -14 -31 -42 35 -11 -6
4014 -6 -5 21 -4 -34 37 31 11 -7 32 -7 -25 -15 36 -24 -1 13 61 -43 44 1 -27 -25 20 -5 22 58 -10 -7 18 27 -7 9 -42
4047 -42 18 -28 38 -1 20 1 32 -6 1 16 26 48 -2 -30 45 -20 -10 40 31 78 -2 0 18 7 19 30 35 -26 -47 2 12 -53
4079 -53 -4 23 -20 -7 19 -13 -17 -1 42 -2 24 69 -19 4 -45 10 22 -9 -9 -9 72 -18 66 20 -21 35 44 -19 -58 -17 41 18
4111 18 40 14 51 -5 24 -17 -10 -43 63 7 -44 -45 30 17 -12 -33 54 21 20 -3 -30 -37 -46 60 35 -23 20 3 11 13 11 7 4 -26
4145 -26 -27 -21 -1 24 -2 15 17 5 -3 -5 -17 27 -6 26 4 -37 42 36 -42 -27 25 37 33 -23 41 0 -5 -7 -12 -15 49 -16 -50 -7 17 -61
4181 -61 16 -2 -58 -4 -7 20 -1 -5 -11 -35 26 12 -15 -8 -14 -28 -68 34 11 6 29 3 4 -15 10 0 -41 10 60 -26 22 -10 9
4214 9 37 6 10 10 16 -11 -15 -6 -25 2 14 -31 -4 20 6 -17 -39 43 22 23 -14 24 8 15 6 27 33 -16 38 -2 -46 30 -8 -8 0 37
4250 37 -35 19 -10 20 -9 -18 10 9 3 -27 17 -32 -4 0 40 23 52 25 -10 19 -11 -7 21 -25 76 -53 35 0 2 -19 -13 -41 18
4283 18 14 -24 74 -12 -38 -46 26 3 -72 45 12 47 -48 -22 -27 27 18 -50 -16 -57 -47 31 33 -2 -25 25 11 -16 -12 -25 -44 -22 45
4316 45 -14 -1 3 34 -22 -3 41 16 -3 23 32 60 -32 25 8 -28 -16 -18 -4 9 -8 10 54 18 -31 31 45 -22 34 51 35 -59
4348 -59 60 18 -4 3 -44 12 -27 11 52 2 -15 59 1 7 22 -3 8 6 -12 -16 -48 22 -18 -25 -34 -2 37 -31 27 44 56 -19 8
4381 8 34 29 0 -43 -11 -22 7 -23 53 27 19 -49 -1 -18 22 -22 -17 -32 -31 -11 29 -11 -3 -10 -37 13 -17 14 -27 -26 -5 5 20 -32
4415 -32 1 38 27 -58 -2 1 -26 -23 -22 -7 -5 17 -16 -2 71 23 38 29 -17 61 -4 1 -16 4 54 57 -19 39 24 10 6 -64 -11 5
4449 5 3 -38 -28 15 -48 14 -10 24 30 -6 1 62 -22 -10 36 -18 -45 -5 26 -11 14 -17 -9 3 23 0 27 6 -11 12 -27 -3 -42
4482 -42 -16 -9 -9 -28 32 42 17 34 -38 -55 68 -4 -22 -24 5 17 -34 8 -22 0 -34 44 38 -1 -41 23 52 -10 -6 -38 18 -49
4514 -49 -11 4 -39 17 -4 -15 9 52 -7 -15 43 2 -11 -3 0 -13 20 31 -22 -33 -1 5 23 23 -38 -11 60 3 -10 27 -17 -62 6
4547 6 -9 27 18 -69 32 -33 -17 0 39 41 20 8 21 51 -22 -25 -16 30 8 -20 -50 -33 -10 -33 0 13 -5 30 -16 37 -3 -41
4579 -41 55 -6 39 -24 7 7 2 11 29 45 -4 -18 1 -21 13 -8 18 -5 47 17 -43 67 7 -8 -10 -30 -49 -21 19 -9 26 28
4611 28 -24 -12 -34 -17 21 -16 -40 -9 -57 -55 -17 -18 29 -6 -36 -3 -12 24 -15 -29 2 -70 -7 -8 -40 15 -23 17 11 20 28 10 47 22
4645 22 -37 6 -3 -21 -11 -3 -23 -5 -18 -18 -17 5 -14 -34 34 -21 39 0 41 -31 37 2 -7 -52 24 3 -14 15 -20 -12 11 -47 -20
4678 -20 26 -16 -12 3 -10 5 5 20 41 22 10 11 51 12 33 17 6 1 10 -36 -1 -6 35 46 -41 7 7 -13 -26 -36 4 22 -17 -1
4712 -1 -27 -62 -39 11 -26 -37 5 2 23 25 29 7 28 0 0 -8 -43 0 -51 -25 22 -33 21 -12 -37 22 25 5 6 -21 3 10 27 0 11
4747 11 12 29 -33 -23 41 -23 19 24 -8 -13 -24 26 -7 2 36 -22 52 28 34 34 -26 -15 19 33 -1 14 70 -15 14 -18 -16 29 8 19
4781 19 -40 -29 -20 -11 -31 35 29 51 24 32 -10 -24 -11 -47 -22 -1 -11 -13 -40 -3 38 -2 -23 -8 51 24 34 -31 47 61 19 4 -21
4814 -21 9 16 8 47 7 56 54 16 -12 -14 46 28 -48 -30 -31 35 -12 33 23 -31 -16 -5 2 4 -1 -23 -14 1 -8 -30 -10 -113 -39 12 59
4849 59 -29 -9 4 35 26 -27 -23 3 23 14 -24 21 8 2 34 1 65 9 -27 -11 29 -14 6 51 9 15 30 3 -20 21 -3 6 -32
4882 -32 10 -14 -54 -9 22 -15 -2 25 5 51 -36 28 -1 -29 5 23 24 35 -2 -20 -18 -12 34 -31 -20 -12 -24 -10 34 18 21 -15 -6
4915 -6 -21 -41 6 11 27 -37 3 -53 -1 31 13 27 24 44 -12 -15 -18 -25 39 -12 -5 0 -8 34 -30 30 23 -25 71 2 -62 -38 -52 -37 19
4950 19 6 -7 11 26 -22 22 -22 60 12 -73 -5 -3 30 35 -52 -20 -12 19 8 4 6 16 -30 25 19 -58 -31 5 -45 49 35 46 -23
4983 -23 -21 -27 -14 44 -18 5 -34 -35 31 4 -12 -22 -14 -8 12 -40 -16 13 -25 -35 50 -22 47 26 -35 11 22 19 -39 -19 -10 -11 29 19
5017 19 12 3 -24 10 -3 28 33 -14 6 30 19 11 12 -14 -4 64 3 -62 -5 -40 10 9 41 14 10 38 -13 14 -25 -31 8 1 -18 -34 22
5052 22 5 27 42 -13 34 0 -42 43 25 -1 3 18 -15 51 -10 -27 -13 -18 -90 3 30 21 -1 4 42 -14 27 -11 -23 24 14 -21
5084 -21 -2 27 20 -7 21 26 -14 18 -32 3 -31 -46 -22 -2 -27 44 -8 -17 -22 -16 -15 25 -34 27 25 10 47 26 16 16 8 -8 -41 -12 25
5119 25 18 -11 79 -25 -2 11 20 -10 -61 31 -92 48 -18 -16 -35 2 9 26 -16 -55 -4 -30 16 23 15 8 -25 31 -29 34 5 14 -42
5152 -42 36 27 -24 81 25 -30 4 17 35 18 -41 26 -22 28 31 46 34 -9 -49 40 3 33 36 3 -16 -74 -16 -47 28 -5 -4 60
5184 60 -41 -1 -11 3 69 15 -10 25 -22 49 6 23 28 -13 42 -40 -36 11 41 -27 -20 39 -16 -63 -65 -10 -59 18 -1 41 38 4
5216 4 56 -75 9 -1 2 -16 -16 -40 15 -7 43 19 10 19 14 21 18 9 -66 6 66 9 27 53 28 -44 -48 64 7 10 -7 11 -4 -6 -18
5251 -18 -18 11 -14 21 35 -6 -4 21 32 -5 -41 -2 -14 15 -14 5 -1 -27 43 16 -44 26 14 -72 -6 -22 42 28 41 -33 -5 11
5283 11 -42 26 -4 29 49 -5 -26 -7 -31 -10 35 -24 -19 52 35 -17 31 -31 -3 5 -2 15 -23 6 -8 -53 2 2 51 -8 38 15
5315 15 -27 9 -53 25 -3 31 -21 -34 1 14 10 -6 27 2 18 19 -4 16 -12 -39 -29 15 26 -37 -31 38 -6 -22 49 -1 7 54
5347 54 -40 18 29 -16 56 53 25 -2 4 25 -49 7 -11 -7 18 28 19 15 3 -21 -25 11 -15 -30 46 -53 -44 1 53 -6 8 -42 10 -18
5381 -18 -8 1 15 46 17 56 -13 39 7 22 6 0 71 15 14 10 30 34 -63 32 17 -47 8 11 -8 -23 -14 -10 -38 15 -10 12 -27 11
5415 11 10 8 -20 14 -14 -8 -31 38 -14 0 -24 -8 5 74 24 -6 -7 24 -28 8 -33 -6 30 -7 25 47 -3 50 -46 -11 -27 -11
5447 -11 -21 9 -33 26 20 -31 49 -49 -1 -33 -24 -5 -8 -48 23 -12 -11 -38 14 -64 -34 -22 -48 43 1 59 18 4 10 32 -24 0 -8
5480 -8 -6 10 -13 -23 -37 -6 27 -6 3 22 10 37 -18 1 -21 19 45 31 28 -6 -28 -12 25 3 37 -7 -32 -31 -41 -19 9 -16 -83
5513 -83 11 -22 52 12 -27 6 -26 15 -8 -8 -13 32 16 11 -32 -30 -1 1 -4 -61 15 0 4 40 -2 -4 -1 11 7 25 14 44 -21 5 30
5548 30 -2 -25 0 -4 4 -6 16 22 -14 -3 -36 -14 25 18 4 33 -2 64 18 -3 -78 -25 12 4 50 5 1 17 -21 11 15 -7 -26 -54
5582 -54 3 -45 -10 -26 15 17 -17 -9 4 -42 -16 8 -48 11 24 52 32 22 17 9 -31 -32 5 -30 -2 51 22 1 -16 -22 46 8 -52
5615 -52 -50 -37 -6 -53 -8 6 -46 -24 -60 53 14 -2 30 -34 53 50 77 8 3 -11 14 0 -6 -28 -23 -26 -5 47 55 9 -12 7 12 15
5649 15 12 -8 -7 -21 -10 -10 22 -37 44 -12 16 -41 -44 -13 -33 -40 1 -18 57 48 42 -28 10 27 32 27 -39 -23 9 -19 16 4 -32 6 0
5684 0 39 -1 -23 28 -21 36 40 -60 -4 37 12 35 -7 24 54 15 102 -26 -66 74 26 -10 -12 -4 18 9 -37 1 15 19 19 59
5716 59 9 -53 -41 41 38 33 18 -1 32 -4 2 -5 30 8 40 -43 48 -37 16 32 41 40 -2 -6 26 -11 -17 25 10 28 47 57 50 23 3
5751 3 9 -2 31 -5 -48 42 57 -12 -3 -80 -29 39 -18 43 -13 17 -13 -16 34 16 24 -29 34 24 26 15 11 8 -34 -16 -45 17 -2 6 -14
5786 -14 -10 -12 60 3 -19 12 -21 35 -11 -16 -46 10 -21 18 39 3 -6 13 43 21 33 0 -12 15 20 -9 -7 26 12 -39 11 45 44 4
5820 4 39 26 -35 55 -28 -7 17 -5 -6 -20 27 -15 -30 -5 -2 -9 -7 -10 0 -58 -51 27 5 30 -46 63 -30 21 -20 9 -20 -12 12 -8
5854 -8 33 3 -10 -7 -3 4 33 8 -11 -32 -14 -8 3 -1 -1 -12 -5 -23 -13 48 52 -19 17 8 -17 -16 15 38 7 -3 19 -39 22 33 18 48
5890 48 15 -18 -39 -48 -1 10 10 -10 -4 8 -11 -43 21 -11 -37 31 -59 -53 -13 -3 51 7 73 -33 -19 46 -28 17 -11 -20 14 6 37
5923 37 10 -1 0 -10 4 11 -58 -2 -25 63 -7 7 40 4 -6 -12 -14 15 17 17 -13 -4 59 -11 47 1 8 -1 39 79 -29 -36 11 -17 4
5958 4 -29 -28 -4 -5 15 -10 32 -2 -41 -16 3 -64 -16 -37 -19 -15 -3 -24 -13 -1 -3 12 -75 21 -44 6 6 24 19 44 -2 -5 -7 -10 14
5993 14 -1 -32 6 -37 -26 -12 -7 32 -10 -19 9 -36 7 -22 20 -14 -24 -27 -14 -16 36 48 3 31 -54 25 -4 46 23 -24 3 -18
6025 -18 9 -34 -29 -26 6 32 -42 -2 -25 1 4 -16 11 2 6 -31 43 -23 10 5 -3 7 -16 -5 7 40 27 36 -31 49 64 -28 26 0
6059 0 6 33 16 -44 -12 -13 56 -5 11 24 -24 -43 -17 -52 41 29 -31 -23 -37 -32 0 16 18 -25 -37 -58 8 -9 -29 11 29 4 -12
6092 -12 13 7 30 15 -8 -8 13 7 16 -3 -37 -5 34 -13 1 -3 -23 27 41 -35 -28 -44 -58 28 -42 -38 -39 4 7 -19 69 -30 -12 -8 39
6127 39 14 2 -6 28 -1 24 13 61 -20 -31 48 25 -33 -17 -53 7 13 4 21 11 25 18 -14 -10 1 12 5 -22 -18 30 51 6 -39 5
6161 5 16 -26 20 -29 -8 -32 28 -1 13 13 29 -58 10 -66 28 -30 -21 7 -9 4 -21 17 0 10 34 5 -23 37 -7 -2 48 -32
6193 -32 25 15 41 -10 7 49 4 -6 -1 -76 39 42 1 -27 51 -8 13 -33 -4 -39 -16 -15 -27 -36 -19 14 -12 -14 -46 6 4 49 -33
6226 -33 19 -38 5 14 27 -54 -9 23 -1 49 -1 20 -14 5 25 -27 -7 -11 -56 -23 -13 26 18 -34 29 -4 -2 -5 31 -12 22 -1 -41
6259 -41 -20 -18 3 1 -24 -6 -24 6 -53 -12 -21 -15 -23 7 -25 -11 18 21 24 -35 45 -20 -7 -5 15 -49 7 5 -41 -25 31 -15 15 -65 -40
6294 -40 -57 -29 40 41 16 -13 35 2 -10 38 12 -32 -66 -46 35 -23 -11 67 -2 -19 27 5 31 9 7 -41 33 24 -50 3 22 65
6326 65 58 1 15 -4 -49 -23 42 16 10 -33 -19 33 55 -15 25 50 -22 -30 -2 9 1 2 15 -21 -50 -23 19 21 -9 -33 24 25 -5 -14
6360 -14 -2 19 -2 15 40 -8 -7 -58 36 -13 3 41 5 8 -13 -7 7 12 33 5 -12 27 -2 -28 -13 6 15 0 -5 6 -4 -12 44 29
6394 29 64 -5 -60 13 -64 21 21 -6 0 -41 30 11 9 9 69 -8 -8 -16 27 23 69 -6 7 -21 30 29 -16 23 -9 24 44 1 -10 -12 40
6429 40 25 2 21 33 25 -28 -31 63 -29 14 -33 55 -14 40 -7 -3 14 10 -4 29 -68 21 80 32 43 -2 1 -5 32 -33 42 -12 -20 -18
6463 -18 89 -57 9 -4 23 37 12 43 -41 48 -31 0 7 -34 58 43 34 -8 44 26 33 8 -6 29 -12 34 18 18 39 49 1
6494 1 34 33 13 -37 39 -11 68 -46 16 10 -16 25 -3 1 -21 -15 11 -26 -45 -65 -79 -5 -3 5 1 -12 -19 -2 36 0 -55 40 -4 -13 30
6529 30 5 59 49 -29 -17 3 0 78 24 40 -34 39 0 34 33 -3 23 1 18 -21 -41 -29 11 35 10 -3 -37 -16 1 -9 24
6560 24 25 27 47 64 13 24 16 45 25 -12 90 -18 26 32 10 7 42 0 4 -1 -45 9 -10 5 53 -60 25 13 10 -18 4 27 18
6593 18 43 44 3 16 47 42 -7 38 11 -26 20 66 2 27 -1 0 8 -2 -47 2 -1 18 -28 68 41 5 5 -36 37 -19 9 14 12 26
6627 26 -7 -42 11 -26 33 9 -25 21 16 44 16 19 -45 16 23 -4 22 74 34 53 46 -7 -5 -19 -18 -39 -18 -27 -17 1 39 -2 -37 40
6661 40 -31 18 1 -23 -15 -3 -18 -2 -31 3 9 20 -26 -17 -10 -9 -130 24 -23 28 1 40 9 -12 -53 -56 -17 -14 56 38 28 -34 3
6694 3 46 10 14 -2 -9 59 -40 2 -44 -28 -32 8 -33 6 18 -16 -13 -34 -5 44 -21 34 8 26 -39 8 -14 38 4 10 -1 10 27
6727 27 -34 12 27 7 16 -39 30 20 -20 15 35 6 0 11 5 6 32 -25 -4 66 6 -62 12 37 -17 -19 37 -13 3 -52 24 22 -7
6760 -7 -31 -47 24 -17 -45 -38 -5 -14 -3 -25 19 10 -6 28 -8 13 -2 -35 51 -64 0 -25 -20 14 -55 -12 20 24 -61 -33 -42 -12 17
6793 17 2 -44 2 1 -53 -65 41 -9 -12 -16 7 -20 21 29 -50 26 -18 -4 53 13 -38 67 22 -16 3 0 -2 4 -34 26 42 -50 37
6826 37 -6 10 5 19 18 9 -7 2 13 -39 -39 -33 -21 2 -4 -33 34 -44 72 -8 -4 14 -12 15 0 7 13 -1 31 -18 26 -2 49 26 9
6861 9 21 28 21 -13 23 -18 7 32 -22 30 14 -20 -3 -40 29 22 -76 -5 -83 6 -18 -29 -26 16 -45 28 -5 -53 -13 -29 8 1 12
6894 12 -15 -3 50 1 13 -24 8 2 -39 -21 22 1 -15 4 -18 -46 15 10 37 -16 2 12 7 19 -13 11 -22 -6 12 -5 20 35
6926 35 -9 -23 -33 29 -52 -38 -22 14 23 -9 51 -38 15 0 14 -33 24 18 20 0 -30 5 35 1 50 -35 -2 -26 2 64 -64
6957 -64 -32 -33 -29 5 29 -22 36 -33 -40 -9 1 35 -6 -2 56 -25 102 -38 -33 33 3 12 -22 6 -6 13 11 21 -8 13 -58 1 38
6990 38 -26 10 -20 -7 -21 -29 -8 -9 -23 -29 9 0 -61 42 44 -35 -15 -29 25 13 0 -16 -33 -10 16 16 1 9 -4 -41 -19 24 17 -46
7024 -46 -20 -48 40 63 29 -27 56 44 -20 -10 13 -11 13 69 -18 -34 -3 45 51 -53 -23 8 8 -42 28 29 -33 -20 -7 -3 -2 64
7056 64 -50 -29 -42 107 30 1 -2 40 10 0 19 4 28 -59 -17 28 -7 11 -27 15 1 -16 49 -21 11 56 40 58 -20 -2
7086 -2 -12 -26 27 37 60 13 32 2 30 2 1 -35 -17 -30 35 -11 -6 2 1 -27 5 9 14 28 33 43 30 -9 -35 30 22 40 -6 26 -16
7121 -16 -2 -46 -3 24 -13 -17 -25 2 47 -5 -39 -10 5 8 16 53 16 60 22 39 -49 -44 -34 30 14 31 -47 -1 3 40 8 -13 -14 74
7155 74 6 23 -14 16 12 36 43 25 5 -11 34 4 41 73 51 2 71 9 -41 -26 0 12 42 -14 -70 32 0 -22 -11 -1 33
7186 33 -9 13 -10 8 -36 53 -41 17 -47 -21 38 13 1 20 -6 13 -12 -5 60 -17 -9 8 68 18 26 -20 -26 -23 -27 6 4 3 46 -49
7220 -49 -21 -5 36 -12 -79 -43 31 -38 -14 51 13 25 5 -35 -13 16 -2 -18 -44 51 -18 -2 13 15 10 -12 -16 13 -1 58 46 29
7252 29 -38 20 14 56 3 1 53 -4 -8 -16 -19 13 8 38 1 26 2 -27 4 -12 27 -22 -37 22 77 4 6 50 12 -9 39 -32 39 -32
7286 -32 -12 -4 -1 -17 -17 -12 5 68 4 17 4 -19 -68 1 36 64 66 42 19 -37 15 -47 64 55 16 -6 -14 -51 -30 33 45 -37 -17
7319 -17 3 -21 29 -7 17 5 -16 -42 23 65 -29 -18 14 9 -13 4 18 14 38 -42 -6 0 8 -13 -20 -24 18 35 -10 9 7 5 5 -45 -12
7354 -12 4 35 10 -50 -15 -20 -17 53 -28 13 43 -3 33 30 34 -15 -35 22 38 5 27 27 -19 3 56 -27 -23 0 -38 31 -32 3 28
7387 28 10 11 18 -95 11 -33 30 27 -11 49 -40 54 -8 36 -28 -20 4 -7 -14 5 51 26 21 -27 -5 -50 37 44 -2 -18 20 -6 16
7420 16 27 -1 14 -7 -14 5 -44 -16 32 6 -34 -24 -20 23 37 -14 31 1 -33 12 24 2 7 14 -25 -18 23 -10 -66 19 -17 22 -5
7453 -5 -10 -2 -48 28 -25 -27 5 -39 -24 21 32 -1 -2 -45 -13 -17 -8 30 -38 1 5 10 -25 -35 -19 -6 -17 -19 -5 18 -20 -18 10 50 -62
7488 -62 32 13 35 -12 -21 -10 22 -8 -30 -47 26 14 -57 -36 -25 7 25 27 -40 9 -37 28 19 -18 37 14 -22 31 -12 -13 -11 19 -33
7521 -33 15 29 -13 -7 11 78 -24 -15 -28 7 46 6 8 16 4 -27 12 12 51 19 -9 -39 6 30 33 23 -19 29 -14 13 -30 28 33
7554 33 -1 3 21 -77 2 -15 -37 -5 16 21 10 43 -26 -24 42 13 -6 -21 4 36 11 24 -8 1 10 -13 -28 20 1 -9 27 -21 5
7587 5 -16 38 67 5 -1 -30 4 35 -56 14 -37 -36 6 -17 -4 -2 43 52 -37 29 -20 18 12 12 22 -26 36 -5 26 4 20 11 19 -6 24
7622 24 -7 9 -1 36 12 13 16 -17 -19 -1 81 29 -37 -7 -26 19 -7 -23 18 -45 -5 -22 8 -5 -64 18 49 56 -29 48 -33 -25 47
7655 47 -31 28 -42 -11 15 -7 -44 13 -9 23 16 33 -4 28 53 -5 18 12 -31 13 -6 37 44 -21 18 19 -19 -17 36 -27 -19 -29 9
7688 9 19 -16 -116 -14 -7 18 26 -29 24 -55 20 -20 37 9 5 3 49 1 54 81 31 15 16 10 70 22 35 50 10 49 23 -2 44
7721 44 1 13 -52 11 -23 -12 3 3 13 33 34 8 32 21 -1 -13 -32 47 -59 -5 -10 23 -25 35 46 44 41 -5 -1 1 -14 -2 -8 6
7755 6 25 -8 66 -4 15 21 35 -16 14 -22 52 46 -18 9 18 37 29 -17 7 2 15 -45 3 44 -13 37 8 -25 -37 -11 -2 -2 0 16 31
7790 31 18 -38 2 -14 -53 -16 18 27 -1 -27 -7 -37 -49 13 -5 12 29 -7 7 -3 -7 -74 -12 -21 6 9 23 35 -40 50 -9 38
7822 38 -38 0 11 50 12 23 37 -10 35 -16 -17 22 -16 -11 53 -8 -13 -39 -22 53 14 18 59 -35 -65 -12 -38 -7 23 7 -26 71
7854 71 -24 -3 19 -49 -12 -33 -8 61 -38 49 21 -10 -43 2 -45 18 43 40 23 -5 0 37 20 16 0 -10 9 -48 9 13 -11 25
7886 25 41 12 -55 53 26 13 1 58 27 31 -10 -4 -20 -4 -20 71 30 -16 -40 -10 60 13 -2 -28 70 -12 -21 46 6 48 -20
7917 -20 -24 -46 -34 -52 -8 38 -50 -18 -10 13 18 38 6 -3 -52 -30 23 61 -45 31 -12 -56 34 19 -17 -6 33 -32 19 -44 9 -2
7949 -2 -27 22 -7 12 17 -22 30 47 1 40 -35 25 -11 -15 -6 0 -5 2 -42 -11 15 -10 0 51 2 -18 38 -16 -44 -68 23 4 54 -42
7983 -42 -41 -7 18 -3 19 2 -16 70 28 -4 -8 -5 12 18 -22 64 -50 7 4 2 44 2 -41 -24 31 24 -14 -53 25 5 -15 17 27
8016 27 7 35 -2 -15 17 -35 -40 8 -25 -28 -1 -5 -5 10 6 -27 -44 -14 28 -24 23 47 24 -13 -15 -35 -24 18 25 47 34 -2 11 7
8050 7 -62 -17 -13 16 8 -30 3 -65 7 26 53 -2 -33 -26 17 7 25 3 20 -25 25 1 -3 -51 -21 33 23 -7 -19 2 -54 -4 -47
8083 -47 -43 -13 22 -3 -25 -11 -1 -31 -16 31 19 -3 -4 -42 -50 4 1 18 2 -15 -7 11 -37 -7 21 59 3 -22 34 52 -16 -7 -38
8116 -38 13 26 38 36 14 -43 11 4 -22 21 26 -19 40 3 17 -19 -15 3 -23 33 -19 30 -5 -25 17 -17 -18 35 12 -56 -18 10 -20
8149 -20 17 16 -25 -13 25 34 2 11 -11 24 5 -21 14 -20 25 4 9 -19 41 -23 11 -45 46 30 8 13 51 44 39 42 -31 60 35 26 -17
8184 -17 -21 10 -34 -24 6 7 1
8191A
##END NTUPLES=NMR FID
##END=
