##TITLE=1H_AM_NV VINPHOS
 CDCl3
 8 sc, 
 9.9.2024
##JCAMPDX= 6.0         $$ Bruker NMR JCAMP-DX V2.0
##DATA TYPE= NMR FID
##DATA CLASS= NTUPLES
##ORIGIN= UXNMR, Bruker Analytische Messtechnik GmbH
##OWNER= root
$$ XWIN-NMR		Version 3.5
$$ Mon Sep  9 15:35:42 2024 Russian Standard Time (UT+4h)  she@DPX200
##.OBSERVE FREQUENCY= 200.1318
##.OBSERVE NUCLEUS= ^1H
##.DELAY= (6, 6)
##.ACQUISITION MODE= SIMULTANEOUS
##.ACQUISITION SCHEME= undefined
##.AVERAGES= 8
##.DIGITISER RES= 18
##SPECTROMETER/DATA SYSTEM= spect
##.PULSE SEQUENCE= zg30
##.SOLVENT NAME= CDCl3
##.SHIFT REFERENCE= (INTERNAL, CDCl3, 0, 15.7039)
##AUDIT TRAIL= $$ (NUMBER, WHEN, WHO, WHERE, WHAT)
$$ ##TITLE= Audit trail, XWIN-NMR		Version 3.5
$$ ##JCAMPDX= 5.01
$$ ##ORIGIN= Bruker BioSpin GmbH
$$ ##OWNER= she
$$ F:/spectra/data/she/nmr/H-F/1/audita.txt
$$ ##AUDIT TRAIL=  $$ (NUMBER, WHEN, WHO, WHERE, WHAT)
(   1,<2024-09-09 15:33:55.89 +0400>,<she>,<DPX200>,
      <created by zg, POWCHK disabled, PULCHK disabled
       configuration hash MD5:
       00 E9 B6 7A A2 85 ED C7 34 08 36 98 17 FE 4E 26
       data hash MD5: 16K
       9A 20 7A A0 70 5E BF 90 27 D8 68 7A 5C E0 0E 4A>)
$$ ##END=
$$ 
$$ hash MD5
$$ 96 C2 A8 53 D1 9C EE D8 5F 47 7C 89 57 6D B7 BD
##$RELAX= 
##$RELAX= 
##$RELAX= 
##$RELAX= 
##$RELAX= 
##$RELAX= 
$$ Bruker specific parameters
$$ --------------------------
##$DU= <F:/spectra>
##$EXPNO= 1
##$NAME= <H-F>
##$PROCNO= 1
##$TYPE= <nmr>
##$USER= <she>
##$AMP= (0..31)
100 100 100 100 100 100 100 100 100 100 100 100 100 100 100 100 100 100 
100 100 100 100 100 100 100 100 100 100 100 100 100 100 
##$AQSEQ= 0
##$AQ_mod= 1
##$AUNM= <au_zg>
##$AUTOPOS= <>
##$BF1= 200.13
##$BF2= 200.13
##$BF3= 200.13
##$BF4= 200.13
##$BF5= 200.13
##$BF6= 200.13
##$BF7= 200.13
##$BF8= 200.13
##$BYTORDA= 1
##$CFDGTYP= 0
##$CFRGTYP= 5
##$CHEMSTR= <none>
##$CNST= (0..31)
1 1 145 1 1 1 1 1 1 1 1 1 1 1 1 1 1 1 1 1 1 1 1 1 1 1 1 1 1 1 1 1 
##$CPDPRG= <>
##$CPDPRG1= <>
##$CPDPRG2= <>
##$CPDPRG3= <>
##$CPDPRG4= <mlev>
##$CPDPRG5= <mlev>
##$CPDPRG6= <mlev>
##$CPDPRG7= <mlev>
##$CPDPRG8= <mlev>
##$CPDPRGB= <>
##$CPDPRGT= <>
##$D= (0..31)
0 1.2 0 0 0 0 0 0 0 0.06 0 0.03 0 0 0 0 0.0002 0 0 0 0 0 0 0 0 0 0 0 0 
0 0 0 
##$DATE= 1725881635
##$DBL= (0..7)
120 120 120 120 120 120 120 120 
##$DBP= (0..7)
150 150 150 150 150 150 150 150 
##$DBP07= 0
##$DBPNAM0= <>
##$DBPNAM1= <>
##$DBPNAM2= <>
##$DBPNAM3= <>
##$DBPNAM4= <>
##$DBPNAM5= <>
##$DBPNAM6= <>
##$DBPNAM7= <>
##$DBPOAL= (0..7)
0.5 0.5 0.5 0.5 0.5 0.5 0.5 0.5 
##$DBPOFFS= (0..7)
0 0 0 0 0 0 0 0 
##$DE= 6
##$DECBNUC= <off>
##$DECIM= 24
##$DECNUC= <off>
##$DECSTAT= 4
##$DIGMOD= 1
##$DIGTYP= 9
##$DL= (0..7)
0 120 120 120 120 120 120 120 
##$DP= (0..7)
150 150 150 150 150 150 150 150 
##$DP07= 0
##$DPNAME0= <>
##$DPNAME1= <>
##$DPNAME2= <>
##$DPNAME3= <>
##$DPNAME4= <>
##$DPNAME5= <>
##$DPNAME6= <>
##$DPNAME7= <>
##$DPOAL= (0..7)
0.5 0.5 0.5 0.5 0.5 0.5 0.5 0.5 
##$DPOFFS= (0..7)
0 0 0 0 0 0 0 0 
##$DQDMODE= 0
##$DR= 18
##$DS= 0
##$DSLIST= <SSSSSSSSSSSSSSS>
$$ [...]
##$SUBNAM2= <"">
##$SUBNAM3= <"">
##$SUBNAM4= <"">
##$SUBNAM5= <"">
##$SUBNAM6= <"">
##$SUBNAM7= <"">
##$SUBNAM8= <"">
##$SUBNAM9= <"">
##$SW= 24.0689170037331
##$SWIBOX= (0..15)
0 0 2 0 0 0 0 0 0 0 0 0 0 0 0 0 
##$SW_h= 4816.95568400771
##$TD= 16384
##$TD0= 1
##$TE= 0
##$TE2= 300
##$TE3= 300
##$TEG= 300
##$TL= (0..7)
0 120 120 120 120 120 120 120 
##$TP= (0..7)
150 150 150 150 150 150 150 150 
##$TP07= 0
##$TPNAME0= <>
##$TPNAME1= <>
##$TPNAME2= <>
##$TPNAME3= <>
##$TPNAME4= <>
##$TPNAME5= <>
##$TPNAME6= <>
##$TPNAME7= <>
##$TPOAL= (0..7)
0.5 0.5 0.5 0.5 0.5 0.5 0.5 0.5 
##$TPOFFS= (0..7)
0 0 0 0 0 0 0 0 
##$TUNHIN= 0
##$TUNHOUT= 0
##$TUNXOUT= 0
##$USERA1= <user>
##$USERA2= <user>
##$USERA3= <user>
##$USERA4= <user>
##$USERA5= <user>
##$V9= 5
##$VALIST= <valist>
##$VCLIST= <CCCCCCCCCCCCCCC>
##$VD= 0
##$VDLIST= <DDDDDDDDDDDDDDD>
##$VPLIST= <PPPPPPPPPPPPPPP>
##$VTLIST= <TTTTTTTTTTTTTTT>
##$WBST= 1024
##$WBSW= 4
##$XGAIN= (0..3)
0 0 0 0 
##$XL= 0
##$YL= 0
##$YMAX_a= 4515
##$YMIN_a= -5767
##$ZGOPTNS= <>
##$ZL1= 120
##$ZL2= 120
##$ZL3= 120
##$ZL4= 120
##$ABSF1= 10
##$ABSF2= 0
##$ABSG= 5
##$ABSL= 3
##$ALPHA= 0
##$AQORDER= 0
##$ASSFAC= 0
##$ASSFACI= 0
##$ASSFACX= 0
##$ASSWID= 0
##$AUNMP= <proc_1d>
##$AZFE= 0.1
##$AZFW= 0.1
##$BCFW= 1
##$BC_mod= 2
##$BYTORDP= 1
##$COROFFS= 0
##$CY= 11.3945322036743
##$DATMOD= 1
##$DC= 2
##$DFILT= <>
##$DTYPP= 0
##$F1P= 15.6554695791079
##$F2P= 12.8336369535428
##$FCOR= 0.5
##$FTSIZE= 0
##$FT_mod= 4
##$GAMMA= 1
##$GB= 0.15
##$INTBC= 1
##$INTSCL= 1
##$ISEN= 128
##$LB= 0.24
##$LEV0= 0
##$LPBIN= 0
##$MAXI= 10000
##$MC2= 0
##$MEAN= 0
##$ME_mod= 0
##$MI= 1.114404
##$NCOEF= 0
##$NC_proc= 0
##$NLEV= 6
##$NOISF1= 3.799351
##$NOISF2= 2.8
##$NSP= 1
##$NTH_PI= 0
##$NZP= 0
##$OFFSET= 15.70392
##$PC= 1
##$PHC0= -26156.72
##$PHC1= 18.38748
##$PH_mod= 1
##$PKNL= yes
##$PPARMOD= 0
##$PSCAL= 0
##$PSIGN= 0
##$REVERSE= no
##$SF= 200.130013532006
##$SI= 16384
##$SIGF1= 3
##$SIGF2= 2
##$SINO= 400
##$SIOLD= 16384
##$SREGLST= <1H.CDCl3>
##$SSB= 0
##$STSI= 0
##$STSR= 0
##$SW_p= 3612.71676300578
##$SYMM= 0
##$S_DEV= 0
##$TDeff= 0
##$TDoff= 0
##$TI= <>
##$TILT= no
##$TM1= 0
##$TM2= 0
##$TOPLEV= 0
##$USERP1= <user>
##$USERP2= <user>
##$USERP3= <user>
##$USERP4= <user>
##$USERP5= <user>
##$WDW= 1
##$XDIM= 8192
##$YMAX_p= 0
##$YMIN_p= 0
$$ End of Bruker specific parameters
$$ ---------------------------------
##NTUPLES= NMR FID
##VAR_NAME=  TIME,          FID/REAL,        FID/IMAG
##SYMBOL=    X,             R,               I
##VAR_TYPE=  INDEPENDENT,   DEPENDENT,       DEPENDENT
##VAR_FORM=  AFFN,          ASDF,            ASDF
##VAR_DIM=   8192,          8192,            8192
##UNITS=     SECONDS,       ARBITRARY UNITS, ARBITRARY UNITS
##FACTOR=    0.0002076,     1,               1
##FIRST=     0,             0,               0
##LAST=      1.7004516,     0,               0
##MIN=       0,             -5767,           0
##MAX=       1.7004516,     4515,            0
$$ Real data points
##PAGE= N=1
##DATA TABLE= (X++(R..R)), XYDATA
0@%%%%%%%%%%%%%%%%%%%%%jKqJ5j6J6j6J6j7J8k1K8l2L3l4L8m6N0n4O2o8P5q3
44d3R2j02J12j25J40j57J77k00K26k61L06l63M44n65P73j235N296n767j538M645
64A855m168K25L037k481q16N635j638m040L323J448l015K144O02m336P74K924
80A473l436j183L319k63k57L047j049k578K061R79k845k19Q67j312O21J194j668
97a249m87K361P83p10K05Qk27K04n32j477o80P49Q75l53n90R41J124j1L78j18
117A194j363L96J001j808j491J560L2p38J618k38j488K381J513k566j0J676j912
134b43o97J670k282j239L342N9k193K181J110k187J521J275l323K6K751k323j588
151b140K279r51j319L112J89k573K477J561k757J15J344k524j66K345j748j568
$$ y = [0, 0, 0, 0, 0, 0, 0, 0, 0, 0, 0, 0, 0, 0, 0, 0, 0, 0, 0, 0, 0, 0, -1, 1, -7, 8, -8, 8, -8, 8, -9, 9, -12, 16, -16, 17, -17, 21, -25, 25, -29, 33, -35, 40, -43, 49, -53, 59, -66, 74, -83, 94, -106, 120, -141, 165, -198, 246, -319, 454, -781, 4515, -1252, -2790, 1855, -2313, -2088, 949, -1532, -2348, 3287, 1649, -2391, 932, 2380, -635, 1509, 2111, -2225, -1451, 1473, -1963, -3146, 173, -90, -347, 2700, 1651, -927, 1134, 2113, -732, -951, -84, -1396, -775, 419, -1249, -1736, 625, 1408, 698, 903, 911, 684, 888, 356, -1121, -1801, -1052, -177, -530, -1120, -179, 945, 934, 1312, 1194, -169, 227, 1228, -580, -2071, -511, -479, -1217, 401, 163, -1325, 1056, 2569, 3, -7, 1669, -243, -940, 730, -1552, -2791, 551, 610, -1583, 598, 1708, -479, 1042, 2317, -1006, -980, 1771, -552, -2140, 139, -812, -2131, 981, 1170, -1403, 1074, 2635, -122, -7, 1337, -1187, -1353, 992, -756, -2324]
167b324K665J91j595J820N57j692J318J128k434n95J415j170p81J384m12o06J792
184F61N06j381N82R22q25k49L73j105n09P65k50o46N69Q70N9J86M22k88m38L45
204E69j33j014k20N89m25k57O21J56l16J214M77j091L04P07j248o24P73p93o96
223a407J456o6j084J278R42j231O82R21j482k42J108j275j143J310q0j051J428
240F4O77j310J183J040j602j14J191j330q07J281o63j198J485M18j177J044J101
257A283j141J43J058j288o31J070p17j110R54K50q57R36Q73q50L01R51p64o68
275b07O96m80r34N95J39q23N21Q07m19K02Q67l28m06M20k26r62J14K96o67m8P69
296g4j01r6R87r0n40N18J59r04l4M27q06l89P86k23l97R80L42n87O70L94r04j05
$$ y = [-2324, 341, 532, -1063, 757, 1314, -378, 940, 2068, -366, -961, 454, -716, -1497, -113, -525, -1131, 661, 1167, -214, 368, 1290, 465, 216, 589, -516, -1025, -260, -510, -1156, -587, 283, 342, 528, 950, 662, 224, 569, 436, -578, -798, -209, -634, -891, -270, -114, -430, 784, 1261, 170, 474, 1181, -67, -691, 82, -711, -1407, 49, -17, -1101, 177, 1119, -112, 570, 1491, 9, -233, 875, -400, -1543, -233, -313, -1364, 64, 741, -569, 614, 1654, 52, -62, 1129, -201, -1008, 273, -390, -1588, -103, 315, -862, 182, 1283, 142, 285, 1343, 55, -576, 494, -223, -1333, -379, -129, -986, -50, 823, -27, 274, 1225, 461, -207, 489, 9, -925, -330, -191, -1014, -493, 314, -105, 97, 964, 636, 230, 650, 424, -538, -424, -128, -795, -843, -74, -175, -271, 716, 626, 86, 604, 763, -141, -175, 252, -554, -943, -157, -380, -777, 203, 545, -42, 628, 1022, 118, 13]
318A3M97r03n25P41k43m96P87M89n99O12O04p21j81P73q03o92O54k70p66O96L84
339E1n98N60Q74o32l0P22n76o73N45m43p72N13L90o32M04Q78m33pO83k86o49M85
361C74j49q89L65K12p47J94Q09l11J7R42j59n27M74j40r40P6L75p05L0Q24l22
382a97j94Q66L2n08N42K26o94l3K87r05k68N78k25j72Q75L23m62L84L53q21M3
403C0L98o12k95M80l34m59O05L05m13N52N92m55n0M14p01o15M70j90n57N60L82
424A07n10K82P16m29p4P15m02n14L82k62q30L53K89l37J70P39k18j00O34k24n12
445b5M27j55p30J63K43o13R9O48k11j9P27o7l93M52j09o97N2K25n86p3N59k03
467b86q0P32N8l21M40J12o38m4J98m77l10L71o5k63N00K25j48L66L02k50k30K23
$$ y = [13, 510, -393, -918, -177, -420, -916, -129, 360, -239, 373, 977, 256, 75, 848, 45, -647, 7, -263, -1029, -333, 51, -547, 13, 887, 255, 225, 947, 371, -302, 243, -200, -972, -459, -69, -701, -297, 581, 148, 141, 824, 538, -111, 374, 225, -664, -299, -87, -834, -640, 169, -142, -125, 817, 658, 131, 605, 465, -475, -399, -24, -729, -699, 125, -197, -391, 475, 507, -1, 541, 767, 73, 40, 327, -578, -846, -268, -493, -665, 210, 533, 71, 455, 808, -13, 30, 428, -184, -479, 1, -333, -792, -187, 118, -295, 257, 849, 394, 344, 758, 57, -558, -88, -278, -835, -275, 107, -403, -121, 595, 166, 92, 807, 405, -109, 273, 11, -819, -466, -177, -514, -344, 395, 177, 77, 711, 487, -25, 402, 247, -483, -320, -77, -690, -591, 57, -154, -173, 554, 487, 94, 546, 437, -260, -208, 17, -569, -642, -83, -286, -366, 366, 424, 103, 543, 655, 17, -27, 171, -306, -616, -245, -310, -573, -73, 152, 4, 370, 672, 422, 192, 415]
489D15n02m24K16j8l32N06K84l03K70M04l48o4M61k38o03K79q3o24K50L66l20
510d08J98Q08k26k23M70j67p08L61J04p76K12L45n61P7P20k38n8P39j76m57L78
531D14q6r08K52K47n19J67N39k64l0P16j48m05M48Mn28K07k3o85K6M42k82O1N95
554B40J2j9L03j33l74R2Q9n26j0L8j25J22K26J13k5L42J40j35k23J1j42j63r5
577b42l8k15K13L05K3o9L02J37j63N8l2n61J16K93n62j56M85q5j41O82j10m04
599a64O35J99p08N0K31o55k8M44n81k6R60r0m70O62N2o53N96Kr56J75N32o18k07
622f18O77l27l1R17j99n48O13J54q20K00m5o49L18N63n63j37O96j8j61M48k20
643B50m08N77j9p97kK37k36J48K25k32K10N83j84k12M4r6rO3l65k86K16J25J06
$$ y = [415, -87, -511, -295, -313, -645, -139, 145, -158, 112, 516, 168, 104, 565, 327, -276, 3, -80, -704, -454, -88, -408, -210, 598, 372, 149, 619, 452, -256, 105, 209, -567, -355, -10, -571, -494, 226, -12, -70, 669, 493, 36, 414, 328, -580, -328, -81, -600, -433, 106, -158, -188, 528, 380, -25, 423, 427, -101, 106, 83, -602, -576, -134, -416, -355, 240, 252, 233, 536, 403, 29, 121, 210, -316, -326, -288, -413, -291, -65, 48, 23, 365, 505, 370, 147, 158, 16, -147, -242, -280, -495, -282, 23, 46, -23, 279, 416, 253, 311, 279, -282, -166, 127, -435, -591, -106, -191, -332, 350, 240, -164, 471, 670, -38, 12, 243, -412, -440, 4, -577, -603, 357, 267, -203, 459, 511, -142, 454, 456, -500, -325, 207, -411, -618, 59, -268, -299, 618, 419, -129, 484, 638, -182, 18, -27, -676, -358, 205, -358, -495, 201, 183, 22, 470, 250, -158, 419, 400, -397, -399, -162, -398, -250, -25, -257, -47, 536, 352, 140, 184, 88, 79, 142, -223, -509, -293, -168, -62]
666f2K4r8K85M50k32k80M9jj82J61l53m47M69L33l47K55K11j30L45K47p42k52
688b97O40l82m58L66j94k40P84J63p49M50O08n47J56P7p93N1O92o93m44P76Q6
709E2k97O31n5o46P70L29r11m9M51n88j13N45o64j13J009Q0o46N71J15m57L96
730D10r1q50J45N76n00j31L83j38J81N63k43m26M85L8l78J9j87l88K96J97k92
751c31O4L27J15J77L8l55J26R9k04k84p1j28J39K74k03m4N36L7o5J40k80j47L66
774C26j86o24J54J30k38L30K91m13L36N90n14k10L23j97l40M34m15n57P49J73
794A42n01L71L69m21L49L95p96j70N62m07l56L99j76l40P57Q6n34M10L58m01L9
815A35K02n90oN02m97l85N83K4j89M05J22l27L52J64n81o6J49k74k2K26k44j1
$$ y = [-62, -38, -136, 149, 599, 367, 87, 136, 135, -47, 114, -239, -686, -217, 116, -231, 24, 235, 105, 450, 697, -45, -297, 343, -39, -497, -131, -325, -565, 219, 382, -367, 83, 691, 144, 300, 377, -416, -365, 327, -366, -810, -34, 52, -245, 386, 331, -315, 455, 784, -127, -176, 275, -313, -426, 119, -545, -658, 351, 431, -215, 356, 471, 14, 410, 319, -531, -386, 190, -310, -441, -58, -196, -15, 548, 305, -121, 364, 402, 24, 43, -144, -532, -236, -39, -331, -267, 60, 175, 352, 390, 35, 161, 260, 56, -228, -299, -427, -288, -14, -217, -261, 275, 312, 247, 387, 107, -40, 326, 140, -484, -330, -200, -438, -108, 183, -230, 106, 696, 182, -28, 295, 98, -242, 192, -223, -780, -31, 142, -359, 12, 381, -40, 309, 704, -92, -262, 300, -107, -463, -64, -240, -580, 177, 263, -271, 139, 497, 96, 135, 337, -253, -259, 243, -254, -639, -56, -32, -221, 184, 306, -21, 331, 495, -86, -152, -3, -277, -299, -73, -317, -328]
837c28M86m0k1J93Jj53J09k20k64nJ23j26M4NQ4K11J37j17J28Rj64R9j44l38J8
862b73J16j53Q4K80j02J67L30k50j82K44j33l49J91j12l36K34K08k49J76M78k00
883A69N1J93k32k48K69k49l88K92L5k80L47K42l40K68L98l99r6L25l47l35L58
904C3k03l10L47K24l12K55K82k41O9K97m53j31J96j72k73K55m5j55K48K56j18
925D9J20J91j76q9O5k40j63J00m4j21J28P8L8J32J88j6n9k3k0j11j70l7j8kM6
950a54R9n2J90J57l6l5J60k15j82P4j03k33J12J22q4J86J44o0N9K12j83j60Q5
973A03j55k24J41o8j52K23J73q6J43J97l3j62K08k12k89K08j20k45J93J42j49
994a64K43K05j53l4K29j46j67O8r2k84J16L6r9O3K92l8l0K75j05j90J49j17k49
$$ y = [-328, 158, 118, 97, 290, 291, 138, 247, 27, -237, -242, -119, -245, -201, -196, -112, 99, 236, 119, 247, 256, 92, 191, 47, -291, -273, -157, -310, -226, 54, -48, 119, 449, 199, 17, 261, 128, -221, -30, -142, -478, -244, -36, -285, -109, 369, 169, 220, 413, 181, -67, 202, -47, -435, -143, -108, -388, -41, 201, -139, 129, 527, 128, 32, 357, 10, -325, 33, -170, -480, -133, 91, -221, 34, 316, 75, 144, 441, -12, -143, 53, -119, -392, -137, -182, -337, -89, 167, 49, 169, 360, 184, 95, 160, -80, -243, -143, -187, -308, -180, -102, -64, 68, 256, 240, 181, 158, 138, 27, -143, -180, -198, -200, -154, -55, -107, 83, 240, 204, 169, 329, 114, -68, 6, -97, -330, -218, -96, -180, 6, 150, 90, 149, 361, 178, 18, 103, -52, -276, -135, -203, -355, -132, 41, -45, 98, 295, 262, 100, 308, 96, -193, 15, -105, -350, -157, -15, -164, 79, 284, 131, 97, 326, 180, 13, 81, -11, -295, -179, -143, -242, -179, 113, 75, 45, 320, 215, 25, 174, 57, -192]
1017a92M6j8j39K4K41N6m4K06L8m3O7j07j37l0kk33m8J62M0K7J69J14m6O8j1k48
1043d0K1M3j74j46J18J03j30J62K00j15J16J33j21n5M6j88j84K2J7r8K11J2RJ34
1067I6Q5j3j2P2j26k00J26j39j83J11R1k7R8J75L3k3Q8p8j79M4n3k62Q5R9r8O8
1093a22J30jJ3J80P7k08J03p3k40Kl1j6l7J44N9KJ36J41j45O8j0k04ML3j34j35
1119b64J06O5k3K03j1J1J72mj29p6%j95p7N3J2p9K44L9j8Q4J09n5j08N5q5j55
1145a26M2n3j10P1J05L0O3K06j01m9J90j32k47n9Q1j45J19J19j45O3K29o3p3K26
1169B41j9k49J15k3k50k3J07n2k2J72J00k5J58q9j25J82j15j69J5%j53N3J32o5
1193a04L6J68K4k6N7K7k20M2n0j29K3M4n7M2J72N2k4J31l0p2n2o9m2j69P7j12
$$ y = [-192, -146, -164, -303, -279, -38, 18, -26, 180, 218, 175, 242, 135, -2, -32, -34, -267, -315, -153, -113, -86, 83, 197, 151, 219, 208, -40, -19, 24, -150, -296, -178, -75, -205, -43, 157, 42, 158, 291, 170, 115, 161, -27, -211, -189, -172, -270, -59, -47, -38, 96, 181, 168, 156, 228, 102, -98, 28, -111, -294, -183, -92, -119, -21, 154, 187, 164, 252, 174, -5, 39, -14, -276, -191, -92, -190, -122, 8, 7, 20, 200, 277, 69, 172, 99, -141, -139, -170, -186, -223, -79, -20, -18, 118, 259, 114, 182, 172, -32, -28, 5, -129, -264, -158, -93, -116, 87, 76, 87, 259, 255, 126, 50, 50, -145, -222, -169, -157, -236, 8, 47, 29, 113, 222, 167, 59, 114, 29, -126, -84, -137, -247, -176, -71, -41, 22, 228, 127, 78, 268, 136, -111, -170, -89, -234, -115, 4, -141, -78, 151, 88, 15, 241, 222, -27, 88, 65, -185, -208, -101, -153, -175, -3, 97, 72, 230, 141, 16, 198, 83, -86, -71, -71, -224, -171, -39, -104, -68, 100, 124, 98, 155, 182, -38, 4, -46, -175, -152, -108, -165, -123, 49, 101, 77, 208, 178, 106, 54, -15, -57, -226, -149, -261]
1219b61J52Q9M9k2N1J34K7n6j14n1p1l8l8j30Q1J41N4N0N2O9pK9l8j86p5J16j40
1246a33j06Q4j8L0K84m4o1R9J27k06q8J00k53J8J25j05r7K98L3j02J35M0j46J61
1270A75J0l27o6K51k25pJ81j72J00L23j01k09K22Q4j88qjl12J08K21k44K4J09
1293e2N3M3J95q6j93J98q7k63L2R4j18O6R5j08J02K69j00j5N3r4k1M7k45p6PM2
1319a62NJ23OJ9J74M1j33R9j72j02J63j40k26J26J55j39J35R6m7J36J58k58j43
1342h6K13j49j84J97j91j35L49J25k59J37K52j89M2J08l31r6K92j69k43K10Q8
1363a9l1K80n7k30K19J40k97l9M1k42R0J78k08j25L30L9j16K54n5j77K20n3k99
1386a57N8K1r0j7J35j19J05K83q1j64K08j5q9j1j40j67J58L9r2P2LQ2J03J09j75
$$ y = [-261, -109, -20, 29, 7, 58, 192, 219, 163, 49, -2, -73, -111, -149, -279, -198, -57, -3, 47, 99, 168, 161, 190, 152, -34, -109, 7, -133, -239, -155, -173, -143, 141, 97, 36, 135, 262, 56, -32, 68, -185, -167, -42, -147, -244, 54, 87, -15, 120, 160, 14, 175, 185, -142, -208, 43, -182, -189, -8, -180, -80, 243, 142, -67, 155, 239, 51, 43, 42, -270, -162, 59, -185, -161, -52, 1, 44, 239, 153, -40, 158, 71, -192, -160, -66, -184, -118, -23, -131, -29, 240, 140, 125, 178, 84, 63, 110, -135, -211, -204, -162, -157, -34, -28, -9, 165, 206, 73, 172, 0, -102, 61, -79, -305, -179, -24, -163, -28, 68, 21, 157, 315, 57, -86, 127, -22, -206, -9, -200, -335, 14, 139, -120, 17, 269, 80, 122, 230, -101, -197, 95, -74, -317, -107, -19, -50, 230, 173, -57, 162, 302, 5, -34, 7, -235, -145, 33, -175, -300, 30, 69, -47, 207, 152, -25, 195, 142, -157, -99, -78, -168, -185, -50, -169, -64, 219, 138, -26, 182, 167, 78, 67, -73, -240, -82, -43, -135, -63, -60, 22, 125, 234, 59]
1411E9j1J27k28p2M1j88N5K43j18kK02K5j04J22o8j90K17k8k49L6j7r7J16J52
1435B3j72K05K06j40j24J77k19r6J75m8k28J43J77k73J82J74j26P1J88k57j11
1456g3K33k21j39J53m8j92L94P2k39J52J35j65j1N9j58n3J16k01l5J62m2L8J69
1479A06rj34J99N4j85n7Qj78M1J82j75j9K59p9N2L1N8q1R1k09o1kN8j27R3O7p8
1506i5J24M8L8lQ5j76Q6n3j57m3P4m7K3N6LO2K03k1q1J9Pj56q2P3k12P6J17p9
1534a11O5K60j23qJ40o5j83J42n0k11Oor4J69Q3q0J65J72k47Q0P0k10k1J1l2j42
1560b20J49K4j29J75J50j02J04O9j34q5J8p1j28R9%k4Q8J59o5K0N5p3l3N1j30
1585c3r5j0l6O5K0N2k1J45O7k8jl6p3Kj27l9N9k1j8J40l9J7Q0M0n8O3%j33j7m0
$$ y = [59, 48, 175, -53, -125, -84, -272, -217, 26, -92, -94, 108, 133, 29, 151, 83, -107, 110, 82, -167, -131, -148, -245, -129, 23, -149, 56, 262, 122, -2, 175, -44, -140, 35, -13, -241, -98, 79, -194, -12, 162, 36, 107, 295, 38, -73, 160, -61, -200, -47, -95, -287, 107, 179, -60, 92, 227, 62, 51, 110, -48, -101, 15, -186, -221, -59, -101, -63, 106, 97, -37, 162, 216, 31, -26, -18, -196, -155, 27, -148, -167, 92, 13, 65, 96, 154, 73, 164, -45, -106, -108, -50, -177, -84, -17, -95, 29, 77, 115, 112, 197, 21, 107, 54, -103, -146, -72, -119, -96, -40, -37, 25, 228, 207, 126, 145, 152, -4, -86, -13, -225, -149, -32, -111, -46, 214, 91, 83, 223, 158, -25, 117, 67, -144, -138, -144, -238, -69, 14, -66, 99, 271, 24, 104, 174, -36, -57, -46, -78, -220, -71, -47, -176, -1, 149, 47, 151, 220, 86, 1, 19, -52, -180, -81, -81, -105, -17, 142, 77, 97, 152, 79, 46, 97, -33, -128, -138, -174, -109, -89, -37, -58, 87, 154, 126, 125, 89, 16, 18, -109, -148, -89, -110, -128, 12, -27, -10, 70, 110, 52, 115, 115, -18, -35, -75]
1615g5j28K4M6L9J9J58J9l0R6k8j79L7j1j13J9j1j7K8J42j4J7J17qj0K8p5j95
1642a05M1k6j47J02Q7K8j2R4NL8N9o2j39L7j7j43J3Q1r7Q4R3K2J3J97j69M5p4
1669D8k1p5or3K2J1J27n0Q8L2K3ML1j05k1j5ro2l0k0J5R9J4J41j27J53m6j9l7
1698G2o2o5p7N1m0K7L3J34m9J00Rk9j00L4p8o3J3j00J02l5J39j0j2J06kj0J4p5
1726B7n0p9J1p5N8J5N5N4M4n4J08O7o5p2nm8q9K2%N6o3O7J0N4M4M1o1K7r0n1p
1757d9o6K4J9P5m0oJ03R4p9M2r1om9n0j00R6k9k1J27L1J7M5rpk3MJ2r9J4j17M0
1788i8j7N3N1O7oM9J8o3K1q2j0Jo7K5j3j4Q0K6M7j2K5J0k9r5j8Oj22J09Rr2J23
1819a8Q2mN6pj7n9p7L6p9n1K1K1l3J56m2P4N4Lm9j3Np2q2P0j22M0P2K8J4J24k8
$$ y = [-75, -203, -179, -133, -94, -75, 83, 102, 72, 168, 140, -39, -2, -13, -126, -107, -118, -135, -107, 35, 21, 38, 155, 147, 137, 165, 90, -105, -64, -90, -237, -135, -48, -20, -32, 62, 67, 105, 164, 102, -37, 0, -17, -160, -147, -66, -163, -79, 14, 36, 49, 246, 77, 122, 48, 27, -48, -54, -147, -125, -114, 13, -37, 51, 83, 106, 110, 141, 36, 15, 0, -9, -71, -101, -121, -106, -7, 7, 148, 21, 174, 128, 109, 72, 10, -55, -132, -81, -121, -94, -61, 73, 24, 124, 133, 104, 4, 38, -40, -103, -90, -190, -88, -123, 16, 6, -6, 100, 98, 88, 102, 27, -23, -102, -91, -166, -108, -93, -38, 16, 60, 6, 114, 181, 116, 44, 39, -9, -98, -76, -76, -20, -83, -16, -6, 48, 92, 133, 72, 99, 9, -42, -49, -115, -91, -72, 3, -37, -43, 60, 154, 75, 117, 26, 20, -29, -79, -179, -83, -112, -133, -6, 25, 42, 87, 78, 71, 48, 52, 64, -35, -21, -138, -98, -115, -62, -11, 56, 50, 99, 117, 54, 75, -7, -17, -16, -83, -58, -71, -85, -5, 21, 68, 56, 81, 91, 62, -33, -51, -45, -167, -58, -49, -141, -18, 64, 60, 116, 109, 92, 33, -44, -8, -87, -138, -117, -96, -129, 27, -15, 59, 113, 116, 67, 54, 59, -13, -95, -25, -147, -107, -35, -7, 7, 131, 103]
1850A03L6k4J8r7k8k0m8j3KpK9N0O9m6J53Qj40j9k3p6qol7Q4j6J6%O4O2N7o5k7
1882E1L1j12kr4P5p0P6M7N0Pj4L1m1Kp0mL5m0q6O4n8OJ26Q4m1nP5n1n4J5j33j1
1914a11R8q8M0J8P1l6K7J16j05J42j08o9p6O7j50R4J10j08qJ83jm5O5l3r3J17
1940A17j19j30J51p3n5O8rKR4N1l4r4R3k5p8J2r7qJ22K8p3J01M1j9L5jp9j3O9
1969G7j43OK4l1K7J6N1n1J04P3o5L0j41m6R5n3j31P4Q0l2J5J1RO2J03j03n4K8
1997C5o6l7k9m5k7J40O5q0J34pj8K1K9j75lM5k0o4O1m5NJ15Q6o0J6K5n8M2n4j55
2027a24J23J8j47J4N8M9LJ01q0K0R6mk36N5Mj65J74N0n4L6P7m6J7R0j40m6J25
2054F8j25l0O1Jq5P4K1l1J45J0j01P6O5j27m5Pp3OR3j10M4J11j9QQ1m4n5L7J6
$$ y = [103, 139, 115, 133, 36, 8, -12, -60, -73, -71, -78, -49, 1, 70, 24, 177, 185, 45, 26, 3, -73, -81, -87, -124, -40, -56, -40, -40, 24, 86, 143, 78, 51, 82, -30, -32, -126, -51, -121, -45, 2, 52, 59, 45, 76, 35, 37, -33, -37, -2, -42, -128, -64, -122, -116, 10, 94, 53, 48, 123, 72, 18, 33, -100, -111, -13, -101, -61, -43, 28, -8, 19, 135, 30, 172, 64, -5, -81, -14, -164, -70, 40, -68, -76, 107, 106, 61, 126, 93, 0, 117, -2, -132, 19, -54, -109, -41, -50, -48, 46, 97, 63, -31, 62, 37, -41, -29, -126, -134, -12, 16, -57, 44, 85, 66, 101, 100, 21, 8, 77, -66, -60, -36, -67, -40, -24, 27, -24, 80, 153, 88, 118, -23, -69, 26, -27, -158, -84, -4, -36, -21, -10, -1, 61, 164, 61, 7, 35, -31, -68, -97, -142, -169, -29, 36, -44, 90, 83, 65, 86, 115, -60, -63, -18, -38, -102, -41, -86, -81, 34, 120, 60, 76, 101, 43, 85, 31, -124, -1, 17, -130, -116, -58, -9, -6, 95, 15, 35, 131, 127, -109, -54, -50, -215, -41, 9, -45, -9, 68, 22, 39, 129, -11, -57, 68, -57, -87, -26, -25, -110, -36, -15, -46, 99, 109, 8, 84, 149, 22, -23, -16, -89, -83, 10, -100, -56, 55, 36, 44, 125, 81, 26, 63, 79]
2083G9j33n1K9j1L7Q9l2O1Q0o5k0K0r3j02J05p0o8P8M3l6Q2%m0O1Q5j27o6J14
2111D9p0n7M4J3n6J36n2p6J43M1l7lK6j23rK7j10K6J1M0l7K49k13P3J20j8j86
2138d9N9j7j30O0Ol6M6J04l2M2O8r0P1j9r0m9L0j9j29J65n7J2Q1L9K0l1K4n6k6
2167cQ0j38JL1qOO1k0OJ03m4o0P5mj06j2j4o1P9J8j1N0MN2r7J39l3j46J47n0j30
2198h5L6nl0L6J01l2P1Ln0J0J3l6j18O7n1q6J36o6j6J25K4o0J02J8j06j02P6j1
2226c6p8N1k1k3J65k4n7J20M5m4L0r2o7rK6mj9N6m0J9L1L7K0Pn5l3K5j2r0N1n2
2257g3J3j9J15n1O9N0n1M7j15K3j38J47o8m2N0%L7M3J5L9j3jj09N9k2p6Q9j55
2285a37qK2R3J8J8Q3o6N4q0J46j19o0m4n1Q8M1k6nJ33o5M6o6M1ln5n0k9N0m3N
$$ y = [79, -54, -105, -76, -87, -50, 39, 7, 68, 148, 83, 63, 83, -10, -112, -7, -77, -145, -67, -24, -60, 22, 22, -18, 43, 128, 1, -65, 49, -21, -78, -34, -21, -77, 59, 7, -69, 74, 115, 78, 75, 101, -22, -31, -4, -114, -88, -77, -37, -74, 175, -38, 35, 155, 137, -49, 10, -7, -137, -77, -71, -107, -61, 43, 11, 53, 121, 31, 102, 83, -7, -56, -26, -45, -174, -9, -66, -54, 27, 66, 86, 55, 79, 23, -3, 77, -61, -60, -29, -37, -31, 30, 10, 16, 119, 75, 15, 90, 86, -20, -32, -46, -107, -28, -10, -21, 29, 33, 85, -12, 127, 94, -52, 95, 45, -85, -49, -54, -84, -48, 53, 21, 92, 95, 45, 55, 68, 32, -86, -19, -70, -156, -20, -86, -102, 23, 47, -13, 89, 107, 1, -101, -25, -36, -114, -63, -84, -107, 58, 34, -23, 97, 142, 98, 128, 36, -31, -40, -14, -18, -37, 19, -21, -2, 29, 66, 86, 93, 38, 5, 30, 18, -72, -21, -73, -60, -79, 36, -15, 54, 104, 53, 100, -15, 8, -130, 17, -51, -93, -43, -43, -6, 37, 52, 91, 78, 77, -32, 27, 5, -71, 18, -137, -145, -123, -30, -12, 6, 89, 23, 77, -3, 143, 24, -36, -80, -131, -43, -2, -28, -33, 100, 35, 81, 15, 56, 53, -2, -52, -81, -31, -74, -69]
2315f9L1P1n5R2Pr3J01p5M4r6k8L2m9N5krJ04k1n0P7nm5k2p2NM0J1j7L2nN0J1
2347E0J5k0K0J4k5r8OL6j20J0j1Q2N0M7k4Q1l0n5Kl7M7q2l5k2L6l4N4Q3l0Q7m2
2378E5m9nN9j07k1O8r1N3j2N0L6m1R9o3N5k6m2l3n0L9j6j3M2l5P5P7o8N4o4o3
2408c7L5l4j4M6j25Q3M1l3Q1K2l8LO0L7j55pK8o3%l0R3o7M1J4R1MJ8j9l2l3k4
2439a4q5j1N9%O6l5L3Q8q6N2j1l4j1r7K0l6K7nO2j00J38j5L0J20q0O2j46Mm6Q
2469d3j02J21k1P6l4M7m1OL3M6j23M8j6k4K8j26M9J9M6J4QN3K2r0K7j17%O9m9
2498g4j5M5k3N7L7j3L2%Mm2J6q7m6L7J8rN4l1N0k7P7m4L0j9K4rp8K7j02N4k4P3
2530hN2RRN3p9Nnm4Jk0l8j8M7LMM8J5L7o6qK9n3k3%K5j9KpJ14k5J7Nk2j0k2K5
$$ y = [-69, -38, 33, -22, 70, 77, -16, 85, 10, 54, -42, -70, -38, -87, -32, -34, -43, 61, 40, -10, 67, 62, 17, -5, -77, -72, -32, -21, -38, -6, -11, 39, 50, 65, 45, 65, 79, 54, -44, -38, -2, -122, -112, -123, -41, 9, 56, 32, 113, 83, 28, 30, -7, 40, -42, -77, -99, -63, -97, -43, 40, 10, 97, 55, 6, 1, 60, -47, -68, 0, -91, -38, -50, 0, 36, -5, 94, 31, 86, 60, 18, -15, -65, -26, -42, -55, -13, -48, 27, 104, 36, 90, 26, -37, -2, -36, -50, -4, -129, -46, -5, -38, 43, 65, 27, 30, 90, 127, -28, -35, -7, -70, -70, -100, -7, -74, -33, -19, 72, 76, 94, 75, 43, 10, -14, -99, -110, -51, -51, 15, -20, 13, 101, 15, 67, 56, 22, 11, -86, -66, -102, -75, -80, -18, -118, 20, 5, 35, 155, 75, 137, -9, -5, -51, -43, -145, -24, -45, 31, -3, 44, 3, 9, 42, 88, -35, 13, -3, -27, 1, -125, -76, -57, -11, 3, 11, 64, 86, -4, 23, -94, -94, -25, -74, -89, -44, -67, -10, 27, 14, 46, 46, 50, 8, 24, -63, -109, -72, -54, -63, -9, -40, 10, -17, 60, 16, 46, 27, 51, 42, -36, -9, -111, -57, -81, -8, 44, 53, 62, 115, 36, 41, 36, -8, -7, -27, -65, -83, -36, -33, -29, 19, 34, 71, 5, -3, 26, -27, -50, -50, -25, -44, -42, -49, 65, 40, 57, 62, 40, 30, 8, 33]
2566C3p2k5N3k0j6K8O7n8R6J4m8L9p7l5%n8K6n0N2m4L1R6LR9j6rq1J1n3j5k1K8
2598b2l2O3jm7K0R9r7J00K0r9L1r0pn2O1j3R0p0P0J1N1m1j2l8M1o9k8m6L6n7J41
2629A3jPj2R6k1J0q9m0R2r8J3r1Q2Q3j7LL9n9R6q7M9j11n2L5K5J0j6L0qJ0O4N6
2661A11j10P0m2n7n4L8oj00J06K9o7J11M1q6Q6n9j9L7o2m1M4Q2j25N0LJ8m5J38
2689I1m7m7J1J9l9k1K0p3J0J26j45R4Q5ppJ8M0j17K3l6q8J2L1K7J9J7k0N7kOm0
2720A7N1q4l0j7J0J1OK3NJ3K8RM4m6k4K8l3k5k4n1J04n3J12m8k4kPM4M3n5k2k3
2752fk0p3LM2K9K8K8RN8L2o5l3p4J8LJj03J09l4N1J6k6M7o6L5P5j36M5j6p1j4
2783a08J24m7J5K2J1%O0j2nl2k3m8rj2j4M6O8l1m5J15n0L9jJ6j08jk1n9O7J7m0
$$ y = [33, -39, -64, -11, -31, -47, -19, 48, -10, 86, 100, 52, 91, 14, -21, -21, -79, -53, -103, -51, -95, -64, 32, 35, 134, 118, 109, 28, 39, -14, -29, -50, -22, -54, 9, 8, -39, -19, 80, -17, 83, 103, 4, 35, -55, -62, -114, -53, -66, 24, -46, 24, 35, 86, 45, 33, -5, 36, -33, -61, -107, -71, -128, 13, 12, 19, 7, 103, 82, 92, 3, -37, 55, -43, -30, -121, -39, 44, 27, 30, 69, 10, 106, 19, 68, -43, -95, -60, -35, -25, -41, -11, -19, -9, 55, 111, 1, 71, 29, -28, -82, -44, -50, -150, -44, -15, -82, 29, 70, -16, 70, 11, -8, 29, -33, -74, -30, 52, -73, -23, -20, -2, -47, 91, 44, -3, 8, 27, -12, -33, -13, -86, -76, 50, -95, -1, 84, 77, 70, 88, 128, 11, 34, -2, -90, -78, -47, -20, -1, 16, -4, 53, 51, 57, 17, 68, -16, -46, -63, -53, -42, -36, -13, -8, 5, 33, 42, 86, 40, 16, 44, 11, -14, -38, -89, 15, -38, 74, 26, 2, 0, 7, 51, 94, 39, 17, -6, -26, -99, -96, -54, -25, 3, 31, 40, 98, 130, 65, 32, -42, -24, -21, -20, -123, -14, -48, 3, 19, -7, 40, -26, 9, 84, -52, -7, -23, -94, -108, 16, -31, -16, 6, 17, 17, 77, 65, 60, 28, 5, -43, -52, -64, -78, -32, 36, 5, -40, 75, 25, 64, 63, 79, -29, -30, -51, -110, -43, -26, -66]
2814f6J26p2N9K6N7r8pQ6j06q7J2Ll4R7Ok5J16q0nO5k2r5K9l6o5J12m7K5M8n7
2844c5L2j0M4K4l4k0l4rM5q1m2J54q8NJ02m1j1J4M7o1K5l7l8n4J29p6j3Q9OJ5
2874D7K3o9L8L3q2k8K2j7m2O5k3K7%M2k8K7l7K7q3N6M1j34rJ07n4K1M1M3M2q2
2904A4kj0J4p1qN%m3Q7k1P2PL4k8J4K1p1rJ4o3n5L7N7%j2K8N1n3L8j7k4K1j24
2937i7P8p7L8K6L2L5k4OO2l6N3q8n0O0l2q3K8R0m1N0M8l1o9P5o0M4L2p9k0%q5
2968a15Q7N1n2P8J6l8n6J06j6n0j6j2k7k0J9k5P1J4N1q4R0m7%qJ5l2m2n9RP5M8
2999C1p0N5K1O1q2J8k4mm6O1p8j8R9ro1P5Jpk7P0j2p2O4l2j00P4Qm9K4K4L4P6
3031A05l3J0nn7j2k0k4m5R0n6N9mJ1J7M5k7j6o2L8l8rn4NM8J7RQM0o3O1rk5m3
$$ y = [-66, 60, -12, 47, 73, 130, 32, 25, 111, 5, -82, -70, -67, -101, -4, 2, -23, 93, 13, 8, 73, 51, -44, -15, -51, -116, -4, -51, -26, 22, -35, -3, -13, 31, 55, 21, 1, -33, -42, 3, -78, -120, 34, -54, -49, 53, 12, 1, 15, 62, 1, 26, -11, -49, -103, 26, -50, -63, 26, 32, 47, 70, 1, 39, 72, -10, -38, -16, -33, -75, -10, -33, -6, -6, 36, 8, 35, -2, 25, -58, -2, 39, -95, -104, 3, -51, -30, 11, 54, 96, 14, 12, 2, 16, -55, -63, -58, -58, -101, -14, -35, 37, 44, 78, 50, 64, 85, 14, 5, 19, -44, -99, -62, -5, -5, -17, 11, 62, 9, 47, 30, 6, 27, -97, -19, -96, -58, -32, 0, 35, 11, 17, 79, 43, 96, 8, -42, 18, -14, -97, -69, 21, -20, 30, 78, 47, -22, 53, -7, 37, 69, -10, -30, -30, -115, -28, 23, -29, 49, 65, 27, -29, 77, 61, 11, -5, -17, -44, -64, -45, -70, 1, 15, 66, -18, 72, 25, 25, 17, 32, 0, -42, -101, -92, -17, 31, -39, 16, 37, 98, 16, 34, 10, 6, -40, 21, -57, -75, 24, 15, -46, 29, 30, 23, -4, 66, 54, -18, 46, 14, -86, -12, -4, -53, -29, -5, 29, 105, 72, 82, 77, 20, 8, -12, -36, -81, 9, -47, 12, 8, 19, 36, 81, 54, 38, -24, 14, -24, -33, -87, -82, -34, -17, -8, 0, 40, -23, 38, 29, 4, -39]
3064c9O1o2Qk5j5O3l1N4L6LL1r7j6K2p4Q3j0m6j3M5nP7m4MO9o2j4K6o2l6OP0j6
3097ik1K4N7kl5%N4R8k09L1mk6k9%L7L7L8j3N1q5L0K3o9n4N8Qk1k4m9J01l2K8
3129gO1mm9L7l4j2K5l7o0Q5r5Q6K9l8L4jM5n5k0j1rq1N7N6m9J09n2J00o4n2L7
3160C1L5p6J6l7l7J16o3oj00J46j0j8M1K2l5J6p9M9o4KK2Rj4N0j3L2m4N5o3O5
3190D8Jo1l3p9J76r1K0l3J02p5NR3j11N2j2Jm5L9n7%N1m0J7Q3o2j2O8Ll2mm5k7
3222f0P3p9O8N8j01O3k9O2m6LM4p2j8M1n2l9Q2k0RK6qq2J24Kk3K7l8ql2J7J2K6
3254C0p2N7M3Qk8k6R9p1m5K9l1m3L5k3M9J5n3N8lK9l2mk0Jk4K7m2pNk3Q3L4Mp1
3288a2QmRk6K0k6K6o2P4o7P9K5q2O4Mk3oj4K7l8M9l9n8J02j17J35l5K4k0N0j04
$$ y = [-39, 22, -40, -32, -57, -72, -9, -40, 14, 50, 53, 84, -13, -29, -7, -81, 2, -8, -54, -67, -22, -27, 50, 6, 10, 79, 17, 3, 29, -33, -69, -63, 7, -9, -30, -6, 51, 49, 14, 14, 68, 166, -43, -12, -16, -42, -71, -71, -34, 3, 41, 28, 79, -6, 24, 47, -22, -76, -18, -10, -31, -55, -104, -3, -35, -7, 54, 50, 1, 38, 4, -8, 17, -20, -80, 5, -90, -4, 25, -13, 21, 20, 65, 10, -10, -21, -30, -111, -54, 2, -47, 62, 10, 110, 46, -6, 31, 66, -10, 6, -31, -68, 48, -15, -21, -121, 25, 15, -3, 38, 60, 25, 41, -38, 11, -53, -51, -29, -20, -34, 16, 3, 35, -9, 46, -17, 48, 49, -12, -45, -124, 52, -39, -19, -52, 50, -25, -20, 73, -38, 14, 2, 3, -42, -3, -60, -60, -9, -49, -32, 51, -11, -23, 45, 48, 16, 12, -33, -60, 13, -66, 2, 60, -41, 22, -7, 55, 9, 12, 56, -16, -34, 7, -45, -84, -2, -22, -13, 13, 5, -77, 47, 49, 26, 53, 15, 7, -25, -8, 4, 30, -42, 15, 58, 66, 38, 12, 111, 40, -5, 24, -7, -50, -15, -38, 11, 26, -27, 31, 28, 57, 25, 21, 1, 2, -22, 5, -37, -44, -39, -62, 21, 55, 59, -12, -4, -8, 1, -25, -5, -31, -5, -67, 7, -60, 19, 44, -38, 26, 30, 7, 1, -13, 14, -24, 25, -14, -72, 30, -87, 48, 13, 37, 17, 67, -37]
3319c7J6K1M1m6k3J6m5N6O0p3J1M0o3K2J1o9Nj8J1k8J07n9J01n1k9mK9N3o4L0
3349B1o2KON2k3k3KJ1j1P1K6k8k3p6M9Pp8M0n0J04LK9o4N3l5Q0k0j37K7M3k8M3
3381A1k8J9OL9L1j7q0N6m4o1LP9j0q2O0O5m1l4R2n4K4k3Kj0k2o2L2l1R9m3j4O2
3413B4k4O9k1n0M7m8o9N4j3j8L5Mj7P0L5j0Ll6J8j36J3N1k3o4O2kl2J64j30P5
3443C1Ql8m4J44o5o7P5j21R3l4J3l1P5k2k4K5mm4k7Q0n2%j9O2m9K8L3KK6Km9n
3475BMk6K5M5n3j13J05Jk6L7kM0k5k5n8O0m3l5J04k8l8PR7k6l8J8Q1r6k2Q8p9
3506a9J2j25R3j3qO3M3j1n8N4pj3k3L%n6K4J1l2R3o5L1P7o3pP4l1p0k7J5OJ6J7
3539DlJ3K5o3Q8m7j4%Nk0m0K4K6OkJRQM8k5r8O3k8k5k8LL7O9j12J01L2l7l3K8
$$ y = [-37, -21, 0, 41, -5, -28, -12, -57, -1, 59, -14, -3, 37, -26, -4, 7, -62, -57, -75, -64, -92, 15, -44, 57, 6, -23, -27, 2, 55, -9, 21, -41, -39, -33, 19, -4, -27, -25, -14, -25, 46, 72, 44, 21, -55, -6, 1, -77, -37, -87, 17, 20, 49, -15, 38, 3, 83, 63, -74, -47, -4, -32, 11, -17, 2, 8, 47, 78, 61, -19, 37, -7, -68, -65, 14, 4, -78, -18, 47, 6, -28, 64, 10, 34, 11, 13, 3, -19, -81, -49, -80, 19, -24, -38, 24, 0, 69, 48, -2, 45, -3, -72, -18, -31, -49, -14, -10, -27, 43, 78, 68, 71, 35, 53, -83, -70, -19, -42, -106, -44, -46, -78, 86, -44, 31, 39, 1, -43, 101, 36, -31, 44, -77, 16, -18, -5, -36, 39, 17, -7, 18, 14, -30, -57, 23, -29, -29, -48, 14, -35, -7, 26, 28, 54, 56, 7, 2, 6, -20, 5, 50, -3, -116, -11, -10, -36, 1, -1, 39, 14, -11, -69, -9, -52, -87, 17, -11, -49, -42, 55, 29, -9, 9, 90, -6, -28, 60, -19, -7, -132, -39, -52, -60, 3, 46, 35, -23, 31, 24, 11, -12, -9, -9, -65, -41, -30, -62, 31, -34, -3, 74, 11, 4, 78, 47, -23, -50, -35, -29, -13, 4, 1, 14, 39, -24, 64, 17, 3, 3, 8, -12, -52, -28, -2, 4, 2, 3, 12, 20, 68, 43, -55, 8, -20, -45, -73, -70, -33, 36, -76, 25, 57, 20, -13, 15]
3573A5M4p5QO1j39J4kP6k1L5l5KjP6j9m3J7j9LK5n0k1K9n6J28l9N0p6Q1q0j8J5
3605a5k1N0jo2qO9%L5l4M1o5RK3m3Jj4k1j6M4r5J14N3k2m6N3l5m9Q3l1k3J3j9
3637c2P6j9J5J6m8PM8r8N5n9k0N5Nl6Njk3OJ07n1K3J7m9q0P9J5p1L1k4O1n8k6
3669g4L3P9l3OJ3n4Ql4M0l4RN8m0JJ7M9n4L7K8l2k3o8L7l3lQM1N5k0L8l8j0j4
3702gk4M3k0l3j4N2p3Q9K8l5O5j2j7n5O9q5K%j0N4k7pJ5K5%J9k3p0J17o5j5m8
3734f2M1oN3rL4n7J6J4l2K9J9m9k7J8m3n4J49J3r6j5Q5jK4mQo6p6rJ40j07K9O
3766c5L1J8o6Q1nK4m7j2m2J8k2j6M2K1nJ4k2M1Kk6N8Kk0l6L7j25J05j9k5K1K4
3797A6L9n7K2PJk5njk0L4J9n1J7K0k5K6KP2j03QL7l2o4N3k2jJQL0O5j09O4J5p1
$$ y = [15, 59, -16, -8, 53, -86, -72, -74, 2, -19, 16, -19, -17, -18, 58, 39, -4, 13, -6, -3, 22, -28, -49, -20, -76, 52, 13, 63, -13, 68, -12, -30, -15, -36, 14, 13, -49, -57, 12, 12, 47, 13, 54, -11, -2, 21, -22, -21, -35, -56, -72, -28, -123, -9, 44, 22, -24, 29, -6, -55, 28, -3, -26, -13, -32, 44, 25, 40, 56, 8, 15, 63, -35, 20, -39, -59, -4, 1, -35, -30, -31, -54, -48, 59, 8, 31, 48, -1, -81, -2, 13, -58, -27, -51, 10, -48, -74, -41, 38, 5, 11, 24, -30, -22, -56, -16, -50, -41, 17, -23, -22, -5, 44, -10, 27, 55, 23, 0, -68, -31, -64, -67, -59, -18, 37, 17, 55, 17, 7, -7, -31, 12, -8, -41, -55, -3, -76, 13, 41, 6, 71, 59, 42, -13, 56, -29, -27, -27, -37, 17, -10, -17, -2, 23, 23, 42, 19, -51, 66, 1, -14, -62, -21, -27, 26, 17, 51, -6, 10, 24, -8, 21, 40, -9, -36, -18, -61, -115, 34, 47, -49, -64, 21, 20, 44, 40, 48, -18, -94, -103, 37, -70, -41, -35, -4, 14, -52, 29, 24, 48, 1, -11, -53, -35, -57, -73, -31, -10, -15, -1, -23, 18, 20, -6, 52, 54, 34, -2, 35, -90, 15, -4, -29, -8, 16, 55, -2, 20, 27, 28, 3, -2, -3, -23, 11, 30, -21, -4, 16, -9, 17, 19, 91, -12, -4, 33, 1, -63, -10, -32, -33, -32, -24, 6, 71, -38, 26, 41, -30]
3831c0j3KL4j2j5m6NM6j2K5Q5l1k1j4m5K5m8RnN2J4ol6L3M1q2M4L4oj4Kl2K7m5
3865c5K4M6p3J23n7J7q0PK6j4km0O6l5jM4k2J7MoJ9n4O1n2MqK4j2LLr3Q2K1k3
3899a6K7K4m7j8L0n9M1L3n4l6Q3M2Ro9O8l3j1l0m5J02j05N1k5p4Q2M5l3K2K2l
3929B3J3l8l3O9m7pj8OR7q9o3P2J14m2l8O7j39K5n9K1L3l1J05q7N3J1q2J29k9
3958C6n7k8M9m4j2K4MPlK3O3N%l8k8n1O3j9O8p9nM0n1O9K0k4j9j1K7l0l9M9JK
3992A2l8M6l6j6L2O8k1k0l1m9K2j1j0j6K8K0j7L0O9pnm1n4P4m7j0L4m1JO3r2O1
4024bj37J14O5m6O5n8k0n7J9K1JnRpN3L4l2j3PJ3o5j2J1L9l5j%N0L0l6p0M8N9
4057D2MJ5j03L6j7j8J3Km9O8O0l9j5J5L2n8J3k0J7n7km4J19K0qK9m2N7k8p1M0
$$ y = [-30, -43, -41, -7, -19, -34, -80, -75, -29, -41, -16, 69, 38, 17, 3, -42, -17, -65, -56, -61, -9, 5, -1, -37, -4, 37, -45, -1, 33, 27, 13, 15, -17, 10, -35, -11, 35, -38, 85, 28, 45, -35, -28, -2, -16, -18, -58, 8, -27, -28, 16, -6, 11, 15, 9, 28, -26, 35, -17, -13, -21, 3, -9, -6, -3, -96, -14, 7, -16, 11, 35, -12, -30, 0, -59, -18, 15, -39, -75, 8, 50, 59, -10, 58, 25, 14, -16, -61, 41, -64, -13, -38, -112, -30, 15, -18, 4, 26, 23, 36, -2, -35, 34, -13, -20, -38, -32, 65, -24, -87, -15, 99, 57, 19, 86, -53, -28, -87, -66, -33, -64, 41, -46, 7, 18, -64, 65, 36, -21, -49, 0, -44, -56, -32, -28, -21, -24, -1, 62, 67, 67, 29, 1, -50, 13, -6, 62, -17, -22, 18, -33, 36, 56, 32, 13, 2, 29, -1, -40, 9, 10, 12, -26, 20, -16, -32, 0, 68, 47, 27, -4, -53, -31, -42, -52, -68, -40, -20, -37, -7, 62, 55, 50, 9, -45, 29, -18, -28, 6, -35, -34, 29, -63, -2, -139, -25, 40, -6, 59, 1, -19, -76, -57, -36, -35, -40, -31, -38, 15, 49, 17, 4, 11, 24, -41, -53, -42, -3, -38, -39, -39, 11, 41, 5, -65, -17, 42, 46, 61, -42, -6, -23, -41, -28, -26, -75, -7, 53, 14, -1, 14, 46, -12, 1, -19, -2, -59, -61, -105, 14, 34, 26, 55, 13, 70, 42, -29, 11]
4088A1k9qRn8R6k1J6K6n3M4k1k6K4j3j3m0K2j2O8K0m9j3Q4L8l9k2m0p5P5N1p2
4119b0n6rP3P6j45J11Qq4M0NRRk3kk7J8nRj7O9mlK3o4N7p9K3K3m5OmOM4l9P2j00
4155d5N1J8K5L0r0l4j9L2k3R1K4o7nOK2p3Q0n2P4q6J4m6J37j55M7J31o2M0o5m
4185dn7J46j01n4L8J8j8K0L4N6k6k3M1k7L2k7o2k2K1J4j5qMJ2L6pn7P7k3O5m5
4216C8k8M8p1l5J6M2Km1M0l0P2l5N0r4L1l4L9k4l3m0L7M5M3jl5L4K5o0k7nO0l5
4248fm7j7Q3P4n4j6J3Pl8J8l9jO9n3l0K2rK0P7rp8N3j3k6n6L3Nrk1M2kl1QL5%
4283DL3r6P5j01L5M8OPm4j5j5N0K1Om1k5N1J1N8k7j16K6N5j7m5j9J15nL5Rj4l1
4315C4k9ok1p8N3J9qO2j4p1R4kl6qN6ml7K4o9Q2j9l5J6K6N7j10Q3l9nk9nk0K6
$$ y = [11, -18, -26, -17, -75, 21, 0, 16, 42, -11, 33, 12, -14, 10, -3, -16, -56, -34, -46, 22, 42, -7, -20, 64, 102, 63, 41, 1, -74, 1, 52, -20, -76, -85, -12, 64, -81, 30, 38, -46, -6, -1, 8, 17, -6, -8, -35, -17, -22, -13, -30, 39, 35, 32, 55, -9, 48, -31, -8, 15, -30, -24, -28, -22, 22, -17, 55, -45, 6, 24, 49, 79, -11, -45, -64, -32, -55, 36, 60, -7, -12, -6, 16, -57, 23, -29, 45, -41, -27, -73, 64, -91, -44, 87, 25, 65, 0, -4, -61, 85, -16, -70, -32, -14, -32, -12, 22, 78, 52, 29, 70, 43, 75, 48, -14, -36, -15, -1, -16, -24, -20, -8, 28, 21, -36, 41, 18, 83, 38, 10, 58, -13, -48, -32, 10, 12, -29, 11, -19, 53, 18, 68, -26, 5, -29, 10, -14, -47, -87, -50, -5, 38, 37, 2, 36, 61, 1, -26, -31, 29, -6, -53, -70, 13, 87, 33, 17, 30, 37, -1, 17, -22, -23, 46, -7, -37, -15, -24, -4, 73, 64, -14, 39, 26, 0, -56, -23, -18, -27, -48, -6, -8, -39, -31, 4, 4, 37, -59, 16, -85, -50, -2, 4, 11, -33, -48, -63, -13, 8, 14, -27, -52, -1, 10, 68, 41, -75, -49, 6, -11, -56, -75, 40, 35, 70, 79, 65, 34, 5, -1, -22, -100, -47, -28, -36, 26, 12, -59, 35, 33, -3, -11, 45, 41, 4, 28, -41, 41, 22, -13, 3, 29, 86, -24, 59, 20, 15, -14, -19, -39, -13]
4348a3l1OP8l1O0p4L6n2J3QL2J5r0J8M2N6j21N8lO5l2j7m8N6jn1L0o1N8k6koQ2
4381E4l8J1k0J4l3PJ4J1l8m6l8Q2l0O0oJ8k9K3L1k7K3j39K5N2l2j1lN0m0R3K5
4412F3J1j44Q9m8p8L5L1P4j07P1K8k5m2J8J6J8PJ2j6m1m6R2o7M4N4q4K6M7k3R
4442B4pq3O7K5n1RL0m7N4Lm2J07o0K6j3n4K1L7Rl8K0j25R2OM6p0K1N2n8oL3Pn1
4475a6l2L2rj6RJ6J8j0n4M5O2m1l4M1nJ2q4OR7J2n3K3k8J0L2M8r4LL0m4k7N4n3
4508e0Q8l6ONm2O7r8j5N5kk3QK7J6o4J19K4o7k0n5J2M1k8%j0N8m8J5L3j1o4J11
4540E2n7P6m8J5p2j4R9j6m5P5nK3o0k4NN3j0q5P4p6J2m7P9j2j0K7j2L8m6K3l0
4571a8RJ0kqj9J7L8M5n4L1p1L4o0pP3J1j05O7l7k8N5KJ7K1N9j0p9L2n9P4mj1p2
$$ y = [-13, -44, -38, 40, 9, 69, -5, 31, -21, -8, 0, 32, 47, -43, -25, 17, 73, -48, 10, 7, 72, 40, 23, -25, 31, 30, -21, 9, -52, 6, -20, -22, -28, 54, 16, 27, 7, 21, -12, -5, 9, 20, -18, -64, -102, -20, -50, 10, 4, 22, -7, 16, 47, 20, 43, -96, -71, -19, -51, -62, -65, -15, -55, 38, 63, 74, -70, 19, -29, -107, -72, -41, 33, -74, -3, 25, 0, -42, -24, -8, 10, 17, 29, 13, -28, -74, 18, -49, -5, 49, -35, -9, 38, 15, 24, 17, -66, 1, 26, -25, -16, 14, -33, 21, 24, -18, 89, 29, 55, 42, -12, 9, 46, 55, 17, 37, -88, 4, 10, 56, -14, 7, 59, 1, -5, 28, 35, -16, -48, -16, -25, -41, -32, -16, 2, -8, -62, -17, 45, 4, -30, 11, 6, 18, -66, -60, 37, 49, -4, 19, -9, 1, 33, 81, -13, -10, 20, -24, -51, 3, -50, 38, 2, 8, 13, -29, 38, -60, -75, -20, -22, -45, -37, -10, 6, -58, 61, 85, 18, -2, -57, -45, -4, -32, -32, -42, 16, -32, -17, 16, 5, -59, 52, -5, 71, 23, 38, -34, -48, 51, 35, -10, 65, 60, 83, 23, -1, 4, 57, 47, -38, 36, -40, -28, -75, 4, -8, -18, 9, -3, 35, -11, 12, -18, -9, 1, -1, -9, -28, -11, 27, 72, 18, 49, -22, 12, -48, -55, 18, 29, -76, -9, -46, -74, -19, -17, 0, 21, 80, 70, -9, 23, -36, 38, 34, 23, -49]
4604d9O6J5m7RM9j1m5L7L1j27M4k5J02k6l3M9r4J01k7j9LK5l4pL3J3j06K4K2K2
4634ej5K4L4l5L0j3j5L8j33Q0p7Q6N8o5j5qL3NK4Pk9M0j11M5M7o4k0O7k3P0n1
4665Ik7Q5k7l9oj4JJ7l8Qk4O0n4O1p0Q7N4o5N9m6o8R1p9o1j7N9l1P5k6M9K0Jq3
4698c9N7m1L3l9Jjk0P0j7l7P5k0o0P8pj9kr2P9m3M2On9J8L1Lk5P2j7L4n9p1Q1
4731A2q1O6k5m2O5m4O2L6l4J1l9Jj2k2K0kK3O6l8J7m3k2Q1n8M0l4L6rn1j2oJ6
4763b2K0M7j5j8M7o4M0Kp3L8jk2K8k2Jj3N8q0N8l1K8m9K8qqJ0R1m5m3L7m9L1L2
4796C3k8nOp5R0rn6k6Q5j9Rj4K9K7J7k0K9j03k1L7K7l8J8N5k2l5J2l8K1O6o8k8
4828d4Q2r7M4m1O3K2o4L8L9n9K0M1j9j1Jn4jP3o4O0m2N6l6rJ8m7nO3r8P2k4M0
$$ y = [-49, 17, 32, -15, -6, 43, 32, -13, 24, 55, -72, -28, -53, 49, 23, -10, 39, -55, 46, 19, 0, 3, 28, -6, -13, 20, 33, -73, -49, -27, -5, -20, 4, 38, 3, 33, 20, 5, 43, -90, -10, -87, -1, 57, -8, -23, -31, 2, 7, 31, 38, 9, 49, -62, -17, 30, -34, -54, 13, -10, 60, 9, -18, 67, 40, 1, -5, -19, -18, -1, -39, -31, -55, 5, -49, 12, -58, 29, 83, 18, 77, 31, -37, 54, -25, -86, -103, -44, -75, 0, -26, 23, 43, 44, -39, 18, -23, 10, -29, -28, -29, -49, 21, 4, -33, 42, 22, -38, 40, 33, 14, 12, -80, -1, -44, -2, 4, -55, -37, -6, -3, -28, 44, 27, 61, 2, -69, 12, -69, -3, -28, -70, -5, -49, 13, 49, 15, 26, -13, -12, -24, -46, -26, -28, -5, 61, 23, 40, -3, -25, 56, -2, 38, 4, 40, 31, -20, -32, -38, -22, -2, 45, 30, 12, 59, -5, 35, 37, -36, 2, 1, -21, 7, -15, -14, -27, 31, -49, 9, -22, 6, -43, -15, -23, -31, -21, 70, 25, -18, 19, -30, 1, 33, 5, 0, 6, -69, 21, 12, -44, -70, 15, -4, 5, -9, 20, 47, 64, 44, 73, -30, -51, -14, 13, -25, -7, 48, 26, -9, 3, -35, -14, 52, -16, -44, 38, -59, -15, -56, 7, 29, -35, 3, 42, -17, 3, 44, 25, 14, 15, -39, -40, 33, -31, 29, -13, 43, 7, -2, 16, -31, -36, 27, -71, 1, -23, 17]
4860A7j14J38Lk7oJ7m0P7q8Kj0M6nQp8M4l8L6R4l2k5Q7o1o0JlK2q5O2L3m7NO8
4893D1j8J2k0k6L3l1JqJ2j1m3Q4j2Nnn0j7L9O2o8J9k0%j0K8k0J2J0J0K7p1L1K0
4926A6r7P5l6j2P4p6J04m6K0M5J2r1Nk7O1j04N6J5n2M2L0l0l7O7l5N4l6m8l1Q3
4956Aj21J13j02M4L5%K3N0k3k1J5Pmk8k0j6J7K0l5k0J11p8K6R7j10K8J1m9N8k4
4986Em0J3L0rN3q9J01l0m9M2k7J1Mk7n2M6L2l4M7j6Ml4K3PK8n2l5K1J8%m0L1P3
5019E5q0L7J0L8o7n7O9M0j06jQ4l6M7p7M2K6J1j2j0l5L8k7l3M1j7M4k5n8O3Rr
5050DJ9L8m1k1L4k7l6%j3K5KK2J2k5M5j3k3M2o1p9P3J5Q6j01nM5j7j3Nj6L8l3
5082a9j0J6L6l5N1k7rNK3p2L9LM1m6p3N2n0M9L5n3M2Ml9P2k9K8j0n1j9M6n5J9
$$ y = [17, -97, 41, 44, 17, 11, 28, -12, 65, -23, -21, -31, 15, 10, 18, -60, -16, -54, -18, 76, 44, 19, 106, 45, -15, -14, -17, 5, -80, -18, 15, -32, -27, 41, 23, 35, 15, -11, 22, -9, -8, -16, -4, -15, -58, 26, 14, 19, 14, -36, -53, -14, 48, -20, -1, -21, -21, -31, -3, -23, -11, -1, 9, 36, -35, -4, 16, -81, -6, -42, -54, 20, -56, 48, 2, 22, 67, 79, -12, -7, -34, 27, -77, -21, -6, -58, -16, 14, -16, -53, 14, -21, 33, -3, -51, -82, 1, -120, -7, -109, -65, -30, -30, -7, 43, 20, -1, 14, 21, 17, -11, -31, -47, -30, -10, -45, -65, 46, -32, -6, 91, -19, 9, 20, -29, 29, 5, -35, -22, 8, -1, 52, -37, 64, 34, -15, 27, 0, 11, 15, -12, -64, -18, 14, -20, 27, 11, 15, -19, 4, 11, 39, -13, -48, -27, -9, -9, -49, -18, 55, -25, 12, 22, 60, -7, -64, 5, 45, -61, -62, 22, -14, 33, -44, -2, 24, 35, 23, 13, -22, 16, -11, -44, -3, -20, 24, -1, -59, 4, 13, 4, 23, 61, 20, -1, 33, 6, -30, -30, -43, -18, -16, 6, 18, -7, 38, 25, 2, 44, -17, -96, -23, -8, 78, -23, -28, 17, 0, -13, -8, -24, 14, -19, -29, -13, 23, -12, 39, 12, 3, 8, 31, -41, -2, 1, 42, -4, -77, -25, -75, -26, 9, -44, -2, 2, -37, 35, 6, 34, 24, -27, -46, 0, -55, -36]
5114c6L2lJ0jj7O3o7M5K7o3O6q2J2K7j5oj11J12M0m6k2M9j0j8lo8J20l4l2M7O
5145B2M9q1PmN8q4N7l1m0K9K3j5k8J20l5k7M9n0l9O1l2l3L2oj8k1qL5K3k1oNj4
5178b3N4l7J0k2rM4l7rp3J5R2lk3l0N0K2pj0l7m9R7Mk7J05j15j3Lj6P0qM3p7O4
5211D8j1l7K1k9o2O2J3l2L8j3%N4m3K6m5L4o8J8pj2L3j1N9j8q8P1k4M0J2m2nj1
5243b9k0N8m1L5K3p6L1M4n1O1q2j3L8n4P6Ok7l8J04n4J3K9o0m9J08j01K0J01n6
5272dl7J6L4l3PM0j7K3k8J1n2L1K3p1J07j8p7N7l3N9r5P0J1NKm9M2j03J6L1k2
5303e4O8J5M2j34J6N6p7R3j7J4n1%l5rR3m0k2L6K1MK9l3q3P8K1l4o9l3J13O0m7
5334B1L8k9pk5J5N6j11m4J06n4J01n5jo0L7N8m2O3r0J03j08k2R4r9O5K7r9M4k5
$$ y = [-36, -4, -7, 3, 2, -15, 48, -19, 26, 53, -10, 56, -26, -14, 13, -2, -8, -119, -7, 33, -13, -35, 14, 4, -14, -17, -85, 35, 1, -31, 16, 22, 71, -10, -3, -7, 51, -33, 24, -7, -47, -18, 5, -10, -38, 82, 47, 20, 69, 19, -20, 41, 9, -24, 8, 2, -16, -37, -45, -10, 13, -8, -14, -9, -23, 31, -6, 4, -18, -27, 17, -20, -29, -102, -87, 5, 2, -21, -51, -1, 21, 14, 4, -33, -82, 15, 19, -8, 97, -18, -31, -28, -44, 26, 18, 61, -16, 48, 37, 0, 21, -8, -70, -8, 5, -27, 11, -2, -2, 52, 9, 35, -10, 24, -44, -26, -33, -45, -12, -23, 36, 18, -70, 1, -23, 17, 29, -13, -18, -29, -49, 9, -32, 3, 26, -50, -19, 25, -26, 35, -47, -60, -22, -76, 0, 6, -21, -59, 45, -9, 4, 33, -27, -76, 32, -69, -49, 52, -4, -41, -25, 9, -24, -17, 23, 6, 29, 1, 12, -40, -9, 14, -57, 50, 32, -45, 12, -21, 38, -57, 13, 24, 29, 31, -18, 24, -79, -63, -32, -54, 14, 29, 71, -63, -47, 9, -68, 25, 8, 22, -29, -29, -64, -73, 20, -20, -42, -6, 15, 19, 48, 15, -68, 10, 31, -3, -72, -105, 8, 68, 21, 59, 30, 23, -2, 13, 69, -42, -86, 20, -34, 67, 12, 11, -49, -12, 46, 4, 67, -23, 80, -28, -50, 44, -55, 10, 37, -62, -18, -43]
5363d3J37j03K5L1L0o8k0k7M9k7k3N6j1p6P6NMk2l3O4l0p4N7m6J00j3L7J3o1J0
5393A7KK7l0mrK9k6L0m0J1o8Q6j10N5R5n8J2k9kNj0J3Ooj6J3J4M2o8O3m4Rk3o1
5427g5N1J17o4q8O4M7J2j29Q2K7Rj3rq9M8%N8k6j8L2j7l7P9n4m8M7m8M3k9j3%
5458d1PK1j5K6k7K4l6M5k9Q0q4jkJo2L9K6K5O7j24j7O6MM5l1j6m4l9J06n1N7m7
5490b7J23q5k0l1L7M7k4J5q5K7k0P4o4K0L0K2l8pPJ6n6N2J6rk6N3q0K8o3P2J5
5521A9Pm6j9N4K2p9N3lk3J2QK6l4K5m1M4Np8j2P5K9q6K0M0l4R2n3Nk5K8j2L5q5
5554c1J8ol2N4p5R9n3mN4k1l2N1K7l2o8P1k4n9L4kN0n8Pl8J06n0r0J51j07k7J21
5585C4o6P5l9l5L9L8j01P2q1Q4r3P4K6k5l5K1J4k5l2O4Q4p1ml6K2j3M3k0O4o1
$$ y = [-43, 94, -9, 16, 47, 77, 9, -11, -38, 11, -16, -39, 17, 6, -70, 6, 11, 15, -7, -40, 24, -6, -80, -23, -69, 31, 18, 55, 68, 7, 17, 19, 46, 16, 12, 3, 32, 6, 36, -4, 7, -61, 25, -85, -30, 65, 7, 19, -10, -12, -7, -17, -4, 2, -4, -20, -7, 7, 49, -19, 44, 0, 9, -14, -75, -24, 93, 29, -59, 5, 52, 64, -65, 17, 44, 53, 40, 31, -58, -10, -10, 48, 22, 4, 36, 19, -18, 61, 7, -41, 6, -42, 1, -28, -41, -41, -34, -13, -28, -2, -29, -5, -41, 4, -25, 55, -29, -30, -32, -31, -93, -54, -28, -3, 64, -60, -77, -11, -7, 38, 7, -9, -53, -92, 14, -37, 20, -27, 96, 11, -9, -40, -3, 44, 20, 35, -50, -23, -43, 31, -33, -13, 17, 39, 1, -6, 1, 17, -39, 13, 29, 20, -6, 47, -33, -5, -68, 4, 19, 26, -20, -39, 15, 37, -42, 11, 8, -15, -3, 5, 31, -3, 22, -19, 25, 30, -48, -60, 15, 44, -42, -22, 18, -16, 76, 23, 28, 3, 31, 19, 54, -31, -13, -19, -51, 3, -72, 27, -26, -30, 24, 3, -29, 22, 49, 17, -51, 20, -4, -63, -29, -31, 19, -39, -32, -70, 36, -14, -104, 47, -60, -87, 34, -32, 43, 4, -31, 8, 46, -55, 17, -64, 20, -73, 1, 27, 2, -33, -12, 2, -23, -55, 9, 93, 22, 18, -18, 4, -9, 34, 14, 78, 17]
5615A7l9L9J2j5j8J2J7m7j4L6l9M9j7K5l9k4O2oo1N9J0k2M7Lj13P8J0o4M8j9N8
5646D5j5J4Lj4K4p6j0l9N1m7Q2k8OK0l0N5nRn9L3l7L4j5L3k8l3K1nJ4JO1ol9%
5680B0Pk0k8K6l2J0J4M0lQj5j9n0N4m9J9P8m6l8J3J8j1JqJ3k4J7pM9m0m5J6J06
5713G4j20K4n2O7q3Q1M6mn3JN8p2P8k0N5q3KppJ8N2k5k8l1M7%k3l5L4K5j4j1O2
5746E6o4m5Q1MJ5o5L3n8l9J4L9L8jO7rk4k9pR0j49k7Q3j1O9j14J00o2Lm5N5K1
5777A9Nj4L1L5ko0k9j4O0Po6J2M6kl2NN9r0k3K9rJ7Po2J22r5J2P5n2l1N6p8Q8
5810B6k2m9K5NN0k2j6k2J00n1Kr4P2j9okOJ3l7K0M8n1J05k9O5r0l5l4J5N3l6q
5842a8P7n4K2m6J5L6k4P0p9n2J4M3j0jQ2r4k3O3k1ql5M9l1l6jL1Pq3O0L9o5J05
$$ y = [17, -22, 17, 29, 14, -4, 8, 25, -22, -36, 0, -39, 10, -7, 18, -21, -45, 17, 11, -50, 9, 19, -3, 44, 47, -66, 12, 22, -42, 6, -13, 45, 30, 44, 47, 33, 57, -19, -29, -68, -17, -64, 18, -10, -4, 16, -14, 41, 36, 45, -14, 19, -18, 16, 1, 34, 6, -27, -6, -11, 3, 4, 65, 59, 20, 20, 27, 7, -21, 5, -27, -17, -3, 37, 34, 42, 27, 8, -42, 12, -37, -18, 60, 14, -24, -11, 7, -4, -3, -11, 2, -22, -5, -12, 37, -3, -48, -32, 74, -46, -22, -74, -7, -90, -9, 37, 33, -20, -19, 39, -33, 45, 25, 80, -3, -1, -8, -15, 3, 55, 30, 2, -29, 18, 18, -5, -40, -6, 19, 5, -6, 56, -8, -53, 28, 32, 47, -18, 15, -43, -82, -68, -29, 9, 8, 75, 66, 42, 13, 6, 96, -53, -80, 3, -8, 61, -53, 47, -15, -12, -57, -2, 19, 24, 10, 41, 76, 74, 14, -15, -29, 31, 38, -28, -16, 30, 28, -4, 1, 60, -30, -53, -24, -33, -16, -9, -71, 51, -44, -32, 43, -9, -40, 16, -62, 26, 4, -45, -20, -15, 35, 13, -3, -25, 75, 24, 26, -68, 4, -15, -21, -23, -17, -4, -41, -21, 27, -24, 81, 52, 117, 27, -8, -42, -27, 26, -10, -18, 59, 5, 27, -19, -4, 32, 8, 78, -1, -53, -39, 4, -6, -7, 75, -19, -42, 21, 0, -8, -43, 6, -25, -61, -62, -31, -24, -107, -47, -8, -73, 32]
5874C2k4j9L2o3L0Pj3J04j59L9M6Qr4R5j0l3KNj5O2Pn6j0n0O9L2pqLn6Q2Jl4l4
5908b9j6N3o1Q3n4K0M0o7L6k9K6M1m1Jj5k4K3l7J16o3j9PK0m0L7Q7j05j9M0Pk3
5939ek9R0n1LNm5N5l7P4l0J0Mo7n9L7L2K1k7N1j6l2J6N3m5n6J07o5N3n6PK6o1
5971c7M4k4K7j8Lmm8O2k8R6j21P7J6l4l5L2Nj8o1Q1k8M3rk8j5K9n1R0k1k2K0o
6003A7j0l1j9J9N0m0k2J4n1J06Pk2pjj4J5L4q1J9j1l5P7j9JQ4j04JO3kk5j4j7
6035a8J9o0L2K1O5p3J0l6L1k9P2q2R7k8j01Q7k1L6Nl7j0J6lL7K6m0Nn6N1N5j05
6066c4N4Ml8J9N3j34R1lo6N6L0j9M6l1j9K6p3M3n2J7pL5k6K7N4j4n9jL8mRk0R
6099A1m2k7PQ1o4M1L1n2J3J9o3P6J1j03N5%P0p1L4mj4l8O1r4K5K2K7k4j8M9j0
$$ y = [32, 8, -11, 21, -42, -12, -5, -18, 86, -73, -34, 12, 20, -74, 21, 11, -22, -20, -15, -30, 32, 39, -17, -27, -77, -8, 24, 17, 9, 12, -44, 38, 39, 5, -29, -45, 8, -53, 30, -24, -4, 36, -31, 5, -24, 2, 43, 2, 3, -12, -36, -13, -50, 66, 3, -16, -9, 11, -29, 8, 95, -10, -29, 11, 18, -5, -34, 56, 5, 8, 13, -32, 23, -14, 60, 30, 40, 44, -23, -82, -45, -13, 8, -19, 32, 16, -16, 0, 53, 8, -48, 59, -6, 47, -9, -2, 24, -37, 7, -17, 10, -8, -5, -9, -57, 5, -23, 73, -48, 29, 45, 11, -24, 8, 13, -5, -66, 15, -13, 30, 21, -7, -22, 7, -44, 46, 25, 3, 23, 17, 7, -24, -43, -24, 26, -14, -36, -22, -73, 33, 40, 18, 11, 10, -4, 11, 45, -36, -17, -28, -63, 14, -5, -4, 80, -24, -23, 40, 38, 13, -1, -18, 1, -59, -27, -6, 59, -14, -4, -40, -9, -38, 34, -48, 49, 21, -80, 7, -14, 22, 27, -10, -20, -4, -7, 30, 56, 16, 21, -35, 16, 71, -34, 20, 24, -14, 5, 58, -76, 15, 12, -54, 2, 32, 13, 59, 28, 9, 35, -38, 5, -47, -30, -37, -2, -28, -1, 53, 39, -20, -21, 17, 13, 22, 2, 11, -31, -58, -51, 30, -34, 7, 38, -14, -1, 18, -45, 31, 42, -61, -6, -6, 64, -7, 27, 23, 9, -29, 32, -62, -37, -15, 12, -12, -30, 19, 9]
6130Ip3J8R5n4l6L7m6M0NPl0j9P6m6O7q7lnk0J2qR2Rp0QNqk6M1L8l8j2j3K5J6
6165FKl1J7M0n1K0k3RqP2m8L9Ql5p1L4J04l8j41R1M1r1L3L2j6J7Pn9k3K7J3K3
6197@qL7l7J5M1l4j4J9j4lML1n2L9o5M3LKj3J5J6On0N1k5l7N0l1k9Q7n6P9m6Q
6231C2j7j5n0N0K5l9L8p5J7mN4rL0m1O4k3k7OK0k7m0K5L5j8m4M0p4N8ojJ3jk5
6264b9M5l0J6k2pQ2o6o1J42j03rN5oP1n6k9Lk9M7j00R9M6j05kN7K3n7O2K5l4r8
6295g0Q0l3l8J08m1j4Q1l2n6M4L5j27M7%K8K2lp4ORL5Kl9jK2L8M8p1k6J9Mj3k
6328a2K5j6j8J8k1P2p4R3p4j6L0l9O3k8K4Qrk0M9n5m4o6J24N8p9j0J1K3mn8P4
6359B9l6KL7k3J2n5J10j03J6Qj4J7M7p3O5k5l0K0mrK7K8l6p9M5K3n3N4k1L2j3
$$ y = [9, -64, -46, 49, -5, -41, -4, -50, -10, -5, 2, -28, -47, 29, -17, 50, -37, -40, -45, -65, -53, -61, 31, 40, -30, -22, -17, -25, -51, -10, 28, -10, -22, -35, -10, 6, 8, -23, -6, 34, -17, 3, -20, -11, -19, 53, 5, 44, 52, 17, -54, -20, 84, 46, -95, -4, 37, -54, -21, 11, -5, 12, 19, -40, -63, -36, -23, 0, -8, 29, -8, 7, 48, 14, 0, 19, 5, 2, 6, 37, -15, 24, -41, 2, 5, 7, -6, 9, 25, 31, -19, 32, 7, -30, 20, -11, -40, 47, -9, 70, 24, 32, 15, 0, -50, 0, 25, -14, 24, -51, -34, -38, 16, 7, 37, -4, 60, 37, 10, 16, 36, 9, -31, -6, 29, 11, -33, 7, -67, -9, -15, -16, -3, -4, -29, 16, -14, 2, -20, -27, 55, -11, -72, 70, -33, -42, 13, 7, 78, 22, -7, -4, -33, 14, -86, 13, 59, -46, -48, 9, 32, -25, 37, 62, 28, -70, 10, -23, -61, 47, 6, -8, 73, 41, -15, 29, 64, -63, -16, -16, 12, 34, 31, -43, -37, -28, 7, 9, -30, -31, -9, 29, 77, 6, -20, -1, 3, -10, -12, 13, -3, -21, -3, -24, 48, -26, 67, -7, -23, 7, -32, 31, 3, 27, 35, 26, 6, 55, 0, -44, -110, 14, 72, -7, -17, -6, 17, 13, -45, 29, -7, -5, 32, 9, 21, -34, 76, -27, -11, -3, -17, 0, 47, -26, 39, 14, -16, 4, 0, -9, 18, 46, 10, -69, -24, -1, -54, 0, -21, 11, -2]
6390bN4l3k7j1O2m8k0K9N6j3jm7l3PN2l7j9K9l0J7L7Rj19M7K7m0P6j0L4l7L6m3
6422Bj7J8n1O8ol6O4q5O7l0n6Q0Ol9rL3RK7j06P4jj1k4pP4n2OL3on9K5k2K8J8
6456A5l4L1KL7K2j02R3o6l7L3j7L8l6O4%l9n0j2R9l8J7m4rO2P7o4o2l4P2N0j21
6487e3m4J24k3j2NJ2rK2L7l3l2Nn6R1k0mj5L5m6M7k7j1J6m5K1MM2m8J4O4n2MM4
6520E7j9o1K6OL5r4K8J3o9K2O2L3k0nM8r0nK4nOpM8r7M0PR7q5PN8j14O7M6p2j0
6554b3O9l4n1K2o9R3j8K8pRk0J7J0lk3l2O5%Ln1M2J1J3m2P0j11LK0n1J71j30Q1
6586F2o9L7n9Q7m3J2NK4j32N8j1j2oM1QN6j5l9l0Q2q0M3%q0P2o5K1K5J7j5M3K6
6618F3j5J7r4N0j02L0O8QKm3M6k1j2j7M2l3L9m8P0n5jl5M6K9k8M0p0qN5m0M5l7
$$ y = [-2, 52, 19, -8, -19, 43, -5, -25, 4, 60, 47, 46, -1, -34, -27, 25, -12, -31, -2, -32, -15, 22, 31, -88, -41, -14, -54, 22, 12, 46, 9, 45, 2, -15, 3, -48, 20, 14, -22, 42, -43, 24, -6, -62, 18, 24, -15, -24, 9, 18, 45, -61, 13, 12, 1, -23, -30, 44, -8, -2, 31, 25, -34, -9, -31, -3, 15, -19, 12, 14, 51, 73, -29, 64, -2, -39, -6, -23, 15, -21, 43, 43, 4, -46, -58, 41, 3, 20, -24, -33, 29, 106, 42, -20, -54, 18, 68, -53, -97, 27, 4, -8, -3, 9, 0, 22, 59, 26, -6, -1, -57, 34, 14, 10, -5, 30, -16, 31, 4, -7, 9, -36, -15, -11, 31, -17, -3, 61, 9, 13, 57, 38, -23, 3, 9, 44, -50, -22, -9, -78, -56, 6, 39, 19, 14, 62, -28, -33, -9, -14, -8, -15, 33, -64, -24, -17, 80, -5, 2, 60, -54, 13, 59, -13, -23, 46, 12, -39, -17, -86, 7, -11, 17, 10, 19, -1, 16, 26, 23, 0, -32, 33, 33, 36, -15, 27, 38, 51, 9, 79, -32, -29, -9, -60, 111, -19, 62, -7, 30, -29, 58, 15, 27, 32, 56, -76, -18, -29, -41, -47, -6, 2, 58, 43, 4, -26, 56, -24, 19, 19, -61, 11, -54, -33, -8, 9, -6, 37, 63, 48, 65, -29, 21, -81, -51, 17, 25, 27, -16, 30, 9, -3, -20, 22, -11, 28, -20, 50, -5, -6, -41, 5, 34, 6, 46, -24, -32, 23, -17, 28, -9]
6650iM3Nk5pj7KJ8LL4l1OQqj9RJ5n3L8m2L9l4KM0J5J6m7L0q5L1K8j5K2K7l3Ko4
6686e6M6K6m7P1m5n0P5m5JKJ7K4pK9J2l4Oj6m4lJ14k2q5K4M8m8Mm0J3M1Q%J4K9
6720F2p6Pk7M6l9j4P8k0M0r8O6K5n3L4n5M6m0K2n1k5J22p6J4M5k4o2J8P9j06k5
6750h7R1j8MN0j8j9Nn8K6L7lJ0m7M3%J9q9Q8p3K2M4n7O2pJ5j7k1Ll7RL5J1%Ml
6785B4L5r7R2Ml4j6k7L1mk0k1PP1o0J3KpN5l7j06J29Np1j2R7m0NK2l8l4P5j0l1
6818BJ0Np4O4K2p4j8J34j01J9P2Lr9L4j5J5j7MN5n9J4j8J8L9Mq1J2K6j4P3n8M2
6850C9j4p7N5o3P6KJ2Kk7ml8N6r0K6M3j9j0l2M5n6O9K8Lm7J6m4O3J8n1LM3m7m4
6883f4R5m9N4nr8R0l2k6L9nN1l7j5l5M4k1N6j4mK0p6Q4o0JJ1l1P4j05M6qj0N0
$$ y = [-9, 34, 39, 14, 7, -10, -8, 10, 13, 47, 16, 22, 30, 22, 3, 12, 27, -26, 12, -30, 9, -25, -23, 17, 32, 48, 1, 31, -54, -23, 5, -10, 12, 39, 6, 8, -56, -10, 16, -31, 40, -5, -55, 20, -25, -24, -22, -5, 19, 12, 41, 53, 19, 25, 9, -35, -38, 76, 54, -31, -7, 41, -7, -3, -43, -30, 11, 19, 19, 33, 62, -14, -7, -34, 12, -27, -41, 37, 17, 57, -41, 25, 50, -3, 31, -24, 22, -18, 4, -47, -72, 50, -26, -12, 33, 9, -53, -35, 44, -62, -87, 4, -14, -10, 40, 22, 3, 8, -50, -24, 13, 10, 20, -27, 16, 16, 35, -54, 34, -39, -17, 27, -30, 32, 25, 40, 23, 2, 5, -32, -23, 12, 23, 23, 27, 24, 59, -38, 54, 58, 24, 8, -19, 12, 8, -12, -33, -26, 45, -15, -2, 0, -7, 48, 11, -95, 34, 39, -32, -44, 53, 13, 18, 40, 2, -32, 43, 33, 2, 12, 17, -57, 7, 29, -45, -63, 71, -30, -11, 61, 64, -35, -1, -16, -1, -18, -14, 41, -18, -4, -22, -4, 35, 39, -42, -30, -4, -18, 55, -3, 39, 25, -52, 3, -60, 16, 18, 30, 32, 5, 1, -37, 19, -71, -45, -2, -21, -31, -63, -18, -74, -5, 23, 26, -21, -5, -49, 14, 32, -19, -16, 27, -20, -64, 31, -18, 36, 31, -67, 23, -9, -35, 4, -1, 50, 13, -2, -37, 7, -14, 42, 28, 24, 44, -32, 52, -8, -7, 4, -27, 47, -58, -12, -20, -30, 20]
6915B0l6J5M7n4J4m1Q2o0J0Rl7M2m3R5Nk6p9K4j3M2oN8o0L3r6L3L4m8ML7M2l9
6947Hk1k0K7K6l7N2Mj8p4P2K4K4o4M2q8O5k8K1L7m6j4K9Oj7j2O0o4K0L5m9LJj5
6980a1j9M8J5q0L9J3J3M8m8l4k9N9m6M9q4N9j1MM7K0q1j1L3j5J04p7j4j2m3Q5
7010B1K4o5K7km1OO7op4R2r6O4j5l1J3J6Nk6K9O1r0K7K6m0j8N5J3o0N6j09P5K0
7042B4J6k8%j7J7K5k2qk3o0J7O2Kl3N2n1pM8l1QL2q0M1J3Mn6Q5j2j0l9P9o1o5
7075g8Q9k8lM5m2k9lOJ9k7N5j1M4M4q3Lk4J9J3j7l8M7qn9Q6n7pJ42j26QP8n1L0
7108C7m5k9P1j0l3K4j2j2j8J6K5j0K0l5L1K8Nl8QK9j3j0l8M6Q6j23J7m5K8JnM1
7140C7n9N5J3l7NJKo0J8L0j5L1o7J08m0r6R4j0ORn1J9K1o1J9pL4J4k9m2L7oO9
$$ y = [20, -16, -1, 46, -8, 6, -35, 47, -13, -3, 6, -31, 11, -32, 63, 68, 42, -37, -13, -26, 16, 10, 68, 8, 41, -55, -22, 12, -36, -32, 5, 47, 8, -13, -33, -6, 20, -17, 35, 39, 21, -53, 19, 43, 67, 3, 45, -43, 22, -6, 15, 52, 6, -8, 21, 27, 10, -2, 58, -6, 14, 49, 0, 3, 4, -11, -30, 18, 33, -47, -8, 5, 18, 66, 18, -16, -45, 14, -32, 17, -67, -8, -19, -15, 32, 52, -29, -40, -7, -22, 82, 5, -9, -21, -64, 21, 45, -20, 7, 5, -36, -30, 37, 31, -43, 49, -47, 17, 2, -29, -16, 0, 5, -21, 8, 69, -21, 6, 32, -8, -26, 29, 42, -18, 38, -71, 4, 24, 40, 12, 12, -5, 12, 37, 15, 7, -16, -76, -59, 3, 5, -28, 24, -27, -34, 14, -17, -9, 23, -57, -16, -3, 1, -55, 30, 18, 8, -31, 48, -13, -78, 11, -17, -20, 25, -17, -46, -49, -43, -24, -51, 4, -7, 37, 81, -2, 1, -23, -4, 9, -8, -46, 1, -7, -66, 20, -37, -44, 98, -28, -20, 58, 7, 37, -8, -37, 34, 24, -9, 15, 3, -9, -27, -11, 14, 4, 24, -11, 20, 48, 53, 15, 23, 52, 39, 29, -9, 37, 123, 0, 17, -28, 0, 1, -4, 37, -22, 33, 46, 9, 14, 15, 17, -43, -25, 5, -10, 21, -46, 62, 22, -74, 20, 10, 16, 25, -26, -7, 14, -47, -28, -35, -1, 13, -16, -58, -21, -27, 42]
7173D2L8p9L2p1K9j4J8lL1K2o9M5K2o1J4pN1q6O9k6joK8l1QK1nJ3m5roj4kN8o2
7208e6N4O8J3j9j37R1k6Mm0L4L1L0p2l6Q0j0rj0Qj3N5J2n2J5n1L5M2k1l4L1k1
7239dL2j7Kk9K1L2k3k5K2J7k0k1km1K6mJ5j3K9J4P9j27j3N3m9L5L7o2J9J9J0q
7271DP1q5l2Q0mj7j25K1J77p6o0M5Qk8k8M2n1K3J01k8rl5P3n2J3rk3J3jk3L0n1
7303c6R0j7m4l7K8j8M7lN4l8J0n5J7K7q7OJ00m7L7nj8n2L4j9l1P9qo2N0j7N8p9
7335c6K8rM1Rp1L7%n3M1J8K3p7k4Q6N2K1q2j1%m2j3O7l1R6o9M4Qn9m2J08o3l2
7367c5J6J4J0j8N5o3K0l3K8n0M9j2K1L9p6lJ6Q7p4k0N2k1Qk1K3Qlk6N6nq2N3P0
7400H3q8q%L5l1k4O6n6Rk6J7RJ7j9P1l2k2M9p2k8O0j4K7j09Q2O1Oq1P3o7J2oL5
$$ y = [42, 80, 1, 33, -38, -9, -23, -5, -8, 23, 45, -24, 21, 43, -18, -4, -11, 40, -46, 23, -3, -4, -10, 18, -13, -5, 16, 11, 24, -21, -30, -36, -50, -52, 6, -56, -2, 66, 79, 60, -77, 14, -12, -8, -48, -14, 17, 47, -25, -61, 19, 9, 0, -10, -2, -15, 40, 52, 0, 15, -36, -1, 41, 20, -14, 17, -4, 28, 11, 13, -16, 5, 37, 14, -11, 11, 28, 8, -13, -15, -56, -30, -34, -19, -32, -3, 11, 90, -37, -50, 3, -46, -11, 26, -36, -17, 2, 12, 4, 75, -10, -42, 38, 34, 17, -108, -87, 90, 14, -46, -1, 7, -21, -49, -7, -58, -35, 66, 38, 29, -6, 67, 15, 28, 19, -4, 9, 8, -15, 15, -36, 54, 37, -7, -44, -16, -34, 13, 10, 64, 26, 36, -19, -2, 25, -62, -56, 44, -3, 34, 29, 11, -41, -7, -26, -57, 22, 14, -48, 2, -15, 43, -36, -8, -17, 24, 33, -38, -1, -1, -54, -13, 5, 28, -49, -73, 13, 65, 86, 4, -7, -7, -49, -62, 5, -26, 70, 1, 45, 53, -6, -48, 60, -3, -35, -19, -5, 5, -13, 42, -21, -1, -34, -6, -56, -7, -19, 2, 41, -35, -38, -22, 65, -9, -29, 23, 2, 10, -11, 12, 20, 17, -9, 47, 42, -40, 13, 83, -5, -13, -13, 22, -9, -33, 33, -23, -14, -40, -23, -14, 3, -16, 55, 23, 1, 50, -22, -50, 10, -4, 23, -86, -4, 57, 63, -18, 55, -12, 0, -6, 29]
7433B9J0Jn0j6L8r3L4L0M7Jq1R1k1j4k8pP7qn6k5J4N6k7j5L5J1m7L0k6R6o9n0
7465c3lP2mp5J08Mk1q9M9j2%m3L7p1J10J5j7m6L2nK8p3M2Nl8JnN0l7N8q7L4N9
7498D5r2J1N4k9L3l4N0j39J29p9L3N2J9Rj39L2J9Q7Pn0nlK0o1K4L3l6l4O8k2K0
7529B2n4J4RJ3J8m8m5N4%K8k1J3K1l6k6L2m9K6KJ3Mo8O0K5m3L3Pn0Q2o6L0j2R
7562cl0M5m5O6Rm5K5L2q6N5Ql3K8l8m6N5rJ1j1l4L2O2q6j5P6o7JN9n3N5j09J10
7594A9J5j1lj1K4n7M1pl8p0R6p0N7J1k0QJN2nm0l7M2m6jM4N5l7k4L2j2l4L8K5
7627C7q1J6oJ6R0m0j0n4J02r6J8K7%l0M6m3j6O1j4j24L9M8M6n1mpJ6J6j1K7k9
7658a1m3O8r2Q0M0l3RJ7o4L1n6L1k0O0m4%L4k7nj0R2r3J9Q1p5O4p1K2L7J8m4M9
$$ y = [29, 39, 40, -10, -26, 12, -81, -47, -17, 30, 31, -50, 41, 20, 6, -22, -29, 48, 40, -16, -41, -27, 29, 2, -13, 22, 33, -14, 16, -10, 86, 17, -33, -36, 36, 32, -43, 65, 69, 48, -41, 8, -4, -4, -47, -10, -81, 29, 44, 27, -19, 13, 8, 36, -37, 5, 10, -28, -27, -32, 18, -19, 39, -48, -14, 45, -47, -36, 18, -11, 22, -12, 38, -101, 28, -51, -18, 34, 53, 62, -77, -45, -26, 61, 68, 18, 13, 10, 30, -31, -7, 26, -10, -44, 24, 2, 22, -32, -18, -9, 4, 22, -26, -71, -17, -17, 11, -10, 3, 24, -12, -38, -6, -55, -29, -27, -14, -10, -78, -18, 7, -36, -3, 4, -46, 36, -30, 0, -12, -3, -33, 12, -33, 33, 42, -3, 22, 54, -32, 23, 31, -2, 26, -12, -58, -3, -12, -1, -12, -46, -14, 48, -38, -53, 23, -44, -43, 16, -37, 18, -91, 19, 34, 23, 20, 9, 33, -24, 17, 10, -28, -98, -2, -72, -15, -4, -24, -16, -15, 37, 32, -8, -45, -3, -49, -50, -6, 49, 12, -12, 20, 8, -26, 12, 37, -44, -28, -34, -18, 72, 32, 22, -32, 70, -26, -8, 19, 19, -11, 35, -8, -24, 37, 23, -101, -62, -14, 32, -19, -23, -30, -14, 2, -9, 18, -11, -54, 14, -78, 2, 42, 9, 18, 35, -29, 2, -54, -23, -43, 17, -27, -27, 7, -20, -25, -35, 57, -36, -17, 64, -11, 53, -18, 4, 41, 59, 15, 64]
7690F4q4M3p2J5R4m4k3jK9M6l3k4oK4NoJ1m7j6R8q9K8oL1p2L8L7o5L3l2K2L2J6
7723D6r0N0K6j9K0j1m0N7KJ0n3lJ0J6m1K3k6Q0k0k6K0k8N7l1m4M7J4m6j8pjK0
7755fo1Q0M2l9k4O5l7l3J3J2Lm6J4Q3r3J0O8l4q2K9M5J8%j8mj8j2Q7o2n2L3mj3
7788c6l9L6L3j4%K4KM5r4LJ5k0O6q4K9M1m0K6l8kl2R9mJ3k0l3j6L3J5Orj2j1O9
7822E1qm8K4p9N1M%j5J9Mq8J26j04M6n3O6QK4j6m4M9oM8p5J0Nl9M4Lk8O9p8Q2
7855E2n3m3J5M0m2OO5l3k4j7M1LJ4l9qM2J6l4k2OK1p4K4O0q5K4O4Jk3K9J3m3j
7888ek1N0l8OK2j7mkJ3K3n0LpJ4pL3j1jK0J2m8J4j2J3J4O2q5M5k1K8n6JJ6m%j5
7924a5L4P5r6K5qJ4j6m0L8k8K5K6k8QM9r6N7l8J6JL9l4Lm3J1l4K1mQ3n7JnkK6
$$ y = [64, -20, 23, -49, -34, 60, 16, -7, -8, 21, 67, 34, 10, 4, 28, 33, 27, 38, -9, -25, 73, -16, 12, 6, 37, -35, 3, 40, -25, 8, -24, -2, 30, 46, -44, 6, 32, 13, 33, 22, -18, 39, 41, 51, -2, -5, 5, 21, -20, 3, -23, 57, 37, 11, 31, 3, 60, 29, -15, 32, 46, 0, -18, -25, -26, -6, -67, 13, 55, 16, -8, 57, 20, -13, 0, 12, 15, -31, -17, 66, -27, -17, 51, 17, -65, -36, 9, 27, 27, 9, 5, -13, -25, 62, 0, -52, -19, -23, -36, -75, -39, -6, -20, -20, 4, 6, 51, -43, -40, -25, -45, 21, -63, -34, 7, -33, -7, -45, -47, -79, 20, 16, 29, 9, -24, -40, -7, 8, 14, 5, -7, -18, 51, 43, -5, 19, -60, -9, -5, -5, -20, -1, 3, -85, 41, -63, -17, -70, -4, 4, 28, 12, -32, 17, 11, 59, -16, -6, -1, -40, 4, 7, -21, 48, -30, 52, -1, -44, -29, 11, -31, -25, 40, 7, -17, -34, 7, 10, 24, -15, -23, 19, 35, 1, -21, -15, 6, -68, -44, 16, -69, -45, 19, 20, -3, 26, 39, -4, -5, -26, 24, -14, -8, 14, -3, -7, -9, 4, 27, -23, -20, -27, -13, -20, 13, 2, 1, 21, 33, -15, -1, -13, 0, 14, 76, -9, 36, 15, 43, -13, -12, 4, 0, 0, -15, 19, 94, -2, 23, 15, 29, 13, -27, 11, -17, 8, 34, 6, 14, 63, -33, 24, -14, 2, 3, 42, 8, 11, -32, -21, -55, -34, -38, 45, -12, -11, -16, -18, 8]
7958HJ9k4J3j1m8Q3n3QLk5k1N9m3P1n8oJ3L3o0m9P6L2pj0j4l3R6m4PJ9M2m0p7
7991d1N2j4n0N7j9j2L6m0K2k1L6P2j03%K4Qo0R7j22J21n0j7O2K7p0RJ6Nn4L3n2
8022d8O2RMj3kJ3L3n5N0q3j4N5L5j04N9n7M3M6l9J3N9q8mR4j5m3m2N8o9M0k7J0
8054b0k4oL6M6jOk1J2n2J9rL3J5jl2L2o2k7Q6k9Pl5j6O4m8N6n3J8M8q0N3k3k0
8087b8P7K0p1k6jJ3N1o9j1Q2j8m4j6K8N7m4p4K8j9O2M8q5M1M9n2pJ0Q2j08l8N7
8118fJ5Kj1l9KM1l8N1j8l8O3m3j9MJ5Kk2O1Nn4L7k2Kk2M0l0P3r1L1n8P1j0NK2
8152B1j3j0L1o9m1J47o5K2N1o5K2o8L7l1K5K9m0On9J06J9m5k9P1m9NL1n7K9j5
8182dk1K2l7M7J5o2J04j20O8
$$ y = [8, 27, 3, 16, 5, -43, 40, -13, -5, -2, -27, -48, 11, -32, 39, -19, -25, -12, 21, -39, -88, -12, 20, 13, 3, -11, -44, 52, 8, 15, 34, 76, 36, -41, 11, -3, -53, 4, -15, -27, 9, -31, -9, -30, 6, 78, -25, -25, -1, 7, -53, 44, -78, 43, -7, -24, 38, 65, -5, 4, 20, 25, -29, 4, -48, 14, 23, 27, 14, 12, 25, 58, 3, 53, -30, -44, 11, 46, -58, 1, -56, -13, 33, -6, 7, 66, -22, -26, 68, 53, 10, -32, 26, -43, -3, -30, -20, -44, -50, -14, 32, 31, 37, 16, 28, -24, -5, -14, 19, 34, 33, 1, 33, -29, -56, 30, 1, 8, -27, -43, 21, -27, 29, -24, -6, 42, -38, 15, -8, -28, 49, 69, -2, -28, -29, -16, 35, -34, -45, 37, 19, -25, -41, -13, 44, 0, -74, -46, -65, -3, 45, -40, 1, 50, -2, -9, 1, 83, -25, -63, -6, 9, 11, 0, -39, -37, 4, -34, 17, -1, -39, 24, -19, -38, -34, -19, -17, -39, 22, 27, -27, 10, -12, -10, -32, 8, -22, 51, -40, -9, -67, 4, -6, -1, 21, 8, -2, 29, -40, -81, 66, 1, 23, 74, 9, 31, -37, 0, -31, -6, 23, -17, -11, -70, 36, 55, 10, -19, 52, 3, 8, 39, -18, 11, -4, -25, -3, -40, 7, 22, -40, 64, -56, 12]
8191A2
$$ Imaginary data points
##PAGE= N=2
##DATA TABLE= (X++(I..I)), XYDATA
0@%%%%%%%%%%%%%%%%%%%%%%%Nj2J4j5J6j6J6j6J7k2K8l0L1l6M1m4M8n4O1o8P4
44C8q2R1j00J13j26J40j57J79k05K35k77L35m16N39p56J262l988k592P420k668
64a015j145L786q66k273M757p44n038K497K831l708L62J556l553j02M079k085
80f61j772L916P31j785J795p05l314J336J688k883n15K022n79P6J628j006p46
97g74K350O62j645n90N7m39M8m54q87P6J352J079l62n25P02J092o28o90k15j127
117i18q3J299j217j355J938J065r60J047M24j653J305J583k827j119K081j162
133e52j421J974o95j337L246J024k944J196J705k404j4J661k802p60L227j389
149b85k242K730M98j807K422R60l028J091K043k973j050K095j552r07K860p95
$$ y = [0, 0, 0, 0, 0, 0, 0, 0, 0, 0, 0, 0, 0, 0, 0, 0, 0, 0, 0, 0, 0, 0, 0, 0, 5, -7, 7, -8, 8, -8, 8, -8, 9, -13, 15, -15, 16, -20, 21, -23, 25, -29, 32, -36, 38, -44, 47, -53, 60, -66, 74, -83, 96, -109, 126, -151, 184, -232, 307, -449, 813, -3175, -5767, 1653, -1015, -2160, 1626, 760, -1513, 3244, 2500, -2538, -41, 2790, -918, -556, 1000, -2553, -2655, 1424, -661, -2433, 1483, 2214, 429, 2224, 1519, -1795, -459, 1229, -1654, -2169, -147, -726, -650, 978, -28, -774, 1576, 2238, 593, 3, 60, -379, -331, -785, -1672, -1596, -244, 835, 473, -52, 650, 1742, 1114, 424, 209, -918, -1001, 298, -919, -2274, -336, 729, -231, 816, 1240, -413, 892, 2475, -352, -1471, 610, -552, -1973, 1, -694, -2031, 1215, 2239, -705, 491, 2196, -208, -222, 1439, -1363, -2123, 1104, -285, -2527, 203, 701, -1106, 1316, 2276, -752, 339, 2382, -591, -1641, 454, -1098, -2005, 855, 60]
165F0j864K589J077k177R34J079j984J26J411k341j045K127k82j033J621L13q29
182b18J318N49j701p6R70r16p32M53n26l79J054L03m93N83R61k43l29K9l87p04
202d84K28l6o96l7R15Jk54P34M52n18N56L45j271m25P66q12q64J085l1o17J361
223C98M84j142O29J183j318l43R80j296p93J351n74j190J531O62j112J070J032
240A552j514J86J131j518q65J342o48j204J396J94j147J266J050j371L98J211
256A459j293n96J166j036j045J248n2j084J065Q45q50M93R60q94m38Q28p02r88
274i14O65k1q04O86O03n75L12J010m75k95O55l54q35K57n9q39K00P25l88Q2R36
295E72n5l11N91pq84P7L05r22j98P40m58k28R39K64n46O89M45q65Q0M15r55m76
$$ y = [60, -1804, 785, 1862, -315, 619, 1698, -286, -160, 1251, -1090, -2135, -8, -290, -1323, 298, 611, -218, 1100, 1649, -52, -128, 842, -74, -806, -353, -879, -1258, -204, 99, -394, 189, 1150, 907, 578, 607, 220, -484, -256, -292, -988, -1025, -110, -109, -363, 371, 823, 305, 861, 1206, -65, -490, 276, -536, -1400, -315, -346, -963, 398, 882, -260, 369, 1552, 234, -109, 871, -425, -1218, 133, -441, -1631, -100, 562, -550, 520, 1552, 38, 224, 1355, -163, -1028, 314, -334, -1538, -142, 52, -1095, 171, 1221, -150, 248, 1459, 166, -430, 736, -300, -1345, -97, -149, -1233, -168, 677, -173, 320, 1280, 386, -52, 776, 74, -914, -249, -270, -1074, -388, 215, -360, -48, 962, 487, 192, 847, 493, -342, -85, -144, -983, -783, -58, -446, -364, 572, 517, 206, 797, 790, -94, -17, 288, -634, -832, -92, -550, -778, 161, 425, -121, 568, 1013, 148, 228, 643, -312, -788]
317g88O36l39n61R49L04n43O75O26q10M9O47p61n92P15m61q22P09L00o48P06Q13
338H04p32J76Q22p45n49N76m38p75N07J61o71N31P76n20K36Q25n33m96N96l63
358A88q33L86J34o78K67P30n25P1Q93m5m00O18j66r84J59J47p88L0P83k92j54
379d59R93o7m70N37J31p39K46K63q38k69N18m48k41Q64K15k96O81K50o87m5L45
400D84p79k61N39l18m28O94J01m84N93M63l77J09N17o73m39L41m53n32N71K85
420d7m77O07N14m78LO20l96m26M80k69p48L07J67o38L78O31k40R0P68l34m73M37
442D76j79p41K62J29o04J44M78k78O4P60nl60M77o8o73N0J03o56K2N15l54L9O37
465B38Q6k88N03Q0n12K9J31o53k07M62k79j95O55O9k51M65K74l15p2L41m97m46
$$ y = [-788, -152, -491, -1052, -103, 201, -342, 333, 959, 149, 198, 845, 84, -508, 207, -254, -1076, -367, -67, -715, -9, 804, 72, 248, 1070, 325, -224, 352, -86, -861, -354, -193, -864, -333, 443, -77, 159, 984, 451, -45, 551, 188, -645, -259, -125, -803, -536, 194, -331, -260, 633, 588, 188, 806, 640, -344, -185, -38, -826, -796, -13, -305, -459, 534, 467, -3, 534, 665, -74, 172, 435, -403, -672, -154, -602, -843, 21, 236, -60, 621, 871, 184, 139, 484, -295, -556, -17, -335, -763, -69, 32, -452, 141, 604, 227, 336, 853, 180, -259, 82, -371, -903, -332, -47, -524, 83, 597, 119, 122, 742, 346, -80, 400, 131, -617, -310, -143, -781, -403, 228, -12, 78, 846, 512, 39, 476, 297, -444, -182, -53, -657, -513, -35, -313, -249, 511, 506, 146, 623, 555, -118, -68, 35, -621, -599, -84, -438, -399, 238, 324, 36, 539, 619, 107, 136, 267, -386, -593, -131, -410, -605, 50, 119, -132, 333, 607, 292, 220, 561, 64, -382]
487c82K84k87l63M84L15k88L11N74l65o8L60l50m52L38n1o76K07L01m47K97N90
508C32j67j4O28l05n77K76l2p60K72K77m79J76O51l17k10P65J5m96M96r6q24J84
530b05J69p28J64O86k68o6P95j80l98O15j19o60K94J54p28M5L26m45J08P21p5
551B05j62L98O5l96J70j53n25J17K13l30k6K87M1R8L06N1r1J36K6l59k86k2J1
574b26j36qJ81L1J46N05j96k10K62L3l39o1j2m65Q8M16k68j68O55R3k63M53o0
597D51n58L21K46q41j62M90l94p8P70k36l07R15K5p41L36K34p28J38L42q56l4
618f67Q87m13l43Q48m9k92P14j70q44L91K90q90L2M62m38Q0Q48m35l07P73M5n22
640@K95j15m84K96O1o34O3N73j78N7L36j60J12M00k44m67k9N2k00Q6j58j52M38
$$ y = [-382, -98, -385, -748, -264, 51, -237, 74, 648, 283, 215, 575, 225, -227, 111, 60, -616, -409, -108, -555, -258, 332, 165, 151, 779, 474, -103, 173, 141, -619, -347, -70, -549, -373, 278, -39, -249, 516, 531, 35, 531, 435, -389, -205, -36, -764, -600, 86, -182, -248, 547, 367, -31, 584, 465, -195, 99, 253, -475, -430, -104, -549, -441, 280, 205, 43, 441, 506, 110, 280, 127, -398, -281, -68, -398, -424, -137, -96, 2, 308, 359, 268, 404, 430, 71, -215, -237, -226, -362, -370, -189, -158, -12, 493, 297, 87, 349, 382, 43, -18, -30, -495, -407, 9, -259, -427, 228, 321, 58, 511, 451, -107, 214, 460, -381, -543, -53, -447, -525, 245, 9, -298, 617, 642, -99, 237, 471, -257, -119, 223, -633, -667, 220, -193, -536, 312, 263, -29, 685, 515, -329, 62, 352, -538, -506, -44, -482, -402, 446, 11, -296, 477, 522, 0, 295, 180, -304, -8, 53, -581, -518, 55, -123, -66, 270, 110, 222, 622, 378, -89, -118, -66, -266, -180, -338, -490, -52]
663e2K55l2PM2P1J63k27m65J25l5r5J21j71k38O14M42m29jL70k21j59L05p21k75
687f06N99o5m25L54K24k65N26L10q42K47O93p21k97L21n16j80Q83l21n47Q66L19
708E57n55L51R8p10L02N57r68k14O25k94k39P12k76l44J062Q9q54K76K36n98R1
729i6J94p05O5P65l42j37M58m8J2L71k29n48L00J70m95j10J08j00L30L53l30k0
751c4M19j3j05n8l60mK61k86k79Q2J86J57L08j70j30M86j2m03R1j83l69L74J6
774b6n43K41M50j53J67K44l68Q5N59m47o47M43j07m44N02l0m89N81N38o04J19
795G1M69l88j76L76n84m10O84j11n33N14J99l33N43K64o79J62L89n42k27L87l98
816c23j77O50j93m24O14K41k56K24mm54J44K28o25j02L97j42m9K73k6n2M06J45
$$ y = [-52, 203, 171, 178, 220, 291, 454, 227, -238, -113, -148, -243, -122, -293, -531, 83, 525, 96, 95, 465, 244, 85, 390, -331, -606, -7, -72, -497, -143, 81, -184, 342, 652, -190, 57, 750, 29, -268, 53, -463, -643, 240, -81, -628, 238, 557, 2, 353, 451, -259, 43, 600, -368, -582, 43, -251, -490, 222, -54, -398, 664, 753, -101, 175, 411, -187, -96, 98, -607, -542, 223, -119, -256, 202, 154, 166, 537, 308, -240, 60, 230, -265, -375, -267, -367, -37, 316, -14, -34, 385, 372, 267, 209, -151, -155, 106, -180, -459, -377, -191, -34, 274, 104, -26, 460, 448, 45, 136, -47, -416, -42, -26, -569, -328, 122, -31, 136, 380, 12, 97, 656, 209, -438, 5, -102, -546, -44, -74, -563, 18, 556, -48, 71, 540, 152, -24, 352, -232, -642, 42, -69, -602, -88, 111, -222, 321, 585, -94, 68, 457, -85, -312, 75, -323, -500, 150, -43, -467, 147, 388, 132, 356, 352, -102, 42, 270, -355, -457, -60, -202, -251, 22, -4, -56, 350, 495]
838D95m42J27l5j97r7J4k54J05J84M3P7J10M5N7J24j86j41J0j99m2K3k30J28K12
862f9J07k8L04j53n1K76k47m57K76lk83Q4J46k61K87L33k76P2M50l16j84K36l02
885e9l00L15Nm53L38L39k82R4M39l32k4L36k83m05K55r4l31L96ql02L81K90k54
908F1R6K05l15q9K55l14k38J82Ok13K92J64o5J75K03k20r9J32k15j88J07j13q5
931b76J11R2j7J80K02o1o6J04n2j66j10j23o4q2J85L7j3K09P9nN6O8j89j07J3
956Ej58r5N7j1p9K24J86j34J25J17n0n4m2j83j34N8K9j14J09J36n0Q4K85j84k7
981A00K06k05k35J07j10k11J63P7n6J11K10J9j56K99j54k02J14q5l01J29P0k49
1003c59J67K51KK2K08n4j38O6l6k95Q1%j66Q3J69j36J45J89k4l7J38p0k24K7q8
$$ y = [495, 53, 180, 145, -52, -149, -135, -389, -284, -100, -57, 20, 130, 175, 232, 356, 170, 29, 39, -160, -202, -179, -409, -281, -69, 38, 10, 314, 161, 110, 386, 139, -318, -42, -45, -328, -244, -98, -359, -72, 261, -15, 57, 507, 191, 7, 243, -59, -359, -44, -39, -492, -154, 185, -97, -3, 436, 104, 80, 416, 133, -272, -17, -111, -442, -46, -54, -356, 25, 315, 61, 157, 362, 47, -42, 213, -101, -339, -157, -151, -364, -72, 92, 27, 202, 405, 185, 86, 218, 3, -185, -78, -191, -276, -165, -73, -90, 90, 292, 231, 165, 269, 217, 51, -59, -182, -246, -328, -143, -106, -119, 90, 169, 164, 220, 288, 99, -8, 5, -153, -248, -191, -202, -281, -57, 129, -5, 120, 237, 187, 133, 91, -92, -226, -168, -139, -253, -144, -8, -58, 26, 311, 127, 100, 306, 101, -134, -27, -137, -348, -185, -108, -164, -53, 157, 176, 20, 319, 165, -37, 77, -8, -309, -180, -110, -359, -192, 59, 61, 83, 291, 237, 99, 165, 129, -166, -85, -85, -251, -168, 1, -135, 10, 199, 175, 138, 276, 206, -18, 9, -79]
1028g9j80K6N3O6q0K60O6o9J57K6j43l8K0j98j08J12n5j16J94J12K1Q0J55j31
1052A51k6Q7k13j55O1o6q8J01J24o5J65J45p8n2J85j93j49R4o5k39K9Q4q0K21
1076b2J74NK2J17m8k15R3j62j41m1Q4p7N4K07k7P6J38K2j24Q8q7k57rJ3p0o4J89
1103f2l4N3K21Q3r4M4Qk04J1m5j07j14J52j22L3K40qM1K8P7o5ro7j61j04Q4r5
1130b16m2K26pJ9J21J48j13j2L9j02j57j1K2j49M1P0J0P2K37j9L1R9p5k19kp0
1156e9k10L4J24rO9J58n5O8P6n9p7J25q0k05jjj73R7K34n8Q4K04r6j07J8Q7k91
1183a03O6K6j89m2K68j47M2K07j3o7J79n1k23L8N2k47K3O9j06M0K33N5n2J61j3
1208B06j21J33j38j77Pj5j02j2J53M4N5J18K6o8P7n6p6l6j09Qr9J6J00o9J21J34
$$ y = [-79, -259, -233, -180, -114, -194, 66, 132, 63, 220, 246, 103, 65, 85, -113, -221, -109, -164, -280, -86, 26, 47, 127, 282, 151, 125, 212, -1, -156, -95, -161, -249, -148, -24, -89, 76, 221, 143, 91, 276, 83, -66, 28, -37, -276, -247, -163, -243, -22, 152, 157, 179, 296, 248, 33, 126, -36, -177, -218, -134, -211, -157, 50, 23, 99, 237, 259, 135, 223, 136, -121, -130, -117, -187, -251, -62, -96, -43, 178, 261, 167, 211, 219, 15, 26, -19, -126, -240, -88, -210, -177, 63, 55, 96, 124, 201, 136, 127, 60, -101, -205, -121, -216, -258, -32, -39, -20, 101, 249, 136, 124, 163, 61, -96, -107, -85, -234, -193, -123, -113, -41, 196, 177, 208, 307, 232, 13, 11, -59, -269, -235, -111, -120, -51, 107, 52, 120, 196, 137, 60, 185, 105, -100, -101, -102, -275, -178, 56, -2, 82, 286, 190, 83, 101, 188, -103, -37, -11, -200, -242, 26, -121, -79, 128, 115, 48, 227, 176, -47, -9, 43, -204, -181, -112, -218, -178, 55, 110, 58, 219, 206, 85, 218, 80, -97, -90, -105, -207, -219, -66, -22, 33, 151, 177, 109, 186, 130, 54, 18, -91, -83, -182, -166, -66, -135, -14, 120]
1234A20N0l8m6J44k16p8Lj17m7J31j3k9K11L3o8K23j18j26L5R3k70p3J32j41K
1259b03K20q9n3L18O7k28J78Mk65K5L8k67K1K54m4j55K03Ll8K81k4k73J04Q1k88
1284a30Qj9r5N9K47r6k6J95O5j29Q5n2k06J61p5j51nQ3qJ22J12j15M0J71j32q6
1310B3l7k2m3J5K9j58J35J21lJ04p9mJ51j09k46N6n9k3L9O9k19K29J78r5j0K06
1336B48j20j04K05k54k31K04Ok34K21J9J4J70J44l31J19J90k14p1J58l22o6K97
1358D8j08k41L53R1n9J29R8m11P2J95k42j60K13j28k4K73j87q2L81R0k53J11m7
1381A12k11J03K7l01J9K68l3j03J52J07RJ29q9l35J83Kj37kl4q7K10P0j17M9J76
1406A67k0M8l5j96r2J80j81p5P6o3J46K50j30l3R2J25k37L4n4j91J35kk57O2K64
$$ y = [120, 170, 132, 86, 230, 14, -64, -61, -178, -225, -94, -107, -136, 75, 108, 40, 263, 145, 19, 54, 147, -123, -196, -64, -205, -203, 17, -72, -125, 193, 260, 32, 210, 214, -51, -26, 12, -255, -234, 20, -24, -179, 24, 27, -11, 270, 246, -27, 77, 158, -130, -122, -141, -236, -177, 70, -26, -52, 143, 208, 79, 164, 112, -94, 67, -8, -159, -164, -81, -89, 33, 145, 30, 70, 241, 109, 23, -14, -36, -79, -64, -35, -193, -58, 63, 60, 164, 85, 81, 232, 123, -123, -67, -126, -149, -110, -41, -260, -31, 147, 52, 42, 248, 128, 24, 229, -25, -256, -52, -46, -280, -59, -40, -26, 144, 288, -43, 76, 266, 52, -19, 139, -183, -249, 48, -60, -301, 52, 143, 84, 213, 311, -100, -28, 167, -75, -235, -22, -150, -174, 99, -88, -170, 211, 301, 48, 159, 112, -99, 4, 31, -270, -251, 17, -16, -119, 33, 140, 149, 278, 189, -146, 37, 39, -98, -100, -134, -221, -11, 59, -58, -9, 167, 147, 195, 160, -36, -128, 52, -129, -204, -128, -191, -45, 205, 75, 42, 134, 259, 22, 56, 2, -189, -54, -56, -313, -251, 13]
1431A3r2J70J61k34O5K28j42k57N3p8j11J32M4k03K25K62j56l1J76j41p3K06k77
1454f0k04K38k8k10K54l1n4K11P2j45L2O0j47k9M0j79L5J63j49o4L00k0l2J26
1478A79l3j63O5O1k69m0J39j19L8J90m4M0J68K6j83J01j2k08L4o7j29Q0J26m5
1502f5O6N3K4j6J68j72KJ8j41J0m3j26O4J70l2N0Q0O1k6jN4k43K1K2j55K0P4o1
1530a24M9K24r2NJ73n8j84J50j41j86J48J3k26J52J01j20J70J30q4n5J66j38j62
1553h9O6j46j8J41k7r9K10M6j06J33O2j33j8P1k51kQ1J3j32J77O1nP7N3r1N9K0
1580A53j50m1k3m2j55J98J3jL0N4P5N9k3j02ln9j02m8O2l2P4L4M5oR2m9Q9j1j29
1609Bl9M0j89J37kj04N2O5J35PO2m1n0k7n9j97R3l2m2J29N6k8L8J54q4J0J7j2
$$ y = [13, -79, 91, 252, 18, 83, 311, 169, -88, -35, -113, -224, -92, -48, -251, -26, 236, 80, 49, 225, 84, 11, 217, -60, -264, -26, -54, -264, -10, -41, -95, 116, 188, 43, 75, 135, -12, -41, -1, -180, -145, 18, -131, -195, 105, 85, 53, 179, 146, -17, 48, 109, -160, -200, -61, -180, -142, 48, 4, 44, 212, 238, 55, 156, 144, -64, -30, -97, -226, -146, -20, -65, 1, 54, 78, 62, 230, 58, 60, 78, -63, -53, -96, -222, -158, 12, -20, 30, 110, 171, 145, 144, 198, -45, -24, -2, -157, -137, -63, -124, -75, 149, 57, 62, 235, 177, -7, 143, 2, -184, -36, -23, -249, -97, 4, -116, 54, 184, 100, 45, 211, 73, -89, -23, -169, -187, -46, -73, -172, 38, 84, -22, 111, 173, 40, 22, 93, -158, -160, -79, -66, -198, -21, 40, 35, 112, 165, 74, 133, 153, 3, -38, -61, -103, -258, -60, -47, -48, -18, 36, 111, 170, 147, 45, 42, -17, -119, -167, -105, -137, -63, -29, 16, 10, 102, 53, 142, 131, 2, -37, 3, -186, -49, -51, -155, -103, -38, 97, 104, 166, 125, 75, 48, -11, -208, -115, -147, -189, -60, -4, -32, 6, 160, 76, 86, 103, 91]
1637I1j20M6q8j68R2J0j9J96M0l4N2N9o9j16Q8j63m7J01J0j07Q6O2N3j7M0LM0
1664A21j2o2o1n0%j25M2R5l0R8J22o8M9qno4l0l5o2m7j1N3K3Q5R9J5l2K9n8q0
1694iK8p5p3knN5l3Q5J37M3rr1J5N0j25l3N1o6j17P0O9J1M4N9O9Ljp1m7k2o3o
1726e9k4N8l0L4O3l1N3P6j7j39P9m7r6MJ7j27Q7M4mP6J15j02P4p0M6q2Lj20k9
1755a48M3J18o6O9l6O8L5M5l3m0Oj23m9o0pN0L2J25K1k7J11Nj1q7kp5o3O8k8n2
1785a11Q3P7p7O0L9J12q2o0o2m1K4j00N3K1O7l7rJ26j9O2On2n6L0q0j17O8l8%
1814a13M5J27jm1J03mq6l4Mk6l4p8O1q5J10J5P4K5N2j7l2m1o6L8j3l7n6Q9QlN2
1845C6kO2N0p0L5q4Mq0n5M5l1O4Q1J0l1O1L1j33J30m4p0n9q1j0k1J09J9J9Q3k4
$$ y = [91, -29, 17, -71, -239, -147, -137, -156, 40, 80, 46, 98, 157, 88, -28, 60, -103, -150, -49, -39, -146, -60, 2, 55, 38, 78, 81, 121, 109, 47, -14, -64, -64, -189, -147, -52, -82, 16, 138, 70, 119, 111, 106, 42, 12, -23, -85, -132, -143, -90, -67, 18, 117, 132, 100, 129, 71, -9, 19, -56, -129, -131, -136, -81, -114, -29, 108, 151, 142, 51, 66, 116, -9, -42, 9, -57, -174, -104, -35, -24, 20, 79, 148, 151, 150, 79, 32, 10, -53, -59, -83, -25, -55, -21, 42, 11, 64, 140, 123, -16, 63, 16, -80, -76, -59, -186, -99, -55, -59, 17, 132, 30, 104, 34, 80, -2, 1, -119, -148, -105, 13, -53, 16, -20, 48, 83, 128, 95, 55, 61, -62, -111, -171, -178, -128, -96, 29, 50, 23, 134, 139, 128, 41, 39, -36, -99, -31, -59, -111, -28, 49, -28, 32, 71, 183, 101, 41, -21, -62, -38, -138, -85, -64, 3, -34, -43, 83, 64, 126, 132, 80, 24, 54, -26, -143, -75, -113, -113, -68, 59, 58, 17, 120, 116, 30, -4, 0, -26, -60, -138, -77, -162, -52, -37, 37, 62, 114, 97, 65, 24, -42, -4, -17, -54, -110, -21, -13, -16, 36, 34, 96, 146, 76, 111, 27, 31, -49, -104, -59, -90, -26, 55, 65, 34, 95, 126, -7, 123, 79, 9, -50, -131, -141, -162, -53, -34, -15, 68, 44]
1875D4J07o8k7j1l5q5L2k3PK1j3K7M2J72r8l9J1o0mK5j21n5J47o6K1K6J03qP2
1904A44P0q3n8J7j34n1J2m1P8M4m0K7P4k8m4Q8m9l3j8N3j83k2Q6K6k3J64j5o1
1932@J35q0o6N6m4o8M9j04j4Q5N4qjO4L4k7J30j32r1K9l7p4K0pR0nJ06q1Q2j4
1962H1L0p2j9q7qP6j13j0O0N4K7K1K9o4O6P5j03n0j07N3l7K4M0k1J29j0r1J44
1990A17j11J7P0o4j35J9L7m3j3P0oJ18P9j15KP5j03k2K1j47J5J55o9l4N2O1MO4
2018A14M0j89Q6L3j42j10J12k8k0J43j6j36K23n8M7nj0j07M6K6j97L8M9J5K1N6
2044C1jK2J26p8j39P0l6j40J36r0l7J08q%J34N7r6O8Pq3j10k1Pm1oJ20p0J88p8
2073D0k4L8N0n0j6k7j20lR3p9NJ04j1M2R1o1q0J14q8q5j9J3p3N4M4p2P5J32k7
$$ y = [44, 151, 83, 56, 45, 10, -75, -43, -66, -59, -38, -51, -24, 18, 190, 92, 53, 64, 4, 0, 25, -96, -151, -4, -70, -49, -23, 80, 72, 144, 214, 131, 73, 90, -44, -95, -83, -124, -46, -2, -42, -15, 59, 31, -13, 75, 26, -7, -25, 28, -155, -177, -91, -65, -88, 76, 61, 0, 135, 55, -11, 45, 1, -67, -18, -122, -136, -51, 3, -5, -6, 58, 92, 65, 195, 63, -28, 1, -36, -110, -90, -97, -7, -12, 94, 13, 95, 81, 111, 39, 20, -67, -75, 1, -112, -122, -62, -8, 19, 40, 69, 5, 71, 146, 43, -7, -114, -61, -98, -74, -34, -55, 74, 64, -27, 117, 6, 23, 93, 29, -106, -87, -50, -93, -106, -36, -42, 76, 155, 40, 42, 117, 14, -8, 13, -134, -119, 36, -33, -67, -15, 46, 50, 114, 154, -35, 51, 84, -58, -168, -56, -84, -104, 39, 23, -113, 110, 52, 99, 94, 84, -23, 23, 49, -148, -110, -61, -46, -25, 31, 30, 52, 178, 100, -39, 31, -5, -145, -9, -99, -136, -28, -36, -36, 98, 155, 59, 127, 134, 51, -59, -80, -73, -114, -120, 0, -70, 118, 40, 16, 54, 104, 54, 38, 11, -109, -112, -19, -98, -93, 11, 0, 42, 133, 72, -8, 106, 18, -67, -86, -73, -146, -92, -48, -120, -45, 87, 60]
2102F0n3J23m8q1N1p6j34J48p9O6J2J2n7J50Q1j70P7%m4o8P9j41k2R0j6o5J35
2129C0l6jQ1Qn0l2R1k23L9Ql3J01N2p7K4J44o1kM3r2o5K2%j08L6J7j0P7P2J5K
2160G2K5m7r2Q6q6j09J21k3Jo3J05o6J21L1k8M5K4j02L7p1m0l9M3k3P9P8o8N9
2188G0o0N8o3M6n2o7J2J2q0K6M8O3K4O8k0Pj2o8l7K3l5m7M7m6k5J01L9o0J48P
2218A27Mr8k6l1m9PM9m8J14n2J9j4M3J8J3qn9%l2p0J5J4K0J7R3L3k3ML6j8o2L7
2250G3j27L8m2l8N0k2N3Q6K6r8K4M8l0q2Pl5n8N0K2Q4QrK0J4L5j06J04n6j23l7
2280a21L9j8k8P6L2P9K8k4j5L2m2K8o0k5n2kL9J7M7j4l3R9N4p5l6L7q9n5L2j4
2310f4mL0lL2P8K2o2O0j9m0p0j9Rn7P4K7j7O8Lj5rK9J8j7l3p8n7J9qP0k6Q3L7
$$ y = [60, 7, 130, 82, 1, 52, -24, -158, -10, -89, -23, -11, 1, -56, 94, 175, 5, 82, 82, 38, -30, 49, -92, -114, -24, -40, -105, 30, -6, -7, 74, 82, 32, 0, 91, -132, -93, -85, -118, -17, 35, -42, -18, 126, 65, 63, 106, 14, -51, -29, -29, -137, -101, -84, -94, -17, 55, 70, 72, 97, 50, -42, 44, -42, -151, -30, -53, -52, -115, -10, -76, 45, 76, 48, 93, 117, 15, 52, -19, -59, -98, -55, -78, 1, 79, 11, 70, 10, 68, 5, 51, -1, -68, -56, -44, -124, -98, -50, 13, 37, 105, 85, 92, 80, 12, -25, -2, -37, -84, -37, -83, -108, -7, 32, -28, 120, 127, 131, 33, 7, -24, -73, -66, -17, -65, 49, -3, 16, 2, 45, 63, 76, 68, 9, 9, -23, -93, -78, -64, -44, -27, 66, 99, 76, 80, 116, 98, 36, 73, -54, -16, -58, -96, -46, -68, -15, 71, 97, -1, 23, 71, 41, -41, -34, -69, -127, -77, -55, 29, 37, 28, 48, 62, 97, -9, 95, 39, -84, -121, -82, -100, -128, -52, -20, 59, 87, 63, 48, 80, 38, 66, 6, -19, -71, -73, -34, -17, 30, 16, -17, 82, 136, 61, 25, 62, -27, -82, -50, -64, -68, -38, -41, -9, 69, 91, 29, 89, 70, 30, -40, -59, -50, -107, -33, -6, -23, 45, 48, 33, 24, 53, 71, 54, 21, -57, -114, -95, -103, -33, -59, 24, 61]
2343F1j9K0M3n6K1o0o0Q4j3q4J7j0J46J6p7K0Q8n8n5ro8N5l3j12R5K2L9j9N4L2
2373H0J9p9O0o6p2J5l1J8K9M7Mk1J2N7n3RJ0M0j21l5%j6O4m2O3l0O7N5j2J2jo5
2405A7k3QJ8q7j9K3K4K7K1L3J9K8o3n6Q2n7ro6j4J3kR5k2qJ04n1K3k7m9J4p1M2
2437c3m3K3J4n5N3O6qJ09l3m6J0n5o7m1M1l6M9M8nL2J3J1L9l8m6m2l0k6Q7j6k8
2468e3R5p2pJ44p9K2o0N7jj31J7k1o7R8J1J7Q1k4MP2k9kn8j6m2n1K1j2J06p0J56
2499A06r5N3m1QJ5j7k7L7j18J6j4j2M5K1L6L9O4q1J2m6L2n3o2N0m7Q1j2M9l2K4
2529C1L0M6p0n2L1j2m2l1P3l4j2jO8M5n2L5m0K4l2m2J3l4%Q6M5j07J8L3N2L4n4
2560D9mrl6l4m1M0j5N1Pl9J57l2L2k9ro5o7K0l5P7j24O7J2N3l0M8O9K6j16K1j0
$$ y = [61, 42, 62, 105, 49, 70, 10, -50, 34, 21, -63, -46, -56, 90, 106, 29, 49, 137, 79, 24, 15, -53, 2, -31, -143, -48, -26, 13, -6, 48, 80, 99, 20, 80, 14, -58, -43, -74, -56, -27, 20, 24, 3, 15, 72, 19, 28, 38, 78, -43, -78, -78, -94, -30, -72, -9, -39, 28, 83, 71, 83, 82, 17, -6, 2, 20, -67, -86, -63, -39, -12, 9, 42, 61, 89, 26, -30, 52, -5, -14, -80, -94, -81, -83, 12, -10, -18, 86, 35, 58, 31, -18, -4, -75, -33, -76, -53, -39, -94, -41, 25, 17, 126, 93, 47, 57, 2, -65, -106, -65, -101, -52, -4, -9, 23, 36, 47, 86, 48, 2, -40, -70, -96, -9, -25, -53, 42, -30, -37, 107, 28, 50, -10, 47, 46, -85, -68, -89, -156, -58, -47, -30, 51, 27, 31, 103, 74, 72, 14, -2, -44, -95, -74, -86, 20, -50, 106, 11, 64, 23, 31, 46, 29, 2, 39, -79, -63, -77, -89, -44, -23, 13, 52, 116, 35, 47, 1, 33, -20, -82, -32, -79, 2, -10, 39, 7, 31, 61, 107, 37, -15, 16, 4, -38, -69, 4, -30, -42, -43, 25, 70, 18, 53, 13, 37, 5, -37, -24, -58, -58, 28, 73, -34, -16, 17, 69, 103, 49, 45, 36, 0, -34, -75, -35, -50, 1, 8, -31, 126, 94, 126, 97, 88, 23, -44, -24, -59, 18, -106, -39, -27, 26, -4, 44, 113, 139, 23, 44, 34]
2591C4j07M2k5Rj9N2M1L1j03O2Q8m4K8j05K6l3k3m0J06m8J0N5l1J10q2J5kk6q9
2620f8K8k3m7L8K3J7Q9J0j5j7O1m0m2l2l3o6N6M3k5RN8j2J6M2n8N1Pl5r6P5o2
2651d8N3n4J5N6k4J31q3N2n5kl7m4Rl4M5k2j2J29m9j3O6m9M5q6O3r4o3N2q7O6
2681g4P2l2N8O8m8k0P3n4j17R0rj37Q8M3k7%M0J3j6J2N7l2k7mq6M2n3J0K0N9L
2712A2M5N3p8L8J7r8PP1m7n1j6rMN5N4k5M8J8r6N2n3l3j4k5j03J57j0k6Q3m6Q9
2743G3j00O4M7n1Rk0j13N3M0q2J1J03n6L6N2p8jN9q5nLr%J4O3j2L7lk4l4L4l1
2775fMnl9M5pRk2P6J7l1O3o1rL4N9j21n1qj3J4L8j%O1m3kJ13j17k4J2n5KJ9K7
2809b2p9J28l7NN9J2q9O7k0p6l9K4M0k2L9K2o9J03M0J5o8L7n6j8K0r6PL6J8o2
$$ y = [34, -73, -31, -56, -47, -66, -14, 27, 58, -45, 17, 105, 61, 89, -16, 10, -23, -46, -86, 20, -28, -18, 37, 6, 116, 34, 49, 47, 21, -68, -40, -63, -110, -72, -49, -32, 57, 67, 52, 35, 96, 56, 14, -18, -51, -117, -61, -18, -43, -34, 24, 12, 28, 70, 12, 63, 70, 35, -61, 14, -48, 5, -49, -34, 22, -2, 129, 46, 98, 43, 41, 4, -40, -31, -65, -20, -42, -54, 75, 26, 13, 79, 30, 75, -11, 52, -42, -105, -53, -140, -74, -2, -34, 24, 92, 44, 24, 97, 43, -74, 16, 7, -130, -42, 1, -26, -26, 14, 27, 11, 23, 80, 48, 21, 17, -69, -27, -80, -70, -50, 9, 12, 57, 110, 32, 70, 87, -11, -4, 67, 20, -31, -47, -56, -52, 3, 57, 32, 80, 98, 2, 54, 1, -32, -46, -71, -174, -17, -27, -53, 30, -16, 73, -27, 37, 84, 33, 42, 22, -91, -38, 2, -80, -69, 34, -22, 14, 66, -12, -13, 46, -39, -44, -41, -50, -50, -36, 27, 15, 52, 49, 25, -9, 25, -6, -2, -7, -46, -1, -8, 1, -21, 55, 72, 41, 104, 43, 34, 68, 127, 6, -45, -53, -66, -52, -14, -15, -15, 46, 3, 1, 114, -3, -27, -15, -70, -68, -49, -22, -101, 27, -10, -5, 54, 66, -23, 44, 24, -52, -91, -67, -27, -49, -10, 12, -57, 46, 86, 101, 33, 70, 14, -4, 16, -80, -73, -37, -19, -81]
2839h1J47J3n2k9J6m0M7k3n7P9K3j11J6K0O5m4M2mk4P8j19L3K8o4NJ5J6m9Q9J2
2869D7K5k3N0Nj16K0m7M3j7j06R7rK8M1K5o0%J3jKq3OL4j4l4%N2M1k4N0kQl7m1
2903b7MP4p0L9r9L3N7k0K1M8m2J9k3M7r5K4J4m1RP2p3R3o6J4P3K2r9J1L7q3KJ2
2935a3m6K2L1k6OP1J8m4O0k2j01P5m8k9m5P8J6m6R0j3J12q9j2n5Q9q5o9Q3n0O9
2965B7o6N1m1N4%k9LK9n7K5l8M1k9m3O5l8K3R3r1J09J3j33N5m1J3Qq9L9N5p7L7
2996c2J02j4J5m3mN0r4K4k4k9Pj7J10p0N2m8M4jN0n4J8l6m4l8l5Q5K2k2N1K0n
3027D0k1N3o9Mk3rj1j8n1qJ51K0n0L2K6L1p1k5l5l2N6j4n6L1N2n2K5R9j7n7K9
3058C0m7J3J3r5J4MM0Q3o4J08m6k6L3j7j%p4nK4l7j3L0R3n3N2k2J4m2lKL6r6L
$$ y = [-81, 66, 79, 27, -2, 14, -26, 21, -2, -59, 20, 43, -68, -52, -32, 33, -11, 31, 27, 3, 81, -38, -5, 23, -41, -36, -21, -5, -54, 35, 47, 72, 49, 99, 104, -12, 8, -39, 4, -13, -119, -22, -31, -3, 38, 63, 3, 3, 16, 15, 17, -66, -60, -26, -40, -74, -74, -22, 19, -5, 45, 43, 51, 14, -27, -23, 51, -19, 20, -79, -46, 11, -9, 12, 60, 18, 37, 14, 61, -34, -10, 4, -37, -28, 44, -29, 64, -2, 12, 85, 107, 8, 19, 56, -27, -25, -13, -59, -37, -6, -32, -26, 45, 63, 19, 79, 57, -44, 31, -17, -46, -91, -13, 3, -43, 47, 34, 146, 57, 45, -10, 79, -6, -75, 8, -42, 27, -39, 12, -29, 25, 25, -4, -1, 28, -29, -4, -42, -1, -30, -73, -8, -46, -23, 70, -21, 88, 101, -32, 23, -18, -5, 3, -86, -47, 8, -69, -32, 70, 56, 71, 28, 24, 74, -20, 4, -20, -49, -42, -59, 51, -19, 33, -15, 29, 28, 78, 24, 42, 6, -38, -76, -111, -26, -4, -26, 25, 45, 40, 19, 72, 3, 7, -16, -25, -36, -54, -105, -113, 38, 58, 8, 40, 66, 97, 26, 1, -34, -66, -10, -24, -80, -49, 3, -49, -24, 75, 58, 1, 30, -17, -4, 9, -86, -72, -68, -28, 55, -9, 99, 53, 27, 60, 43, 42, 42, -32, -37, -13, -50, -63, -33, 60, 7, 59, 37, 51, 9, 6, 8, 44, -52, -49]
3091d9J2Ol5L3P1j7K0k1RMk8K4o1K5m8L9K0j5k0J6R7j8k2mm9L2o6Lk9l0J3Q1n
3124a2QL6M6q7L6j6ol9K3nQm6j7M7J4P9m5M4m4J4m2J7j1j5q5Q0J4nK4m1J17j11
3156b0K6M6ll4k9l9L8n5O7L4j5k3rL9K1jn4j4l7P7p8J8l7K5O5K5K7l8L7k0J7j9
3188C7pm0K2n9R4j02N8n0R7o3P4n8L6n6J6or8Q1k3r0J40KOQ0n5r9K1j8N7J7l3
3219a9qM0Kl5N9l7M8m2M7rm4K4n7L5l2L5j07P7P3q4R5N2o0j4K4k4n5L5j07O5Q1
3250E8p4N8lM7j3k9l7o0K2J9j2k3K6L3q7Q0M2j9K8J6p4O0Qr8L4J4j01K4K1Pj6
3281d9J00k1M9o1l0K6l0j2N2q3L4Pl8R2l5N8m4O9j05R0p0l2l2L9KJ5Mj2j3O3J7
3312E0J2p5N3o4R2j00l5M9K5n9P8k1k9M8M4k9j4rj9Po1P7n7j4P2j1j2J9K6k2M5
$$ y = [-49, -37, -31, -66, -33, 38, 21, 41, 20, 29, 33, 5, 29, -32, -7, -55, -16, 4, -11, -31, -15, 82, 64, 42, 38, -11, 21, -45, -42, -71, -101, -88, -7, -12, -4, 32, 78, -9, 27, 11, 5, -34, -11, -16, -8, -54, -71, -24, -10, 69, 24, 68, 24, 38, -4, 13, 2, -13, -98, -18, -4, -9, 15, -26, 91, -20, 6, 52, 49, 15, -14, -53, -15, -70, -3, 31, 16, -7, -16, 23, 44, 43, -11, -25, -62, 15, -63, -45, -82, -57, 8, 33, 60, 22, 59, 39, 56, 37, 30, -10, 12, -47, 47, -55, 3, -47, 50, -13, 61, 3, 39, -17, -1, -7, -105, -24, -47, -137, 3, 5, 11, 91, 36, -63, -42, -60, -3, 14, -19, -27, 13, 15, -20, 39, 2, 50, 8, 55, 46, 2, 26, -31, 4, -28, 7, -100, -23, 50, -34, 61, 113, 53, 39, 63, 39, -16, 19, -88, -23, 58, -16, 42, 39, 86, 73, 44, 7, -53, -31, -12, -24, -47, -21, 12, -75, 5, 47, 28, 56, 72, -2, 58, 66, -32, 2, 16, -85, -61, -40, -33, -49, 51, 30, 79, 18, -12, 14, -16, -28, 24, -59, -25, -18, -56, 36, 1, 59, 15, 84, -21, 69, -1, -33, -65, -26, -24, -9, -5, -17, -30, 33, 50, 62, -13, 40, -24, 68, -32, -67, -18, 7, -52, 26, 5, -24, 24, 68, 39, 25, 16, -3, 4, -57, 20, -37, -51, 21, 10, -2, 17, 43, 21, 66]
3343F6q3m1L4MJ5J6n9m5Q6j8o0J41m0j1N0Kj03N0m2M2QJ9Qn9O6j0L6L4j24K9k4
3374a3qk6j5O0Po1J04l3O2o5oL0kn6j2n6O8JM5l0N2o7N3ql0Q1j18Lj8LL1J6n1
3407e9N2m1Q8J8L5k0m6k2K4m0J3Ml5LK0pN9N7m2r2Q7m8N9o0m1%Km8Q0n7N1L4k0
3440HP6j10L9L6j01m0J34j16k5J03q2J12L0jn7L1lll1m6o6J13p0J6J8J6L0j9J02
3469I4l3j01K3K0o6P4m1O2n4J8k6M1M9l5j2L5m7P6q2J0j2K3q5ON4M6J8n2L3M2
3499G8n5m8L3l1K2k0k4l2R6J7j9k1mj2K9n9jP0Qj11J5M1K4L4K5J7o8M3k7L6k4
3530C2J1o5j27J36k1k8M3pK4k8J39l5l3q0R6j2m7m2k0O9jmL7Jj4K2kp6J7m6K8
3561c3m6O6jN0n3R9n1m7M7o7N6l6ql0M3j2J6M7j5J8j7K4k7j0O4j43J25j37J0Q8
$$ y = [66, -17, -58, -24, -20, -5, 11, -48, -93, -7, -25, -85, 56, 16, 5, 55, 57, -46, 4, -38, 4, 12, 31, 39, -20, 46, 36, 72, 106, -18, 11, -13, -21, -47, -62, -2, 5, -56, 48, 15, 77, 12, 6, 36, 34, -22, -34, -90, -22, -21, 24, -6, 46, -21, 32, 24, -6, 75, -43, -40, -58, -55, -24, -8, -59, -7, -48, 40, 58, 93, 73, 27, 5, 29, -11, 2, 6, -29, -26, -6, -13, 46, 103, 61, -31, 56, 8, 67, 7, -34, -34, -32, -80, 0, -57, -6, 28, 8, 84, -26, 13, 49, -52, -92, 42, -74, -99, 4, -78, 34, 64, 63, 6, 37, 34, 31, 0, -46, -112, 1, -69, -53, -35, -19, 11, -8, 94, 61, -40, -17, 3, -63, 11, -30, 32, -22, -4, -30, 11, 60, 25, 13, 48, 1, 77, -5, 5, -7, 16, -69, -63, -9, 37, 55, 3, 36, 78, 23, -25, 8, -23, -1, -21, -45, -77, 19, 36, 17, -4, -8, -20, 9, -50, -51, 19, 27, -84, -69, -28, -4, 30, 55, 72, 4, 47, 20, 56, 32, 43, -22, -149, -13, -34, -62, -19, -26, -2, -30, 109, 74, 41, -39, 57, 45, -2, -44, -64, 5, 4, 0, 37, 38, 24, 46, 44, -32, -15, -61, -33, -79, -13, -14, 36, -17, 82, 31, -16, 31, -36, 20, -16, -24, -54, -11, -23, -7, 40, 25, 43, 26, 50, 23, 13, 77, -66, 59, -78, -68, 20]
3591B0L0p0J0m0J10l7rn4M5p7L5k7M7l2J1O5l5j3J6J01r3M9n2LqJm0j6L9M7k8
3622bM0m4Q6n4%k7j5J3k4m9J7l6J07n0k9O4J00m7j1m1j6jql6RL1N4l6j6M4M%n9
3655c2P6l9J1m5J9Mjn2J8Q6p0M8Mnj4n3N3m3L4l7K9k0K7l9N7lM7j1l5M6j65O7
3687c8j2k5P5j6jo3L8O5QM4o9L5k9j9m0L8r%L0k2l1O2O1j26J06k6j4n1l1M6n8
3718g2LN7m3K6K0J4M6m8JJ8p4O9lm9n4K3R6m9N9L4p0M5L8j06J5rp2P6J4m9pR2
3750D1k5%qJ2mn2K8j5l6J1OL0rnM1j0J4O6j62J28o1l4M0l0M5j01J7P5Lm4P8Jn8
3783a8K8j2L4r3PoM7k8k3R0o6K2L8Pl0K0m2N8o1n6L0N6K1p6N0Q1m2p1O8m4L3n9
3815c7L7K7m1N8r7J00n9M8k8j5n2J46q4p0J9p6J05jL8qPp5J49p5j5L3m2l2L2o4
$$ y = [20, 50, -20, -10, -50, 60, 23, 14, -40, 5, -72, -37, -64, -17, -49, -38, 27, -8, -21, -5, 96, 3, 52, 0, 3, -5, -4, -44, -60, -21, 26, -2, 38, -6, 80, 26, 26, -1, -16, -3, -27, -76, -59, -95, 12, -38, -67, -3, 97, 50, 39, -2, -18, -19, -27, -63, -54, -23, 31, -5, -21, 23, 27, 27, -32, 44, 5, 16, -29, -10, -6, -7, -59, -41, 45, -25, 23, 27, 22, 8, -45, 8, -35, -1, -38, -9, -29, -2, -41, 16, 13, 60, 49, 14, 60, -105, -38, -50, -75, 0, -16, -17, -80, -42, 23, 31, 75, 6, 41, 12, -7, -47, -9, -18, -18, 12, -10, -41, 21, 82, -44, 62, 36, 22, -29, -60, -14, -72, -69, -12, -55, -29, -9, 5, 51, 3, 4, 22, -52, 17, 14, -35, -89, -66, 30, -19, 40, 74, 4, 49, 87, -19, -4, -13, -85, -9, 5, -44, -51, 41, 16, 16, 8, 20, 16, -36, -8, -23, -59, -48, -42, -12, -21, -26, 15, 5, 19, 85, -77, 51, -10, -44, -4, -34, 11, -90, -73, 2, 5, -39, 39, 40, -18, 10, -2, 32, -61, -54, -60, -13, -41, -64, 26, -40, -18, 20, 27, -3, 17, -25, 33, -28, -84, -54, 2, 23, -53, -3, 78, 36, -35, 33, -11, 22, -37, 0, 27, -14, 44, -53, 47, -12, 36, 8, -7, -59, 87, 3, -67, -48, -124, -19, -20, 18, 10, 17, -58, 91, 16, 1, 34, -8, -40, -8, -72]
3845g2Q2n1QJ7P1n3m2L4NK2q2J03k6n8M7n3J2lL4K6m1j2J00m8l0L0n0N0J0k2o
3876BMpj5K9omk0J1l6MN8j00O9O3j03K0l7J17p3jk3N7J5j7j1r4J31r6N1K6m9j
3908c6M9N2k1j4j0k1l9K1J9Rj2qk7N0l9L3N2J3l4qp6j4L3N9j31P0KM0o7J10l4
3939B1oQj0m8J6k7J6k3Q9k5j7pP0p7L0L8l4k3J1n6m0M7K2M5K4Kj16R9L8r0l5P2
3971A4%l5lQ3j06M1M6p8K5K5M6k2r2P9j1o0lM7Pn2P2K6k1%P4j41N7kn0NO4l9M7
4004D3j25Q7K1Nn0L7J8Jr8L6J13p9j3P9l0n3J07q0J5l4L6m1K6k6o6QP4n8N7l9
4034b9J2K1kQ6j50N1m8l4K9O0n4k1N7N4m4J8K5k5P9m9o5MK5p3L9L7nmRJ1j8ml2
4067d0KN0m3L8k8j6qj8K7J0NO7L6n9L7l9k3K6n7qj8L0M8j2PJ7L5r%k9o4J1J7J1
$$ y = [-72, 10, -41, -33, -16, 55, 2, -40, -6, -1, 21, -61, 42, 16, -42, 5, -48, -36, -39, -5, 21, -20, -32, 68, 20, -10, 20, -30, 20, 30, 8, 2, 6, -1, -16, 13, 7, 3, -17, -6, -42, -38, 20, -80, -11, 52, -51, -31, -68, 49, -24, -25, -48, 9, 24, 7, -4, -98, 33, -63, -12, 14, -35, -36, 13, 65, 44, 30, 20, -1, -40, -19, 0, 9, -3, -11, -38, 12, -27, 6, 58, 71, 37, 29, -47, -61, -28, 31, -100, -30, -28, 12, -55, 55, 21, 15, 23, 13, -35, -19, -46, -30, -53, 36, 11, -6, -13, 57, -20, 10, 48, 14, -9, 2, -54, -94, -47, -25, 20, 44, 46, -70, 29, 67, -23, -58, 14, 14, -21, -24, 59, -47, -6, 40, -38, -13, 12, 58, 36, -56, 23, 12, -48, -51, -4, 3, -49, 23, 49, 28, 28, 102, -39, 18, 16, -34, -29, 35, -4, 43, -82, 5, 26, 31, -19, 18, 36, 37, -61, -25, 88, 9, -4, 75, 45, -8, 99, 19, 34, 0, 36, -5, 21, -5, -71, -63, 11, -47, 10, -29, -17, 4, 2, 88, -62, -11, -59, -93, -64, -4, -58, -79, -22, 32, -12, 6, 31, 6, 85, 36, -29, -25, 0, -73, -34, 3, -2, -6, 3, 14, -4, -8, -40, -38, 12, -31, 7, -21, -37, -45, -63, -36, -26, -21, 46, 82, 23, 60, 21, -2, 24, -33, -41, -59, -29, 19, 7, 14, 31, 66, 57, 57, 28, -36, -25, -8, 3]
4101Ck3%m8LQ8Lk0m9M4Ln3L0M3k1L3l3k2L0Pn1L0J3M1r3K5j8L4o0L6j5%J0m7Q0
4135CM1n8K5Kk2l9N1l1L4n6M8K0Nm6qQ0l5L0kjj3q%m9l8Q3m0K9L4k4Pm2jn4N1
4170b4K0o1RJ20m4m3kR0j06N1j8J0k1m7J17j15J0K3M1m9N6J9m3PM1o0Q4o8o6M4
4200b5N5p1KN6nN1j6qm7L9L2j20J02l5k8J4n2P0j4j2nO8p3j4J0J9P6l7j33M8J9
4231c4K2pK8l6R9j7j34J02l8j2K5p7K7j8K4%M7PM1K5l9On6Qoj4K4l0O4j9k9M6
4263B9J7L1p1L1l8J5n2J8Nl7j5P6L9j22R8k4l1J2M0%p2OJ1K8j8k0L2l1P5o0J6
4294a2J28j20op2M1L7l0N3o3O4j7K2J8m9RK0O6r6l2j8O0Om4KNL4NK6J9n7J7j9
4326cK4o0J1j2K8k3K1K4p3P8j1Q4q0l5L5Qn4J9L4k7L0J0k6O2k5k2K0k8J6m0p3
$$ y = [3, -20, -20, -68, -65, 23, 26, 6, -43, 1, 4, -49, -19, 24, 3, 36, 3, -19, 11, 18, -33, -3, 10, 51, -42, -17, -35, -1, -61, -25, -40, -40, -30, -77, 3, 44, -14, 11, 13, -9, -48, 3, -28, 6, -50, -2, 18, 23, -23, -31, 49, 14, 44, 42, 41, 28, 20, 20, -29, -67, 16, -24, 5, 39, 15, 22, -20, -21, -75, -24, -4, -65, -56, 64, 20, -23, -25, 65, -41, 10, -8, 2, -19, -66, 51, -64, -54, -31, 10, -39, 17, 36, -7, 0, 41, -19, 65, -3, -69, -25, 30, -41, -39, 17, 12, 63, 47, 39, -8, 31, 63, -57, 45, 10, -18, -4, -56, 14, 0, -12, -17, 51, -22, -36, -26, -7, 69, 32, -101, -53, -34, -12, -19, 9, -27, 72, 55, -79, 23, -15, -27, -2, -79, -52, -70, -46, -46, 1, 8, 49, 74, 35, 41, -15, -7, -13, -27, -3, -33, 31, 12, -17, 29, 46, 77, 6, 37, -1, 14, -38, -20, -15, -52, -67, 9, 48, -74, 24, 0, -31, -19, 21, 21, -51, -45, -34, -6, -24, -44, -12, -43, 32, -28, -12, 116, -4, -10, -82, -41, -4, -34, 19, -44, 20, 3, 25, 43, -6, 3, 23, 89, -7, -39, -57, 3, 9, -35, -33, -28, 6, 11, 37, 56, -1, 16, -3, 21, -39, -28, -40, -12, -35, -14, 10, -63, 15, 4, 88, 8, -27, 8, 16, -38, -19, 15, -12, 18, 28, 2, 64, 39, 17, 37, 9, 25, -15, -88]
4357h8Q6K7j03P4J8Ro8P8j5j30J14mJ1l9MK7q0O0J04Qp8l9J1M1p9L5n7J15o7k3
4387d8O7Qm0n0R2Qj8J8k3j5NJk4nk6L9j3Q6m6J0K6j05P5l1L0j4k2ql3N6PJ3j3
4420GrN7m0M3j21K0P9o3k0O8k9J7K8L1k6J0k2k4J5no6N5K5m3j3p4R8J0Pk4J27
4451A18j10n2JK9n4Q6k6l2O4n0J3Q4kk8J8m2l2l0N1l0RK0ll9J05m6l3P2n5LP5
4482H4o8J8or1N3k0P7l7Kk5L4M3j32O5l8J3J9Lm2P8m1J44j26Q8j08j2N6o5N2n7
4512c9M1PK9l0L1k7n4M6j6N4r1J20o8m1Q8%j4k5j7qmMpm4N3j3O3q3J4J0J3L3k8
4545cl1J8K2l1J5N8p2O7k6J8m4o1Q6n4P4o7j8N5j6P0m9K5n6K6m4n2J36n5K3k6
4575a2N0L9q7J5J2n3L8k0j5L0j1Nj01J16J8M2n6jk8Q8r4M1J1m4K0j9pN1K4rqN3
$$ y = [-88, -2, 25, -78, -4, 14, 23, -45, 33, 18, -112, 2, -2, 9, -30, -26, 1, -79, -19, 85, 93, 15, -24, -13, 28, -51, -16, -73, 42, -25, -48, 19, 27, -13, -63, 29, 37, 19, 37, 14, -1, 4, 5, -19, -24, -50, -11, -24, 62, 16, 26, 52, -53, 22, -9, 21, 7, -15, -23, -56, 0, 7, 20, 7, -2, 55, 15, 58, -63, -43, 36, -27, -47, 21, -8, 9, 37, 68, 42, 52, 30, 6, 21, 16, -50, 5, 30, -13, -26, -100, -2, 8, 15, -9, 118, 8, -44, -43, -14, -68, 18, -8, -40, 24, -26, -13, 71, 69, 41, 59, 17, -15, -45, 6, -24, -15, 5, 2, -37, 68, 22, -11, 61, 6, 9, 84, 16, 34, 28, -63, -10, -30, 47, 10, 12, -13, 21, 64, -68, -3, -41, -28, -9, -6, -48, 30, -11, 133, 7, 95, -13, -25, 31, -34, 18, -39, 2, 9, 38, 8, 39, 12, -42, 4, -12, 42, -49, 71, 3, -38, 50, 50, 36, 11, -6, -14, -18, -14, -21, -65, -12, -25, 38, -45, -31, -21, -8, 25, -3, -34, -16, 6, -25, -10, 48, -24, 43, 17, 35, -9, -70, 16, -38, 36, -31, -49, 6, -10, 60, 11, 36, -20, 6, -38, -90, 46, -9, 14, -12, 38, 77, -10, 5, 17, -36, 2, -18, -33, -3, -14, -9, -110, 6, 24, 66, 10, 9, -19, 69, -25, 16, 27, -17, 3, -16, -23, 28, 52, 43, 35, 88]
4607H8o8M4o2j4P4j20O2l5mN9o4N5rj2K1k7J07l1r1K3o7R8m9M2l7J05q6mL1j1
4637A8j0J0k6rO5j31M9K9K6m0L8n3M6J6Loj01K1P7p5RM9JO1p0N8j0n0L0K1Mk7
4669B3rmL7o2K8K0j0p1J11l0p5N8r6J04l2K9m0J1K1p8P4m5L6K5K4j4n1j9L0kJ4
4700Gj0kj0j2OP7J9p6L6m8K5p2P0nJ0o3N2N7pm0l5L0J8L5o8J7pN2j14L3kk5O5
4733A3J5K0K0o0m0l3L9n0M2L8Rp2R7Qk0J1j6k0mP2n6l2l1L5l7K0R4j0l9l2M7l4
4765fm4L5J8n8N9m3J8ko4J19Lr0Q0L1n0J8j9m2orP5k3n8N0M0L1l8m2J8j4m3L7
4797a9j2m1O5K1PJ7m1L5k5k1K1n3O9k9k3KL3k9L0k2jJ5L4n7K6K6m2MK2pk8M1r
4830Ij3L3P3j06L8on1P7p4L7k7k4M5m8J3Mk1N2l3jO4j5p6L8N7n9l6M7m3L6kK0
$$ y = [88, 20, 64, 2, -12, 62, -58, 4, -31, -35, 24, -40, 15, 6, -6, 15, -12, 95, 64, -27, -4, -71, 27, -22, 20, -17, 88, 2, -2, 29, 18, 8, 18, -8, -17, 48, -83, -34, -5, 21, -19, 19, -34, 12, 28, 31, 25, -76, -55, 22, -53, -44, 5, 6, 67, -3, 55, 45, -5, 25, 46, 50, 23, 14, 10, 47, -15, 13, 33, 23, -48, 63, 33, -42, 16, -80, 24, -8, 21, -19, -8, 13, -65, 9, -36, 0, 25, 49, 35, -16, -35, -5, -7, 7, -3, -5, -15, -27, -21, 56, 75, -1, 35, -13, 12, -60, 10, 5, 15, -48, 4, 61, 54, 14, -21, 9, 27, 62, -6, 11, 4, 56, -58, -25, -27, -52, 13, 28, 48, 68, 8, -32, -65, -26, -76, -34, 4, 13, -59, 38, 46, 26, 37, 21, 1, -3, 69, 13, -19, -50, -15, -52, -32, 62, 52, 13, -19, 28, -6, -50, -15, 3, -55, 4, -39, -21, -23, -87, 32, 35, -55, 25, 56, 6, 24, 5, -37, -43, -52, 23, 0, -58, -8, 32, 63, 25, -17, 1, -13, -56, -19, -31, -72, -7, 14, 21, 38, -3, 32, 7, -14, 7, -46, 23, -6, -29, -27, 6, -23, 7, -15, -16, -1, 33, -24, 2, 28, -14, -10, 12, 5, -23, 18, 9, -4, 29, 102, -4, 34, 28, -23, 54, -20, 17, -10, -34, 11, -37, -24, -20, -41, 11, -22, -23, 41, 26, -50, -12, 45, -14, -50, -3, -46, -10, -12, 8]
4862HJ8jK3r1Q8r4K2K9J2l4l0P8K7n6K3N6m6j1n5oK1K2ml9J6Rqk3R3m7L9L1j10
4895d0P2nm6M4o9L5M5m3LjL6p5P1o8M7q0NO5l0J6L7p5P6Oj4kn6M7j6o6Q9l3K8
4928CoMRNOj3J4N5j04M6nJq8Q3J0m2N4K0p3L2J0k1O9r9j0M8l7Q8k2p8K7N4l0m5
4962c5Q1m1J9j3j9MpnM6k4l2N2qj3RL2Lo1L0j5k8j1N7Oo8P5k7K4l8JR3j16J7J8
4996Fj8j9L8J1RN6o9K9j4j5j2j7KM7m3l3NK1M0l1O8j1m7Nj1%l4L5%L0r9Q6j6q1
5030h2P5L9p4K6M3k8M3j13M7L4l4L1K7j9k7m3R7L2lk3n9L9j2n3J3qN9j4k5O9j05
5061d8R0l9K8m4J6J1m5j3L4J7Qk6j0O2Qj25R9n5O3m6NN5q6M8Rm0O9Qp7O0Mr2M7
5094eJ4j6J4J8n4K6J4k5K2OM2n0m2J17q7N0n6K8l5nj0K7pL6M7j01M1k7N5j7pp9
$$ y = [8, 26, 25, 48, -43, 45, -49, -27, 2, 14, -20, -50, 28, 55, -1, 22, 78, 32, 21, -34, -40, -19, 3, -1, -40, -24, -15, -23, -46, 47, 0, 39, 70, -40, 32, 27, -19, 25, -44, -9, 36, -7, -4, -5, 31, -44, 27, -41, 6, -74, -69, -4, -34, -18, 19, -56, 20, 26, 12, 10, -46, 1, -15, -81, 8, -25, 3, -3, 1, 10, 15, 21, 8, 22, 77, -27, 19, 14, 15, -73, 10, 20, -22, 32, 52, -21, 11, 21, 0, 69, -30, -40, 8, -29, 59, 37, -41, -14, 40, 10, -35, 46, 5, 24, 11, -8, -4, -11, -16, 30, 6, -26, 26, 18, 5, 14, 46, 49, -12, 18, 3, -25, -36, 21, 27, -41, 34, 7, 31, -7, -6, 87, -29, -12, 6, -12, -31, 7, 18, 27, 83, 14, 43, 29, 14, 2, -15, -13, 34, -9, -42, -37, -16, 24, -7, 61, 50, 3, 8, -3, -3, -37, -2, -2, 28, -71, 15, -1, -82, -7, 32, -42, -16, 27, -1, 42, -71, -24, 10, -24, 7, 34, 15, -12, -55, 42, 74, 71, 48, -11, 28, 16, -37, -24, -32, 27, 13, -12, 57, -48, 42, 3, 31, -13, 3, 14, -31, -44, -10, 7, 15, -11, -21, 41, 49, -76, 23, -32, 31, -15, -10, 45, -41, 7, 16, -24, 45, 53, -24, 36, 40, -52, -5, 9, -7, 7, 25, -29, -3, 11, -14, 8, 14, 56, 6, -36, 81, -6, 44, -12, 16, -19, -24, -34, -7, -14, 22, 69, -32, 9, -18, 37, 20, 13, -66]
5126f6L0L4pj4mO5n7k0J26j01M4q3P8o1J5lK6N9m5o6J9M9L6m5jl4N3Klk8L2j6
5158A4K9p7O4k8Mj4m3PnM8m1K6N9k4J4M8o4P2m9lm8J0N4n7nk5L5k9Ll1N0j7M1
5191A8N3q8N1Po2K7n4L4N6q7Q3j8k8L2j4k2qO2l0K1n1k1K6oM7l0k0%R5nn9jK8
5224C6l4l5NK7K8j1P0j18K2N3j06M4k7O0K6mo4k2N2l5P1n2J1P6j33M2j6K6k8M
5254c2K3M2j8MpJ3J9j3l4J0k8K6Pm7P9m6k0Q2j9krk3m0L7Pl7PO2k1K3m9p9K0L9
5288b4M6J2l2Qm1K6j8O6n4L8n9J5nm7Q6j4j7k7Lj1L3m3K4M8rN5l0n1L5K9n1Oo4
5321f7OPO3qpk9qP8Mk7k6J1k6M3J8k6J5j0J8n2m9K6J18l3k6L2j3l2j8k2mQRK1
5355fj7L4K8l4O2o4oL1m9L3J0J4n0l6N5l9J9M3l2O4j7k2m2k8R1o3k1Q1J2m9L3
$$ y = [-66, -36, -2, -9, -23, -27, 38, -19, -39, 87, -14, 30, -53, 25, -36, -21, -24, 2, 61, 16, -50, -31, 18, 54, 9, 8, -26, 27, 29, 26, -2, 30, 14, 43, -34, 30, 2, 6, -8, -51, -44, -49, -1, -42, -16, 43, 19, 33, 81, 17, 89, 40, 37, -11, -1, 53, -4, -9, -34, 1, -28, -25, -56, -6, -23, 18, 71, -17, 34, 41, -21, 6, -48, -14, 42, -45, 38, 20, -8, 24, 10, -12, -20, 42, 12, 33, -18, -39, -13, -19, 28, -2, -22, -22, 73, 68, 9, 8, 36, 2, -33, -28, -1, 27, 16, 86, -32, -10, 43, -63, -19, -46, 14, 40, 36, -28, -50, 2, -33, 38, -14, -3, 73, -60, -18, -34, -8, -36, -32, -9, 33, 15, 19, 12, 25, 44, 31, -3, 7, -21, 5, 12, -35, 44, -2, -22, 60, 41, 39, 30, 7, -33, 4, 11, -26, -19, 43, 22, 45, -4, -83, -63, -24, 22, 34, 2, 10, -31, -5, -23, 43, -11, 27, -32, -17, -22, -69, 17, 3, -14, -41, -38, -49, -16, -59, -35, 13, 4, 59, 29, -22, 13, 42, -9, -3, -67, -61, -54, 9, 1, -6, -35, -43, 35, 39, 12, -14, -3, -29, 14, 32, 6, 21, 11, 29, -23, -72, -46, 72, 39, 13, 45, 32, 0, -18, -40, -44, -36, -27, -6, -23, 11, 39, 5, 67, 3, -3, 28, -21, 12, 22, 36, -14, -50, 5, -34, -15, 28, -4, 60, 43, 21, -21, -49, 42, -21, -42, 39, 51, 2, 35]
5386C5Nm0Kp7J16L9k9m3M3%o2LM2l5J1J8n9K0m7J09K2j05KP8n5m4R3m7molK2M0
5419D4n8oL0O5n4J4l0j4kL5J2j8K3p7L1lM1n2j1L9Nm0O5nLq3J11jj20K3P0k1j5
5452Al7M3l5K4j4J2ln3P3J1L4m7K0j16J25l7Lj9K3L1k4qm3L9J6o4K5K7m1J1N%
5484a8pM8j1K0K6Qj4o5QRL7q9L6j1L7j2k0P8ql9n7j5P8Rn3j2M4Qj2J6j2J3l0K2
5518A2j4m2J4J8J1O1m9L2j4K1j6l2NJ8l0M2m6kl6K7l0L9L5m4K5jO3m8o8L9J29
5549A19j14k1mN6j22P4k9OJ7k5k2J7K7k9Q6nJ2Lq1pQ1o1K3jRl4N2Ln6k6RO6j4
5582Il9j8Q9p8K6K6jJorj3l2O4qmk1o3R9J1kk3j3kQ2r0L2Qk1L3p0J11q2J0M7p5
5617b2R5n5LJ5n6K5PJ1j17P8j2J5O0p2O6l4j8k0N7n8m0O4l8L4Rk9qM9m9O0l0p2
$$ y = [35, 40, 0, 2, -75, 41, 80, 51, 8, 51, 51, -11, -8, 34, -1, 10, 28, -31, -11, -58, 51, 73, -32, -30, 48, -7, -51, 42, -5, -9, -15, -18, 4, 44, -14, -20, 10, 75, 21, 35, 5, -9, -11, 24, 36, 18, 41, -36, -5, -8, 33, -19, -30, 9, 14, -26, 39, 34, 37, -46, 65, 64, -56, -33, 37, 16, 1, -36, 7, -28, -4, -18, -6, -9, -62, 11, 22, 56, 9, 29, -87, 38, 1, 4, -15, 8, 39, 15, 7, -36, 3, 19, -45, -20, 7, -34, -23, -18, -18, -25, 23, 12, 32, 58, 66, 52, -13, -5, 4, 41, -48, -12, -23, 14, 2, -18, 60, 52, 13, -44, -59, 19, 28, -25, -37, 7, 15, 3, 19, 7, 20, -10, 12, -2, -44, -30, -12, -1, 60, 11, 43, 29, 50, 34, 2, 7, 25, -5, 37, -9, -11, -47, -20, -50, -11, 24, -20, 5, 4, 67, 19, -49, -10, 119, 5, -16, -20, 36, -86, -12, -41, -35, -18, -43, -65, -48, -21, -50, 36, 31, 43, 46, -35, -42, 39, -22, 1, 0, 9, -25, 27, 30, -26, -52, -43, 23, 9, -30, -48, 41, -37, -11, 15, 14, 15, 9, 0, -13, -45, 19, 11, 7, -14, -77, 22, 33, 31, 8, -5, -7, 75, -15, 17, 25, 4, 37, -33, 78, -4, 6, 53, -22, 73, 18, 21, 36, -20, 5, 12, 23, -94, -16, -28, -13, 47, -25, 41, 7, -11, -31, 26, -32, -72, -8, -46, -12, -3, -32, -40, 9, -40, 20, -10, -82]
5649h2J31k9No0N5o4N4qL7m3K9J0k9j2j5RM0Jo4RL6j4l4N9K3l2J8j6Pj2k9n1O0
5682a1K9k6LK3oN2n9J3q2qM3O8l7qJ8m3j7M2m6NO7n7L0l2L3PoRK1j0l1L5K3p0
5716b8P6o5R0q2J9m6N7l0o3Q7J7ql8M7n9k4QN4m9N0L1m2k7N4oj5l7L8qqqK3K2
5749C0KN3j35K3k1Q5m5J4J6Lm4LK8o4K6O2l5m2N0n9M7PK3J6n2K9m4L4m3jK6k7
5781c5J6LrM3l9JM4j0lml5L6q3J15Np9QP0Lj2k8l3P5j0m1rJ9n8MK9N4m5n7L6J9
5816a0l8P7m4L4q3L6O2j1k4jK4m7R8n2R%k4M6jn7k5J0pM1J8p5O9jJ3jo1pN3Qq1
5851e2MM3J3jk0Ml5P9N3m9j5j03J14l3j9L6k9Q1j01J7K1n1O4j03L7N9j0N1m7k5
5881a7knM9k6L4l8P3j6l2l8L9n3nO0Ln2L2k4L2L9j6ro4M0k8J8MNK3ml5k0O0rk4
$$ y = [-82, 49, 20, 25, -35, 20, -44, 10, 2, 39, -4, 25, 35, 6, -6, -21, -12, 28, 29, -35, -26, 10, -4, -38, 21, 44, 12, 30, 14, 21, 9, -20, -71, -11, 18, -8, -5, 18, 12, 64, 5, 18, -64, -72, -29, 39, 2, -6, 12, -31, -48, -6, -52, -47, 20, -37, -7, -39, -6, 1, -5, 4, 25, 15, -16, 19, 42, -28, 48, -17, 73, -9, 10, -36, 21, -9, -72, 15, 32, 24, -14, 33, -26, -50, -42, 12, -37, 13, 44, 2, -25, 29, 23, 8, -29, 9, 1, -7, -15, 8, 30, 32, 85, -50, -27, -48, 37, -8, 6, 22, 25, -19, -16, 12, -52, -26, 36, 1, -41, 9, -50, -3, 4, 27, 43, -9, 20, -24, 10, -33, -34, -8, -35, -19, -16, -25, 18, -21, -20, 24, 14, 11, 7, -28, 8, -75, 40, 45, -34, -26, 44, 47, 35, 7, -26, 49, 39, -2, -11, 8, -50, -46, -17, 37, -8, -65, -29, -10, -48, 29, -15, 19, -64, -28, 34, 23, -1, -2, 22, -25, 73, 21, 30, 30, 6, 52, 51, -6, -31, -21, -28, 13, 31, -44, 25, 24, 37, 36, -25, -32, 21, 29, -52, -48, -5, 8, 7, -13, -9, -44, 35, 88, 39, 24, -79, 35, 2, -17, 19, -10, 71, -30, -13, 8, -43, 21, -82, -45, 14, 4, 55, 8, -17, -19, -24, 25, -1, 33, -5, 68, 52, 20, -18, 21, -32, -37, 23, 26, -26, 6, -18, 14, 53, 37, 28, -36, 4, -24, -6, -2, 3, 26, 22, -13, -33, 27, 18, -6]
5916fkj6L2qP3o4K6k9K0N7o8o3M9J8Ll2J5J8qk2Jl8K4R0q6J7L7j03M0P7q4LJ0
5949a9K7m4K5Q1r1N4l1N2o6J7JQ%l6j5N2M8o7J6o7O2k1L4j3J4k9kj9N2o4R1rp9
5982c8l6L4P1K0k1n9O4j4rl7jj8K0jK5j5k2L4K8rL1m8l1L8O6k1p3K5P7q1K9j5
6014A3MlK2k9Jm8rQ7l9k3pJ0k4N9Jl9NM2J3j2j7k1k9k5L0N7k0MJ2K7l1l7O1k0
6048A5k6N0p7N2n6N6j0J5m5J0N8J5p7l2M9Nm9L7j9k8O5m5k0L2N1J8j5p8Q3p3J
6079c8KJ2o6J06Nm7Q2n6K9n5M6k1j4N6m1Nl7k4O4l3J4N5rjl4KR6r7j4m0M4M3J0
6112D4o4M9Pm6Q0n8Q8q1l0n0P0j8QNn7N6K0L4m7N0k6M8j4q3m2K9J8oO1p3l8Q2
6144A6ln4L2k9N4Lj16Q9n0N3K3L1o6L4m7M8n7J4kN8k4m9P1Mn0k4R1%q3L2l2m0
$$ y = [-6, -8, -24, 8, 0, 73, 9, 35, 6, 26, 83, 15, -48, 1, 19, 22, -10, 5, 23, 15, -7, -6, -44, -20, 70, -16, 1, 38, -65, -25, 52, -32, -29, -19, 8, -36, -11, 70, -21, 33, 2, 54, -12, 5, 6, 14, 14, -22, -37, 15, 63, -4, 12, -55, 7, -14, 20, 7, 21, -8, -10, -29, 23, -41, 50, 41, -38, -74, -40, 31, 51, 30, -29, 35, 21, 12, -25, -26, -44, -24, -25, 0, -15, -37, -3, 25, 16, 47, -1, -32, 6, 72, 51, -22, 3, 80, -1, 28, 13, 17, 14, 36, 7, 8, -40, -49, 38, -1, -24, -31, -21, -45, 14, 15, -24, -19, 23, 36, 24, 7, -14, -43, -68, -38, 19, -1, 3, 15, 42, 11, -26, 35, 15, -11, 39, -38, 14, -42, 14, 4, 19, -26, -16, 42, 57, -20, -52, -3, 2, -47, -10, -29, -57, 8, -37, -57, -25, 26, 44, 29, -49, 34, -39, -38, -36, -24, -90, 16, 21, -26, 56, 0, 29, -26, 20, -1, -15, 41, 0, 5, -32, -56, 8, -25, -11, 44, 35, 34, 0, 2, 98, 1, -13, -53, -9, 34, 44, -20, 29, 36, -10, 70, 12, 100, 19, -11, -61, 9, -9, -1, 4, -53, 3, 23, 57, 10, 60, 34, 82, 68, -15, -57, -28, -10, -16, 45, -28, -66, 16, 13, -41, -9, -38, 16, 19, -97, -8, -58, -5, 18, 49, -17, 17, -30, 18, -39, -25, -27, 31, 7, -42, 29, 33, -17, -41, 50, 50, -33, -1, -33, -73]
6176g3J26o1nm5N5l7J9O0o8j6Q7o8J1L7jn7j1j4LJ7K3M3Km3M2n9LP0j9Ql7l2J6
6209b4N0Jk1k3L7n7J09j08M0l9P9o6K6J8rl3N5m4L2L2j7JJ7l9nn6M0JM9j0j0k3
6241CM2o7O7k6q8M8LP6l5lK2j6n3N7mkm8o8N9L4ml7mk0J03l1M3o1J5o6J02n0k6
6274c5R6m7J0j5mJ0j9j7N5j05J15j1J7l3l6MJ9O5l6k7N9p3JN6o8L3Qpj3Kj6K5
6306A3K1J0o6j4j5P9l4O7n5L1j4qk6ll7P4j05R5l8N4rJ7Qn0Pk7k4N4J9on2mK7
6339a1oP0k3ROj2j7j8m0K6O7M2j07k8K7J04q8L9j9Ll9j8N9o3j6NK8O0l8Mo2L0
6371b6M8K3l3j3ol7O4m9N5j0K5n4Mk9K8mj6Q8l3n0l4N3L1o9J0L4K0l1O0o7L0j6
6403dN5j00O7J2o0N8Lk5%P6j36O4J7k9Ql6Kj0Pj4M0J9L0ln1N0p8J4J1k2M8o2n
$$ y = [-73, 53, -8, -13, -58, -3, -40, -21, 39, -29, -45, 42, -26, -15, 22, 21, -36, -47, -61, -58, -41, -18, 25, 27, -16, 26, -33, -30, 40, 21, 29, -8, -40, -24, 26, 27, 6, -17, 20, -37, 72, -36, 4, -35, 44, -22, 4, 22, 13, -20, 35, -9, 23, 55, 38, 39, 56, 17, 12, -44, -4, -3, 46, 36, 26, 3, 45, -22, 45, 19, -69, -21, -18, 58, 23, 20, 42, 26, -27, 30, 26, 24, -24, -92, -33, 1, -3, -40, -44, -64, 39, 8, 51, -10, 5, -61, 41, -9, -35, 61, 14, 24, 9, 5, 15, -4, -21, 34, -71, 44, 33, 50, 17, -19, -15, 4, 69, 33, 6, 65, -8, -7, 49, -19, 14, 22, 15, 2, 4, -12, 13, 34, 44, -22, -36, -51, 28, -6, 61, 6, 37, 23, 15, -11, -14, -51, 23, -82, 13, -25, 29, 20, 37, 45, -5, 2, -25, -49, 5, 24, 18, -34, -38, -11, -17, 53, 30, 39, 45, 33, 16, -2, -42, -16, 51, 93, -14, -42, -15, 89, 1, 40, 21, 24, -15, -33, 26, -37, -53, -48, -20, 40, 2, 6, -56, -26, 22, 45, 12, -1, -7, -44, 20, -29, 26, 16, 41, -13, -9, -38, -10, -14, -30, 58, 25, -25, -59, -6, 25, -44, -34, 0, 20, -11, 49, -18, 12, -4, 51, -49, 18, 30, -30, 28, 31, 6, 6, 82, -54, 10, 27, -2, 6, -30, -28, -38, -31, -45, -5, 14, 44, 41, -10, 40, -38, -24, -13, -35, 13, -49, -54]
6436e4R3j9o0l4P9m9O2k4J7J2j9N3m2j3K1j0j6k7qO0L5q6KL3q4L4J16q5o0L7J8
6467a8M9q8K2M2rL3m4l9P4o2J9oK1M1p6O9j6L4j5l4po0Q6j0n7Q4p5R4j1n1K1n2
6499d1m4N5M3J2q8J4L6K8k9K1l3L4J0n2O9l3qK6o7Q6p5K2J6k3K0NK6Lj23R0M9
6530D9Mp8J6kqJ0J8j4rL2k9K2l2M5q0R0o5N7l4K6j26J21Rj3n6J02k2m0lj4O0J4
6562E0o0M0p1N6o1R2j7k2J7lm9P3k1NKl9N5p7k1J1O0k8k1N0m4oP7j11Q2Lj7jp
6595cPo3L0J9l3K9M6n1l1J9jJ4m2m3J04n1J09j1k1j7l1P3Jm1K6L7p5Q2p4O0k0
6626D8k7K0n9K2L8q5M6L1n6P5j4k2k8JM0l4j9jOL2l2rM1l7mK0J6j9k3K0l1J02
6658E8p7J3lL6m9l2NM0L8k5L1n2KqJ8N8m3L1q0O3J5M6j6m2lk0K7j6m0K2K6k1L7
$$ y = [-54, 39, 20, -40, -74, 5, -44, 18, -6, 11, 23, 4, 57, 15, 2, 23, 13, -3, -30, -38, 22, 57, -29, -27, 6, -78, -44, 72, -13, -73, -36, -18, 31, -57, -35, 7, -2, 31, -13, -52, 22, -40, -21, -27, -6, 35, -41, 28, 12, 46, 31, -3, -10, -70, 16, 6, -51, 33, -42, 52, 41, -10, 11, -41, -85, -30, 13, 25, -63, -49, -13, 15, -14, 7, -26, 8, 18, -34, 35, 2, -6, 20, -47, 39, -36, -14, 2, -21, -1, 4, 30, 33, -90, 0, 49, 53, -25, -9, -11, -19, -9, 9, -5, -14, 18, -11, 11, -21, 24, -56, 34, -31, 26, -8, 18, -108, 13, 22, 9, -47, 55, 33, -7, -10, -24, 36, 50, -10, 30, -41, 15, -46, 46, 29, 7, 24, 21, -28, 45, 24, 29, 31, -8, 47, -30, -51, -40, 20, -8, -29, 21, -23, -29, 48, -63, 19, 22, 5, 4, -3, 4, -59, -29, -10, -43, -14, 32, -19, -50, -31, -32, -18, -60, -103, 1, -50, 59, 48, 27, 10, -21, 52, 53, 12, 38, 75, 0, 82, 8, 68, 48, 21, 41, -18, 4, 42, -43, 3, 34, -22, 53, 39, 17, -11, -10, 30, -4, -23, -24, -18, 14, -18, -27, 14, -23, -27, -7, 9, -10, -33, -13, -44, 58, -19, -6, -9, 27, -22, -54, -49, -9, 29, 4, 35, -17, -15, -23, -5, 53, 10, 41, -39, 24, 39, 85, 69, 27, 24, 4, 31, 15, -25, -3, 23, 2, 39]
6691C9r5Q1l6J8J3J0jJ4q7Q4q2O6o1nj6Q0n1mnNP8k2l1o7R7L7r0J6J5K3K0on2
6724a5J4K8jj5J0K9q9M3l4l1R2J5j4j5nJ9m6P7m2r1O0kK5M9kk3l9L4Lj8pl3k6
6757e0L2O0m1m0m4Q0j9M9KKl2k8L2K2j3j4k5K5j8k1j5J9P5l4J7Jj2k9L9j7M2n4
6789ij2l8N6l7K1n1J35j0p6L9l0JJ1p3P8k7pK7J9j8k6O7kk4k9pO1j01L0J5M0n8
6821c5MK8l0P9j5k8l6PQ2o0P5m9m5N5n5N1J5p1K2M9n6P6jn2Q8j22L3Nj5L5q4Q7
6853C7o9M8o0J4j9N9n3K8L8Oq3N2M1pq5J5L2JJ7j0L4n4J2l3O3p5M0k5J9k4K6K
6885a3n0K8N2n6L2J7Pn5O2Nl3k5L0L4k1m1rR6ro1L3K5o4M3Mj9q6J00lo9L2P5j1
6918E0q7N0L9n6k7J4k4oK8k9L9k3K2q3J59kq7k6N9m3LJ9K6Rp9J4J7L3K%n2N5J5
$$ y = [39, -56, 25, -11, 7, 20, 30, 29, 43, -44, 40, -42, 24, -37, -42, -58, 22, -29, -33, -38, -33, 45, 23, -8, -75, 22, 59, -31, -15, 0, 23, 43, 37, -15, -1, 27, 26, 11, 21, 50, -39, 4, -30, -61, 31, 46, 32, 17, 12, 31, -15, 62, 20, -71, -11, -13, 12, 61, 59, 36, -3, 31, 34, 16, 9, -24, -50, -18, 42, 1, -39, -83, -3, -22, 27, 29, 31, -1, -29, 3, 25, 12, -2, -27, -2, -20, -41, -56, -37, 38, 4, 21, 22, 10, -19, 20, 3, 45, -9, -21, -59, -3, -40, -19, -70, 65, 55, -21, 18, -12, -11, 0, -73, 5, -22, -29, -2, 17, -1, -27, 40, 38, 14, -15, -22, 39, -62, -32, -17, 23, -35, -31, -3, -33, 46, 31, 3, -33, -26, 56, -4, 71, 22, -23, 32, -23, 28, 43, -28, -6, 43, -13, 63, 62, 10, 98, -24, 9, 14, -1, 34, -50, 37, -32, 16, -44, -30, -49, 10, -43, -15, 23, 29, -54, -2, 39, 32, -53, -38, -6, -5, 12, 2, 36, -18, -6, -39, 24, -51, -11, -36, -17, -41, -15, -13, -63, -35, 17, -39, -7, 10, 17, -38, 24, 29, -4, -29, 1, 35, 14, -27, -36, 60, 51, -10, 23, 48, -16, 27, 31, 12, -74, 26, 23, -46, -14, 61, 50, -37, 13, 52, -4, -31, -17, -41, -47, -19, -48, -9, -32, -10, -93, 66, 64, -23, -49, 10, -33, -30, -11, 15, 24, -55, -41, -24, 9, 11, 11, -41, 14, 29]
6951B9n8K7P3j11L3K3m0Q8o1k4N9n7K6mo8O0lN2l3k3l1O0m3j7N4n7p0J71m1Mk6
6982hP1q4K1O2q0LQk1J9J7rk4l6P6j9N7m7ql2J40o1r5M2K5j9O2k4M6m9p0M2OJ
7015A2j8k1L6J0K2q9L4J1l0N9m9M1Ml9rK8M6j5r2J3PJ01k7k3m4J4qJ2oKK0q4J05
7048B3j8o0L2N5ml5L2o5K2M4o3PnR4l6n0J1K6o5N3L4k4j5o9J09m9j8k4O3l2O3
7079C6n5M8m7MnJ9LJ4o3K1K3K9p6M6J3J4m1k9N5k1j0M4mn2N7k6M4o8M1k8M5n5
$$ y = [29, -29, -2, 71, -40, -7, 16, -24, 64, 3, -21, 38, -19, 7, 3, -65, -5, -8, 44, 11, -12, -43, 17, -26, -43, 11, -46, -116, 55, 14, 18, -8, 63, -21, 0, 62, -18, -15, -7, -28, -9, 8, -1, -25, -61, 15, -4, 53, 6, -2, -34, 106, 45, -50, -8, 17, -2, 60, 36, 82, 33, -37, 5, 11, 12, -6, -27, 9, 19, 41, -48, -14, -3, -33, 26, -23, 18, 22, -17, -26, 2, 48, 33, -59, -46, -39, 62, 35, 12, -32, -18, -26, -14, -20, -18, 2, -82, 23, 5, -55, -23, 32, 28, -7, 25, -40, -18, 26, -37, -30, -35, 59, 23, -27, -16, 10, -55, -2, 32, 8, -7, -76, 33, -16, -34, -58, 5, -27, 36, -19, 29, -18, -14, -19, 0, 3, 17, -46, -25, -2, 27, -49, -3, 10, 24, -17, -46, 9, -12, -22, 22, 18, -34, 23, -3, 41, -27, 14, -14, 31, -24]
$$ [...]
8191G
##END NTUPLES=NMR FID
##END=
