##TITLE=1H_AB_NV DMF
 
 8 sc, 
 9.9.2024
##JCAMPDX= 6.0         $$ Bruker NMR JCAMP-DX V2.0
##DATA TYPE= NMR FID
##DATA CLASS= NTUPLES
##ORIGIN= UXNMR, Bruker Analytische Messtechnik GmbH
##OWNER= root
$$ XWIN-NMR		Version 3.5
$$ Mon Sep  9 14:54:09 2024 Russian Standard Time (UT+4h)  she@DPX200
##.OBSERVE FREQUENCY= 200.1318
##.OBSERVE NUCLEUS= ^1H
##.DELAY= (6, 6)
##.ACQUISITION MODE= SIMULTANEOUS
##.ACQUISITION SCHEME= undefined
##.AVERAGES= 8
##.DIGITISER RES= 18
##SPECTROMETER/DATA SYSTEM= spect
##.PULSE SEQUENCE= zg30
##.SOLVENT NAME= CDCl3
##.SHIFT REFERENCE= (INTERNAL, CDCl3, 0, 15.7039)
##AUDIT TRAIL= $$ (NUMBER, WHEN, WHO, WHERE, WHAT)
$$ ##TITLE= Audit trail, XWIN-NMR		Version 3.5
$$ ##JCAMPDX= 5.01
$$ ##ORIGIN= Bruker BioSpin GmbH
$$ ##OWNER= she
$$ F:/spectra/data/she/nmr/H-F/1/audita.txt
$$ ##AUDIT TRAIL=  $$ (NUMBER, WHEN, WHO, WHERE, WHAT)
(   1,<2024-09-09 14:52:37.84 +0400>,<she>,<DPX200>,
      <created by zg, POWCHK disabled, PULCHK disabled
       configuration hash MD5:
       00 E9 B6 7A A2 85 ED C7 34 08 36 98 17 FE 4E 26
       data hash MD5: 16K
       18 87 A7 6E 9F 4D E9 4E 3F 60 81 3C B7 94 79 DD>)
$$ ##END=
$$ 
$$ hash MD5
$$ C9 46 41 5C CC 95 B3 21 11 DF D8 A3 08 ED C4 8B
##$RELAX= 
##$RELAX= 
##$RELAX= 
##$RELAX= 
##$RELAX= 
##$RELAX= 
$$ Bruker specific parameters
$$ --------------------------
##$DU= <F:/spectra>
##$EXPNO= 1
##$NAME= <H-F>
##$PROCNO= 1
##$TYPE= <nmr>
##$USER= <she>
##$AMP= (0..31)
100 100 100 100 100 100 100 100 100 100 100 100 100 100 100 100 100 100 
100 100 100 100 100 100 100 100 100 100 100 100 100 100 
##$AQSEQ= 0
##$AQ_mod= 1
##$AUNM= <au_zg>
##$AUTOPOS= <>
##$BF1= 200.13
##$BF2= 200.13
##$BF3= 200.13
##$BF4= 200.13
##$BF5= 200.13
##$BF6= 200.13
##$BF7= 200.13
##$BF8= 200.13
##$BYTORDA= 1
##$CFDGTYP= 0
##$CFRGTYP= 5
##$CHEMSTR= <none>
##$CNST= (0..31)
1 1 145 1 1 1 1 1 1 1 1 1 1 1 1 1 1 1 1 1 1 1 1 1 1 1 1 1 1 1 1 1 
##$CPDPRG= <>
##$CPDPRG1= <>
##$CPDPRG2= <>
##$CPDPRG3= <>
##$CPDPRG4= <mlev>
##$CPDPRG5= <mlev>
##$CPDPRG6= <mlev>
##$CPDPRG7= <mlev>
##$CPDPRG8= <mlev>
##$CPDPRGB= <>
##$CPDPRGT= <>
##$D= (0..31)
0 1.2 0 0 0 0 0 0 0 0.06 0 0.03 0 0 0 0 0.0002 0 0 0 0 0 0 0 0 0 0 0 0 
0 0 0 
##$DATE= 1725879157
##$DBL= (0..7)
120 120 120 120 120 120 120 120 
##$DBP= (0..7)
150 150 150 150 150 150 150 150 
##$DBP07= 0
##$DBPNAM0= <>
##$DBPNAM1= <>
##$DBPNAM2= <>
##$DBPNAM3= <>
##$DBPNAM4= <>
##$DBPNAM5= <>
##$DBPNAM6= <>
##$DBPNAM7= <>
##$DBPOAL= (0..7)
0.5 0.5 0.5 0.5 0.5 0.5 0.5 0.5 
##$DBPOFFS= (0..7)
0 0 0 0 0 0 0 0 
##$DE= 6
##$DECBNUC= <off>
##$DECIM= 24
##$DECNUC= <off>
##$DECSTAT= 4
##$DIGMOD= 1
##$DIGTYP= 9
##$DL= (0..7)
0 120 120 120 120 120 120 120 
##$DP= (0..7)
150 150 150 150 150 150 150 150 
##$DP07= 0
##$DPNAME0= <>
##$DPNAME1= <>
##$DPNAME2= <>
##$DPNAME3= <>
##$DPNAME4= <>
##$DPNAME5= <>
##$DPNAME6= <>
##$DPNAME7= <>
##$DPOAL= (0..7)
0.5 0.5 0.5 0.5 0.5 0.5 0.5 0.5 
##$DPOFFS= (0..7)
0 0 0 0 0 0 0 0 
##$DQDMODE= 0
##$DR= 18
##$DS= 0
##$DSLIST= <SSSSSSSSSSSSSSS>
##$DSPFIRM= 0
$$ [...]
##$SUBNAM2= <"">
##$SUBNAM3= <"">
##$SUBNAM4= <"">
##$SUBNAM5= <"">
##$SUBNAM6= <"">
##$SUBNAM7= <"">
##$SUBNAM8= <"">
##$SUBNAM9= <"">
##$SW= 24.0689170037331
##$SWIBOX= (0..15)
0 0 2 0 0 0 0 0 0 0 0 0 0 0 0 0 
##$SW_h= 4816.95568400771
##$TD= 16384
##$TD0= 1
##$TE= 0
##$TE2= 300
##$TE3= 300
##$TEG= 300
##$TL= (0..7)
0 120 120 120 120 120 120 120 
##$TP= (0..7)
150 150 150 150 150 150 150 150 
##$TP07= 0
##$TPNAME0= <>
##$TPNAME1= <>
##$TPNAME2= <>
##$TPNAME3= <>
##$TPNAME4= <>
##$TPNAME5= <>
##$TPNAME6= <>
##$TPNAME7= <>
##$TPOAL= (0..7)
0.5 0.5 0.5 0.5 0.5 0.5 0.5 0.5 
##$TPOFFS= (0..7)
0 0 0 0 0 0 0 0 
##$TUNHIN= 0
##$TUNHOUT= 0
##$TUNXOUT= 0
##$USERA1= <user>
##$USERA2= <user>
##$USERA3= <user>
##$USERA4= <user>
##$USERA5= <user>
##$V9= 5
##$VALIST= <valist>
##$VCLIST= <CCCCCCCCCCCCCCC>
##$VD= 0
##$VDLIST= <DDDDDDDDDDDDDDD>
##$VPLIST= <PPPPPPPPPPPPPPP>
##$VTLIST= <TTTTTTTTTTTTTTT>
##$WBST= 1024
##$WBSW= 4
##$XGAIN= (0..3)
0 0 0 0 
##$XL= 0
##$YL= 0
##$YMAX_a= 284086
##$YMIN_a= -291579
##$ZGOPTNS= <>
##$ZL1= 120
##$ZL2= 120
##$ZL3= 120
##$ZL4= 120
##$ABSF1= 10
##$ABSF2= 0
##$ABSG= 5
##$ABSL= 3
##$ALPHA= 0
##$AQORDER= 0
##$ASSFAC= 0
##$ASSFACI= 0
##$ASSFACX= 0
##$ASSWID= 0
##$AUNMP= <proc_1d>
##$AZFE= 0.1
##$AZFW= 0.1
##$BCFW= 1
##$BC_mod= 2
##$BYTORDP= 1
##$COROFFS= 0
##$CY= 11.3945322036743
##$DATMOD= 1
##$DC= 2
##$DFILT= <>
##$DTYPP= 0
##$F1P= 15.6554695791079
##$F2P= 12.8336369535428
##$FCOR= 0.5
##$FTSIZE= 0
##$FT_mod= 4
##$GAMMA= 1
##$GB= 0.15
##$INTBC= 1
##$INTSCL= 1
##$ISEN= 128
##$LB= 0.24
##$LEV0= 0
##$LPBIN= 0
##$MAXI= 10000
##$MC2= 0
##$MEAN= 0
##$ME_mod= 0
##$MI= 1.114404
##$NCOEF= 0
##$NC_proc= 0
##$NLEV= 6
##$NOISF1= 3.799351
##$NOISF2= 2.8
##$NSP= 1
##$NTH_PI= 0
##$NZP= 0
##$OFFSET= 15.70392
##$PC= 1
##$PHC0= -26075.1
##$PHC1= 12.78748
##$PH_mod= 1
##$PKNL= yes
##$PPARMOD= 0
##$PSCAL= 0
##$PSIGN= 0
##$REVERSE= no
##$SF= 200.130013532006
##$SI= 16384
##$SIGF1= 3
##$SIGF2= 2
##$SINO= 400
##$SIOLD= 16384
##$SREGLST= <1H.CDCl3>
##$SSB= 0
##$STSI= 0
##$STSR= 0
##$SW_p= 3612.71676300578
##$SYMM= 0
##$S_DEV= 0
##$TDeff= 0
##$TDoff= 0
##$TI= <>
##$TILT= no
##$TM1= 0
##$TM2= 0
##$TOPLEV= 0
##$USERP1= <user>
##$USERP2= <user>
##$USERP3= <user>
##$USERP4= <user>
##$USERP5= <user>
##$WDW= 1
##$XDIM= 8192
##$YMAX_p= 0
##$YMIN_p= 0
$$ End of Bruker specific parameters
$$ ---------------------------------
##NTUPLES= NMR FID
##VAR_NAME=  TIME,          FID/REAL,        FID/IMAG
##SYMBOL=    X,             R,               I
##VAR_TYPE=  INDEPENDENT,   DEPENDENT,       DEPENDENT
##VAR_FORM=  AFFN,          ASDF,            ASDF
##VAR_DIM=   8192,          8192,            8192
##UNITS=     SECONDS,       ARBITRARY UNITS, ARBITRARY UNITS
##FACTOR=    0.0002076,     1,               1
##FIRST=     0,             0,               0
##LAST=      1.7004516,     0,               0
##MIN=       0,             -291579,         0
##MAX=       1.7004516,     284086,          0
$$ Real data points
##PAGE= N=1
##DATA TABLE= (X++(R..R)), XYDATA
0@%%%%Qj6J6j6J6k4L2m0M8n6P2q8J04j21J41j66J96k32K71l09L52m07M68n31O00
29C18o76P61q57R62j075J198j333J485j652J832k030K247k486K753l050L379l746
46a970M160m632N176n805O544p430Q512r871J1633j4016J7431k2747L2166n3495
60c4344J74990o847l74519M10990o9257l92592L43429R8856l97869L16980J71902
71B41719m17069J74253K17619m25786J03168L02209l33053M1325L52987l00616
81d3244p6809L20644k54791j51543L44490j41198j67390L35663p3174k41225K55418
92A06841l5850k70097K20691O4749k33803J89366J14853k44481R0473J14403k35502
103a18357M3159J64468j58825K5819J78421j33232m6557J31324j15403p2715J34946
$$ plain form
0 0 0 0 0 0 8 -8 8 -8 8 -16 16 -24 24 -32 40 -48 56 -65 76 -90 106 -126 145 -164 188 -219 249 -282 318
29 318 -358 403 -454 508 -567 631 -702 783 -869 963 -1067 1180 -1306 1447 -1603 1776 -1970
46 -1970 2190 -2442 2734 -3071 3473 -3957 4555 -5316 6317 -7699 9732 -13015 19151 -34344
60 -34344 140646 133799 -240720 170270 101013 -291579 51850 150706 -247163 69817 241719
71 241719 -175350 -1097 216522 -209264 -106096 196113 -136940 -95615 257372 -43244
81 -43244 -120053 200591 -54200 -205743 138747 -2451 -169841 165822 92648 -148577 106841
92 106841 70991 -199106 21585 86334 -147469 41897 156750 -87731 2742 117145 -118357
103 -118357 -75198 89270 -69555 -43736 134685 1453 -45104 86220 -29183 -101898 33048
114C3048l9863n0496J25775j5464p9076N9639k2269p8440M6070K1845k6189M5212
126A9792K4853k5799n627j4797j9900p945m687L3613K0494j6264L5012K065p1552
139c0742J9235J9229p4225M6861P4725p5093K8143Q0083j15767k1447R9552j03139
151e2585k5643J55358o9553n9676J55789p5543j26560J48185l8146j40958J74724
162D5392K7481j62753J48786M7353k14615J01474R1175k11066R1452J62625j96539
173f9235M2524J82041k11787l1794K04382j77627o2296K51756j21778j11813K45585
184A39958r9882j84762K25302m3358k06745K30563L6278k26607J89133P2711k67014
195a34423J26202J22457k54983R6815J91338k27128L8077K08855k23994m0091
$$ plain form
114 33048 -6815 -57311 68464 53000 -26076 33563 11294 -67146 -21076 769 -25420 19792
126 19792 44645 18846 13219 -1578 -21478 -29423 -34110 -497 19997 3733 38745 40810 -30742
139 -30742 -11507 7722 -66503 -19642 55083 -20010 8133 88216 -27551 -48998 50554 -52585
151 -52585 -78228 77130 7577 -52099 103690 28147 -98413 49772 11626 -129332 45392
162 45392 72873 -89880 58906 106259 -108356 -6882 84293 -126773 -35321 127304 -69235
173 -69235 -26711 155330 -56457 -88251 116131 -61496 -123792 127964 6186 -105627 139958
184 139958 40076 -144686 80616 37258 -169487 61076 97354 -129253 59880 132591 -134423
195 -134423 -8221 114236 -140747 -43932 147406 -79722 -41645 167210 -56784 -96875
205i6875K21302j78638p3651K52780j14786j16599K35064q5824j76355K03344
215F9762l2155j86922J97189L7921j92490J53743O4619k16834R4755R8725j96631
226a08318P0186J48075j64412K4878J51852j57649l4227J50673j18866n1763J68058
237G8487o7450p4497J46125n0698j11609J14687j7405j06898J10397K7848r8679
248d9692P9267L3044j11013L8433M3181q9011L2782O8738o0788J2740N6280o1444
260g483j8523M2687l8859j1808N1312q928j0444K9887j3961k4805N178o744n015
273a7506J0347J0222J3815l366q446R157k1399k1627K8963m863j8395M8619J711
286B7232m4235L7005j061o6170M0016K8409o2308M5855N0992p8127J8369N4960
$$ plain form
205 -96875 124427 -54211 -127862 124918 10132 -106467 128597 42773 -133582 69762
215 69762 37607 -149315 47874 85795 -106695 47048 111667 -105167 -10412 88313 -108318
226 -108318 -38132 109943 -54469 -29591 122261 -35388 -69615 81058 -37808 -89571 78487
237 78487 11037 -63460 82665 31967 -79642 35045 17640 -89258 21139 48987 -49692
248 -49692 29575 62619 -48394 -9961 33220 -55791 -23009 45729 -15059 -2319 53961 -7483
260 -7483 -26006 16681 -22178 -33986 17326 8398 -2046 27841 13880 -10925 -5747 -12491 -17506
273 -17506 -7159 3063 16878 13512 5066 14223 -7176 -28803 160 -4703 -23098 25521 27232
286 27232 -17003 20002 18941 -47229 -7213 21196 -41112 4743 55735 -22392 -4023 50937
298E0937r1541N70Q3829p3125o856J06637o7658m3775J02352o4661p2563J15240
310C9386k9374q1775J24225l545j13209J01244J1948j36953Q9352N4735j32761
321g6727P8696Q8417j42498L7138J01682j46545M683J33314j19015j6797J55355
332I7703j00806o1906J49024q4189r6552J53953l9508j09582J53119m583j38040
343h1367J22351J7965j56589J00996O1379j47233Q2462R3692j48606L8067J04088
354H7205j45001M240J28722j13036j6341J43489r1074n5976J31205p3016q3837
365h3420J29644l1494q9804J24069j643j08964R2757J4049j18865P2579M6569
376D5477j03956N7972O7477j00434K3012O7704r5016J69Q0918o7152q503Q6867
$$ plain form
298 50937 -40604 -40034 43795 -29330 -36186 70451 2793 -40982 61370 -3291 -75854 39386
310 39386 10012 -71763 52462 48917 -64292 36952 48900 -88053 1299 56034 -76727
321 -76727 1969 90386 -52112 -14974 86708 -59837 -55154 78160 -40855 -57652 97703
332 97703 -3103 -65009 84015 -174 -96726 57227 17719 -91863 61256 56673 -81367
343 -81367 40984 58949 -97640 3356 64735 -82498 -36 93656 -54950 -16883 87205
354 87205 -57796 -53556 75166 -37870 -54211 89278 -1796 -57772 73433 417 -83420
365 -83420 46224 14730 -75074 48995 47352 -61612 31145 45194 -73671 -1092 45477
376 45477 -58479 -507 66970 -33464 -10452 57252 -37764 -37595 43323 -23829 -32332 54535
388E4535n1214l2788P0696m2112m6661O6638j4607m1271O2546Q90m9077L8191
400A5766K076n1122K6637J8123l2900K3354K4145k8019L590J1855k5103l258J3427
413a429m865M604J1100P54j766q345l589P34j2505O430J9121j2087L748K2394
427B4299k5929j2668K6763k4537j4751M5173j2642k3495M7258j3935m5860M3137
439A2813l719n2359N1374J9373n8009M4378K8113p5637K6259M2070p6194K0483
451b1055O8154o8894L560P7376p2267k5592Q3766n9775l9859J00017l5822n7620
463d8011R7972k3943q5437Q6961k059r5119Q5429L0494j00415O8604M7460j13837
475e1901M1061O6173j09110K5540R3175r5266J583J02070r0217l1695J05594p1004
$$ plain form
388 54535 3321 -29467 41229 -883 -47544 19094 4487 -36784 25762 26652 -22425 15766
400 15766 17842 -33280 -6643 11480 -21420 1934 26079 -1940 1650 13505 -11598 -14856 -1429
413 -1429 -6294 -1690 9410 10164 8398 53 -3536 -2802 -15307 -8877 10244 -1843 1905 24299
427 24299 -1630 -14298 12465 -12072 -26823 18350 5708 -17787 29471 15536 -30324 12813
439 12813 9094 -43265 8109 27482 -30527 13851 41964 -33673 -7414 34656 -41538 -21055
451 -21055 47099 -21795 -18235 59141 -13126 -38718 45048 -14727 -54586 45431 9609 -48011
463 -48011 49961 26018 -59419 27542 25483 -69636 15793 46287 -54128 14476 61936 -51901
475 -51901 -10840 55333 -53777 -28237 64938 -30328 -28745 73325 -16892 -48587 57007 -13997
487a3997m9290J16137m1779o7253J09116k4598r2147R2878n20r8860Q5391L1481
499D6559r9465O5104M7092j06759L6101O1801r7390K0265Q2661p9926q25Q5727
511F0945p2338k8569Q3354n3820l9767Q8406k8186n0026P8655j6216o6586O2312
523A8164J41o6784N6400K2617o2500M1092K9472o6000J9607L5256n6336J1622
535a7249M7250m1093M09M4119l6735j6114L6986k4866j7326L8343q240j7243K8653
548A6894n913k3648J5088j537j6581J3986P732p132P302K455p871k907l210K29
562e113J433j257J0392L873j0728P295J129k1035Q569J1660k0086J2694K1811
575B0637k6171K667K3567l3134n823L4988k6337r124M6052k2527k4402M4911k0810
$$ plain form
487 -13997 -63287 52850 11071 -56182 52934 28336 -63811 29067 28547 -70313 15078 46559
499 46559 -52906 12198 59290 -47469 -11368 50433 -46957 -26692 55969 -23957 -24782 60945
511 60945 -11393 -39962 43392 -10428 -50195 38211 10025 -40001 38654 22438 -44148 18164
523 18164 18305 -48479 7921 30538 -31962 9130 38602 -27398 -7791 27465 -28871 -17249
535 -17249 30001 -11092 -10683 33436 -3299 -19413 17573 -7293 -24619 13724 5484 -11759 16894
548 16894 10981 -12667 2421 884 -15697 -1711 6021 -1111 6191 8646 775 -2132 -5342 -5113
562 -5113 -3680 -4937 5455 9328 -1400 5895 7024 -14011 -5442 6218 -13868 -1174 20637
575 20637 -5534 -2867 20700 -12434 -18257 16731 -9606 -18730 27322 4795 -19607 25304 4494
588D494l8716M8731n331m3628N2243Q752n6115M1425J7076o6916L2731L5844o4431
601c3841K6139N2532o5617O511N8714o5898j1194P1122n1876k2425Q1005l9854
613E318m2990P7120k9948o0750P6156p737o7431P3783J2256p9093N7324K5341
625C9349q7398M2515M6336q1769L0106O3623p8022O670O9250p2927j3812P8466
637D2387n4799k6379Q4044l8752m5260P6240k6236n9986P0571m380o3008O4625
649A9067J3863o9545M7054K3703p3242L2409L9439o4592K2013N1336n8781L001
661a4275N2119n3434j2205N6603l7364j9014N8767k4683l1317M9425j6755l9792
673c1925M3281j302l7633L8462R903l9173K4503J2510l9235J4708J9929k9378
$$ plain form
588 4494 -34222 14509 9178 -34450 17793 26545 -29570 11855 28931 -37985 -5254 30590 -33841
601 -33841 -7702 44830 -20787 -14276 44438 -21460 -32654 38468 -13408 -35833 45172 5318
613 5318 -37672 39448 9500 -51250 24906 17169 -50262 23521 35777 -43316 14008 39349
625 39349 -48049 -5534 40802 -40967 -10861 52762 -25260 -18590 50660 -22267 -36079 42387
637 42387 -12412 -38791 45253 6501 -38759 37481 11245 -48741 21830 17450 -45558 19067
649 19067 32930 -36615 10439 34142 -39100 -6691 32748 -31844 -9831 41505 -17276 -14275
661 -14275 37844 -15590 -27795 28808 -8556 -27570 31197 6514 -24803 24622 7867 -31925
673 -31925 11356 10054 -27579 10883 20786 -18387 6116 18626 -20609 -5901 14028 -15350
685a5350J0593K4124k3617K33J8742k0614n812J7712j0096l628J6707m365o396
698a767P368m816o878L075M03J036K613J604L744m319n141N457n952o638J4067
713C856q98r647J6643r60k0010J4412K872k4218J7307J4026k6011J4383J9538
726B1293l3120M690K5358l3367r6L6890k8013q038M1539k6968k2211M2644k0395
739B06l0263M7904p353l7601M6205Q01m9645L8571J1422n4415L4718K7739n4932
752b6643K5399L7616n8815R710M5998n5221j112N8136m5262j3916O2274l8697
764e33l1418O1344k6899m1745O2909r417m9592N7070K650o0079M5181J5550o2373
777c7352L6950L1971n9589K4645M0983n9307P663M7072n2576l534N5568m0584
$$ plain form
685 -15350 -4757 19367 -4250 -4017 14725 -5889 -11701 6011 -4085 -7713 8994 4629 -1767
698 -1767 5601 785 -6093 -3018 -2615 -1579 1034 2638 6382 2063 -3078 2379 -3573 -10211 3856
713 3856 2958 -6689 9954 8994 -11016 3396 6268 -17950 -643 13383 -12628 1755 21293
726 21293 -11827 -7137 18221 -15146 -15242 21648 -6365 -14403 27136 168 -22043 20601 206
739 206 -30057 17847 10494 -27107 19098 19899 -29746 8825 20247 -34168 550 28289 -26643
752 -26643 -1244 36372 -22443 -12733 33265 -21956 -23068 35068 -10194 -24110 38164 -533
764 -533 -31951 29393 2494 -39251 23658 14241 -35351 21719 24369 -35710 9471 25021 -37352
777 -37352 -402 31569 -28020 -3375 37608 -21699 -14036 33036 -19540 -23074 32494 -8090
789h090j4878N6568l2566k9359N2859k1273l6684N1863n814m1076M5116L772m7815
802b7377L3619J3055m7450K6411K5070m2698J6664K9936m1044L504L1846l4443
814a2907l388L6242k4061r501L4269j8641j8051K8783j1543j9967K7032j722j9342
827a2797K1502J869k1617J3085M580j8630R907R690j2909N798Q832j1386n26N854
841C252p194p39O070q63K04K065l30j232l875L39K712m634K665Q115o966j132
857a543R532j0424n827J3892p609p702J9012m601j3946J8295l229k0760J8418
870C508L685k2858J9188J1045k7018J3848J5185l1325Q194K2948k9659M118L0805
883B1664k8175n077L3685k6948j4675L7819j9562k0869M1435j1465k9954L8648
$$ plain form
789 -8090 -22968 33600 1034 -28325 24534 3261 -33423 18440 12626 -28450 16666 20438 -27377
802 -27377 6242 19297 -28153 -1742 23328 -19370 -2706 27230 -13814 -10310 21536 -12907
814 -12907 -16295 19947 -4114 -13615 20654 2013 -16038 12745 1202 -18765 8267 6545 -12797
827 -12797 8705 10574 -11043 2042 6622 -12008 -2101 7589 -5320 478 9310 -2076 -2602 3252
841 3252 -3942 -4681 1389 526 730 2795 2465 1233 -2642 -2303 409 -4225 -1560 6555 -411 -1543
857 -1543 7989 -2435 -8262 5630 -1979 -9681 9331 4730 -9216 9079 5850 -14910 3508
870 3508 7193 -15665 3523 14568 -12450 1398 16583 -14742 -6548 16400 -13259 -9141 21664
883 21664 -6511 -11588 22097 -4851 -19526 18293 -1269 -22138 19297 7832 -22122 16526
895A6526m844l8481L5317O404m1366L1849J7563m4610K2345K4676m6710J2368
907h963L3774m2260M367M1624l7283p467M3495l2371j8564M5470k2030k5299M6346
920B0839j1719l3522M1061l677m0355L5424P606m1412L0117J7964m2467J9948
932a93K3884m2491J0005L0892l6794K607L6440l0912p419L6374k5708j6215L6288
945A6758j6381k0459L5540p723k5567K9765k043k9423K4312N875k8140K0090J2471
958A5075k7280J2340J4708k6275N581J8025k0873J884K0304j6168l823J7954j3015
971a563q168J6268o924q275J4844k182r376R715p80r699N881K075o034M284L503
986C569l521O03R73k088j289l56K036L60j702M136O47o142L487J944q607M400
$$ plain form
895 16526 11682 -26799 8518 14922 -26444 5405 22968 -21642 703 25379 -21331 -8963
907 -8963 24811 -17449 -13082 28542 -8741 -16208 27287 -5084 -23648 21822 -208 -25507 20839
920 20839 9120 -24402 16659 12982 -27373 8051 15657 -25755 4362 22326 -20141 -193
932 -193 23691 -18800 -8795 22097 -14697 -12090 24350 -6562 -13981 22393 -3315 -19530 16758
945 16758 377 -20082 15458 7735 -17832 11933 9890 -19533 4779 10654 -17486 2604 15075
958 15075 -12205 135 14843 -11432 -5851 12174 -8699 -6815 13489 -2679 -6502 11452 -1563
971 -1563 -9731 6537 -387 -8662 6182 4000 -5376 4339 3559 -6140 -259 1816 -4218 66 3569
986 3569 48 651 1624 -464 -1753 -2109 -73 287 -1415 2721 3368 -2774 713 2657 -5950 -1550
1002a550O573r303L553R435j2036n94J1752j2483l229J6564j0026o587J9049q941
1016B177j2923J9372n942j7264K1183L54k0678K0325N197k5899J6148J0607k8324
1029a5667J2919J8455k7995P755K3892k8395n14K7698k5863p121L2544j9952j3664
1042a5908L4185j4933k2000L2716q333k7516L1812Q92l0993K8059Q135l5144K1114
1055B086J4976l6004J5207K3214l3728P965K8402l1888j582L1324k7344q882L4662
1068A8408j9826j5395L4609j3548k2863L1516o430k7058K8974K487k8906K4159
1080F127Q859l1091J6907J4113l0291J1277K0116k6877N248K3119k4341k240K3943
1093A4869k0046p219K5349j3655j1110K4179q984j5784K0679m146j7570J8193
$$ plain form
1002 -1550 5023 -4280 -727 8708 -3328 -3922 7830 -4653 -7882 8682 -1344 -7931 11118 2177
1016 2177 -10746 8626 2684 -14580 6603 6957 -13721 6604 11801 -14098 2050 12657 -15667
1029 -15667 -2748 15707 -12288 -4533 19359 -9036 -9550 18148 -7715 -14836 17708 -2244 -15908
1042 -15908 18277 3344 -18656 14060 5727 -21789 10023 10915 -20078 7981 16116 -19028 2086
1055 2086 17062 -18942 -3735 19479 -14249 -6284 22118 -9770 -11352 19972 -7372 -16254 18408
1068 18408 -1418 -16813 17796 4248 -18615 12901 6471 -20587 8387 10874 -18032 6127
1080 6127 14986 -16105 802 14915 -15376 -4099 16017 -10860 -5612 17507 -6834 -9074 14869
1093 14869 -5177 -12396 12953 -702 -11812 12367 3383 -12401 8278 4132 -13438 4755
1105D755J967j7298J4275N446j7731Q698P595j5780N193J0372j1938J980J0372
1118G906r662j964Q585o626l122P938k651l016N677j170l641K253l22k092R30
1133i77J153O41n39J26J754k625j941L825k111k941O571q89n607O912l11r036
1149e995P044K621j0597P509O447j2616N191Q994j4812K010J2857j4217o16J7013
1163A0833j2970n404J8721j1676j0736K0332p570j4406K1608k657j8798J9832
1175G109J537k2986J7210P463k4432J4485J3588k5380R134J7803k5803L096K2325
1188A5149k3121k099K6332j9451q735K7430j5617j5291K7670r337j9634K7185
1200A0481k512k3883K3577L160k7279J9037R813k7536J4532J6009k6931Q015J9653
$$ plain form
1105 4755 6722 -10576 3699 9145 -8586 112 7707 -8073 -2880 7492 -4446 -2466 7906
1118 7906 -1756 -3720 4865 -1761 -4883 3055 404 -2612 3065 1895 -1746 507 185 -1907 -977
1133 -977 176 817 278 404 2158 -467 -2408 1417 -694 -3635 2936 2047 -3560 3352 3041 -5995
1149 -5995 1049 3670 -6927 582 7029 -5587 -396 8598 -6214 -4204 8653 -5564 -6180 10833
1163 10833 -2137 -7541 11180 -496 -11232 9100 1530 -12876 8732 6075 -12723 7109
1175 7109 8646 -14340 2870 10333 -14099 386 13974 -11406 -2272 15531 -10272 -7176 15149
1188 15149 -7972 -10071 16261 -3190 -11925 15505 -112 -15403 12267 2930 -16704 10481
1200 10481 7969 -15914 7663 10823 -16456 2581 12394 -15142 -610 15399 -11532 -3517 16136
1213A6136k5623J371K3019k1601l749K5500j7015r529K5105j2803j4764K4085
1225A0132o916j7602K2701j118k0184J8863L244k2105J4599Q114k1316J0834J2447
1238A1693j9943N614J4392j8292N73J6013j4480k761J6912j0477o344J5330p341
1251H89r176J3388l219r648J1598L29r910Q220J929r755N150L743p690L352M879
1266D079n730Q74M017m360r09L228j838q28K411P3r34M3N05n45j851J361J617
1283A213k786J410L454m441m01M977n121k032P517m097l937R170l200p277R457
1298C906j461r906R996J973j1767R346N008j4176O912P989j5344M592J2028j4896
1312e800J545J5037j4500l024J7019j2832p034J9256r307j0843J9982n806j5412
$$ plain form
1213 16136 -9487 -8116 14903 -6698 -10447 15053 -1962 -11491 13614 811 -13953 10132
1225 10132 3216 -14386 8315 7197 -12987 5876 9120 -12985 1614 9728 -11588 -754 11693
1238 11693 -8250 -2636 11756 -6536 -5963 10050 -4430 -7191 9721 -756 -7100 8230 889
1251 889 -8287 5101 1882 -7766 3832 4161 -5749 2471 4400 -5355 -205 3538 -4152 -800 4079
1266 4079 -1651 -777 3240 -1120 -2029 1199 -639 -1467 944 1017 83 126 631 86 -1765 -404 1213
1283 1213 -1573 -163 3291 -1150 -1551 3426 -1695 -3727 3790 -307 -4244 4926 1726 -5551 3906
1298 3906 2445 -7461 2535 4508 -7259 2087 7095 -7081 -169 7820 -7524 -2932 9096 -5800
1312 -5800 -4255 10782 -3718 -6742 10277 -2555 -9589 9667 360 -10483 9499 3693 -11719
1325a1719J8921j627j8718J7575L931k0631J4793Q786k2394J0187J3055k2399
1337a0240N651J7631k0397P10K0582j8049n188K1876j4455j0022K2815r353j3929
1350a2368K2062m635j7862J9537J04k0188J6902N562k0941J3325R871k1468Q441
1363a658J3228k0480M065J6653j7862k92J8497j5214n234J8791j1710q941J8836
1376H679p072j1623J7454l100j4162J4598N68j5157J1910M537j4660Q723P154
1389G849j4064M786Q651j2395J788J0040r635p18J0134p366l342R021m973m680
1403d904Q113k105n018O493k97n387M055R01m638K405K137k961Q87K078j718p90
1419g49J054j34j148K18J807p66j385K593l58l503K852J183m744L033L369n880
$$ plain form
1325 -11719 7202 5575 -13143 4432 8363 -12268 2525 11311 -11083 -896 12159 -10240
1337 -10240 -4589 13042 -7355 -6645 13937 -4112 -9300 12576 -1879 -11901 10914 1561 -12368
1350 -12368 9694 5059 -12803 6734 6838 -13350 3552 9114 -11827 1498 11369 -10099 -1658
1363 -1658 11570 -8910 -4845 11808 -6054 -6346 12151 -3063 -8297 10494 -1216 -10157 8679
1376 8679 1607 -10016 7438 4338 -9824 4774 5342 -9815 2095 6632 -8028 695 7849
1389 7849 -6215 -1429 7222 -5173 -3385 6655 -2980 -3698 6436 -930 -4272 4749 -224 -4904
1403 -4904 3209 1104 -3914 2579 2282 -3105 950 1851 -2787 -382 1755 -1206 -319 1759 41 -749
1419 -749 305 171 -977 -759 1048 282 -1103 1490 1132 -2371 481 1664 -3080 -47 3322 -2558
1435b558J893N032o943P5P010o711j611R171n865m118J0205m864p065J0895k638
1450A908r311J1388K50j1650J0419K934j3921Q668O373j4838O615J0049j5105
1463f221L274J2793j4839p08J5302j2913m362J7314j0040q427J7672o923j2324
1476a0402J7131k764j4965J5966J734j7046J3272N603j8449R807R547j8234O344
1489b456J3129j7182K101J5417j5635k300J7077j2743n966J8134r227r646J7640
1502H343n738j2908J6318j640j4767J4537K515j6023J1518N822j6581Q045Q928
1515H369j5644M785J1498j4016J126J2687j2104k352J3259r241m880J3279o158
1528F08p138J2071l488q880J0368n94r397Q593K054r383O109L699q977L550N051
$$ plain form
1435 -2558 -665 4367 -2576 -2501 4509 -2202 -3813 5358 -507 -4625 5580 716 -6349 4546 1908
1450 1908 -7403 3985 4235 -7415 3004 5938 -7983 685 7058 -7780 -1165 8884 -6221
1463 -6221 -2947 9846 -4993 -5701 9601 -3312 -7674 9640 -400 -8827 8845 1922 -10402
1476 -10402 6729 3965 -11000 4966 6700 -10346 2926 8529 -9920 -113 9434 -8800 -2456
1489 -2456 10673 -6509 -4408 11009 -4626 -6926 10151 -2592 -8558 9576 349 -9297 8343
1502 8343 2605 -10303 6015 4375 -10392 4145 6660 -9363 2155 7977 -8604 -559 8369
1515 8369 -7275 -2490 9008 -5008 -3882 8805 -3299 -5651 7608 -1633 -6513 6766 608
1528 608 -6530 5541 2053 -6827 3541 2947 -6450 2143 4197 -5186 923 4622 -4355 -805 4246
1543D246p547J601N891n805m12N600m216j971M850k217k453L928m73k572K287
1558G37L85k246P00J089j029l42J257K76j426M43J391k026n13K815j701j656L899
1575B053j206l363M235l17m879M512J382o049M271L120p295L081M873q041J646
1590a977P064p919j82Q924p506k783J0194o390n372J1252m226p760J1528j787
1604C060j0271J0676R75j2129R367M267j3097P333P254j3617M380R784j3229J332
1618c915J2163j1758j830J3752r864n299J4343p382q316J4470m097j0759J3709
1631E217q27j2951J1878K453j4256R661N883j4558O941Q789j4327L544J0955j3219
1645d817K99J2723j1120k771J3607q781n814J3456o090q218J2886k964r862J1624
$$ plain form
1543 4246 -3301 -1700 4191 -1614 -2026 3574 -642 -2613 2237 20 -2433 1495 1022 -1550 737
1558 737 1122 -1124 -424 665 -364 -706 551 827 -599 -156 1235 -791 -1304 1511 -190 -1846 2053
1575 2053 847 -2516 1719 1402 -3477 1035 2417 -3632 639 3759 -3536 -455 4418 -3623 -1977
1590 -1977 5087 -2832 -3014 5910 -1596 -4379 5815 -575 -5947 5305 1079 -6681 4847 3060
1604 3060 -7211 3465 4440 -7689 1678 5945 -7152 181 7435 -6182 -1802 7982 -5247 -3915
1618 -3915 8248 -3510 -5340 8412 -1452 -6751 7592 210 -8106 6364 2267 -8492 5217
1631 5217 4390 -8561 3317 5770 -8486 1175 7058 -7500 -559 8230 -6097 -2553 8402 -4817
1645 -4817 -4518 8205 -2915 -5686 7921 -860 -6674 6782 692 -7526 5360 2396 -7466 4158
1659D158j32j1131R526K468j1617P366M958j1194M954O842j0446K206P988r085
1673c139k05Q770p032k262Q792n009m132P968k905n253O893p03n640N428R68n649
1689c110L545K079n016J943K889l807O11L000k661o03K465j423j183J838j09j224
1705g66R02P08j078l63J170l98j345J482P19k193J164J747l007L62K967l195n93
1722a717M294k956j986N199k434l710N758j246n195O031M05o612N519K191p881
1737d340M429M220q456L001O334q480J012P985q089j337R312o868l613J0290n082
1752C18n937J0455l062q151J0041n83r754R101K178j0952P405M706j1667N155
1766g47P166j1470K680R373j0601j35J0816r234l045J1696p131n578J2003m595
$$ plain form
1659 4158 4026 -7105 2421 4889 -6728 638 5596 -5598 -644 6198 -4248 -2042 5946 -3139
1673 -3139 -3344 5426 -1606 -3868 4924 -85 -4217 3751 846 -4407 2486 1783 -3857 1571 2539 -3110
1689 -3110 435 2514 -2502 -559 2330 -1477 -866 2134 -527 -1130 1335 -88 -1271 567 458 -766
1705 -766 136 844 -234 -597 573 175 -1170 312 1031 -1162 2 1749 -1258 -896 2071 -1124 -1717
1722 -1717 2577 -379 -2365 2834 400 -3310 2448 1202 -3993 2038 2443 -4169 1350 3541 -4340
1737 -4340 89 4309 -4147 -1146 5188 -3292 -2280 5705 -2384 -3721 5591 -1277 -4890 5400 318
1752 318 -5619 4836 1774 -6377 3664 3081 -6673 2428 4606 -6346 1059 5765 -5902 -747
1766 -747 6419 -5051 -2371 7002 -3599 -3734 7082 -2152 -5197 6499 -632 -6210 5793 1198
1780A198p845J1418k041r688J0187O98j0751Q608L369j1239O477N542j1230M072
1794a225P392j0478J739Q913r202p21R693p653l057R923n577m942R724l306o490
1809e267Q775j150p593P342J004p937N709K940p736L735M248p134J722N169n931
1824b104O6N567m468j389N284l036k511M648j535k989L830k22l116K672O60k915
1840a558J509J277k249N53J622j437l52J414n52j022R22M62j210K56J351j095
1856a09p83J897o85j836K234K40k740K211J328l587J624K488m098P38L789m095
1872a384l96M879l773j875N609l032l391O108j813m737O166l60o070N662J273
1887B866p085M789L103p618L553M874p824J801O396p505j45P764o541k171Q653
$$ plain form
1780 1198 -6647 4771 2730 -6958 3229 3927 -6824 1784 5153 -6086 391 5933 -5297 -1225
1794 -1225 6167 -4311 -2572 6341 -2861 -3582 6111 -1542 -4599 5324 -253 -5195 4529 1223 -5267
1809 -5267 3508 2358 -5235 2107 3111 -4826 883 3823 -3913 -178 4070 -3064 -1342 3827 -2104
1824 -2104 -2038 3529 -939 -2328 2956 -80 -2591 2057 522 -2467 1363 1141 -1975 697 1357 -1558
1840 -1558 -49 1228 -1021 -468 1154 -283 -635 779 227 -795 127 589 -621 -365 986 -109
1856 -109 -892 1005 320 -1516 718 958 -1782 429 1757 -1830 -206 2282 -1816 -1078 2711 -1384
1872 -1384 -1780 3099 -674 -2549 3060 28 -3363 2745 932 -3805 2361 2001 -4069 1593 2866
1887 2866 -4219 570 3673 -3945 -392 4482 -3342 -1541 4855 -2650 -2795 4969 -1572 -3743 4910
1902D910n193m288Q929l432o185Q708j227p668P942R77q788O553L098r336M840
1917a60N148r226K895O805q688P08P994p712j391Q830o210l343R139m520n143
1932d874Q883k647o607Q253n70p602P183J432q268N638L239q389L909M841p885
1947c464K056O027p026Q5O678n777j671O923m181l068O661k560m195N883r66m852
1963c447M871N54m998L682J731m839K327K531m293J063L104l446j9L232k493r69
1979a409K962j488j567K480m61j803J772L64j780Q57R10j366k5J247o51p65J164
1996D41J36j377P29R81j618R6J825j548p43K429j196j726K761n43k599K867L86
2013A301l380K592J396m056K014K498m382J203L618m386R0M578m113j277N381
$$ plain form
1902 4910 -283 -4571 4358 926 -5259 3449 2222 -5446 2496 3473 -5315 1238 4336 -5000 -160
1917 -160 4988 -4238 -1343 5462 -3226 -2518 5476 -2236 -3627 5203 -1007 -4350 4789 269 -4874
1932 -4874 4009 1362 -5245 3008 2438 -5164 2019 3451 -4817 821 4060 -4329 -420 4421 -3464
1947 -3464 -1408 4619 -2407 -2322 4356 -1421 -3092 3831 -350 -3418 3243 683 -3512 2371 1405 -3447
1963 -3447 1424 1978 -3020 662 2393 -2446 -119 2412 -1881 -818 2286 -1160 -1179 2053 -440 -1409
1979 -1409 1553 65 -1502 978 517 -1286 486 850 -930 -73 837 -529 -554 693 42 -723 441
1996 441 577 -800 -71 910 -708 -612 1213 -335 -1078 1351 155 -1571 1190 647 -1952 915 1301
2013 1301 -2079 513 1909 -2147 -133 2365 -2017 -814 2804 -1582 -1492 3086 -1027 -2304 3077
2028C077l414k650N868k305m037N935r70n320N542O19o242M744K353o818L519
2043i9L943o985J946N344o592K55O470n781j511P148m629l236P401l166m729P281
2059C060j501n947O669K11o889N703J905p369M472L555p489K965M919p199J256
2074a679O020o457m34O812n372k095P122m016l617O971k435m769O455p83n582
2089c859N509P74o021M280K181o003K945L337n592J517M120m914J19M560l945
2104i92j084M682k801k068M380j647k823L825m99l195L053N63l245K095J333l012
2120a435J123J829k439K25K042j707n30J920r13j055J507j35j242R49N42j171
2136d90K20R90q66m72J166l00j078J169L49j585R02J020j886M16J736j966k04
$$ plain form
2028 3077 -337 -2987 2881 576 -3461 2474 1504 -3816 1726 2345 -3897 847 3200 -3618 -99
2043 -99 3844 -3141 -1195 4149 -2443 -2188 4282 -1499 -3010 4138 -491 -3727 3674 508 -4221 3060
2059 3060 1559 -4388 2281 2492 -4397 1306 3211 -4158 314 3869 -3620 -655 4264 -2935 -1679
2074 -1679 4341 -2116 -2550 4262 -1110 -3205 3917 -99 -3716 3255 820 -3949 2506 1723 -3859
2089 -3859 1650 2424 -3597 683 2864 -3139 -194 3143 -2449 -932 3188 -1726 -1607 2953 -992
2104 -992 -2076 2606 -195 -2263 2117 470 -2353 1472 973 -2222 831 1394 -1851 244 1577 -1435
2120 -1435 -312 1517 -922 -697 1345 -362 -892 1028 115 -940 567 432 -810 139 681 -490
2136 -490 -270 720 -146 -618 548 248 -830 339 688 -897 5 1025 -861 -445 1291 -675 -879
2153h79K364j803r95K820j384j881L108p10k711L146J79l480K854J179m046K238
2169aK302m338J364L368m291K25M245l901j045M880l135k273N187k096l474N117
2185B134q80m483M730M67n186M016J810n626L038L059n736J824M193n460N18N086
2201C504m906q80N689m057k231N967k910l453N920j621m502N486k54n259M747
2216A240J147n678L752K417n748K528L477n488J238M308m882l9M847m075j257
2231b213N031l055k312M927j928l139M526p17l801L889L84m077L018J403m065
2246b129K038K230l775R74K782l219l8L068k439q87L003j580j543K697p23j926
2262a467K171M6j999J530O51j877Q40J036j541J94J217j037l54J219n04p72R65
$$ plain form
2153 -879 1485 -318 -1313 1507 123 -1758 1350 640 -2071 1075 1254 -2226 628 1807 -2239 -1
2169 -1 2301 -2037 -673 2695 -1596 -1371 2874 -1027 -2072 2808 -327 -2600 2587 491 -2983 2134
2185 2134 1254 -3229 1501 1968 -3218 798 2608 -3018 20 3079 -2657 -833 3360 -2100 -1582 3504
2201 3504 -1402 -2282 3407 -650 -2881 3086 176 -3277 2643 1022 -3480 2006 1752 -3507 1240
2216 1240 2387 -3291 461 2878 -2870 -342 3135 -2353 -1115 3193 -1689 -1728 3119 -956 -2213
2231 -2213 2818 -237 -2549 2378 450 -2689 1837 1120 -2681 1208 1592 -2485 533 1936 -2129
2246 -2129 -91 2139 -1636 -662 2120 -1099 -1137 1931 -508 -1395 1608 28 -1515 1182 459 -1467
2262 -1467 704 750 -1249 281 932 -945 -105 931 -610 -416 801 -236 -590 629 125 -647 318
2279C18O6r79N81O12j017Q8J057q81m86J339n54j059J494m6j592J402N67k021
2297a111J088J260k271N87J956k304j07K570k089r36K989j599j775L209r04k547
2313a984L133l6l215K785Q91l670K227J868l887J447K750l849M85L512l546n19
2329a608M069k976j572M399k182k586M440j225l473M249j36m182L756J008m654
2344b673K989K102m836K044L102m694R49L884m288j95M428l635j274M693k757
2359a61k268M682j767l109M401p08l752L907L52m127L194J338m288K318K210m161
2375a939J347K957l801L29L416l177o73L645k384j551L582j477k225L272n49k677
2391a905K708L26k829J983J074k751J239J586k440M62J900j944k05J965j359p27
$$ plain form
2279 318 384 -595 -14 598 -419 -331 726 -155 -641 698 144 -915 579 533 -1059 343 910 -1111
2297 -1111 -23 1237 -1034 -447 1509 -795 -902 1668 -421 -1357 1632 33 -1742 1467 563 -1984
2313 -1984 1149 1113 -2102 683 1574 -2096 131 1999 -1888 -441 2309 -1540 -1055 2457 -1089 -1608
2329 -1608 2461 -515 -2087 2312 130 -2456 1984 759 -2714 1535 1399 -2783 973 1981 -2673
2344 -2673 316 2418 -2418 -374 2728 -1966 -1017 2867 -1421 -1616 2812 -823 -2097 2596 -161
2359 -161 -2429 2253 486 -2623 1778 1070 -2682 1225 1577 -2550 644 1982 -2306 12 2222 -1939
2375 -1939 -592 2365 -1436 -1107 2309 -868 -1541 2104 -280 -1831 1751 274 -1951 1321 772 -1905
2391 -1905 803 1129 -1700 283 1357 -1394 -155 1431 -1009 -547 1353 -591 -796 1169 -190 -917
2407i17J829p80j079J535j92j258J135L13j259O59O79j095J29R45p93l69J028
2424E10l57p79R24J48j105O64O75j235K24J185j194l03J527r36q91J750n08j453
2442a154J767O2j919J563P01k259J185J349k382O26J976k342l7K457k082p51K803
2459A563j625j510K990j011k206K946k54k824K672O09l266K203J454l496J514
2474b41K271l516O93K991l275k22L509k789j146L787k084k020L822j271k738L635
2490A406l92l288L225M95l641K625J374l805J927K115l730J108K757l476K41L231
2506B172l012o02L497k366j446L569j602k153L387p44k708L011J28l033K415R35
2522A448l129J690J622k977Q94K141k624J13K415k098n92K477j473j148K346q20
$$ plain form
2407 -917 912 132 -947 588 396 -862 273 586 -673 -14 665 -430 -301 644 -149 -518 510
2424 510 153 -626 298 446 -659 5 680 -555 -331 854 -340 -643 884 -52 -943 807 299 -1154
2442 -1154 613 675 -1244 319 1020 -1239 -54 1295 -1087 -461 1515 -827 -864 1593 -489 -1240 1563
2459 1563 -62 -1572 1418 407 -1799 1147 893 -1931 741 1350 -1916 287 1741 -1755 -241
2474 -241 2030 -1486 -793 2198 -1077 -1299 2210 -579 -1725 2062 -22 -2042 1780 509 -2229 1406
2490 1406 1014 -2274 951 1446 -2195 430 1804 -2001 -74 2041 -1689 -581 2176 -1300 -1059 2172
2506 2172 -840 -1442 2055 -311 -1757 1812 210 -1943 1444 700 -2008 1003 1131 -1902 513 1448
2522 1448 -1681 9 1631 -1346 -452 1689 -935 -822 1593 -505 -1097 1380 -93 -1241 1105 285
2538B85j549K033k00j773J630L42j820J145P97j704O03J109j449R3J296j092l65
2555f19J305o46p37J158j78r56Q65K94j019M57O71r39J6R14o88m29J036l43q07
2574f45R84J05j131P85N48j277M86R64j314O4J329j182m05J584r15q99J735n46
2592B70j330J702n4j745J538N12k057J239J084k220P57J657k199J79K119k002
2608e50n00K480j608j159K640j066j787K609m14k284K372L03k656J975R74k822
2624a493J447J608k848Q39K131k688J88K535k368m91K806j941j154K943j383j735
2640a604K881p55k216K644n8k584K260O33k802J749J288k807J102J844k647M17
2656f55K238k292k66K455j774r27K498j192j435K356n73j787K044L9k012J622
$$ plain form
2538 285 -1264 769 569 -1204 426 768 -1052 93 890 -814 -211 898 -551 -458 838 -254 -619
2555 -619 686 40 -697 461 283 -673 192 486 -533 -76 595 -344 -328 586 -102 -531 505 162 -645
2574 -645 339 444 -687 98 646 -631 -145 819 -495 -431 898 -284 -689 895 -20 -919 816 270
2592 270 -1060 642 588 -1157 381 893 -1164 75 1159 -1061 -304 1353 -846 -667 1452 -550
2608 -550 -1050 1430 -178 -1337 1303 237 -1550 1059 645 -1639 733 1036 -1620 355 1329 -1493
2624 -1493 -46 1562 -1286 -447 1684 -1004 -816 1719 -649 -1140 1666 -275 -1429 1514 131 -1604
2640 -1604 1277 522 -1694 950 892 -1692 568 1201 -1601 148 1436 -1371 -269 1575 -1072 -655
2656 -655 1583 -709 -975 1480 -294 -1221 1277 85 -1350 1006 433 -1354 690 729 -1283 339
2672C39N93k055J127J059j957N88J397j720O8J589j349m09J629r25q07J544m79
2689B32j083J303j0j214R59M18j239N65P28j093J34R37q30k68J001n03n77R12
2707C72j27p85P00K47r05M29N83q85J02Q40p75k53J011n61n88J047k44r23J037
2726C22J06j160Q55N25j340N73R34j392K09J275j297k45J573j046p49J710o85
2743A68j199J715k06j587J542L35j868J234Q67j986Q23J324j973L32J710j796
2759e65j95J990j512p22K150j125j212K183o62j636K073j35j970J833M10k212
2775a307J494R31k281J015J419k251N06J826k065m6K089j724o04K215j278j104
2791a165K193p39j532K020j91j825J710L38j948J318Q01j966Q67J197j837L60
$$ plain form
2672 339 932 -1123 4 1063 -894 -306 1091 -629 -561 1028 -321 -730 899 -26 -833 711 232
2689 232 -851 452 442 -772 187 605 -634 -69 659 -434 -300 637 -193 -461 540 37 -540 372
2707 372 245 -540 160 407 -498 -69 514 -371 -269 571 -204 -457 554 -7 -595 452 208 -715 322
2726 322 428 -732 123 648 -692 -119 815 -577 -368 907 -390 -635 938 -108 -857 853 168
2743 168 -1031 684 478 -1109 433 768 -1100 134 1001 -985 -162 1162 -811 -479 1231 -565
2759 -565 -760 1230 -282 -1004 1146 21 -1191 992 330 -1306 767 632 -1338 495 905 -1307
2775 -1307 187 1118 -1163 -148 1271 -980 -474 1352 -713 -759 1330 -394 -998 1217 -61 -1165
2791 -1165 1028 289 -1243 777 586 -1239 471 809 -1139 179 980 -986 -119 1078 -759 -399
2807c99J496j593j41J667j251n97J721q43r77J629l85j268J391Q5j420J082M88
2824F85j432O76Q36j325K68J042j087j27J142p89m70J123m39p27R81p3q60P27
2842A51K53q93M60N07q44J70O95p00j39P95m75m21Q17k25o51P48Q0q36N98L82
2862D72r53L82O77r38O6R11q19k68J086o21o25J160l11r34J080O3j165Q96M53
2881F12j302O11Q31j311K45J147j221j34J347j009n26J469p08q90J487l67j208
2898i27J401K5j445J225M30j614R43Q33j658N83J186j611J76J472j439k42J666
2915A004j181o65J745q21j056J723m05j372J577K4j574J284M77j673R65Q28j670
2932g90N87J130j525J61J372j333k21J498j034o06J528o70r47J447k76j186J247
$$ plain form
2807 -399 1097 -496 -637 1030 -221 -818 903 60 -917 712 327 -941 450 535 -885 197 685
2824 685 -747 -71 765 -560 -292 750 -337 -464 678 -111 -581 542 103 -624 357 284 -576 151
2842 151 404 -489 -29 478 -366 -196 499 -201 -340 455 -20 -441 376 151 -500 248 328 -508 90 472
2862 472 -481 -99 578 -360 -294 617 -202 -470 616 -5 -630 530 219 -715 365 428 -737 159 612
2881 612 -690 -79 752 -559 -314 833 -388 -522 825 -184 -710 759 51 -839 648 281 -927
2898 -927 474 499 -946 279 709 -905 38 871 -787 -204 982 -629 -453 1019 -420 -662 1004
2915 1004 -177 -842 903 82 -974 749 344 -1028 549 573 -1001 283 760 -913 52 880 -790
2932 -790 -203 927 -598 -437 935 -398 -619 879 -155 -761 767 97 -850 597 321 -865 382
2949C82J33j343R89N12j399O38Q47j315K46J081j113j56J210q26m94J208n01p32
2967f33J073j61r12Q83J84r85O10M48r51L37O49q30K5P81o60k38Q46m67m46P91
2987C44j88o37P03P7p64N36L52q22K95N77p65K5P68o53k54Q77m51n28Q81j77p56
3008e60P93J24r15O24M29r89L72O99r46Q1R06q43k21J043o32n23J078l79p74J028
3028C95o5j004R11K50j145P15N75j202M34Q57j169R7J109j035k48J273q49n72
3046f73J333n58q79J295k15j130J178J47j291R56M70j358O85P59j312L53J013
3063G73j209K7J178j036k99J270p70n99J287m97q40J188j63j040J041J72j175
3080f92Q18M92j222N11P69j136J82R70r69j71J105p39m87J109m12p49J012r0r19
$$ plain form
2949 382 515 -828 161 673 -726 -88 759 -556 -310 771 -342 -498 712 -114 -608 600 99 -633
2967 -633 440 279 -633 250 434 -551 59 507 -444 -107 542 -288 -263 518 -142 -380 466 -1 -447 344
2987 344 156 -481 222 299 -465 71 423 -399 -104 473 -292 -267 501 -152 -406 471 20 -508 373 196 -560
3008 -560 233 357 -558 66 495 -494 -122 577 -369 -288 618 -225 -446 597 -35 -558 520 141 -633 395
3028 395 330 -674 237 487 -658 57 632 -570 -136 721 -448 -351 758 -277 -525 748 -101 -673
3046 -673 660 102 -777 518 303 -827 351 498 -793 163 633 -725 -40 719 -593 -240 773
3063 773 -436 -409 769 -267 -566 704 -66 -665 622 125 -715 473 310 -730 311 483 -692
3080 -692 126 618 -604 -93 676 -460 -278 692 -277 -448 657 -82 -569 540 128 -621 391 301 -618
3099f18Q28K22r71N52M94r46K92O85q46K1Q03o75k36Q39m50m46Q16k14o34P21
3119B37K4p29N62K71p82L63M87p60J32O61o65j05P39m83l61P93k71n87P56k9p11
3140d58N93K34q17M43M53q15K23O29p18m7P69n98k74Q31m11n13Q43j82o99P69
3160B55M4q13O14L15q82M29N50q96J80P41q00p9Q75o41l48R48m51n80R39j98p86
3181e84Q42J01r35O99L41r81M77N85r54K21P51q43k3Q61p11k50R09n18m71R11
3201D28k94o60Q59r2p61P26J28q41N75L59q65L70N54q32J42P04p18j08P88n40
3221g8l29P97l15n34P36n8o88O08J73p22M12L82p07J94N33o08m2O40m83k29O57
3242C39l05l91O35j17n46N48Q2o01M10K65o24K55M31o12O5N63n43j23O46l99l11
$$ plain form
3099 -618 210 432 -539 13 507 -439 -147 538 -308 -287 516 -159 -395 444 -6 -452 364 150 -484 237
3119 237 261 -468 94 365 -417 -54 433 -327 -195 466 -199 -304 435 -48 -409 384 113 -474 282 253 -458
3140 -458 135 369 -448 -5 448 -367 -144 485 -233 -280 489 -109 -383 448 37 -476 367 185 -514 255
3160 255 299 -514 100 415 -467 -38 512 -384 -204 537 -263 -342 533 -108 -456 492 41 -539 400 202 -584
3181 -584 258 359 -576 123 464 -517 -40 545 -409 -188 563 -280 -303 558 -153 -403 506 -12 -483 428
3201 428 134 -526 333 241 -520 206 334 -507 68 427 -438 -68 486 -346 -204 500 -218 -326 462 -78
3221 -78 -407 390 75 -459 277 219 -469 139 312 -410 2 384 -323 -129 404 -204 -246 394 -89 -318 339
3242 339 34 -357 278 161 -385 163 245 -356 54 319 -305 -50 381 -231 -166 397 -146 -269 377 -22 -333
3263c33O48k32m84O30k5o08N31J87o91L77L82p07K02N27o23j1O45n26k15O98l88
3284a6l78P10k17n25O79l8o53N79J75p34M53L55p61K84N27p27R0O55o36j46P64
3305D40m93l52P83k81n50P44o7o78O36J35p52M91L46p61K89M97p01R6O02o02j00
3326b78O79m68k70O83l24m06O70j66n30N96J7n94N02J58o34L63L10o21K17M48
3346C52n67L9N22m75r8N44l44k79N61j71l92M85%m66L69J53m80K21K95m37P1L64
3368B67l42j03M10k22k29M27j32l16L51M7m06K79J80m12J42L14m14M0L87l56j30
3389b18M76k57k67M74j08m16M43O2n10L68K12n53K52L67n52R1M73m81q2N51l73
3410d8k53N96k48l94O01j16n17N51N3n84M53K06o34L49L45o64K21M89o46M5O12
$$ plain form
3263 -333 315 83 -401 229 204 -404 127 314 -377 0 382 -325 -123 404 -219 -230 415 -111 -326 372 -16
3284 -16 -394 316 99 -426 253 215 -438 141 316 -418 35 390 -371 -87 440 -287 -197 458 -178 -324 440
3305 440 -53 -405 378 97 -453 291 224 -454 182 317 -435 56 402 -359 -70 427 -274 -178 424 -178 -278
3326 -278 401 -67 -337 346 22 -384 286 120 -410 186 203 -391 111 269 -365 -2 308 -313 -96 352
3346 352 -215 -176 346 -129 -227 317 -27 -306 255 84 -308 177 177 -289 80 233 -247 -26 269 -168 -97 267
3368 267 -75 -178 232 10 -219 208 76 -240 111 158 -248 31 211 -201 -59 255 -159 -119 268 -88 -218
3389 -218 258 1 -266 208 100 -316 127 189 -321 47 259 -294 -42 325 -227 -136 337 -144 -226 325 -48
3410 -48 -301 295 47 -347 254 138 -379 172 225 -359 94 300 -334 15 360 -304 -83 406 -240 -195 417
3431D17n66j50O89m45l09P16k94m73O96j02o29O31R7p01M92K84p30L29M44p02
3451c06J47N52o01l6O38n03j98O48l46l38O28j96m54N85n2n15M84J02n69L92K19
3472B81n68K50L55n47J28M20m79j5M80l78j58N05k69k47M43j25l22L69ml46K99
3493G2R2l45J71J71l01P9K20k32l7K36j55r5K18o6j66J77L0j85R6J16j81J9J79
3516A13j58n8K13q9j69K35Kk66K15J12l17J50K04l24O0L17l26o4L92k77j94M60
3538B31j81l01M36o6l90L91Q4m82L32J90n12K46L13n12J33M14n01jN12m51j19
3559b34N61l76k51O01k77l73O05j36n24N92K8o20N16J87o76L82L49o80K34M87
3579C95o55P5N97n65j05O48m59k58O76l18l82O42j76m78N69j7n53N06J08n90L94
$$ plain form
3431 417 -149 -299 390 -55 -364 352 58 -415 281 179 -450 181 278 -423 69 353 -377 -48 396 -306
3451 -306 -159 393 -208 -244 394 -109 -307 341 -5 -343 285 89 -365 220 168 -347 137 239 -330 62 281
3472 281 -287 -37 318 -229 -101 319 -160 -175 305 -73 -231 274 5 -242 201 76 -246 123 119 -227 72
3493 72 164 -181 -10 161 -140 -61 159 -73 -110 126 -29 -124 94 28 -138 39 69 -116 -20 96 -85 -66 113
3516 113 -45 -103 110 21 -148 87 89 -177 38 150 -167 -17 187 -137 -77 240 -86 -150 242 -35 -229 231
3538 231 50 -251 185 119 -271 120 204 -278 54 244 -268 -22 291 -221 -88 326 -175 -176 336 -115 -234
3559 -234 327 -49 -300 301 24 -349 256 120 -404 188 216 -404 112 299 -377 5 354 -326 -92 395
3579 395 -260 -185 412 -153 -258 390 -69 -327 349 31 -351 291 115 -363 206 189 -364 142 250 -340 54
3600E4K25n72K56L49n54J33M35n02QM72m10j21N13l17k38N17k20k88M47j02l41
3621b56L73J9l67K93Q6l40J99J61l32J40J84k84P1J95k19MK04j71l7J82r8p8J44
3644G3o6n8J01k7m0L0J5k4j3QL2o5J5Q1p3n0J34p3j10J95l3j92K02L3k60J87J10
3671A32l17J77J91l45R4K83l45J8L36l08q8M03k68j75M33k07k66M56j28l64M53
3692A65k0m53M24Q2m98L52K19n51K74L32n81J65M43n65M7N35n17r2N97m24k53
3713c19O41k89l86O28j73m91N91k3n70N27J01o05M26K31o17L00L70o25J81M58
3733C56n83M5N35n07q0N69m18j99N88l01l19N68j67m19N30n6m58M34P6m79L64
3754G9J45m68K59K30m44J63K80m05R4L00l60K2L16k97l7L26k59q1L12j86j32K96
$$ plain form
3600 54 279 -293 -37 312 -242 -109 326 -176 -168 304 -106 -227 286 -31 -269 248 28 -260 187 85 -256
3621 -256 117 136 -231 62 148 -192 7 168 -164 -24 160 -124 -53 142 -77 -73 131 -40 -77 105 7 -71 73
3644 73 7 -51 50 23 -17 13 28 4 -9 -1 31 -34 -19 62 -11 -61 73 0 -110 85 52 -140 62 95 -165 22 132
3671 132 -185 -8 183 -162 -68 215 -130 -112 224 -84 -172 231 -37 -212 221 14 -252 204 76 -288 165
3692 165 145 -308 116 198 -300 52 271 -280 -6 326 -255 -90 353 -212 -165 370 -147 -239 358 -66 -319
3713 -319 322 33 -353 275 102 -389 202 179 -391 136 237 -368 58 289 -328 -28 342 -283 -102 356
3733 356 -227 -182 353 -154 -234 335 -83 -282 306 5 -314 254 87 -332 198 142 -316 118 194 -285 79
3754 79 224 -244 15 245 -199 -36 244 -161 -67 233 -127 -105 211 -86 -123 203 -56 -137 175 -11 -143 153
3776A53j44j52K62r2j68K31o1j57J93l1j44J50Lj37J30j8q7J09l4q2J42p5o5J52
3800G8q2j04J85o1j37K18n4j92K52k5k38K47L8k99K36P5l09K06J38l56J88K08
3822B12l86J43K57l70M3L53l80j7L96l36j06M62l22j98M88k24l10N23j62l76M90
3843A80m2m64M51P9n39M00J85n55L14L01n82K06L88n50R0M85n20j7N32m42j42
3864b42N75l59k58N87k71l45N80j64m48N61m4n17M85R7n73L92K15n72K92L00n40
3885b49J87L74n25J00M22m64j3M54l86r6M66l27j74M69k43k41M56j83k78M30j26
3906E3l18M18m0l59L53M3l92L02R4l68K41J60l74J89J97l52J15K28l20P9K39k92
3928a04M1K40k59J1K34k25j6K41k23k7K48k17n0K61j94q6K86j85j10K98j75j54
$$ plain form
3776 153 9 -143 119 27 -141 90 29 -128 65 34 -110 40 43 -94 36 18 -69 40 6 -76 66 -9 -74 78
3800 78 -4 -108 77 16 -121 97 43 -149 103 78 -160 87 125 -174 62 137 -172 34 172 -184 4 212
3822 212 -174 -31 226 -144 -101 252 -128 -145 251 -85 -191 271 -51 -249 239 15 -295 228 66 -310 180
3843 180 138 -326 125 204 -335 65 250 -305 9 310 -272 -66 322 -228 -138 347 -173 -190 342 -100 -242
3864 -242 333 -26 -284 303 32 -313 267 103 -345 216 172 -345 140 237 -336 56 271 -301 -9 291 -249
3885 -249 -62 312 -213 -113 309 -155 -168 286 -100 -196 270 -57 -231 238 -5 -246 210 27 -251 179 53
3906 53 -265 153 113 -246 107 150 -242 60 154 -214 27 187 -187 2 199 -153 -38 190 -130 -51 188 -104
3928 -104 -63 177 -82 -71 163 -62 -78 163 -60 -87 161 -56 -106 155 -39 -125 161 -24 -134 164 -11 -165
3950a65L22j59j77L11q7k30K95n5k52L08k7k83K86L1l28K71Q9l70K68J26l93K13
3972fK14m03J56K73m24J17L23m00L1L94l82o0M35l30j53M71k58k28M70k09k93
3993b62M63j20l85M81m3m40M48N0m97L78J67n38L24K43n52K35L57n60J30M44n13
4014a90J6M96m55r9N32l81j86N42k92k71N39j85l67N14j16m09M66pm48M22P2m85
4036b92L73J41n02L11K26n09K29L10n13J39L82m78N5M16m31k1M43l68j09M46k89
4057d1j89M41k22k16M10j53k74M04j00l03L75l2l43L44J6l68L16P9l73K66J35
4078A72l86K31J73l82J73K13l69J36K44l43O4K78l34L5L16l22j3L32k88n9L40
4099B11k68q0L32k27j44L79j97k08L85j53k67L74q0k87L52k7l60L64K9l67L04
$$ plain form
3950 -165 157 -2 -179 132 45 -185 110 55 -197 111 84 -199 87 118 -210 61 150 -220 48 174 -219 -6
3972 -6 208 -195 -39 234 -190 -73 250 -150 -119 275 -107 -167 268 -62 -215 256 -2 -230 240 31 -262
3993 -262 201 81 -304 177 134 -306 142 192 -305 73 240 -298 26 269 -283 -48 309 -251 -121 323 -190
4014 -190 -174 322 -133 -232 300 -81 -267 275 -17 -288 251 66 -301 213 97 -312 154 147 -301 121 193 -292
4036 -292 81 222 -280 31 257 -252 -23 287 -226 -87 295 -183 -128 288 -143 -164 279 -89 -198 248 -41
4057 -41 -230 211 -11 -227 183 30 -244 160 60 -243 132 100 -243 101 117 -251 65 144 -229 37 172
4078 172 -214 17 190 -192 -19 194 -175 -39 205 -138 -74 204 -130 -95 221 -101 -114 218 -70 -129 211
4099 211 -57 -137 195 -32 -176 203 6 -202 183 30 -237 137 57 -230 122 95 -265 99 128 -239 65
4120F5J05m09K64J62m16K14K19m19J73K66m05R9L25m03M6L73l78m1M23l45j15
4141a97M70l09k03M99k55k70M90j48l51M57o1m20M45K7m62L75J23m74L15J96m96
4162b49K37K60m83J75L38m80R2L86m61K2M43m09q3M92l54j77N26l02k50N18k30
4183A1l10N04j22l88M77o1m15M31M4m67L78J16m75L20J93m83K44K73m83J69L14
4204B70m59J07L75m30LM13l83o5M51l49j29M66k76k20M61j98k84M40j27l23M21
4225A64o8l51L71K6l81L32O1l88K84J20m08K47J88m24K05K31m04J42K73l87P0
4246i7L28l64J3L63l43m9L94l02j07L78k33j62L72j77k20L84j25k55L63j08k64
4267b11L52m6l23L34K1l52L15M2l69K88J36m23K45J93m12J81K39l93J08L13l99
$$ plain form
4120 65 170 -239 25 187 -229 -15 204 -215 -42 224 -181 -82 243 -160 -114 259 -119 -160 263 -82 -197
4141 -197 273 -36 -239 260 5 -265 225 77 -274 183 122 -298 147 174 -288 87 210 -264 51 247 -249
4162 -249 -12 248 -235 -60 278 -202 -110 276 -185 -163 280 -129 -212 280 -74 -251 275 -27 -277 241 11
4183 11 -299 205 83 -305 172 111 -304 127 171 -296 82 198 -277 43 236 -247 -3 270 -213 -44 270
4204 270 -189 -82 293 -137 -134 279 -104 -169 282 -67 -196 270 -6 -226 235 37 -247 193 66 -257 164
4225 164 96 -255 116 142 -239 93 154 -234 50 170 -238 9 197 -227 -22 209 -195 -53 220 -167 -97
4246 -97 231 -133 -120 243 -100 -149 245 -57 -164 214 -19 -181 191 14 -206 178 53 -202 161 53 -211
4267 -211 141 95 -228 106 127 -225 90 132 -237 51 187 -236 9 202 -210 -29 210 -183 -75 238 -161
4288a61O4L21l67oL88l36p8M08k92j40M27k45k15M50k04k70M46j25l26M32o4l84
4310b77M15J4m25L61J03m50L13J82m87K58K61n01J97L18m75J00L85m60K1M37m12
4331a22n5M70l70j32M84l13k07M85k34k81M92j63l61M75n6m19M42J7m58L76J44
4352B14m96L12K08m99K44K82n04J73L25m50Q0L79m16JM18l65q4M48l32j38M51
4373B51k74k04M60j96k84M53j35l20M15n8l74L87K5m01L34R6m12K80J53m08K05
4394gK05l93J39K49l58R6K75l49M1L06l28pL32k93n0L40k54j17L63k06j67L59
4416A76j70k06L78j41k45L60p1k97L42j3l30L25L0l53K88Q4l64K57J25l73K16
4437A8J76l80J72K34m02J35K92l92N8L37l77mL88l45o5L91l03j36M31k50k02M33
$$ plain form
4288 -161 -97 224 -143 -149 239 -97 -175 233 -59 -199 228 -17 -232 218 14 -256 190 65 -261 171 107 -277
4310 -277 138 152 -273 88 191 -259 54 236 -251 7 268 -233 -36 282 -193 -93 292 -168 -147 290 -122
4331 -122 -177 293 -77 -209 275 -38 -245 240 6 -275 217 54 -307 168 112 -307 135 152 -306 70 214
4352 214 -282 30 238 -261 -17 265 -239 -66 259 -191 -111 268 -148 -147 271 -94 -178 270 -62 -200 251
4373 251 -23 -227 233 37 -247 206 71 -249 166 108 -266 121 146 -255 79 175 -237 43 196 -212 -7
4394 -7 198 -195 -56 193 -165 -69 206 -143 -102 204 -124 -131 201 -92 -142 198 -56 -173 190 -16 -183 176
4416 176 6 -200 178 37 -208 152 81 -216 126 113 -217 108 138 -215 73 157 -207 50 175 -198 18
4437 18 194 -186 -14 220 -182 -47 245 -147 -89 248 -129 -133 255 -90 -155 236 -67 -203 228 -22 -224 209
4459B09j92k66M42j50l06M43r1l60M04Pm15L67Q8m54L26J76m85K55K64n07J97
4480d8L36m91R5M08m55PM64m35p1M93l47j87M99k60k73N05j97l25M80r7l96M56
4502A61k5m34M10P8m81L49J60m92K80K34m91K11L08m75J01L71m38L7M10l88o1
4523a75M30l32j32M49k66k01M47j90k65M16j12l05L89m9l25L39J5l66L29P3l79
4544b10K55J33l72K06J81l72J69K18l64J01K57l34N8K75l16K1K77k61l4K93k39
4565e8q9L26k10j26L24j81j54L17j57j68L26j33k07L20q1k45L09l0k95L04K0l21
4587b09K86O1l37K44J17l54K18J66l71J72K25l96J36K68l78P8L22l70J0L52l38
4608i8n8M15l30j15M38k69k15M64k03k94M74j24l59M32l2m18L99O0m58L68J32
$$ plain form
4459 209 17 -249 193 43 -263 180 89 -271 133 140 -275 92 180 -274 52 228 -257 -2 262 -245 -48
4480 -48 288 -203 -108 300 -155 -148 316 -119 -190 303 -44 -231 268 8 -265 240 43 -282 198 101 -295 161
4502 161 136 -298 112 190 -291 58 218 -274 6 240 -251 -40 268 -207 -106 265 -173 -136 274 -114 -175
4523 -175 255 -77 -209 240 -26 -227 220 30 -235 181 69 -236 153 104 -221 118 133 -233 96 169 -210
4544 -210 45 178 -194 12 193 -179 -10 208 -156 -55 202 -132 -74 201 -115 -94 183 -78 -112 181 -58
4565 -58 -147 179 -31 -157 167 -14 -168 149 -8 -176 150 17 -190 130 49 -196 113 83 -212 92 112 -209
4587 -209 77 138 -199 45 162 -192 26 192 -179 -7 218 -178 -42 226 -152 -74 248 -122 -112 240 -98
4608 -98 -156 259 -71 -186 252 -17 -232 232 29 -265 209 85 -274 158 126 -292 107 167 -291 77 209
4629B09m85L02K15n04K31K81m69J27L69m57M4M36m26n1M74l65j51M92k96k26N05
4650B55k19l11M99j40l79M71l4m13M00O4m59L38J34m55K63K17m60J99K69m43J31
4671g3L24m03N0L36l54k5L67k89j15L99k55j56L79j83k16L70j26k45L46o9k88
4692b26L24Nl07K69L9k90K28P6k96J94J36l09J61J48l00J33J71k81R4K00k79P9
4714c1K06k68L4K26k44oK56k48l1K85k25p1K76j99j11K99j65j40L16j53j82L14
4736A38j06k28L24p4k65L29m3k96L18J7l42K85R4l77K52J56l97K12K27m18J46
4757d8K94m09O8L51l77k1M03l51r5M49l11j69M56k30k58M66j51l44M66p0m04M33
4779A48J9m63L93J15n00L28K15n18K47K89m98J37L62m69O5M17m26m3M60l55j33
$$ plain form
4629 209 -276 26 241 -263 -32 249 -220 -93 276 -181 -137 299 -127 -178 296 -69 -220 272 -24 -250 255
4650 255 36 -275 224 84 -295 176 142 -271 129 193 -266 72 206 -249 14 231 -229 -30 239 -204 -73
4671 -73 251 -152 -102 234 -120 -145 222 -67 -182 217 -38 -194 185 2 -214 156 30 -215 131 62 -226
4692 -226 98 103 -204 65 104 -186 42 118 -178 16 152 -157 4 152 -148 -15 156 -125 -31 169 -110 -31
4714 -31 175 -93 -59 167 -77 -83 173 -75 -106 179 -46 -117 159 -40 -151 148 -17 -157 159 6 -176 138
4736 138 32 -196 128 54 -211 118 75 -221 97 114 -228 57 151 -226 26 182 -215 -3 224 -194 -48
4757 -48 246 -163 -95 256 -121 -142 261 -90 -185 264 -47 -216 240 10 -248 218 67 -277 189 119 -285 148
4779 148 167 -296 97 212 -288 40 255 -263 -16 273 -225 -88 274 -195 -130 287 -139 -182 278 -77 -210
4800b10M62k78k10M66k16k72M57j14l47M16l7l77L74N0m15L23J15m23K60J94m18
4821b00J76K53l99J06K91l60N0L08l23k4L34k74q4L33k05j32L14j68j57L01j22
4842A8j89K92p7k23K76l8k26K47nk45K30K7k46J87P1k52J76Q7k42J31J00k36J37
4865@J23k39J05J45k51R1J71k46O9J89k55M5K23k63J7K48k39l1K81k24r4L15j99
4888a9j43L55j83j95L60j38k36L52p1l01L39rl38K97P1l84K85J41m20K38K15m17
4910b01J57K87m32R2L53m09QM11l64r9M46l02j79M69k26k74M81j41l54M59p1l91
4932b80M06M2m50L65J14m51K92K05m75K02K86m50J14L54m29L4L94l86m6M19l28
4953f8j27M33k59j93M05j75k48L86q9l05L66k4l40L22M7l39K42J30l48J94J43
$$ plain form
4800 -210 252 -26 -236 230 14 -258 199 85 -262 154 117 -260 114 164 -251 72 187 -236 24 218 -200
4821 -200 -24 229 -170 -64 227 -133 -83 225 -98 -122 212 -62 -146 187 -18 -150 164 -4 -161 140 18
4842 18 -171 121 44 -179 97 59 -167 80 75 -170 60 87 -159 28 99 -153 23 110 -132 -1 99 -137 0
4865 0 123 -116 -11 134 -117 -26 145 -101 -32 157 -98 -53 170 -93 -76 172 -67 -98 183 -41 -135 180 -19
4888 -19 -162 193 10 -185 175 37 -199 153 82 -219 120 111 -227 70 141 -243 42 183 -237 1 216 -201
4910 -201 -44 243 -189 -97 256 -153 -145 266 -98 -197 249 -53 -232 237 11 -263 218 77 -277 182 111 -280
4932 -280 126 168 -282 83 197 -254 38 243 -232 -30 256 -194 -80 274 -155 -121 273 -113 -159 260 -68
4953 -68 -195 238 -21 -214 191 16 -232 154 65 -240 126 102 -238 84 131 -208 34 164 -184 10 153
4974A53l20J51J76k99Q6K31k95M3K46k61%K64k30l6K56j89r2K68j60j04K50j39
4996aj16K49j08j46K28p4j54K24p2j53K20m6j69J88j2j87J92nj97J93J5k02J60
5019B7M8k16J69P4k45J42J28k74J15J75k74R5J98k92N7K54k88RK92k72n9L44k52
5042d5j11L61k05j85L83j59k60L93q8l22L81k6l70L52N9m00K80J61m42K30K45
5063B32m43J64K95m22P0L74m13k0M19l62j00M56k96j91M62k27k53M49j43l24M23
5084A50m5l75L82N0m32L27J34m30K54K13m37J85K62m08J01L21l79PL67l26p8L77
5106B20k62j32L85k15j87L72j53k13L20p0k60L15k8k86K76L1l05K44P7k88J64
5127EJ37k78J16J65k77R6J62k34N1J74k11L4J78k03J9J74j66j5J97j70k4J78j64
$$ plain form
4974 153 -167 -16 160 -139 -53 178 -117 -74 172 -89 -89 175 -55 -91 165 -24 -116 152 -8 -112 138 -1
4996 -1 -117 132 24 -122 106 32 -122 102 30 -123 97 51 -118 70 58 -129 63 58 -139 54 69 -133 27
5019 27 75 -141 28 102 -143 -1 127 -147 -32 143 -131 -36 162 -130 -73 181 -107 -98 194 -78 -137 207 -45
5042 -45 -156 205 0 -185 198 39 -221 172 84 -238 143 117 -253 99 158 -242 38 199 -243 -13 232
5063 232 -211 -47 248 -174 -104 270 -143 -163 256 -106 -206 250 -46 -237 225 -2 -255 194 51 -273 150
5084 150 105 -270 112 162 -270 57 191 -239 15 228 -209 -24 238 -170 -69 252 -127 -120 247 -79 -157 220
5106 220 -42 -174 211 -4 -191 181 28 -185 135 65 -195 120 92 -194 82 113 -192 52 129 -159 5
5127 5 142 -136 -20 145 -132 -36 126 -108 -57 117 -94 -60 118 -85 -66 108 -58 -73 124 -46 -70 108 -56
5150e6k9J90j38n2K11j33p1K03j37q9K09r1j27K19r5j47K28o6j76K43k6k40K60
5173I0j2k37K16O7k92K04J04l13J83J60l44J28K30l41P3K80l25ML44l22n6L76
5195B17k57j61M21k18k12L97j34k92M10p8l50L90j1l70L38J01m33K97J68m41K13
5216eK78m69J33L29m24M7L82l88m1M22l29j28M19k51k04M28j75k57M04r2l16L45
5238A08ll45L11Q3l93K69J38l86K02K01l60J25K61l64O8K77l07kL02k59n9L18
5260A85k21j17L10j55j60K94j13j78K68n6k00K38k0k23K13J8k11J80M8k11J44
5281C3O0k02J30O7j80R8Q4j89J02Q2j63N9J15j78O8J08j75N6J22j77L2J42j69
5304g5K1J49j61RJ73j87oJ94j72m5K35j62r0K53j50j41L02j14j89K84p1k34K80
$$ plain form
5150 -56 -85 105 -33 -85 126 -7 -78 125 -12 -101 108 17 -110 109 14 -133 95 29 -147 96 70 -170 90
5173 90 78 -159 57 124 -168 36 140 -173 10 170 -174 -46 184 -157 -84 196 -129 -125 219 -103 -159 217
5195 217 -40 -201 220 2 -210 187 53 -239 171 93 -257 133 122 -248 90 191 -242 55 223 -218 -5
5216 -5 273 -196 -63 266 -158 -111 271 -117 -158 264 -65 -193 226 -25 -229 199 24 -233 171 79 -237 108
5238 108 105 -240 71 154 -239 30 168 -218 -16 185 -175 -50 211 -153 -85 192 -115 -117 185 -74 -133 185
5260 185 -36 -153 157 2 -158 136 23 -155 113 57 -143 95 75 -148 65 83 -128 52 100 -111 33
5281 33 93 -109 21 88 -92 6 90 -99 3 85 -78 -19 96 -82 -14 94 -81 -25 97 -80 -48 94 -75
5304 -75 -54 95 -66 -57 116 -71 -77 117 -55 -100 135 -27 -117 136 -14 -155 147 33 -156 128 57 -177 103
5327A03mk77K51O4l15K25J17l48J97J71l59J45K41l66P8L07l55J0L36l07o9L75
5349B20k74j45M14k20k15M08j35l01M04n7l59L73M0m13L25J16m14K50J85m02J59
5370d1K68l97J05L03l64K5L48l28o3L61k61j34L77j92j97L65j30k47L55n8k81
5391a86K99Nl23K79P2l19K00J41l26J41J86l10Q5K09k60M4K20k40jK32k09m9K50
5414A40j68q1K29j33j00K20j03j15J87p8j13J87m7j33J71k3j42J53%j40J37Kj36
5437h6J32oj25J11K6j39J19L3j48J19L0j57J08O5j89J15R5k06R0J23k15Q4J50
5460A29k28N6J84k27kK38k15m7K67j99j02K96j65j54L14j14k14L07p3k51K94Q
5482A02l17K95O5l41K40J39l49J75J98l83J42K60l57M3L33l40j9L42k88r8L76
$$ plain form
5327 103 99 -178 73 137 -178 47 164 -184 13 184 -175 -30 211 -155 -77 230 -125 -115 221 -86 -155 220
5349 220 -54 -199 215 -5 -220 188 53 -248 156 99 -260 113 153 -260 65 181 -233 17 202 -200 -41
5370 -41 227 -170 -65 238 -126 -101 247 -81 -144 217 -44 -178 199 7 -190 175 45 -202 153 95 -186
5391 -186 113 118 -205 74 146 -173 27 168 -158 -17 169 -141 -56 153 -107 -63 157 -83 -84 148 -61 -110 140
5414 140 -28 -109 120 -13 -113 107 4 -111 76 -2 -115 72 25 -108 63 40 -102 51 51 -89 48 50 -86
5437 -86 46 40 -85 26 52 -87 32 65 -83 36 66 -91 17 82 -107 8 103 -103 -13 110 -105 -21 129
5460 129 -99 -43 141 -86 -88 150 -65 -112 155 -44 -146 150 -15 -169 145 31 -183 124 51 -200 94 102
5482 102 -215 80 145 -196 44 183 -166 9 207 -176 -34 226 -131 -88 245 -95 -114 228 -60 -158 218
5503B18k31j80L86j61k42L80j01k92L65l4l32L06O2l71K66J25l69J98K00l68J37
5524c8K43l47N5K91l00k9L32k68r9L26k02j39L33j41j99L11o5k37K74k2k43K33
5546F9M2k61J90Q7k65J52J21k54J17J38k31O2J58j99M7J48j72MJ63j48j8J61j38
5569b7m2J49j05m7J48r2n2J26o7o7J38o9n9J31p1o1J24m6q7J28m4r1J36m9r4J38
5595D8k2j24J46qj35J45J2j80J57N2j93J24Q5k13J14J13k18Q0J61k39M6J94k25
5618h0OK55k36o1K84k01j09L05j67j66L08j07k33L31o8k63K84J8l04K52R0l29
5640a91K02J49l42J53K07l28P6K79l25J5L10k79n7L31k33j24L36j64j90L46j20
5661E1k51L42o5k60K81L2l18K44R7l31J84J70l31J33J99k91O1K19k58jK60k26
$$ plain form
5503 218 -13 -193 193 32 -210 170 69 -223 142 108 -224 82 144 -227 39 164 -205 -7 193 -175 -38
5524 -38 205 -142 -87 204 -96 -125 207 -61 -160 166 -36 -175 158 17 -182 129 64 -173 101 79 -164 69
5546 69 111 -150 40 127 -138 14 135 -119 -2 136 -95 -33 125 -74 -27 121 -51 -47 116 -32 -50 111 -27
5569 -27 -69 80 -25 -72 76 -16 -68 58 -9 -76 62 -7 -66 65 -6 -67 57 11 -76 52 8 -83 53 4 -90 48
5595 48 26 -98 48 40 -95 50 62 -118 39 91 -102 22 107 -106 8 121 -97 -17 144 -95 -49 145 -80
5618 -80 -74 181 -55 -116 168 -33 -142 163 -4 -170 138 31 -202 129 61 -202 82 100 -204 48 138 -191
5640 -191 11 160 -182 -29 178 -150 -74 205 -120 -105 205 -74 -131 200 -33 -157 179 15 -175 171 51
5661 51 -200 142 77 -183 98 130 -188 56 153 -178 6 176 -155 -22 177 -114 -53 166 -92 -93 167 -59
5683e9n0K61j96r5K87j51j44K55r5j66K46n9j91K19oj95J79K9k01J49O6j85J03
5706AQ7j75O7R8j50N1J09j45L0R7j16K1J01j03PP7q9J0Q9r7PQ3q7qR5q1j2J06
5734G3j04k3J20r0l5J34j03m4J48q5q0J63q2r7J76o4j28J99m5j72J86J3j97J79
5758D2M9k24J69P7k43J32J33k57R7J84k65M1K32k41j4K63k25o5K88j81j31L12
5780A73j51j82L05q7k39K88k7k68K66N2l18K30J10l18J60J67l12J05K32l09L8
5801h5K68k65l7L00k45r2L12j79j44K99j16k12L21p4k31K81qk67K46K5k58J95
5823C4J04k86J50J34k58J09J54k33L7K16k29mK20j88n6K27j51p5K04r4j24K10
5845A01o8j47J91l8j46J61nj35J22Nj27J25J2j29Q6M5j25P9L6j05N5M3q0M8M5
$$ plain form
5683 -59 -109 152 -44 -139 148 -3 -147 108 13 -153 93 34 -157 62 56 -139 40 69 -132 17 83 -102 1
5706 1 88 -87 -20 78 -72 -21 88 -57 -27 70 -46 -25 76 -27 -20 57 -32 -22 67 -30 -23 60 -27 -35 60 -21 -33 73
5734 73 -31 -54 66 -24 -59 75 -28 -72 76 -9 -89 74 -8 -105 71 7 -121 78 33 -139 47 60 -137 42
5758 42 91 -133 36 113 -130 2 135 -122 -25 159 -106 -65 167 -74 -88 175 -50 -115 173 -8 -139 173
5780 173 22 -160 145 58 -181 107 80 -188 78 130 -188 42 152 -166 -6 161 -151 -46 186 -123 -85
5801 -85 183 -82 -119 181 -64 -156 156 -23 -167 132 16 -196 125 51 -180 101 93 -174 72 97 -161 34
5823 34 138 -148 2 136 -122 -13 141 -92 -55 161 -68 -72 148 -40 -96 131 -20 -95 109 15 -109 101
5845 101 33 -114 77 39 -107 54 49 -86 36 41 -86 39 51 -78 8 53 -72 7 43 -62 -7 36 -44 4 49
5870D9j07N4N5r4M8N8j22N4O3j08M9P4j36N0Q9j32K0J36j47JJ48j42j2J66j42
5895b8n7K04j25q9K13r9j36K23p1j69K32k7k05K02L1k55J95Q4k73J57J14k61J00
5918d0J84k84P2K23k50mK65k29p1K96j90j19L09j52j81L12r5k22K86l3k58K64
5940H3L2k92K31P8k90J80J54l10J01K16l05P3K41k76j1K73k26p4K89j93j13K90
5962A51j42j58K71r2j99K67l9k10K19K6k56J88P5k48J41J19k31Q5J47k21O8J52
5984A13j88K7J57j76mJ72j30m3J49q7o9J55q6o3J43o4p3J28m1p8J07k3r4J13k4
6009B1q7J04j7q2R3kr4R5qj02J15or9R2Mj10J06Pj30J08M4j52J01O5j59P2J09
6036H8j88O0J39j88L0J67j84PJ87j70l6K25j57q1K40j49j06K51r3j80K55o2k03
$$ plain form
5870 49 -58 -4 51 -43 5 63 -59 -5 58 -50 -1 73 -63 -13 76 -56 -36 100 -47 -46 102 -40 -52 114 -28
5895 -28 -85 119 -6 -95 118 19 -117 106 35 -134 98 71 -134 68 99 -156 39 123 -150 7 121 -140 -40
5918 -40 144 -140 -68 155 -95 -99 166 -63 -134 162 -28 -147 162 10 -171 141 46 -176 110 77 -181 83
5940 83 115 -177 54 132 -158 22 176 -134 -33 183 -122 -49 192 -84 -95 178 -48 -122 167 -26 -139 151
5962 151 9 -149 122 30 -169 98 59 -151 68 94 -162 26 101 -147 -6 113 -118 -33 114 -107 -39 113
5984 113 -75 -48 109 -67 -71 101 -29 -72 77 -10 -79 76 -10 -73 70 6 -67 61 20 -58 49 26 -68 45 21
6009 21 -66 38 21 -61 32 30 -64 31 23 -79 36 30 -69 23 27 -83 23 30 -100 8 52 -100 1 66 -93 -21 88
6036 88 -100 -40 99 -89 -59 108 -76 -69 118 -52 -88 137 -20 -101 139 -10 -116 135 42 -138 117 55 -148
6059a48K31J0k57K26N8k70J90J14k81J09J87l04R3K12k72K0K41k35m1K85k11r8
6081a41K98j56j61K95j05k06K85l1k64K65J2k73K23O8k78J83J27l04J39J78k80
6102a26P4K30k66J7K34k29m2K66j90p8K43j24j51K69j11j44K41n6j82J97rj96
6124a33J91K0j96J38P3j98J09Q9j82P3J16j71L9J17j51J9J21j15lJ04q8k2J18
6147F8q1l8J09q3k3Q4n1m2J03n8l4R1n5m0J19p1m5J16p2n4J23m5q6J31m6j02J39
6174E7k3j30J57j8j34J45J7j73J44M6j91J13Q9k11J06J14k10O7J61k10K0K06k24
6197h2k0K36j80q2K58j64j08K68j19j63K62o5k03K34j3k22K28L2k62J93J14k86
6219a44J33J64k87J10K00k80L5K45k53k0K78k15p4K72j66j38K87j16j97K90o6
$$ plain form
6059 -148 83 93 -164 62 120 -150 40 154 -127 -18 169 -135 -42 170 -102 -82 159 -76 -117 168 -43 -141
6081 -141 157 1 -160 135 30 -176 109 78 -186 79 91 -182 41 109 -169 14 141 -163 -24 154 -126
6102 -126 -52 178 -88 -71 163 -66 -108 158 -32 -110 133 9 -142 127 16 -128 113 57 -125 72 63 -133
6124 -133 58 78 -118 20 93 -105 4 93 -89 -16 100 -71 -32 85 -66 -47 74 -41 -44 60 -28 -50 68
6147 68 -13 -51 58 -25 -48 36 -15 -57 46 -12 -46 45 -10 -50 69 -2 -47 69 -3 -57 66 21 -65 66 20 -82 57
6174 57 34 -96 61 43 -91 54 71 -102 42 88 -103 10 99 -112 -6 108 -102 -35 126 -84 -64 142 -82
6197 -82 -102 134 -46 -128 130 -34 -142 126 7 -156 106 41 -162 72 59 -163 65 97 -165 28 142 -144
6219 -144 -11 153 -134 -24 176 -104 -69 176 -77 -97 181 -34 -108 164 -2 -140 147 31 -166 124 58
6240E8k27K64pk41K15M0k61J91R6k84J46J53k82R4J83k36L6J97j95j9K06j82n0
6263a05K09j22r1K08r3j36K16n9j48J95k9j44J48Jj34J32K3j42Q9N3j25N8P5j23
6287d4M0P1j08M4O7j14L8O5r8K6O7q8K5O8j07K3P6r9L1P0r9JJ03j00qJ16j18j1
6315f3J42j21l0J52r7o7J67q1r6J79p1j14J79l9j61J98j1j77J73K0j89J35R7k27
6339a02J27J03k21Q0J57k29L8K11k31nK30k00n5K44j67j00K67j32j55K60r0j88
6361a58K50k5k39K27L5k55J91Q8k65J43J46k73R7J85k56L9K41k46j3K46k13n0
6383a05K57j72j15K80j28j62K54n7j79K26l3k09K09K4k25J70O5k19J31J05k29
6404a12R6J38k12O6J38j77J2J57j47l1J83j41n3J71r9p8J56p0q2J28l9q4J14j8
$$ plain form
6240 58 -169 95 88 -153 62 102 -159 32 128 -156 -10 143 -139 -45 138 -98 -62 135 -60 -79 127 -55 -105
6263 -105 104 -18 -109 99 6 -130 86 27 -121 74 45 -99 49 50 -84 48 71 -71 18 71 -54 4 79 -44
6287 -44 -4 67 -41 3 70 -44 -6 59 -39 -13 54 -34 -9 59 -48 -25 51 -48 -17 53 -46 -45 58 -42 -50 66 -52 -63
6315 -63 79 -42 -72 80 -17 -84 83 2 -94 85 14 -100 79 40 -121 77 66 -111 62 82 -107 28 125 -102
6339 -102 25 128 -93 -13 144 -85 -47 164 -67 -72 158 -42 -97 147 -20 -120 147 15 -140 120 30 -158
6361 -158 92 67 -172 55 90 -165 26 114 -151 -8 138 -135 -38 147 -109 -70 171 -75 -88 158 -55 -105
6383 -105 152 -20 -135 145 17 -145 109 52 -127 99 66 -143 66 90 -135 35 100 -119 12 117 -112
6404 -112 -16 122 -90 -24 114 -63 -51 106 -41 -72 111 -30 -83 88 -11 -89 67 -3 -85 43 4 -80 34 16
6428A6r7J03nq9R8Rj02R6J5j08Q8J6r4P4K2r7Q2L0j12R4J6j07Q4L0j07O7M8j19
6456d9O5P6j53P0P0j43L5J20j43QJ53j53j2J68j50m9J92j27q2K08j20r3J93p0
6480A4j43K06l7j75J95jj99J93M3k40J66R2k44J16J50k40P7J83k40nK49k22l8
6503a00K76k04r1K57j33j35K73j16j64K68o0k20K43j4k36K14N7k66J84J02k75
6524a40J33J56k74Q3J95k47L2K16k22k2K43j90q2K45j24j31K38q4j52K07m1j68
6546a29J90oj83J71L8j88J14R9j96R6Q9j78P7J14j73L5J25j33J3J24j26j6J23
6569H0r6k9J14q3l6J16o8m5J17o5n4J05o2m1R2m4n4R0m1m6R4m8o1J07l7r0J31
6596D6l4r2J39l3j19J35j7j19J33K1j50J22M5j82J24O7j79R6J10k05P3J44j98
$$ plain form
6428 16 -81 22 17 -72 26 35 -67 29 44 -64 24 40 -54 20 42 -55 27 57 -55 39 55 -52 32 62 -45 22 70 -49
6456 -49 16 92 -61 9 79 -64 -29 91 -52 -44 109 -44 -56 112 -38 -87 105 -22 -104 104 -16 -109 84 14
6480 14 -129 77 40 -135 60 59 -140 53 96 -144 22 114 -130 -14 136 -104 -27 156 -84 -89 160 -62 -100
6503 -100 176 -28 -119 138 5 -130 143 27 -137 131 71 -149 94 80 -156 58 115 -151 33 135 -140
6524 -140 -7 149 -125 -42 153 -94 -62 154 -68 -90 153 -37 -119 126 2 -129 109 25 -127 80 39 -129
6546 -129 61 55 -128 43 81 -107 7 106 -90 6 95 -83 -6 108 -65 -30 95 -38 -25 99 -27 -43 80
6569 80 -16 -45 69 -14 -50 66 -2 -47 70 5 -49 56 -6 -47 45 1 -53 37 -4 -50 44 -4 -65 42 5 -85 46
6596 46 12 -80 59 26 -93 42 25 -94 39 60 -90 32 77 -105 19 86 -93 3 113 -92 -19 125 -73
6619g3L4J66j69k4K13j89m7K37j59r1K40j17j51K52p5j87K29j9k21K26K7k57J96
6642D1R5k74J44J48k96J10J86k60L8K29k39k4K68k17p2K81j76j26K90j30j63K75
6664A28o6k32K84k6k44K39K0k35J74R5k71J29J55k74J09J70k40M0K01k24j4K34
6686A52j80o9K27j41q0K03j10j09J98o7j34J84l1j56J50Pj48J35K5j50J23K6j38
6709h3P9O3j34P0O3j21M7O9j00L6O5r2L0P3q9J6P3r4K5O5p9LR2r3lJ07j08NJ07
6738I2j16j3J27j11l7J36r4n6J66j04o7J68p3j13J68m9j34J77k1j59J56K8j96
6761a25J54O3k15J44Q9k28J26J15k27P5J68k24J4K18k00l2K43j86q7K59j34j49
6783a39K83j06j92K67n4k20K54Lk49K07P0k75J89J13k94J30J70k65O4K05k60J7
$$ plain form
6619 -73 -39 127 -42 -66 147 -42 -89 148 -11 -102 138 21 -130 122 47 -140 89 70 -151 75 102 -155 41
6642 41 136 -138 6 154 -142 -32 154 -106 -68 161 -78 -102 166 -51 -123 158 -18 -144 146 16 -147 128
6664 128 62 -170 114 88 -156 83 103 -132 42 137 -134 -5 150 -124 -15 155 -85 -45 156 -68 -82 152
6686 152 -28 -97 130 -11 -91 112 2 -107 91 24 -110 74 43 -113 37 44 -104 31 56 -94 29 55 -83
6709 -83 -4 59 -75 -5 58 -63 -16 53 -47 -11 54 -38 -8 65 -24 -8 65 -29 -4 61 -18 -15 77 -16 -19 88 -20 -15 92
6738 92 -24 -37 90 -21 -58 78 -16 -72 94 -10 -77 91 18 -95 73 24 -110 67 46 -113 43 71 -125
6761 -125 29 92 -123 21 110 -118 8 123 -104 -29 139 -85 -71 147 -53 -85 158 -28 -115 144 10 -139
6783 -139 144 38 -154 113 59 -161 93 96 -153 54 124 -151 38 151 -143 -13 157 -108 -44 161 -99 -82
6805h2K58k45l8K69j83j19K90j44j50K62r7j74K48l1k03K10J9k40K03M3k22J53
6827B7Q2k27J00J48k29Q3J52k00K8J68j77JJ64j35n1J73j02q0J70r0p3J43m5j04
6851g4J37k7j09J19j4q5R5nr4R3Jq6O6K1r2Q0Nq7P0J8r8Q0L1j11Q1J5r5Q0L9j21
6881f7P2M7j31P4P5j43N5R2j33L8J17j53J8J56j57mJ70j51n9K05j35p4K01j04
6905Ij14K02m9j74K07j7j87J90K6k20J64O6k34J22J44k60R1J81k60N1K13k38N
6928h2K40k06p1K71j73j27L02j40j77K71p2k03K71k6k47K32N0k68K01Q6k75J51
6950HJ55k81J14J63k56M6K26k45oK32j89o1K38j61j05K52j22j35K30o3j81K30
6972H9j3j96J73K9k01J42O2j94J07Q2j80P6J20j76L0J38j43LJ33j24kJ07q5l1
$$ plain form
6805 -82 176 -69 -107 162 -21 -140 150 6 -144 118 21 -153 95 64 -139 71 90 -150 53 96 -126 27
6827 27 109 -118 -18 130 -99 -16 136 -64 -36 132 -45 -44 120 -15 -66 107 5 -75 95 5 -68 75 30 -74
6851 -74 63 36 -73 46 32 -53 42 37 -57 36 37 -49 17 38 -54 26 31 -56 14 32 -66 14 45 -66 15 30 -65 15 54 -67
6881 -67 5 52 -79 -5 70 -73 -18 74 -59 -21 96 -57 -39 117 -40 -44 126 -25 -84 121 -14 -88 113 9
6905 9 -105 97 48 -126 81 64 -123 67 93 -127 37 103 -131 -9 135 -125 -34 147 -113 -62 151 -87 -82
6928 -82 158 -48 -119 152 -21 -148 154 14 -163 108 36 -167 104 78 -169 63 113 -155 46 132 -143 8
6950 8 163 -118 -4 159 -97 -51 175 -70 -76 156 -33 -94 144 -17 -122 130 8 -127 103 40 -141 89
6972 89 76 -120 53 82 -119 23 85 -109 -2 80 -100 -24 96 -80 -50 88 -55 -52 81 -43 -45 62 -23 -54
6996e4J26r5k5J03o1m1J03n0m8R7n4m6R7m1n0Q6l9m1Q7l6n9J10m4p3R8l5o5J02
7024E2j8r5J11k8q8J19k4j13J22J0j46J12O1j80J05Q0j78Q1J21k03N6J50j89J7
7048f5J84j81k0K14j65p7K35j39j17K53r7j72K47m1k10K35Pk31K08M5k61J76J09
7071A37k71J29J65k71P5K03k63L1K36k40k4K54k03r3K81j51j35K61r2j87K59n4
7093D7k10K44Lk43K00P0k64J73Q9k49J22J55k41O2J80k30K5K14k06l0K22j45r1
7116a03K27j27r3J99p2j41J96k5j44J47Qj68J37M9j72J15L8j38P2O6j28N6O1j01
7140d1M1O1r5J7Q1j16L2P2q4J2P5q8J3N7p8K4O8p9JO1p9J7Q9q2lR0j01QJ16j06
7170a7k0J16r5m3J40q1p4J67p0j09J64n2j28J84k0j58J65J4j85J44O4k14J26J01
$$ plain form
6996 -54 72 -23 -48 55 -6 -47 56 6 -42 55 1 -45 52 11 -39 47 8 -33 54 18 -41 69 25 -48 50 15 -50 52
7024 52 34 -61 50 22 -66 53 29 -84 38 48 -98 14 75 -105 0 80 -98 -17 104 -99 -43 107 -82 -65
7048 -65 119 -62 -82 132 -33 -110 125 -14 -131 122 25 -147 100 59 -151 84 91 -140 68 113 -148 28 137
7071 137 -134 -5 160 -111 -36 167 -96 -65 171 -69 -93 161 -42 -135 146 -5 -140 121 29 -158 101 47
7093 47 -163 81 84 -159 41 111 -153 20 109 -140 -18 137 -104 -42 138 -92 -67 147 -59 -89 133 -12 -103
7116 -103 124 -3 -96 103 31 -110 86 61 -83 64 72 -96 41 90 -82 33 71 -67 5 71 -57 -1 60 -41
7140 -41 0 61 -34 -17 64 -52 -20 52 -32 -20 55 -33 -20 37 -41 -17 51 -28 -27 34 -45 -28 61 -21 -24 66 -35 -27 89 -17
7170 -17 -37 79 -16 -59 81 0 -74 93 23 -86 78 26 -102 82 62 -96 69 83 -102 42 106 -108 18 119
7194A19k23Q8J44k10L8J80k26J2K25k06l8K33j67j00K60j48j20K69j05j90K59
7215I4k6k35K35K1k48K00Q8k69J56J29k79J09J80k66N8K24k64J5K55k29l6K53
7237A65j92q8K66j28j60K70q0j88K40l4k19K24J6k23J61P2k37J38J08k21R1J42
7259A23k02K6J67j70KJ58j59k7J79j17o5J53p6p2J55o9q4J33k1r5J02j5r0J02
7283C8Nq4O0K1r2P7Op1O3J8q2O3K5q6O2K8q2O6Rq3O7Kp9P2K4j10P0M8j14O4N8
7314F3j28N3P2j28N0J04j51K0J31j42%J46j28l1J69j13q7J97r4j14K09o4j55K14
7338I3l5j87K02K4k28J75P2k40J39J31k67J07J69k33L4K19k48jK29k16m2K58j69
7361a4j15K89j49j61K67p5k13K79l7k45K52K6k63J93Q7k77J64J33k82J11J81k61
$$ plain form
7194 119 -104 -16 128 -82 -44 136 -90 -78 147 -59 -97 136 -31 -131 129 -19 -139 130 25 -165 94
7215 94 68 -167 68 89 -159 41 129 -140 16 145 -134 -25 155 -111 -53 171 -93 -78 177 -52 -88 165
7237 165 -27 -115 151 23 -137 133 53 -135 105 71 -148 76 92 -131 30 102 -135 3 111 -110 -19 123
7259 123 -79 -53 114 -56 -54 104 -55 -82 97 -20 -85 68 -8 -80 75 6 -78 55 34 -61 41 26 -64 38
7283 38 43 -41 19 40 -52 25 31 -40 23 41 -41 22 47 -39 23 51 -31 35 44 -39 28 30 -49 23 47 -63 7 55 -59 5 63
7314 63 -65 -12 60 -68 -18 86 -65 -45 86 -56 -56 90 -38 -69 100 -13 -100 97 3 -111 98 34 -121 93
7338 93 58 -129 73 97 -131 44 116 -124 15 146 -121 -14 155 -78 -44 175 -73 -74 155 -61 -103 155 -14
7361 -14 -129 160 11 -150 117 42 -171 108 71 -174 78 104 -159 34 121 -156 8 141 -141 -30 151 -110
7383a10M0K08k12j6K30j81p3K49j55j00K41r5j41K14m7j67J99pk05J76M7j89J34
7406D0O8j96R1R6j71O9R8j53L5J16j20j8J26j08j5J14q9k2J00q3k2R1n7k4Q2o4
7432a6k4Q4m0n1P3l3l1O8k9l8P6l2l9P1m2l6Q7m8l9Q5l6o3J16k6r6J06j3j07J21
7461D8j0j15J21J9j54J21N5j78J05Q6j70O3J26k07M8J58j88OJ89j75l7K01j32
7484b0r4K35j27j33K46o7j91K32j4k16J98M7k48J95P3k55J51J27k57Q5J84k47
7506i6M1K14k34qK50k05o4K72j62j32K73j17j63K58o4k00K26rk25K15N7k48J63
7529D2Q8k51J23J29k27O0J58k05K7J91j77m1J96j60m9J97j16q8J86q1j10J71l0
7552C3j33J50lj26J10K2j34J00M1j27P7N7j12M2O7r9L4N8q4K6O0p9K3L4m4KM0
$$ plain form
7383 -110 -70 138 -74 -90 140 -41 -114 135 -20 -120 121 26 -115 99 52 -115 84 77 -128 48 95 -94 40
7406 40 108 -88 3 99 -72 -3 95 -58 -23 93 -27 -45 81 -27 -42 72 -17 -39 61 -22 -44 47 -10 -34 48 -16
7432 -16 -40 44 4 -47 26 -7 -38 30 1 -37 39 7 -32 39 -3 -39 48 0 -39 46 10 -53 63 37 -59 47 34 -73 48
7461 48 38 -77 44 63 -91 30 85 -93 12 98 -72 -9 117 -90 -42 116 -72 -66 123 -52 -89 112 -20
7484 -20 -114 121 -6 -139 107 40 -151 81 67 -149 49 96 -152 43 116 -139 12 139 -118 -33 151 -96
7506 -96 -55 159 -75 -83 167 -38 -102 170 8 -124 149 32 -131 127 63 -137 89 80 -145 70 127 -121 42
7529 42 130 -121 2 131 -96 -36 122 -83 -56 135 -42 -83 113 -47 -96 101 -15 -103 83 2 -108 63 33
7552 33 -100 50 47 -79 31 53 -81 19 60 -67 10 67 -45 -3 64 -35 -1 57 -27 -1 59 -20 3 37 -7 -5 35
7579C5n1J4L9n4J6M4n7J4K7m8K1N3q0J3O0p8JR0r2OR2j02j0J19r2m9J46q3n7J41
7609G8p4r5J54l7j23J49j2j47J55J7j72J30P4j90R4J09k00P8J45k13L9J76j85
7632e0oK04j81o4K32j46r9K31j05j51K40m9k03K31j1k27K13K9k29J57J03k64J34
7655a1J43k50P0J85k33K7K08k05k9K35j76o8K33j28j30K30p5j58K18l0j88J98
7677F6J1j97J43O9j98J21J04k03P6J21j80L5J49j66PJ50j29l8J51j00o8J55n9
7700B0q9J36m1r0J20l5p6R5k9p0O6J1p5O7K4q2N3J4n8M7Kn1M2Pl9L6Kl7M2Pn2
7731c3N6Po1N7Np1P2J1q2O0M0r8O5L4j15M7R2j29J2J22j37RJ30j29j6J33r5n4
7759f8J52q6q3J57o8j16J89l5j64J69Nj71J49M9k15J46P6j97J01J30k17N2J67
$$ plain form
7579 35 -16 -2 37 -17 -1 43 -14 0 27 -21 0 53 -27 -14 46 -32 -31 59 -33 -27 65 -37 -47 72 -20 -69 77 -6 -63 78
7609 78 4 -91 63 26 -97 52 40 -107 48 65 -107 23 97 -93 1 110 -90 -12 133 -80 -41 135 -50
7632 -50 -56 148 -33 -97 135 -11 -110 121 16 -135 105 56 -147 84 73 -154 59 88 -141 16 119 -145 -11
7655 -11 132 -118 -48 137 -96 -69 139 -66 -95 140 -36 -104 129 1 -129 101 26 -132 86 56 -132 66
7677 66 77 -120 23 92 -106 15 119 -84 -8 113 -67 -32 117 -49 -42 108 -21 -59 92 -8 -76 79 20
7700 20 -69 67 26 -64 56 21 -55 40 11 -59 7 18 -57 10 34 -48 5 19 -39 8 10 -41 1 8 -31 5 7 -30 12 19 -33
7731 -33 23 30 -31 26 31 -40 32 43 -39 21 61 -37 28 62 -53 -6 86 -43 -31 91 -46 -37 93 -36 -52 81 -14 -68
7759 -68 84 -2 -85 72 4 -112 77 42 -122 47 52 -119 30 79 -136 10 86 -111 -10 120 -97 -45 122
7782A22k01PK03j79l9K25j59q5K34j24j27K36q0j73K20j9j93K08J7k18J73O4k21
7805a09J30J07k18O9J53k07K5J89k06j4K06j59n1J91j13r8K05p1j42J86l5j52
7827a14J64Mj59J21M0j51Q9Q3j50O6Q8j38J8J09j11K1R4j02qJ00p7k6R5m7m5P6
7853D0j8n7P4l2l6O1on7N1ol6M7k5j6K9ml8N0k9k0N4l8j3M2k2k7O3m8k8P0k8n7
7885f0Q8k0p8Q8Lr0J03mr9Q2M6j29P0O1j32O1J07j61M6J11j50J2J45j32l3J86
7911A21j30p3J89r2j07J94o5j44J81k5j75J87J4k01J53O5k12J27J08k23Q1J43
7933A16k12L0J83j85j4K08j75o9K33j30j09K31r6j39K09l5j75J86J0j86J56O3
7955A00k17J30R1k06R4J22j94L0J79j83qJ78j54l0J63j03p0J66p0j06J58l5j26
$$ plain form
7782 122 -79 -72 131 -48 -87 138 -21 -106 128 4 -123 113 33 -140 80 61 -132 76 93 -125 48 112 -109
7805 -109 21 128 -90 -21 132 -75 -50 139 -67 -81 125 -34 -85 106 -7 -105 100 29 -113 73 38 -114
7827 -114 50 54 -105 16 56 -95 -6 77 -73 -7 81 -57 -39 70 -41 -20 74 -28 -36 64 -13 -39 56 9 -36 40
7853 40 22 -35 39 7 -29 32 26 -31 20 14 -22 25 0 -16 13 9 -29 21 -8 -28 26 -12 -25 17 -5 -32 31 -17 -45 25 -3 -60
7885 -60 28 8 -70 18 21 -69 34 30 -69 13 59 -70 0 61 -71 -10 97 -64 -18 93 -57 -45 100 -32 -65 121
7911 121 -9 -82 107 15 -92 102 37 -107 74 49 -126 61 75 -126 27 92 -120 7 115 -108 -27 116
7933 116 -96 -66 117 -68 -82 126 -49 -118 115 -15 -124 107 11 -128 81 46 -129 57 67 -119 37 100
7955 100 -117 13 104 -102 -8 114 -80 -50 129 -54 -62 116 -38 -68 95 -8 -78 88 18 -88 70 35 -91
7978i1J54j8j23R8M4j31O6N7j18N0O7j09K8P8q9J7N9p2%O1n1j2N4m1nM1l4NL5
8007B0k9nL5l0MK4k9JK1k8J7K3m1J1M1m8jO6p0KP2o5k3Q0o8k3J12q1m4J11m6p4
8039f5J17m4j00J31mj26J13L4j57J05N7j61Q5J04j81O9J10j71K7J55j54k4J82
8062A02j53n3K14j23r2J93o9j38K03k8j84J86J2j94J60O2k08J26R7k28J03J33
8084A21k10N2J65j88pJ95j82j7J91j33j02K02p4j30J98n6j61J97Jk02J61M5j80
8107a14J27O7j85R0J06j60L5J37j66mJ62j37k7J54j02m2J22n4p8J29m9p3J11k0
8131B9p9P4J4q9Q5J0q9N1K6o9L5L8n7L6J6m5J1J4k8RK2m0J5K5m1K7J1l7K7j3j8
8162c0L4Om7L6J7n7N1J5p3L4N3q1M3M5r1K3P7j00J2J16j16j0J28r0n5J54r9o2
$$ plain form
7978 -91 63 45 -78 20 64 -67 -1 56 -62 -12 55 -54 -26 52 -37 -20 39 -33 -33 28 -23 -35 19 -22 -27 14 -20 -15 20
8007 20 -9 -14 21 -9 -5 19 -10 -9 12 -16 1 24 -17 -6 35 -13 -14 52 -18 -16 56 -9 -32 48 -20 -43 69 -12 -56 55 9 -65
8039 -65 52 8 -92 39 35 -91 22 56 -101 4 61 -100 -15 89 -92 -23 87 -84 -57 98 -56 -80 102
8062 102 -51 -104 110 -13 -105 88 19 -119 84 56 -128 58 70 -124 36 98 -110 16 113 -115 -12 121
8084 121 -89 -37 128 -60 -67 128 -54 -71 120 -13 -115 87 13 -117 81 25 -136 61 62 -140 21 66 -114
8107 -114 13 80 -105 -15 91 -69 -34 103 -63 -67 95 -42 -69 85 -17 -59 63 9 -69 60 11 -62 49 29
8131 29 -50 24 38 -51 34 44 -45 6 32 -37 -2 36 -21 15 31 -14 -3 11 -17 -8 14 -26 -11 14 -27 0 11 -26 1 -12 -30
8162 -30 4 10 -37 -1 16 -41 10 25 -48 -14 39 -42 1 46 -45 -22 55 -45 -33 83 -33 -43 85 -5 -60 94 -5 -67
8190f7J34
$$ plain form
8190 -67 67
8191F7
$$ Imaginary data points
##PAGE= N=2
##DATA TABLE= (X++(I..I)), XYDATA
0@%%%%%%Qj6J6j6J6k4L2l3M1n6P2q8J03j19J37j62J93k23K55k93L35l85M39m96
30b64N60o29P09p99Q96r98J109j235J375j528J695j873K070k293K540k816L122
47A641l464L851m294M810n413O126o990Q063r436J1257j3802J7613k4019M7705
61C3648k58448K24922J85217m60534K48726K69782l95862J18096L18539m20926
71a36840J61L40802l31302o0308M14293k39294j35286L77351j95775k46022L40269
82A28049j05892k56107L39066J1515k78023K68380M4272l25615J76918J07250
92A09813k91185J51015J89979k45984P4824J89062k48450j7066J91879j83873
102g9986l2339K27802j08106o9365J86367r6415j28863J41475m4528j08727J46244
$$ plain form
0 0 0 0 0 0 0 0 8 -8 8 -8 8 -16 16 -17 24 -32 40 -48 55 -64 73 -89 104 -119 136 -157 178 -207 232 -264
30 -264 296 -333 376 -423 473 -525 584 -651 724 -804 891 -982 1088 -1205 1335 -1481 1641
47 1641 -1823 2028 -2266 2544 -2869 3257 -3733 4330 -5106 6151 -7651 9962 -14057 33648
61 33648 -224800 122 185339 -275195 -26469 243313 -152549 -34453 284086 -136840
71 -136840 -136679 204123 -127179 -187487 226806 -12488 -147774 229577 33802 -212220 128049
82 128049 22157 -233950 105116 116631 -161392 106988 151260 -174355 2563 109813
92 109813 -181372 -30357 159622 -86362 -11538 177524 -70926 -87992 103887 -79986
102 -79986 -112325 115477 7371 -61994 124373 27958 -100905 40570 -3958 -112685 33559
113C3559K1333r6150R5342J2395j19084L8171K4279p6227M5675N9226l5202J9044
125B2361K4303m6163j9645k28j1281J0263J3348K6297K0776k8006J006O885o3730
138d3814L919N3930m5682J8094Q8476o4591l1495Q1381q3159o2367J19527l9135
150d916o5873J47837j9512j22089J19382j2098j61833J21470N3564j55758J21818
161B1992R8536j87131O2229J12616k05968K6068J71730j68543L878K11988j57625
172a0230p0113K05707j45043j22953K30745p6829j43958K42436k9812k03204J99688
183G6434K601k42850J78735Q0963k35576J56162J38229k53382Q1782J61668k57223
194a12457K7494K16866k08092r482K51158j78753q6372K37880j50266j40516K46900
$$ plain form
113 33559 54892 -41258 54084 66479 -52605 -14434 9845 -66382 -20707 38519 3317 22361
125 22361 46664 501 -19144 -19372 -30653 -20390 -7042 19255 40031 12025 13031 19916 -43814
138 -43814 -39895 14035 -31647 -13553 74923 10332 -21163 60218 -22941 -85308 34219 -4916
150 -4916 -70789 77048 57536 -64553 54829 42731 -119102 2368 55932 -99826 21992
161 21992 120528 -66603 -4374 108242 -97726 -71658 100072 -68471 -64593 147395 -10230
172 -10230 -80343 125364 -19679 -142632 88113 11284 -132674 109762 79950 -123254 76434
183 76434 79035 -163815 14920 95883 -139693 16469 154698 -98684 -16902 144766 -112457
194 -112457 -84963 131903 -76189 -85671 165487 -13266 -99638 138242 -12024 -152540 94360
205I4360p5036j58841K43728k1642k05175J91465J1729k31460J60067Q0495k12769
216a23079J32492J26482k16085O3226J37749k09899J6141J74878j59540j0314
226f7949J94022j30105o8207J71892j06547j04415J70930m6506j07440J63338
236F9013q607j34120J16809P625j45498R2021N1755j19648P6239P5660j15994
247c4745K8442O8324j09698L144Q5038o9319k15Q9914n2309l0388O1806m6397
259f403m2244N7733j1367k5555N3989J302l3591K0236p356l2492J1030R214k645
272h149J4445R017K046p360j6726L223o918j7753K9113J4293k4212K9338J1873
285C2230n4257J4993K3245n7306K2752N6435n3333R703O3316p0055k2510P1779
$$ plain form
205 94360 19324 -139517 104211 82569 -122606 68859 80588 -150872 9195 89690 -123079
216 -123079 9413 135895 -80190 -16964 120785 -89114 -72973 101905 -57635 -67949
226 -67949 126073 -4032 -72239 99653 -6894 -111309 59621 13115 -94325 69013
236 69013 60406 -73714 43095 50720 -94778 -2757 48998 -70650 5589 81249 -34745
247 -34745 -6303 62021 -47677 -44533 40505 -28814 -29029 60885 8576 -21812 39994 -6403
259 -6403 -48647 9086 -2281 -27836 26153 27455 -6136 14100 6744 -25748 -14718 -5504 -8149
272 -8149 6296 15313 17359 9999 -6727 -3504 -10422 -28175 938 15231 -8981 20357 32230
285 32230 -22027 -7034 16211 -41095 -18343 38092 -15241 -5538 57778 -12277 -34787 36992
297C6992o0931l0519R9906l6831m9344R9925l4054q7095R1207j1943r7390J01234
309B1157K7921j07289Q5439M3510j34249N4515O8290j32414M3506J09566j20335
320d0383J3989J22857j24207l1828J33424j02416n3550J57548o5604q1788J52567
331H0609m7605j23223J36111j3545j36156J33831L4274j44131J07789N7502j63698
342g8242O8079Q4699j55249M7574J23131j35588J3396J33360j30160l2863J38031
353G6168j02856n4168J53885o3213p8232J42797m3350j12413J21349j1557j18728
364i0318J14516L0517j19484Q7851M7348j31144N0961O5759j17960L4598R3222
375F5866r6248Q660R4489r0078k5727R1108o7177l5825R9390l6251m7111Q6080
$$ plain form
297 36992 -23939 -54458 45448 8617 -40727 59198 25144 -61951 29256 17313 -80077 21157
309 21157 49078 -58211 27228 70738 -63511 -8996 59294 -73120 -29614 79952 -40383
320 -40383 -26394 96463 -27744 -59572 73852 -28564 -82114 75434 9830 -71958 80609
331 80609 33004 -90219 45892 32347 -103809 30022 64296 -79835 27954 85456 -78242
342 -78242 -10163 74536 -80713 -33139 89992 -45596 -32200 101160 -29000 -61863 76168
353 76168 -26688 -80856 73029 9816 -68416 74381 31031 -81382 39967 28410 -90318
364 -90318 24198 54715 -64769 23082 70430 -60714 -9753 56006 -61954 -27356 65866
375 65866 -30382 -21722 72767 -17311 -43038 48070 -19107 -54932 44458 8207 -38904 47176
387D7176k5934o7604O6130p599o4452O2530J8611n7732M4572K1623o3565J9776
399f468K5768n0131J5940L9415l1593N491L0849l0685j2011J9949j7779o501K2950
412E194j65k238R480m470q043o343l567N772k851L745J9564q502j0247J7644j7229
427b256k1877K8627m524k2102L9991L442l8668L1370M577n3567L0116K4809n1598
440c1660L1474M2001o0161J2090M6805o7936l072O5792n5128j1159Q1879m8161
452B764l7051P9748m3076n9124Q6053j7436o7463R0037L994q7783P2734J7601
464D0998j03422O0395M7125r9710M9816P1367j02695K0060Q0791j02732m866J00043
476E7170q2213k1159J13797o6255n1300J08290n2482p5511J08304k1162q4533
$$ plain form
387 47176 21242 -46362 19768 12169 -52283 10247 28858 -28874 15698 37321 -26244 -6468
399 -6468 19300 -30831 -14891 24524 -7069 -1578 29271 -1414 -13425 6524 -11255 -17756 5194
412 5194 5029 2791 12271 7801 -242 -6585 -10152 -4380 -7231 -3486 16078 7576 -2671 14973 -2256
427 -2256 -24133 4494 -30 -22132 17859 21301 -17367 14003 18580 -34987 -4871 19938 -31660
440 -31660 -186 41815 -18346 -6256 40549 -27387 -30459 35333 -19795 -30954 50925 2764
452 2764 -34287 45461 2385 -56739 29314 11878 -55585 34452 38446 -49337 23397 40998
464 40998 -62424 -2029 45096 -54614 -4798 66569 -36126 -16066 64725 -38007 -42873 57170
476 57170 -25043 -46202 67595 1340 -49960 58330 5848 -69663 38641 17479 -67054
487f7054J05418N059j01689Q2872K1979j13020O4699N0887j05190M9515P3212
498F6688j02280J8431P9643r7019o549R3260p3487k1039J01158n5398m6101R0805
510D8112m1759o4117Q6227j4076o6605Q0698O668p6515N8898J6663q1789M3526
522d069L6650p0625L3354N0175o5842J0477M9327o1177n529N5793m1907j0952
534b4325N8559k9358k5370M6311k2856l3774M0823n317k8392L6857M885l0356
546a2313K0388M019l0063J1893J1585j6686J0888J3799j1697K83L613j0171k814
559g276K142J751M767K45M756L469j2582k38O259j5824L677J9736j4241N23K3686
574B0850k1664j2626K6625j9776j6892L8629r416k4121M0300p047m0540L5848
$$ plain form
487 -67054 38364 43423 -58266 24606 46585 -66435 -1736 49151 -56039 -6524 66688
498 66688 -35592 -17161 62482 -34537 -41086 52174 -21313 -42352 58806 3408 -42693 48112
510 48112 6353 -57764 28463 14387 -52218 28480 35148 -41367 17531 34194 -47595 -4069
522 -4069 32581 -38044 -4690 45485 -20357 -9880 39447 -21730 -27259 28534 -13373 -24325
534 -24325 34234 4876 -20494 25817 2961 -30813 10010 4693 -23699 13158 18043 -12313
546 -12313 8075 12094 -17969 -6076 5509 -11177 -289 13510 1813 2096 5709 -4462 -7276
559 -7276 -5134 -3383 1384 1629 6385 9854 -2728 -2966 3293 -12531 -8854 10882 -3359 -2836 20850
574 20850 -814 -13440 13185 -6591 -23483 15146 5730 -18391 21909 14862 -25678 10170
586A0170J973m6769L8691K0298n0226L1936K9481o0844J6357M0106o0243Q466
598b0604N8291n2488n153O5180n1140k7084O8004m0377l9058P6819k1071n1307
610c9988P3995r676o9944O3673O766p6751N9298L0671p8689M5626M4281q5588
622c6326K3823N7143q0650R815P5099o7914q232Q0769o0552l2470Q0716m4852
634c631m5842Q4692k1931n7119P7454p440p2407O2971R497p5601N4475L1421p3135
647c6596L9173M2232p5166J7838N0618o7262N551O3121n3125q507O4339m5665
659c449k7268O0571l2286l5182O1777j3546m0773N3901l988n0444M0528O780m9473
672c2852L4227K1602m3989K3188K5772m3792P909K7419l6021K195L3194k4029
$$ plain form
586 10170 12143 -34626 4065 24363 -25863 6073 35554 -25290 -8933 31173 -29070 -20604
598 -20604 37687 -14801 -19954 45226 -5914 -32998 35006 -5371 -44429 32390 11319 -39988
610 -39988 34007 24331 -45613 18060 24826 -51925 7373 38044 -40645 4981 49262 -36326
622 -36326 -12503 44640 -36010 -26195 48904 -19010 -27242 53527 -7025 -39495 41221 -3631
634 -3631 -49473 35219 13288 -43831 33623 26183 -46224 16747 26244 -49357 5118 36539 -36596
647 -36596 2577 44809 -30357 -12519 38099 -29163 -23612 39509 -13616 -22123 42216 -3449
659 -3449 -30717 29854 -2432 -37614 24163 10617 -30156 23745 19757 -30687 9841 16621 -32852
672 -32852 1375 22977 -21012 2176 27948 -15844 -7935 19484 -16537 -14342 18852 -5177
684e177l773K9650j9959j3340K2658j2793j2978K1980k296j0594J5542j397j3112
697e589O122n39p855N331M124k89K365l31ql367o164M782M82o382J1457M541j3172
714d492Q796M742k1117P416J3233k0759Q106K2336k3390o27K4920k6734r425L2378
728A5383k0324j3947L9713j4517k5330L8001j0722l6348L8042J662m0080L8337
740I870J3750m7386K9081K1054n3894K0118L4200n1098J3265M6469m9280j754
752a5605N0957m7262j6346N8053l5535k5756O3616k3872m0088N9194j4278n2689
764c9611N5136K707n6694N0493J8491o2208L6608K8332o5613K3221M1819n9299
776b6618J2668N2839n3322m001N5246m7351j8813N8793l3352k7343O0648k0359
$$ plain form
684 -5177 -8950 20700 741 -12599 10059 -2734 -15712 6268 3972 -6622 8920 7523 -5589
697 -5589 533 -6 -7861 -2530 1594 1305 3670 3339 3331 -36 -6200 -1418 -936 -7318 4139 8680 -4492
714 -4492 4304 9046 -12071 -4655 8578 -12181 -4075 18261 -5129 -5756 19164 -7570 -16995 15383
728 15383 -4941 -18888 20825 6308 -19022 18979 8257 -28091 9951 11613 -28467 9870
740 9870 23620 -23766 5315 26369 -27525 -7407 26793 -24305 -11040 35429 -13851 -15605
752 -15605 35352 -11910 -28256 29797 -5738 -31494 32122 8250 -31838 27356 13078 -39611
764 -39611 15525 18232 -38462 12031 30522 -31686 4922 33254 -32359 -9138 32681 -26618
776 -26618 -13950 38889 -14433 -18434 36812 -10539 -29352 29441 -3911 -31254 29394 9035
788I035l8855N3631j0674m8095M7230M289m9123M1390J7335n1341K8312K4064
800B7198n2170J6475L3447m4746Q382M0567l8258m332L9706l2890j4745M0215
812A8849k1245j8646L9853j1545k4971L2231o127k9305K6297L179k6484K2331
824D417J0092k5510J3184J0832k4530O355J4071j7490M039J5910j2682j627J1472
837H533j0451n097R316m010k714P910k65k745J535j340k031j913L55M187j868
852e98r8P265n021n981Q560n011q933J3569k6j1740J4745K142j8756J1899N943
867G959k1885J1772J4329k2368Q569J9163k5737P06K3185k5117m237L0549k0257
880c369j0426L3770j7738k0616L3860j2131k7167L6059j979l2321L3947N478l9992
$$ plain form
788 9035 -29820 23811 13137 -34958 12272 16561 -32562 8828 26163 -25178 3134 27198
800 27198 -24972 -8497 24950 -19796 -11414 29153 -9105 -13437 26269 -6621 -21366 18849
812 18849 -2396 -21042 18811 7266 -17705 14526 8399 -20906 5391 8570 -17914 4417
824 4417 14509 -11001 2183 13015 -11515 -5160 8911 -8579 -4540 11370 -1312 -2939 8533
837 8533 -1918 -7015 2301 -1709 -4423 3487 3222 477 2012 672 -1359 -3272 -2917 1270 -598
852 -598 -696 6569 1548 -4433 4127 -884 -9817 3752 3726 -8014 6731 8873 -9883 2016 7959
867 7959 -13926 -2154 12175 -10193 -1624 17539 -8198 -7492 15693 -9424 -13661 16888 -3369
880 -3369 -13795 19975 2237 -18379 15481 3350 -23817 12242 10263 -22058 11889 17367 -22625
893b2625K7191J3777m2976K2206K5426m2085J4274L2867m2578K144L8086l8497
905a2790o889M4957k9846j5996M6699k3203k7581M4404j4157l4467M3412j622
917A2921l8825L8207P442m4563K8964J6114m5314K1899K6827m2273J2910L2937
929B7246m0502R07L6347l4974p507M0902k5735j5180M0759j8852k4447L7000j0655
942E309k9085L4650l2l0999K9219O752l4083K0684J2483l3006J4995J9620k8830
955a2323Q499K2406k6613m2K2812k1876m706K4710j4613q297K2985j0432j3358
968a0848J8668n753j4289J6557N85j3091J2526K951j3517O615M050j0880M138
981b288O439o374J913N049m619j466J990j950q35J037J825J068j922J653J383
$$ plain form
893 -22625 4566 18343 -24633 -2427 22999 -19086 -4812 28055 -14523 -12379 25707 -12790
905 -12790 -19679 25278 -4568 -20564 26135 2932 -24649 19755 5598 -28869 14543 12921
917 12921 -25904 12303 19745 -24818 4146 20260 -25054 -3155 23672 -18601 -5691 27246
929 27246 -13256 -12349 23998 -10976 -18483 22419 -3316 -18496 22263 3411 -21036 15964 5309
942 5309 -23776 10874 10842 -20157 9062 15814 -18269 2415 14898 -18108 -3113 16507 -12323
955 -12323 -3824 18582 -8031 -8073 14739 -7137 -11843 12867 -1746 -10043 12942 2510 -10848
968 -10848 7820 2067 -12222 4335 4920 -8171 4355 7306 -6211 404 4454 -6426 -2288
981 -2288 4151 -2223 -310 4739 120 -1346 644 -1306 -2141 -1104 721 1789 -133 1520 2903
996B903n917R26M652o402J264Q855p167k041J0307q656o166J3056o213q362J6371
1011G410l212j3000J5863j228j8191J5320M202k0247J5102J0326k3097J0738J4390
1024A4376k5880N555K0376k4452J262K6367k2369o170K8685k0147j3976L0983
1036A4610j3845j9248L2624o732k5674K9884q12l1488K6211P666l3306K2466J6068
1049A8424l4715J4987K1547l5335O964K7754l1594L57L3097k6954q440L4284k2364
1062a988j6825L4922j4283k2052L4643n935k7634L0126P05l2067K4910Q983l2322
1075a8817J9962J6494l1987J2128K0646l0932M439K4922k6211j181K8156k1167
1087c548q035K7579j6808j4094K6679j0049j6964K5489l591k0040K1037P43k2295
$$ plain form
996 2903 -3014 -2088 2564 -3838 -2574 6281 -886 -2927 7380 -1276 -7442 5614 -599 -8961 7410
1011 7410 4198 -8802 7061 5833 -12358 2962 7164 -13083 2019 12345 -10752 -14 14376
1024 14376 -11504 -5949 14427 -10025 -8763 17604 -4765 -10935 17750 -2397 -16373 14610
1036 14610 765 -18483 14141 7409 -18265 11619 10807 -20681 5530 13196 -20110 2356 18424
1049 18424 -16291 -1304 20243 -15092 -8128 19626 -11968 -11611 21486 -5468 -13908 20376 -1988
1062 -1988 -18813 16109 1826 -20226 14417 8482 -19152 10974 11679 -20388 4522 13505 -18817
1075 -18817 1145 17639 -14348 -2220 18426 -12506 -8067 16855 -9356 -10537 17619 -3548
1087 -3548 -11583 15996 -812 -14906 11773 1724 -15240 10249 6658 -13382 7655 8398 -13897
1100a3897J6452O177k1041J2819J0803j9584P068J2212j8018J896J3778j3626
1112d961q13J4559r548m311J2179o926o737J0035k889o088Q365J15n810M730N12
1127B412n267J989J499k266J169J721p9o56o55R65j376k305L490L75l658M732
1143B090J446o885L895L032q945L814O830r495K558R675j1050j136J1883j1036
1157c324m164J5487q595p528J7396o621j2745J7288l380j6536J7701K125j9158
1170a2054J6176O730k2536J2155J1274k3855Q554J7140k2883L891K1260k2114
1182f262k742K3834j9436q289K6781j4286j3461K7519r553j9617K5804l918k3774
1195a7400K4047L463k6083K0364R531k8397J4323J4843k8308Q829K0657k5663
$$ plain form
1100 -13897 2555 8732 -12309 510 11313 -8271 -1203 11009 -7009 -5113 8665 -4961
1112 -4961 -5774 8785 -763 -5074 7105 179 -6558 3477 588 -5500 2865 2980 -2830 1900 2412
1127 2412 -2855 -866 633 -1633 -464 1257 1178 522 -133 832 -544 -2849 641 1016 -2642 2090
1143 2090 3536 -3349 546 3578 -5367 -1553 5277 -4218 -1660 8015 -3035 -4171 7712 -3324
1157 -3324 -7488 7999 -596 -8124 9272 2651 -10094 7194 3814 -12722 4979 7104 -12054
1170 -12054 4122 10852 -11684 471 11745 -12110 -3556 13584 -9299 -5408 15852 -6262
1182 -6262 -9004 14830 -4606 -12895 13886 -400 -13861 13658 4105 -15512 10292 6374 -17400
1195 -17400 6647 10110 -15973 4391 13922 -14475 -152 14691 -13617 -4788 15869 -9794
1207i794K804K4173k3062m508K5645j8835j0081K7057j2690j4612K6251p475j9489
1220a4616K3267k048k2138K0578M347k2948J6662R060k3876J1062J2739k2827
1232a0738O448J6758j9851J805J8694j7195l733J8851j3515p498J9065q402j0074
1245i385J7523m515j2811J4264r40j3506J1663L170j2572Q513N300j1958M500
1258g54O222j0097K021P393p069J68O892n214k092N220l209k517M263o36j898
1273a307K484K29j745n3M32k73j126R05K120k007l27L428l129k477N110k378l970
1290d084P013p91o418P190N71r294O725L408j0699O259O889j1934L880R357j3079
1305e007P47J2349j2215k008J5374j0593n955J6595q863j0292J7413n290j3396
$$ plain form
1207 -9794 -6990 17183 -5879 -10387 15258 -3577 -13658 13399 709 -13903 12348 4873 -14616
1220 -14616 8651 6603 -15535 5043 9390 -13558 3104 12164 -11712 -650 12089 -10738
1232 -10738 -4290 12468 -7383 -5578 13116 -4079 -7812 11039 -2476 -9974 9091 689 -9385
1245 -9385 8138 3623 -9188 5076 4136 -9370 2293 5463 -7109 1404 6704 -5254 -754
1258 -754 5468 -4629 -2608 4785 -2284 -2116 4776 -438 -2530 2690 -519 -3036 1227 591 -1307
1273 -1307 1177 1406 -339 -392 40 -233 -1359 -454 1666 -341 -668 2760 -369 -2846 2264 -114 -4084
1290 -4084 2929 2138 -4280 2910 3481 -5813 912 4320 -6379 -120 6769 -5165 -1285 8072 -5007
1305 -5007 -4260 8089 -4126 -6134 9240 -1353 -7308 9287 424 -9868 7545 2255 -11141
1318a1141J7862r96j6732J6151K848j9786J3535P712k0825J0662J2733k1104N961
1331c120J6296k0695O03J9631j8010m066K2276j4304r369K2667j0467j4380K2037
1344I099n151j7597K0763M25k0304J7430N050k2263J3361R916k2010R455J4362
1357A2536k0955M371J6991j9427q24J9198j6091m941K0702j2162r299K0141q445
1370A795j3180J8828l718j5267J7088J003j6788J3682M510j7609R882P995j6459
1383h238O512J0877j4703K489J1935j2795j207J2466r647l561J2497o425n746
1396e546J0942l968p394R084j126p419P424J299p150M889K358o629K506L274m805
1411b261J122L660k966m64K612j634j441J415K26r53K32J549l44j780J592O65
$$ plain form
1318 -11141 6721 5725 -11007 5144 7992 -11794 1741 9453 -11372 -710 12023 -9081 -3120
1331 -3120 13176 -7519 -6916 12715 -5295 -9361 12915 -1389 -10758 11909 1442 -12938 9099
1344 9099 3948 -13649 7114 7539 -12765 4665 9715 -12548 813 10729 -11281 -1826 12536
1357 12536 -8419 -4048 12943 -6484 -7308 11890 -4201 -9142 11560 -602 -9901 10240 1795
1370 1795 -11385 7443 3725 -11542 5546 6549 -10239 3443 7953 -9656 226 8221 -8238
1383 -8238 -1726 9151 -5552 -3063 8872 -3923 -5130 7336 -2311 -5872 6625 200 -5546
1396 -5546 5396 1428 -5966 3118 1992 -5427 1997 3296 -3854 1035 3393 -3236 -730 2544 -2261
1411 -2261 -1139 2521 -445 -909 1703 69 -1372 43 269 -684 -452 1097 753 -1027 565 1230
1427A230l380J556K763m043Q88M631m806j072O009m814k941P749l516m854Q809
1442D209k167p514Q764l19r698Q666K646j1179P748N446j2800N450Q150j3529
1456f127L033J1364j2906O2J3894j1964l920J5427j0011p603J6708o607j0898
1469i548J6784l076j4323J5262Q12j6678J3315N379j7725J0408R316j8318O319
1482b073J2501j7635K340J5523j5488j711J7441j3056o150J8026r917r838J8180
1495H143n781j2705J7174j815j5415J4862K051j6966J2293O236j7200R075R574
1508I526j6984N029J1994j5646J286J4138j3133k154J5064j0512n685J4746p483
1521A86q281J4099l903r896J2593q37j1277J0138J813j1609P802M484j0877N258
$$ plain form
1427 1230 -2150 -594 2169 -1874 -986 3645 -1161 -2233 3776 -1038 -3979 3770 254 -4600 4209
1442 4209 2042 -5472 3292 2973 -6725 1941 4587 -6592 1156 6602 -6198 -748 7402 -6127
1456 -6127 -3094 8270 -4636 -4574 9320 -2644 -6564 8863 -1148 -8751 7957 1350 -9548
1469 -9548 7236 4160 -10163 5099 5911 -10767 2548 7927 -9798 610 9926 -8392 -2073
1482 -2073 10428 -7207 -4867 10656 -4832 -6543 10898 -2158 -8308 9718 -199 -10037 8143
1495 8143 2362 -10343 6831 5016 -10399 4463 6514 -10452 1841 8077 -9123 -48 9526
1508 9526 -7458 -2429 9565 -6081 -4795 9343 -3790 -5944 9120 -1392 -7077 7669 186
1521 186 -8095 6004 2101 -7795 4798 3961 -7316 2822 4635 -6974 828 5312 -5565 -307
1535c07O240r997K369P088q446P4P686o191j687P409m217l377O275k306m082N061
1551A592k55l876L488R34l512J571J413k473K75J734r14n97J169K87j366o4J461
1568H67j222j111K624m51k469K975L54m072K852J797n052K594L629n789J472N137
1584D135o367k07O770o075j890Q447n172m115R338l961o643R730j879q673R750
1599C188P94j0555Q659L383j2136O795O289j2627M600R187j2382J628J1293j1596
1613c480j691J2954r732m695J4105p186p760J4127m467j0607J3379j142j2547
1626h742J2137K392j3987R881N495j4815O997Q517j4480M023J1222j3418O00J2915
1640H737j1807k904J3959r307n859J4410o330q549J3721l399j0787J2343k27j1982
$$ plain form
1535 -307 5933 -4064 -1695 5393 -3053 -2979 4707 -1484 -3171 4238 21 -3356 2919 613 -3469 1592
1551 1592 1337 -2539 949 1883 -1629 -58 1355 -1118 -843 891 -23 -620 549 836 -530 -594 867
1568 867 -355 -1466 1158 707 -1762 1213 1567 -2505 347 2144 -2908 -314 3315 -2474 -1002 4135
1584 4135 -2232 -2439 4331 -1744 -3634 4813 -359 -4474 4864 903 -5740 3990 2111 -6562 3188
1599 3188 3982 -6573 2086 5469 -6667 128 6417 -6210 -1610 7577 -4805 -3177 8116 -3480
1613 -3480 -5171 7783 -1949 -6644 7461 275 -7485 6642 2175 -8432 4947 3805 -8742
1626 -8742 3395 5787 -8200 1681 7176 -7639 -642 7875 -6605 -2582 8640 -4778 -4178 8737
1640 8737 -3070 -5974 7985 -1322 -7181 7229 899 -7650 6071 2672 -8115 4228 4001 -7981
1654g981J0602K879j2585Q151N325j2665N398P456j1741K832R173j0312R6R972
1668F600q652k492J0177o356m415R917l854o007Q781j658p103P211N33p249N546
1683I79K406o883L501L515o158J527M147m770J03M306l236j103L699j912j900
1698a779K807n80j887J847M96j567N85R09j028n74J110M8j268R23J178j907R2
1715e95K169k205r09L294j830k033M135j167l584M435j45m979M446J473o062L974
1731D17L235p011K703M925p407J122O769p059p49Q244o304l027R102m992n250
1746e282R628k968p187R505p58r011Q559J619j0354P223M270j0960N358O667j1121
1761d812K844Q675j0562J96J0443r155k493J1566p331n303J1845n040p709J1594
$$ plain form
1654 -7981 2621 5500 -7085 1066 6391 -6274 -876 6580 -5161 -2329 6844 -3468 -3372 6600
1668 6600 -2052 -4544 5633 -723 -5138 4779 925 -5082 3699 2041 -5062 2149 2682 -4567 979
1683 979 3385 -3498 3 3518 -2640 -1113 3034 -1736 -1633 2673 -563 -1666 2033 121 -1779
1698 -1779 1028 448 -1439 408 904 -663 -78 831 -197 -771 339 387 -881 42 1220 -687 -595
1715 -595 1574 -631 -1540 1754 -76 -2109 2026 859 -2725 1710 1565 -3414 1032 2505 -3557 417
1731 417 3652 -3359 -656 4269 -3138 -2016 4753 -2306 -3055 5189 -1115 -4142 4960 -32 -5282
1746 -5282 4346 1378 -5809 3696 2938 -6073 2486 4105 -6249 974 5244 -5716 -358 6309 -4812
1761 -4812 -1968 6707 -3855 -3659 6784 -2371 -4864 6702 -629 -5932 5913 873 -6836 4758
1775D758k250r530J0621N30j0989Q850L178j1707O807N745j1607M440P810j1026
1789d370J759R272r883p71J0332q074l098J0774o108n299J0448l910p039R759
1803C792j436q192Q537Q50q965O729K863r075M774M702q443K695N963p463N24
1818b145O554o071j311O758m284k693O358k586l768N381j021m237M271M36m141
1833b499L044J430l802J664J957l103N57K254k078k99K082j111r97J483j79j263
1849h60Q03P47j061j17J334o53j209J541J46k053J521J252k717R92K316l161K8
1866a151L388l081j074M386k570k376M948j794l821N146n61n005N028R58o003
1881c582M356K492o801L262M110p041J897N693o830J88O930o263j773P867n112
$$ plain form
1775 4758 2508 -7022 3599 4129 -6860 1990 5168 -6539 268 6013 -5594 -1154 6656 -4370
1789 -4370 -2611 6661 -3222 -3993 6339 -1735 -4833 5941 -167 -5466 4982 1072 -5967 3792
1803 3792 2356 -5836 2701 3551 -5414 1315 4178 -4897 -123 4579 -3864 -1169 4794 -2669 -2145
1818 -2145 4409 -1662 -2973 3785 -499 -3192 3166 580 -3188 2193 1172 -3065 1206 1642 -2499
1833 -2499 545 1975 -1827 -163 1794 -1309 -752 1502 -576 -875 1207 96 -901 582 403 -860
1849 -860 -57 690 -371 -488 846 193 -1016 525 671 -1382 139 1391 -1326 -334 1982 -1179 -1151
1866 -1151 2237 -844 -1918 2468 -102 -2478 2470 676 -3145 2001 1440 -3565 1463 2421 -3582
1881 -3582 774 3266 -3535 -273 3837 -3204 -1307 4386 -2444 -2256 4674 -1589 -3362 4505 -607
1896f07l656Q453l483n518Q392j622p201P762N08q356O700K771r053N066M779
1911D935r257L065O574q799R79Q040p782j251Q886o446l378R248m690n180R175
$$ plain form
1896 -607 -4263 4190 707 -4811 3581 1959 -5242 2520 3028 -5328 1372 4143 -4910 156 4935
1911 4935 -4322 -1257 5317 -3482 -2503 5537 -2245 -3496 5390 -1056 -4434 4814 124 -5056 4119
$$ [...]
8191E5
##END NTUPLES=NMR FID
##END=
