##TITLE=1H_AM_NVCDCl3
 200.13MHz,CDCl3,
 8 sc
 
 22.4.2025
##JCAMPDX= 6.0         $$ Bruker NMR JCAMP-DX V2.0
##DATA TYPE= NMR FID
##DATA CLASS= NTUPLES
##ORIGIN= UXNMR, Bruker Analytische Messtechnik GmbH
##OWNER= pz
$$ XWIN-NMR		Version 3.5
$$ Tue Apr 22 14:07:03 2025 Russian Standard Time (UT+4h)  she@DPX200
##.OBSERVE FREQUENCY= 200.1313
##.OBSERVE NUCLEUS= ^1H
##.DELAY= (6, 6)
##.ACQUISITION MODE= SIMULTANEOUS
##.ACQUISITION SCHEME= undefined
##.AVERAGES= 8
##.DIGITISER RES= 18
##SPECTROMETER/DATA SYSTEM= spect
##.PULSE SEQUENCE= zg30
##.SOLVENT NAME= CDCl3
##.SHIFT REFERENCE= (INTERNAL, CDCl3, 0, 14.3821)
##AUDIT TRAIL= $$ (NUMBER, WHEN, WHO, WHERE, WHAT)
$$ ##TITLE= Audit trail, XWIN-NMR		Version 3.5
$$ ##JCAMPDX= 5.01
$$ ##ORIGIN= Bruker BioSpin GmbH
$$ ##OWNER= she
$$ F:/spectra/data/she/nmr/H-C/1/audita.txt
$$ ##AUDIT TRAIL=  $$ (NUMBER, WHEN, WHO, WHERE, WHAT)
(   1,<2025-04-22 14:05:17.71 +0400>,<she>,<DPX200>,
      <created by zg, POWCHK disabled, PULCHK disabled
       configuration hash MD5:
       00 E9 B6 7A A2 85 ED C7 34 08 36 98 17 FE 4E 26
       data hash MD5: 16K
       83 BB DC 47 FD 35 AD 67 3B D3 FC 91 A6 A1 BD 5B>)
$$ ##END=
$$ 
$$ hash MD5
$$ B8 7F 2E 57 8E B7 EF 94 99 81 B9 64 F0 92 B3 F0
##$RELAX= 
##$RELAX= 
##$RELAX= 
##$RELAX= 
##$RELAX= 
##$RELAX= 
$$ Bruker specific parameters
$$ --------------------------
##$DU= <F:/spectra>
##$EXPNO= 1
##$NAME= <H-C>
##$PROCNO= 1
##$TYPE= <nmr>
##$USER= <she>
##$AMP= (0..31)
100 100 100 100 100 100 100 100 100 100 100 100 100 100 100 100 100 100 
100 100 100 100 100 100 100 100 100 100 100 100 100 100 
##$AQSEQ= 0
##$AQ_mod= 1
##$AUNM= <au_zg>
##$AUTOPOS= <>
##$BF1= 200.13
##$BF2= 200.13
##$BF3= 200.13
##$BF4= 200.13
##$BF5= 200.13
##$BF6= 200.13
##$BF7= 200.13
##$BF8= 200.13
##$BYTORDA= 1
##$CFDGTYP= 0
##$CFRGTYP= 5
##$CHEMSTR= <none>
##$CNST= (0..31)
1 1 145 1 1 1 1 1 1 1 1 1 1 1 1 1 1 1 1 1 1 1 1 1 1 1 1 1 1 1 1 1 
##$CPDPRG= <>
##$CPDPRG1= <>
##$CPDPRG2= <>
##$CPDPRG3= <>
##$CPDPRG4= <mlev>
##$CPDPRG5= <mlev>
##$CPDPRG6= <mlev>
##$CPDPRG7= <mlev>
##$CPDPRG8= <mlev>
##$CPDPRGB= <>
##$CPDPRGT= <>
##$D= (0..31)
0 0.7 0 0 0 0 0 0 0 0 0 0.03 0 0 0 0 0 0 0 0 0 0 0 0 0 0 0 0 0 0 0 0 
##$DATE= 1745316317
##$DBL= (0..7)
120 120 120 120 120 120 120 120 
##$DBP= (0..7)
150 150 150 150 150 150 150 150 
##$DBP07= 0
##$DBPNAM0= <>
##$DBPNAM1= <>
##$DBPNAM2= <>
##$DBPNAM3= <>
##$DBPNAM4= <>
##$DBPNAM5= <>
##$DBPNAM6= <>
##$DBPNAM7= <>
##$DBPOAL= (0..7)
0.5 0.5 0.5 0.5 0.5 0.5 0.5 0.5 
##$DBPOFFS= (0..7)
0 0 0 0 0 0 0 0 
##$DE= 6
##$DECBNUC= <off>
##$DECIM= 32
##$DECNUC= <off>
##$DECSTAT= 4
##$DIGMOD= 1
##$DIGTYP= 9
##$DL= (0..7)
0 120 120 120 120 120 120 120 
##$DP= (0..7)
150 150 150 150 150 150 150 150 
##$DP07= 0
##$DPNAME0= <>
##$DPNAME1= <>
##$DPNAME2= <>
##$DPNAME3= <>
##$DPNAME4= <>
##$DPNAME5= <>
##$DPNAME6= <>
##$DPNAME7= <>
##$DPOAL= (0..7)
0.5 0.5 0.5 0.5 0.5 0.5 0.5 0.5 
##$DPOFFS= (0..7)
0 0 0 0 0 0 0 0 
##$DQDMODE= 0
##$DR= 18
##$DS= 0
##$DSLIST= <SSSSSSSSSSSSSSS>
$$ [...]
##$SUBNAM0= <"">
##$SUBNAM1= <"">
##$SUBNAM2= <"">
##$SUBNAM3= <"">
##$SUBNAM4= <"">
##$SUBNAM5= <"">
##$SUBNAM6= <"">
##$SUBNAM7= <"">
##$SUBNAM8= <"">
##$SUBNAM9= <"">
##$SW= 18.0517328524113
##$SWIBOX= (0..15)
0 0 2 0 0 0 0 0 0 0 0 0 0 0 0 0 
##$SW_h= 3612.71676300578
##$TD= 16384
##$TD0= 1
##$TE= 0
##$TE2= 300
##$TE3= 300
##$TEG= 300
##$TL= (0..7)
0 120 120 120 120 120 120 120 
##$TP= (0..7)
150 150 150 150 150 150 150 150 
##$TP07= 0
##$TPNAME0= <>
##$TPNAME1= <>
##$TPNAME2= <>
##$TPNAME3= <>
##$TPNAME4= <>
##$TPNAME5= <>
##$TPNAME6= <>
##$TPNAME7= <>
##$TPOAL= (0..7)
0.5 0.5 0.5 0.5 0.5 0.5 0.5 0.5 
##$TPOFFS= (0..7)
0 0 0 0 0 0 0 0 
##$TUNHIN= 0
##$TUNHOUT= 0
##$TUNXOUT= 0
##$USERA1= <user>
##$USERA2= <user>
##$USERA3= <user>
##$USERA4= <user>
##$USERA5= <user>
##$V9= 5
##$VALIST= <valist>
##$VCLIST= <CCCCCCCCCCCCCCC>
##$VD= 0
##$VDLIST= <DDDDDDDDDDDDDDD>
##$VPLIST= <PPPPPPPPPPPPPPP>
##$VTLIST= <TTTTTTTTTTTTTTT>
##$WBST= 1024
##$WBSW= 4
##$XGAIN= (0..3)
0 0 0 0 
##$XL= 0
##$YL= 0
##$YMAX_a= 4827
##$YMIN_a= -12191
##$ZGOPTNS= <>
##$ZL1= 120
##$ZL2= 120
##$ZL3= 120
##$ZL4= 120
##$ABSF1= 10
##$ABSF2= 0
##$ABSG= 5
##$ABSL= 3
##$ALPHA= 0
##$AQORDER= 0
##$ASSFAC= 0
##$ASSFACI= 0
##$ASSFACX= 0
##$ASSWID= 0
##$AUNMP= <proc_1d>
##$AZFE= 0.1
##$AZFW= 0.1
##$BCFW= 1
##$BC_mod= 2
##$BYTORDP= 1
##$COROFFS= 0
##$CY= -3
##$DATMOD= 1
##$DC= 2
##$DFILT= <>
##$DTYPP= 0
##$F1P= 0
##$F2P= 0
##$FCOR= 0.5
##$FTSIZE= 0
##$FT_mod= 4
##$GAMMA= 1
##$GB= 0.15
##$INTBC= 1
##$INTSCL= 1
##$ISEN= 128
##$LB= 0.25
##$LEV0= 0
##$LPBIN= 0
##$MAXI= 10000
##$MC2= 0
##$MEAN= 0
##$ME_mod= 0
##$MI= 1.114404
##$NCOEF= 0
##$NC_proc= 0
##$NLEV= 6
##$NOISF1= 3.799351
##$NOISF2= 2.8
##$NSP= 1
##$NTH_PI= 0
##$NZP= 0
##$OFFSET= 14.38212
##$PC= 1
##$PHC0= -830.8265
##$PHC1= 11.39221
##$PH_mod= 1
##$PKNL= yes
##$PPARMOD= 0
##$PSCAL= 0
##$PSIGN= 0
##$REVERSE= no
##$SF= 200.129724274929
##$SI= 16384
##$SIGF1= 3
##$SIGF2= 2
##$SINO= 400
##$SIOLD= 16384
##$SREGLST= <1H.CDCl3>
##$SSB= 0
##$STSI= 0
##$STSR= 0
##$SW_p= 3205.1282051282
##$SYMM= 0
##$S_DEV= 0
##$TDeff= 0
##$TDoff= 0
##$TI= <>
##$TILT= no
##$TM1= 0
##$TM2= 0
##$TOPLEV= 0
##$USERP1= <user>
##$USERP2= <user>
##$USERP3= <user>
##$USERP4= <user>
##$USERP5= <user>
##$WDW= 1
##$XDIM= 8192
##$YMAX_p= 0
##$YMIN_p= 0
$$ End of Bruker specific parameters
$$ ---------------------------------
##NTUPLES= NMR FID
##VAR_NAME=  TIME,          FID/REAL,        FID/IMAG
##SYMBOL=    X,             R,               I
##VAR_TYPE=  INDEPENDENT,   DEPENDENT,       DEPENDENT
##VAR_FORM=  AFFN,          ASDF,            ASDF
##VAR_DIM=   8192,          8192,            8192
##UNITS=     SECONDS,       ARBITRARY UNITS, ARBITRARY UNITS
##FACTOR=    0.0002768,     1,               1
##FIRST=     0,             0,               0
##LAST=      2.2672688,     0,               0
##MIN=       0,             -12191,          0
##MAX=       2.2672688,     4827,            0
$$ Real data points
##PAGE= N=1
##DATA TABLE= (X++(R..R)), XYDATA
0@%%%%%%%%%%%%%%%%%%%%%%%%%%%%%%%%%jLoQqRj1J2j2J2j3J7k1K3k4K5k9L4l7
52a9L8m0M5n1N6o4P2p9Q8j03J22j42J71k13K82m09P19l684j731O181K535k928
74H46m2M023j596l771J539K848l082l220K155J041m219m47L416j64l716J506L615
91G32j035k033L501K337k954m38L565K47l452N98K519k397l196J675J549l375
107b157k032K810Q11l361M78L898l80k533K412L129j890j716L512J223l539k86
123C79K728j173l565Q93K163k820k662K561J359k915l51L434J27k616J674L472
139B688j348j926K980J586k980q77K714l06l692L24J977j790k832J871J796k666
155b481j046K914Q46k120O82L342n17k260K090K297k102j630K426J72l280n34
$$ y = [0, 0, 0, 0, 0, 0, 0, 0, 0, 0, 0, 0, 0, 0, 0, 0, 0, 0, 0, 0, 0, 0, 0, 0, 0, 0, 0, 0, 0, 0, 0, 0, 0, 0, -1, 2, -4, 4, -4, 5, -6, 6, -6, 6, -7, 10, -11, 12, -12, 13, -16, 18, -19, 19, -21, 24, -27, 29, -35, 37, -42, 46, -57, 65, -77, 94, -119, 163, -246, 473, -3211, -4942, 1239, 3774, 846, 804, 4827, 3231, -540, 999, 3847, 765, -2455, -300, 741, -3478, -3925, -509, -673, -4389, -2883, 732, -303, -2336, 1165, 3502, 548, 110, 3675, 3922, 470, 1068, 3587, 1190, -2006, -331, 1218, -2157, -4189, -1379, -568, -3929, -3451, 447, 67, -2466, -54, 3075, 1185, -531, 2981, 4204, 665, 379, 3107, 1934, -1631, -738, 1425, -1395, -4057, -1496, -137, -3052, -3403, 31, 158, -2458, -784, 2688, 1340, -586, 2394, 3980, 1000, 123, 2837, 2531, -1161, -837, 1140, -650, -3482, -1611, 185, -2481, -3527, -613, 233, -1887, -1205, 2137, 1620, -640, 1450, 3747, 1645, 15, 2441, 2613, -667, -1201]
171a201K398j114l025R46J967k028j658K677J752k438K4L230J39k281J590K495
187C473j646j897J766J156k807j178K418p91l207O09K163j379k033K098J687j916
203a484m72L157N77k171Q06K524q90j976J330J542k356j451J427L64k858j88K198
220G9r85k294J154K293j263r62K346J369j881j15K771k20k145Q92J839j980k039
237a141J859O93k845q19K016l72k108N16K457j028j301J794J827j530l27K439
253B130L25k268K65K133j198j979R99Q49k196j113J745K36k297J12J945k62j515
270b089J393K197j210q11J909R23j703k44K003p49k293O32J451j774j567J321
286f11P40k010m82J907K69j791J005J980o95j314J950J605j682p65J765J40k144
$$ y = [-1201, 1197, 83, -2942, -1996, -29, -2057, -3715, -1038, 714, -1724, -1700, 1530, 1669, -612, 978, 3473, 1827, -70, 1696, 2852, 45, -1133, 1285, 494, -2713, -2104, 59, -1320, -3353, -1255, 432, -1484, -1956, 1201, 1778, -393, 413, 2937, 2047, 71, 1401, 2943, 587, -864, 563, 927, -1931, -2119, 79, -906, -3200, -2046, 247, -1016, -1978, 368, 1737, -144, -259, 2512, 2292, 147, 1039, 2878, 898, -1141, 718, 1411, -1434, -2253, -237, -609, -2717, -2201, 256, -772, -2073, -279, 1548, 18, -309, 2130, 2455, 187, 452, 2585, 1387, -592, 407, 1256, -940, -2053, -308, -72, -2369, -2257, -312, -574, -2089, -696, 1501, 291, -520, 1389, 2312, 609, 365, 2368, 1619, -674, -42, 1409, -365, -1932, -611, 129, -1881, -2363, -456, -187, -1978, -973, 1007, 312, -1002, 948, 2553, 871, 106, 1871, 2011, -133]
303a33R7J494j013k130P80J148j703q72J794O19j844L23K214j14j401J331J491
320B081j332p30J588O03j902m17J278p86j760N70J071j393j122J316Q29j379j2
337a497J901L43j492Q35J788q35r81J377P71j781q17J573j29k137jJ269r31j511
355b255J168J410j509o96K042M37j197M19J935n46j213R63J074j083j199J360
371A110k11j730k57J466q51j385O76R14q42n51J443R31j293K49J650M8j329O63
389G01J249r98j003Q24O44j861n80J347l25j805L25J408q36q62J269J200j089
406c92j91J580M78j369K69J609q21j369P36R19j425j166J119J08j528J2J235m03
424e99j143R97J333j014m26J649M94j225PJ629k89j441O17P77j183j002Q77L19
$$ y = [-133, -36, 1458, 445, -1685, -905, 243, -1460, -2332, -538, 81, -1763, -1440, 774, 660, -741, 590, 2081, 749, 19, 1607, 2210, 308, -109, 1169, 383, -1377, -807, 264, -1129, -2251, -935, -106, -1485, -1497, 404, 747, -745, 90, 1878, 1043, 62, 1439, 2210, 429, -388, 1185, 1056, -1081, -1082, 187, -744, -2255, -1087, 323, -1186, -1882, 160, 597, -600, -181, 1754, 1208, -5, 958, 2032, 949, -250, 1110, 899, -831, -1088, 378, -473, -1858, -1182, -268, -1110, -1661, -218, 713, -580, -331, 1319, 1367, 38, 701, 1950, 952, -51, 773, 1417, -444, -1024, 323, -2, -1807, -1482, -74, -910, -1772, -503, 697, -392, -583, 997, 1475, 106, 375, 1984, 1163, -206, 530, 1449, 24, -1142, -23, 85, -1443, -1431, -196, -599, -1742, -745, 588, -426, -852, 797, 1291, 66, 73, 1702, 1413, -28, 589, 1366, 183, -819, 58, 377]
442C77j451l85J298l45j092N79J380n77r71J454R09q93j06J314j36j260K69J043
460A407p95j408O38N83j148j010J247K64j269L47J372m93p44J043J147p07o61
477a87J394K36j255K19Q75m61j325L36P40r49j071R56L16j141j44J494n6j004
495a027Q71J172n25p37J106O74j053m10J038n5j386J70P62q09j010O91L55q95
513a068l08J029L50q67R9J606k86p64Q93Q60j011n94J286l4j341j72J088o71j322
532a227N40R70j020q26J148K76o71J53J511l63p26O75P64p35n13J149M8j125j35
551a07P82k50j346K22P27p33p79R19N26p30k00J229N35j193O33J118n96q27Q78
570H08M10q23o42P64o2j236j51R96l20j061O86P36p64k36J195L77j064L99J147
$$ y = [377, -1074, -1459, -161, -506, -1598, -1019, 361, -216, -1187, 267, 1176, 283, 177, 1491, 1355, 95, 364, 1407, 612, -796, -158, 425, -723, -1733, -486, -222, -1491, -1144, 228, -265, -1009, 34, 1181, 474, -187, 1207, 1443, 188, 407, 1282, 821, -504, -168, 572, -377, -1448, -492, -176, -1317, -1461, 33, -23, -1027, -156, 1016, 491, -246, 860, 1534, 481, 71, 1109, 1054, -332, -162, 600, -209, -1219, -528, -173, -1068, -1376, -347, 3, -864, -765, 841, 555, -209, 684, 1544, 533, -61, 1225, 1191, -150, -322, 766, 95, -1227, -687, 283, -737, -1563, -415, -139, -810, -657, 854, 491, -235, 440, 1204, 469, -44, 1105, 1153, 28, -107, 675, 425, -921, -699, 28, -705, -1484, -565, -39, -769, -969, 260, 795, -398, 235, 1353, 757, -70, 808, 1218, 395, -247, 517, 455, -781, -932, 64, -256, -1317, -631, 105, -659, -895, 300, 677, -387, 12, 1159]
589A159k64r38N60J051j107q36P86L73j444k41J006l91r82K94R06k85o27Q97N68
608D85q29N6J221R7j007P21N15p57n56M24L88j146n02R10j48j206N32R65o79o79
628a195J008O74o77k76J145K14p40J98Q10k76q46M44L96q81q82P23J89r68r5Q57
648a78j12q56O68J019n06n06J077K55p47K68Q82j50j114J34P67p47q88O97K56
667B19r26j75O86o5o79K32R35k63n31Q34N51n06k76Q77mq42Q3O87l21j244N24
688b04N18p95m09O34J04r37K90Q16M1n46O34Q98q66l35J038J86r13j87R03m98
708C72q76P5P94o06p02O55K75r38n3J028j09m24N98O52k94n42R04L70j045j49
728a5O75j5r87P1O40p35o05O19L15o73k96Q43L01p04K21J059k72n75M05Q67o72
$$ y = [1159, 895, -43, 517, 1568, 461, -375, 411, 784, -660, -901, 105, -286, -1268, -974, -68, -353, -980, -83, 485, -344, -288, 933, 1030, 23, 744, 1259, 502, -54, 370, 758, -388, -890, 20, -128, -1334, -802, 163, -516, -1195, -187, 487, -190, -466, 679, 893, 153, 351, 1161, 885, 39, 483, 879, -2, -884, -161, 28, -940, -1035, -178, -290, -1146, -478, 541, 35, -471, 606, 861, 114, 382, 1264, 1114, 0, 134, 901, 154, -734, -37, 219, -707, -882, -196, -261, -940, -708, 227, -36, -567, 267, 818, 312, 36, 913, 909, 67, 150, 837, 516, -728, -204, 314, -481, -890, -256, -152, -1089, -799, 17, 58, -488, 146, 1044, 178, -157, 881, 1067, 154, -33, 870, 372, -504, -429, 365, -241, -943, -288, -13, -951, -1004, 24, -85, -509, 89, 741, 447, -95, 809, 1179, 134, -15, 660, 645, -342, -271, 369, -366, -971, -352, -37, -710, -1006, -163, 138, -566, -345, 714, 442, -133, 272, 1139, 467]
749D67m42N63J35q90j27N71j97r44M56L95o37n03Q87L30m72J06O40L39q27K19
769F9R81m37p71N80K04q14q6O88j75j098L09M85l97l99N59M51o53n3Q43L63q21
790a72L56N80k37o70M14N55p82m21O04j4q36j37P29l60n98M62P92o56q8O55N51
811G27q42K6Q76r2p37L56N28m75q40O84K04q63l04P57j79p38M55L91k75m63P58
832d6N96o95N3P34K6o04J11Q23o76o52O60J71q03m70O92K4r24K84O64q5n97N21
854a93P40n43k22O46L05n62J8P60l22p80Q9N92q20m21N97L22p59k60P40o2o48
875g83N02P62m30m11N48P66p16j0N54j26o27n6M39m09n66L05J73m72l40P61N9
896g7m50l4P38p8m52O96L75n22m3O34j46n24k48N82l08o77K83M54o59k64M62K50
$$ y = [467, 25, 588, 723, -167, -294, 277, 80, -864, -408, -13, -650, -1153, -266, 64, -408, -302, 338, 677, -150, 69, 1050, 613, -158, 422, 626, -188, -274, 414, 239, -859, -550, -65, -462, -861, -302, 149, -504, -557, 286, 649, -172, 184, 764, 527, -143, 271, 826, 44, -377, 227, 213, -623, -760, -31, -391, -989, -527, 265, -391, -479, 176, 727, -115, -89, 787, 695, -42, 314, 842, 367, -473, 211, 415, -448, -752, 5, -174, -912, -457, -66, -341, -804, -46, 550, -145, -92, 642, 668, 64, 175, 998, 322, -330, 330, 501, -302, -772, -80, -56, -980, -696, -32, -117, -714, -193, 547, 4, -218, 428, 733, 171, 189, 949, 627, -153, -64, 528, -292, -713, -116, 206, -553, -813, -73, -135, -783, -281, 481, 51, -360, 188, 954, 238, 228, 782, 656, 29, -27, 412, 3, -563, -258, -85, -557, -897, -136, -77, -527, -561, 177, 99, -353, 343, 718, 196, 153, 787, 641, 117, -131, 451, 143, -534, -251, 203, -456, -720, -258, -8]
918hn82MP15J20m58O9P41k39l37M72L23o08k78M33Op40J5M69k81o53L36K42k85
941e24k3M97K47m05K04O11j7p32N67K86o44n8N26k29p99P3N14l46l96J87L75l65
963d51j78N68K68l48j66R24j90l66K07O29n22l16J82L47o91l22N18n6p40K16L86
984a01l98j78L59M82k57k50P39Q2n16L14M23l24l70K89K00n98j46K88j5o66pP43
1006I3l92j06K07K11l51J0O10J98m36n9N67k6l18J35K45n78m63M96J5m95j87N40
1028h4k54l08L36N13k41l36M11M37n11o3Q51j93n98J40O27o96k69J71L57p64j09
1049e83M88k87j24R7N70k44k82L67M58k70j74N52M9n22j4M46l56n70M63P6l83
1070b43l68L78J66m75K35L23j0m07M41M61l33k23K91O13p77j9M30p3q10J85M37
$$ y = [-8, -590, -586, 129, 249, -209, -140, 601, 362, 25, 497, 820, 212, -66, 367, 373, -367, -352, 117, -164, -817, -481, -239, -524, -547, -50, 197, -208, -4, 607, 590, -142, 425, 711, 67, 9, 535, 306, -493, -420, 94, -252, -648, -461, -86, -451, -629, -61, 207, -141, -307, 617, 427, 61, 268, 897, 375, 59, 241, 588, -103, -425, 93, 37, -703, -487, -101, -499, -677, -318, 164, -93, -343, 396, 478, -38, 276, 699, 375, 5, 294, 494, -104, -250, 38, 23, -643, -650, 93, -299, -405, -198, 13, -338, -328, 282, 480, 44, -15, 552, 526, 208, 343, 588, 10, -453, 43, 58, -437, -624, -84, -338, -646, -310, 203, -38, -374, 37, 474, -37, -100, 751, 558, -40, 100, 727, 31, -238, -67, 290, -474, -583, -95, -382, -506, -409, 161, -83, -365, 2, 460, 190, 16, 568, 617, 95, 81, 527, 171, -399, 64, 140, -243, -611, -233, -67, -542, -307, 16, 6, -401, 40, 501, 168, -55, 236, 849, 72, 53, 483, 410, -400, -215, 222]
1091B22l14m03K49K25o39K08M70M3l83J66M14j53k69N91K80m74k10M46o1o36K85
1112E7J65k49n60K08K82k00m51N91K80m53P4M56j26M0Q3M28l39k57K17K52n13
1133a5j18L39k1o50J82L07l86j11J37K29k78J54K67L88n66J91M76q3l37L26P7
1154E08k89m81M08J14o76J10L35n40k13O25j5q1k16M64L15n64J68M55r3k81O7
1175A20M96n64l37N12N9n52l7K15n1m96J55N32j88k88K36M53m08k5P29k13n5j09
1197A84M90l61m60K97J40n40q0M10kn06m0O06j19m97L79L06k12k7M50J31l97J21
1219B73K99k85m32K47K80l16l22R7K26o22m6N89j87k66J25N26pm84N57K64l39
1240A77j0L17p1j48l24J49j89l59L86Q2m66N4K35P4m25K04M83j81j94M15M37m25
$$ y = [222, -92, -495, -246, -21, -660, -452, 18, 61, -322, -156, 258, 105, -164, 427, 707, 233, 23, 469, 408, -228, 57, 222, -27, -587, -379, -97, -297, -748, -157, 123, -330, -256, 200, 74, 114, 197, 625, 286, 29, 246, 498, -15, -133, 206, 185, -465, -283, 24, -362, -473, -336, -107, -385, -231, 36, 424, -142, 49, 525, 442, 105, 431, 508, 219, -262, 146, 260, -416, -306, 29, -511, -724, -99, -114, -195, -411, 53, 368, -196, -28, 427, 334, 53, 120, 616, 52, -285, 227, 286, -266, -303, -88, -139, -635, -480, 52, -136, -424, -188, 265, -143, -168, 561, 348, 293, 184, 674, 313, -147, 150, 290, -250, -330, 80, 78, -428, -468, 138, 19, -478, -99, 207, -5, -32, 418, 549, 152, 273, 572, 287, -145, 102, 382, 66, -256, -159, 67, -555, -601, -12, -199, -465, -340, 186, 179, -305, 252, 516, 177, 167, 484, 413, 265, -59, 90, -99, -458, -72, 10, -456, -402, -167, -93, -518, -314, 169, -12, -206, 209, 646, 221]
1262B21k56N92L5o50J03K41l02l19Q4L38n42j49M91N1l54L7O26k40q2Q6N15l07
1284B19m25O05M4k64k51N89k44n90N0M88l69l47L91P2n35K49M58J3m98L51M08
1305D14k27k55L97J15k70k98M43J25n91j65K19n0j82J36J19j58k70M58M4j38K5
1326a09K58K90l24J61Q8p4l42K39J36n40M3L61k82m60J52L76k79j27J46L07l28
1347c08M9N93qk88j1K89J3l79K80R3m17k12M40j05m83K59J31k8m85M66J12j48
1369a47k2L91K37n27J64L36j32k17J29K81m39k90J99K10p44K41L64j79m39K92
1389b92N01k45l24N44K37j55k79L01J73l86J5K06k33l16K76J98o45o7L38M8k14
1410c19o0L00Kr6R0L49j21k72L65P3j91q8L81j23p17L21K65j51m24L51J01m12
$$ y = [221, -35, 557, 592, -58, 45, 286, -16, -335, -251, 87, -455, -604, -113, -62, -416, -379, 247, 7, -75, 11, 526, 219, -206, 399, 443, 179, -72, 517, 273, -317, -267, 221, -148, -495, -104, -32, -567, -318, 140, 153, -345, 6, 414, 187, -68, 329, 444, 174, -124, 319, 444, -147, -312, -93, -143, -325, -189, -70, -228, -498, -40, 4, -134, -109, 149, 439, 115, 276, 364, 290, -52, 187, 323, -217, -174, 187, -95, -555, -403, -27, -306, -433, -287, 20, -308, -259, 334, 326, 38, 27, 316, 329, -50, 230, 323, -94, -306, 134, 29, -454, -195, -64, -92, -577, -111, 1, -147, -169, 222, 459, -68, 96, 432, 300, 83, 212, 493, 54, -236, -37, 173, -571, -330, 34, -145, -584, -292, 209, -36, -360, 184, 421, 266, -13, 288, 461, 75, 90, 296, 63, -253, 23, 221, -424, -491, -153, -105, -319, -379, -79, -77, -173, -83, 266, 145, -127, 238, 311, 120, 32, 413, 290, -427, -106, 159, 8, -416, -65, 36, -376]
1432c76J71R7J51m61K47N23k62l21M32J75m01J59J81j41k96M0L32k35m13K71M2
1453h5k86j05L89J14m26L16J61N8l05J40M59k49k54K07K21l23j57L88m37MJ06
1474f4J9k89l2K52K00k59n1M73j31n6N9J53o7j54L12P5n39r5J10K1k05O4J73p4
1498a05k39L40L6k67j23L97M6k65L64K51k40k51M16l2k71j10M10k50l30L3K47
1519E7k89j04J40K99j87j23K22K59k32L4L72j08k73L7K82k44j64L26j48l68O6
1540a46N1R8j97J38J33j31j41J97K07k02l1L88o1j62r4K52k45LK3J60m32j56L47
1563aO3n53J36L15k45J1L30j4R8j90L47k53J10j92L44j24j53J55k8k68Q5J09K1
1586A03m65k36N40k0r8J0K79N8l83L97J37k76j1J38J7k36L21j09k85m6M5kr2j26
$$ y = [-376, -205, -108, 43, -418, -171, 352, 90, -231, 201, 376, -25, 134, 315, 174, -122, -82, 250, 15, -398, -127, -85, -371, -476, -87, 27, -399, -83, 78, 136, -169, -29, 430, 181, -73, 134, 355, 32, -125, 263, -174, -170, -64, -45, -334, -366, -114, 86, -173, -224, 249, 118, 62, 121, 274, 207, 53, 365, 440, -99, -194, -84, -63, -268, -204, -31, -105, -344, -4, 32, -235, -358, 39, 85, -180, 184, 435, 195, -56, 360, 328, 57, -53, 357, 107, -223, -190, 57, -232, -336, -196, 103, -84, -207, 15, 274, 42, 76, 448, 340, 67, 104, 386, 142, -22, 304, 156, -212, -146, -95, 3, -194, -56, 77, -54, -195, 2, 209, 7, -24, 364, 303, 141, 47, 299, 54, 57, 80, 240, -192, -348, -1, 62, -491, -355, -40, -285, -274, 56, 42, 140, -50, 297, 44, 154, -38, 306, 182, 29, 184, 156, -112, -27, 82, 103, -362, -598, -58, -78, -176, -166, 113, 171, -212, 185, 322, 46, 35, 173, 190, -46, 275, 166, -119, -165, -120, -122, -214, -340]
1610c40K78l0k72K44J76j06n9K05L60k51j85K20R3k30o8K59k18m20K18K43l13
1631a96j64J88J53l10J70K68J23l78K88K28k48j54L01R1l29R5k5j04j30J26R3
1652H6j15l18K15J07k98N6L27o7k42K10L48r0q0L0K93k19k97J42J2k21Q5L6o2
1675f2j30R4L48m53k06L06J66j84P4K81o0j73jL01r4j99J88J50l93L0M5Qm85K59
1699a90J15k25Q1J73J21j18L7J52ML3K8J90j56l27K83M1k07j67O6m3k38L2K52
1722f3j11j37J26K49j86m1L25K02l79m1L75k7l39K42J46k92j62J14k3k89K33n4
1744a32o8k28L19J38j48j33K20K18k15R8K49K30m42j07M27l63o9Q6J2k99n8J72
1766i3J9j81j11L01p9q4J83J38n9N8K64o1k05P8j05mk19P5L06m84J13K9K03l50
$$ y = [-340, -62, -92, -364, -120, 56, -50, -109, 96, 456, 205, 20, 240, 333, 103, 35, 294, 76, -344, -126, 117, -196, -360, -172, -19, -329, -159, 109, 232, -146, 142, 370, 122, -32, 269, 360, 31, 126, 101, -3, -133, -7, 86, -29, -347, -132, -25, -323, -267, 60, -7, -249, -39, 309, 219, 139, 169, 462, 243, -54, 88, 100, -121, -36, 0, -62, -192, -98, 250, -203, -409, -103, 63, -121, -47, 234, 174, 1, 0, 301, 207, 8, 196, 346, -47, -17, 28, 36, -449, -190, -75, -300, -219, -46, 75, -43, -6, 146, 150, 183, 211, 401, 245, -82, 201, 242, 35, -132, -66, -109, -347, -315, -63, -174, -311, -185, 64, -122, -163, 162, 364, -15, -56, 319, 292, -47, 195, 341, 49, -113, 1, -22, -311, -78, -132, -200, -428, -109, 29, -119, -252, -32, 186, -29, 69, 318, 548, 106, -1, 426, 63, -6, 80, 92, -207, -265, -93, -74, -255, -366, -65, -144, -228, -45, 93, 34, 92, 356, 295, 90, 168, 63, 59, -160, -85, 221, -263, -150, -121, 82, -268]
1790b68N8L38j35j60Q5K63j01q0J49O3j28J25j7k0l61P8L04j08m65K07K4j0k36
1813c95M30%l76L06J61j53m4K21J29j51j68L40j29k95o2K46n2l87nL61j4k70N00
1836A93k94j59J21J54Q0k44K17M06l37J3J06P3n2k98J99j66l33M48n6l79KK65
1858d1O9l02J40K74m4r1m7N01l91J1j0J55k34K6j05K21n63L97J34l09l2J34K74
1881A67k17j77K35J93m03L11K6J12j52K40R1l71o7L1J33j82k60J95J53j89j48
1902b79L85k44m4J85J72m36K07L53Q0l23K2J24n4j03K19j54j83q5K2K76k39M4
1924e5J42k02k98L42J64j87J57J15N5l09K33K45k91k01L0L64l70p9O5P4l90K71
1946a25J45k49K27k6J87j45r3J26J98k80O5J51J6k73J22R8j47q6K14q7j77j06
$$ y = [-268, -210, 128, -7, -167, -82, 181, 80, 0, 149, 212, 84, 209, 192, 172, -189, -111, 193, 85, -380, -173, -149, -159, -395, 35, 35, -341, -35, 126, -27, -71, 150, 279, 128, -40, 300, 171, -124, -186, 60, 8, -379, -384, -23, -37, -307, 193, -101, -260, -139, 15, 95, -149, 68, 474, 137, 150, 256, 329, 277, -21, 178, 12, -321, 127, 71, -308, -306, -41, 28, -274, -134, 140, 96, 5, -42, 459, 68, 79, 69, 224, -10, 16, -89, 132, -431, -34, 100, -209, -241, -107, 167, -50, -227, 8, 201, -202, 109, 135, 247, 95, 335, 426, 55, -12, 19, 152, -30, -290, -95, 58, -131, -279, 106, -138, -182, 3, 175, -261, -54, 299, 379, 56, 78, 202, 148, 45, 264, 110, -73, -158, -136, 140, -99, -55, 87, -115, -413, -71, 93, -94, 63, 178, 233, -76, 157, 402, 111, -90, -60, 304, -66, -145, -80, -6, -396, -125, 20, -229, -2, -28, 159, 14, -79, 47, 245, -35, 30, 181, 197, -76, 46, 144, -3, -89, 125, 38, -139, -245]
1968b45K82M7k82M6L20j26j74L6K92j67o5K16N5l17kL01m0n92L90L3k05j54K34
1991a17o4k2r4M45j19j60M9K76k48M9K53J50l68j46L91l25p2j05L39j77j61J23
2013a03J23l62J95N2J75k43J58K07J5k67K81j1k40P0j7J56k46k33L05j55j59J26
2035a73O5rr5pK23j78J11J73O2K6j32J55k39K30k13K47k64m2J77j00p1k08J84
2058g8j43j5J74J33pj76J43N1r4J86J50j38j87N6K66l87Q6K48k26k91K44O0r9
2081d4k46K38K18l10j00M57q2j69Q8J82o3j29N0J10j72j47RJ72%j33K7n0k44J44
2105a94L58k04j23K92O2k67rL08j80Q5r0K54j72k40M4J23j72P1J39j88j09K9J99
2128A6j34p7J83K87j73m5J38oj58L0K05j47k3M2p0J8k57J19M0j50j07K19r4j9
$$ y = [-245, 37, 84, -198, -152, 168, 42, -132, -96, 196, 29, -36, 180, 235, -82, -84, 217, 177, -415, -25, 8, -197, -351, -117, -181, -203, -297, 148, 29, -131, -82, 194, -54, -5, 248, 398, 30, -116, 275, -50, -122, -227, 112, -65, -226, -103, 20, -342, -147, -95, 80, -163, -5, 202, 217, -50, 231, 220, -20, 50, 33, 189, -57, -290, 15, -140, -299, -173, -108, -117, -212, -219, 4, -174, -63, 110, 172, 198, 66, 221, -18, 212, -1, 246, -18, -60, 117, 17, -54, -262, -78, -221, -236, -62, 71, 64, -112, 31, 82, -12, 174, 324, 186, -1, 55, 321, -66, 20, 268, 42, -249, -5, 55, -44, -290, -52, 166, -144, -244, 213, 131, -38, 50, 232, 169, 40, 90, 200, 28, -119, -110, 62, 62, -71, -44, -94, -338, -194, 164, -40, -163, 129, 191, -76, -85, 223, 43, 128, 38, 292, 120, -120, -76, 47, -125, -54, 85, -103, -212, -183, 16, -118, -195, -12, 275, 102, 57, 195, 189, 31, 61, 266, 119, 96, 138, 68, 86, -171, -52, -12, -162, -269, -50, -144, -163]
2152a63J74J27k40l8L50L6k78O7J36r7k19P1J86o8l63K36J29l64J47K68n1k98
2174b52K14K3O8j14J12L31m04J01J87j91l99N00k00J37m38M69k92M5j50J43mj7
2196a31K9K76k94P7J35K74l12k05M06j49j55j80K94M7j85J44L7j01j17J44j0j79
2218a55N6J67j83L9O0J91J2l22J35L44l42L0J1m2k04J49K8j13N7j80J21J31j90
2241b00J50j6N9J21J15k02l2J06K03k57L7Q4M5k84j9L15l21mO8J44k45M5L44J
2265B57m01JL70o3j92N6M45m01J8k77K79L6j86p3K26l11J30Q2k79K95K0j18j37
2288b23J65K33K6j27M1J10m5j22j8J39k40m8q5K6j3P8J5K6q0O8O3j54J94J21j53
2313cP9j66J6K75k07l6J65j66qj77K19j41nJ44n9j84J82L4k0j22K70J5l5r3K23
$$ y = [-163, 11, 138, -102, -140, 210, 246, -32, 35, 171, 74, -145, -74, 112, 44, -319, -83, 46, -318, -171, 97, 46, -252, -38, -15, 53, -61, 51, 382, -22, 79, 266, 75, -324, 176, -24, 113, -325, 144, -148, -103, -253, -110, -114, -131, -102, 174, -120, -43, 92, 366, 54, -151, 255, 106, -49, -229, 65, 112, -73, 71, 108, 7, -110, 34, 24, -155, -99, 68, -115, -76, -16, 175, 187, -135, 0, 344, 2, 32, 43, 1, -203, -54, -26, -139, -82, -262, -141, -10, -200, -50, -66, -7, 114, 229, 27, -5, 101, 304, 47, 84, 168, 213, -71, -90, 225, -96, -100, -32, 112, -133, -88, 256, 257, -144, -143, 227, 164, -28, 28, 473, 72, 90, -187, 92, 128, -58, -131, 95, -216, -86, -4, -283, 12, 32, -86, -223, -58, 175, 201, 74, 115, 225, 180, 58, 40, 179, -61, -109, -194, -168, -181, -103, -88, -62, -142, -74, -11, -165, 29, 150, -3, 76, -90, -74, 201, -6, -42, 123, -43, -51, -228, -9, -150, -155, -11, -70, -254, -72, -38, -58, -180, 90, 105, 70, -23, 200]
2338B00j15j2p9R9o4j17J11L4k20o8N3K6j5LN9M4j47K55L4p6p4J01K9K3j87L38
2364B35o7k47o3J13j37l6%J00K8j14N4J1P7LO9J0m0K5L06l25k6J90l4n4p0J37
2390A45k17j82K49N3k14j54J52J30oj03K63j80N5o2J91k2j00J88j52lr0K18k0
2413A39l40J15J65j07j50qK10j43J58N4J5k58K04K23k85R7J8m2q7M9m3N1k51J53
2437f3K40l27o5J22M1j6j30L77p8k12M7K04j49Q2N6O3q3j2p8R8j63j42J71n9j01
2462a77K46J0j69L2%Q2j81J58J63rj51K11o9j13n7M4J56o3j66N1l9m6Q9M2k12
2487a68J49K6m4r6J41N5Q0j50J43J46j95r6J35L0l40J47l1Ro3j38K80j14L1Q1
2511A8J82r4k07K01J36j40m5R6L9k56R2O5k68O2M4Q3k18J39L4J8j55P4P8j43J58
$$ y = [200, 85, 73, -6, 93, 29, -88, 23, 57, -163, -231, -178, -152, -167, -164, -105, -61, -208, 47, 81, 5, -69, 32, 61, 84, -103, 235, 168, -79, -142, -29, -166, -202, -202, -102, -74, -188, -134, -123, -46, -43, 26, 36, -4, 21, 327, 2, -24, 166, 132, 78, 8, 145, -72, -254, -5, 48, -166, -320, -168, -38, -44, -147, 116, -64, -9, -71, 120, 98, -2, 186, 34, 31, -59, 159, 139, -201, -86, 79, -28, -178, -186, 24, -119, 39, 93, 108, -150, 54, 277, -8, 89, 107, 65, -22, 27, -16, 35, -216, -63, 177, -150, -215, -93, -52, -68, -198, 179, 101, -111, -64, 140, -9, 73, 129, 192, 109, 97, 19, 117, -46, -188, -17, -76, -177, 69, 79, -90, -58, -58, 24, -157, 1, 164, 155, 4, 215, 146, 33, -24, 20, 176, 113, -53, -2, -41, -87, 2, 44, -168, -19, 7, -37, -133, 8, 63, 143, -7, 136, 282, 87, -9, 126, 156, -184, -37, -68, -59, -122, -260, 20, -94, -63, 18, 200, 106, -101, 100, 236, 96, 51, 147, 186, -70, 22, 87, -181, -119, -75, 8, -210, -71, -37, -19, -174, -100, -22, -165, -7]
2536gJ04K16l72Q2L22l49n3P4Lm1j45J19o9n0P0L2%k9J11LL3p5L04r1j62p4Q9
2563D5K58k53nK08k42j72R3J65j39j19M4J80j38j00J74k03J53L1J69j40J03k0
2585I2P6k82M4J13q4R8j23k0l9QJ44j01m0m4Q2J11k03K88J50k81J12j39K62l53
2609a29J74RL5p0p2O4k9j61N1J75m9k05M17j64j87K89K7k17J9J4K85n8k14R1j6
2634G9j37J13M0L9k87MJ93j45p7J63j4l12L58p6J36j92J65Mm7J05j03J99k65J41
2658H4Mr9j84K33K0r9k26M3L11j70M7p5J47j08J40RJ61j59M4mk1p5Q2j22p4J9
2684g2Q9K5j51J15q7k7k5L0J5J18O5l4Q7k02J60O8j22k40K39R7k84N9N3M3r9k24
2710c04K95j16J03J53j27N4M8j9J1m1m1J16j38j19N7R5j70P5K0m1L5j8o0P2K7
$$ y = [-7, 97, 313, -59, 23, 345, -4, -57, 17, 20, -21, -166, -47, -116, -166, -96, -64, -64, -93, 18, 21, 54, -21, 283, 192, 30, -44, 45, 303, 50, 45, 253, 11, -161, -68, 97, -42, -161, -117, 63, -75, -175, -1, -204, -51, -20, 149, 9, 112, 92, 168, -114, -70, 43, -41, 57, -66, -86, -125, -117, 27, -74, -114, -158, -76, 35, -168, 120, 270, -11, 101, -38, 224, -129, 45, 54, 89, 19, -53, 11, -18, -179, -128, 47, -2, -207, 210, 46, -141, 148, 175, -42, -23, -9, 276, 218, 4, 95, 79, -58, 55, 95, 134, -153, -149, 44, -101, -178, -15, -29, -341, 17, -59, 77, -115, 50, 54, 7, 112, 9, 208, -57, 84, 88, -11, -195, 38, 58, -41, -267, -224, 87, -83, -36, -111, 36, -72, 68, 77, 238, 79, 123, 119, 98, 23, 105, -17, -91, -72, 17, 42, -109, 6, -81, -108, -133, -103, -88, 30, 95, 61, 148, -54, 106, 174, 52, -188, 51, 148, -136, -77, -24, 19, -80, -304, -9, -125, -22, 131, 4, 58, 106, 87, 98, 57, 16, 132, -6, -125, -68, 27, -143, -68, -48, -89, -54, -72, -132, -60, -33]
2735c3p9J49K6j57K39M8j63J6k4L5j74L9O7n6MJ51j60q2l2J97N8k26K07P2n6j46
2761h0K72j27j31k9J52O7j9q4J63j26j88J24n3p5l6J39J14j45K7L8N7j20K45j67
2785A8Qj44L28j47j98J17K22j54j71J8L3o0R4q1K85k61n0K70k36r3Q4J63j32N1
2809c6K87j72J08k16Q7p2n3o0P7J30j10j9J39l25J30J72j25o7J52m8P3K5KN0k11
2834h2J15Q0p6N1k72R3J54k37J60J37n2j26R5L5k21K03J36j73Q6N1J03j61k84
2857a85K72p5j00p7K84j06j64q1K06k7j39J49p9N1Q5J39ll28K04J57k70J4R4K14
2881B35k07n7K42k17k08K71n5l30R1L34k9lK5m1P9M6J0l4J35m17K09L4m2k35J70
2906FJ14k47k9J72j10M8M6lN6j00L0J36Kl5l3K61l54J19j1j23m2N6J32k77O6J87
$$ y = [-33, -112, 37, 63, -94, 145, 193, 30, 46, 22, 57, -117, -78, -11, -67, -63, 88, -72, -154, -186, 11, 69, -157, 50, 122, 66, -80, 192, 65, -66, -95, 57, 124, 105, 21, 184, 58, -130, -6, -59, -134, -170, -31, 83, -62, -35, 3, 60, -60, 185, 18, 26, -118, 210, 63, -135, -18, 204, 50, -121, -103, -70, -130, -36, -117, 168, -93, -143, 127, -109, -202, -118, 45, -87, -36, 251, 79, 187, -29, 58, -14, -67, -127, -50, 80, -30, -49, 90, -235, -105, 67, -58, -125, 27, -21, 52, 77, 79, 129, -82, 33, 113, 37, 88, -184, -91, 63, -174, -14, 123, 71, -55, 40, 75, -146, 57, 193, 20, 106, 157, 260, 99, -185, 87, 12, -88, -165, 119, 13, -151, -232, -26, -53, -192, -43, -122, -71, 14, 153, 150, -178, 26, 183, -87, -73, 21, 235, 28, -29, 213, -4, -212, 59, 4, -326, -235, 99, 70, 67, 92, 51, 130, 176, 186, 152, 287, -130, 79, 113, 71, -164, 6, 120, -127, -156, 16, -94, -46, 0, -3, 53, -47, -17, 119, 121, 86, 53, 314, -40, 79, 68, -55, -97, -41, 91, -186, -120, 67]
2932F7k24JJ20j34J51k5J31L5k20j34K22J30l25K71K29l37p4J5J35j60r8J65j35
2955a94K43j4M7j07K5mKJ50k01L11j12r5l9R1j11J2L7L2K2j63m6J08K0j76K98
2980A36j86p6k1L47k20m4P0n7J25n0J52j39pk76K68j71O8k4K05k86N9l6K23J20
3004A80l15J67J65r0o1K32l15j68K92m4l1N0j62O0m7m4K12j31j43K14J24m01K51
3027eQ5p7jJ60q4q1N4q2l4J18j47O4J5q0k8Q6Q8j83O3J43j76l8L06p0j88K67p9
3054I6L4l1n9K02k84QM3J70k19j39K24j77O4O6J36j36j41K02n3j46J66O6k3j5
3078E4O3M6Kj08m6p7p5N6O7m6P7k1J55l07O9J73K7j89K62j58J01j59R5N6k47J45
3104A5J07Q3m78JK68o7l2J4J53r1j08K50l5J00k36K14J08k00Om3J04M4j77K40
$$ y = [67, -157, -156, -36, -170, -19, -44, 87, 122, -98, -232, -10, 120, -205, 66, 295, -42, -116, -101, 34, -126, -224, -59, -194, 49, 35, 82, -25, 0, -4, -2, 148, -53, 258, 146, 51, 12, 103, -8, 4, 41, 73, 95, -68, -114, -6, 14, -162, 136, -50, -126, -147, 200, -20, -64, 6, -51, 74, 24, 176, 37, 30, -246, 22, -149, -81, -105, 100, -186, -127, -163, 60, 180, -135, 32, 197, 107, 46, 278, -37, -205, 87, 43, 12, 62, -100, -40, -87, -131, 81, -50, -193, 21, 145, -256, -5, 80, 3, 2, 162, 78, -3, 51, -31, -65, 53, -94, -30, -15, -95, -123, -37, 51, -132, -69, 74, -102, -140, 166, 96, -92, 175, 96, 130, 99, 40, 242, -42, -34, 9, 179, -40, -179, 45, -132, -68, -2, 134, -2, -143, 59, 6, -140, 26, 92, 69, 54, 117, 163, 165, 57, 11, -66, -141, -85, -18, -64, 13, -8, 147, -160, -91, 82, 109, -80, 182, 24, 125, -34, 61, 117, -130, 15, 122, 205, -273, -272, -4, -71, -103, -89, 64, -27, -135, 115, 80, 180, -56, 158, 266, 66, 72, 29, 133, 177, 0, 240]
3128B40j00k49K94k68qj17K45j01n0kK09l22N9J32K26o9r8Q3r1n6O5k7L3j72J25
3153a9o8j07K6J15J9p7P6R1n8k03K03J22j96J07J1O2j18M6J89k47k51L48q9l0
3177d8j52J75J19j54J01j07n3l8k4L30N2k46J58K5j83K48j65Rj81J79J8m8j72
3200a57L1J37M5j80%J5J79k11K35J0j52J70P8nk23J68p5J32k10k3o0rJ5%l8J01
3226b7R8r1p1R1M4k6Lj1K20j49p0l6K54l09j08J26P7QKk5j98P6K79j27j7J5Rj59
3254a22O9L20j89l0J4Pr2L2p8n9O6Q1J9q8k2lQ1m9q8J82j1Q2j00m6L3J18k44J09
3282hK33m03R9N7J15m31K73Q3n2L7j50J90n0j30R5JK6NK15r2j03kJ67o7O0m8k08
3309h8p9J24J45m3j38J75Qr3QPj00l7j6K45L2j13J16n3O1q9j2J37l27M1k9J7K05
$$ y = [240, 140, -109, 185, -83, -91, -208, 37, -64, -114, -116, 93, -229, -170, -38, 188, 119, 21, 104, 13, -43, 22, -5, 28, -144, -19, -87, -194, -168, -53, -34, -111, -35, 56, -2, -205, -2, 120, -76, 31, 42, 104, -14, 32, 221, -26, -277, 71, -18, -48, -200, -25, 94, -60, 41, -66, -119, -157, -181, 149, 201, -45, 113, 138, -45, 203, 38, 47, -134, 45, 63, 15, -157, -126, 11, 56, -124, -124, -109, 70, -141, 94, 104, -48, 122, 200, 195, -28, 140, 65, 197, -13, -36, -96, -105, -90, -90, -128, -27, 71, -20, -91, 0, 44, 18, 21, 10, 230, 81, 11, -25, 229, -80, -188, -62, 15, 23, 25, 0, -198, -122, 157, 30, 13, 28, 37, -122, -53, 267, 78, 48, 62, 69, -23, 9, -69, -128, -62, 19, 38, -50, -72, -75, 6, -43, -131, 51, 40, 122, 22, -24, 9, 127, -117, -8, 225, -178, -79, -22, 93, -338, -65, 18, -34, 3, -147, 43, -7, -137, -42, -41, -15, -10, 205, 113, 10, 8, 175, 108, 168, 120, -88, -167, -43, 102, 59, -79, 96, 104, 11, 19, 26, -74, -111, -127, 118, 150, 37, 153, 100, 161, 72, 60, 197, -130, -89, -118, -101, 104]
3336A04l25K59J0l69K77K35k80J77m0O7j16R7K6Lm3n7M5J9m8j3j23J8J5L5k7n2
3362a06J71o1J90j59J07K19l19j28K25N4l28L2R0J25r3L6l4n3o0R0kj66P8J43
3386E1j6j1K7r6J88j50M2pj10J46n2L4k50L28l6j07j77P6J84k53K29j38K30j92
3410f0J08R6j39o4J50k9k74J76J03j63o0J39K25j49l7N7q7q6N6J9p3J51k6J45
3434A78n7n6j43K17Kj77n6l1J51N7o1L5o2j05J30j30L9J23j65N3m9K34j99LK42
3459A73r4J28p4j34J28j57n3J69j56l4O6O8j49Q0k9M4n8J3J28P8k22M2K43k54
3483e4J20K3k1j3j39pK13j10j60L7J05k36J81kp7J60J3P9q7n6P4R1j43L5O3O2
3509A51j29Q5L6k80J24j22P6j09K32MPp6J6O6n8j77J93J51k15P9Q5k25J4lJ01
$$ y = [104, -221, 38, 48, -321, -44, 191, -89, 88, 48, 115, -1, 96, 122, 125, 82, 25, 70, 89, 41, 28, -95, -77, -62, -27, -54, -106, 65, 4, 194, 35, 142, 361, 42, -86, 139, 193, -135, -103, -13, 112, 19, 55, 21, -32, -92, -2, -4, -170, -92, 51, 35, 24, 51, -45, 143, -7, 35, 28, -82, 64, 12, 46, -204, 124, 88, -19, -196, -120, 64, -189, 40, -98, 132, -60, 48, 144, 5, -59, 91, 62, -212, -36, 67, -96, -156, -17, 208, 59, 22, 79, -8, -94, -38, -19, -92, 59, 33, 178, 121, 65, -78, 139, 141, -36, -92, -123, 28, 85, 24, 59, -3, -108, 22, -108, -69, 54, -111, -58, -107, 127, -72, -69, 173, 79, 207, 133, -1, 127, -30, -83, 86, -70, -104, -38, 30, -119, -39, -68, -24, -82, -69, 59, 137, -85, -43, 200, -54, 66, 89, 68, 55, -84, -91, 122, 12, -148, -111, -6, -242, -61, -63, -140, 20, 33, 112, 25, -31, 43, 134, -9, 26, 89, 151, 22, 107, 143, -137, -13, -135, -59, -168, 64, 68, 75, -1, 15, 81, 23, -154, 39, 190, -25, 54, 139, -86, -72, -75, 26]
3534B6j80NJ66q7N9P7j14p6l1J17K11k04J40K8p4r7R6N9l0o0k14J55m8j62K58
3559B0M5j96m9K25Ok2K0K3l3n4K24j17p2j41K64l2l37L59k1k56K21m1q7L3m0l0
3585h8p9J95M8L8k31j6J31K04j85j0M7n0jn3J86l6m07J73J73j25P3N6k52J05l
3610a07J85j33J04PJ75k36K2mP0j22L3K8o0K5QJ17j61r3N6k0J37J5j65J37q7J70
3636A01q9J3J8r5K6J50j00j49J44j82K1J17J69k58MJ33k15J03N2J83k13M7J13
3659I3M0j83N4M8M5k61J08N3q5L2K3P1j48q0J49L9j48K32j42K27j02O3p5k7Q5
3684A11l1km1O0P2j25j21K77k41m4L3jJ22k94J38J51r8J84j74P1N9J3K8j62l0
3709d5O8o4k0N5N6n1r6J37J75k92J30n7N6J01j36J81p9j37mR4j12J7q1K32k77
$$ y = [26, -154, -149, 17, -70, -11, 66, -48, -124, -155, -38, 173, -31, 109, 137, 63, -34, 62, 121, 91, 31, -183, -28, -76, -238, 20, 65, -131, -180, 45, 51, 29, 49, 72, 39, -15, 209, 92, 20, -121, 143, 111, -226, 133, 112, -144, 77, 36, -51, -18, -58, -88, -167, 28, 76, 114, -117, -133, -2, 202, 17, 7, 54, 4, 3, -50, 136, 100, -307, -134, 39, -86, -13, 43, -209, -104, -107, 78, -55, 49, 56, 231, -5, 17, 13, 83, -39, -6, 22, -38, -13, -5, 112, -49, -142, -86, -106, 31, 46, -119, 18, -69, 101, 12, 25, 43, -52, -26, 124, 24, -125, 19, -163, -142, -25, 144, -114, -110, 23, -192, -89, -37, 146, -67, -20, 93, 133, -50, 4, 52, 97, -164, -56, -3, -88, -56, -33, 38, -110, -190, -41, -2, -150, 82, -60, 167, 65, 128, 53, 26, 111, 80, 78, 37, 97, 169, 44, -77, 200, -41, -85, -52, -53, 69, -225, -87, 64, -34, 150, -24, 47, 106, 119, 147, -15, -45, 23, -41, -61, -6, 50, -1, -97, 40, 215, -77, 53, -4, 52, 153, 17, 198, 119, -18, -22, 72, -40, -23, -104, 128, -149]
3734a49J41J19k08Q5r4J74l10J62J3m6K23k76J19K28k58J56N1j72Q0j5l8P4p9
3757b0j07J05j71J19K2n7j12J12J43o2n6mP2o2K48j90J45j25J1j04K97n0k02J02
3781E4M0Qk50K02P1k79K46J26k17ql1j8j5J49j43O8q6J41Q1p6r8J10q2o8R1p7
3807f1M7R4q2j2o0J77P4l0m04L25J8n5J0n2J59m6K2n6j5kj97L2N0R0j43j3l3J22
3835d1l9J80j66J25j0Ok43J48J17J2r0j7M0mQ2j46O8o8q0P5K17j40M6PM1l7OO7
3863A56j91L0L6p3n0O0Q5k70J09R0L7j66J97k1q4N8j06K42k05R5r2N5L2j36J61
3888D9j04Q1j30J69Mj83m6Q9R1l8j15M2J26j39J59r7P2J67k62J34pP7J02l25R9
3913A5P1j55K9q0J23j62J19J43qk04l0P7j14J67J11k53J61l2kK3m2N9J2l3rJ40
$$ y = [-149, -8, 111, -97, -12, -106, 68, -242, -80, -67, -113, 110, -166, -47, 181, -77, 79, 130, -42, 38, 23, -15, 59, -20, -127, -22, -193, -74, -52, -109, -221, -109, 34, -28, -84, -88, -16, -78, 170, -20, 125, 0, 11, -93, 204, 154, -48, 54, 94, 102, -148, 54, 125, -154, 92, 218, 1, -7, -38, -56, -71, 78, -65, 3, -83, 58, 139, 63, -35, 75, -7, -75, 16, -61, -14, 80, -2, -14, -74, 103, 177, 147, -257, 68, 86, 31, 41, -11, 148, 102, 124, 68, 53, 51, -146, -114, -64, 26, -117, -130, -163, -41, -80, 100, -66, 59, 49, 55, -188, -40, 77, 89, -1, -18, 22, 18, 100, -46, 22, -46, -126, -51, 166, 26, 72, 79, 120, 83, 89, 156, -35, -5, 31, -42, -92, -32, 53, -217, -108, -18, 19, -147, 50, 29, -55, 3, -103, 139, -66, 29, -63, -8, 24, -112, 49, -55, 26, -104, 65, 69, -114, -160, -71, 20, -18, -133, -91, 35, -104, 55, -42, 30, 197, -65, 69, 62, 139, 241, -84, 15, 86, -69, -40, -120, 3, -159, -40, 103, 95, -109, -139, -62, -176, -9, 102, -151, 10, -22, -24, -1, -43, 16, 28, -5, -14, 126]
3939A26q2k3o8Q9J27k55Jm7K16k20P2L42j98n2j48P9QJ43Q8k81m6L2rr2J88LO0
3966E3j16N1O7j92J65K3L8j2k3Jq7L8P1N6k33J54k57K72j6j49J99j41J6k13K46
3991A1OO5k19J03N2n1N9R8j80R9o0J2P2k9j41K2J13Qq3O9m5M2j03j09J97M7p5
4018b0j06M9J25n9N3OJ05j50j85K33r3k32K30j57K22R5l4K1j18p2Q2P6j99J14
4042a4OR4k5n6N6q0K70k00j9n6k22Jk3J33J62k05J13L3n6K70j16k38L44j79R7
4067I0N8j60M2l43J80J69l0p3R5l1K3r6J85k04K2K4L4p5o6J93k15Q6R1J6M4r3
4093c4R9J78l27k2J41j14N6no7K67j68j7J10o3j08J67j24n9r2J11K30j45M9O4
4117A27j09j34o5J52M5k0J20l08J18J3K18j84N0Q1p6j00k2K99j20n3R4p9J12j88
$$ y = [126, 44, 21, -47, 42, 169, -86, -85, -132, 84, -136, -64, 278, 80, 28, -120, -41, -33, 110, 198, -83, -129, -97, -106, -198, -10, -7, 53, -63, -12, 55, -137, 28, 51, 89, 77, 54, 55, -32, 6, 77, 133, -100, 54, -203, 69, 53, -96, 103, -38, -22, -235, 11, 17, 82, -137, -34, 18, -33, 26, 124, -56, 43, -17, -5, 67, 38, -103, -81, 32, 40, -43, 26, -19, 23, -80, -189, 8, 55, -20, -126, -77, 48, -11, 42, 48, 153, 3, -182, 51, -42, -274, -44, -201, 21, 116, 82, 103, -15, -87, -5, 71, -128, -14, -8, 86, 61, 5, 61, -19, 251, 51, 32, -24, -246, -245, -268, -135, 27, -178, -65, -32, -88, 182, 66, -172, 172, -7, 90, 148, -12, 30, -313, -133, 36, 6, -67, 28, -3, 20, -76, 109, -95, -73, -49, -15, -90, -156, 37, -178, -92, -1, 15, 59, -34, 65, 243, -84, -106, 35, -79, -23, -28, -95, 172, 4, -13, 97, 34, -74, 93, -31, -90, -182, -71, 159, 14, 63, 127, 18, -116, -181, -29, 16, -4, 116, -192, -74, -61, 157, -27, 23, 104, 28, -72, -94, 205, 85, 32, 126, 47, 159, -29]
4141b9o1j27K29r4nM4L8J82r8P2j22J15j27p4K29n6n6p1j1k4N3j07M8Q4j41j08
4167b17J70O8pj66K64j66O5J0R0Q7L2j41j28p2J57Mo6q4o2R9j8j7O0RM7j10K24
4194A32m3j89P7j6J21l2K8j91p4L36j06r5Q8k0pk15K63j09J11j34O8J23j54o8
4218a06M9L04j01j26Q6o6J3q8k1KJ02r1P9k6j11l4M7O4n1R7J00rl0ok75K28o5
4245c5k4rj93K83o5O3J15j44m3L1N7o6MJ23j15p0K24j22Ol5j31J93O5q8K3r7O5
4272A5j61LR0K2L4M8J5O1j88N2R8L9j40N1m2q5L0O1k3L1j4M0J9m9r2k6J70j5N4
4301I8k35J86r4k4L7Q7j50J00r6J5P8J12j08n3L18k89j56L37k6l7k09J52mj55
4325a16Q7L8k1J6j50J62J23j34J2J71p5j21q1Q5j0J1rM0o6Q8k4K5o5N3O9j58j4
$$ y = [-29, -90, -217, 12, -82, -87, -43, -5, 177, 79, 151, 29, 144, 17, -57, 172, 116, 60, -11, -22, -46, 7, -100, -52, 32, -109, -217, -47, 21, 14, -152, 112, -54, 11, 21, 111, 198, 230, 89, -39, -111, 46, 50, -16, -100, -162, -63, -81, -98, -38, -29, 18, -92, 132, 89, -100, -23, -39, 82, 50, 78, -113, -187, 149, 43, -52, 36, 16, 9, -206, 57, -52, 59, -75, -7, 116, -38, -106, -57, 247, 146, 20, 106, 40, 53, -35, -56, -54, 48, -43, 36, 10, -101, -135, -88, -24, -75, 22, 122, 113, 83, 77, -198, 30, -35, -59, -68, -261, 22, -43, 20, 135, -9, -52, -21, 36, -30, -26, 97, -18, -88, 136, 14, 20, -15, -146, 47, 112, 24, 47, -50, 15, -146, -143, -53, -31, 3, 51, 66, 127, -61, -9, 89, 128, -12, 39, -3, -88, -58, 3, -20, 11, -3, 37, 56, 7, -85, -111, 59, 44, 98, -137, 49, -45, -69, -32, 55, -95, 5, -91, -76, 2, 114, 6, -47, 271, -18, -174, 163, 137, 100, -109, 43, 39, -116, -29, 9, -12, 4, -146, 16, 139, 5, 17, 188, 113, -8, -89, -4, -14, -3, -12, 28, -38, 50, 26, 51, -14, 39, 108, -50, -64]
4352f4J75j92j6J06O9kj71Q7N0j65L3m1K5J54q1J9J98l65J25M5q8Q3J67q1o9Q6
4378H7j68K10jr5j20k13L32J30j48n2m7L02k49p4J70K0j22PO4J67l09J22r4N8
4402b3M0j7j10L20k82P5j12k9J92k7r7J40j41J09J47k63J65q4o1O3n4K3Q6j17
4426e7lr9M7J24n6k3o8m1R9Q5j05J35j36J85n3O1qo3o5J09p2Q5m2j68p5J15lJ10
4454A8o7km7n0J2J40K8K0l9k0J22k04J81Lq3j38oJ43L7K0k54N5j8J31j37P9kJ90
4482A12q7j28PJ05O8M1j53J14lJ2N5n9J39k09J0j74L8l6J93n3O0j36P2N9r3j11
4508a57J88J34l67K93m2pJ86k62l5o0L54k54n7o3N2O9l4R9kN7l6q6m2P5L7O2j77
4535g5J80k88L91m12J95J71k56J98M7o7k45J8J19J50j35o1O5K1o5J0M2QQ9p2L1
$$ y = [-64, 111, -81, -97, 9, 78, 76, -95, -8, 42, -123, -90, -131, -106, 48, -33, -14, 184, -181, -56, -11, -99, -16, 151, 70, 1, 87, -81, 129, 128, 33, -87, -300, 32, 162, 14, -38, -85, 217, -32, -106, 64, 84, -38, -31, 33, 200, -109, 13, -81, -23, 17, 0, -110, 210, -72, 3, -109, -138, 54, 27, -70, 70, -71, 38, 185, -78, 87, 3, -58, 5, -49, -26, 60, -57, -60, -159, -112, 12, -44, -67, -135, -176, -77, 8, -97, 38, -98, 87, 34, 95, 87, 24, -41, 68, -4, 81, 39, -129, -204, -89, -92, 18, -49, -51, -98, -148, -136, 4, 32, 52, 13, -7, 115, -89, 92, 95, 12, -126, -132, 11, 48, 68, -186, -131, -149, -18, -155, -76, -78, 112, 25, -103, -96, 9, 77, 118, -35, 79, 76, 88, 143, 84, 223, 14, 24, -150, -112, -148, 45, -8, 52, -84, -12, 47, -46, -157, 31, 165, -202, 91, 49, 42, 228, -34, -69, -129, 225, -29, -86, -149, -97, -28, -62, 37, 35, 92, 56, -30, -72, 3, 40, 102, -75, 105, -183, 208, -204, -9, 162, -94, 104, 151, 84, -161, -143, -24, 126, -9, -70, -5, 16, -49, -39, 3, 11, 100, 28, 59]
4560E9j59J29J68k28k7N5j63J29RQ5j80J25j70LJ33j25K6kL77k46R8j04N%L5J
4586C3j80R6n2N1Lq0O1J75j73J95Pj24OR8j33o9J95M6k5r8o5M2j04J06Q2j66N3
4613b0O8j16J58j10k03M27k39P8J1q5J76r5N1n9p7R1J8j80NJ72o2q7n6J90j2k17
4639a73K56R6k23J29k52J38K12k8k85N9J71j5j20N9p7j68J27J18j26rj7J76j60
4662a12lJ88p6l7j70K62p9J75j13j24J37J40j26j5pl7N2j9J2j60J88j75K18j44
4686b5k4Q8l7R2j04J47M3k09r1J29K0P2j42j21J26O3k5j36P6K1J16N7m4p7J54
4711A69J9l13o1K44kR7n4qk75J65l3p6J17j85K15Q2j30L0j42J36L0N8r2L9k1j13
4737a04O9J38Q0j17j55L06k5k13J52k61K5J07L1k55K62N8m0o3Q6j52O3j36K15
$$ y = [59, -100, 29, 197, -31, -58, -3, -166, -37, -28, 57, -123, 2, -168, -165, -32, -157, -131, -133, 244, -2, 96, -8, -3, -3, 32, 33, -147, -51, -103, -52, -49, -129, -68, 107, -66, 129, 136, 12, 18, 116, -17, -86, 109, 155, 130, 32, -33, 9, -95, 11, 93, -73, -20, 48, -68, 90, -20, -223, 204, -35, 43, 54, -31, 145, 50, 101, 42, -35, 56, 74, -106, -101, 71, 9, -78, -134, 56, 44, -173, 83, 179, -44, 85, -167, -29, 183, 155, -130, -71, 100, 85, -35, 24, -53, -221, -94, 24, -102, -111, -128, 48, -112, -115, 73, -3, -40, -210, 52, -27, 148, 35, -89, 48, 188, 62, 47, 40, 3, 55, 36, 48, -112, 76, -99, 119, -25, -49, 39, 2, 94, -10, 137, 180, -29, -120, 9, 29, 101, -41, -162, -36, 27, 2, -134, -58, -37, 79, 136, 92, 15, 169, 188, -125, -186, 58, 56, 153, 99, 91, -184, -19, -52, -128, -11, -196, 19, 101, -29, 1, -141, -5, 25, 83, -9, 30, 9, -104, -35, 103, 183, 66, -89, 217, 192, -21, 131, -130, -105, 2, 33, -222, 40, 98, 58, -5, 81, -71, -8, -144, 71]
4760G1j23N8L9r6j1nR7m1M6r4n6o5J30J92k06o9J75q5N8N0j10j4l0K70j51j83
4786a53Q6R4qk4K07j44k49K70j25N5p8J12J50l21J75j98P4K31k03K07k13k8o2
4809a45J67k27K30J5k56K19j09R4n8J81K7r4j04J27j39J69k19K23M3j27m0N7j69
4832a35J72k2j18L9K92k01j06J92j7k41Q0J52j06J63l6j1j58P0j16J70j08J09
4854F4J0O2r6j4p3jO7p1N0m3J06Mj23P1J3P0K3K0R1k65j9j4K42j40L9j59K62k18
4882d2o8n7J84Q3k71L23o9j68k4J48r4J94k05K37j88J8J3Q9l05Q4L17j48j04Q
4906d5O5pj10j50L76j29k5L3j4N4j1K1j78J25N0R3n3j05j80J88O6p3L2k7rL3M
4933B4j15J32k5m8j59K23O2j97K0L28k06N5j41O7Q6p9n6J32p8N7n2J41k01q1J71
$$ y = [71, -52, 6, 45, -51, -62, -67, 30, -11, 35, -59, -115, -180, -50, 142, -64, -133, 42, -43, 15, 65, -45, -59, -89, 181, 30, -153, -67, 27, 19, -5, 202, 58, -191, 79, -46, 9, -69, 43, 193, -128, 47, -151, -77, 154, -49, 158, -55, -83, -145, 22, -205, 25, 40, -216, 3, -106, -12, -70, 111, 138, 44, -60, 67, -72, 97, -122, 101, 144, 17, -23, 34, -135, 37, 15, -103, -64, 228, 27, -79, 113, 96, -145, -65, 87, -19, 144, 108, 97, -61, 9, -107, 63, -45, 64, 74, 136, 40, 26, -47, -48, 19, -52, -2, -45, 61, 65, -58, 13, 26, 96, 119, 139, 230, -35, -54, -68, 174, 34, 73, -86, 176, -42, -110, -167, 17, 100, -171, 152, 83, -85, -109, 39, -55, 139, -66, 171, -17, 1, 14, 103, -202, -118, 199, 51, -53, -45, 20, 13, -97, -247, 129, 0, -25, 8, -6, 48, 37, 58, -120, 5, 55, 148, 95, -10, -190, -2, 64, -9, 23, -4, -13, 20, 24, -91, 41, 16, -32, -191, 32, 94, -103, -83, 245, 39, 94, -47, 20, 106, 27, -29, 103, 25, 82, 30, 171, -30, -111, 60]
4958F0J7o4Pj13j9J98L9l2k78K65k19L00r2l8R6l48L02j8J35j37p3J33l02J49
4982c2J12j05J27k02M8O1m4K4m7J52j33l4Q5r8K3J27r8p7R5Q1K3m4J09j99o1K04
5008I7k15J26r2N0LJ47k00Q6j73J79PO6K1j31p6j40L68j57M8o9J76k6j4j93R6
5033a6J10j62R3J53k55m7J5O2l2J60j5Q9l4l1n1n1P3j04j61K11n6l0O0j64J51
5058c2K5l9L6l1n9J10j22NO8o4P8J19r8jq7J19m0L6L4lj7j01J6J00L9lk28J45
5086Eq1j2j6M1J07J13j37L8j61n9K35q0l3r4M6R0j26J25L4%j6P1j75j4K23j60
5112c6q4J74o6K62k9j97j00R4Rq6j06K89j66J26k09R8mJJ33n0k17J5K22J30m1
5137A62k6k31J85j43PK06j45M3L0K2j53j63J45K57j51q0K19j85N3J5n9L6q7K9
$$ y = [60, 77, 13, 20, -93, -112, 86, 125, 93, -185, 80, -139, 161, 69, 31, 127, -221, 81, 63, 198, 61, -12, 121, -181, -32, 80, -25, 102, -100, -52, 9, -35, -11, -58, 94, -39, -73, 12, -86, -63, 64, -34, -111, -16, 65, 88, 44, 153, -46, -107, 97, -118, 8, -84, -34, -31, 116, -84, 2, -171, 8, 15, 81, 102, -29, -105, -245, 123, -34, 14, -55, 121, 95, 81, -112, -16, 94, -68, 25, 178, -77, -124, -109, -47, -79, 81, 66, 155, 121, 90, 39, -12, 61, -43, -204, 7, -49, -79, -19, -183, -32, -7, -46, -10, -41, -100, 10, -112, -107, -39, -103, -25, 94, -4, -5, -92, 27, -13, 23, 57, 54, 37, -64, -48, 52, 91, 88, -140, 5, -76, -88, -104, -63, 44, 157, 20, 58, -103, -162, 73, -7, -40, -134, -88, 2, -124, 1, 35, 35, 19, 90, -85, -99, 124, -36, -120, 54, -12, 250, 221, 24, -76, 18, 27, -59, -165, 124, -42, 84, -125, -27, -31, -30, 103, 53, -164, -149, 73, 203, 162, 136, -95, 90, -53, -46, 160, 15, 58, 88, 110, -43, -206, -61, 196, 45, -35, 184, -1, 52, 67, 8, 44, -43, -14]
5161a4Q9l3j43L38l85K24l8j2k2j9J89j06q2L4J70j79oq2K12j40n7P1N5j18Q9
5186C5L9o6L2l4J51k14j05NK28j04j00K58K6j81J18k0j14J92L2k77K7J30l2l2
5210fq8K6N3M3j39J05J29m0j71R1j21P0k9J96k1j45l8l4K43l13J53j3J27k6m6
5235FK6R3j85nJ63r7j1q1L3nj72M05j26j5r1q6J86j04K28n6o4J5L6J9l8p6K7J7
5263D2L1j50J59q6P6l7j27J28p2J84l7k01RP8ONk67K75j87LO7P2j43J25J11j7
5289D7l1N3KJ01o4PL5k74L81j70k6m9%l8J4j37J65K8N3j02M8j61O3L4l6j03J79
5316A9J75k47j5O9K0k4k1j0J27K7k73J26j27Q0r3J37lM1J02j16j31L1o2K93j94
5341f9J37j62J53j64Q9K2r7L08k46K0j2N6l0o6M9r7K70j14P0p9k2o6j31L14q9
$$ y = [-14, 75, 42, -101, 237, -148, 76, 38, 26, 4, -15, 174, 68, -14, 20, 190, 11, 5, -77, 135, -5, -62, 9, 64, -54, 35, 74, 8, 40, 6, 157, -57, -162, -157, 71, -33, -133, 125, 151, -30, 88, 68, -46, 146, 178, -99, -72, 58, 26, -6, -94, -68, -15, 28, -111, -6, 123, 83, -88, 3, -118, -48, -77, 119, 98, -47, -85, -119, 124, -189, -36, -49, 78, 52, 6, 32, 125, -60, -65, 98, 1, -10, -91, -58, -63, -235, 170, 44, 29, -62, -148, 38, -66, 162, 106, 42, 57, 93, 112, 74, -2, 25, 42, 73, -77, 82, -4, 72, 35, -92, 36, -36, 148, 111, -90, -81, -3, 3, 8, -259, 16, -171, -168, -101, -29, -172, -47, 64, 47, 16, 69, 71, 172, 108, 115, 150, -124, 257, 87, 61, 12, 12, -26, -12, -149, 16, 44, 97, -5, 43, -118, -55, -21, -57, -160, 19, 194, -53, -68, 1, 21, -3, -24, -34, 93, 120, -153, -27, -154, -74, -167, -30, -33, 8, 110, -6, -137, -106, -168, 125, -69, 68, -94, 59, -105, -16, 6, -91, 217, -29, -9, -21, 35, 5, -61, -12, -109, 161, 47, 117, 38, 16, -50, -181, 133, 44]
5366D4j09K30k10R7k25J25O1J07j17j04J23K2m8Oj06K57j65mJ1p5J12o9m6Q0J42
5391A39j95M9R2k8K2j95R0j01J92j98K12j78K2K8L6J5N1j8p7J26r6nj36P0K73
5416A90K9l43LK15o7o6J10k89J82o1R2Q9j85K7J49k23J66Q4j32J39k18J32j36
5439a13K3O5J4Ok8J04Rlk28R8R9m2J14j29p5J27O4j41R9j59J55Kj16j28N3j11
5465b41K46j18N2R5J30k2j12k0M6qj6j18K19rm0j88J03r0K72j21K3j71J9J31j48
5490h6p0K19K9Rm7J09j53j3K61k05k5j50J19j50K34q7O0q7l5Q4J61j94k25K16
5514b6j88J54J1J02J36j45J08l9k86J52j8Jp8J11m8Q1j13n8J40Oq2O3L3j24R3
5539a4M3QJ74k04k1J05m4q1Q8Qk50J91M4j34O2r1O4K27l24J58j07K7J42j99J62
$$ y = [44, -65, 165, -45, 52, -173, -48, 13, 120, 3, -101, 22, 44, -4, 2, -104, 153, -12, -16, -5, -80, 32, -37, -83, -3, 139, -56, -7, 85, 57, 79, -116, -26, -127, 65, -133, 79, -99, -77, -49, -13, 2, 53, 35, -42, 84, -12, -17, -153, -83, 190, 219, -124, -121, 94, 27, -39, 71, -218, -36, -97, -5, 84, -101, -74, 75, -148, 18, 102, -30, 109, -109, 23, -113, -90, -25, -11, -5, -33, 71, 80, 77, -151, -53, 46, 4, 118, -11, -86, 41, 105, -36, 63, -96, 59, 61, -55, -183, -130, -241, 5, -113, -61, 34, 164, 142, 30, 10, 56, 48, 32, -86, 133, 124, 84, -104, -1, -91, 181, 60, 83, -88, -69, 62, -86, -156, 63, 92, 101, 54, 163, 10, -3, 258, 53, 28, -122, -3, -153, 81, -6, 54, -33, -68, 16, 177, -17, -242, -26, -214, -60, -49, 53, 189, 44, 152, 113, -173, -21, -39, -38, -116, -5, -53, 28, -85, -143, -3, 3, -79, -16, 17, -107, -14, 29, 37, 211, 7, -14, 91, 47, -34, 54, 62, -188, 3, 47, -87, -25, -116, -52, 175, -149, 9, -98, -71, 71, -128, 34]
5564C4m2J7o0K8L4N7n2R0P0k00n1oP9k7m5M8K5jj09J04j50J2O3N1q5J14J62N5
5592B15l50J46l4N4j32J60k50J54R7k0o1l3J72J3j23j09J03M0q3Q5k38J58l0L7
5616b9P8k06J66j7l6j18L26k18l7O5m1J23l5r0q3K12q5j01J34K5K6j72J90L9j71
5641e5J34j07qO0n0k1j78J68J11r9o9O1L5L14k02j46p4N2PJ05k01M2K2J81j94
5666a12P2K11m8j35m5k5P4J72j75p5k6J14L1M1q1j11N3J0J36l3o7p4J43M9J25
5691B24k05lQ4p6q1L6j5K04j03J6r8j58K03j57L0mR7m9L1j45P6J66K4J47j97J15
5717A62k35j60K56N4k9n3O9j14J92p5l73L84n8P6j68j6J91j00J37j47J03o9n7
5740c0P4L4k21o2Q2M6J64j36J16r0O6j40O9K29r9l6p4J3q7R0j84J46J63q5J18
$$ y = [34, -8, 9, -51, -23, 11, 68, 16, 106, 176, -24, -75, -81, -2, -29, -74, -26, -1, -2, -111, -7, -157, -145, -82, -31, -116, -2, 160, 215, -135, 11, -23, 31, -101, 59, -191, -37, 60, 40, -21, -54, 118, 131, 8, -101, 2, 42, -41, 44, -194, -36, -66, -29, 49, -157, 9, -8, -44, -162, 164, -54, -91, -26, -67, 56, 21, -69, -152, 60, -25, -126, 8, 33, 59, -113, 77, 116, -55, 79, -28, -36, 24, -26, -47, -225, -57, 54, -45, -114, -53, -18, 296, 94, -52, -126, -74, -67, 38, -163, -121, -99, 82, -112, -40, 171, 123, -12, -57, -82, -8, 164, -11, -86, -112, 2, 33, 74, -7, -118, -65, -55, 81, 48, -19, -93, 50, 99, 224, 19, 16, 100, 24, -57, -21, -36, 168, 65, 81, -17, -175, 28, -129, -99, -103, -6, -55, -24, -169, -93, 73, 97, 244, 47, 162, -73, -233, 23, 77, 48, -5, 64, -50, 142, 67, -306, 78, 20, 96, -72, -88, 103, 3, 140, -7, 96, 27, -30, 44, 78, -143, -205, -123, -77, 87, -49, 67, -23, 43, -97, -28, 201, 102, 66, -8, 5, -82, 8, -176, -30, 133, 48, 166]
5765A66j93L4j21N5M7%K8k8L2k5K13k78J94k14Q0J11k06P7K62k18r7J10Q5o0j7
5790C7l9J6J07j31K9R1j4j67P2p8K06j43J14Nj6k19K4K70l73pL44j6j02j19M7
5815f2P2j25L01j06r2J12j36Q4j36j8o6K16mQ2n9L4k90j5K28j21R0n2Q2l9K43
5840B23k27k3n8Q9J50k69P8J69Q1k67L3pk8M9K67k72k6j50K06O7l4j12ok6P0P7
5866E4R3l5m6j03J11j32J18j65K36k02l6K6lQ5J39j95j17K42L5K1k45J88L3j08
5890fJ09q0k7j2n8N5K06k07j12J74j8K9n1L8j68J58Q6k11j7M6l8m5N9K60k45J59
5916H4k53J71PK9j8Qj53K4K69j72L4j97L36k87L4J91q4K5j05LJ37j2j16k1K6k8
5942f8J59j19K4p7P0j1J08L4r9J19m2j66R8j23L8P0J85l48J92k44J68O0M4J5P0
$$ y = [166, -27, 7, -114, -59, -12, -12, 16, -12, 20, -5, 208, -70, 124, -90, -10, 101, -105, -28, 234, 16, -81, 29, 114, 54, 37, -2, 14, 121, -10, 19, 110, 96, -71, 1, -77, 129, -14, 100, 105, 89, -130, -106, 164, -209, -216, 128, 112, 10, -109, -62, 10, -115, 186, 80, -12, 100, -36, 48, -88, -106, -172, 44, 40, 122, 63, 97, -193, -208, 20, -101, -11, -63, 19, -20, 223, -4, -27, -85, 4, 154, -115, -37, 132, 213, -54, -21, -28, -56, -7, 260, -12, -38, -188, 18, 85, 51, -61, -67, -93, -23, 54, 147, 112, 66, -37, 74, -58, 60, -105, 131, -71, -107, -81, -84, 1, 140, -55, -172, 70, 105, 126, -119, 69, 102, -6, 103, 23, -4, -16, -74, -19, 187, -20, -132, 42, 24, 53, 2, 40, -128, 30, 116, -95, -112, -66, -104, -149, -90, 170, -75, 84, -169, 2, 9, 38, 20, 28, -125, -101, 168, -4, 30, -167, 169, -118, -84, 107, 23, 48, -57, -54, 83, 71, -45, -66, -40, -68, 91, -28, -4, -81, -11, -22, 86, 120, 21, 140, 98, -68, 30, -93, -55, 15, 200, -148, 44, -200, -32, 28, 72, 87, 157]
5967A57k40J23l0j32J20Q9J2o4j18J7R7l5J47j28k33K71j75M8O2q9J71M3j59K29
5991A83l80J57Jnn7Q2j73K37M1n7p0L6J32r9j15J5M6J4O5o2M5M9j07J57m2j22
6017b9J37k57J24P5K6n0N2j78K18j86R6p2P5Jj13M3m9R5r7K52k26J9k2J36r9j30
6043a59J85J9p7o1J73J03j81N7j15M5r8M3K33j48p4J40m7O5j10n2R2L2P1j27q8
6068g9J47J5j19N7k63J69N0L0P7OnLj23J14j88J47j38K66j55J9o1P2O3j82K51
6093A73j82O2o6o4j81K17LO2j41J42O8j3j33j2J01k43J93J10O1k60K05j17nj5
6117c5p6J0M9K18r5n6R0j75J54l8k9O2q8J4k05K10q1k6R6K7j8L4N9p2Q5p8n5J74
6145A55j62k6R7J7k38Q7L1k3N7k4j68J94L9j46J13M2j40L9n9J43j52L1K9j6j5
$$ y = [157, -83, 40, 10, -122, -2, 87, 99, 35, -83, -66, 31, -4, 143, 15, -218, 53, -122, -74, -12, -101, 70, 113, -46, 183, -197, -40, -39, -44, -101, -19, -192, 45, 86, 29, -41, -5, 127, 28, -87, -72, -26, -12, 53, -9, 36, 85, -22, 135, 93, -29, 108, -149, -25, 50, 76, 26, 78, -100, 118, -68, 28, -44, 31, 32, -81, -38, -87, 8, -89, 163, -63, -44, -66, 70, -29, -159, 26, 45, -32, -93, 80, 183, 2, 59, -56, -11, -109, -66, 167, 19, -55, 85, 38, 103, -7, -59, 33, 65, 136, 9, -79, 68, 83, -36, 21, -242, -73, -23, 7, 84, 90, 85, 88, -35, 79, -109, 38, -100, 166, 11, 30, -31, 41, 104, -78, 173, -9, 53, -13, -77, -258, -41, -38, 24, -117, 25, 93, 80, -53, -65, 36, -207, -14, 96, 157, -103, 102, -15, -20, -35, -111, -101, -52, 166, 71, 15, 105, -70, 84, 46, 17, 79, -9, 5, -200, 10, -71, -97, -1, 26, 8, 42, 101, 29, 114, 36, -19, 155, -7, -33, 64, 81, -157, -70, -39, -62, -5, -29, -197, -3, 36, -110, 3, 45, -95, -56, -115, 28, -124, -93, -64, -80, -95]
6170i5O7l7J93j52J53j5J0o1r7N3q7P1O6o1j5o5P8R3k18J03J45j61p0K03j06L9
6196C4J00k84J13j28P8o1K08K0p0k3J10j21rr8P2L0Q1k5j89J09K1n3R8o8p9K16
6222H2j26O9j14J15j28J39j31J41r1J02k8m4r3J31j08J52j85J2Q3j18P7m1K06
6245A02j46J2r8J55j60M0L65k38j06J52j07l4O8J3j36J50n7J87j69k4P2j7l8M8
6269C4o5L5K12k14l8o5J74PJ5mr1K9j09L82k33K9j18p5K01k09L0J89j45J20J9
6294A10p5j18L0K5M6l5K2k1J0J02J11k83M0q2O9J39j19nJ79k32J99p2j09Mo7L0
6320a02K06pL3k02J82j20q8J26j2n1Rl7j1O7j1R9K4j42k6QJ51j43J93j05N7J8
6346A16j77Q3J37l5o9q3j59K89j43m1P2n1p8K48j00l3J72k85O5K2j1K9J75k5j25
$$ y = [-95, -28, -65, 128, -24, 129, 114, 124, 63, -34, 19, -68, 3, 69, 8, -7, -72, 6, 99, -119, -16, 129, -32, -102, 101, -5, 34, 134, -150, -37, -165, -87, -148, 60, 80, 10, -13, 97, -24, -33, -131, -59, -29, 52, 27, -162, -53, -32, -85, 13, -55, -134, 82, -44, 25, -89, 26, -102, 37, -94, 47, -44, 58, 30, -14, -107, 24, -84, 68, -117, -105, -22, -140, -63, -104, 102, -44, -32, -130, 25, -135, -95, 270, 32, -74, 78, -29, -63, 5, 18, -118, 32, -25, 162, -7, -31, 41, 24, -14, 34, -31, 4, 216, 2, -36, -101, 73, 80, 95, 91, 0, 29, -80, 302, 69, 98, -20, -95, 106, -103, -73, 116, -29, 91, 110, 35, -83, -53, -28, 18, -17, 5, -16, -6, 96, 207, -76, -36, -118, -49, 90, -29, -34, 145, -87, 112, 40, -69, -65, -132, -102, 104, 97, 130, -72, 110, -10, -98, 28, 16, -35, -26, -63, -74, -7, -18, 81, 105, -37, -63, -55, 96, -47, 146, 41, 98, 116, -61, 22, 159, 124, 55, -28, -187, 102, -41, -82, -10, -61, -139, 109, 9, -24, 148, -137, -72, -50, -61, -32, 143, 118, -7]
6371gj20L6J08o4J38p9J8Rj9J7n3J22l3l5O0J07j89J22k28P2M0k34R5J18o1K37
6397A77k02o0J79p3j37J2K42j47j0Q9r6p0P5R2n8P9J8j42O2L2p2Po1R5j43K76
6423A64l1j10q7J8k2Q6L9k9m3L0j46J0R7J97r3k39J60%K3L6j75J22O5k51K57j22
6449d4n9o6p7K60r4K41k71K29j05K7j08OR4J6P5j84J8N7O4l3k40J77O1Q7j66m6
6475h1Q2o4J98j81M3J9R2j13Rj98O8J68j6K1J43j42k1K17k63m8J00m7j54K00q2
6500e0O4j57L6L4k5P8K16k66O3Q8j77j11K55j08k0J90j88P8j7j87K21k8Mm4P0
6525A9K26l13J67n7j59J72l8l1R6q0J1R4j68n4J49j26J19j17J17P0m9j47J13q1
6549f7K07j27Q1k08Q6J31n2r4J28k17K08l22K52k69K84J2j31K74j63j22QJ69m2
$$ y = [-7, -127, -91, 17, -47, 91, 12, 30, 39, 20, 37, -16, 106, 73, 38, 98, 205, 16, 138, -90, -18, 22, -212, -117, 1, -60, 177, -25, -85, 94, 21, -116, -104, 138, -9, -19, 70, -26, -96, -21, 71, 13, 92, 110, -32, 30, 62, -10, -3, -64, 31, -112, 164, 133, 23, -64, -46, -68, 18, 57, 28, -15, 15, -131, -121, -24, 173, 80, -159, 1, 1, 24, 60, -115, 7, 72, -179, 78, -44, -103, -169, -246, 14, -80, 161, -110, 119, 14, 41, -67, -61, 33, 49, 124, -60, -42, 15, 79, 46, -194, -17, 44, 131, -35, -81, 1, -63, 135, -46, -3, 16, 108, -5, 4, -194, -126, 42, 26, 47, 190, 48, 27, 244, -19, -67, 33, -14, -168, 32, -50, 14, -143, -107, -73, -98, -20, 196, -70, -7, 81, -96, -207, 48, -60, -80, 110, -78, 0, -17, -204, 17, -11, -7, -51, 19, 245, -68, 99, 42, -117, 55, 17, -14, 82, 2, 13, 107, -61, -115, 34, -92, 27, -90, 27, 97, 48, -99, 14, -67, 140, 13, 94, -114, -28, 103, 51, -43, 85, -132, 76, -246, 6, -263, 21, 33, -98, 176, 13, -109, -101, 68, 26]
6572B6jK7k66L91j64j0m9j6R0j09K30j34l2k6N3p9J12j09P7n8O7J51k22k1O2M0
6598C0Q4r5N1o4o9j16J48K26o0j45Oj18R8r4J45J08j62J13n9j56K8J38j0j66N1
6623h8M9J84j16j24J22j28L0rO6M6o1J94mj80L0J03q3k8M6Q2q1k37P6K61o0j34
6649d4n7PJ14J4P6j0Oj61O4M5j8l3j06J99j45J85j90L8K0l3m5K41j45j45n1J62
6675a2Q9j82PlL8j15J53j03J34K0J3j8q1p7J76K5jj15J6m7K95l54P7lN5m4R7K1
6703F1j92J35j16Q6J2j3M7J02l07J40pJ53p9l6R3p1K23j11j54Ql6o3K60k11MJ65
6729I3R7k55M9j12L7J45J02k54M7j1Q1J1j18J70k33J80j30J74R1j83R5m7j44Q1
6753c4J86O8k24J52j56LL0r5K21j55N5jL4l6j64J23KN9j37R1L5J22j81j5j43J21
$$ y = [26, 25, 52, -214, 177, 13, 3, -46, -62, 28, -81, 149, 15, -17, -43, 10, -69, 43, -66, 11, -47, 20, 171, -51, -72, -10, 30, 114, 19, 70, 6, -63, -179, -31, 195, 135, -10, -4, -122, -24, -118, 27, 135, -27, 86, 27, -129, -101, 37, 27, -139, -88, -39, 145, 29, -95, 27, -101, -71, -80, -14, 32, -29, 165, 161, -19, 11, 114, 31, 3, 49, 131, 50, -187, -111, 150, 90, -44, -101, -94, 20, 34, 110, 100, 106, -55, 9, 54, 36, 3, -103, 96, -49, 136, -54, -16, 4, -29, -74, 167, 22, -123, -174, -12, 77, -105, -98, -101, -63, -178, -25, -128, 6, 26, 39, 21, -60, -137, 39, 64, 63, -52, -36, -83, 212, -142, -65, -68, -13, -57, 40, 61, -131, 4, -112, -26, -14, -27, 20, 122, -185, -45, -52, 101, 22, -14, 79, 8, 231, 120, -34, -26, -62, -125, 135, -76, -72, 93, 190, -65, -16, -128, -91, 54, 156, -98, -51, -62, 19, 30, -88, 82, -151, 29, -101, 73, 164, -19, 76, 29, -115, -34, 152, 220, -4, 148, -8, -5, 25, -70, 151, -4, 51, 50, 84, 48, -116, 7, 9, 68, -69, 22, 57, 179, -2, -17, -160, -39]
6779c9J46N0j65P9j33J02o0R0j59J64k29L15k14J39j96M3o3K50k23J21j2R1k15
6802a18J44j9k0R9J88l96J12o8j36K15J41j13L1K5j63Q3p2J17K9n0m7k0o5L43
6826B40k74Oj01K19P1j14n4P5J5p9N0J69k08j7K8N2j23l6j9j6K72%n1p5j38J79
6852G1J28j01J0j57j6J9j12J59LP8j2j26L50k73N3j35P4N4J05j02k56M24l27l0
6876a19J69j65J18m9j3N0J16k89K10J5m7j1J27PJ1j12O8k9r9J49p2l0J06q6j66
6901a41J76J71j74n3J04n8MJ26N7l69L29j61L8j92k6R1J59j9r8l4m4J41o7p6j04
6926b20J95J0K08k21N7o6pJ27k28J68K5O9j50M6M1K6j98J11j1r9N8O1M8j2P5j76
6952f3N4Q3p7N2jm7l6p2q1l5J79j04L2l9J80j0K48k39o9J56j98J29P1j79N4J00
$$ y = [-39, 107, 157, -8, 71, -62, 40, -20, 70, -89, 75, -154, 161, -53, 86, -110, -67, -130, 120, -103, 18, 6, 97, -118, 26, 7, -13, 86, 274, -122, -10, -78, -214, 1, 142, 29, 60, 85, -78, 5, -67, 50, 79, 29, -18, -38, -103, 240, -34, -28, -129, 90, 161, 47, -7, 68, 83, 4, 54, 223, 15, -2, 26, 78, -45, -81, -100, -116, 156, 156, 105, 30, -108, 71, 199, 98, 108, -49, -65, -46, -158, 1, 4, 82, 70, -56, 294, 21, 74, -61, 13, 67, 172, 70, -186, 238, -89, -119, 50, -115, 3, -46, -59, -9, 107, -182, 28, 43, -4, -15, 112, 119, 130, 18, 86, 57, -42, 107, 35, 5, 111, 25, -141, 35, 206, 32, -21, 83, 25, 29, 155, 212, -157, 172, 11, 49, -143, -169, -78, 81, 62, -36, -70, -114, 27, -40, -116, -220, -25, -15, 193, -28, 29, -37, -44, 83, -145, 23, 48, 117, -33, 13, 54, 80, -118, -7, -18, -117, -59, 2, 50, 38, 113, -63, -9, 74, -3, 49, 48, 1, -35, -107, -188, -223, -44, -148, -116, -155, 25, 15, 263, 24, -45, 111, -87, 42, 113, -66, -12, 88]
6978H8O9q0k2p5o5r9J80j53J79M9j39P3k2k0n3k7K28j52Q2j1q3J0q7J14j36M8
7004a04J49mp4j04K47J05k20n7P5L5m8k6J05Pj43M1J09n4m9j42J10K7J56k70j54
7029b83K57p5K03k27j1L15j90k44L64k15K76k07j0J24L4j46j9R1o0p2J44k0q3
7052e4o1J84O7j54kj07J38LN6k05J36j22K22q0R0j07l1P5k1J72l52J4J95j67K8
7077h3J79p1p3N2j12J19r6J46qL4K06m62K22n1j36j9K6J91L0k60J14J28j13J44
7101A07l69J11O2l9O0J65r0J70j78m5pJ37K5n6Q5p9J5k7N2o6j78J77r0M5n5J0
7127e8K7J1o6N4j7o3J57j81K4J24l7J33j86pJ44N5j60RK14k60J15j85K08j64Q8
7152b1J59k0q2N7j73J20j0Jo3jL0q9R9lP7j6o2j9o6J91j29N4j01J61k59K58o3
$$ y = [88, 157, 77, 55, -20, -85, -184, -4, -157, 22, 71, -68, 5, -17, -37, -90, -117, 111, -41, 41, 30, -53, -43, -130, -16, -152, -104, 45, 41, -33, -137, 110, 215, -5, -62, 13, 48, 0, -26, 79, 86, -57, -16, 93, 39, -10, -152, -42, -15, 141, -129, -283, -26, -101, 102, -125, -136, 179, -11, -255, 109, -106, 170, -37, -47, 77, 111, -35, -54, 37, -23, -95, 49, 29, -54, -115, 69, 136, -18, -20, -127, 11, 14, 70, -135, 1, -121, 101, 21, 111, 4, -27, 48, 27, 199, -153, -139, 56, -111, -83, 96, 25, -48, 4, -108, 11, -85, 61, 53, 87, 293, -169, 53, 2, -134, -153, -127, 64, 94, -166, -52, 76, -37, 107, -262, -151, -89, -128, -68, 97, 7, 177, -1, -46, -53, 84, 109, 53, 138, 59, 74, 47, 99, 33, -145, 32, -58, -13, -68, -58, -31, -20, -86, -32, -49, -112, 45, -136, -112, 12, -25, 108, -78, -85, 59, 114, -46, -37, 177, -83, 32, -153, 55, -109, -21, 138, 118, 36, 93, -80, 40, 30, 31, -32, -33, -3, -92, 7, 4, 81, 65, 3, -16, -82, 109, -20, 34, -67, 94, -165, 93, 30]
7179C0p0No1K9N5J8p9N7p4J06J49o0Rk08M7L4Q8r6m1J5J26j46k5K46k53j9qJ20
7207fJ46j37j8J20j31L5j6l0p4J77n9n8o1J13j38J72M7j02n7k1R5R2k4j06KR8
7233E9j92J56j02K80l55K22k5j05K03j4M1j79J15j42P6P6L3k80L8J51p5p6K30
7256A35j31P9Mo8j58K15p4L2j9k6J53k27J41k14J51L6k2l5mJ78j45J29m1j0j59
7281h0J15Q3k7j35J38J0m4p8p9J75k0mk1p3j23J36q2J19j21L11j35j96J85p3p2
7306i1J29j03k0J41j00J37P2k26K69k73J04j1q2k7m1K04j45j7k1O5l2k5K55j50
7330A2kN0p3O5p7L0p1L27j67j34o4P6k00L59m4k91K65k13J15NP2J20j08l47L15
7355B0J16q0p4K3o6N8j20K39j39N3o0P3J14j93M9j51O6O6j7J49j78j2O8N9lk33
$$ y = [30, -40, -35, -96, -67, -12, 6, -73, -16, -90, 16, 165, 105, 114, -94, -47, -13, 75, -21, -62, -47, 79, -67, -92, 154, -99, -118, -126, -6, 140, 3, -15, 105, -26, 9, -7, -37, -111, 66, 7, -51, -112, 1, -137, 35, 82, -20, -77, -98, -3, 89, 65, -41, -39, 59, -133, 23, -79, 201, -154, 68, 43, -62, 141, 127, 168, -11, 104, -38, 38, 114, 147, -133, -95, 56, -19, -95, 135, 4, 83, 87, 19, -139, 76, 2, 34, 15, -11, 142, -85, 56, -158, -7, 29, 7, -28, -32, 146, 1, 130, 89, 79, -80, 35, 118, 91, -44, 94, 104, 60, -18, -97, 78, 58, 54, 33, -40, -163, -27, -109, 10, -111, 200, 65, -131, 54, -19, -91, 38, -65, -85, 56, -44, 93, 165, -61, 208, -65, 39, 28, -54, -81, -122, 82, -63, -80, -101, -36, -68, -93, 162, 12, 10, 60, -13, 52, -25, 5, -66, 261, 94, -40, -104, -28, -228, 131, 87, -204, 61, -152, -37, -32, 40, 160, 52, -295, 20, 136, 56, -18, 5, -61, -3, -123, 116, -23, 30, -30, 43, 157, -36, 13, -138, -72, -6, -23, 126, -52, -64, 4, 63, 60, -173]
7381a73K87j5K3o3L1j70N8M0J2P1j13p1K20j95J45r5j7J58p6q9j03O7K1Q1L5o5
7407DP4m1O5j02O7J4j57o2P2J07k5j42J73K4J0R3l1k75P2m2L1J11K7j02j83K90
7433G2l2o4k4J02j38L9J68k56L09k12J15j14O1J0Kj37J18q5m2J77k12J60N4N2
7457A23l1p4kk26J70j20J59j3m5K48j73k2J1k04J22J54j12P4J85k24l6O4J9j14
7481f7j6J96p6j29K5J75r2M1o4K6L9o1jqm9q9L18j14M5k41K85j80R3j11n4R5K0
7508FO4j00O5m5Q9k42L30l38K60p4J24l03J67L3j47kO1Q4np3P5j29j8J82p3j14
7534a23R8Q9j38K00n5O8n6k4ko1qJ0J77k60J86Qq0Oj30K44O8l29j4J04k8R2Lr1
7562d6Q1M2j51J26jk31J49Q9j89J30p0RP9o7K21O0k03j6P3q4O4N7r4o9Ll8q5J33
$$ y = [-173, 114, 99, 122, 59, 90, -80, -22, 18, 30, 101, -12, -83, 137, -58, 87, -8, -25, 133, 57, -32, -135, -68, -47, 34, 69, 4, 78, 37, 102, 0, 67, 81, -76, -138, -66, 41, 16, -126, 47, 71, 81, 174, 143, -132, -60, -102, -71, 40, 67, -35, -218, 72, 40, -24, -48, 54, -84, -45, 123, -133, 176, -36, 79, -35, 26, 36, 38, -99, 19, -66, -108, 69, -143, 17, 71, 123, 92, 18, 16, -210, -40, -160, -1, -14, -59, 189, 16, -6, 5, -199, -77, 77, -35, 39, 224, 0, -36, 28, 47, -67, -83, 113, 37, -92, -67, 108, 16, 57, -7, 19, 58, -3, -4, -12, -61, -150, 168, 54, 99, -142, 143, -37, 56, -55, -109, -14, 6, 70, -30, 35, -10, 79, -163, 167, -171, 89, 15, 139, -164, 3, 36, -111, -113, -52, 32, 27, -46, 29, -100, -118, 64, -9, -123, -25, 64, -74, 126, 71, 139, 83, 59, 57, -4, -12, -2, 175, -85, 101, 109, 29, 35, -95, 149, 217, -112, -126, -22, -50, 42, 45, -46, 35, 77, -74, 52, 51, -180, -31, 58, -131, -1, -71, -62, 17, -50, 171, 231, 28, 12, 85, 1, 65, 122, 28, -41, -38, -76, -161, -28]
7590b8L01k45jm7J2O7k26J48J45j20L1jj4K03q9r2l42L45j32J11J34j46r3L4j1
7615e6R2j18L3J94k52J76p3l7j09K57j64J68M6k86J04oO3L0j68N3K4K5L9M4q4
7640eo0K3l3J9J41j29q4K3K05o8J02k72OQ6O5N4j58K0L6L5O7k00J08J28j40M8
7666A7Q8l6k19J61lP2j21L9r8Q2l1qL0j60L6K35n2j66M1P7j8N6K8j25J65n0k2
7693A8j39J68j59K45p6k8P0j12j5l1J17m4p0J34m3N6K8j57m0ol6J22J16p7j45
7718a04J33j34OJ46Qj80J51q5rP3p9K33k76K2J94o1J28r3j49mK9j18K94Kj09m6
7744b8r3N5J01q0j14J36l7P7J48k69J75m8Q6j18k1k7M0J22j34m0J96j43j9q1R3
7769b3n5J45j07J19p2P4j38LL8kRl5J98k29J58q1j8p9J46j26N2J20r7PR2Qk11
$$ y = [-28, 273, 28, 27, -20, -8, 59, -167, -19, 126, 6, 37, 36, 22, 225, 136, 44, -298, 47, -85, 26, 160, 14, -79, -45, -56, 36, -82, -49, 145, -107, 69, -4, -41, -150, 107, -57, 111, 157, -129, -25, -31, 32, 62, -106, -53, -29, -4, 35, 79, -5, -65, -42, -75, -56, 85, -44, -128, -105, 100, 32, 134, -138, -132, -46, 19, 73, -85, -65, -29, 6, 73, -127, -19, 109, -31, 17, 105, 69, -150, 11, 8, 80, -41, -2, -100, -18, -49, -57, -27, -187, -151, 84, 32, -134, -93, -16, -34, 22, 50, -75, 90, 40, 18, -121, 47, -112, 133, 57, 29, 99, -13, -28, -59, 58, 14, -56, 78, 35, 91, 119, -38, -78, -84, -120, 2, 118, 41, -104, 29, -105, -99, 47, 55, -125, 26, -59, -68, 5, -74, 159, -117, -95, 99, 38, 166, 73, -76, -80, -51, -169, 125, 127, 18, -28, -121, -66, 35, -45, -159, -23, -60, 17, 165, -104, 71, 23, 109, -9, -30, -57, -17, 105, -29, -69, 127, -16, -35, -116, -23, -78, 67, -40, 79, 7, 81, -57, -54, -16, -18, -9, -44, 154, -75, 83, 2, -16, -95, 51, -75, -23, 97, 0, 7, 99, 107, -104]
7796a04P2j11J35K72l84K9J44l14K56j0QP3p1j10K49m9p5J48k53jL4J05o0j29
7820a46K05n6J44j31j06K32J1k03o0K70j96J21O5k06J20j75J7qK52k93P7O2r7
7843a01J73K6j19m2j02J17l0J39K5k23Q9m7P4k3j32J87j62J00R7J12j36k7J66
7866A61p1j55p6J36j03R6N4j47N8j6jL8J84j54j70J33m9lJ1J03Q0j75p5K26k14
7891a29J59m0RJ0j31J89o5j61R5J40L6r2k83K30l0P8M7P9J1j08Oj52J01j68%K57
7917H8k35K12k54K06M1j64J79J38k22J17j04P9r9J37N4l33J39J03Lp0l3K7M3k9
7941B3p9JJ40P4j57J3J44q1o7K7o7l8P6K7M2j75R4K91l72l1J61P9j39l0R1l3O4
7968G8LJ06k33%m5J16j38M1J68m5k1K1l8N7j60J53O9n9j07K4J84k7q2p4k6J2j57
$$ y = [-104, -32, -143, -8, 264, -120, -91, 53, -261, -5, -15, -7, 66, -5, -115, 134, 85, 10, 158, -95, -96, -62, 43, -17, -146, 59, 3, 147, 16, -90, 142, 153, -50, -110, 160, -36, 85, 150, -56, 64, -111, -94, -102, 150, -143, -66, -4, -101, 72, 98, -21, -63, -165, -48, -78, 61, 86, -137, -48, -95, -21, -44, -176, 11, -151, -51, 46, 158, 22, -5, 161, 90, -65, -141, -5, -108, -12, 42, -105, -47, -63, -64, -26, 158, 4, -166, -33, -82, -85, -74, 29, 109, -66, -141, 85, -129, 30, -10, -1, 9, -122, 67, 2, -159, -64, 76, 112, 20, -263, -33, -63, 15, 62, 141, 152, 44, 50, -102, -1, -169, -169, 88, -147, 65, -189, 17, 58, -106, 73, 211, -11, 106, 2, 81, -18, 119, 173, -160, -21, 82, 85, 15, -18, 9, 52, 23, -56, -55, 85, 159, 2, 15, 159, 78, 11, 38, -29, -67, 9, 36, 78, -97, -3, 288, -84, -115, 46, 125, -14, -44, 47, 14, 78, 81, 187, -46, -46, -91, 25, -113, -72, 96, 51, 30, 51, 13, 70, -90, 63, 132, 73, -34, -10, 174, 147, 65, -9, -35, -23, -180]
7995a80O1K28j85K5K5J63l81J76J83j38N1K3n7n5J9K07k27K01Qk18j07J52K3J
8019bM8j30KJ02q2J18o9n0o0J21j53%J98j18k5N1J52p2R2j51j0q2K46k20J56o6
8045dPK8n4OOJ62k49p6K7K93j07j87K46j83O3N2j41J11L1j93P9J38n7n6K36k41
8071f3L07k68K0N8J05j91J1k4l7N4K0K9R2j46J1P3j29J47o5O9k9j03J89k12J62
8096H0j62qL25k78J65j5o0N1M0J0m8q2m7J2L0Q0k66K34l0j15J1J12n6j56K95j91
8122f9N4n3J05j08j3Q3LN6p6m3J49j07J11L5M4k29J19j15N1P6q7j03R6J87l06
8147a40K03p3M2j93J28k4r3L0j02J56o2j7K66j20k10J90J72k34N0P3n7QJ13k54
8171a48K01m7Mo7K34j61k02J54M0J1n1K06k13J47ok1j01j25K53L2
$$ y = [-180, -119, 109, -76, -51, -26, 137, -244, -68, 115, -23, 28, 51, -6, -61, -42, 165, -62, 139, 147, -71, -178, -26, -3, -2, 46, -84, -82, 20, -62, 56, -13, -63, -123, -2, -155, -155, 43, -75, -100, -49, 103, 31, 123, -28, -38, -120, 126, -94, 62, -4, 3, 31, -23, -17, -11, 151, -98, -174, -147, 146, 39, -148, 98, -85, -22, 30, -111, 0, 31, -162, -83, 55, -2, -58, 178, -63, 244, -24, -4, 54, 159, -32, -21, -45, -82, -28, -8, 21, 113, -33, -22, 51, -78, 69, 4, 73, 44, -59, 130, -82, 80, -82, -90, 235, -43, 122, 107, 47, 98, 138, 148, 100, 18, -29, -17, 13, 93, -173, 61, 31, -84, -73, 39, -17, -173, 122, -69, -15, -68, 37, -71, -84, -1, 2, 58, -18, -61, 88, -19, 92, 127, 171, -58, 61, -54, -3, 73, -14, -117, -21, 166, -140, 63, -10, 32, -161, -33, -57, -150, -120, -222, -66, -128, -145, 121, 1, -209, -19, 153, -81, -31, 42, -15, -7, 106, -148, 53, 6, 10, -57, 177, 16, -186, -32, 8, 19, -32, 174, -39, 108, 102, 81, -20, -145, 108, 140]
8191A40
$$ Imaginary data points
##PAGE= N=2
##DATA TABLE= (X++(I..I)), XYDATA
0@%%%%%%%%%%%%%%%%%%%%%%%%KrJ5j6J6j6J6j6J8k5L1l2L4m0M5m9N6o2O7p5Q3
45D3r2J03j13J25j38J51j66J82k01K23k46K74l07L40l80M30m87N61o58P87r67
66e36J243j735K872j4035O725P558n774P44L192J025l661L002L620j360l274K968
82B574J580k961j542L205r36m224QK922k184k757K140K098k799q94L816J228k711
99a437J106L656q27k581K078K435k694k113K458M23l996q78K892r74l733J236
115b949K921j942j939L410J922k587L4L599L07k682J417K931k187l066K263J478
131B930l532j530K675o67l447M65L131j464k196K412K525k209n59L585Q61k673
147C07L20L199j407k452J131J708k881k271K305M87l072k62K540q49k182J688
$$ y = [0, 0, 0, 0, 0, 0, 0, 0, 0, 0, 0, 0, 0, 0, 0, 0, 0, 0, 0, 0, 0, 0, 0, 0, 0, 2, -7, 8, -8, 8, -8, 8, -8, 10, -15, 16, -16, 18, -22, 23, -26, 30, -32, 35, -40, 43, -49, 54, -59, 66, -72, 79, -87, 95, -106, 117, -129, 145, -162, 178, -202, 228, -259, 302, -356, 431, -536, 707, -1028, 1844, -12191, -5466, 2092, -3682, -2938, 254, 1279, -2382, 620, 4240, 2880, -394, 2574, 4154, 1193, -349, 2856, 1920, -2304, -2296, 626, -1558, -4315, -2175, -77, -2876, -3770, 46, 1274, -1437, -331, 3325, 2498, -83, 1995, 4430, 1736, -377, 2081, 2504, -1492, -2370, 522, -452, -4185, -2949, -28, -1970, -3909, -499, 1423, -1164, -1130, 2469, 2776, 94, 1511, 4442, 2255, -811, 1452, 2930, -602, -2132, 543, -124, -3571, -3106, 25, -1439, -3635, -1223, 1302, -907, -1466, 2119, 2980, 307, 627, 3826, 2419, -33, 1098, 2806, -75, -2346, -41, 446, -2626, -2888, -348, -1197, -3379, -1691]
163a691K550j319j301L011J540k289k06K875k60l050P50J929j844k599J865Q79
179H40l120q35K474M0k418P53L168j075j827K557K059j753p06K605Rk565J10K308
197B624j406k570Q95J188k399j329K208O22k536J43K721m35j458J804K369j452
213I89j292K365J005k191n65J793n17k756O03J595j772k013J615J026k328k85
229b728K776K41j823R86K520q98j382J821J467j927j120K058m3k637j57J794j371
246d23k277J253J500j682j043K276P84k070M53K797k40j637J333J818j643j286
262h7J661N12k191p29J732q55k155O28J608j320j408J700J118j462KK496N1j624
280c23R22K020r02j681J333J005k341j005J810Lk474Q0J239n59j597J212J872
$$ y = [-1691, 859, -460, -1761, 1250, 2790, 501, 295, 3170, 2910, -140, 610, 2539, 695, -1904, -39, 840, -2280, -3115, -641, -601, -3019, -2266, 902, -173, -2000, 557, 2616, 863, 157, 2762, 2771, 206, 316, 2624, 1218, -1352, -457, 731, -1668, -2997, -789, -167, -2703, -2560, 161, -274, -1732, 72, 2441, 989, -303, 2062, 3067, 876, 311, 2104, 1587, -1169, -566, 1029, -743, -2756, -1141, -115, -2443, -2728, 48, 289, -1534, -548, 1972, 1074, -308, 1513, 2980, 1053, -67, 1991, 1948, -689, -846, 948, -423, -2700, -1447, 53, -1629, -2672, -396, 388, -1682, -1229, 1568, 1328, -309, 1024, 2842, 1199, -87, 1574, 2086, -105, -834, 898, 43, -2112, -1484, 124, -1196, -2604, -904, 214, -1248, -1246, 1250, 1301, -323, 599, 2619, 1717, 36, 1369, 2374, 33, -972, 838, 841, -1633, -1553, -314, -873, -2470, -1258, 614]
297F14j656m87K139O98j516L42K277n20j883P58J414j602j488J347L22k310k52
314a803J763m82j852P94J773j110o74J795J085j245o1J946k02j651P18J231j218
331H07j575R97O73j728r28J556k6j848K90J905m64j255J273J546j319l51J936
348A489N83j779L0J542o71j692P94J046j779j361J445J86j457k2J430n6j440J090
366f22J634q05p22J703O74j433j15J301j81j623J65J216j384j293J006N81j476
383a374n02J475J47j355P44J837o29j061J334J198j251m26J449j06j711P5J206
400A050p35j499P23N96j395p81J494M49j222K96J544j93r35J115J372j126p42
417A1J223L57j240n06J347n35j621K29R51r65j004J134N13j264Q5J570J67j083
$$ y = [614, -1042, -1529, 610, 1308, -208, 134, 2411, 1891, 8, 766, 2180, 578, -910, 437, 759, -1551, -1803, -40, -522, -2374, -1580, 193, -917, -1591, 204, 1289, 44, -17, 1929, 1727, 76, 794, 2025, 807, -768, 229, 902, -826, -1754, -198, -224, -2072, -1782, 123, -341, -1596, -323, 1223, -96, -447, 1489, 2072, 293, 323, 1865, 1194, -498, 296, 1342, -437, -1798, -353, -167, -1624, -1646, -216, -272, -1712, -622, 1012, 207, -515, 1188, 1862, 429, 314, 1615, 1434, -189, -24, 1192, -192, -1485, -479, 102, -1374, -1876, -401, -254, -1609, -865, 972, 343, -718, 616, 1814, 563, 137, 1586, 1480, -231, -156, 1050, 315, -1184, -461, 135, -1260, -2041, -547, -98, -1320, -1024, 520, 327, -608, 507, 1879, 753, 11, 1234, 1591, 351, -155, 1192, 657, -964, -735, 216, -749, -1753, -619, -106, -1370, -1285, 285, 452, -631]
435f31P36J391n44r02R51O89j261n89J171l43j485J30J034j029r93Q16Q71j134
453a122l06J407M95j126L08J608k53j135R49Q88j107r56J198J06j525j49J045
470C25n43j431O77R53q45q11J486N29q71J44J457k91p94O22J045q90r61R09M25
489A135j422m29R62j88j444L32J124p47q49J032R77r62l30J506K71j016L60J396
507A708n92j214O08N84j066o05P71j53j266K5J159l47j033P60P78n98m82J447
525D84O75j031K9J300m13r59L92Q21j111j162J122K74j456j31J088j28j352R15
543f43P91l29o80J146P26r23q5J350j23j189M16Q84q90r60O49L14j079o52J023
562b54J2r88L04Q88j19o63P80Q08n30m27J248J71r80O5R03m25j379O64N11r22
$$ y = [-631, 105, 1496, 952, 50, 1001, 1690, 429, -160, 1011, 668, -817, -687, 347, -682, -1675, -859, 12, -1122, -1428, -21, 474, -652, -344, 1264, 1011, -124, 825, 1713, 606, -350, 848, 954, -571, -720, 325, -218, -1649, -972, -19, -864, -1675, -189, 340, -531, -387, 1070, 779, -15, 607, 1652, 762, -199, 710, 1135, -287, -716, 246, 58, -1386, -1054, 70, -677, -1526, -494, 483, -479, -809, 697, 968, -48, 312, 1708, 1116, -98, 510, 1094, 28, -577, 194, 41, -1225, -1200, -41, -388, -1421, -661, 117, -481, -963, 484, 1159, 128, 157, 1457, 1044, 85, 477, 1298, 187, -975, 147, 421, -1035, -1166, -78, -206, -1558, -643, 148, -181, -861, 285, 1011, 88, 3, 1353, 1230, 41, 457, 1341, 451, -509, 140, 454, -625, -1277, -254, -242, -1230, -926, -38, -157, -820, -40, 768, 238, -189, 1059, 1230, 250, 315, 1218, 793, -586, 78, 589, -333]
582c33j023Q57L54p86k99J186k13o98O75J079l58p30J030M95r17l74J103j41j304
601c97K32P11n93q81O06N08j117k22J064k8q26M78J054j63o86Q46O71o93m86J031
621A109J0j201R1O63m23j221L66P82r48m83P12P32j070L4J188R9p47P42P55n19
641F71p85R81J58q54j02M19k89r95J96Q02q00p40R81J58m46j7J047P9o86L40R20
662A038n16m39N58N01r60m07P40m9r47k41P68m14q75O45N51k94n55Q87N61j015
682d63N56P60k4q58N71M59n20n54N27M5r48l29R02j38j141N70M46n72j86P29O19
703D51m75j47Q65J80r02M21Q53p09o66M51L94j027m16Q60q2j014J34R21m89n50
723i47O18O51m85n8Q50J68o59K34N01k81o57L12M44o45p69O42J03q77p2Q19k07
$$ y = [-333, -1356, -499, -145, -931, -1230, -44, -257, -955, -280, 799, 441, -289, 741, 1236, 319, -55, 1048, 907, -397, -165, 546, -47, -928, -322, 186, -931, -1153, -89, -117, -943, -465, 589, 426, -260, 586, 1257, 564, 78, 1109, 1119, -82, 9, 672, 249, -972, -606, 176, -772, -1255, -543, 189, -881, -847, 341, 440, -307, 435, 1190, 671, -114, 867, 1025, 171, 69, 488, 199, -796, -600, 202, -598, -1338, -357, -199, -645, -662, 385, 464, -222, 118, 1038, 522, 83, 641, 1142, 182, -225, 515, 466, -481, -722, 46, -368, -1243, -598, -47, -341, -896, -9, 552, -463, 93, 853, 829, -29, 542, 1001, 481, -73, 454, 499, -449, -778, 124, -14, -1155, -585, -139, -711, -897, -168, 451, -24, -171, 694, 874, -28, 393, 1246, 537, -129, 322, 716, -311, -727, 133, 51, -963, -829, 92, -397, -947, -329, 322, -163, -221, 629, 797, 138, 372, 873, 592, -65, 247, 691, 46, -723, -81, 22, -855, -927, -108, -315]
744c15p69O64O54k79l24Q53M26p72K0O95P1j015L24N39n96p98M58K17p24l16O05
765c82R2n70K01J077m90m35P16M93m43k52Q32P2r65J94P16n20q68M31M46j096
785g51j71N23L96q27R6Q09k91k29M40O37k52l52N93K88p83rN71j99q60oP81o76
807b72n43M46L32p04j14R14O4n63L39O78k82l30O28L51m54m41N14J08q75p6N48
828B68n04m46K24M79p33j25Q10J13n76J23Q37m8m75L25M73k79o63O72L09r63k85
849d64P90l87p57L55M58l77o11P81K83n33O6Q54n9m88K52P46m07n61O75J80q24
870b8k60N35O9r94J11N81m80m60N84N90o43l4P50R1n89K33R38m06n04L23L33n70
892A70l15M83Kq44j96N70k22n27L03P18m97k20O07L06n41J08Q45n5o65K61O63
$$ y = [-315, -1084, -420, 234, -45, -369, 484, 910, 138, 158, 853, 924, -91, 233, 772, 176, -622, -164, 53, -671, -987, -382, -290, -860, -659, 418, -72, -507, 209, 702, 259, 7, 839, 911, -54, 140, 856, 336, -532, -101, 345, -751, -922, -399, -3, -830, -734, 75, -216, -445, -5, 632, 380, 28, 621, 909, 126, 117, 688, 489, -371, -377, 404, -272, -815, -369, -37, -741, -855, 59, 123, -440, -101, 577, 295, -35, 593, 944, 490, 49, 563, 671, -204, -280, 268, -236, -682, -458, 21, -712, -837, -27, 86, -490, -367, 470, 422, -53, 272, 745, 466, -197, 475, 784, -179, -464, 326, -61, -818, -463, -5, -382, -993, -212, 71, -462, -396, 458, 399, -89, 163, 909, 502, -59, 616, 796, -28, -288, 247, 316, -678, -567, 14, -466, -926, -342, 248, -395, -429, 321, 412, -177, 56, 994, 588, 84, 407, 740, 170, -145, 338, 340, -504, -700, -130, -352, -879, -576, 142, -355, -575, 32, 338, -203, -95, 750, 695, 30, 291, 954]
913I54o23o12M90j41n70k05P73k09o84K20O21k18j74L30N42l35m08O64L11o24
933A02K15M38l52p16M43K71o43k18N18n5p51j57Q24j19m31M61N28j94l41O81J73
954F77k89k29M69j18p60L29L74n06n37L31K39o64n8N77J55o63K25Q12k73j73M64
975C82L60n46p9N05j93n01J81L20n49m20L94K71n44m16O92J67n67O1M71J29l75
996b57N41M05l23l09M83J85n08k83M03q7n22p2L61m83k15M21K23l22j05O48q8
1017I6l44L62M71k82j13K86J35n98Q3K18J59p57M3L06k06m40L40K25m40k09P28
1038F3L00o46K68L99m1k70L52L00m98l55M74k6q18J75N08k13n94K31M48n00j78
1059f21N10K14l38K2O68p2m53K78L89k27m12L59K9l49j46K49M6p14J70M40l60
$$ y = [954, 331, -281, 209, 68, -502, -707, 66, -143, -827, -607, 14, -204, -378, -48, 494, 159, -249, 415, 726, 102, 317, 755, 403, -313, 130, 401, -242, -460, 58, 3, -748, -905, -81, -200, -631, -170, 358, 164, -177, 504, 677, 388, 159, 628, 510, -250, 79, 453, -53, -590, -259, -20, -684, -742, -165, -10, -673, -448, 364, 91, -82, 382, 742, 196, 117, 622, 429, -72, 109, 429, -120, -540, -146, 125, -419, -835, -143, 24, -543, -482, -11, 118, -257, 284, 689, 366, 57, 540, 725, 217, -66, 337, 250, -272, -344, 17, -466, -681, -260, -37, -359, -464, 184, 96, -248, 114, 585, 303, 190, 476, 611, 13, 96, 314, 473, -284, -241, 65, -141, -581, -241, -16, -456, -665, 63, 363, -283, -15, 384, 343, 73, 425, 725, 227, -128, 346, 320, -498, -323, 185, -28, -622, -391, 57, -443, -621, -111, 103, -235, -213, 455, 383, -70, 208, 597, 370, -42, 317, 346, -3, -149, 100, 146, -568, -398, 42, -318]
1080c18l75N30M29l72r7O13K5n34L37L78j21l74R9L55p56j99N91j70o62j71Q32
1101D0k73o04N80M32n22j20O71J11l05J31M63k12l18K40K71l88m58M37J02q41
1121e63K9L41L4k39J24J66j11n4L25M56m79j36P23j39l33n3M10k19l96P4L45o46
1143c41j56M23n3l93r6O91k83j30M84J66j84l5K73J46l93L5L21l9o89L58K90o67
1165b72k47L72J38m41k9L73J63m57L44L76n2l51M67Q5m24n3M51o2n81J86J96k70
1187h8o29N58J81n45j02N26k9j38l0O92l26j53M24R7k76n3K92k3m41j07M30k97
1209c7l63K36k9k76j80M68J25l05J02N82N9m21O2O45m24k27K93L46p13K6J17J00
1231A86l77p1L13m17l19M83R3r8m1L94K45l29j14M62k0l30K81J35j13m96L16p2
$$ y = [-318, -693, -163, 266, -106, -203, 410, 435, -99, 238, 616, 495, 121, 220, 575, -181, -380, 211, 41, -621, -792, 40, -233, -837, -257, 175, -347, -467, 204, 315, 10, 141, 604, 392, 74, 314, 585, 197, -261, 176, 278, -563, -534, -193, -159, -398, -274, -108, -219, -273, 52, 508, 29, -107, 616, 477, 144, 91, 501, 282, -114, -40, 305, -341, -497, -74, -127, -520, -616, 75, -208, -338, 146, 312, 128, 93, 366, 512, 119, 154, 475, 436, -253, 105, 395, -272, -519, -147, -9, -450, -479, -106, 57, -400, -56, 320, 268, -83, 384, 469, 45, -8, 443, 381, -200, -14, 182, -88, -717, -159, 22, -523, -625, -99, -128, -266, -296, 396, 70, -83, 341, 438, 162, 109, 401, 378, -63, -170, 260, -37, -400, -164, -193, -469, -649, -181, -56, -361, -259, 323, 382, -39, 23, 668, 244, 17, 310, 656, -57, -31, 86, 186, -191, -262, 51, -366, -685, -202, -109, -207, -248, 146, 391, 62, -52, 410, 390, 60, 341, 476, 363, -133, 183, 111]
1253A11l46N7K12k26m53K86L31j41j41N10J80m68J64L60L7l72R1L66n52o2L90
1274C34k44k27k02L54j00l58M7M31l22k39N77K12n09J99N82j50n05K94K38p9l55
1295b2K32J19m63l07K42J40l35P4J51pk82M14K36l30J12K40L25m01K6L44n0n18
1317f0k4M25m18j44K49R1n72j00J65M58m29K88L83k24k16J71L02k47j58M42j09
1338B73l28J85K74l70n83O20r3m30J71K48q0j45j52L80O7j95J94M66m41p6K63
1359B48J90m26m1K35O7m86O6J26j62k38J36K25l78K81L34j98j02J85L99k58j10
1380I3P9M25o01n0L08j52l65Q6J94k12k31K42K23l08j05K99J59k34J78M77j11
1401C94m43K16K15k19k60M93r6m02k60N35l06j25K08l1n2l80L00M06l20j53O42
$$ y = [111, -235, -178, 34, -192, -645, -359, -28, -169, -310, 200, 380, -88, 76, 436, 473, 101, 192, 558, 6, -56, 334, 90, -137, -339, 15, -85, -443, -396, 35, -287, -526, 51, 263, -246, -47, 535, 385, -120, 174, 412, 333, -22, 210, 329, -134, -441, -199, -59, -394, -320, -169, -176, -458, -44, 192, -138, -26, 214, 539, 138, 164, 508, 458, -60, -84, 341, -77, -221, 28, 119, -453, -553, -388, 70, -359, -71, 312, 88, -128, 43, 345, 98, -60, 382, 273, -55, 130, 404, 34, -549, 71, -22, -452, -281, -33, -113, -258, -410, -30, 37, -158, 36, 502, 61, -15, 248, 438, 12, -29, 206, 273, -213, -147, -21, -183, -421, -285, -60, -438, -157, 177, -21, -123, 62, 461, 203, 93, 172, 597, -4, -54, 254, 102, -263, -177, 17, -195, -426, -184, 39, -269, -374, -75, 84, -150, 28, 505, 394, -49, 167, 382, 163, -97, 396, 300, -102, -362, 173, -133, -258, -50, -81, -133, -513, -213, 193, -127, -280, 362]
1422C62j50k40J78L69k57k43K69k2l23k73L43j8m34J54K55j93j19J09M77l86p6
1443b18N10k2j38l8L24k65k63L95J03m08j66K60j65k47l4L70k02l13L99J81j86
1464a23n7K03K63m13L16K69j43j31n5J32j73l41L22r8k81o7K96J40n41J19L45
1485a8q4p8K10L57l02j41M62j0l52R5M23n77j07J9L57n16jK36L7m41K28K52r6
1508d7j57K68K39k64j64N08P0l34QJ63jl22j07L11k71l69L48J7j27k69M31Oj77
1531b40J73K34j70K5J68K77l62J64J60j35k64J11J49m90j28K26J43l35N4J81J09
1552E0m06P6M62p8k03K21K11k09r8K75M6m94rL87l42j77L2L72k49l70M54q2l04
1575d35L02K43J45o41M78K60j55k62M23j67j14k55M42j11k86J43l4r2j62K50L5
$$ y = [362, 212, -28, 150, 519, 262, 19, 288, 266, -57, -330, 13, -5, -439, -285, -30, -223, -342, -233, 244, -142, -218, 292, 270, 132, 94, 418, 153, -110, 285, 388, -20, -186, 74, -91, -338, -372, -2, -204, -517, -118, 63, -123, -180, 23, 286, -127, 189, 458, 315, 184, 129, 261, 88, -253, 69, -29, -310, -377, -81, 59, -482, -363, -18, -102, -180, 30, 387, 85, -56, 406, 396, 44, 139, 562, -15, -122, -103, 254, -262, -263, -27, 10, -431, -203, 49, -47, -204, 64, 303, 39, -125, 383, 453, 119, 127, 290, 289, -33, -140, 171, -100, -469, -121, -104, -231, -500, -69, -63, -240, -67, 167, -3, 22, 190, 467, 105, 269, 429, 294, 30, 141, 290, -200, -328, -102, 41, -294, -240, -59, 50, -356, -280, 182, 104, -99, 122, 333, 124, 26, 301, 347, -147, -156, 231, -111, -288, -256, 116, -133, -503, -49, -131, -435, -133, 110, 255, -386, 92, 352, 197, -65, 358, 191, 77, -178, 264, 153, -133, 10, -24, -116, -278, -28, 7]
1596Gk60J06L57M7l34K78J87k05k1J3K56l31j93J47K02m43O2J79l02j4L9J88j68
1619b03j39M60P7k82K35Q3n3j37O9L01k10k01J65J11m83k3L27j87k19OK97j97
1641b03j94L49L89n30J05J98K58l05J36K38l96N9L2oj43l28K49L5l68K00J96j38
1663a67j12J25K50k70P5L72o4r4J7J62j26l55K20K05l70n6K31L9m25J74N8j9q2
1686b12J32J18j10j28L29K59l74n9L36j19l52K50K26K6m98J62J60n65P2K07J83
1707D3j66l3L01o4k65J35M73k68j39J09J41j58j2L7l7k94J58L9j23r5R8J75l81
1730c26J10M12l34q7k1L76O4k88M47J64m50L8r9Q2k19Q7J60j87k41J18J26QmJ69
1754A05l4k00L40Jj52Q6J57R1l86o4K95o4l34J01L69l99p4P3K41k78j98K16K66
$$ y = [7, -253, -147, 210, 257, -77, 201, 388, 183, 162, 175, 431, 100, -93, 54, 256, -187, -125, 54, -248, -262, -223, -35, -203, -342, 118, 195, -87, 148, 231, 178, 41, 110, 411, 201, 0, 165, 276, -207, -230, 97, -90, -309, -303, -6, -203, -397, -48, 341, -189, -84, 114, 372, 67, 203, 441, 45, 104, 136, 130, -13, -341, -92, -57, -425, -225, -29, -167, -279, -154, 96, -174, -99, 273, 209, 115, 132, 294, 168, -187, 33, 238, -132, -188, 43, 82, -343, -169, -111, -130, -212, -80, 38, -72, -200, 129, 388, 14, -45, 291, 172, -180, 70, 296, 322, -176, -14, 146, -419, -347, -140, 43, -123, -156, 145, 81, -184, -49, 424, 156, 17, 126, 267, 109, 97, 134, 97, -197, -39, 0, -123, -218, -120, 55, -326, -216, 196, -138, -225, -246, 130, 194, -94, 353, 517, 67, 105, 6, 88, -131, -44, 116, -71, -312, -194, -68, -60, -64, 105, 71, -129, 211, 212, 60, 146, 303, 394, 8, -56, 239, 175, -159, -58, 311, -88, -162, -89, 152, -126, -324, -108, 158]
1777A58j80%J83Kp5o0K66k07j2q7J12k32j64L96j35k03rJ97j94j7J46K83j72k26
1801b30K75J82l16K88K16k22k69J83J30j90n8J63k00l03Q2J68P5k78K3N37m26
1822a70k01K60K42K5q4J51p2p4L9pj01k8O3L8k92M7O1J7r6pL41q7k25O7K65j67
1848Ej8L79k67J1Q1qk9k98K34J98m42j57K36q9l2NK27n2k6RJ02j73k25N65j01
1873A35j20QK35j04k93K07k5j53k94K89J90n30J46O1J95l77K90K84j39k5K08J58
1895C46l03L0L00l50j31QK40k94k74L92L0k88p9J15L01k05J12L34m04P1J22L34
1917D07k15r1J45jk68pJ89j52k50J41N9j03q2K90m5r8o9K20j7l5O1J49J3j15J32
1942B58j02p6o0J81k81q6j5K19k52q6J95J48k42J3L98j17q4NK58n3l20K86J21
$$ y = [158, -22, -22, 161, 163, 88, 28, 294, 87, 75, -12, 100, -132, -296, 100, -35, -238, -247, -50, -244, -261, -115, 168, -4, -230, 45, 227, -89, 199, 415, 193, -76, 107, 237, 47, -11, 152, -48, -351, -269, -101, -26, -304, -281, 256, -170, -371, -111, 131, 156, 72, 223, 151, 77, 116, 109, 8, -20, 43, 81, -211, -164, -103, -86, -182, -189, 152, 65, -160, -93, 172, 5, -13, 366, 99, 110, 191, 183, 154, -144, 90, 288, -154, -311, -75, -164, -196, -191, 36, -16, -42, -33, 69, -104, -329, 236, 135, 15, 23, 258, 154, -139, 68, 43, -110, -404, -115, 75, -455, -309, -248, -53, -430, -140, 144, 5, -20, 188, 346, 43, 73, 373, 23, -108, -100, 140, -154, -428, -36, -6, -294, -373, -258, 43, -162, -50, 284, -120, -49, 73, 407, 192, 101, 246, 245, -23, -30, 159, 7, -243, -102, -43, -146, -228, 62, 17, -81, -150, 70, 53, 18, 79, 228, 241, 126, 258, 156, 80, 20, 201, -80, -166, -181, 38, -214, -300, -105, 43, -199, -186, 212, 95, 11, 16, 274, 221, -99, 187, 308]
1965C08k07o3N8N3k19o7K27j51j09nK65r7r5N6J85k36J11K17j9k27K12K6k46j89
1989b12L87m6k36o9J33J40k42J13M0j54j8J35J34j74J26J80r8K9j56J53L5j07
2011I3l0J62k85j56Q3K72l96J63m7J24j25R3K76l54J4L40Q2l14P9L49k74j01J07
2034A55L2j45k79K06J13l35j12L81j37j19J81J16l8m3J81J35p6j58M8J35p7l5
2056A29J85k32j48J45L2k40O6J8q9j10K2L61q2j05J24J05j63q5J53J89k16j51
2078i2M55l66j50Q0N7k38J26J97j85j33J33J69K7o2N2K31j60o1R9L2l3j31J66
2101B13r6j68J02Kj40j75K28%j25k8K48O2k90K03K94k01j39R9O1j91O3J18mj70
2125c4j99M96l37k72J84K65k31L2L1n9J43j57J29J79j29J39K35k37l5R6o6j79
$$ y = [308, 101, 38, 96, 149, -70, -137, 90, -61, -170, -175, 90, -7, -102, -46, 139, -97, 14, 231, 212, -15, 197, 223, -23, -212, 175, 129, -107, -176, -43, 97, -145, -32, 8, -146, -164, -29, 105, -69, 57, 237, 139, 168, 12, 165, 200, 93, 63, 225, -60, -216, -133, 139, -257, -94, -141, -17, -142, -49, 227, -127, -113, 227, 309, -5, 74, 423, 149, 48, 155, 187, 42, -237, -31, 82, -253, -365, 16, -121, -240, -59, 57, 19, -24, 157, 292, 216, 58, 106, 241, 164, 129, 314, 82, -66, 79, 111, -129, -63, -45, -134, -244, -222, 139, 57, -48, 76, 181, 18, -67, 86, 275, 59, -92, 363, -3, -153, -73, -16, -254, -128, 69, -116, -249, -116, 53, 80, 18, 70, 301, 141, 80, 179, 211, 178, 47, 213, 117, -51, 51, 53, -87, -262, -34, -34, -159, -187, 61, 123, -167, 36, 330, 129, -10, 89, 150, -41, 22, 140, 136, -34, -233, 263, -74, -346, -162, 103, -128, -96, -65, -124, 19, -138, -9, 170, 41, 180, 415, 178, 143, 239, 173, -6]
2147fm7J75k60j68J85R7n1l24L39M6j4l2K71j06m0J16n6l7n1J73m5k83R5m6n4
2172a23l4lK83k52j09K30J4j52M6K02k5r8Q3K39j18n5j37K46j73J1r2J02p9k35
2196b29K72o6k64K09J94k58L6J07J12j89N9J81K02l16K82m9l31L1k1K95l35kk9
2219a09N9j83j24K52J10k56J66J44jM7J2kq5J13J04J34m11O1j53jj92L58p0j56
2243a83j03L07k4j18n2L56j91l1Q1J07L0j90L04j83j77K46j4k81j32K70qk23J44
2266f5P1pj7j65L40K2k01O3J89l40L30J54j70j96K5O9m4k67K64J85l09j68J16
2289a21J40k46K36j4J26j71J16J70p2j70Q1K57j96j89N9J53l69J94j10n6n0L06
2311G4r8jr1J07J51j02R1Pj08QLK98k33K1r3J47k59qJ11k19N6J57qj31j49L89
$$ y = [-6, -53, 122, -138, -306, -121, -24, -75, -399, -60, -14, -28, -60, 211, 105, 65, 181, 125, 88, 37, 210, 165, -118, -23, -69, -123, -157, -160, 123, -129, -238, -8, 6, -146, -100, 102, 77, -21, 62, 301, 183, 128, -9, 237, 64, 75, -17, 85, 6, -229, 43, -23, -287, -78, 116, -142, -106, 1, 113, -76, -17, 164, 366, 50, 332, 283, -48, -17, -38, 257, -78, -80, -109, -50, -233, -357, -105, 5, -251, -85, 59, 58, 105, 117, 115, 30, 143, 247, 381, -30, 31, -122, -123, -315, 43, -27, -183, -286, 21, -3, -121, -173, 183, -8, -39, 42, 149, 179, -11, 293, 110, -67, 179, 165, -116, -248, 22, 14, -209, -65, 6, -1, -18, -183, 157, 179, -22, 41, 230, -110, 220, 374, 204, 8, 33, 102, 58, -209, 55, 240, -69, -237, -121, 19, -227, 9, -5, 121, -50, 66, 236, 164, -6, 75, 332, 136, -53, 6, 159, -210, -16, -126, -182, -232, 74, -24, -25, -116, -9, 142, 40, 131, 138, 30, 38, 41, 339, 106, 127, 34, 181, -78, -86, 25, -194, -138, 19, 11, -120, -269, 120]
2337A20K4l16J54K68j03j51K01J12k20n5J60r7p6j73K72j84J4P0J0k81K2K18K10
2360A99k87m6K22oj18J5J47j28Lo2L34l15J49Pj16k10J27K00r1j8q2K61k25N2
2384A2K18j59l9L3m6R8j00K92j53j50k08K83K5j07j40Q7N3k54J55K17J04l50J08
2407b1J56q9M6o1O7r8J17q7O6j72J00o4j23p4L71j99k24M4L20Q2k50K19J30k65
2431iR3K0M0j20j06J92J02%k28K46m06J45J06n5k44J02K98j54k55K29Qm1N4J10
2455A27J84l99N8K81j72n9r6J16j20M9j7n7j56K88RN0k40L5K56J7l03L04k6k19
2479i0J85lK10k28j08J54j54k5JM1q8J6PL1q0N0K43k15J08J51J3k10j5K56l9j14
2505I7j37J08j40n9J07J26j91j10K03L4k43J69R2K00m25J11K08n4kO7n4p9K1R0
$$ y = [120, 144, -172, -18, 250, 147, -4, 197, 309, 89, 34, 194, 97, 21, -152, 120, -64, -50, 20, 30, -251, -229, -11, 199, -88, -134, 88, 82, -36, -21, 126, -2, 1, -61, 273, -42, 107, 114, -2, -212, -85, 115, 24, 6, -76, 185, -40, 12, 230, 71, 32, 65, 19, 117, 17, 309, 156, 6, -202, 81, 106, -1, -141, -54, -1, -255, -100, 117, 221, -129, -21, 135, 46, 92, 31, 98, 0, 117, 30, 96, -76, 24, -40, -163, -237, 134, -65, -289, -245, 75, 157, -93, 126, 256, -9, 84, 104, 144, 24, -82, 110, 212, 212, -16, 230, -176, -31, 75, 20, -224, -122, 176, 22, -233, -4, 4, -37, 17, 127, 311, -88, -30, 251, 79, 20, -76, 40, -80, -31, -48, -105, -261, 27, 36, 86, -154, -119, 137, 154, -149, 155, 129, -90, 95, 92, 302, 74, -34, 120, -34, -59, -58, -17, -105, -89, -82, -51, -131, -81, 162, -53, 55, 206, 219, 9, -6, 250, 211, 97, -40, 68, -72, -131, -24, 102, -89, -199, 4, 38, -205, -36, 56, 256, -169, -58, 150, 96, 94, 161, 107, 28, 49, 139]
2529A39n0k07L1J39k1k6j28P8J07k29J56J51k86J06J00j26k0J01J57k55K4P2r5
2552h2K5L2q4n6J7J64r6n2O0J49k4k27J30J62r2j4N5J0j26KJ18Ok40J11r7J67
2578A8k13N5J79j74J01K6Lj97K10J05K43k87m6K64j24k70J24R4l7j75J16J1o4
2601c8K6J25j3l29K36Q4j19P7J0Q1l13K03J77j30k7j19R5j67N7J44Oj00p6J70
2625F0j56R6j41L5O6j55L43q9l7Q5J66k28J97j15j65j9Q8N1P7k68j0k1J12j43
2649a71J08J19j58O2J9K18j68l1L1l7O3j23k9K38k01j5N8m4r5K27j63O8rJ43j47
2674c7j16L47p9m4j7P1J30k18p9O1J58k47Q1j27j08P8P4Q2m6j42J30N5K8m6K35
2699B24k07j49K20J62j93p5J97k92K15k13J3M5j30K8K91j37r3J10K5q8J62R2k37
$$ y = [139, 89, -118, -87, 52, 31, 5, -123, -45, 62, -167, -11, 140, -146, -40, 60, -66, -86, 15, 172, -83, -59, 13, -82, -57, -25, -109, -165, -148, 16, -80, -132, -72, 77, 53, -174, -44, 118, 26, 12, 67, 77, -49, -47, 71, 77, -163, -52, -149, 18, -195, -140, 39, -135, -34, -8, -5, -202, 8, 113, 356, 69, 23, 287, 163, -107, 17, 111, 74, -101, 15, 26, -38, -12, 113, 100, -229, 7, 91, -28, 49, 59, 140, -173, 30, 207, 77, 50, -69, 26, -141, -84, 60, 66, -34, -110, 60, -96, 0, -141, -106, -40, -195, 148, 59, 22, 107, 273, 45, 242, 127, -38, -57, 31, 82, 159, -109, -119, -140, -28, -171, -63, 56, -102, -40, -21, 197, 29, -2, 29, -8, 55, -68, -97, 141, -60, -75, -17, -61, -156, 71, -92, -24, -33, 110, -37, -153, 194, 115, 71, 54, 125, 255, 37, -42, 19, 177, -70, 11, -116, -224, -146, -72, 10, -36, -178, -48, 7, 35, -11, 224, 17, -132, 88, 250, 57, -18, 179, -113, 102, -111, -98, -53, -183, -155, 136, -1, -94, 16, 41, -47, 115, 207, -30]
2722c0J11j35K06k11K12j74qQ3k41K76k01l2J08k45K40O4j70J24p1J30M7qj54
2745g9L15q3K7k03J00J63l01J9K43j77j10M8P8k38K64p7O4j37k6J12K51k88j7
2768e2K08L2j24pJ74j79k18J35P0k80K06j6P3k21J0J62r2m7J90l1q5m8L10J62
2792C32k65Pp6p1k27L02q3p0m6J66j77N9J42j3k8OL6m4lJ07J64l05J35j07L15
2817B56k76J15r5j7r1j26M15j54j05L6Q5Pk29K51%j06J96j03Ll4J8J16K2k33%
2842d9L8k4l07L39j8oj43J18J0J42l11L47k20J66n5K0R9j07L15k25j24K78j36
2865A47k12P0J19n5j44r1J25K06k07o6J8K06r5k9k0J18k53K86P6l1j10n7J58l70
2889b11J66K3n1N7j6J59k20N5P5P6k10K24L0j5j15j0L0kO3k9K2j87j18J76k63
$$ y = [-30, 81, -54, 152, -59, 153, -21, -29, 54, -187, 89, -112, -144, -36, -281, -41, 23, -147, -23, -94, 36, 83, 75, -79, 236, 153, 180, -23, 77, 240, -61, -42, 201, 24, -86, -38, 40, -198, 66, -11, 53, -84, -110, 2, 253, -35, -52, 156, 188, 64, 57, 231, 52, -166, -31, 39, -241, -35, -51, 22, -199, -189, -27, -119, -166, 24, -7, -92, -140, 170, 332, 67, 74, -2, -73, -300, 2, -81, -151, -197, -31, -208, -149, -7, -20, -48, -42, -6, -50, -53, 54, 218, -87, 48, -59, 256, -20, 95, 0, -17, -108, -234, 181, 27, -78, -42, 43, 50, -179, 72, 72, -34, 162, 59, 62, 28, 46, 162, 184, -49, -49, -11, -35, -342, -3, -21, -27, -170, -52, -42, 100, -211, 136, -84, 82, 27, 47, 146, 39, 354, 129, 5, 283, 147, -65, 5, 124, 69, -75, -166, -41, 165, -42, -108, -90, 116, 21, -8, -28, 90, -163, 123, 199, 168, 58, 1, 159, -211, -45, -22, -73, -16, -32, 127, -93, -38, 37, 113, -97, 127, 157, 142, 27, 17, 47, 45, 108, 79, 101, -86, -204, -28, -291]
2914b91J10m7J43J5n4J11k42J3L34J36l19J53J62O5j76j39J62m8l38O4L03k43
2936a26N8j0J21m8J79j91J3K4P3j52J03N8p8K51k24J03j55K21k49M8r2O8r7n5
2960a57M3M1j61K68J25k65j9K28m7r3R4P9n2j37K31J9l07rO6J30j76k9jO4J26
2985F1j61K58j35j28K2J73r1M7o0K63j01j38P7j58L1N8l6m3m8K07r7j79J83j8
3009a3qj75J98J05n8j70L95j2k06R4j40K2m8O7kj93j76L56k2k47P5J20J08j79
3033a09o6J91n4J86r5J2J38j41N3r4o2m9J20j77J17p1J71k15K06j73K26j02n6
3056d4J51j08l2J4J78o1j86K45l56J84k8J78r9%j0N4n5j00J87k93N6J08J60p5
3080F8QRP0j70n6K33q3p7J4Q0q5k37J35N9L6k31K01P5k44K49R3j40k10J03J85
$$ y = [-291, -181, -228, -85, -70, -124, -13, -255, -242, 92, 228, -91, 62, 224, 289, 113, -26, 136, 88, -250, -186, 117, -126, -68, -78, 43, -5, 174, -17, -4, 20, 93, -59, 44, 102, 24, 275, 51, 154, -1, 220, -29, 19, -73, -5, -102, -157, -114, -73, -234, 34, 159, -106, -125, 103, 56, -37, 57, 136, 84, -53, 178, 197, -110, -119, -53, 77, -99, -128, -129, -65, 61, -100, 158, 23, -105, -83, 90, -1, 46, -14, 249, 148, 10, 87, -71, -40, 18, -18, -61, -109, 98, 1, -178, 5, -13, -21, -196, 2, 107, 49, -121, 274, 262, 56, 150, 10, 32, -16, 51, 49, -144, -320, 36, 14, -233, -158, -38, 70, -109, -175, 16, -38, 148, 53, 65, 203, 62, 115, 21, -41, -90, 30, -147, -30, -101, 70, -145, 61, -112, 114, 12, -44, 107, -1, -33, -19, 159, 98, -88, 157, -199, -15, -43, 135, 36, 36, 26, 80, 25, -75, 112, -181, -125, -17, 143, 68, 76, 85, 155, -15, -71, 162, 79, 2, 16, 96, 11, -226, -91, -32, 4, -227, -26, 49, -195, 54, 147, 7, -203, -100, 85]
3105H5rj4O3O7j63j65K12j55j08J45n7K4j06J72M8r5j2M3K5m5N3J67M8l09J63
3130G7j8o4m9K82k13k85K66m0Kj85J65j8L6j68K95p1O3k02K32k08J18J33j36L0
3154D2L1J27k7l15J82j05J45j58k5J50M8k57M6M07l83Q3J02k5J05j59K34Ml72
3177a20J08R9M3k35J38j8j60r6K26O9K9j13l3J41q4NO7p9k22L84K3k03M4j26M0
3202g3l5m1J20m2j03J47J58j53Q2j52K6o1J34K6j33J16J08l3Jj28K40l40L9J87
3226I0r3r4J65j03m5N2O7o2kL9J97l5k93R7J51j8j90m7J51k6j10M6J00k07J73
3251CPR0k32J02L1l3m7M3L9lo4J89L3r4JK8j9j73p3J58k6j12J51n2J01j7K4p7
3279b2p7m2J80k6j5K62k79o0L18q4l3j48q5K0K01j57o3J48j2j14O4P0j8o5n7K18
$$ y = [85, 76, 62, 125, 192, 29, -136, 76, -79, -187, -42, -99, -75, -181, -9, 39, -56, -68, -25, 0, -45, 8, 175, 223, -86, 77, 59, -5, -54, 228, 15, -270, -4, -44, -42, -227, -62, -80, -44, -212, 83, 12, 75, -127, 105, -103, 15, 148, 12, 42, 73, 200, 173, -142, 40, -65, 80, -78, -103, 47, 95, -162, -116, 291, -92, -9, 93, 68, 173, 14, 248, 252, -120, -12, 87, 130, -105, 33, 15, -145, -241, -15, 54, 83, -30, -63, 78, -6, -1, 66, -13, -235, 149, 172, -31, 13, -113, -73, -108, -149, -29, -71, -174, -27, 131, -22, 60, -92, -66, -127, 7, 33, -100, 16, 124, 91, 92, -36, 204, -136, -97, 90, -3, -97, 68, -35, -80, -28, 39, -23, -25, 14, 211, 176, -117, -20, 131, 113, -77, -124, 27, 1, -109, -63, 37, -170, 3, 10, 100, -132, -30, 1, -32, -79, -36, 3, 0, -64, 125, 158, 64, 65, 93, 74, -99, -172, -14, -40, -152, -1, -53, 48, 31, 55, -22, -99, -141, 39, 13, -2, 260, -19, -79, 239, 155, 122, -26, -111, -91, 110, -47, -110, 38, 26, -88, -24, 46, 28, -37, -94, 124]
3305A24k7o2O1k3n5j9Q6j62O0J04j65J16j3L4j86MQ9j0J8J47r1J44j70P0L9k23
3331a10K51j15J45k29O0J29l45Jn3K98j02j95J47k4J19j40J56J38k04P7J68m6
3353A26l0M1n1j27N6R3k59J12j24L25l17P3K2j9J0R6J27Qk18J19O7Q8j88O0Q5
3378A75j18j16J09m9m5J95j31o8J32k26J38k6j07L4R1l6J19k1NM6J9j70J58j0
3402I8j10J2J98l93L0J57j13j07Q4L3J55J6j56Q7KJ28j31ln7J40j74K7O4P2m9
3427A0J33p4j1r5j40K79l30J35rJ80p7m1K45P7k63K37j51j93K04O1p0j27N8j85
3451a47m7K73k12J60j59J90j11P9j19k7MK13j6q8J9Pro9j9Q4L7j64pL6K2q4J91
3478C7q1j51L86j04k04J64Q5k34K44j36J20k75K63o2L5j03r1J70k63K22M5j53
$$ y = [124, 97, 35, 96, 73, 18, -1, 85, -77, -17, 87, -78, 38, 25, 59, -127, -123, -34, -44, -26, 121, 30, 174, 4, 74, 113, -110, 141, 26, 171, -58, 2, 131, -214, -213, -266, 32, -70, -265, -118, -142, -23, -163, -7, 131, -73, 4, 172, 126, 96, 137, 86, -41, 15, 108, -151, -39, -163, 162, -155, -82, -60, -79, -69, 27, 154, 162, -56, 63, 130, 218, 30, 90, 175, 57, -59, 50, 1, -44, 151, 20, -48, 84, -142, -4, -30, -137, -103, -12, -48, 71, 50, 55, 101, 120, -50, 108, 98, -12, 0, 198, -195, -165, -8, -121, -228, -144, -111, 44, 60, -96, -9, -7, 121, -10, -13, -70, 70, -104, -77, -13, 59, 10, 143, 69, 58, -37, -177, 102, -228, -93, -102, 78, 1, -40, 205, 282, 19, 256, 105, -88, 116, 177, 107, -20, 38, -147, -194, 79, -133, 27, -132, 58, -53, 26, -93, -120, -116, 97, 81, -7, 12, 19, 10, -59, -78, 6, 43, -121, -128, -92, -70, -154, 37, -44, -195, 191, 87, -117, 47, 132, -102, 142, 6, 126, -149, 114, 52, 87, -16, -107, 63, -200, 22, 67, -86]
3500h6J30j28J36J49k06N2j77J75j18K00l8lk2q7j1R4o7l6q3K87o5j94P7P3l1
3525B1r3J20o0J7RrJ08J29p4j1k7j22k05J78K27j91o7r9K88k00J0p3JP6r3N6K04
3552A20%k26J11Q9j35n0J02n7l1K00j43k9p2P1k7j42J7K04o9n8J06R9q7O3N8q7
3578B7j14K59j75n1P2o1m9n1P1J66j36O8k25K37Pj97J19J93j56LN6j68k2J35J56
3603A64j58Pj49K48j46RjJ89k34Q3J11k32N5K6j3J60j01J91r1R5j58q1Lj67j15
3628c05K64N2j10J9P2j26RJ02J26j58J26nj06j7K59j83j9J83k14K98l78R7Q0Q1
3652A47n1j24R6j38O1N2j56j11J41J54j79j18K17J00j02j47K49j44q3M2P9m6j04
3675a65J36J99j84k12J73Q8pj32J73j21j23J35J22k91L21j11O9l3j85J31J35n4
$$ y = [-86, 44, -84, 52, 201, -5, 47, -130, 45, -73, 127, 89, 86, 64, -23, -34, 60, -7, -43, -126, 161, 96, -98, -21, 52, 21, -72, 48, -12, 5, 14, 5, 113, 242, 168, 157, 130, 8, -197, -19, 208, 17, -50, -149, 139, -61, -51, -124, -123, -47, -140, -84, 120, 120, -106, 5, 94, -41, -91, 11, -46, -77, 123, -20, -49, -121, -50, -77, -219, -202, 2, -67, -125, -19, 80, -7, 56, 114, 27, -87, 172, -3, -54, 18, -43, -92, -143, -72, 94, -42, 26, -199, 38, 45, -152, -33, 160, 4, 7, 63, -105, -127, 8, 164, 6, 13, -136, 112, -34, -25, -26, 163, -71, 12, 123, -109, -54, -28, -41, 119, 18, 209, 118, 213, 55, -26, -23, -190, -305, -41, 11, -99, -80, -8, -134, -125, -23, 103, -55, 71, 66, -40, -57, 202, 19, 0, 183, -31, 267, -111, -14, 66, 147, 96, -28, 68, -70, -9, 43, -113, -224, -83, 71, -108, -226, -9, 91, -11, -158, 91, -53, -136, -94, -15, -61, -165, -29, 170, -14, -226, -53, 35, 28, -104, 69, -52, -175, -40, 82, -209, 112, 1, 70, 37, -148, -17, 118, 64]
3697F4j46j0Q7k29L5K01j01R2J2J42k11J10M6j55J1J29R8j71M9o0m6m4K0J61k11
3722a27N4J51J60k44K3N0j0Q5k5mj57j8l1J25P7q3r9J33j20n2R4j2J12n1j38J43
3748C6M4J54j77j71K35J50k66j62K17%q0j47K10p2o4J9J01o3o7O6P0l0j06O0M3
3773@j0j23J75K14j42j54J49K9j32O1M9j31j69J13J0P9k20K14M5l22J14J84o1
3796b8K03j5Jk16R0N6j31J60j67K1Ro2nK63o3k28q5K26j34K04j87M6m0l7J37k6
3822hm9J85J08j45l01L23j20J1q9L6J28l63K65Qo5n9J65QM6j65K54Pj67P5j97
3847a09K34k03K1P9QMj34J01j90K48j29J77l09J86J25r2J17j73M7l4J11P3j47
3870A1J10j32m6j09Q1K3P9q2J56q0j38P9J2j0J63j55N5n3P8K6J20k18j4J16q8
$$ y = [64, -82, -92, -5, -234, -199, 2, -99, -7, 5, 147, -64, 46, 92, -63, -52, 77, 175, 4, 53, -7, -53, -97, -77, 84, -127, -73, 78, 238, -6, 17, 67, 57, 142, 117, 113, -44, -62, -93, 32, 109, 26, -73, 60, -60, -112, -18, -30, 82, 31, -107, 36, 80, 234, 57, -114, 121, 271, 5, -157, 60, 60, -20, -167, 43, -29, -93, -74, 27, -36, -103, -37, 33, 3, -103, -43, 0, -10, -133, 42, 256, 114, -40, 109, 138, 6, 67, 116, -15, -184, -71, -61, 18, -202, 12, 57, -265, -151, 33, -28, 175, 160, 161, -55, 35, 91, -40, 120, -47, -26, -17, -79, -84, 179, 116, -112, -197, 29, -105, 99, -88, -42, -82, -119, 18, -8, -57, 128, 236, 91, -210, 113, -7, 4, -85, -49, 79, -284, -19, -11, -76, -135, 30, 38, 84, -81, 173, 180, 13, 88, -109, 125, -78, -57, 22, 30, 34, -100, 1, -189, 59, -70, 107, -202, -16, 109, 17, 134, -39, 8, -26, 85, 158, 11, 121, -11, -57, -166, -85, -62, 17, -65, 91, 11, -127, -48, -36, -46, 117, -38, 17, -36, 42, 68, 188, -30, -44, 72, -16]
3895a6j2k0k9J57k22K3M1J02j60M0J10J06j09R0n1j23J9N4P5o3J14R5j98K0n2
3920ij39M0J5M7K4P4k08K05l1%l0j21J60L7J01k01K2JJ5m5j7M1O7j39L4J98k20
3947g9N3k1L2k9O1Q8k5%L2J22q5j00J28k14J26j77J15K4n9j65L43j53j60J61R
3972B7j17K48j76K11j91n8O8R9q7n2PJ81j92K2j8nk0J8J1j21J09P8p9N8L0N5j
3999A05l86N42l10l8J2J21%k03N2J96j87K8j3O9k10J76P2q4kJ3P1K8pm0j05J56
4025E6P1Q9j04j33J55k82J97L6n3Lj05J27J04j01j37R1j00J44l0j07L16k31k9
4048b3N9R3j72k9q0K06l4o5p3J27n9l1J43j84J11Q7j00J68j5R0Mk57J71q9p4r
4074c5L7%L5p8qo3J58q6q1K1Q5j37K91k95J45J25j5k38J43K52k66J30j93o7M1
$$ y = [-16, -28, -48, -77, 80, -142, -119, -78, 24, -136, -96, 14, 120, 11, 101, 50, -73, -54, 0, 75, 12, 126, 221, 23, 43, -9, -148, -108, -93, -46, -22, 52, -156, 49, 18, 18, -12, -133, 27, 64, 165, -36, -14, -13, 2, -43, -60, -19, 48, -91, -57, 141, -79, -26, -47, -15, -44, 17, 105, 80, 80, 112, 234, 149, 49, 177, -37, 89, -88, 27, 51, -8, -173, 170, 17, -143, 18, 27, -90, 158, -18, 193, 2, -56, 12, 111, 24, -28, -21, 160, -32, -10, -28, -33, -53, -35, -24, -145, -36, 42, -37, 21, 51, 106, 105, -281, 261, -49, -87, -75, 46, 46, -157, -105, 91, -96, -68, -81, -12, -222, -46, 26, -58, -60, -47, 24, 52, 45, 5, -100, 56, 127, 216, 112, -21, 134, -148, 49, 85, 32, 35, -70, 57, 161, 60, -77, 14, -86, 58, 28, -79, 237, 6, -23, 36, 129, -43, -72, -152, 54, 20, -45, -118, 9, -50, -81, 62, -122, -11, 76, -24, 144, 129, 219, 223, -34, 137, 48, -26, -35, 2, 2, 37, -41, -49, -112, 46, -40, -121, -100, -15, -152, 139, -156, -11, 114, 99, -139, 4, 256, -10, 120, -73, -140, -99]
4099i9qp5J66k2j72p3K67M4r9J9L7O5j62J42m0J04r1L1j10K31j26j3m4n3J02n7
4125c6K0K5j83N3K04jj20n2J82Q0k19M3q3J05lMj47L7J29j01QO8N8q1j91J92Q
4152aJ72k2j05L7j92K7J49k5J24j06j07mJ29j26P2O5k95P4K15j04r4O4M2R5r5
4177a1m1J26j2K6qk17K66j16j79J68Mq0M6k3l2J27R9l56M7J02K43j27Km3j21O1
4203d9jM7q0P2J46r3K7j13J2l6K92j63J55k45r9J65j17K1j2N3j11J43J89j64m9
4228a0N4o4l8q7J33j8Q5j74J41r5j79J47M4M2r4J85l7K7O7p7Ln5J27j41Q6j34
4254f2k8K29k12k5N3O8p2l4K9J80k12R5O2l9n9N8J50j65m8n5J75l9k40N5K40j10
4280fJ0P0n3n3J30o7N3J1kq9J02k17K43L1j75O8M5j72N6J11k89J73N6N9j05j06
$$ y = [-99, -107, -182, -16, -38, -210, -283, -16, 28, -71, -52, -15, 50, -112, 30, -10, 94, 3, 34, -76, 155, 29, 16, -28, -81, 21, -36, -16, 9, -174, -121, 83, 82, -38, -90, 92, 172, -47, -4, -87, 18, 15, 19, -128, -91, 38, -63, -55, 13, 71, -10, -201, -9, -1, 171, 149, 44, 81, -111, -84, 65, 40, 164, 58, -49, -53, 76, -50, 22, 87, -208, -134, 81, -23, -117, -53, -11, 84, -11, -52, 74, 62, 88, 80, -137, 129, 13, -166, 2, 6, -74, -28, -51, -83, 44, 143, -213, -166, -64, 179, 52, 54, 11, -110, -49, -50, -3, -83, -11, 135, 42, 69, -44, -32, -68, 224, 61, 216, -29, -128, 37, -80, -59, -71, -18, -129, 14, 203, 39, -10, 44, -20, -58, -145, -12, -30, 55, -119, 22, -73, -252, -105, -61, -19, -113, 72, 35, 62, 129, 52, 55, 0, 127, -14, 72, -62, -90, 139, -73, -98, -45, 23, -49, -83, -54, 126, -86, 9, 71, 32, -27, 31, 181, 16, -32, -87, 88, 49, -191, -136, 104, -6, 4, 74, 21, -32, 98, 31, 84, 95, 93, 4, 106, -111, 132, 163, -12, 56, 101, -71, -15, 96, -193, -20, 36, 95, -10, -116]
4306a16K28Kj77J20m3M9j77L8M3N1L3N6k61K49r3j02J12q7K9K3J78j11r7J53q7
4331A3lpp2J44j50J28L7j81K24n4K1K9k79Q8j65J26M2n7J22P8k8R2k88K1J50m7
4357a6K3J92j14j21J9J23rn2K3qj78K05j57Q2K9j52L52m36J62J4O6j66K03J10
4381A94k32N1N1L7j87K28j16L1j30K2k2l1K30j93O8P3j90j27R8J30J40k08K18
4404A35j41J03O6j30j41J96k6L8l50J70Q8p4j42K11n1j4j28J80L5j17NrK27q7
4428D4L7J21k56J06l7Mk1k8J49J3j56k35K58j2Lj9N9l0p1K52p6J4k07J93k61J18
4454c8J2J59j33J13o5l6N5j12M3Q9j08Qj30K7K16p6o4n5J1NKO6K3J49k35o7P9
4481f2q1J80l4O8p8J35k03K5J60k3K3J20k38J52l3Mj26m1J76j77Q7K0k0q1N5O3
$$ y = [-116, 112, 114, -63, 57, 14, 63, -114, -76, -33, 18, 51, 107, -154, 95, 2, -100, 12, -75, -46, -23, 155, 44, -53, 100, 13, 10, 3, -69, 75, -75, 53, 90, -91, 133, 79, 100, 129, -150, -62, -227, -101, -59, -116, 6, 84, 56, 148, -140, -119, 31, -16, 7, 199, 85, -36, -17, 106, 97, 45, 68, 60, -118, 87, -70, 12, 41, -111, 241, -195, -33, -19, 47, -119, 84, 194, -38, 13, 64, 101, -86, 142, 26, 57, -73, -51, -73, -104, 126, -67, 1, 74, -116, -243, -145, -15, 125, -83, 135, -6, 97, 163, 33, -108, 88, 62, 100, -250, -80, 8, -66, -208, 3, -48, -62, -190, -10, 25, -92, -87, -96, 131, 44, 81, 202, -54, 52, 15, 19, -2, -30, 119, 132, -24, -259, -1, -13, -10, -29, 30, 0, -71, 181, 105, 119, -88, 105, -156, -38, -26, 133, 0, 113, 48, 12, 67, -45, -2, 87, -21, -13, -143, -116, 100, 24, -40, -95, -84, -79, -77, -11, 12, 161, -74, -141, -62, -143, 37, 3, 71, -7, 128, -75, -50, 110, 87, 110, 230, -8, 144, 111, 115, -11, -52, 124, -53, 34, 54, 34, -47, 8, 71]
4507G1k04Q0L1Q6p4n5QJ07j09J5K7On8p8m3P5P7J7m9K17j79q3R6OJ20o5on2J5
4536aJ01o7q0l8J01m4j4N3j49K64r0n4j68N9N8O1N5j46J0K1j4K9j47J63J00j75
4562a12N2J13j38J63M2n2p5j15J49o7m3N9J19k19K78j50P0j15P2R3O9l57J16J0
4586c8J66j51j90J17M7LO2o3q6n4J71j15J76p1J33j59J8pQk3J55j14J30j14pJ39
4612A33r6J9j37J29q5J13j21o0Q5o3N8P4j27N4l8J27J02j51q6J33K0m0k3n7Q4
4637D7m5o6K4o2O8j39R2J16q8j43K19J86q5r8K6m9N8n5K1k09K20j5l5j75J09Q5
4663Gm4n0K76j80k34J67N7m2j62J81jp1J55rJ28j05nR2p1j37Q4K2m8k4j0n3j25
4690b02J39K3J8j53K02R4j90J37RM1p3q8n3J11QJ1j6J1K3Q0j83m1M9j0R6kJ6j16
$$ y = [71, -133, -53, -22, 64, -10, -65, -57, 50, -59, -44, -17, -11, -69, -147, -190, -115, -38, -21, -70, 147, -32, -115, -19, -13, 107, 42, 36, -16, -1, 100, 33, -47, -85, 16, -28, -42, 11, -138, 126, 36, -18, -186, -127, -69, -8, 47, -99, -89, -68, -82, -53, -200, -37, 63, -112, -60, 53, -85, 78, 120, 68, -7, -122, 27, -40, -83, -24, 95, -124, 154, 4, 74, -41, 31, 124, 193, -164, -48, -38, 128, -23, -213, -96, -49, -46, 16, -47, -133, -187, -16, -131, 45, -26, 107, -52, -34, -41, -33, -56, 99, -15, 115, 1, -6, 133, 37, 56, -81, 48, -37, 76, -45, -105, -20, -83, -25, 49, -78, -24, -62, 65, 167, 16, -70, 63, 83, 43, 20, -37, 47, 2, -64, -40, -102, -34, -173, -81, 35, -53, -196, 23, 209, 124, 26, 52, 3, 61, 6, 27, -182, 38, 23, -12, -187, -78, 7, -37, -87, 189, 9, -225, -58, -1, -43, -205, -24, -25, -96, 59, 50, 178, 73, 68, 160, 89, -48, 36, 58, 10, -14, -24, -77, -202, -63, -40, -22, -175, 27, 121, -69, 68, 77, 118, 45, -43, -96, 15, 23, 34, 18, 29, 52, 132, -51, -92, -43, -53, 43, 41, 57, -59]
4718e9J89m3q9J36j95K29k12L2l5R4j51nP6j26L1J98j20j31J65O9l3l1K8j80K76
4743A13k08l1J29l4J49j00j4N9p4o3nJ27mp7J9k0Pq9J63olrK0m5J0N8o6O1j75
4772a08j19M1J14J5n1K03J07j06j09j20K50o2K5jr3N4o0k3K29j80j6O5jK4j72
4797i4K58l26m5Q8K08j14QN3j50J41R1j12J0j4J22j34m4N8j79L49j29o2j2K9J4
4822A4l4j99K65m7R5o5L5l6M1Jj13J59m1m8O3k51K00n1P7o3k5J79m4j36Qp7J77
$$ y = [-59, 130, 87, -2, 134, -61, 168, -44, -12, -47, 47, -104, -109, -33, -159, -128, 70, -50, -181, -16, 53, 20, -11, 17, -163, 113, -95, -126, 3, -31, 118, 18, 4, 63, -11, -74, -79, 48, 44, -33, -14, -34, -27, -116, 47, 41, 38, 29, 49, 4, 14, 72, 6, 67, -108, -227, -186, -72, -57, -108, 95, 202, 96, -13, -133, 117, 55, 80, 79, -14, 40, -20, -43, 186, 6, -10, 55, 54, 78, -94, 164, -162, -207, -119, 89, -25, -17, 36, -114, 27, 118, 6, 16, 2, 124, -10, -54, 4, -175, 174, 45, -17, -29, 0, 14, -20, -219, 46, -1, 94, 29, 64, 28, 69, 70, -43, 116, 75, 27, 90, -161, 39, -12, 65, 2, -23, 156, 112, -24, -16, -93, 84]
$$ [...]
8191c0
##END NTUPLES=NMR FID
##END=
