##TITLE=1H_AM_NV BuA
 200.13MHz,,
 8 sc
 
 22.4.2025
##JCAMPDX= 6.0         $$ Bruker NMR JCAMP-DX V2.0
##DATA TYPE= NMR FID
##DATA CLASS= NTUPLES
##ORIGIN= UXNMR, Bruker Analytische Messtechnik GmbH
##OWNER= pz
$$ XWIN-NMR		Version 3.5
$$ Tue Apr 22 14:12:44 2025 Russian Standard Time (UT+4h)  she@DPX200
##.OBSERVE FREQUENCY= 200.1313
##.OBSERVE NUCLEUS= ^1H
##.DELAY= (6, 6)
##.ACQUISITION MODE= SIMULTANEOUS
##.ACQUISITION SCHEME= undefined
##.AVERAGES= 8
##.DIGITISER RES= 18
##SPECTROMETER/DATA SYSTEM= spect
##.PULSE SEQUENCE= zg30
##.SOLVENT NAME= CDCl3
##.SHIFT REFERENCE= (INTERNAL, CDCl3, 0, 14.3821)
##AUDIT TRAIL= $$ (NUMBER, WHEN, WHO, WHERE, WHAT)
$$ ##TITLE= Audit trail, XWIN-NMR		Version 3.5
$$ ##JCAMPDX= 5.01
$$ ##ORIGIN= Bruker BioSpin GmbH
$$ ##OWNER= she
$$ F:/spectra/data/she/nmr/H-C/1/audita.txt
$$ ##AUDIT TRAIL=  $$ (NUMBER, WHEN, WHO, WHERE, WHAT)
(   1,<2025-04-22 14:11:24.70 +0400>,<she>,<DPX200>,
      <created by zg, POWCHK disabled, PULCHK disabled
       configuration hash MD5:
       00 E9 B6 7A A2 85 ED C7 34 08 36 98 17 FE 4E 26
       data hash MD5: 16K
       46 4B 69 98 DA 5B D5 D2 64 53 92 AE 45 DE 05 38>)
$$ ##END=
$$ 
$$ hash MD5
$$ 00 3D B9 19 5D 73 F1 0D 44 73 F8 1B 2A 6B C0 DB
##$RELAX= 
##$RELAX= 
##$RELAX= 
##$RELAX= 
##$RELAX= 
##$RELAX= 
$$ Bruker specific parameters
$$ --------------------------
##$DU= <F:/spectra>
##$EXPNO= 1
##$NAME= <H-C>
##$PROCNO= 1
##$TYPE= <nmr>
##$USER= <she>
##$AMP= (0..31)
100 100 100 100 100 100 100 100 100 100 100 100 100 100 100 100 100 100 
100 100 100 100 100 100 100 100 100 100 100 100 100 100 
##$AQSEQ= 0
##$AQ_mod= 1
##$AUNM= <au_zg>
##$AUTOPOS= <>
##$BF1= 200.13
##$BF2= 200.13
##$BF3= 200.13
##$BF4= 200.13
##$BF5= 200.13
##$BF6= 200.13
##$BF7= 200.13
##$BF8= 200.13
##$BYTORDA= 1
##$CFDGTYP= 0
##$CFRGTYP= 5
##$CHEMSTR= <none>
##$CNST= (0..31)
1 1 145 1 1 1 1 1 1 1 1 1 1 1 1 1 1 1 1 1 1 1 1 1 1 1 1 1 1 1 1 1 
##$CPDPRG= <>
##$CPDPRG1= <>
##$CPDPRG2= <>
##$CPDPRG3= <>
##$CPDPRG4= <mlev>
##$CPDPRG5= <mlev>
##$CPDPRG6= <mlev>
##$CPDPRG7= <mlev>
##$CPDPRG8= <mlev>
##$CPDPRGB= <>
##$CPDPRGT= <>
##$D= (0..31)
0 0.7 0 0 0 0 0 0 0 0 0 0.03 0 0 0 0 0 0 0 0 0 0 0 0 0 0 0 0 0 0 0 0 
##$DATE= 1745316684
##$DBL= (0..7)
120 120 120 120 120 120 120 120 
##$DBP= (0..7)
150 150 150 150 150 150 150 150 
##$DBP07= 0
##$DBPNAM0= <>
##$DBPNAM1= <>
##$DBPNAM2= <>
##$DBPNAM3= <>
##$DBPNAM4= <>
##$DBPNAM5= <>
##$DBPNAM6= <>
##$DBPNAM7= <>
##$DBPOAL= (0..7)
0.5 0.5 0.5 0.5 0.5 0.5 0.5 0.5 
##$DBPOFFS= (0..7)
0 0 0 0 0 0 0 0 
##$DE= 6
##$DECBNUC= <off>
##$DECIM= 32
##$DECNUC= <off>
##$DECSTAT= 4
##$DIGMOD= 1
##$DIGTYP= 9
##$DL= (0..7)
0 120 120 120 120 120 120 120 
##$DP= (0..7)
150 150 150 150 150 150 150 150 
##$DP07= 0
##$DPNAME0= <>
##$DPNAME1= <>
##$DPNAME2= <>
##$DPNAME3= <>
##$DPNAME4= <>
##$DPNAME5= <>
##$DPNAME6= <>
##$DPNAME7= <>
##$DPOAL= (0..7)
0.5 0.5 0.5 0.5 0.5 0.5 0.5 0.5 
##$DPOFFS= (0..7)
0 0 0 0 0 0 0 0 
##$DQDMODE= 0
##$DR= 18
##$DS= 0
##$DSLIST= <SSSSSSSSSSSSSSS>
##$DSPFIRM= 0
$$ [...]
##$SUBNAM0= <"">
##$SUBNAM1= <"">
##$SUBNAM2= <"">
##$SUBNAM3= <"">
##$SUBNAM4= <"">
##$SUBNAM5= <"">
##$SUBNAM6= <"">
##$SUBNAM7= <"">
##$SUBNAM8= <"">
##$SUBNAM9= <"">
##$SW= 18.0517328524113
##$SWIBOX= (0..15)
0 0 2 0 0 0 0 0 0 0 0 0 0 0 0 0 
##$SW_h= 3612.71676300578
##$TD= 16384
##$TD0= 1
##$TE= 0
##$TE2= 300
##$TE3= 300
##$TEG= 300
##$TL= (0..7)
0 120 120 120 120 120 120 120 
##$TP= (0..7)
150 150 150 150 150 150 150 150 
##$TP07= 0
##$TPNAME0= <>
##$TPNAME1= <>
##$TPNAME2= <>
##$TPNAME3= <>
##$TPNAME4= <>
##$TPNAME5= <>
##$TPNAME6= <>
##$TPNAME7= <>
##$TPOAL= (0..7)
0.5 0.5 0.5 0.5 0.5 0.5 0.5 0.5 
##$TPOFFS= (0..7)
0 0 0 0 0 0 0 0 
##$TUNHIN= 0
##$TUNHOUT= 0
##$TUNXOUT= 0
##$USERA1= <user>
##$USERA2= <user>
##$USERA3= <user>
##$USERA4= <user>
##$USERA5= <user>
##$V9= 5
##$VALIST= <valist>
##$VCLIST= <CCCCCCCCCCCCCCC>
##$VD= 0
##$VDLIST= <DDDDDDDDDDDDDDD>
##$VPLIST= <PPPPPPPPPPPPPPP>
##$VTLIST= <TTTTTTTTTTTTTTT>
##$WBST= 1024
##$WBSW= 4
##$XGAIN= (0..3)
0 0 0 0 
##$XL= 0
##$YL= 0
##$YMAX_a= 218712
##$YMIN_a= -222990
##$ZGOPTNS= <>
##$ZL1= 120
##$ZL2= 120
##$ZL3= 120
##$ZL4= 120
##$ABSF1= 10
##$ABSF2= 0
##$ABSG= 5
##$ABSL= 3
##$ALPHA= 0
##$AQORDER= 0
##$ASSFAC= 0
##$ASSFACI= 0
##$ASSFACX= 0
##$ASSWID= 0
##$AUNMP= <proc_1d>
##$AZFE= 0.1
##$AZFW= 0.1
##$BCFW= 1
##$BC_mod= 2
##$BYTORDP= 1
##$COROFFS= 0
##$CY= -3
##$DATMOD= 1
##$DC= 2
##$DFILT= <>
##$DTYPP= 0
##$F1P= 0
##$F2P= 0
##$FCOR= 0.5
##$FTSIZE= 0
##$FT_mod= 4
##$GAMMA= 1
##$GB= 0.15
##$INTBC= 1
##$INTSCL= 1
##$ISEN= 128
##$LB= 0.25
##$LEV0= 0
##$LPBIN= 0
##$MAXI= 10000
##$MC2= 0
##$MEAN= 0
##$ME_mod= 0
##$MI= 1.114404
##$NCOEF= 0
##$NC_proc= 0
##$NLEV= 6
##$NOISF1= 3.799351
##$NOISF2= 2.8
##$NSP= 1
##$NTH_PI= 0
##$NZP= 0
##$OFFSET= 14.38212
##$PC= 1
##$PHC0= -907.6058
##$PHC1= 6.79221
##$PH_mod= 1
##$PKNL= yes
##$PPARMOD= 0
##$PSCAL= 0
##$PSIGN= 0
##$REVERSE= no
##$SF= 200.129724274929
##$SI= 16384
##$SIGF1= 3
##$SIGF2= 2
##$SINO= 400
##$SIOLD= 16384
##$SREGLST= <1H.CDCl3>
##$SSB= 0
##$STSI= 0
##$STSR= 0
##$SW_p= 3205.1282051282
##$SYMM= 0
##$S_DEV= 0
##$TDeff= 0
##$TDoff= 0
##$TI= <>
##$TILT= no
##$TM1= 0
##$TM2= 0
##$TOPLEV= 0
##$USERP1= <user>
##$USERP2= <user>
##$USERP3= <user>
##$USERP4= <user>
##$USERP5= <user>
##$WDW= 1
##$XDIM= 8192
##$YMAX_p= 0
##$YMIN_p= 0
$$ End of Bruker specific parameters
$$ ---------------------------------
##NTUPLES= NMR FID
##VAR_NAME=  TIME,          FID/REAL,        FID/IMAG
##SYMBOL=    X,             R,               I
##VAR_TYPE=  INDEPENDENT,   DEPENDENT,       DEPENDENT
##VAR_FORM=  AFFN,          ASDF,            ASDF
##VAR_DIM=   8192,          8192,            8192
##UNITS=     SECONDS,       ARBITRARY UNITS, ARBITRARY UNITS
##FACTOR=    0.0002768,     1,               1
##FIRST=     0,             0,               0
##LAST=      2.2672688,     0,               0
##MIN=       0,             -222990,         0
##MAX=       2.2672688,     218712,          0
$$ Real data points
##PAGE= N=1
##DATA TABLE= (X++(R..R)), XYDATA
0@%%%%%%%%%qJ6j6J6j7K5l2M0n6P2q8J04j20J42j67J94k29K69l13L61m14M74n42
$$ 0 0 0 0 0 0 0 0 0 0 -8 8 -8 8 -9 16 -16 24 -32 40 -48 56 -64 78 -89 105 -124 145 -168 193 -221 253 -289
32b89O18p02P94q95J007j131J264j410J573j750J942k154K386k637K910l207L535
$$ -289 329 -373 421 -474 533 -598 666 -744 829 -921 1021 -1133 1253 -1384 1526 -1681 1854
49A854l894M288m724N202n733O327o993P744q599R582j0728J2083j3712J5716
$$ 1854 -2040 2248 -2476 2726 -3007 3320 -3673 4071 -4528 5054 -5674 6409 -7303 8413
63H413j8252K1577k6149L2889m3964O6490j85639J79634J5817r0360K41854l41207
$$ 8413 -9839 11738 -14411 18478 -25486 41004 -144635 34999 50816 -39544 202310 -138897
75a38897K68777j24111j84203J92527o5828J45006k9420j27085R8973r004m1799
$$ -138897 129880 5769 -178434 14093 -51735 93271 63851 -63234 35739 26735 -15064
86a5064o0722Q1817j0803P2882r0318o1780K07869j46250L8706l7016q1690K29045
$$ -15064 -75786 6031 -4772 68110 -22208 -83988 123881 -22369 16337 -20679 -102369 126676
98A26676k08628O7942O8618o4342J28252k30078P3202O3097m6321P7942j31488
$$ 126676 -81952 -14010 54608 -9734 118518 -111560 -38358 24739 -21582 56360 -75128
109g5128J49269m4945o7849K9485p8002K06281j27130k8889O6659j00300J63377
$$ -75128 74141 29196 -38653 -9168 -87170 119111 -8019 -36908 29751 -70549 92828
120I2828j58089L3007J33087j24339O7422j31914M1548J12709q4717L9750j4602
$$ 92828 -65261 -32254 100833 -23506 43916 -87998 -46450 66259 -18458 21292 6690
131F690L3567l5511n7428p488O0945Q2698j14274O1195l1152j5180O6156j76968
$$ 6690 40257 4746 -52682 -60170 775 83473 -30801 30394 -758 -15938 50218 -126750
143a26750J63697Q921p3491R7350j69380J50211p426j24195J30046r8351Q9661
$$ -126750 36947 45868 -27623 69727 -99653 50558 43132 -81063 48983 -49368 40293
154D0293k1166r7406J28654l8258J3785m2817k9423O5174k1141K336k1051O6204
$$ 40293 19127 -78279 50375 12117 25902 -16915 -46338 18836 -2305 31 -21020 45184
166D5184j4461n2252J611l6528J04547m5678k0381O1284n9718N5745q4757m389
$$ 45184 30723 -21529 -19918 -56446 48101 2423 -17958 43326 -16392 39353 -45404 -49793
178d9793R1803m9759M2584n4795J6971L9235p0498K8512j8034N0257l777n1080
$$ -49793 42010 -7749 34835 -19960 -2989 36246 -34252 -5740 -23774 26483 22706 -28374
190b8374L9873j9987M0230m4717k0239N5610l7171L3065l7158J6362N1882o4333
$$ -28374 11499 -8488 31742 -12975 -33214 22396 -14775 18290 -18868 -2506 49376 -14957
202a4957J2816k8012K1738L0238m3046L8390k346P011k3571l9498L5835O52J8327
$$ -14957 -2141 -30153 -8415 21823 -21223 17167 14821 21832 -1739 -41237 -5402 -4750 13577
215A3577j4611N878K6164l6667q29k3138K5225K3120l2669K5296r940J4524o188
$$ 13577 -1034 4844 31008 -5659 -6488 -29626 -4401 18719 -13950 11346 1406 15930 9742
228I742l7428L0966q327O904n619r750L6550j4826l756r690k946J4392k3251P906
$$ 9742 -27686 3280 -5047 1857 -3762 -13512 23038 8212 4456 -5234 -8180 6212 -17039 -9133
242i133Q291J5600N595k3551O941q855l181n880l517K9824K566R21r571r956M428
$$ -9133 -842 14758 20353 -3198 3743 -5112 -8293 -14173 -17690 12134 14700 15621 6050 -3906 522
257E22j9307K220J0747J4094J3009j3947j641n650q429m014m066J6967R243M13
$$ 522 -18785 -16565 -5818 8276 21285 7338 5697 47 -8382 -12396 -16462 505 9748 10161
271A0161j876n232M29q938p068K068P590Q199N65K706N48m938r239q985K936P473
$$ 10161 8285 3053 3482 -5456 -12524 -10456 -2866 5333 5898 8604 9152 4214 -5025 -14010 -11074 -3601
287c601P131N287J445j314q474r605j795M002P330M642m49N79k589m001l4o80
$$ -3601 3530 8817 10262 8948 474 -9131 -10926 -6924 406 5048 4599 5178 2589 -1412 -1446 -2126
303b126J939j612l745K134K745P336L543k847m664j1333n528J340Q586J4627O548
$$ -2126 -187 -1799 -5544 -3410 -665 6671 10214 7367 2703 -8630 -14158 -12818 -4232 10395 16943
318A6943p27j1746j4549p342j84J2812J3010Q384L97j1987j0919q525R60Q911
$$ 16943 16216 4470 -10079 -17421 -17605 -4793 8217 16601 16998 5011 -5908 -14433 -13473 -4562
332d562P053P416r56l713m192o385J102n96J065K613M90O539J086m69l533r239
$$ -4562 2491 9907 8951 5238 1046 -5339 -4237 -4833 -3768 -1155 -665 5874 6960 6491 2958 -6281
348f281k042k999O553J1268M460L360j1158r442n999k099J2668O926R362k228
$$ -6281 -8323 -11322 -4769 6499 10959 14319 3161 -6281 -12280 -14379 -1711 5215 14577 12349
362A2349j2846m989r226P461P783N511P576j0969l115q051j67J0481j944Q910
$$ 12349 -497 -5486 -14712 -7251 532 6043 13619 2650 -465 -8516 -8683 1798 -146 8764
376H764o305m177L28p081J2777k350K049k060j0718R408n960R307L918n847L791
$$ 8764 2459 -1718 -1390 -8471 4306 1956 4005 1945 -8773 635 -5325 3982 7900 2053 5844
391E844j8478N565K814N654J3827j3427O267j4188p043Q029m024K5209o979l649
$$ 5844 -12634 -7069 -4255 1399 15226 1799 8066 -6122 -13165 -5136 -9160 16049 9070 5421
405E421l250j7265J4525j0690J3531J0225r103O453k4086R774L314j033J3133
$$ 5421 2171 -15094 -569 -11259 2272 12497 3394 9847 -14239 -4465 -1151 -2184 10949
418A0949j5322J4007j4313n544J0913o526K4415j9602p81K757j4022K0642j9410
$$ 10949 -4373 9634 -4679 -10223 690 -5836 18579 -1023 -1804 953 -13069 7573 -11837
431a1837J8619O022j6996J1890k5587K2510q16j1413J6112j9441K2959j4975l382
$$ -11837 6782 12804 -4192 7698 -17889 4621 3805 -7608 8504 -10937 12022 -2953 -6335
444f335J9063j7602J7374l0152N349J8897j2229K7411k3918J3100m538l3731J9875
$$ -6335 12728 -4874 12500 -17652 -12303 6594 -5635 21776 -2142 10958 6420 -27311 -7436
457g436j1722L5729M502j7875J3405k8386O191j9295R051L1594l885J4095l4750
$$ -7436 -19158 16571 21073 3198 16603 -11783 -5592 -24887 -15836 15758 11873 25968 -8782
470h782J0805n885k0029K6498k1128M5928j3484k5845K9948m0467L6870k4010
$$ -8782 2023 -3862 -23891 2607 -18521 27407 13923 -11922 18026 -22441 14429 -9581
482i581j6189N0874l7313L0149j8709r343L7318m5978J3330o763R552K2649k6080
$$ -9581 -25770 25104 -12209 17940 -769 -10112 27206 -18772 -5442 -12205 -2653 19996 -6084
495f084J4700p335P033j9653q751K6037o955K4550l5266Q850J9450l6767L0397
$$ -6084 8616 1281 8314 -11339 -20090 5947 -1008 23542 -11724 -2874 16576 -20191 10206
508A0206l0207K9156J6822n1254L5340k6707K6242M391l8133M6363k7893J1521
$$ 10206 -20001 9155 25977 -25277 10063 -16644 9598 13989 -24144 22219 -5674 5847
520E847j6473j4129N1245l0239J8607k2216O14K8506n2210L2568r034J6643J8118
$$ 5847 -10626 -24755 26490 -3749 14858 -7358 -6744 21762 -30448 2120 -6914 9729 27847
533B7847n4529L8141j4212J02M616k7351M4954j1791o857o692J700J9507k4362
$$ 27847 -26682 11459 -2753 -2651 1965 -25386 19568 7777 920 -5772 -4072 15435 -8927
546h927N351j3146L2509l972l1357L7330l0944L2988k2810l5706O9626m4749K7673
$$ -8927 -3576 -16722 15787 11815 -19542 17788 -13156 19832 -2978 -38684 30942 -13807 13866
559A3866r309l1433O9714o4215J0858J3941j9190N1832n2892J0003K1015j8308
$$ 13866 4557 -26876 42838 -21377 -10519 3422 -15768 36064 -16828 -6825 14190 -4118
571d118J0637k7639K2907J0250o225j4361j125K8656k5242Q759j7202J4044K8523
$$ -4118 6519 -21120 1787 12037 5812 -8549 -9674 18982 -6260 2499 -14703 -659 27864
584B7864n1845K9563q749O566J7038n4589M5073n659o272P815l1530M7634j9664
$$ 27864 -23981 5582 -3167 3399 20437 -34152 10921 5262 -1010 6805 -24725 22909 3245
597C245j0481K879o995L6959l7622P837N674M96J8515m9323L1212M417p878J2455
$$ 3245 -7236 -4357 -11352 25607 -12015 -4178 1496 1992 20507 -28816 2396 6813 -1065 11390
611A1390l7303M3846p662k2254J2154j5931L5864j8781j4101J6439o80J0845k9024
$$ 11390 -25913 17933 10271 -11983 171 -15760 20104 1323 -12778 3661 2981 13826 -15198
624a5198Q679J0464L371l415k4997L5114r192l986k238j8285M3945l0085n203
$$ -15198 -6519 3945 7316 3901 -21096 14018 4826 840 -1398 -19683 24262 -5823 -11026
637a1026J5153j1117L4407l8825M17K0722j6818J4754k6037K0555J7996j9668
$$ -11026 4127 -6990 27417 -11408 -10991 9731 -7087 7667 -18370 2185 20181 513
649E13m89j5457K2443n970j1697J0174K388K1343k9288m906J1331m314J3651k6264
$$ 513 24 -15433 7010 1040 -10657 -483 1905 23248 -6040 -10946 385 -3929 9722 -16542
663a6542J8515J4616j6725L137k0227K2899K292j9225J0754k908J9349j3742j3701
$$ -16542 1973 16589 -136 3001 -17226 5673 7965 -11260 -506 -3414 15935 2193 -11508
676a1508J3710k338O776j8718O501J7203p140q60j6300J5300L823j3598N272k626
$$ -11508 2202 -136 6640 -12078 -5577 11626 4486 3626 -12674 2626 6449 -7149 -1877 -4503
690d503J9270j1646j4639J0383j248J3158j5801p9J5400j1163J007j4290J2867
$$ -4503 14767 3121 -11518 -1135 -2383 10775 -5026 -5105 10295 -868 139 -14151 -1284
703a284J5951j4624K223p359P254r77j5409J2757Q184O036r921j0969O926m32
$$ -1284 14667 43 2266 -5093 2161 1184 -14225 -1468 6716 12752 2831 -8138 -1212 -1644
717a644j600n008J1555R502p497o515q847J1309p05q653Q735J485R503q705j1758
$$ -1644 -3244 -8252 3303 12805 5308 -1207 -10054 1255 550 -8103 632 2117 11620 2915 -8843
732h843J0073k713J75m160J453J4426l936o408l487J774J639o266J220P778Q589
$$ -8843 1230 -1483 -1308 -5468 -4015 10411 6475 67 -3420 -1646 -7 -6273 -5053 2725 11314
747A1314o336q727Q15q45K863m144L699J1850m681n596o365N64P717m058O71N695
$$ 11314 4978 -3749 -2934 -3779 -916 -5060 -1361 10489 5808 212 -6153 -5589 2128 -1930 -1259 4436
763D436P52k980p530p19P436J542l814J222J423L63k804n094O034L598l768p18
$$ 4436 5188 2208 -5322 -6041 1395 2937 -877 345 1768 2131 -673 -5767 267 3865 97 -621
779f21j627M112J046o031K043K313o27p47k770L674L841m639k154O43N05K436
$$ -621 -2248 1864 2910 -3121 -1078 1235 608 -139 -2909 765 4606 -33 -2187 -1544 -1039 1397
795A397k557J004M704l482k567j854N50N220j744l40K171j673j087l023K17M513
$$ 1397 -1160 -156 4548 1066 -1501 -3355 -2805 2415 671 331 2502 829 -258 -3281 -3064 1449
811A449O62j331j74k68l86r12j716K549K215j816M57j170P06R97l577J638N65
$$ 1449 2111 780 606 338 -48 -960 -2676 -127 2088 272 729 -441 265 1262 -2315 -677 -112
828a12k8J888k281J949q9k879L47j301K575J724n03R17j964j044j885j58K604
$$ -112 -140 1748 -533 1416 1327 -1552 -1205 -2506 69 1793 1290 2207 243 -801 -2686 -2844 -240
845b40J787K126j828j344k080k145J881K21M058J352j783k85m939N69J85O56M677
$$ -240 1547 3673 1845 501 -1579 -3724 -1843 -1622 2436 3788 2005 1720 -3219 -2650 -2465 -1809 2868
862B868j116K090k605l543P84k693M096O01R92K616l672P91m011k70K378r84M616
$$ 2868 1752 3842 1237 -2306 -1522 -4215 -119 482 1474 4090 418 1209 -2802 -3072 -694 -1678 2938
879B938j759J417q26m413J729l055M144Q72l48L395m730J861l965n83M203k585
$$ 2938 1179 2596 1770 -2643 -914 -3969 175 1047 699 4094 -636 1225 -2740 -3323 880 -1705
895a705N648l438L97P87o031M962l637M066K059m561N266o501K514m49k804P293
$$ -1705 3943 505 902 1689 -4342 620 -3017 1049 3108 -1453 3813 -2688 -174 -623 -3427 3866
911C866n211M052k295k746M480o242N653j876P57K867o231N255n008K402J044
$$ 3866 -1345 2707 412 -2334 2146 -4096 1557 -319 438 3305 -2926 2329 -2679 -277 767
926G67l358P222o819M189k335k714O539q288P946l189q70N313j0040R168n532
$$ 767 -2591 4631 -2188 2001 -334 -3048 3491 -4797 3149 -40 -910 4403 -5637 3531 -2001
941b001M83N243q344J0152p668J082L257o740R274p905M116J265m922O128q179
$$ -2001 -1518 3725 -4619 5533 -2135 -1053 2204 -4536 4738 -3167 949 2214 -2708 3420 -4759
956d759P024j988j558M429p340Q848p358J511L394o089J0437j0961N210J461o990
$$ -4759 2265 277 -1281 3148 -4192 4656 -2702 -1191 2203 -3886 6551 -4410 800 2261 -4729
971d729J0269j2111R640j81o978R555j2083J0624l911m831R883r638J0369p828
$$ -4729 5540 -6571 3069 2888 -4090 5465 -6618 4006 95 -4736 5147 -4491 5878 -1950
985a950j232P518q955R126q926N029L983q536P761r312Q686j855o005Q670p918
$$ -1950 -3182 4336 -4619 4507 -4419 610 4593 -3943 3818 -5494 3192 1337 -4668 4002 -3916
1000c916R961p979j556P624q442R668j1104O184N151j0156J0059j3061J0939j63
$$ -3916 6045 -1934 -3490 4134 -4308 5360 -5744 440 5591 -4565 5494 -7567 3372 3209
1014C209j0819J4031j2272J2400n134r984J5987j3102R911n490m286J5063j3597
$$ 3209 -7610 6421 -5851 6549 1415 -8569 7418 -5684 4227 -1263 -5549 9514 -4083
1027d083N798m581J106P818j0981O090k722N731l232o212P909n553Q972j0814
$$ -4083 1715 -2866 -1760 6058 -4923 1167 -1555 4176 944 -5268 2641 -2912 6060 -4754
1041d754J791J0625j2443J0967j3605O539R606j8213J5038r730P240M461j9395
$$ -4754 -2963 7662 -4781 6186 -7419 -880 8726 -9487 5551 -4179 3061 7522 -11873
1054a1873J6477p441M670Q34j0231J6622r616M32m286p40J3022j0877N910m115
$$ -11873 4604 -2837 1833 2667 -7564 9058 -558 -126 -4412 -5152 7870 -3007 2903 -1212
1068a212L729K264j5978J1636k575P319l59j1554J4157r466O53l327j684J6619
$$ -1212 2517 4781 -11197 439 -2136 5183 4824 -6730 7427 -2039 -1386 -4713 -6397 10222
1082A0222j0119K289m035J446M980j4828R423q52P653n25j3592J4645r116K455
$$ 10222 103 2392 -1643 -197 4783 -10045 -622 -1474 6179 5654 -7938 6707 -2409 46
1096D6l523o411K1711j2081K283j008n147J2547j8239M934O518J101O420j4786
$$ 46 -3477 -9888 11823 -258 2025 1017 -4130 8417 -9822 -4888 1630 2731 9151 -5635
1110e635O985k42l573j240l610J5970m116k355m950j918J0588j2928N094L434
$$ -5635 1350 1108 -2465 -3705 -7315 8655 4539 2184 -2766 -4684 5904 -7024 -1930 1504
1124A504K609M952j8119P195K021n14K570q520J3578l249o149k092j770J3651
$$ 1504 4113 9065 -9054 -1859 162 -352 2218 -6302 7276 4027 -2122 -4214 -5984 7667
1138G667q453k48J477O36N755j6111O713M432k60L364j3140J2652R6p919J920
$$ 7667 -786 -1034 443 1079 6834 -9277 -2564 1868 1608 4972 -8168 4484 4580 -3339 -1419
1153a419o031J3811l554o768N848q62M868j0771k303P710K219J244p548O467J292
$$ -1419 -7450 6361 2807 -3961 1887 1025 5893 -4878 -7181 529 2748 3992 -3556 2911 4203
1168D203n452l873l087J3807j426l684M17j886O252j1230q60P719K628L523j1396
$$ 4203 -1249 -5122 -8209 5598 4172 488 905 -981 5271 -5959 -6819 900 3528 7051 -4345
1183d345L688L459m429k5n063J1881L13p709J405k530Q964n899o067Q040o02K955
$$ -4345 -657 2802 -1627 -1652 -6715 5166 5479 -2230 -825 -3355 5609 -290 -6357 1683 1081 4036
1199D036o851j100R332l642l639k848M240N004m198k859K693M745n537l876J226
$$ 4036 -2815 -3915 5417 1775 -1864 -4712 -472 4532 334 -2525 168 4913 -624 -4500 -3274
1214c274M707M971r089J345L915k705O39p372P074O461p032J11k760M577J242
$$ -3274 1433 6404 -2685 -1340 2575 -130 509 -6863 211 6672 -360 -249 -3009 1568 2810
1229B810p817L545L780J187l693l741M355K717k673m694L471L608j824j983j918
$$ 2810 -5007 -1462 2318 3505 -188 -3929 426 3143 470 -4224 -753 2855 1031 -952 -2870
1244b870O374l45o795J207J327M314j779m787N033J104k875l065m6N652P11m378
$$ -2870 3504 3159 -3636 -2429 -1102 3212 1433 -3354 1679 2783 -92 -3157 -3203 2449 3160 -1218
1260a218o01L478r4k517j881K070N024m110l153K541J053K306m200j015N268k425
$$ -1218 -1819 1659 1565 -952 -2833 -763 4261 151 -3002 -461 592 2898 -1302 -2317 2951 526
1276E26k160j157J854N124k861k854J841M45j212k364J60N031J410l967k69O14
$$ 526 -1634 -2791 -937 4187 1326 -1528 313 758 -454 -2818 -2658 2373 3783 -184 -453 161
1292A61o1r15l318L982L675k260o00j569J502K79m409J396L159R94m00k307Q90
$$ 161 100 -815 -4133 -151 3524 1264 664 -905 597 876 -3533 -2137 1022 2016 1616 -691 199
1309A99J553k858j914J944J705J294j464j284L103j548k435j3k45L626r75j600
$$ 199 1752 -1106 -3020 -1076 629 1923 459 -825 2278 730 -1705 -1718 -1963 1663 688 -912
1325i12K813p02l01k278j506L128m4m45O19Q84P73j783j939K53J596q80nJ179
$$ -912 1901 1199 898 -1380 -2886 242 198 -247 372 1256 2029 246 -1693 -1440 156 -724 -729 450
1343D50P06J612k972p89Q87j880J241r22K130L155k247r8k386r08N10j304L107
$$ 450 1156 2768 -204 -993 -106 -1986 -745 -1667 463 3618 1371 1273 -1113 -2021 -1511 -2815 292
1360B92J889J140j165l102n98j218J233P51K076K078k039n12k926K47J459r57
$$ 292 2181 3321 2156 -946 -1544 -2762 -1529 -778 1298 3376 1337 825 -2101 -1854 -395 -1352
1376a352K898r16O02k48k667K051j311J134Lj384K238j569J573o14p18J188k798
$$ -1352 1546 630 1232 984 -1683 368 -943 191 194 -1190 1048 -521 1052 438 -280 908 -1890
1393a890J765r26J227K054k601J859k898K81J201j681L799j914O18o29k757K857
$$ -1890 -125 -1051 176 2230 -371 1488 -1410 -1129 72 -1609 2190 276 894 265 -2492 365
1409C65j417K450j01j517J140l196J910n21J515J988k912J392l400J223J234j248
$$ 365 -1052 1398 1297 -220 920 -2276 -366 -887 628 2616 -296 1096 -2304 -1081 153 -1095
1425a095M240l195J141j629k709M362k445L538q82k262K437m597L148l28N46K703
$$ -1095 3145 -50 1091 -538 -3247 1115 -1330 2208 1326 -936 1501 -3096 52 -276 270 2973
1441B973m483K187k436R76K006k127L576l515O08p73j093M670k801K630k690j814
$$ 2973 -1510 677 -1759 -783 1223 -904 2672 -843 -235 -1008 -2101 2569 -232 2398 -292 -2106
1457b106K249l670N684r20Q31O80o497L384l262K927L513k363M638o077m78n99
$$ -2106 143 -3527 2157 1237 2068 2748 -3749 -365 -3627 -700 2813 450 5088 -989 -1467 -2066
1473b066k079O157k443L601q53k920J523m835L790r42P13K375l008M227l628Q64
$$ -2066 -4145 2012 -431 3170 2317 -603 920 -3915 -125 -1067 -354 2021 -987 3240 -388 476
1489D76k29l494L783m231M682J458r56L378p406K023l235p34O295k077O938m040
$$ 476 247 -3247 536 -3695 987 2445 1489 4867 -2539 -516 -3751 -4485 1810 -267 6671 2631
1505B631l222J04o211O044j384M057L660n113J955o646J727J692j261N455l373
$$ 2631 -591 -487 -6698 -654 -2038 2019 5679 566 2521 -4125 -2398 -706 -1967 3488 115
1520A15K423k829k319L304k337M276l472M30J191l298M438l694M157j99m490L515
$$ 115 2538 -291 -2610 694 -1643 2633 -839 -409 782 -2516 1922 -1772 2385 2186 -2304 1211
1536A211n406N441o13k314N789n821L844l244j855N918n240L715k705K80M316
$$ 1211 -4195 1246 633 -1681 4108 -1713 2131 -1113 -2968 2950 -2290 1425 -1280 -1000 3316
1551C316m628L488k744N56n48l986M977l90M348k140k909J901n858L011j744L846
$$ 3316 -1312 2176 -568 -12 -560 -4546 431 41 4389 2249 -660 1241 -4617 -1606 -3350 496
1567D96N918n467K069n826K81J767m202P404o46K106j813n750M224l090K312p13
$$ 496 6414 947 3016 -2810 -2529 -762 -4964 2440 1794 3900 2087 -3663 561 -2529 -217 -930
1583i30L94M820m978J566k509J723K165o091M237j593K773O85m928N945l616j87
$$ -930 -536 4284 -694 872 -1637 86 2251 -3840 397 -1196 1577 2262 -2666 3279 -337 -524
1599e24j215k176P564l181O69o62j223K915n831K206J548J830P43n298L501j049
$$ -524 -1739 -3915 3649 468 1137 475 -748 2167 -3664 -1458 90 1920 2663 -2635 866 -183
1615a83L87j014j838O159l300l20j220J26N006n508J106K63O68J736n575M159
$$ -183 204 -810 -2648 3511 211 -109 -1329 -1203 3803 -1705 -599 -336 332 2068 -3507 652
1631F52Q59j62j261l956N660j549l18l56m45N219n824m59R23P01L880o153K618
$$ 652 1511 1349 88 -3868 1792 243 -75 -431 -876 4343 -1481 -1940 -1017 -316 3564 -2589 29
1648B9J980j913L91m695M855J785k949L18r13L722j960l119J041K131J562l826
$$ 29 2009 96 487 -4208 647 2432 -517 -199 -1112 2610 650 -2469 -1428 703 2265 -1561
1664a561P70J502J521j542m587M653j48m00p81k041P027l176k740Q32j397M806
$$ -1561 -791 711 2232 690 -3897 756 608 208 -573 -2614 4413 1237 -1503 -671 -2068 2738
1680B738m680n41N110p22P58n180K44L540k346k68L11M034N58m174j859R90K759
$$ 2738 -1942 -2483 2627 1905 2663 -2517 -2273 1267 -1079 -1347 -1036 2998 3556 -618 -2477 -1487 1272
1697A272k544l12K517J749J4n608J273K681q23n11k509M286J301l456j27K03L174
$$ 1272 -1272 -1584 933 2682 2696 -2912 -1639 1042 219 -292 -2801 1485 2786 -670 -797 -594 2580
1714B580k410l597K010K188J796l034O7K537j162k179l168L841L132j861m09q49
$$ 2580 170 -3427 -1417 771 2567 -467 -400 2137 975 -1204 -4372 -531 2601 740 331 -518
1730e18K912j562m301J861J750J789k223j581L853O92k112k889N45K106j027j091
$$ -518 2394 832 -3469 -1608 142 1931 -292 -1873 1980 2672 560 -2329 -1784 322 -705 -1796
1746a796J804M372q22m195k355P4K610j340J079M449M25j925n867r19L562O3J099
$$ -1796 8 4380 3558 -637 -2992 -2918 -308 -1648 -569 3880 4305 2380 -3487 -4406 -844 -781 318
1763C18R24K188L3n296j932J850K637K4j428J418J559j050l181L36K362r2j562
$$ 318 1242 3430 3463 -1833 -3765 -1915 722 746 -682 736 2295 1245 -1936 -1600 762 670 -892
1780h92j517L204K038k146r80n72J395j195k387K725K622O42k671k329J630L38
$$ -892 -2409 795 2833 687 -293 -865 530 -665 -3052 -327 2295 2937 266 -2063 -433 -95
1796i5p88n7K118J480k334k502K08L014N08j521q7J47K44k275r9L529J262q20
$$ -95 -883 -940 1178 2658 324 -2178 -1970 1044 1552 31 -56 91 335 -1940 -2039 1490 2752 1932
1814A932l292p63J655n32N12J251J979l83l814j342J201K272J60n64R62j81j182
$$ 1932 -1360 -2123 -468 -1000 -488 763 2742 2359 -1455 -2797 -1596 676 836 272 1234 1053 -129
1831a29k216R99K701j18q51j634J132R74j473O54L42P66j285k270J719J623R87
$$ -129 -2345 -1346 1355 1237 386 -1248 -116 858 -615 39 381 1147 -138 -2408 -689 934 1921
1848A921j108j375M78j005l99M19K402J636j880j831j512J155O31P4K130R3k18
$$ 1921 813 -562 -84 -1089 -1488 -1069 1333 2969 1089 -742 -2254 -1099 -468 -394 1736 1829 1611
1865A611k642j798K025N68J347l32k30Q09k127l08N2J158Q99j602M12K12R90k53
$$ 1611 -1031 -2829 -804 -236 1111 779 549 1358 -769 -1077 -1025 133 1032 -570 -158 54 1044 791
1883G91j197O10j200L7l90J073K886q23m02k364j292P94o98K882J500O25p58l721
$$ 791 -406 204 -996 -959 -1349 -276 2610 1787 1385 -979 -2271 -1477 -2175 707 2207 2832 2074 -1647
1901a647m08m73J380J881N91J489j816j366j468n3J915k12J321o20p1J88j701
$$ -1647 -2055 -2528 -1148 733 1324 2813 997 -369 -1837 -1890 25 -187 1134 514 443 631 -1070
1918a070J427p12L94J6j521J983n67J072J03j455Q99k080N96L65L77K029j534
$$ -1070 357 -355 39 55 -1466 517 -50 1022 1125 -330 569 -1511 -915 -550 -173 1856 322
1935C22N04j158n56R32j245J728n47J72L94j274J756q86K62m87j536J304q54J782
$$ 322 826 -332 -888 44 -1201 527 -20 152 546 -728 1028 142 404 -83 -1619 -315 -1169 613
1953F13O95n5O13k926j50j078Q57K382j88K057j674j037j131k014K361m0K080
$$ 613 1308 1253 1866 -1060 -1210 -2288 -1431 951 763 2820 1146 109 -1022 -3036 -675 -715 1365
1970A365N47j212Q38k849L61m07J96K260j319J709q62l67L59k372J638r69P40
$$ 1365 1912 700 1538 -1311 -950 -1357 -1161 1099 -220 1489 627 260 619 -1753 -115 -1084 -344
1987c44J050r68K262j728j01n61j380J854j177J619M82l40P27k373P32p20K32
$$ -344 706 -262 2000 272 171 -390 -1770 84 -1093 526 1008 668 1395 -978 -246 -966 -734
2004g34J026q32K076j206J41l32j334J751j822J291K50m42J829k362J281o65q46
$$ -734 292 -540 1536 330 471 139 -1195 556 -1266 25 275 -167 1662 -700 581 -84 -930
2021i30J326j905K258m54j60J000j872J527j682O7Q87p67K064j468P71j63j381
$$ -930 396 -1509 749 295 135 1135 -737 790 -892 -825 62 -705 1359 -109 662 499 -882
2038h82R81j634J847J15k28J061j798J077j473RJ210o38J817j613M12n9j331J480
$$ -882 99 -1535 312 427 199 1260 -538 539 -934 -925 285 -353 1464 -149 263 204 -1127 353
2056C53j400J821j09j109J307j955J680p67n96J738j764J465j016K9J565j738
$$ 353 -1047 774 665 -444 863 -1092 588 -179 -775 963 -801 664 -352 -323 1242 -496
2072d96R13j272L53P40q29J627o36O40j314j200J111o44K084o79L89P02k684Q50
$$ -496 417 -855 -502 238 -591 1036 400 1040 -274 -1474 -363 -1007 1077 398 787 1489 -1195 -345
2090c45j436J458J738j665J776j663N7p6j648K471m53M20n01r95J573r94N14l59
$$ -345 -1781 -323 1415 -250 1526 -137 -80 -156 -1804 667 214 634 133 -862 711 -283 231 -128
2108a28K79M41j861R25l5J438J06j781J169j306L85k93k44K616j206q3r04j63
$$ -128 151 592 -1269 -344 -379 1059 1165 -616 553 -753 -368 -661 -905 1711 505 422 -482 -645
2126f45J495j702P34q3M90K77j748K056q6J45j108k107K148o80J001J043r0J509
$$ -645 850 -852 -118 -201 289 566 -1182 874 788 933 -175 -2282 -134 -814 187 1230 1140 2649
2144B649l454j587L33P47K604k88R40J48j977k132j172K148J701J118o38j19K76
$$ 2649 -805 -2392 -2059 -1312 1292 1004 1944 2092 115 -2017 -3189 -1041 660 1778 1140 1021 1297
2161A297k829j43o8J779J935k437J262Jm98O1k686K104O10r24Q20k94K081q88
$$ 1297 -1532 -1675 -1743 36 1971 -466 796 797 299 360 -2326 -222 388 -536 284 -10 2071 1183
2179A183k416j55L76J235m87O10J164M0j577k465J491J197N38m8r74J635j476
$$ 1183 -1233 -1388 -1012 223 -264 346 1510 1550 -27 -2492 -1001 196 734 686 -288 1347 -129
2196a29j556P80J012K111j737j568N99J35K83o98J412J304r49k134j268K208O56
$$ -129 -1685 -905 107 2218 481 -1087 -488 -353 -70 -768 644 1948 999 -1135 -2403 -195 461
2213D61N7M1K7J159k786j163J475J050J476k043o6J467j168n97q03J485J293j641
$$ 461 518 559 586 1745 -1041 -2204 -729 321 1797 -246 -312 1155 -13 -610 -1413 72 1365 -276
2231b76n94Q36J433o94j532q3R17L47j546R10J737J49j196k486J170J167n95M32
$$ -276 -870 -34 1399 705 -827 -910 7 354 -1192 -282 1455 1604 408 -2078 -908 259 -336 96
2249I6K63J582j064k708K37J265J415p21n98J069J2j260j476J402J687l67j072
$$ 96 359 1941 877 -1831 -1594 -329 1086 365 -233 836 848 -412 -1888 -486 1201 834 -238
2266b38o83J732j79j490K56O46J207j532j153J730P83j70j732j62J469n04o82
$$ -238 -921 811 632 -858 -602 44 1251 -281 -1434 296 1079 909 -823 -985 484 -20 -702
2283g02K34J744M04j995j194N03J478l88m46J120O28o06k363p1J825M88k39p53
$$ -702 -468 1276 1680 -315 -1509 -1006 472 84 -362 758 1386 780 -1583 -1654 171 659 420 -333
2301c33J077M25j808o74N27J714k09j389N37P99K10j506m49J369K57o54r40J196
$$ -333 744 1169 -639 -1313 -786 928 719 -670 -133 666 876 -630 -1079 290 547 -107 -1047 149
2319A49J215r67r67k89J292j45j240O11R25P37j377j050J155L15k84r49N64J366
$$ 149 1364 397 -570 -859 433 288 -952 -341 584 1321 -56 -1106 49 364 80 -869 -305 1061
2337A061o75q14r8J135J71j387l12P00R95o74n23R23L25l99j704J55J447k1K3
$$ 1061 386 -428 -526 609 780 -607 -919 -219 776 102 -421 502 827 428 -1276 -1121 326 305 328
2356C28m34Q88K37j842l39L66J239J69q54P48K97m29j297l12J263L67j40m91P79
$$ 328 -106 782 1019 -823 -1162 -796 443 612 -242 506 803 374 -923 -1235 28 395 255 -236 543
2375E43L72j179m34j15J194J0r34P53J84L51q71p59J127j60j81m37L76J136o21
$$ 543 915 -264 -698 -813 381 391 -543 210 394 745 -126 -885 242 82 -99 -536 -160 976 355
2394C55m29k32L88or04M09O20P63n05p90M59l27l6n65L99J276m00j20n81J74K92
$$ 355 -74 -306 82 76 -828 -419 201 964 459 -331 128 -199 -235 -800 -401 875 475 355 -226 -52 240
2415B40j036L64K62P28P4q58O17l23j04n26l45J289j22K52j84k62L50j157J0L50
$$ 240 -796 -432 -170 558 632 -226 391 68 -36 -562 -907 382 260 512 328 66 416 -741 -731 -381
2435c81O32O24o83J39l75k61k73j10J082P7J52o29l41M10o50N39pL49M04j126
$$ -381 251 875 192 331 -44 -305 -578 -688 394 471 623 -6 -347 63 -587 -48 -55 294 698 -428
2455d28M03k47K34L85p33P20l31o6J19m16Q48m39r2j18j93P13m22L46j51k06J58
$$ -428 -25 -272 -38 347 -386 334 3 -63 56 -360 488 49 -43 -161 -354 359 -63 283 132 -74 84
2476H4p68O74Q9K96J84q65L84n58J67L38q6Q45o55r2l83k41P53m06O52j63j70
$$ 84 -684 -10 79 375 559 -306 78 -480 -313 25 -61 784 129 37 -346 -587 166 -240 412 249 79
2497G9J51r03O60j07K47K84p36O24m60R0J42l39O94n87J51m1l2N57p13L13k93
$$ 79 230 -673 -13 -120 127 411 -325 299 -161 -71 71 -268 426 -161 -10 -51 -83 474 -239 74 -219
2518b19P8L89n33Q38m34j32j29p55J097j82M48J87p91L55j086J41O07K97R66p34
$$ -219 -141 248 -285 553 119 -13 -142 -897 200 18 466 653 -138 217 -869 -728 -121 176 1142 408
2538D08j71n84n47K71N1J264J79l4n77r56K82n96P58N66K68O49j291J0m92k88
$$ 408 237 -347 -894 -623 -572 692 871 837 260 -696 -414 -1010 -252 314 582 1231 -60 -50 -542 -830
2558h30P56m32J198K1l20L0j092M70m69J27P74K7Q11q05l24k67n78O04j75J031
$$ -830 -74 -506 692 713 393 423 -669 -199 -668 -541 233 260 1071 266 -58 -325 -903 -299 -474 557
2578E57L47m30j27j131L15j35K81R44j52M41j007m51R6j71R12j38N33j41q00K9
$$ 557 904 474 347 -784 -469 -604 -323 621 469 910 -97 -548 -452 -623 289 151 684 543 -257 -228
2598b28o49R06J39M3N09p92K78p98l6P66k53P82n35L8M6q51M44k85O62K17l79
$$ -228 -877 29 168 211 720 -72 206 -592 -628 138 -115 667 132 170 216 -635 -191 -476 186 403 24
2619B4M82o05J70n26j66Q21k81O23l45k9J85j008L31j18N54M68n21M39m56j69
$$ 24 506 -99 71 -455 -621 200 -81 542 197 168 353 -655 -324 -442 112 580 59 498 42 -127
2639a27l61j33Q58j5K91m44PJ00q11M43j48P16K10r03O71n46J74q7n75J195l66
$$ -127 -488 -621 237 222 513 69 76 176 -635 -192 -340 376 586 -317 354 -192 -18 -105 -680 515 149
2660A49o7o9k79P16o62j07K32K71J67o28K89M8K22m37m10R15k92J53l53j18R31
$$ 149 82 13 -266 450 -212 -319 -87 184 351 -277 12 60 282 -155 -565 350 58 211 -142 -260 671
2681F71r30k0J64J28O29r85J87L96j22j35n43O52K81j89m78P6P27o22p4j82M66
$$ 671 -259 -279 -115 13 642 -343 -156 240 118 -17 -560 92 373 184 -294 -218 509 -113 -187 -369 97
2702I7O63j233L38K21RJ90j116Q99N07n57q7l83P68K7p43M6N95L36p22j82J38
$$ 97 760 -473 -135 86 95 285 -831 68 575 18 -69 -452 316 343 -400 -354 241 577 -145 -327 -189
2723a89O32k13r78R14J66q4l20p59J383j84p39K80j04Q63o33q07Q09L51j11o26
$$ -189 443 230 -748 166 332 248 -72 -831 552 368 -371 -91 -195 668 35 -772 37 388 277 -349
2743c49k4O77J55q51k17J065p2k52o22P3J259j015l24N43J81O38j395j72J128
$$ -349 -373 304 459 -392 -609 456 384 132 -490 -417 842 -173 -497 46 227 865 -530 -702 426
2762D26l06j06m53N48Q35r18p78L82P35j47m08p8Q18K40j461K4N47L82J59j091
$$ 426 120 14 -439 109 944 26 -752 -370 365 218 -190 -268 550 790 -671 -647 -100 282 441 -650
2782f50R11O22j028l69l35J064M76r99K31N78K1q21p11O67J006k32p64N34K51
$$ -650 261 883 -145 -514 -849 215 691 -308 -77 501 522 -299 -1010 -343 663 431 -333 201 452
2801D52k99p83m42J594K51p47m0j27P04q06q72J137O32N0q41m09Q14q7p47MR92
$$ 452 153 -630 -1072 522 773 26 -14 -141 563 -243 -1115 22 654 704 -137 -546 268 181 -566 -562 430
2822D30M44o52q42J65R12n68m49N50N28L35j286l52R71n8j96l92O14Q53q65p50
$$ 430 874 222 -620 -455 457 -111 -560 -10 518 853 -433 -785 186 128 -68 -460 154 1007 142 -608
2842f08J32O33M5n95J86Q75K16j150m85M59M44j1n94P69O78p85p38m30R52M85
$$ -608 -476 157 202 -393 -207 668 884 -266 -751 -292 152 141 -453 316 994 209 -529 -959 -7 478
2862D78o68K59M02J71q27q86P29P12J6n03P8N90l86p18j71Q83M60o27k42K67M99
$$ 478 -190 69 471 642 -185 -1071 -342 370 386 -117 -39 551 165 -553 -724 159 619 -8 -250 17 516
2883E16m46p05M43M64K5o04K3Q22l6o23n12M31N03l41j10L01N92m83r56J13M62
$$ 516 70 -635 -192 272 297 -307 -284 538 502 -121 -633 -202 301 -40 -150 151 743 260 -696 -583 -121
2904a21N27l34j37O35k63n40o00L71R75k56j78j3J88k3q64J16O16K62j63m32L78
$$ -121 406 72 -65 570 307 -233 -833 -462 513 257 79 66 254 231 -633 -517 99 361 198 -234 144
2925A44K67m14m56J37M61J5k01k9N83m7p72j59L0O35L4l08N72j63l21n41k63J009
$$ 144 411 -3 -459 -322 139 154 -47 -76 507 460 -312 -471 -441 194 228 -80 492 329 8 -533 -796 213
2947B13J48j07m1k42J35n66j54O53M71L2n57k71P4P1j14K41N78r7l35o43j2N49
$$ 213 361 254 213 -29 106 -460 -614 39 510 542 -15 -286 -212 -141 -255 -14 564 467 132 -511 -523 26
2969B6j20L09J32L2k9q64M1K54J99L05k11L31k7m28k87k06M22P8R8K72J15O1o66
$$ 26 -94 215 347 379 350 -514 -473 -219 -20 285 74 405 378 -50 -337 -543 -121 -43 55 327 442 503 -163
2992a63l75j0J72M62J26M09Qm70n74m30L59L69M59K21k7r8q22j93m3L92O77k29
$$ -163 -538 -548 -376 86 212 621 629 159 -415 -845 -486 -117 342 563 536 438 -384 -577 -620 -228 449 220
3014B20K97k75l94N3n13N77K02j08K73m53K45m6k67K31j53J25k8j41K16J09k4
$$ 220 517 242 -152 -99 -612 -35 167 59 332 -121 124 78 -189 42 -111 14 -14 -155 61 170 146
3035A46j50n9r6J11m4n1L87j69R2j55k56M02l61J56M3j26M85m28J53M9k70K68
$$ 146 -4 -63 -159 -48 -92 -143 244 75 167 12 -244 158 -203 -47 -4 -130 355 -73 80 129 -141 127
3057A27m95K74K03p0K97l70J90j50l28J92r2M41J0j48O8k33K0j98Q5K48J13J2
$$ 127 -368 -94 109 39 336 -34 156 6 -322 -130 -222 219 229 81 149 -84 -64 -262 -177 71 184 196
3079A96k23P8j53Rn7j2M38k64R8j18j45L50m74K55J15j23L37n49K78P9k63K98
$$ 196 -27 51 -102 -93 -150 -162 276 12 110 -8 -153 197 -277 -22 93 -30 307 -242 36 115 -148 150
3101A50l77L47K5l00K77j86K22j42k26K08n1J63j26R2O8j76p1k06L14Q7J8P9k13
$$ 150 -227 120 145 -155 122 -64 158 16 -210 -2 -53 110 -16 76 144 -32 -103 -309 5 92 110 189 -24
3124b4J37l63j3K17O5L36l54O9o9k10K14k57M56l8k52J92l60M53r7j81L35m78
$$ -24 113 -250 -263 -46 19 355 1 70 1 -209 5 -252 204 166 -86 106 -254 199 102 -79 256 -222
3146b22J65j51pO38k01M7k46l71R5j44K74M45J93j79k78l60j46K13q7N68K21k24
$$ -222 -57 -208 -215 423 222 269 23 -348 -253 -397 -123 322 515 336 58 -302 -448 -235 -322 246 467 243
3168B43J19o43J41nl77N71j22L70K03m49L03m92k99m5l0P28K95J27j56l93n15
$$ 243 362 -281 -140 -145 -522 49 -73 297 500 51 354 -138 -437 -482 -512 216 511 638 482 89 -426
3189d26m69K60M98Q13J68l89j95p88j90O6L70R60l7k66l49m04N0m6K69M04J41
$$ -426 -895 -635 -137 676 844 455 260 -528 -718 -652 -282 678 641 375 26 -378 -328 -374 -105 299 440
3210D40l94k80J05M5L32k79k5K83n51J89kK05O13p50l5M7k51M01l37K55M61m68
$$ 440 46 -234 -129 -84 248 -31 -56 227 -324 -135 -137 68 681 -69 -104 -57 -308 93 -244 11 472 4
3232Dq4K6Q8K30l90l29M08M3OL52j12K81n54r66M52K36O41M57m18K77p23r58J60
$$ 4 -80 -54 34 264 -126 -455 -47 -4 2 354 242 523 -31 -997 -545 -309 332 789 371 648 -75 -1033 -873
3255h73L52J070L93m75j23m21o05j59L77Q08N47m93m67J03l19j1nJ73P31m46l75
$$ -873 -521 549 942 467 344 -77 -682 -841 -464 344 891 398 -69 34 -285 -296 -301 -128 603 157 -218
3276b18K90mK64m86l83N45pq2J97J55K90n01q35K52N15J67K43k30J65j12j014
$$ -218 72 68 332 -154 -537 8 1 -81 116 271 561 60 -775 -523 -8 159 402 172 337 225 -789
3297g89J78N68M27L15p85K2K01n86J12J83N40L36r02k08L56O0O2k41J86L87n06
$$ -789 -611 -43 384 699 -86 -64 137 -449 -337 -154 386 722 -180 -388 -32 28 90 -151 35 422 -84
3318h4l80L93L69J57n05m42M56O0k05K31K39L01n46q37L59M63K41l0j61K89k47
$$ -84 -464 -71 298 455 -50 -492 -36 24 -181 50 289 590 44 -793 -434 29 270 240 79 368 121
3339A21p29J2O07N06j21n32J2K79l06j85L14L84R1p33k64O16J75m9k16L5L13n93
$$ 121 -608 -596 11 517 396 -136 -124 155 -151 -336 -22 362 453 -280 -544 72 247 198 -18 17 330 -263
3361b63l80M46N34L00n32l14K91j46l55mM74N29k73n12J48K30k18l50l6N53K74
$$ -263 -643 -197 337 637 105 -209 82 -64 -419 -423 51 580 307 -205 -57 173 -45 -395 -431 122 396
3382C96l99P0K45om51o58L77N92J06L1jJ95l69q48j02O01N94P5j58P0l0o07n69
$$ 396 -3 67 312 306 -145 -803 -426 166 272 303 302 497 128 -720 -822 -221 373 448 290 360 330 -277 -846
3405h46L65N88L24j80k17L81k62n33j13J84N73j28l00L91J39j41m65k27M39N1
$$ -846 -481 107 431 251 34 415 153 -380 -493 -309 264 136 -164 227 366 225 -240 -467 -28 23
3425B3k34J37L67K47l04n53N0K48k42K5K10M59K14o63j77Q1j00J4j88N31N05l41
$$ 23 -211 -74 293 540 236 -317 -267 -19 -261 -236 -26 433 647 -16 -193 -112 -212 -198 -386 145 650 309
3447C09k72k36R1j3l17K18M85K09k79k82K8P5k09k53L37L55M4j43k05K43j47m03
$$ 309 37 -199 -108 -121 -438 -220 265 474 195 -87 -59 16 -193 -446 -109 246 290 147 -58 185 38 -365
3469c65%K27M46n1j85R8q9j84l48J63M48J45r2k45R8n1k38K9J43L46j36l15N7
$$ -365 -365 -138 308 257 72 170 81 -103 -451 -288 160 305 213 -32 66 15 -223 -194 -51 295 159 -156 -99
3492i9Q9J44j51l1J46q5j70j20L27K61p7k25k29J40j00NK74J32J91m53k98J50
$$ -99 -10 134 -17 -48 98 13 -157 -277 50 311 234 9 -220 -80 -180 -175 99 231 422 -31 -329 -179
3514a79K9K76n2O8J21l61j18m2K95K25j49j03r3M4n3M1J76O1q1l36jJ85J75J31
$$ -179 -150 126 74 142 263 -98 -216 -258 37 262 113 10 -83 -39 -92 -51 125 186 105 -231 -232 -47 128 259
3538B59j91j0k14j73J13J82M77q2k64k56k92K09L6L38L61j75j12n20j11K57M2
$$ 259 68 58 -156 -329 -216 -34 443 361 97 -159 -451 -242 -206 132 493 318 206 -314 -425 -168 -126
3559a26L53m1L0l8l15K5J9P8k0r5O9K04J62p6p0l12k41m2N3O47L29N8k65p60j94
$$ -126 227 186 216 178 -137 -112 -93 -15 -35 -130 -61 143 305 229 159 -153 -394 -436 -383 264 593 651 386 -374 -568
3584e68j60L11P07L32K52n50o58k85r5N04L54L68R6l89l20l82J79K43J22J59j54
$$ -568 -728 -417 290 622 874 324 -334 -619 -714 -210 144 512 608 219 -101 -483 -304 -61 61 220 66
3605F6N2r3q2J35k3j6k27o9J78K18J77j08q1k38j65j7J09M43j9q1j55k22K32j11
$$ 66 118 25 -57 78 55 39 -188 -257 -79 139 316 208 127 -111 -276 -293 -184 259 240 159 4 -218 14 -97
3629i7J48J04k42L8k76K21M10L0O1m68k88j19qN17M54K88k34o55m65j69K92M75
$$ -97 51 155 -87 -49 -325 -104 306 336 397 -71 -359 -478 -486 31 485 773 539 -116 -581 -750 -458 17
3651A7N32K35k31n69n85oK02M08L63M0M7m06k81m5j0K69n9R7J89m5R6k30j02p9
$$ 17 549 784 553 -16 -601 -607 -405 3 366 406 453 47 -234 -279 -289 -20 -79 18 207 162 258 28 -74 -153
3675a53k40J64J74L89J69k43k33l37j10Q1K70M38J17j63l73k67MJ15K35J98Q3
$$ -153 -393 -229 -55 334 503 260 27 -310 -420 -339 -69 369 486 323 -50 -317 -313 -198 37 235 318
3696C18k02k31j24J00K49j9J8o9j69N8q4K48J64j85m3k67N0J89l3K60l2j48j23
$$ 318 116 -115 -239 -139 110 91 109 40 -129 -71 -155 93 257 72 29 -238 -188 1 -32 228 196 48 -75
3719g5k42J85K16L2R0j20j28o9j01J61K34k6m8j35r5J10q4J16J49j07k4j67J3
$$ -75 -317 -132 84 116 206 86 -42 -111 -212 -51 183 157 109 -26 -121 -11 -95 21 170 63 39 -128 -115
3742a15K10o6K0rr9J8r9J03K17j6j07j58n6N6K2P9J69Q1j57k08o5M0J22mQ1J86
$$ -115 95 29 49 40 -59 -41 -140 -37 180 164 57 -101 -157 -101 -79 0 169 250 93 -115 -180 -140 -18 -22 59 245
3768B45r2j34j29m2J38p2JK00O4K8j76j45Q4j08r0J53J77K08p5k63L0j11j77P6
$$ 245 153 19 -110 -152 -14 -86 -85 115 179 207 31 -114 -30 -138 -228 -75 102 310 235 -28 2 -109 -286 -210
3792b10R6L61J29k87Nj50j30m8j26M28K48j16k6j73%j43k29K19K62J14o0j18P2
$$ -210 -114 247 376 89 94 -56 -186 -234 -360 68 316 200 174 1 1 -142 -371 -152 110 224 164 46 118
3815A18l0k36j10J51J46L3o4R6K37j80k75j56J6J74m1J83L44L5k52n24r5J45Q8
$$ 118 88 -148 -258 -107 39 72 8 104 341 161 -114 -270 -254 -80 -121 62 406 441 189 -335 -430 -285 -197
3838a97K13K31L17j61n38k73rK75P1J19L16N9k35m24o9J94L2l7O0L51O0k31k03
$$ -197 16 247 564 403 -135 -408 -417 -142 -71 48 364 423 188 -236 -305 -111 -79 -116 -56 295 355 124 -79
3861g9o6J12k33k9L30L00J42m13k08L6j42kP4M29K57l43l11j24J94L3o1J87J56
$$ -79 -145 -33 -266 -295 35 335 477 64 -144 -108 -250 -252 -178 251 508 165 -146 -270 -76 -43 -104 83 239
3884B39q6l68p7L40K08p8k74L1L8j60JK23M37j18m43k17K1K83o5J47K81o9k06
$$ 239 153 -215 -292 48 256 178 -96 -65 -27 -187 -186 37 474 356 -87 -304 -283 0 -65 82 363 294 88
3907H8n29J32L82qN6j27J62%l86Q1J69J48j44k99J83K61mj34j8K2p7k82J1N66
$$ 88 -441 -309 73 65 121 -6 156 156 -230 -149 20 168 24 -275 -92 169 165 31 13 35 -42 -324 -313 253
3931B53J33j14k85k65K22k11L7M55J40J11n96k95K90MJ87K6J26J42m51k47J21
$$ 253 386 272 -13 -278 -56 -267 -230 225 365 476 -120 -415 -125 -121 66 92 218 360 -91 -338 -217
3952b17K84J16j75n4J35K0k54N6J42N8j34l49L04K94Qn6k94Q3j60k41L24L48L75
$$ -217 67 183 8 -46 89 109 -145 -89 53 111 -23 -372 -68 226 234 178 -116 -33 -193 -434 -110 238 613
3975F13k73n00j19j00J08J19M16L54j84m73m37J31J81J15K24J17J20l89l33Q9
$$ 613 340 -160 -279 -379 -271 -152 264 618 434 -39 -476 -345 -164 -49 175 292 412 23 -310 -221
3995b21J13K18j44J5K00n4j05j55J26L7j71n8Q5L80l8j45r3j35J02k32J64L40
$$ -221 -108 110 -34 -19 181 127 22 -133 -7 30 -141 -199 -114 266 228 83 -10 -145 -43 -275 -111 229
4017B29O%l99k3K05r1J53KN4n8l32K6K76K28l8j62j88p3m7o8M58K37Mj87n74Q4
$$ 229 235 235 -164 -187 18 -73 80 82 136 78 -254 -228 48 276 238 76 -112 -185 -232 -300 158 395 399 212 -362 -278
4043b78l1M0M53O2K75k90n05Pq5K27J45P9K54r3k14k06k6K7N7M7R7K96j07j24
$$ -278 -309 -269 184 246 521 231 -274 -267 -352 -125 20 99 353 260 46 -160 -186 -159 -102 -55 42 338 231 107
4067A07j26k18J09j30J53L55M8M3l33k01j8n9J59J79K12mj92k03j26J86n4J38
$$ 107 -19 -237 -128 -258 -105 250 298 341 8 -193 -211 -270 -111 68 280 276 84 -119 -245 -59 -113 25
4089B5J16q0J15l19K9J70j26J67j83K7J62j82J25K0mL0k00m2J24M6M6N4p5M2r9
$$ 25 141 61 176 -143 -114 56 -70 97 -86 -59 103 -79 46 66 62 92 -108 -150 -26 20 66 120 45 87 -12
4114a2j90J98j0P8P4k01J87j11j10J08j34K04l0j21J58r7O2o7r8J38k4jj7L2N6
$$ -12 -202 -4 -14 64 138 -63 124 13 -97 11 -123 81 51 -70 88 -9 53 -14 -112 26 2 1 -16 16 72
4139G2n2p1j8Q7ok8M3RO5j19o3M9M7L4n5N7K0k3r2p5J26J2M2Qn7Q0j46p9P8J7
$$ 72 20 -51 -69 18 12 -16 27 36 101 -18 -81 -32 15 49 -6 51 71 48 -44 -119 7 19 61 69 12 92 -54 -133 -55 -38
4169c8J58p2n4Q4j35lk3K6J55o7l7L0j8K1p7k5J06nk9J2J7P7o3j35M2J1M2L6j7
$$ -38 120 48 -6 78 -57 -60 -83 -57 98 31 -6 24 6 27 -50 -75 31 26 -3 9 26 103 40 -95 -53 -42 0 36 19
4198A9J13n4j31l1NJ00K1n5O4j5n1j4l0J25rj18ooP9N0KQ0p0j56j21PJ84J53O4
$$ 19 132 78 -53 -84 -79 21 42 -13 51 36 -15 -29 -59 66 57 -61 -67 -73 6 56 58 138 68 -88 -209 -202 -18 135 199
4227A99j7j00j63j99K5J71K37J23q1q3j68j51m5Q5K60J07Kq0j11q2j27QJ09J59
$$ 199 182 82 -81 -280 -255 -84 153 276 195 112 -56 -207 -252 -167 93 200 202 122 11 -71 -198 -190 -81 78
4251G8O8j7K5j30r5j55j3K10O3J66pj07n0k90LJ34J42K35q9m5j25k02JQ5K15J27
$$ 78 146 129 154 24 -71 -226 -239 -29 34 200 193 86 36 -254 -251 -117 25 260 171 126 1 -201 -200 -115 100 227
4277B27o2j39r5p3k3J75J03R0o9k49J0n7R9J54k4J35j45j83Jm4J93K4L4N0p1q5
$$ 227 165 26 -69 -142 -165 10 113 203 134 -115 -105 -162 -63 91 67 202 57 -126 -125 -169 24 48 82 132 61 -24
4303b4j22N7M9N7J9j1J44j11q8m3q0J57o9J05J56m6k4k52n3P4K8J45P4R3j12k09
$$ -24 -146 -89 -40 17 36 25 169 58 -30 -73 -153 4 -65 40 196 150 126 -126 -179 -105 -77 68 142 235 123 -86
4329h6j20QK03J9J13M6j02p2k57R5J46L7R8j15O8m8j52L3L2J27n2o3O5L0K5j69
$$ -86 -206 -198 5 24 137 183 81 9 -248 -153 -7 30 128 13 81 33 -119 -86 -54 73 21 -42 23 53 78 -91
4355i1O6L0k8M0q8K23Mj57l5j18J66j7l9J91k1j2k09j02J42O6K3LJ04m4j45j34
$$ -91 -25 5 -23 17 -71 152 156 -1 -36 -154 12 -5 -44 147 126 114 -95 -197 -55 11 34 37 141 97 -48 -182
4381a82J2K43m9J0L1k2O9k77KJ54J2J07j56J07R5j92n6n8J82M9q0N9L5L7k10j09
$$ -182 -170 73 24 34 65 43 112 -165 -163 -9 3 110 -46 61 156 -36 -92 -150 32 81 1 60 95 132 -78 -187
4407a87J25J10P1j22P7L5j40j16l8K45P7o7o0k0O7k14kJ38J53Q3k84L1K0p3M9
$$ -187 -62 48 119 -3 74 109 -31 -147 -185 60 137 70 10 -10 57 -157 -159 -21 132 215 -69 -38 -18 -91 -42
4432d2j05L10N7k19m6r3J58m4j05K02J08k7j98r8R0O3o1k1K35kq6j75r5K65j31
$$ -42 -147 163 220 1 -45 -138 20 -24 -129 73 181 154 -44 -142 -52 11 -50 -71 164 162 76 -99 -194 71 -60
4457f0J9R4K3J49l31o6J55l5J02j31J23J41j71j26l7J66L1n8k0R3Q8k47%N8Q7
$$ -60 -41 53 76 225 -106 -172 -17 -52 50 -81 42 183 12 -114 -151 15 46 -12 -32 61 149 -98 -98 -40 47
4482D7Q1k59J59O5r1pj51K36M7j75PK4J32j25q1O1J21Mk22R0M7L7k5j84K70k7
$$ 47 128 -131 28 93 2 -5 -156 80 127 -48 -41 -17 115 -10 -91 -30 91 95 -127 -37 10 47 22 -162 108 81
4508H1j31Qj04K75p7j64J56l7Q6j54q0J77M5p4o9J01jOj57J1K80j65jk0p3K69
$$ 81 -50 -42 -146 129 52 -112 44 7 93 -61 -141 36 81 7 -62 39 38 44 -113 -102 178 13 12 -8 -81 188
4534A88l12L5J90j03J64k67K2J96j78M1k4Q0J04j57p6Q3N7r4K4rJ14M4k68J39
$$ 188 -124 -89 101 -2 162 -105 -83 113 -65 -24 -48 32 136 -21 -97 -14 43 -51 -27 -36 78 122 -146 -7
4558gJ2l4R8k06K36K1j72O1j02J43lj36J00N8K0j12j7J8O2l0j31K02j1k6%j84
$$ -7 5 -29 69 -137 99 120 -52 9 -93 50 47 -89 11 69 89 -23 -40 -22 40 10 -121 81 70 44 44 -140
4584a40J98q0r5J83o4J50r7j95J26n2J8N1J4J23k6j73n1O6k0J01k4K8J61k27k3
$$ -140 58 -22 -117 66 2 152 55 -140 -14 -66 -48 3 17 140 114 -59 -110 -44 -64 37 13 41 202 -25 -48
4609d8j1n2J98j36P9J38j36M2j87mJ31o8Q6O3J9k2j57o9L4R0K1Q5L9o2q0j78M0
$$ -48 -59 -111 87 -49 30 168 32 74 -113 -117 14 -54 32 95 114 92 -65 -134 -100 -10 11 96 135 73 -7 -185 -145
4636a45J14P8R4n9k7n2j73K5J15J46N3p7j00m8o4j2J42J09O5n5j84k5l3NJ20M7
$$ -145 -31 47 141 82 55 3 -170 -145 -30 116 169 92 -8 -56 -120 -132 10 119 184 129 -55 -80 -113 -108 12 59
4662E9J29l1j88m4o7L2Q4J5J60K7j01r9j30%N8K0J55J17lj07k19o9K4Q3J51J45
$$ 59 188 157 -31 -75 -142 -110 -26 -11 149 176 75 -24 -154 -154 -96 -76 79 196 193 86 -133 -202 -178 -95 56 201
4688B01P0j26k12j69NJ36J50J39M7p0j98j86kJ31J65O1krj61p5p1J10J36KL3q5
$$ 201 271 145 -67 -236 -231 -95 55 194 241 171 -27 -213 -215 -84 81 142 140 131 -30 -105 -176 -66 70 72 105 20
4714B0mk4j07R7KN8j1q6J02m6pm1j3R7l5K4%JRj22K3O1Q1J3p7J5o9k3j0N1J60
$$ 20 16 -8 -115 -18 -16 42 31 -55 47 1 -6 -47 -60 37 2 26 26 27 36 -86 -63 -2 79 92 15 30 -39 -62 -72 -21 139
4745A39k3o2r9m3K5k7J33M5N2o6k00N2k3J03M1l2J13j42m4j7j7J73p5OOl8M6q7
$$ 139 116 54 -45 -88 -63 -90 43 88 140 74 -126 -74 -97 6 47 15 128 -14 -58 -75 -92 81 6 12 18 -20 26 -61
4773f1N8L3lm2m8R7MK2m6l7M6j07O7J8P3N2j67K4p4J7Q8l4J55n5p1q1o6J20k2
$$ -61 -3 30 27 -15 -63 34 38 60 14 -23 23 -84 -17 1 74 126 -41 -17 -91 -74 14 -20 135 80 9 -72 -138 -18 -40
4802d0Q5L7j9%j52KK6L1P8n0R4l3m9l3o6Q5m0L4O2K9N1j27k4o0J0K9kJ75j1l5
$$ -40 45 82 63 63 -89 -87 -61 -30 48 -2 92 59 10 -23 -89 -4 -44 -10 52 81 132 5 -19 -79 -69 -40 -42 133 122 87
4832H7o6j51R1p7Q4Q1J2Q8j49k2l5k9O1m2J18J4k2j8n6N5o4k3K4J5Q0l6M9rl5
$$ 87 21 -130 -39 -116 -32 49 61 149 0 -22 -57 -86 -25 -67 51 65 43 25 -31 24 -40 -63 -39 -24 56 20 69 60 25
4861B5l1j25P9K6N7O5k4O6j23q6m0rJ41j0J18K2p0p3j81M7N7P5P6JO8j26j11m9
$$ 25 -6 -131 -52 -26 31 96 72 138 15 -71 -111 -120 21 11 129 151 81 8 -173 -126 -69 6 82 83 151 25 -86 -135
4889a35K1J31k8P0K3k1k9j20O8%MMk5J23k8j7l2k5L1j06L9N6P7K5j08L9o1j2j3
$$ -135 -114 17 -11 59 82 61 32 -88 -20 -20 -16 -12 -37 86 58 41 9 -16 15 -91 -52 4 81 106 -2 37 -24 -36 -49
4918d9l2J62n8qjj2J01j20l8mRM3l8J31N2k8j51j32O8mJ27P3O8M9k53r2o8R1J99
$$ -49 -81 81 23 15 14 2 103 -17 -55 -59 -50 -7 -45 86 138 110 -41 -173 -105 -109 18 91 159 208 -45 -137 -205 -114 85
4947H5j8J21m4j35r4j41J69J06K7%l7K8j12k4j5J09M0j36Q3j0R9l1j65J12r4L
$$ 85 67 188 144 9 -85 -226 -57 49 76 76 39 67 -45 -69 -84 25 65 -71 12 2 101 70 -95 17 -77 -74
4973g4M7JK47j23j29p6n7J42j4J21R2l2j41k17Q0O8J52K2l3Q0k10n2k4Q7K29j66
$$ -74 -27 -26 221 98 -31 -107 -164 -22 -36 85 177 145 4 -213 -133 -65 87 109 76 156 -54 -106 -130 -43 186 20
4999B0K9k3m5O6j36Q5M9n4l3m2J60K5k0j28n1M9j08J56P7J27K6l59j0n5Q0K16
$$ 20 49 26 -19 47 -89 -4 45 -9 -42 -84 76 101 81 -47 -98 -49 -157 -1 76 203 229 -130 -140 -195 -115 101
5025A01o1K13r9k44o3p1K41J00j7Np1p0j08Q4J06J29o9k13O4o7J01P6m3K02k19
$$ 101 40 253 154 -90 -153 -224 17 117 100 105 34 -36 -144 -60 46 175 106 -107 -43 -110 -9 67 24 226 7
5050Gj39%k5K83o7LM4j03l4j18N5J10K4k4k2J21m1l2j09o7J02j28J54J63O1O9
$$ 7 -132 -132 -157 126 59 62 106 3 -31 -149 -94 16 40 16 -6 115 74 42 -67 -134 -32 -160 -6 157 218 287
5076B87l38j50k4j8K57J17K06Ll10k43j35J05K03J96J22%j54l23o3M5J64J85n6
$$ 287 -51 -201 -225 -243 14 131 337 340 30 -213 -348 -243 -40 156 278 278 124 -199 -262 -217 -53 132 76
5099G6J14r9j52Mj02J51K1n8P8pR4m6j01jk5l0jJ07J28Pq9j36Qk8L4P7K6Q5j04
$$ 76 190 91 -61 -57 -159 -8 13 -45 33 26 120 74 -27 -28 -53 -83 -84 23 151 158 69 -67 -59 -87 -53 24 50 135 31
5128C1r4L0J5Q3m7o1N1o1KM2Q2N3r1j21o5N1P5P5Q0J0n3j75r5N1R0J36J1J9m6
$$ 31 -63 -33 -18 65 18 -43 8 -53 -51 -9 73 126 35 -86 -151 -100 -25 50 130 140 87 -88 -183 -132 -42 94 105 124 78
5157G8j37m5j0R4J05l6J0k2j6j6o4L8K6oMj3O1Qo0k7l2K7KK0Q0J0k4r0o3M0L3
$$ 78 -59 -104 -114 -20 85 49 59 37 21 5 -59 -21 5 -1 3 -10 51 59 -1 -28 -60 -33 -31 -11 69 79 55 -35 -98 -58 -25
5188b5K6L9K3mp2m6j5O7L9lK9j7Lq6k3O4JN3k9J2L6q7j1k7L4L4l2N3j2L1m9p1
$$ -25 1 40 63 59 -13 -59 -74 -7 32 29 58 41 44 -42 -65 -1 0 53 24 36 72 -15 -26 -53 -19 15 -17 36 24 55 6 -65
5220f5N3m8N4oJ0Q8o4j0p4j7N8l0N9N0L0pj09l7j0L2OO1Q4k6j6j30kM3n2J00l1
$$ -65 -12 -60 -6 -12 -2 86 22 12 -62 -79 -21 -51 8 58 88 81 -28 -65 -75 -43 -37 24 108 82 66 -64 -66 -23 -75 25 -6
5251fQ6L1j25N1p7j4Lp8J49N0M8Nj00l4j24n9O2J54J52Rn4j60q8r5QK19J07J15
$$ -6 80 111 -14 37 -40 -54 -51 -129 20 70 118 123 23 -11 -135 -194 -132 22 174 183 129 -31 -119 -214 -206 13 120 235
5279B35p5j67m3j26N4Q0R3J16r5l5o5oK8o5O1ML0KmO9m9n5r0k3R0J7J03Rk8l8
$$ 235 160 -7 -50 -176 -122 -42 51 167 72 37 -28 -34 -6 -71 -10 -6 24 26 22 91 42 -13 -103 -126 -36 -19 84 93 65 27
5309B7j54K2L7R1L9n9K6n3K4rK4M5r9l9k9Q3J33J4L6j18j25r1l8J89J44J36m5
$$ 27 -127 -105 -68 23 62 3 29 -24 0 -9 15 60 -39 -78 -107 -24 109 123 159 41 -84 -175 -213 -24 120 256 211
5336B11j77j26j55K6J38K03J24q9j01j69n6J3P6J47L4J5q8o9L2m6J9j8J5O1LO5
$$ 211 34 -92 -247 -221 -83 120 244 155 54 -115 -171 -158 -82 65 99 114 26 -43 -11 -57 -38 -56 -41 20 23 88
5362H8pl2p6j32M1O1J38Q1j9n4j67q2NJ25J58L1l1j41o0n5J9J48N5L4j10j07P
$$ 88 81 49 -27 -159 -118 -57 81 162 143 89 -78 -160 -155 -30 128 159 128 -13 -73 -128 -109 39 94 128 18 -89 -82
5389h2nJ01M4Pk6r8j5J0J03L5m9k8p1J4MQ8Q8n0l5j52K5O7M1J33m4m9r7j18Q1
$$ -82 -87 14 58 65 39 -59 -74 -64 39 74 25 -3 -74 -60 -56 32 120 70 35 -117 -92 -25 16 149 105 56 -41 -159 -78
5418g8O5J30J7p8n7j02RK7J17O7p4k3j17M5L0J1R8p5mq8l7J36J6P3o8n7l0o4O2
$$ -78 -13 117 134 56 -1 -103 -94 -67 50 117 43 20 -97 -52 -22 -11 87 12 8 -80 -117 19 35 108 40 -17 -47 -111 -49
5447d9N9Q0J5q9k4o9O5k1K5P9p9N7p3L8Q7j10Rj02kJ18pJ42l0n3j33j54N7Q2J76
$$ -49 10 90 105 16 -8 -77 -12 -33 -8 71 -8 49 -24 14 101 -9 0 -102 -104 14 7 149 119 66 -67 -221 -164 -82 94
5476I4O6K1p7k19p0o7J69J77L2J02j64p3j05j10J70L5J12K5o4L6j13l6k9J1Q6
$$ 94 160 181 104 -115 -185 -252 -83 94 126 228 64 -9 -114 -224 -54 -19 93 118 54 90 -23 -59 -88 -77 9
5501Ij0O8LM8o7j40K8r3J28M1OJ63j44k7r9o5J47n7J10K7k6K0j32K8nK8j3j4P3
$$ 9 -1 67 70 118 51 -89 -61 -154 -26 15 21 184 40 13 -86 -151 -4 -61 49 76 50 70 -62 -34 -39 -11 -24 -38 35
5530C5k8N8l9rN2j56L2k9P0J38q5Q1p5r3rj08J45O6L5J6m6j2j05k5rQ3R9m6N7
$$ 35 7 65 26 17 69 -87 -55 -84 -14 124 39 120 45 -48 -57 -165 -20 46 81 97 51 39 -66 -91 -100 -17 82 36 93
5559I3q9kk7j16J30pL9L5p9J08r2m5J9l7R7k1KL9Mk1m8j6QK6Jj1J08o2kn6n5J02
$$ 93 4 2 -25 -141 -11 -18 21 56 -23 85 -7 -52 -33 -70 27 6 8 47 51 30 -18 -34 -26 0 1 -10 98 36 34 -22 -77 25
5591B5o5N0L7j4M3j32NK7kN8l9K5Om2j0nN9j4k8j4K1N2n6K9J1k7j1n6O9N2mOp5
$$ 25 -40 10 47 33 76 -56 -51 -24 -26 32 -7 18 24 -18 -28 -33 26 12 -16 -30 -9 43 -13 16 27 0 -11 -67 2 54 50 56 -19
5624a9J2k6k2O0M8N3m4r3j8qL1K8L2M0m1m8o9M3M5lRj4L3k3k1L0j4Ko7oP3M4N4
$$ -19 -7 -33 -55 5 53 106 62 -31 -49 -57 -26 2 34 74 33 -15 -84 -41 4 1 10 -4 29 6 -15 15 1 3 -64 -70 3 47 101
5657A01l1m8m5j04JQ7J32R0n1r8r0p9QO4J38J04m1r3j05n1PM7Q3O0J7q1m6j0q
$$ 101 70 22 -23 -127 -126 -39 93 183 132 34 -56 -135 -127 -63 75 179 138 45 -60 -111 -104 -57 26 86 103 22 -24 -34 -42
5686d2J9l3M7L3kK6k0Rn1o7j1M9R1M1pm0n7l5m0O4Q7K4oj06jRqP9qJ4p0j10O4
$$ -42 -23 -56 -9 24 22 48 28 37 -14 -81 -92 -43 48 89 82 42 -15 -50 -90 -26 61 85 79 -27 -28 -19 -27 52 44 58 -12 -122 -58
5719e8N5R9L9q0n5j15m6N0J35J25L4r7j41p1m1N2J42P5P9j03j08j8r5R3K7M7J00
$$ -58 -3 96 135 55 0 -115 -161 -111 24 149 183 86 -55 -126 -167 -115 27 102 181 78 -30 -48 -143 -50 -23 24 124
5746A24n5Jn8l6jo1K7N5P9M7m3k5r5m3m8O3J30O4L0j17p6n8n4J02P8Q7J5j34m3
$$ 124 69 70 12 -24 -25 -86 -59 -4 75 122 79 54 -41 -84 -132 -69 61 125 155 38 -38 -96 -150 -48 30 117 132 -2 -45
5775d5n7M3N7K7O6l3o3o1K5O6QJ9n6Pj8l1O3J3L9l1p5J6j7N9NLJ4n5l1lL6O2j8
$$ -45 -102 -59 -2 25 91 58 -5 -66 -41 25 33 52 -4 3 -15 -46 17 30 69 38 -37 -21 -38 21 26 29 43 -12 -43 -46 -10 52 34
5808C4k0m0MjkO7j0Lo3l3L3J7M8nj4ko2J0J2P2J3m6j1m1K8nK2N1j6j6o0qL9QL0
$$ 34 14 -26 -22 -23 -25 42 32 35 -28 -61 -28 -11 37 32 18 16 -46 -36 -24 48 61 15 4 -37 -9 -14 8 59 43 27 -33 -41 -2 6 36
5843C6k5J7j3n5K7QK3%l9J9rK4k3J5mk4mk5O9K2Oj2n7qk4MP1L2L7n1m5k6l3L1
$$ 36 11 28 15 -40 -13 -5 18 18 -21 -2 -11 13 -10 5 1 -23 -27 -52 17 39 45 33 -24 -32 -56 -52 19 51 88 37 -8 -34 -67 -36
5877c6J2Q1L1l3l7o0J4k1J4N5J1L5l9l1j6k6Oj4O1K3J2j1l9J8n4qK6J7O9l2Qm
$$ -36 -24 57 88 55 18 -42 -28 -49 -35 20 31 66 27 -4 -20 -46 -40 -54 7 30 42 31 -8 10 -44 -52 -26 -9 60 28 36 32
5909C2n3J3o0N7L0ML3m0K5l6l2J1k3N2nJ6K5k7J1o8OJ3j6N3k5N9j1n5Mn9M1k3
$$ 32 -21 -8 -68 -11 19 23 56 16 41 5 -27 -16 -39 13 8 24 49 22 33 -35 -29 -16 -32 21 -4 55 44 -11 -7 -66 -25 -48
5941d8K4P4k5L2o9k4ok1O5oO6j1l1j1q2N5pJ5O3l8L9p2jK6l8P0m1K2jm9M8k7M1
$$ -48 -24 50 25 57 -12 -36 -42 -63 2 -4 62 51 20 9 -73 -18 -25 -10 53 15 54 -18 -19 7 -31 39 -2 20 19 -30 18 -9 32
5974C2j8m3K3m6O0k6L2L4o7L8q1L9J2kO0m0K3j7m8L8k9N5k7j2M2l5M4n4J3Mm7
$$ 32 14 -29 -6 -52 8 -18 14 48 -19 19 -62 -23 -11 -13 47 7 30 13 -35 3 -26 29 2 -10 32 -3 41 -13 0 4 -43
6005d3M4k3P4J0m7K1r3L9j4J3Q7m7L0o6m2L5k4O6jK3qp4J1j1M1Nj4M6m1J0j8m
$$ -43 1 -22 52 62 15 36 -57 -18 -32 -19 68 21 51 -15 -57 -22 -46 20 19 42 34 -40 -29 -40 1 6 -8 38 -3 7 -11 -15
6037a5M7n2M3l9J5M2l9L6m1pol6P7qM1l3n2J6n8L8L8L0N1p8j7n4KL9rQ2j2rl7
$$ -15 32 -20 23 -16 -1 41 2 38 -3 -10 -16 -52 25 17 58 25 -27 -11 -69 -31 7 37 88 10 -7 -61 -59 -20 -29 53 41 32 -5
6070ep3M4jL1K1J2L4p6J0k5mL6k4O0pJ1no8K4l8J7M3RN6m6m8k5k1N8pM2K7n0j5
$$ -5 -78 -34 -35 -4 17 29 63 -13 -3 -28 -32 4 -20 40 33 44 39 -29 -5 -43 -26 17 26 82 36 -12 -37 -58 0 -7 35 62 12 -3
6104cp2K3K7M5L2k3mo0l0J9L4Q3l3nk4n5J5j9O8N4rj5n2k4j4j0N3M1L4j8m7l3
$$ -3 -75 -52 -25 20 52 29 25 -35 -65 -46 -12 71 38 33 9 -46 -31 -50 18 72 63 48 -4 -28 -42 -52 1 42 76 58 11 -22
6136b2k4J1oN8L2Oop0ol1j1O0J3O4%p6j5m7J0L0K8O5jl4n4l9NL9L6K8K9l0n4j6
$$ -22 -46 -35 -41 17 49 55 49 -21 -27 -58 -69 -9 4 68 68 -8 -23 -70 -60 -30 -2 63 62 28 -26 -65 -60 -21 15 43 72 42 -12 -28
6170b8j4L8K6J4K2m0ql9j9O2j2J5Mj9Ll5nJ6L0j0qJ2j4Ml2OM0rNQk2L0m1OK0K
$$ -28 -42 -4 22 36 58 18 10 -29 -48 14 2 17 21 2 5 -30 -35 -19 11 1 -7 5 -9 -5 -37 -31 9 0 5 13 -9 21 -20 -14 6 8
6206HL3k5k2K4j9kNOK5j5j0qJ8l0J5lK3nk1J1j8LJ1m1N2jk7J7l9L5J7n1L0MOm
$$ 8 41 16 -6 18 -1 -3 2 8 33 18 8 0 18 -12 3 0 23 18 -3 8 -10 -7 4 -37 15 14 -13 4 -35 0 17 -34 -4 0 6 2
6242Bk1J3Noj8L1MOMl9L1pk6K9k3M5k1j4J9k1J1j6%K9k4J5k7J6Kj5J1j2L2j5k2
$$ 2 -19 -6 -1 -7 -25 6 10 16 20 -19 12 5 -21 8 -15 30 9 -5 14 -7 4 -12 -12 17 -7 8 -19 -3 -1 -16 -5 -17 15 0 -22
6277b2QPJ5k3MK1onj2JK1KmrJ3j6pK1j2L9j9j9J6j9J5k2J7K9l2Mk2J0kj1K0J4
$$ -22 -14 -7 8 -15 -11 10 4 -1 -13 -12 9 11 7 -2 11 -5 -12 9 -3 36 17 -2 14 -5 10 -12 5 34 2 6 -16 -6 -8 -19 1 15
6313A5J1k0k2j5K3Qk2K5%Oql4L4nj0K3pK4k5k1kJ2L5mRjk4k4j6M7NNKk2Ol9KL
$$ 15 26 6 -16 -31 -8 0 -22 3 3 9 1 -33 1 -4 -14 9 2 26 1 -20 -22 -10 25 21 30 29 5 -19 -35 12 17 22 24 2 8 -31 -29 -26
6351b6L0L4l2lnj6lk7M2K5LPm5J8m3RK3J9M8l1k6ol4J7LL4K8Jj7m6Oj4QL3J1M2
$$ -26 4 38 6 3 -2 -18 -21 -48 -6 19 22 29 -16 2 -41 -32 -9 10 58 27 1 -5 -39 -22 -19 15 43 44 27 -19 -13 -27 -19 14 25 67
6387F7m4j5m7KL2j2N6mj5k2m8L1j0K8K0k0L9m4j4okM9k1OJ1j2Ml2J7oJ9J0oK7
$$ 67 23 8 -39 -37 -5 -17 39 35 20 -2 -50 -19 -29 -1 19 -1 38 -6 -20 -26 -28 21 0 6 17 5 9 -23 -6 -12 7 17 11 38
6421C8l6Qk9j3O4k5L4k1j0ko5N0J4ML2m2J6l2k3ORN9l3mpk6L7m6L5K3k0J9m6M6
$$ 38 2 10 -19 -32 32 7 41 20 10 8 -57 -7 7 11 43 1 17 -15 -38 -32 -23 36 3 -1 -8 -34 3 -43 -8 15 -5 14 -32 14
6455A4k1nK8n5O1k9RK2k3K8m1nJ0LM0l2K9k2m3Nk0P6j1MMn3J4n5M2L4NL5n6kj2
$$ 14 -7 -12 16 -39 22 -7 2 24 1 29 -12 -17 -7 -4 36 4 33 11 -32 -27 -47 29 18 22 26 -27 -13 -68 -26 8 13 48 -8 -10 -22
6490b2m2M0RN7k0qol8K7k6J9L2j6N7m9J0k2m7L8m0P8K0j8J4p1qk2j0Q3J6L3l5
$$ -22 -64 -24 -15 42 22 14 8 -30 -3 -29 -10 22 6 63 14 24 2 -45 -7 -47 31 51 33 47 -24 -32 -54 -64 19 35 68 33
6522C3n4k4l9M1J3P9J6m3oq7L8oJ5P2l9K8n1k7L8k7N4j5jJ4m6K9j3L2Om2K6l8
$$ 33 -21 -45 -84 -43 -30 49 65 22 16 -71 -33 -39 -24 48 9 37 -14 -41 -3 -30 24 9 8 22 -24 5 -8 24 30 -12 14 -24
6554b4L2k0%M2k9K6l9NK0m7L0j0J7J9k1K4m3oj1j5M8J3M6k1n0Kn4K6J4M3N4m6
$$ -24 8 -12 -12 30 1 27 -12 -7 13 -34 -4 -14 3 22 1 25 -18 -24 -35 -50 -2 11 57 36 -14 -12 -66 -40 -26 17 71 25
6586B5K1o4j4Oj5P5NJ5k1n4K5l1J3LK3L3m7J4qmKm3L2kK0J2k9L8m9%Mk4M2j1K4
$$ 25 46 -18 -32 -26 -41 34 39 54 33 -21 4 -27 -14 -11 12 45 -2 12 4 0 2 -41 -9 -11 9 21 -8 30 -19 -19 -15 -39 3 -8 16
6621A6mlNn1K6OJ1J2j8L4k5pj2j8L8rRJ2j3K6n2QJ8k5J6j3J3J8k2j1j0K1j0nJ7
$$ 16 12 9 14 -37 -11 -5 6 18 0 34 9 2 -10 -28 10 1 10 22 9 35 -17 -9 9 -16 0 -13 0 18 -4 -15 -25 -4 -14 -19 -2
6656blK3l1Qjj7K9j8L1J2k7Kl9K5J1j3M2j7J7k4l4J0rM2qK3Km2Pl2K1J0j9K5j0
$$ -2 -5 18 -13 -5 -6 -23 6 -12 19 31 4 6 -33 -8 3 -10 32 15 32 8 -26 -16 -25 17 9 32 34 -8 -1 -33 -12 -2 -21 4 -6
6691fJ1J7n1K2k2lJ2PM1kml5j7rj0M1L6L1j8n6j0l9L6L7kO8m1k5m0rN2rK9rk3
$$ -6 5 22 -29 -7 -29 -32 -20 -13 28 26 22 -13 -30 -39 -49 -8 28 59 41 -15 -25 -64 -28 9 7 75 34 9 -31 -40 12 3 32 23 0
6726@kk7K8K0Lj7k6lj3L0J0J9K5n3j7l6J1N1mL1pj1nm7J8RJNJ5L7jj0l6l8j2r
$$ 0 -2 -29 -1 19 22 5 -21 -24 -37 -7 3 22 47 -6 -23 -59 -48 3 -1 30 23 12 7 -40 -22 -13 -12 -7 8 45 44 34 -2 -40 -52 -61
6762f1N2N4M3Qr3n2n1QN5P6P7k1p0p8o4K0N1P1O0J0n2j10j5J2N3M2lL0k8m0rp
$$ -61 -9 45 88 96 3 -49 -100 -92 -37 39 116 95 25 -53 -117 -97 -46 25 85 95 43 -67 -82 -70 -17 25 22 52 24 -16 -25 -32
6794c2L4%k2K3J0K4oj7j8j7j2kO0QJ3m0m2Pj4L3K6OPn7j1PK2M1j5jl6l7LK3P7
$$ -32 2 2 -20 3 13 37 31 14 -4 -21 -33 -35 25 33 46 6 -36 -29 -43 -10 16 22 29 -28 -39 -32 -10 31 16 15 -21 -58 -55 -32 45
6829D5J3j8m5n5RMM9O1J3k8o9k3lM9K3J2J6m4ql3J5M0j7J6l1jK0l3K8opj0l6N0
$$ 45 58 40 -5 -60 -51 -47 2 63 76 48 -21 -44 -47 2 25 37 53 9 1 -32 -17 23 6 22 -9 -10 10 -23 5 -1 -8 -18 -54 -4
6863dJ7K3j1l2k2l1K4K7M9J9m6k3l9KJ9K7O9l3kn2l7M0jM5j%Lo1J6PLK4l8K5j1
$$ -4 13 36 25 -7 -29 -60 -36 -9 40 59 13 -10 -49 -47 -28 -1 68 35 33 -19 -56 -16 -17 28 27 27 30 -31 -15 -8 -5 19 -19 6 -5
6898eOJ6l7J7l9KJ5L4N0l1Lo4k5rJ3Q3K8Ok1q7mj9L8N4J7L9o1k5l0pM4k3M2Qj4
$$ -5 1 17 -20 -3 -42 -40 -25 9 59 28 31 -33 -58 -67 -54 29 57 63 42 -45 -49 -68 -30 24 41 80 19 -6 -36 -43 1 -22 20 28 14
6933A4Ol4K6k2rnj3N3k0K9nj3mp1J9J3L9L5l9L3l6j4ol8O8k2M5Mj9L1o3Lok2N2
$$ 14 20 -14 12 -10 -19 -24 -37 16 -4 25 20 7 3 -68 -49 -36 3 38 -1 32 -4 -18 -24 -62 6 -16 29 33 14 45 -18 -15 -21 -43 9
6968InN2lk1no6P%J0N6LM5n6l3l8j8M6j2P3Pj0qq0K6l0KO0j8O5l7k3Rn3L8k2K7
$$ 9 4 56 53 32 27 -39 -32 -32 -22 34 37 82 26 -7 -45 -63 -17 -29 44 51 41 33 -47 -21 -51 -49 11 -7 58 21 -2 7 -46 -8 -30 -3
7004cK3%L2m4K5k4m0J6j9N9LQK0m4K0q1pL9MP1k5J5l2o5rj7O7K6lL1n2J7o0J0
$$ -3 20 20 52 8 33 9 -31 -15 -34 25 28 36 56 12 32 -49 -56 -17 -13 58 33 48 16 -49 -58 -75 -8 18 15 46 -6 11 -49 -39
7038c9L2l2O6k7QL1n3J9m1QL3l3O0kJ5j9n3j3NK8K9K4J7p5Lo0K6M1KO5m6j9k3
$$ -39 -7 -39 27 0 8 39 -14 5 -36 -28 5 -28 32 30 45 26 -27 -40 -35 -7 22 46 63 -12 -9 -69 -43 -2 0 65 19 0 -23
7071b3m9N4kM9jm7K5n8M2%PK1l6J9j4L0J7l9K3m2LlJ6P7k8Km8p2M2nO7L7j3k3
$$ -23 -72 -18 -20 29 28 -19 6 -52 -10 -10 -3 18 -18 1 -13 17 34 -5 18 -24 -21 -24 -8 69 41 43 -5 -77 -35 -40 27 64 51 28
7105B8q0j4NN0M7MQn5l3k3K3O7j9K5m0l5L2k6O2Lk2jo0J6L4L7L7o2ql6j2L5J6
$$ 28 -52 -66 -61 -11 36 40 48 -7 -40 -63 -40 27 8 33 -7 -42 -10 -36 26 29 7 6 -54 -38 -4 33 70 8 0 -36 -48 -13 3
7138CN5k4ql6qJ1j6M1k4k3K8k2P3kl1l2p8K8J8O1Q0ql1j18p1nP3J14M9M1p7r2
$$ 3 58 34 26 -10 -18 -7 -23 18 -6 -29 -1 -23 50 48 17 -15 -93 -65 -47 14 94 86 55 -63 -134 -139 -66 48 97 138 61 -31
7170c1q4l1J12O3N8L6q0l0q4k3O6J1O7lj1Ol3k8j9J0j6K8M3J1L3o0l8l6l1P2P
$$ -31 -115 -146 -34 29 87 123 43 13 -71 -94 -28 -17 50 47 36 42 9 -19 -38 -28 -44 -16 27 38 71 11 -27 -63 -94 -22 -15
7201a5P3L2p9k0o7OO4QN3k8k2l0k5K9M0L1m1k0k7nM6K0N2j6o7m1m4O1M9J2O0n2
$$ -15 58 90 11 -9 -76 -70 -6 2 55 27 5 -25 -50 -21 19 50 9 -11 -38 -43 3 23 75 59 -8 -49 -93 -32 17 29 89 37
7233C7n3l5m3O3K7M8j0j6k6l2lnN7%k1K2j6L8l0k4Kk1K2K5J3M3k0m2l5k3K7L0
$$ 37 -16 -51 -94 -31 -4 44 34 18 -8 -40 -43 -48 9 9 -12 10 -6 32 2 -22 -20 -41 -19 6 19 62 42 0 -35 -58 -31 -1
7265aL8K0ko7l7RqP0lNJ1n7mk6K1O0k7LnrQk2J5J1j3oj1K9J5qj7mLj6M1lL2j5
$$ -1 37 57 55 -12 -49 -40 -48 22 19 24 35 -22 -26 -52 -31 29 2 5 0 -9 -1 -23 -8 3 -10 -16 -27 2 17 9 -8 -12 -9 -25 16 13 45 30
7303C0n4Ql2M5RJ3L9l7k5k8j2K9OJ5RMrl1q%J2LQK0klj7j5J1j7lJ8L8J3k3Pl2
$$ 30 -24 -16 -48 -3 6 19 58 21 -4 -32 -44 -15 -9 6 15 19 10 -21 -29 -29 -17 -14 -6 14 12 9 -8 -23 -12 -29 -32 -14 24 37 14 21 -11
7340a1J3l1KL7LM6k5k4J6o6KPJ4O7j5Lk5k9j8k7L2K3M8k0j2Jm3lj3J4L8NL0j7
$$ -11 2 -29 -27 10 13 59 34 10 26 -40 -38 -31 -17 50 35 38 13 -16 -34 -61 -29 -6 42 22 10 11 -32 -35 -48 -34 4 9 39 22
7374B2oj5m5J4k5M1L9lL5m2k0l8nN1rM0Moj0n3J3rK1K0j7K1k3J2pj0K4l6mk4L8
$$ 22 16 1 -44 -30 -55 -14 25 22 57 15 -5 -43 -48 3 -6 34 38 32 22 -31 -18 -27 -6 14 -3 18 -5 7 0 -10 14 -22 -26 -50 -12
7409a2M1nJ7m4l4k7j1N4M0L9Jn2j1o4KL2M1N9j6j1m2k1J0l3L6J7L0Jj4J0m0j2
$$ -12 29 24 41 -3 -37 -64 -75 -21 19 58 59 7 -4 -68 -66 -34 7 66 50 39 -3 -24 -14 -47 -11 6 36 37 23 33 -7 -19
7441a9k2j3N6JM8ok6l6o1J3K7N0M2j8on9m2J4J3Q8qnk2m4J9k9N2L2opn4J3J0J9
$$ -19 -41 -54 2 3 51 45 19 -17 -78 -65 -38 12 54 36 30 -29 -71 -57 -44 44 36 31 9 -35 -16 -45 7 39 33 26 -28 -15 -5 14
7475A4J4j7lm1PJ5K2L6m2j2j1k4M5k4N5j4l0qm8M6K9J7nl4Om2J9K7K7K2m1rk2
$$ 14 28 11 8 -33 -26 -11 11 47 5 -7 -18 -42 3 -21 34 20 -10 -18 -66 -20 9 26 21 -13 -7 -49 -30 -3 24 46 5 -4 -26
7508b6j3M6oM3l3l4K2k8N5j7J7J0n1Nj9M3J5Lnn8J1jJ1L1k0K9m4k6K5j1N5k1j6
$$ -26 -39 7 1 44 11 -23 -1 -29 26 9 26 36 -15 -10 -29 14 29 32 27 -31 -20 -21 -10 21 1 30 -14 -40 -15 -26 29 8 -8
7541hkl4L5NL4J1n0j9m0M3K9M4M1m1k8q5j2M5L5Q3j8j2m3p8LRP2M1j6Qm5k9k9
$$ -8 -10 -44 -9 -4 30 41 -9 -28 -68 -25 4 48 89 48 20 -65 -77 -32 3 86 68 56 13 -65 -62 -53 19 60 44 52 7 -22 -51
7574e1mM5JL6j0Pol9rk7L5K2J1N5k9om1o5L4K0M9K6j0J2o0l8qL7M9kJ6m7j5pj0
$$ -51 -55 -10 -9 27 17 24 18 -21 -30 -57 -22 0 11 66 37 31 -10 -75 -41 -21 28 54 44 56 -4 -42 -50 -13 36 34 50 3 -12 -19 -29
7609b9L9qJ9l0k9L8k4L4Qj6Qn0%LL8L8k3K0l6k4qj7N9NK1j5k3K2m7J3JPM5l2L6
$$ -29 10 2 21 -9 -38 0 -24 10 18 2 10 -40 -40 -37 1 39 16 36 0 -24 -32 -49 10 15 36 21 -2 20 -27 -14 -13 -6 39 7 43
7644D3ql3%l8J1J5K6QKJ1o2j0oJN2j0L5k0l2Om7M1jJ2L4m5K5j9oJ1k3L4j2J6j2
$$ 43 35 2 2 -36 -25 -10 16 24 26 37 -25 -35 -41 -40 12 2 37 17 -15 -9 -56 -15 -16 -4 30 -15 10 -9 -15 -4 -27 7 -5 11 -1
7679aPMk4K4j2Pkj5L3qj0Lj9K6l3J9J4k2K8k2j2J0j9K1qJ3Qj0rk0K3k0J6J7j2
$$ -1 6 10 -14 10 -2 5 3 -12 21 13 3 6 -13 13 -20 -1 13 -9 19 -3 -15 -5 -24 -3 -11 2 10 0 -9 -29 -6 -26 -10 7 -5
7714eL6m9ROJJ4j8K5oj9K3k6J7Pk2J3j1L1j5j1Rk8K4l4K6K0nK8n2kk4j2L5J1L5
$$ -5 31 -18 -9 -3 -2 12 -6 19 13 -6 17 -9 8 15 -7 6 -5 26 11 0 9 -19 5 -29 -3 17 12 40 -12 -14 -38 -50 -15 -4 31
7749C1mk6ok5NmL9J4RMm2Pk1kL4k2M0rj1Nk3%oj0K9LJ5qj0j2k6pK0M2Lqk1l1J1
$$ 31 27 1 -5 -30 -25 -29 10 24 33 37 -5 2 -19 -21 13 -9 31 22 11 16 -7 -7 -13 -23 6 9 24 16 6 -6 -32 -39 -19 23 26 18 -3 -34 -23
7788b3pJ8K6j9J8m1j0K6%L6j0Jj0l6QjM7J7j1j3l6nj4M3L2lJ0m5j5j5oK6J1K7
$$ -23 -30 -12 14 -5 13 -28 -38 -12 -12 24 14 15 5 -31 -23 -24 23 40 29 16 -20 -25 -39 4 36 33 43 -2 -17 -32 -38 -12 -1 26
7822B6nj2om3K0j5J1M4j1L0l6rk3k3K5kM9K3oj1p0J3j9J5O9OK3l3m1k2j5M4K9
$$ 26 21 9 3 -40 -20 -35 -24 20 9 39 3 -6 -29 -52 -27 -29 20 43 37 26 -44 -31 -50 -35 34 40 63 30 -11 -33 -48 -4 25
7855B5J3K8n4j1l0RJ6J7J3j3Jk4k4K6JJ9k7MJ2k2J3mMJ1l0L6j7J3j1j8K3j0KJ3
$$ 25 38 66 12 1 -29 -20 -4 13 26 13 14 -10 -34 -8 -7 12 -15 -11 1 -21 -8 -12 -8 3 -27 9 -8 5 -6 -24 -1 -11 -9 4
7889DKJ4k6Nj6J8J0rL6k5%k2j7L3qK8j2j5Jk3J0k0J9K3j9PNj5Nj1K5j5J1j8RJ3
$$ 4 6 20 -6 -1 -17 1 11 2 38 13 13 -9 -26 7 -1 27 15 0 1 -22 -12 -32 -13 10 -9 -2 3 -12 -7 -18 7 -8 3 -15 -6 7
7925Gj1Pj1MPoJ6nkLl0K3qJ2K0j1J6m3OnrL6j2K5l1j0qk6L0J2K3j2j7K1l8kPO
$$ 7 -4 3 -8 -4 3 -3 13 8 6 9 -21 2 -6 6 26 15 31 -12 -6 -11 -20 16 4 29 -2 -12 -20 -46 -16 -4 19 7 -10 11 -27 -29 -22 -16
7963a6K9jj1joj0j9L4MJ5J3l1K1m1J2rPN7m1Pqk4K0l4K8J1J2Mm2J3j2nQJK3Jj2
$$ -16 13 12 1 0 -6 -16 -35 -1 3 18 31 0 21 -20 -8 -17 -10 47 6 13 5 -19 1 -33 -5 6 18 22 -20 -7 -19 -24 -16 -15 8 9 -3
8000cLk5K1j2J1J6j1Jm2L8j0%K1j5L2k0qkoL8j6%Pj2J0m0K7Oj0J9k9J5rmRj7K9
$$ -3 0 -25 -4 -16 -5 11 0 1 -41 -3 -13 -13 8 -7 25 5 -3 -5 -11 27 11 11 18 6 16 -24 3 9 -1 18 -11 4 -5 -9 0 -17 12
8037A2j7j1J4j5J5j6PQj1K0k0J9jk6K9j3J9k0JJ7j0J7l2J9kj1J1j4K0jj7L1k3
$$ 12 -5 -16 -2 -17 -2 -18 -11 -3 -14 6 -14 5 4 -22 7 -6 13 -7 -6 11 1 18 -14 5 3 -8 3 -11 9 8 -9 22 -1
8070aJ1pk2K7k0K1mrJ0k1K1k5J5J0j4J0j3Qj0j7L1kJ6j8oJ3k5K3mlK5k8K7j9N
$$ -1 10 3 -19 8 -12 9 5 -4 6 -15 6 -19 -4 6 -8 2 -11 -3 -13 -30 1 -1 15 -3 -9 4 -21 2 -2 -5 20 -8 19 0 5
8105EPj5OQJ2j0k5K5k5K3j8j1M0l4K0k6J0J6k9J8jNOk8K4qkrJ3OrJ0j0JJ2k2K0
$$ 5 12 -3 3 11 23 13 -12 13 -12 11 -7 -18 22 -12 8 -18 -8 8 -21 -3 -4 1 7 -21 3 -5 -7 -16 -3 3 -6 4 -6 -5 7 -15 5
8142EqJ5mk5M1l8K4mj7L9l1K2jl4J9j3J2Pj2J8l5JqJ4RMJ7j7j0k2lL0j2L4mk3
$$ 5 -3 12 8 -17 24 -14 10 6 -11 28 -3 19 18 -16 3 -10 2 9 -3 15 -20 -19 -27 -13 -4 0 17 0 -10 -32 -35 -5 -17 17 13 -10
8178a0J4l4KkK1L4qQj8j3nj0K9
$$ -10 4 -30 -28 -30 -9 25 17 25 7 -6 -11 -21 8
8191H
$$ Imaginary data points
##PAGE= N=2
##DATA TABLE= (X++(I..I)), XYDATA
0@%%%%%%%%%%%%%%%%qJ6j6J6j6J6j6K0k8L2l2L5m0M5m9N3n7O5p2P4q0Q9r6J06
$$ 0 0 0 0 0 0 0 0 0 0 0 0 0 0 0 0 0 -8 8 -8 8 -8 8 -8 12 -16 16 -16 19 -21 24 -25 28 -29 36 -36 38 -42 47 -49 57
40E7j15J21j32J43j55J68j81J95k12K33k56K81l11L48l92M45n09N91o96Q34j019
$$ 57 -58 63 -69 74 -81 87 -94 101 -111 122 -134 147 -164 184 -208 237 -272 319 -377 457 -562
61e62J267j616K124k895M143o342J0736k1946Q7967J45836l00852K33848k25838
$$ -562 705 -911 1213 -1682 2461 -3881 6855 -15091 72876 218712 -82140 151708 -74130
74g4130J1308J58266l18434K62256J9363j2821M9457j93604R7152K7186n7291
$$ -74130 -62822 95444 -222990 39266 58629 45808 95265 -98339 -1187 25999 -31292
85c1292k8175P0414L4395k2981k233j17943J88246n9175j13528J13035j31513
$$ -31292 -59467 10947 45342 22361 20128 -97815 90431 31256 -82272 30763 -100750
96a00750J94805p5895j07088K03768j46805Q1638j08777m8007K04758j18895O8087
$$ -100750 94055 18160 -88928 114840 -31965 49673 -59104 -107111 97647 -21248 46839
107D6839p5476L0910P0694j65635R8973n0103J12401q913j68876J60586r5876
$$ 46839 -28637 2273 72967 -92668 6305 -43798 68603 59690 -109186 51400 -44476
118d4476Q2694j7749j08578K07031j40380o772N8m1827J74709r9115j3546K5454
$$ -44476 38218 20469 -88109 118922 -21458 -28230 -28172 -69999 104710 5595 -7951 17503
130A7503j9943J803o4628M1005M4189P0188j00467k2471O3595q6469R5964j05356
$$ 17503 -2440 -637 -65265 -24260 19929 90117 -10350 -32821 30774 -55695 40269 -65087
142f5087M9276J35163j79934R8981q1534J5787J26365j98411J22497j0066l1429
$$ -65087 -15811 119352 -60582 38399 -43135 -27348 99017 -99394 23103 13037 -18392
153a8392P8604j41203J13755J1486o6054J7107m9546Q0577q643k0732J124K0972
$$ -18392 60212 -80991 32764 44250 -21804 -4697 -54243 26334 17691 -3041 -1917 19055
165A9055J4986q4648L0197n397N9648J2050q9733Q2332m9115K567o48n4610J25399
$$ 19055 34041 -50607 -20410 -25807 33841 45891 -43842 38490 -10625 -8058 -8706 -63316 62083
178F2083m6277j4504K105l7347P2411o7565J0206K7985J027K6910p3729L8667
$$ 62083 15806 1302 3407 -33940 38471 -29094 -18888 9097 10124 37034 -36695 1972
190A972N193k780O65n0738P2863k2326o086R720k7903O4415o0123j4540K4119
$$ 1972 7165 4385 5050 -45688 27175 4849 -1237 8483 -19420 44995 -15128 -29668 -5549
203e549p594N0967m5855J2091J8532k8130p39l6690M2141J9966p622M24j9010
$$ -5549 -13143 37824 -8031 4060 22592 -5538 -6277 -42967 -826 19140 11518 11942 -7068
216g068K8207l3101j1579J1219O770L8256l8611P285J0426j5062J1482l8319K6519
$$ -7068 21139 -11962 -23541 -12322 -5552 32704 -5907 1378 11804 -3258 8224 -30095 -3576
229c576J4832j5375J2081j7568K8333o638k4480O895q177J9584j2343l34K0784
$$ -3576 11256 -4119 7962 -9606 18727 12089 -12391 -5496 -13673 5911 -6432 -6766 14018
242A4018j135L239k7498L48O578p845R335j926K3954K447j8530n762j3384R524
$$ 14018 12883 16122 -11376 -11028 -4450 -12295 -2960 -4886 19068 21515 2985 -2777 -16161 -6637
256f637n189J529K1418M530M276j8734j0818K939o764N142L380J4094R042j0412
$$ -6637 -11826 -10297 11121 15651 19927 1193 -9625 -6686 -13450 -8308 -4928 9166 18208 7796
270G796n910p054l04k465l530Q724Q876N575l641m287k025o905n595j990Q431
$$ 7796 1886 -5168 -5472 -7937 -11467 -2743 6133 11708 8067 3780 1755 -5150 -10745 -12735 -4304
285d304J1232L805l61m867n882p183n340M578Q912O577J756m448l306k252l757
$$ -4304 6928 10733 10372 5505 -377 -7560 -12900 -8322 590 7167 8923 4475 1169 -1083 -4840
300d840J436J607J134O55k857L484L999K506J17q036n615n567L44R940R475R194
$$ -4840 -3404 -1797 -663 -8 -2865 619 4618 7124 7241 -795 -6410 -11977 -11633 -1693 7782 16976
316A6976k258j1165j2589j0134L627J0139J4316R800l295q568j4745q306J971
$$ 16976 14718 3553 -9036 -19170 -15543 -5404 8912 18712 15417 6849 -7896 -16202 -14231
329a4231P638J2852M912jn132q630k735l038L245M358O98L928l47K258k96o083
$$ -14231 -6593 6259 11171 11170 6038 -2592 -5327 -8365 -5120 -762 -64 3864 3517 5775 5479 -604
345f04k903o405J799N390N750J0248k690n446j0584r438M494M376J3527O309l046
$$ -604 -3507 -9912 -8113 -2723 3027 13275 10585 5139 -5445 -14883 -10389 -6013 7514 13823 10777
360A0777n130j6150j265J803P807J2930k451J362j1630p403K759l70J3889j909
$$ 10777 5647 -10503 -11768 -9965 -2158 10772 8321 9683 -1947 -9350 -6591 -6961 6928 5019
374E019l11j799j0482O462m005Q471L317q382L389j0599Q801K891j472Q622j3386
$$ 5019 4708 2909 -7573 -1111 -5116 3355 6672 -1710 1679 -8920 -119 2772 1300 9922 -3464
389c464K436q480Q48J5984l570J0577j4394n512R36j1487J9113j018J1851p19
$$ -3464 -1028 -9508 -8660 7324 3754 14331 -63 -5575 -4639 -16126 2987 1969 13820 13101
403A3101k1429O253j3786J3747N330k483J7206j9630J712j0717l3K0353j1300
$$ 13101 -8328 -2075 -15861 -2114 3216 733 17939 -1691 21 -10696 -10729 9624 -1676
416a676J2158j2264j32L316j6212K1728o357J0303o218j9670J9197j5187J6327
$$ -1676 10482 -1782 -1914 1402 -14810 6918 561 10864 4646 -15024 4173 -11014 5313
429E313k710m788K0761k9211J0295q365L685K0631k6721J8541j0442M011P367
$$ 5313 2603 -2185 18576 -10635 -340 -8705 -5020 15611 -11110 7431 -3011 1000 8367
442H367k2747K7509j6782K400l958j2873L7749j8400J1266q365j5996J8424l5569
$$ 8367 -14380 13129 -3653 -1253 -5211 -18084 19665 1265 12531 4166 -11830 6594 -28975
455b8975K3919J1192P301J7094m1054J0682j4467l366J2404l352L9198j5427n628
$$ -28975 -5056 6136 13437 30531 -10523 159 -14308 -17674 -5270 -8622 30576 15149 9521
468I521j9706j0339K4524k6623L0981l583Q070J3884n4989L5785j8340K930K1163
$$ 9521 -10185 -20524 4000 -22623 8358 4775 12845 26729 -28260 7525 -10815 -7885 13278
481A3278m3203N7276k1256j0462J8547l8136M3454k9745r450K7818j1712K8463
$$ 13278 -29925 27351 6095 -4367 14180 -23956 19498 -10247 -19697 8121 -3591 24872
493B4872k8075m37P406r681J670j6296L4786n380J876j1296k0221M1279l6769
$$ 24872 -3203 -3640 3766 -5915 -4245 -20541 14245 8865 10741 -555 -20776 20503 -16266
506a6266J4349O061j1659M0866n8647J9883J2068j4145L3427n0714L3352L79k4364
$$ -16266 -1917 4144 -7515 33351 -25296 -5413 6655 -7490 25937 -24777 8575 8954 -15410
519a5410K0572k8957N0466j6012j8377J2599k6753M2356l8307P480K9848k2357
$$ -15410 5162 -23795 26671 10659 -7718 4881 -21872 20484 -17823 -10343 19505 -2852
531b852L0805n2069J5243K3119l0372K6030k6216K8847P195l2505J1062o875K2057
$$ -2852 27953 -24116 -8873 14246 -16126 9904 -16312 12535 19730 -12775 -1713 -8588 13469
544A3469j9505l647Q448O905J7079m6655L1644m820r451K0554n4858O5188j0361
$$ 13469 -6036 -9683 -1235 5670 22749 -23906 7738 2918 -6533 14021 -40837 24351 13990
557A3990k8567L6849n4839N7572k3071l7580N9431l5844L5394k2185k8277N0060
$$ 13990 -14577 22272 -32567 25005 1934 -35646 23785 -12059 23335 1150 -27127 22933
569B2933k9835O506r431O160K4427k2058m407o275K8395j6142j1015J1694r481
$$ 22933 -6902 -396 -9827 -3667 20760 -1298 -5705 -11980 16415 273 -10742 952 -8529
582h529L6969m3413K690K8809k6613K9946m3775J8363L0973l9490K3391k6228
$$ -8529 28440 -14973 -12283 16526 -10087 19859 -23916 -5553 25420 -14070 9321 -16907
594a6907K5929Q217l9300K5192j1405K6748j7723j9502L2433j7940J8690l2251
$$ -16907 9022 17239 -22061 3131 -8274 18474 751 -18751 13682 -4258 14432 -17819
606a7819N749L6307l3237J8448k4493J6824K1304m5820K3312n962J5481K490l3504
$$ -17819 -12070 24237 -9000 9448 -15045 1779 23083 -22737 575 -5387 10094 12584 -20920
619b0920K7315k275K129j5523l690K6230j0373J585k0818K1709J0668k8297J4736
$$ -20920 6395 4120 6249 -9274 -12964 13266 2893 4478 -16340 5369 16037 -12260 2476
632B476j8010K9371m193l2881L6010j5412J6661j4296k5408M1543j9867N290m807
$$ 2476 -15534 13837 9644 -23237 12773 -2639 14022 -274 -25682 15861 -4006 1284 -3523
645c523j465L0433l0568l194k007J0884J0385k2812J6454Q56P734j6149j9254
$$ -3523 -4988 25445 -5123 -8317 -10324 560 10945 -11867 4587 5443 13177 -2972 -22226
658b2226K8125p004Q010j1336j016K7499k7223J08m884P987J7983k8102J1519
$$ -22226 5899 -1105 6905 -4431 -5447 22052 -5171 -5063 -9947 -1960 16023 -12079 -560
671e60M595L783k281k3172J9587J161j138o284l601K3652j2493o113o136N823
$$ -560 4035 7818 5537 -17635 1952 3113 1975 -4309 -7910 15742 3249 -2864 -9000 -3177
685c177J4879j9439O172K996O415j819k2713J6591L134L112n108j1509K0720j0784
$$ -3177 11702 -7737 -1565 1431 7846 6027 -16686 -95 3039 6151 1043 -10466 10254 -530
699e30m901o2L020K0863j8875n084K717n97P769j4242J0704J1794n214p966j2630
$$ -530 -5431 -5493 -2473 18390 -485 -5569 -2852 -3449 4320 -9922 782 12576 7362 -604 -13234
714a3234J0208M446k616l14N765R052j3124p504k218Q367P365j1885Q339L796
$$ -13234 -3026 1420 -1196 -1510 4255 13307 183 -7321 -9539 -1172 6193 -5692 2647 6443
728F443q80l781j4814J1782L596m719K298j213J1490m269j1796L69K352M235l847
$$ 6443 5563 1782 -13032 -1250 2346 -2373 -75 -1288 10202 5933 -5863 -5494 -3142 1093 -2754
743b754J411P631L042p370j1131M138L241K206M38m05R525o212r962n21J769R265
$$ -2754 -1343 6288 9330 1960 -9171 -5033 -1792 414 852 447 9972 3760 -6202 -6723 -4954 4311
759D311j856l293N530j591m680m578J066Q373J767n623j96K305j338j574l016
$$ 4311 2455 -838 4692 3101 -1579 -6157 -5091 3282 5049 -574 -770 1535 197 -1377 -4393
774d393M643N260n829j523P58J868K211n891P96M482j908q20j184J987L713m822
$$ -4393 250 5510 -319 -1842 -1084 784 2995 -2896 -2100 2382 474 -346 -1530 457 4170 -652
790f52l274L095J013J588j102j387M115l175m089J518J110M668r46l328K274j768
$$ -652 -3926 -831 182 1770 668 -719 3396 221 -3868 -2350 -1240 3428 2482 -846 1428 -340
806c40j661m09O22M633K70l066o53J14l69j17m38J842K553k635q70K92n91J746
$$ -340 -2001 -2410 -1788 2845 3115 49 -604 -490 -859 -976 -1414 428 2981 346 -524 -232 -823 923
824I23k590M98K750j452J482j647l71J441l373R73Q49J291K295k294l07j468j326
$$ 923 -1667 -1169 1581 129 1611 -36 -407 1034 -2339 -1366 -517 774 3069 775 468 -1000 -2326
841b326M92M72L333Q88k10k314k759R2q44L120J740J175J083m487q04k293L06
$$ -2326 -1834 -1362 1971 2859 2649 335 -2424 -2332 -3176 -56 1684 2859 3942 -545 -1349 -3642 -3336
858c336M022k89L652j480k019o80m506K883J41K427K887k672J962m002j172J06
$$ -3336 686 397 4049 2569 550 -130 -4636 -1753 -1612 815 3702 1030 2992 -1010 -2182 -2076
874b076j376N207j023K124m87k950J271m800K488O53J333L640l902K518l782j171
$$ -2076 -3452 1755 732 2856 2369 -581 690 -4110 -1622 -969 364 4004 102 2620 -1162 -2333
890b333J292k685O659k175J439j05m808M020n441L588J715j577N329p101L067
$$ -2333 -1041 -3726 2933 758 2197 2092 -2716 1304 -4137 -549 1166 -411 4918 -2183 884
905H84j706k516N527n113O431k248k304L102o351O014l284J115L613m828N002
$$ 884 -822 -3338 2189 -2924 3507 1259 -1045 2057 -4294 1720 -1564 -449 3164 -1664 3338
920C338o113K253R14l032O022n688N352k734k669M636o868P832m603Q61M634q149
$$ 3338 -2775 -522 392 -2640 3382 -2306 3046 312 -2357 2279 -4589 3243 -1360 -499 4135 -4014
936d014Q079p740K905L839p677R817q092M166Q65p527R625p820N699q87m465P945
$$ -4014 4065 -3675 -770 3069 -4608 5209 -2883 1283 2148 -5379 4246 -3574 2125 1238 -3227 4718
952D718q563N606l183J07N534p865O966n914L305J007o637R709p897O237k825
$$ 4718 -3845 1761 -1422 -1315 4219 -3646 3320 -2594 711 1718 -4919 4790 -3107 3130 305
967C05n099J0567j1143Q501l975j793J0161j3904R588n222L2P662j2833J2218
$$ 305 -4794 5773 -5370 3131 -844 -2637 7524 -6380 3208 -2014 -1982 5680 -7153 5065
981E065n936Q90K972j0277J2825q088L080O98n109J1031j1676N277j597r73P554
$$ 5065 -871 19 2991 -7286 5539 -2549 531 1229 -3880 7151 -4525 752 -845 -1818 5736
996E736j2121R849l802Q50K216j0226J2933p706L330n12n234J3492j3929O324
$$ 5736 -6385 3464 -338 512 2728 -7498 5435 -2271 1059 547 -4687 8805 -5124 1200
1010A200k501k065J1948j7271J2629l077k544Q468j8105J6677m701l596Q187j3237
$$ 1200 -1301 -3366 8582 -8689 3940 863 -1681 6787 -11318 5359 658 -2938 5249 -7988
1024g988J6078q437m410P175o831J1209r729J022M452k528L172j0168R342j973
$$ -7988 8090 -347 -4757 2418 -4413 6796 -2933 -1911 2541 13 3185 -6983 2359 386
1038C86Q58j93q167J6334j2100K218R23p232J8703j8604O194N146q962J3982k0175
$$ 386 1244 1051 -7116 9218 -2882 -664 259 -6973 11730 -6874 -680 4466 -4496 9486 -10689
1053a0689R962O305r459J0321j3607J1859j249j0220O894n321J3746p699l318
$$ -10689 -727 5578 -3881 6440 -7167 4692 3443 -6777 117 -5204 8542 843 -2475
1066b475N155n811P897j4090P484P912n066N936j5101J0126j26q838P936n501
$$ -2475 2680 -3131 4766 -9324 -1840 6072 1006 6942 -8159 1967 1841 -6997 939 -4562
1080d562J4665o339q265N261n339R077j1288M304Q812m287M903j6243J0212J639
$$ -4562 10103 3764 -4501 760 -4579 4498 -6790 -2486 6326 2039 6942 -9301 911 2550
1094B550q933Q641r647J7547m131j2462R862j0280J1343q164m433J7055o575M046
$$ 2550 -6383 2258 -7389 10158 6027 -6435 3427 -6853 4490 -3674 -8107 8948 2373 6419
1108F419j1231l92R016q565M039k461J0899l71j1887K221m064J1275o400k895
$$ 6419 -4812 -5204 3812 -4753 -714 -3175 7724 7353 -4534 -2313 -6377 4898 -1502 -4397
1122d397J1519n666M192j3529J003J2684p177M888o919O287L250j3171M212q94
$$ -4397 7122 1456 5648 -7881 -6878 5806 -1371 3517 -3402 2885 6135 -7036 -2824 -3718
1136c718J0546l301q689P876l794N099j0008Q6J3545p275L439r114M300Q742j4338
$$ -3718 6828 3527 -5162 2714 -1080 4019 -5989 -5903 7642 367 3806 -5308 -1008 7734 -6604
1151f604M996j397O857L223j3493P765K4J23m485n136J2242M63j333n891J569
$$ -6604 -1608 -3005 3852 7075 -6418 1347 1371 1494 -2991 -8127 4115 4578 3245 -2646 -1077
1166a077N271q459kN5J0260J943j1046K916k259L984m421m549J2744n19l46q143
$$ -1077 4194 -4265 -4267 -4212 6048 7991 -3055 -139 -2398 1586 -2835 -7384 5360 4841 4495 -3648
1182c648j480R298o636R87j108N995M418j2774K789P45L921r5r804R659J180k318
$$ -3648 -5128 4170 -2466 -1479 -2587 3408 7826 -4948 -2159 -1414 2507 2412 -7392 2267 3447 1129
1198A129k056m112R931k665o292J079L155N245m945l556K896L646m106m839M785
$$ 1129 -927 -5039 4892 2227 -4065 -2986 169 5414 469 -3087 -191 3455 -651 -5490 -705
1213g05L393L057p358k932P854m127p8k288K527R018r261k254J823J075L806p494
$$ -705 2688 5745 -1613 -4545 3309 -818 -896 -3184 -657 8361 -900 -3154 -1331 -256 3550 -3944
1229c944K197N913j904l013l429M493K998l417l552K836M861l375k111m66L796
$$ -3944 -1747 4166 2262 -751 -4180 313 3311 -106 -3658 -822 4039 664 -1447 -1913 1883
1244A883J457p761J775L980J378n18n692L839K642m559j352J099M878N22n229
$$ 1883 3340 -4421 -2646 1334 2712 2194 -3498 341 2983 -1576 -2928 -1829 3049 3571 -1658
1259a658p58L753J72l123m14J954L804l039m727M154J471J26k243k637N516j278
$$ -1658 -2416 1337 1509 -1614 -2028 -74 3730 691 -4036 118 1589 1715 -528 -3165 2351 1073
1275A073l749J417J493L813k585m567K492J189j405r77R14L948Q18n038j175K206
$$ 1073 -2676 -1259 234 4047 1462 -3105 -613 576 -829 -1806 -892 3056 3874 -1164 -2339 -133
1291a33m45n8j473K644M218l888k064j7L47J574l238J044M367m90j548k089J84
$$ -133 -578 -636 -2109 535 4753 865 -1199 -1216 -869 705 -2533 -1489 2878 2388 840 -1249 -1065
1308a065J909j998j597K892K006k79j349j937K198k41l321J533R29K192J92l306
$$ -1065 844 -1154 -2751 141 2147 1868 519 -1418 780 539 -2782 -1249 -320 1872 2064 -1242
1324a242K361k02j981m01j101L441R16j755O97J62mj725j473J041K025j98p81
$$ -1242 1119 917 -1064 -1465 -2566 875 1791 36 733 895 891 -834 -2307 -1266 759 561 -220
1341b20J490j19J87k101j911K528r73Q22J106P0K752l208j947k29j037K520j65
$$ -220 1270 1151 1338 -763 -2674 -146 -1119 -297 809 879 3631 423 -1524 -1753 -2790 -270 -435
1358d35K053J883j670j621l236M37J006J409J932J61J090l032j658m87j11L375
$$ -435 1618 3501 1831 210 -3026 -2589 -1583 -174 1758 1919 3009 -23 -1681 -2168 -2279 1096
1374A096r28J367Q1j980R69k720J715P09p95J603k155J897l87n92J022k210J730
$$ 1096 168 1535 1616 -364 605 -2115 -400 309 -486 1117 -1038 859 472 -120 902 -1308 422
1391D22j686N76J606j046K613l050J05r7j591L487j938K122k19k500J621k961
$$ 422 -1264 -688 918 -128 2485 -565 -460 -557 -2148 1339 -599 1523 1304 -1196 425 -2536
1407b536K844N73m60J501l400J514j532O22K164j064K414l541j3j94p69L948k407
$$ -2536 308 881 421 1922 -1478 36 -1496 -874 1290 226 2640 -901 -914 -1108 -1877 2071 -336
1424c36K547j477k462J944l484M638k29o90J854m878L055k100N67L315k751L076
$$ -336 2211 734 -1728 216 -3268 1370 1141 451 2305 -2573 482 -1618 -1051 2264 -487 2589
1440B589l997J6J506j668M014k966J606j004k344K844k302M330j611j428Q81m064
$$ 2589 -1408 -1392 114 -1554 2460 -506 1100 96 -2248 596 -1706 2624 1013 -415 466 -3598
1456c598M449j895K439K119m337K337n779K290K322j052N809m757J388k683l930
$$ -3598 851 -1044 1395 3514 -823 1514 -4265 -1975 347 -705 5104 347 1735 -948 -4878
1471d878M689k356N629m66j847J750n731K614k061J590L255k796L624l536J493
$$ -4878 -189 -2545 3084 2618 771 2521 -3210 -596 -2657 -1067 2188 -608 3016 -520 973
1486I73m49l148L371m058L816m14J91M621n310K375n027j088L740k867P947j913
$$ 973 524 -2624 747 -3311 505 91 282 4903 -407 1968 -3059 -4147 -407 -3274 4673 2760
1502B760M93q60q026M030l262M725L763k167M573p516k86j274r97O675l033L830
$$ 2760 3253 2393 -5633 -1603 -4865 -140 3623 1456 6029 -1487 -1773 -3047 -4044 2631 -402 3428
1518C428j975k255J203m341N064j181J094n4l475M277l714L073l30j187L474o928
$$ 3428 1453 -802 401 -3940 1124 -57 1037 983 -2492 1785 -1929 1144 814 -373 3101 -3827
1534c827L749j255P40M529o356N483l390j361K780n278P219l166p33K440l726
$$ -3827 -78 -1333 -593 3936 -2420 3063 -327 -1688 1092 -4186 3033 -133 -866 1574 -2152
1549b152N792m331J26J080k989L051l778M585J690q94L3o225L415k704J336L794
$$ -2152 3640 -691 -565 515 -2474 577 -3201 1384 3074 2180 2213 -4012 -597 -3301 -1965 1829
1565A829q93O067p061j951k62k606O567l594M641J905m224P54o543M410J021j046
$$ 1829 936 7003 -58 -2009 -2271 -4877 1690 -1904 2737 4642 418 1172 -5371 -961 60 -986
1581i86L059k689M496m155j726J923j646M409n486K079K777k066L209o093L649
$$ -986 2073 -616 3880 -275 -2001 -78 -1724 2685 -2801 -722 2055 -11 3198 -2895 754
1596G54L32m275L288k717O199q49m288K468l115L228l019j49M970j586J069n050
$$ 754 1086 -3189 99 -2618 3581 2732 -1556 912 -2203 1025 -1994 -2143 2827 1241 2310 -2740
1612b740J715K353k571J735k545M754j073l994K391j498M643l585k191M001j849
$$ -2740 -1025 1328 -1243 492 -2053 2701 1628 -2366 25 -1473 3170 -415 -2606 1395 -454
1627d54K430m172J491L854l613M28l317M272J492l846K148j769L813l175l499
$$ -454 1976 -2196 -705 3149 -464 -36 -3353 919 2411 -1435 713 -1056 2757 -418 -3917
1642c917M910r67L040m048j137N165m056N82k032K249M316n149L66J69J705j86
$$ -3917 993 26 3066 -982 -2119 3046 -1010 -428 -2460 -211 4105 -1044 -678 -509 1196 1010
1658A010m160K419K038Q81l166n67L105n87o23l984L562K674l428J187k073M504
$$ 1010 -3150 -731 1307 2188 -978 -1545 1560 973 350 -3634 -72 2602 -826 361 -1712 2792
1674B792m92o242L495p17K897j129l576O417j525j868k352j176N554j888j042
$$ 2792 2300 -3942 -447 -1164 1733 604 -2972 3445 1920 52 -2300 -3476 2078 190 -852
1689h52J502J743L69n130r43K205K779j325j643L222J63j008m146K67M918j752
$$ -852 650 2393 2762 -2368 -3311 -1106 1673 348 -1295 1927 2090 1082 -3064 -2797 2121 369
1705C69o55j046K255K522m860q8J306J483q51l990L088K683J86k478j586L107
$$ 369 -286 -1332 923 3445 -1415 -1503 -197 1286 435 -3555 -467 2216 2402 -76 -1662 1445
1721A445j473j998q76L077M099l486j360oJ115N2m313K528L045L4j423k307L357
$$ 1445 -28 -2026 -2902 175 4274 788 -572 -578 537 589 -3724 -1196 1849 1883 460 -1847 1510
1738A510O65l275j754J036L054o24j056J508K506j646n239o46J925L233J65p60
$$ 1510 2175 -1100 -2854 -1818 1236 612 -444 1064 3570 1924 -3315 -3961 -2036 1197 1362 602
1754F02L363j368l816l494L9N878Q54o00O64l22o40m600r68L979K593k56k126
$$ 602 3965 2597 -1219 -4713 -4674 1204 2058 1458 2122 1800 1160 -3440 -4408 -429 2164 1908 -218
1771b18O59J136j520k461N38L114l46j590o14K339K091l266j475M80R52K36j984
$$ -218 441 1577 57 -2404 -1866 1248 902 -688 -1302 1037 3128 -138 -1613 -1133 -181 55 -1929
1788a929K573K541j378k700k124K307J463r71J98J294P47k616k034J331K897M72
$$ -1929 644 3185 1807 -893 -3017 -710 753 -218 -20 1274 2021 -595 -2629 -1298 1599 2071
1804B071k545k61M93J38q87j75L429L79k447k497m31L004K70j21J094K73r63l507
$$ 2071 -474 -735 -242 -104 -991 -1166 2263 2642 195 -2302 -2733 271 541 420 1514 1787 824 -2683
1822b683m13K782K108m4j643L47k64j233q68J085K973p65j709q49O91J695j562
$$ -2683 -3096 -314 1794 1750 107 454 190 -1043 -1911 -826 2147 1382 -327 -1176 -485 1210 -352
1839c52P7Q50k92n13j804J935K076n11j282j789Q63J28j73J208J332P34k788j932
$$ -352 -275 575 283 -230 -2034 -99 1977 1466 184 -1605 -742 -614 -787 421 1753 2487 -301 -2233
1857b233Q1J536J822n71J103l91j716j340j244L044J349j67j68j485P36j402n34
$$ -2233 -2152 -616 1206 635 1738 1347 -369 -1709 -2953 91 1440 1273 1105 -380 356 -1046 -1580
1874a580J462N38R51j671j06R42l7M0j644O34j08k14J048L04K119j486k121q32
$$ -1580 -118 420 1371 -300 -406 536 499 539 -1105 -471 -579 -793 255 559 2678 1192 -929 -1761
1892a761j025K452M96J566J418j962j190l115K67K090J122K151p60j84j787k032
$$ -1761 -2786 -334 162 1728 3146 1184 -6 -3121 -2854 -764 358 2509 1749 1565 -222 -2254
1908b254M60L91K512m4j64o1j391P98j386Q59O59r22J068j511J490N43q52Q02
$$ -2254 -1794 -1403 1109 1065 901 840 -551 247 -1139 -280 379 -543 525 -986 504 1047 195 997
1926I97k154P59m76k08K008n84J467j433j048L84j193J778o62O81O36j307J097
$$ 997 -1157 -398 -874 -1082 926 342 1809 376 -672 -288 -1481 297 -365 316 952 -355 742
1943G42j367R65J29j237P36j530J585M04K52J283j812K07k140m07J514L44K828
$$ 742 -625 340 469 -768 -32 -1562 23 427 679 1962 150 357 -1783 -2190 -676 -332 2496
1960B496r60j33j072k515Q22j029K635J385k64Q77k788L86j364m06J989n29K384
$$ 2496 1536 1403 331 -2184 -1362 -2391 244 1629 1365 2242 -546 -160 -1524 -1930 59 -470 1914
1977A914j167l13L94k003J254j693J028J079q27J979j609R30o40j836J199j339
$$ 1914 747 434 828 -1175 79 -1614 -586 493 -334 1645 36 966 326 -1510 -311 -1650
1993a650K026J24j58J377j850N60j646j6J241o47J794j019Q20k46j603J023j562
$$ -1650 376 500 342 1719 -131 429 -1217 -1233 8 -639 1155 136 956 710 -893 130 -1432
2010a432J671k78l89J815j704J469j481n27J372j911J936r71O62J180k023J478
$$ -1432 239 -39 -428 1387 -317 1152 -329 -856 516 -1395 541 -430 232 1412 -611 867
2026H67j680M84K77j251K234j046J126m85j151J180j940J256l21N01J455j766
$$ 867 -813 -329 -52 -1303 931 -115 1011 526 -625 555 -1385 -129 -450 51 1506 -260
2042b60J097j479N8M39j028K253q99O93n64j269J375j636J458j45K0J254k362
$$ -260 837 -642 -584 -145 -1173 1080 181 874 310 -959 416 -1220 238 93 113 1367 -995
2059i95J392r07J32J150j911K111j140k4P64j434K038j562j26L89o98J783j109
$$ -995 397 -510 -378 772 -1139 972 -168 -192 572 -862 1176 -386 -512 -123 -821 962 -147
2076a47Q72j36q68j1j564J979P5P49K88j621J215k389L85R50n7K608k332K96j53
$$ -147 725 589 -279 -290 -1854 125 200 949 1237 -384 831 -1558 -1173 -223 -280 2328 -4 292 139
2095A39j502J551j503J920O22j362N00j436J526k31n90O43o68R08j470N32J121
$$ 139 -1363 188 -1315 605 1227 -135 365 -1071 455 224 -366 277 -391 517 -953 -421 700
2112G00r1N83k346P85J22o04J236p95K017p67j672N04p11J810j040k73J162o64
$$ 700 609 1192 -1154 -369 -247 -851 385 -410 1607 840 -832 -328 -1039 771 -269 -542 620 -44
2130d4Q56j628J101Q51j539Mj768K219R61p09J532j458L07k131j899K678J082
$$ -44 812 -816 285 1136 -403 -399 -2167 52 1013 304 1836 378 685 -1446 -3345 -667 415
2147D15J983n48j226lk308r56M23K760J914m97j084j428M38j814r6K002P76J800
$$ 415 2398 1850 624 621 -1687 -2643 -2220 540 2454 1957 873 -555 -117 -1931 -2027 -25 751 2551
2165B551k545m87J367j737O14j487J198K221j955P82p0M71k91k857P61J298J095
$$ 2551 6 -481 886 -851 -237 -1724 -526 1695 -260 522 452 923 632 -2225 -1464 -166 929
2182I29j55m29R12q62j342j506J729K270o10j89j278P53k26j935J760J084Q32
$$ 929 774 345 1257 395 -947 -2453 -724 1546 936 747 -531 222 -4 -1939 -179 905 1737
2199A737j389k314J460O02K10k63M63J078j695j639l25K479J314j162mo24N16
$$ 1737 348 -1966 -506 96 306 43 506 1584 -111 -1750 -2075 404 1718 556 552 -72 444
2216D44j519j388K815R03L66j555j260K019j038q30L32R23J429j811q13J188R08
$$ 444 -1075 -2463 352 1255 1621 66 -1194 825 -213 -1043 -711 212 1641 -170 -983 205 1113
2233A113p28j723M24J131M61j132K94J821q36j448j536J133K313j001N2K61K84
$$ 1113 385 -1338 -914 217 678 -454 -160 1661 825 -623 -2159 -1026 1287 286 338 599 883
2250H83o75k559R63K093P82p73j276R03mj163o68J383J889j068j259l63J335L90
$$ 883 208 -2351 -1388 705 1487 714 -562 341 337 -826 -1494 -111 1778 710 -549 -912 423 813
2268H13j851N35R15M79r20j436J932P78r84j210k50J843k21q90M71J057Q9k194
$$ 813 -1038 -503 412 891 -29 -1465 467 1245 261 -949 -1199 644 423 -467 4 1061 1150 -1044
2286a044p67J265J519j81j029Q54K03r87j553K06K489K73q36o76L79O15j732l62
$$ -1044 -1811 -546 973 792 -237 617 820 -167 -1720 -1514 975 1248 412 -264 115 730 -1002 -1364
2304a364J256J251j31j765M56R43k33j079m98J654K74r19n22Q24J212j337j039
$$ -1364 -108 1143 1012 -753 -297 646 413 -666 -1164 490 764 -155 -677 147 1359 22 -1017
2321a017K55J073L17j373O33R87k4j108j175J449O09o60m75K88J349p86j068K91
$$ -1017 -762 311 628 -745 -112 875 851 -257 -1432 17 626 -34 -509 -221 1128 342 -726 -435
2339d35Q41K47j407j07J077O89n45r29Q92J79o92r71J91J948j67n63k43J16M17
$$ -435 406 653 -754 -861 216 905 360 -569 323 502 -190 -1161 -970 978 811 248 5 121 538
2358E38j667j26J249Q21K19j255L15L84p99o91k9J565L83o13m08K30M97j259k78
$$ 538 -1129 -1255 -6 815 1034 -221 94 478 -321 -1012 -1041 524 907 294 -114 116 613 -646 -924
2377i24N67Q14L60j264N36M46l55l95q29J218K68o49Q2J15R73o75q64K11K31L02
$$ -924 -357 457 817 -447 89 535 180 -215 -1044 174 442 -207 -125 -10 963 288 -576 -365 -134 168
2397A68p01M10Q21Q9n06j080N46J22k12J36J00J210n76p64r0j56O74p45K38P93
$$ 168 -533 -123 698 787 281 -799 -253 -131 -343 -207 -107 1103 527 -237 -327 -483 191 -554 -316 477
2417D77L3J36j089L15J82n25J87k72J207J20o36Q2o38M04n89r5J048J80L94r07
$$ 477 510 646 -443 -128 54 -471 -284 -556 651 771 135 217 -421 -17 -606 -701 347 527 921 14
2437A4l43J10l61L10J3R31P0o04l13n61P40k54J75N25l53M38j023M1N63l02O54
$$ 14 -329 -219 -580 -270 -257 674 744 140 -173 -734 6 -248 -73 452 99 537 -486 -445 118 -184 470
2458D70p22K65K49o14N23m22N15m1o23M06k84O47j85k46K66n57L76m16L70N93
$$ 470 -252 13 262 -352 171 -251 264 223 -400 6 -278 369 184 -62 204 -353 23 -393 -23 570
2478E70m27K65q86J51K05k07P99l63M30m26o63L43l30Q91j35n3K44p44M02o07
$$ 570 143 408 -478 -327 -122 -329 470 107 537 111 -552 -209 -539 352 217 164 408 -336 66 -541
2498e41L61N61m04M84p68K68J49m34N83m77M82j79l82M78l28N26m91j43L46l25
$$ -541 -180 381 -23 461 -307 -39 110 -324 259 -218 264 85 -297 181 -147 379 -112 -255 91 -234
2518b34O63n26K92O6p49M48n67Q75L71n38M28j049K03j69j56J273j15L82p59q13
$$ -234 429 -97 195 261 -488 -40 -607 268 639 101 529 -520 -317 -486 -642 631 516 898 139 -674
2538f74J50l90Q17L28O70J12r90l43q23O11K87L41R63n41J86j104n32O12l92J119
$$ -674 -524 -914 -97 231 901 1013 23 -320 -1143 -532 -245 96 1059 518 704 -400 -932 -320 -712 407
2558D07j30K82L68j197J72p11K94N17k53J035k65P6n70q67M43l39P95K76K41M17
$$ 407 277 559 927 -270 -98 -809 -515 2 -251 784 519 595 25 -842 -399 -738 57 333 574 991
2578I91j152j51n91K66P85j12R01m39l15n15p21Q59K5P01N6l52J03j056K74K1
$$ 991 -161 -312 -903 -637 148 36 937 498 183 -332 -1053 -194 -169 532 588 236 339 -717 -443 -422
2598d22N20O63o83M13p36j42J13l66J192k67J19j54o73N19p49M10L65N4N19q33
$$ -422 98 761 78 491 -245 -387 -274 -640 552 285 404 250 -423 96 -653 -243 122 176 695 -138
2618a38K76l07k54K43l63J018j55n4K0o61M66p29K25N96J5N75p85J0p5m66K73
$$ -138 138 -169 -423 -180 -543 475 320 266 286 -375 91 -638 -413 183 198 773 -12 -2 -77 -543 -270
2639b70j04R06Rl07j93m28M54o07L38M51kM68j152L42J32m35N69o39Q83Q6q10
$$ -270 -374 532 541 234 41 -387 67 -540 -202 249 247 715 -437 -95 37 -398 171 -468 415 501 -309
2660c09L89m28N78k38m51O20J0J55n83P9L74j86n0m96Q64K3m67J54m22Q66n07
$$ -309 80 -348 230 -8 -459 161 171 326 -257 -178 196 10 -40 -536 328 351 -116 38 -384 482 -25
2681b5n51P83j62M63o69l04Q42l47j10k93M48M50n22k56n3P39m30m14L75P4O64
$$ -25 -576 207 45 508 -161 -465 377 30 -80 -373 75 525 3 -253 -306 433 3 -411 -36 38 702
2702G02j044j70Q87m51K74p05L40J015r92j14k1M16L04q70J55N81J93o93k90M96
$$ 702 -342 -512 375 -76 198 -507 -167 848 -144 -258 -279 137 441 -429 -274 307 500 -193 -483 13
2722A3K86J0r70O51O37p04J2n82R53M04j306M93J32L18j60j029R20M86m54m56
$$ 13 299 309 -661 -10 627 -77 -65 -647 306 710 -596 -103 29 347 187 -842 78 564 110 -346
2742c46k8P03M2p09k39J052K0p35j28n8J129n50r15J034lJ56p89n91J535k21n25
$$ -346 -374 329 371 -338 -577 475 495 -240 -368 -426 703 153 -762 272 269 425 -364 -955 580 359 -166
2763a66PJ60P54q68p99O78P88j90n64M5M87K21j271j20J180M8M3q27K57R81j251
$$ -166 -159 1 755 -113 -912 -234 554 364 -200 -155 332 553 -718 -838 342 390 433 -394 -137 844 -407
2784d07l46L65O90O33j173q8P33k45o48l77Q26R27l57r93L50M61n58l55j22J331
$$ -407 -753 -388 302 935 -238 -326 407 162 -486 -863 -37 890 533 -460 -110 351 -207 -562 -684 647
2804F47M61j367k9J15L16j75r17J222P22o01p18m29R08J32p25J51Q71K09r27o50
$$ 647 1108 -259 -288 -173 143 -32 -949 273 995 394 -324 -753 155 287 -438 -287 584 793 -134 -784
2824g84L27R33k89p10P32L41j29r25m96J311P9m88p4K83P14q89q55N36O87O8n72
$$ -784 -457 476 187 -523 209 550 421 -504 -1000 311 390 -98 -172 111 825 -64 -919 -383 304 372 -200
2845b00J01O95m3j095m14R05M53o6n03L16O83j022o69J64Q83O69q78l4M47k24
$$ -200 -99 596 553 -542 -956 -51 402 336 -167 149 832 -190 -859 -695 188 857 -21 -55 392 168
2865A68n73o24R16R00l42n54j10N21l14o52J90Q11M25q17l39M13K96l13o79N36
$$ 168 -405 -1029 -113 787 445 -109 -219 302 -12 -664 -474 337 762 -55 -394 19 315 2 -677 -141
2885a41O02j93m63j04P77j11p54k16M97O35m08k37K86K51m10q81L95P62K76l01
$$ -141 461 268 -195 -299 478 367 -387 -603 -106 529 121 -116 170 421 11 -870 -475 287 563 262
2905B62m59M90k19o26p1M26R78l31o13J21K0M3n68J12Q60M3l27m10K28L35m58
$$ 262 -197 293 74 -552 -623 -197 781 450 -163 -42 -22 21 -547 -435 425 468 141 -269 -41 294 -164
2926a64l33K81N54m5l02l3L19k8p73k1M56M48J48n90K93k8n96n3l7R54K65o47
$$ -164 -497 -216 338 293 -9 -42 277 249 -524 -545 -89 359 507 -83 210 182 -414 -467 -504 450 715 68
2948F8m7k86J12j37j28P64K70k96o08k31L19J89M7Q9L92k72n64k52R3P78k8q0
$$ 68 21 -265 -153 -290 -418 346 616 320 -288 -519 -200 -11 36 125 517 245 -319 -571 -478 300 272 192
2970A92J76l42n7n61N0P20O6J90k94l5O1n60l2Q2M36K70j68J69j54j72m85k77
$$ 192 368 26 -31 -592 -542 178 244 434 140 105 166 -394 -426 -344 92 362 194 363 209 37 -448 -725
2992g25M70L14M25Nr5j53o56k97pO37N68J00j6m57k29n45n5N67L06N93l80k91
$$ -725 -255 59 484 489 394 241 -415 -712 -719 -82 486 586 570 113 -116 -661 -716 -149 157 750 370 79
3014G9k5n79L11j23L41N33m85J59k95p0K88l97K56L2n0J21j90J80Q9j27j67m0
$$ 79 54 -525 -214 -337 4 537 52 211 -84 -154 134 -263 -7 25 -25 96 -94 86 175 48 -119 -159
3036a59K8P8J08j12K90q1k36Q0l20L83n9j70L75k85L23k00k49L58l86K41j52n
$$ -159 -131 -53 55 -57 233 152 -84 -4 -324 59 0 -170 205 -80 243 43 -206 152 -234 7 -145 -150
3058a50N21l26J67k46j23J76l77L07J17J68J00m24P4j47jM7L4L16l4q5k41J8L9
$$ -150 371 45 212 -34 -157 19 -358 -51 66 234 334 -90 -16 -163 -164 -117 -83 233 199 114 -127 -109 -70
3081g0r0J62q0L61j58k55J63k78L67j99p3M35l72K42k58r5M62m62K54q0k5L09
$$ -70 -160 2 -78 283 125 -130 33 -245 122 -77 -150 285 -87 155 -103 -198 264 -198 56 -24 -49 260
3103B60m65K52Jm9Q1l28K80K9%J4j17J56k41j0k9K24K14k31N9k29M5p9j01M31
$$ 260 -205 47 48 -1 80 -248 32 61 61 75 -42 114 -127 -137 -166 58 272 41 100 -129 -84 -163 -264 167
3127A67l1J43k71k20K13k63K77m6J12K23n24K50j37J19K51n04L64k60p4L02j94
$$ 167 136 279 8 -212 1 -262 15 -31 81 304 -220 30 -107 12 263 -241 123 -137 -211 91 -103
3148a03N62j87l89j2l43K79J56J86L62j11l69l86j00M4M15J20K04K46n85l3l31
$$ -103 459 272 -117 -129 -472 -193 -37 149 511 400 31 -355 -455 -411 4 124 328 574 -11 -44 -375
3169c75p2N12l74M93J71j78K83o59N9q1l84M16J55N76J78l98l29m58k01j6N95
$$ -375 -447 65 -309 184 355 177 460 -199 -140 -221 -605 -189 -34 542 720 322 -7 -465 -666 -682 -87
3190h7O44L27j33q72k87l18NO72L35O22k81p77k05k30K81K70J74L14j29m24l09
$$ -87 557 884 751 -121 -408 -726 -721 -49 286 908 627 -150 -355 -585 -304 -34 140 454 325 -99 -408
3211d08K96J36J58j09l20L95l50j9M25j24M35n99m16N19k50L27mj26M96m78k63
$$ -408 -112 24 182 73 -247 148 -202 -221 204 80 515 -84 -500 19 -231 96 92 -34 462 -16 -279
3232b79K49J5J55k45l08M73K49k21K27j83j81j88p48O99P38Q7K77p68k24k52p39
$$ -279 -30 -15 140 -105 -413 60 309 88 315 132 -49 -237 -985 -286 452 539 816 48 -176 -428 -1167
3253a167P01P86O06R2r92l81j37k98K86O71N99J09p38o91K63L8k7L20O1M61l22
$$ -1167 -466 320 926 1018 26 -355 -492 -790 -504 167 766 875 137 -554 -291 -253 -280 40 101 562 240
3274B40o65M40O6Rk18m00O30K03l07J83J5l6l51o25M34Q31k8r1k57k01O8o78K24
$$ 240 -425 15 81 90 -128 -528 102 305 -2 181 196 160 -191 -816 -382 449 421 330 73 -128 -60 -738 -514
$$ [...]
8191B4
##END NTUPLES=NMR FID
##END=
