##TITLE=1H_AM_NV BROMACOLD
 CDCl3
 8 sc, 
 9.9.2024
##JCAMPDX= 6.0         $$ Bruker NMR JCAMP-DX V2.0
##DATA TYPE= NMR FID
##DATA CLASS= NTUPLES
##ORIGIN= UXNMR, Bruker Analytische Messtechnik GmbH
##OWNER= root
$$ XWIN-NMR		Version 3.5
$$ Mon Sep  9 15:47:41 2024 Russian Standard Time (UT+4h)  she@DPX200
##.OBSERVE FREQUENCY= 200.1318
##.OBSERVE NUCLEUS= ^1H
##.DELAY= (6, 6)
##.ACQUISITION MODE= SIMULTANEOUS
##.ACQUISITION SCHEME= undefined
##.AVERAGES= 8
##.DIGITISER RES= 18
##SPECTROMETER/DATA SYSTEM= spect
##.PULSE SEQUENCE= zg30
##.SOLVENT NAME= CDCl3
##.SHIFT REFERENCE= (INTERNAL, CDCl3, 0, 15.7039)
##AUDIT TRAIL= $$ (NUMBER, WHEN, WHO, WHERE, WHAT)
$$ ##TITLE= Audit trail, XWIN-NMR		Version 3.5
$$ ##JCAMPDX= 5.01
$$ ##ORIGIN= Bruker BioSpin GmbH
$$ ##OWNER= she
$$ F:/spectra/data/she/nmr/H-F/1/audita.txt
$$ ##AUDIT TRAIL=  $$ (NUMBER, WHEN, WHO, WHERE, WHAT)
(   1,<2024-09-09 15:46:30.51 +0400>,<she>,<DPX200>,
      <created by zg, POWCHK disabled, PULCHK disabled
       configuration hash MD5:
       00 E9 B6 7A A2 85 ED C7 34 08 36 98 17 FE 4E 26
       data hash MD5: 16K
       35 B0 61 21 A1 54 1E 5A 46 87 AF 6E 9F 31 1F F3>)
$$ ##END=
$$ 
$$ hash MD5
$$ F6 0B 8A 40 DE B9 4A 38 36 D8 56 DC 16 10 21 42
##$RELAX= 
##$RELAX= 
##$RELAX= 
##$RELAX= 
##$RELAX= 
##$RELAX= 
$$ Bruker specific parameters
$$ --------------------------
##$DU= <F:/spectra>
##$EXPNO= 1
##$NAME= <H-F>
##$PROCNO= 1
##$TYPE= <nmr>
##$USER= <she>
##$AMP= (0..31)
100 100 100 100 100 100 100 100 100 100 100 100 100 100 100 100 100 100 
100 100 100 100 100 100 100 100 100 100 100 100 100 100 
##$AQSEQ= 0
##$AQ_mod= 1
##$AUNM= <au_zg>
##$AUTOPOS= <>
##$BF1= 200.13
##$BF2= 200.13
##$BF3= 200.13
##$BF4= 200.13
##$BF5= 200.13
##$BF6= 200.13
##$BF7= 200.13
##$BF8= 200.13
##$BYTORDA= 1
##$CFDGTYP= 0
##$CFRGTYP= 5
##$CHEMSTR= <none>
##$CNST= (0..31)
1 1 145 1 1 1 1 1 1 1 1 1 1 1 1 1 1 1 1 1 1 1 1 1 1 1 1 1 1 1 1 1 
##$CPDPRG= <>
##$CPDPRG1= <>
##$CPDPRG2= <>
##$CPDPRG3= <>
##$CPDPRG4= <mlev>
##$CPDPRG5= <mlev>
##$CPDPRG6= <mlev>
##$CPDPRG7= <mlev>
##$CPDPRG8= <mlev>
##$CPDPRGB= <>
##$CPDPRGT= <>
##$D= (0..31)
0 1.2 0 0 0 0 0 0 0 0.06 0 0.03 0 0 0 0 0.0002 0 0 0 0 0 0 0 0 0 0 0 0 
0 0 0 
##$DATE= 1725882389
##$DBL= (0..7)
120 120 120 120 120 120 120 120 
##$DBP= (0..7)
150 150 150 150 150 150 150 150 
##$DBP07= 0
##$DBPNAM0= <>
##$DBPNAM1= <>
##$DBPNAM2= <>
##$DBPNAM3= <>
##$DBPNAM4= <>
##$DBPNAM5= <>
##$DBPNAM6= <>
##$DBPNAM7= <>
##$DBPOAL= (0..7)
0.5 0.5 0.5 0.5 0.5 0.5 0.5 0.5 
##$DBPOFFS= (0..7)
0 0 0 0 0 0 0 0 
##$DE= 6
##$DECBNUC= <off>
##$DECIM= 24
##$DECNUC= <off>
##$DECSTAT= 4
##$DIGMOD= 1
##$DIGTYP= 9
##$DL= (0..7)
0 120 120 120 120 120 120 120 
##$DP= (0..7)
150 150 150 150 150 150 150 150 
##$DP07= 0
##$DPNAME0= <>
##$DPNAME1= <>
##$DPNAME2= <>
##$DPNAME3= <>
##$DPNAME4= <>
##$DPNAME5= <>
##$DPNAME6= <>
##$DPNAME7= <>
##$DPOAL= (0..7)
0.5 0.5 0.5 0.5 0.5 0.5 0.5 0.5 
##$DPOFFS= (0..7)
0 0 0 0 0 0 0 0 
##$DQDMODE= 0
##$DR= 18
##$DS= 0
##$DSLIST= <SSSSSSSSSSSSSSS>
$$ [...]
##$SUBNAM2= <"">
##$SUBNAM3= <"">
##$SUBNAM4= <"">
##$SUBNAM5= <"">
##$SUBNAM6= <"">
##$SUBNAM7= <"">
##$SUBNAM8= <"">
##$SUBNAM9= <"">
##$SW= 24.0689170037331
##$SWIBOX= (0..15)
0 0 2 0 0 0 0 0 0 0 0 0 0 0 0 0 
##$SW_h= 4816.95568400771
##$TD= 16384
##$TD0= 1
##$TE= 0
##$TE2= 300
##$TE3= 300
##$TEG= 300
##$TL= (0..7)
0 120 120 120 120 120 120 120 
##$TP= (0..7)
150 150 150 150 150 150 150 150 
##$TP07= 0
##$TPNAME0= <>
##$TPNAME1= <>
##$TPNAME2= <>
##$TPNAME3= <>
##$TPNAME4= <>
##$TPNAME5= <>
##$TPNAME6= <>
##$TPNAME7= <>
##$TPOAL= (0..7)
0.5 0.5 0.5 0.5 0.5 0.5 0.5 0.5 
##$TPOFFS= (0..7)
0 0 0 0 0 0 0 0 
##$TUNHIN= 0
##$TUNHOUT= 0
##$TUNXOUT= 0
##$USERA1= <user>
##$USERA2= <user>
##$USERA3= <user>
##$USERA4= <user>
##$USERA5= <user>
##$V9= 5
##$VALIST= <valist>
##$VCLIST= <CCCCCCCCCCCCCCC>
##$VD= 0
##$VDLIST= <DDDDDDDDDDDDDDD>
##$VPLIST= <PPPPPPPPPPPPPPP>
##$VTLIST= <TTTTTTTTTTTTTTT>
##$WBST= 1024
##$WBSW= 4
##$XGAIN= (0..3)
0 0 0 0 
##$XL= 0
##$YL= 0
##$YMAX_a= 10350
##$YMIN_a= -14712
##$ZGOPTNS= <>
##$ZL1= 120
##$ZL2= 120
##$ZL3= 120
##$ZL4= 120
##$ABSF1= 10
##$ABSF2= 0
##$ABSG= 5
##$ABSL= 3
##$ALPHA= 0
##$AQORDER= 0
##$ASSFAC= 0
##$ASSFACI= 0
##$ASSFACX= 0
##$ASSWID= 0
##$AUNMP= <proc_1d>
##$AZFE= 0.1
##$AZFW= 0.1
##$BCFW= 1
##$BC_mod= 2
##$BYTORDP= 1
##$COROFFS= 0
##$CY= 11.3945322036743
##$DATMOD= 1
##$DC= 2
##$DFILT= <>
##$DTYPP= 0
##$F1P= 15.6554695791079
##$F2P= 12.8336369535428
##$FCOR= 0.5
##$FTSIZE= 0
##$FT_mod= 4
##$GAMMA= 1
##$GB= 0.15
##$INTBC= 1
##$INTSCL= 1
##$ISEN= 128
##$LB= 0.24
##$LEV0= 0
##$LPBIN= 0
##$MAXI= 10000
##$MC2= 0
##$MEAN= 0
##$ME_mod= 0
##$MI= 1.114404
##$NCOEF= 0
##$NC_proc= 0
##$NLEV= 6
##$NOISF1= 3.799351
##$NOISF2= 2.8
##$NSP= 1
##$NTH_PI= 0
##$NZP= 0
##$OFFSET= 15.70392
##$PC= 1
##$PHC0= -26151.54
##$PHC1= 12.78748
##$PH_mod= 1
##$PKNL= yes
##$PPARMOD= 0
##$PSCAL= 0
##$PSIGN= 0
##$REVERSE= no
##$SF= 200.130013532006
##$SI= 16384
##$SIGF1= 3
##$SIGF2= 2
##$SINO= 400
##$SIOLD= 16384
##$SREGLST= <1H.CDCl3>
##$SSB= 0
##$STSI= 0
##$STSR= 0
##$SW_p= 3612.71676300578
##$SYMM= 0
##$S_DEV= 0
##$TDeff= 0
##$TDoff= 0
##$TI= <>
##$TILT= no
##$TM1= 0
##$TM2= 0
##$TOPLEV= 0
##$USERP1= <user>
##$USERP2= <user>
##$USERP3= <user>
##$USERP4= <user>
##$USERP5= <user>
##$WDW= 1
##$XDIM= 8192
##$YMAX_p= 0
##$YMIN_p= 0
$$ End of Bruker specific parameters
$$ ---------------------------------
##NTUPLES= NMR FID
##VAR_NAME=  TIME,          FID/REAL,        FID/IMAG
##SYMBOL=    X,             R,               I
##VAR_TYPE=  INDEPENDENT,   DEPENDENT,       DEPENDENT
##VAR_FORM=  AFFN,          ASDF,            ASDF
##VAR_DIM=   8192,          8192,            8192
##UNITS=     SECONDS,       ARBITRARY UNITS, ARBITRARY UNITS
##FACTOR=    0.0002076,     1,               1
##FIRST=     0,             0,               0
##LAST=      1.7004516,     0,               0
##MIN=       0,             -14712,          0
##MAX=       1.7004516,     10350,           0
$$ Real data points
##PAGE= N=1
##DATA TABLE= (X++(R..R)), XYDATA
$$ [...]
936a024P69J218r08q58J295N41j311l26J073o9j127O6J002j54q38L67J012k51
$$ -1024 -255 963 55 -803 492 1033 -278 -604 469 400 -727 -661 341 187 -651 -284 728 477
954D77r48N93Q74r53r53J025N21j370j94J375j3j132M74J159m89j029O97P74q55
$$ 477 -471 122 996 43 -910 115 636 -734 -928 447 434 -698 -224 935 446 -583 114 888 33
973C3p34O84N20p80o40J090N25r63k59J316J6j271K34J166q07j133Q26P75r62
$$ 33 -701 -17 503 -277 -917 173 698 -265 -524 792 808 -463 -229 937 130 -1003 -177 598 -364
992c64m56J020M41q43q0R44O6r68j08R23j82j164K30J132o15r90J006Q53r68n53
$$ -364 -820 200 641 -202 -282 662 728 -240 -348 575 393 -771 -541 591 -24 -1014 -8 845 -123 -676
1012f76J215J76j226k8J114k24j008L72R23m47o71N05Q60o60p90O20O26j072o84
$$ -676 539 715 -511 -539 575 351 -657 -285 638 191 -480 25 885 225 -565 55 681 -391 -1075
1031a075J109L03j162Q4J440j70j022O54R63o57p88P03M57j026o07O83K19q14
$$ -1075 34 337 -825 -741 699 529 -493 161 1124 467 -321 382 839 -187 -794 -111 108 -706
1049g06k57J119K16q85J40J188k05j076N38R08p90r69R82M91j121k48J018O7r58
$$ -706 -963 156 372 -513 -373 815 610 -466 72 980 190 -779 203 694 -427 -675 343 410 -548
1068e48M7Q70j28q64K75P78l42p73N55R49o06o73R52N09j139k64R35r7j267K32
$$ -548 -501 369 241 -623 -348 430 88 -685 -130 819 213 -460 492 1001 -138 -402 533 436 -831 -599
1088e99R68n21q24O55Q22m60m66P10N98o82m71O58L08j013l81R79mj110L33J186
$$ -599 369 -152 -976 -321 501 41 -425 285 883 201 -270 388 696 -317 -698 281 277 -833 -500 686
1108F86m60q85P88P61q34o23P57L07r99k65R42N0p87J92R15M0q94K90R41m83r53
$$ 686 226 -659 129 890 56 -567 190 497 -502 -767 175 225 -562 -370 545 585 -309 -19 922 439 -514
1129e14N51O13r09o97R78K65r80K8J113j34q05L49P89l43p08L91P91n82o38N44
$$ -514 37 650 -259 -956 22 287 -693 -665 448 314 -491 -142 647 304 -404 -13 778 196 -442 102
1149A02O21p57n63R62J45j054j79J029k53r58L52R95m85n34P82O35n29l72O77
$$ 102 723 -34 -597 365 510 -544 -723 306 53 -905 -553 442 -43 -577 205 840 311 -61 616
1168F16K68q44m30O83r0j015j36R41j21q77O34R75m99m96P81O84r07l62Q33n8
$$ 616 884 40 -390 293 203 -812 -948 -7 -128 -1005 -371 604 105 -391 390 1074 167 -195 638 580
1188E80r33j31P24k11p35K90P01k18o71M08P79m91o84P69N18r77k11J024lq79
$$ 580 -353 -484 240 29 -706 -416 285 67 -604 -196 583 92 -592 177 695 -282 -493 531 528 -351
1208c51J96Q56l61q42L72O69o48o08N49N06o29l55P69M27o41k26R04P3j041J43
$$ -351 -155 701 340 -502 -130 539 -109 -717 -168 338 -291 -646 123 550 -91 -317 587 660 -381 -238
1228b38Q63m19r49N27P26o49m64Q00M22p26j50O78J07q55j44P78k24p93J67R08
$$ -238 625 206 -743 -216 510 -139 -603 197 619 -107 -257 421 528 -327 -471 307 83 -710 -543 365
1248C65k87o86P25P88o46n04Q12L02j043k98Q11k75q05J65P00k43m86M13P41l66
$$ 365 78 -608 117 905 259 -245 567 869 -174 -472 339 64 -741 -576 124 -119 -605 -192 549 183
1268A83n20O13N78p19n00P98J48r36n4Q24j14r11L12P30n39o27N72M69n65l77
$$ 183 -337 276 854 135 -365 433 581 -355 -409 415 301 -610 -298 432 -107 -734 -162 307 -258 -635
1288f35P68L91n61k01P47K07p41q7Q02l01r14J39P62o56p19O52N84o38j01Q48
$$ -635 133 524 -37 -238 509 716 -25 -112 690 389 -525 -386 376 -280 -999 -347 237 -401 -502 346
1308C46K78p00Q0P47j96p45O3N72l68o99K28P12m80n39O99N45o43l11R60%r09
$$ 346 624 -76 4 751 555 -190 -127 445 77 -622 -394 318 -162 -701 -2 543 -100 -411 549 549 -360
1329c60N5P93l35p38L62O65l56n78N33N39n33m46N66K97p19l58Q05R3q49J86R23
$$ -360 -305 488 153 -585 -223 442 86 -492 41 580 47 -399 167 464 -255 -613 192 285 -564 -378 545
1350E45l13o76N22N70o03n09O07L17p26j97P04M0o14K3P25j5p33J86O15l49p50
$$ 545 232 -444 78 648 45 -464 143 460 -266 -463 241 281 -333 -310 415 400 -333 -147 468 119 -631
1371f31L95O17o12m79P22N09q02k1Q63l9o70J05N85l03p94L15M96m58n90N12O34
$$ -631 -236 381 -231 -710 12 521 -281 -302 561 522 -148 -43 542 239 -555 -240 256 -202 -792 -280 354
1392C54m69l22O58M11p60j15P85j13q22J70O23m00o43N91M64n34l19N82L14o19
$$ 354 -115 -437 221 632 -128 -243 542 429 -393 -223 400 0 -643 -52 412 -122 -441 141 455 -164
1412a64k35O83R7p23p9P43n2o94L49P13m56o06N87M00p52m04O56K27p14j23P34
$$ -164 -399 284 381 -342 -421 322 270 -424 -75 638 182 -424 163 563 -189 -593 63 290 -424 -547 187
1433A87Kn44K33O40q8n87K43M86l48p09M47M02p15l00P12K17o63O5Q39j32o37
$$ 187 189 -355 -122 518 430 -157 86 572 224 -485 -38 364 -351 -651 61 278 -385 -320 519 387 -250
1454b50K32N81n05m88L23L95m20l56N91L51n77k42P20J14p47l3P07k72p14L78
$$ -250 -18 563 58 -430 -107 288 -132 -488 103 454 -123 -365 355 469 -278 -311 396 124 -590 -212
1474b12O47m88m40O24M12n84j73N01J63o24j83N95j7p69J10P00j55o02M48O22
$$ -212 435 -53 -493 131 543 -41 -214 287 450 -174 -357 238 221 -548 -438 262 107 -495 -47 575
1494E75l89m45N46K97p54k38O88j00o82N5O63j19n36L77N45k78n57M48M41o25
$$ 575 186 -259 287 584 -170 -408 280 180 -502 -447 216 97 -439 -62 483 205 -352 96 537 -88
1514h8k99M48K68o06j62P50mo23J98N98l10n32K99M15m36m30M79L82n49k45P09
$$ -88 -387 61 329 -277 -439 311 307 -316 -118 480 170 -362 -63 352 -84 -514 -35 347 -202 -447 262
1535B62J69n92k6O41l0q11J75O25l59o73M27N91n15l68P22K36n72j59O18k5o48
$$ 262 431 -161 -187 454 424 -387 -212 413 54 -619 -192 399 -116 -484 238 474 -98 -257 361 336 -312
1556c12K9N44k19n32K80N58k21m79N21N11n77m50O89M8p11j72O39j02o51K61N69
$$ -312 -283 261 42 -490 -210 348 127 -352 169 680 103 -347 342 390 -321 -493 146 44 -607 -346 223
1577B23j21n10M74N11l89l51M11L32o86k36N39ro20j0O41j24n52K75O60m29m54
$$ 223 102 -408 66 577 188 -163 248 580 -106 -342 197 188 -432 -442 199 75 -477 -202 458 29 -425
1598d25N12L08m29k56N33K64o44p7O18J2o17l1M94k45o19K84M17m10l29N97N26
$$ -425 87 395 -34 -290 243 507 -137 -214 404 416 -201 -232 262 17 -602 -318 99 -311 -640 -43 483
1619D83n59j72P79J08o53J24L52k01o75J18M86l75m93L46M99l06l40O17L93o02
$$ 483 -76 -248 531 639 -14 110 462 261 -414 -296 190 -185 -678 -332 167 -139 -479 138 531 -71
1639g1j38O79qp43J01N56l03n13K91M70l37l80M35L32m93k32M37J82n97n6O43
$$ -71 -209 470 462 -281 -180 376 73 -440 -149 321 -16 -396 39 371 -122 -354 83 265 -332 -388 255
1660B55n2n77J69O53k58n73M63L81m76m01M96K42n78j23O03l0m84M8N84j02n58
$$ 255 203 -374 -205 448 190 -383 80 461 -15 -416 80 322 -256 -379 224 194 -290 -242 342 240 -318
1681c18J32N79l73n23M18M66m99j89N39K26n20qN36o1o55N3M66l62n92L27M30
$$ -318 -186 393 20 -503 -85 381 -118 -307 232 458 -62 -70 466 405 -250 -197 269 -93 -685 -358 72
1702G2l40k26M68L98l76n7O39J25o23j47N60k66o60J23M61m10m28L50N13m35j46
$$ 72 -268 -494 -26 372 -4 -61 578 703 80 -67 493 227 -433 -310 151 -259 -687 -337 176 -259 -405
1723d05N79K32m88n2N41L9n90N3O23k03n79K67L24m06m96M21L42n81k08O10J27
$$ -405 174 406 -82 -134 407 446 -144 -91 532 329 -250 17 341 -65 -561 -140 202 -379 -587 23 150
1744A50m61J2O74m7l53J42N64l13n15K07K92m53l99K87K72m31j76P25M6n02J71
$$ 150 -311 -299 375 328 -25 117 681 368 -147 60 352 -101 -500 -213 59 -372 -548 177 223 -279 -108
1765a08O66j58n66J70M23l70m35L71L08n18j94N04K22l94j57N07j1n36K2N17k10
$$ -108 558 400 -166 4 427 57 -378 -7 301 -217 -411 93 315 -79 -236 271 260 -276 -254 263 53
1786E3n78L49M62m30k47N48K91m90j15N31O7n55n6M41j24n69J76M98l17m13L97
$$ 53 -525 -176 286 -144 -391 157 448 -42 -157 374 441 -114 -170 271 147 -422 -246 252 -65 -478 -81
1807h1M06m32k79M94J95n29m4N56on05J87M94j01n12J99L54m46m01L17J94l88
$$ -81 325 -107 -386 108 303 -226 -270 286 280 -225 -38 456 355 -157 42 396 -50 -451 -134 60 -328
1828c28k49N17K06m49O0O89m5m34J67N29k97n93L23K26n30l69M13J81m89R3M11
$$ -328 -577 -60 146 -303 -243 446 401 -33 134 663 366 -227 96 322 -208 -577 -164 17 -472 -379 32
1849C2K04m37J51N37j50m89K08M83m40m74L84K81l89k69M99Q5n53O1N17j21m23
$$ 32 236 -201 -50 487 337 -152 56 539 99 -375 9 290 -99 -368 131 216 -337 -276 241 120 -303
1870c03P9M34j36l55K82M10l31l05M11K53m55k53M06O0o02mN39j45l22K39M51
$$ -303 -224 210 74 -281 1 411 80 -225 186 439 -16 -269 137 197 -405 -409 130 -15 -337 -98 353
1891C53k50k61K96L09m29l01M35R0m63j11M46M6m82J54M88j66l82K48L63l47l63
$$ 353 103 -158 138 447 18 -283 152 242 -221 -332 114 160 -322 -168 320 154 -228 20 383 36 -327
1912c27L61J45m09j97N50P8l70L2M72l5m25R5M37l22m21K77L19m32k54M74K12
$$ -327 34 179 -230 -427 123 201 -169 -137 335 300 -125 -30 407 85 -336 -59 260 -172 -426 48 260
1933B60m56j13O02m8m42P1M58j67m26J47L57k25k46K77K20l03k33M67P2m54j23
$$ 260 -196 -309 293 245 -197 -126 332 165 -261 -114 243 18 -228 49 269 -34 -267 200 272 -182 -305
1954c05M59k9n56J99N08j94m03L84M07l39k53L51J45n09j52M11k8m08o6M77l6
$$ -305 154 125 -431 -232 276 82 -321 63 470 131 -122 229 374 -135 -287 124 96 -312 -378 99 63
1975F3l40K10M85k79k95K70K67l50l19M05J60m82m5M04q0l33J81L69j81l50K65
$$ 63 -277 -67 418 139 -156 114 381 31 -288 117 277 -205 -250 154 74 -259 -78 291 110 -240 25
1996B5L30l30l47L56K40l91j13M57J00m13rM12j65l94J65K75k12m04L56K42k82
$$ 25 355 25 -322 34 274 -117 -230 227 327 -86 -95 317 152 -242 -77 198 -14 -418 -62 180 -102
2017a02j53M50J71l14p5K69O6n25J00K96j45m57K53L80k78k62M16K17l40j24M40
$$ -102 -255 195 366 52 -23 246 312 -213 -113 183 38 -419 -166 214 -64 -326 90 307 -33 -157 283
2038B83J1l75k4L48j19l93K1M60j97k99K65K60k91j94L36J46l70j76M97Rl90O9
$$ 283 294 -81 -105 243 124 -269 -248 212 15 -284 -19 241 -50 -244 92 238 -132 -308 189 198 -192 -123
2060a23M25n9l89J76K99k22l36J91K16l65k34L66J19l15j7N02R7m46J53L85k78
$$ -123 302 243 -146 30 329 107 -229 -38 178 -187 -421 -55 64 -251 -268 234 331 -115 38 423 145
2081A45l14J55K25l33k52L10J96k47j17L82J14l88j6M66j32m43J36L55k62l10
$$ 145 -169 -14 211 -122 -374 -64 132 -115 -232 150 264 -124 -140 326 194 -249 -113 242 -20 -330
2101c30K43K82k14k50L81J98l54mK82m1m55P1L68j70k95J92L15k21k53L29J31
$$ -330 -87 195 -19 -269 112 310 -44 -48 234 193 -262 -191 177 7 -288 -96 219 -2 -255 74 205
2122B05l62J4L20P3m43N7L87j11l43R5M24k37l24J86K58k97k55L32R3k73K0L08
$$ 205 -157 -143 177 250 -193 -136 251 140 -203 -108 316 79 -245 -59 199 -98 -353 -21 72 -201 -181 127
2144A27J31l48J26M01j04k96O6K41l33l00J39J31l71j27M50J24k58O2M26J02l66
$$ 127 258 -90 36 437 333 37 103 344 11 -289 -150 -19 -390 -517 -67 57 -201 -139 287 389 23
2165B3Q9L31j80l99J81J91l64k86L33J79l17j36L94L2l46J26L83n9l40J15L65
$$ 23 112 443 263 -136 45 236 -128 -414 -81 98 -219 -355 39 71 -275 -149 234 175 -165 -50 315
2186C15j94k18K96J20k85k41K47J71m29j21L36K0l83J15M45j09l21K66L48k20
$$ 315 121 -97 199 319 34 -207 40 211 -218 -339 -3 17 -366 -251 194 85 -236 30 378 158
2206A58j55J49J48l88j36K75L5l38K2L42j0l10J75K92r9k43N5K60k88k45K77J47
$$ 158 3 152 300 -88 -224 51 86 -252 -230 112 102 -208 -33 259 160 -83 -28 232 -56 -301 -24 123
2228A23k93j02L79L2k55J18L49j13j99l7K33j54l46J09J95k92j44L36J84l47R5
$$ 123 -170 -272 107 139 -116 2 351 238 39 2 235 81 -265 -156 39 -253 -397 -61 123 -224 -129
2249a29L86rl34J80L34k87k58K23J57k81k37K18J43l07o9K94K6k84k6M13l4l39
$$ -129 257 248 -86 94 428 141 -117 106 263 -18 -255 -37 106 -201 -270 24 50 -234 -260 153 119 -220
2271b20K42L31j24k89L00J82l00l06L06m3m40n8L35q0k09M2M74k4k16K04L49k39
$$ -220 22 353 229 -60 240 422 122 -184 122 79 -361 -419 -84 -164 -373 -331 143 119 -97 107 456 217
2293B17k35K98J29m25j92K87j4m08l7L83n5j97J39L45j09k70K20K08k36j32K22
$$ 217 -18 280 409 -16 -208 79 65 -343 -380 3 -52 -249 -110 235 126 -144 76 284 48 -84 138
2314A38P5k72j25L54Nl89L6L65j95k30P1K93j87j72K55K13j89k16K67J47l27n2
$$ 138 213 -59 -184 170 175 -214 -178 187 -8 -238 -167 126 -61 -233 22 235 46 -170 97 244 -83 -135
2336a35K96%l22j6L38j67k34J30L82l03j71K59J84l66k3K56j6l44J7L07%k71K14
$$ -135 161 161 -161 -177 161 -6 -240 -110 272 -31 -202 57 241 -125 -148 108 92 -252 -235 72 72 -199 15
2359A5K86j45j35J46J87k87j93J87L2l11j39L18J4l07J99L08n9k73K79K36j86
$$ 15 301 156 21 167 354 67 -126 61 93 -218 -357 -39 -25 -332 -133 175 116 -157 122 358 172
2380A72j99J84J12k50k25J77J51m06J9L38q5k88J20L25j05k81L62J30j86j53K85
$$ 172 -27 157 269 19 -206 -29 122 -284 -265 73 -12 -300 -180 145 40 -241 121 251 65 -88 197
2401A97Q3l12l8K54rl15nJ92j46k62J41K72j96q7K35K65k34j2J73J63l16j8J53
$$ 197 280 -32 -70 184 175 -140 -145 47 -99 -361 -220 52 -144 -231 4 269 35 23 196 359 43 25 178
2424A78p8l29J03J33o1k56J78K57j25j82L32J45k95j18K40P9l41K6K76j13k77
$$ 178 100 -229 -126 7 -54 -310 -132 125 0 -182 150 295 0 -118 122 201 -140 -114 162 49 -228
2445b28K14K38j72j85K38P8k11j52K03Q7l12J7L31l7k88R9K63m8k68J93J59k68
$$ -228 -14 224 52 -133 105 183 -28 -180 23 110 -202 -185 146 109 -179 -80 183 135 -133 60 219 -49
2467d9j55K72M9k19j04K90M6k61j5L03n9l06N9K75j50j91K35Q7p1k10L08J57k49
$$ -49 -204 68 117 -102 -206 84 130 -131 -146 157 98 -208 -149 126 -24 -215 20 107 36 -174 134 291 42
2490D2j14K95jl21j3J98l8l01J54K14j76j74K44K29j48j45K81P1l78j9J79r4k55
$$ 42 -72 223 222 -99 -112 86 48 -253 -99 115 -61 -235 9 238 90 -55 226 297 -81 -100 79 -15 -270
2513b70J31K48j34j37P9K99j65k33K57J11k41o5K50nk91L3L20n8k53N9K50k42
$$ -270 -139 109 -25 -162 -83 216 51 -182 75 186 -55 -120 130 125 -166 -133 187 129 -124 -65 185 -57
2535e7j40J98J54k71j17K02J60k32J8K64p9k15J27K16j60k16P3J65j56j84K58
$$ -57 -197 1 155 -116 -233 -31 129 -103 -85 179 100 -115 12 228 68 -148 -75 90 -66 -250 8
2556HJ16k54p2L45o4j51N2K03q4k49J23J68j20k09J42K09k43j12K66R8j78j39
$$ 8 124 -130 -202 143 79 -72 -20 183 99 -150 -27 141 21 -188 -46 163 -80 -192 74 172 -6 -145
2578a45J78J20k63KK00K1l27J44K42j47j20J19K11k39j24K12J1k14l8J76lk09
$$ -145 33 153 -110 -108 92 113 -214 -70 172 25 -95 24 235 -4 -128 84 95 -119 -157 19 16 -193
2600a93J16K38o8j56R9K01k18j71K34O7k63p1K10L6k53J14K35o5j95J09K60k15
$$ -193 -77 161 93 -63 36 237 19 -152 82 149 -114 -185 25 61 -192 -78 157 92 -103 6 266 51
2622E1j99J06J94k29j19K02J34k43m1K94J1k72K9K64j55j92J75J32j85j31J98
$$ 51 -148 -42 152 -77 -196 6 140 -103 -144 150 161 -111 -82 182 27 -165 10 142 -43 -174 24
2643B4J05j43j19K24Q9k19o8K23j4l00J16K24j16k61K81J68k13j39K21Q8k34k6
$$ 24 129 -14 -133 91 180 -39 -107 116 102 -198 -82 142 26 -235 46 214 1 -138 83 171 -63 -89
2665h9K21r2k87J47J89m0j81J12K32j48j22L2J90k69n9J94K6k19l4K57m8j80J21
$$ -89 132 40 -247 -100 89 49 -132 -20 212 64 -58 -26 164 -105 -164 30 56 -163 -197 60 12 -168 -47
2688d7K84j13j87K24J01k68j40J07K19l07j05K92K4k97O6K25l4j74J52J61r2j78
$$ -47 237 124 -63 161 262 -6 -146 -39 180 -127 -232 60 84 -213 -147 78 44 -130 22 183 91 -87
2710h7J25J56j94j47K19K8j31p0K07j9k72J26J24m2k05O4L06j20j61J73K04k54
$$ -87 38 194 0 -147 72 100 -31 -101 106 87 -185 -59 65 23 -182 -118 188 68 -93 80 284 30
2732C0m9K04n6k53j1J69q5k01P3K55j53j42K37J80j37j53K78O2k16j42K47m3k03
$$ 30 -19 185 129 -124 -135 34 -51 -252 -179 76 -77 -219 18 198 61 -92 186 248 32 -110 137 94 -109
2755a09m8K36l9j72N6K71k22j10J73Q9j61p6J94J1k30N3J93K4j92N1J82j04k25
$$ -109 -157 79 40 -132 -76 195 -27 -137 36 125 -36 -112 82 93 -137 -84 109 133 -59 -8 174 70 -155
2778a55J84J00j65j28K69l4j41q4J99J28k65O9J98j02k17J32J32j15j54J84J54
$$ -155 29 129 -36 -164 105 71 -70 -154 45 173 -92 -23 175 73 -144 -12 120 5 -149 35 189
2799A89j88r8K16N3k76nK31o9j89J3J74j81j15J81J83o3r9J42J35j24p4K05r1
$$ 189 1 -97 119 172 -104 -109 122 53 -136 -123 51 -130 -245 -64 119 56 -43 99 234 110 36 241 150
2822A50l06j4K57j05k27Q7J77j10j23K47J34j35n7K21qj02j09J89p5j65l0J75
$$ 150 -156 -170 87 -18 -245 -158 19 -91 -214 33 167 32 -25 196 188 86 -23 166 91 -74 -104 71
2844G1o8j93J87O9j68j23K57N4j09j44K96l9r6JK35o4k90R2J80j12k35P4J74j75
$$ 71 3 -190 -3 66 -102 -225 32 86 -23 -167 129 90 -6 -5 230 166 -124 -32 148 36 -199 -125 49 -126
2868a26o9J68J70k20oL04q8j39K0J57n9k18Q1J49j36j67K09J25j84j25K56O8j95
$$ -126 -195 -27 143 -77 -83 221 133 -6 14 171 112 -106 -25 124 -12 -179 30 155 -29 -154 102 170 -25
2891b5q7K23o5j99O7J69o9k41J90J56j20j22J94J11j76p2J66j3k06L7J22m5j56
$$ -25 -112 111 46 -153 -86 83 14 -227 -37 119 -1 -123 71 182 6 -66 100 87 -119 -82 40 -5 -161
2914a61P4J75q3j43J26J19j32m1J81j0j56k3K52j3k62R2J48j40j22R7J41j68j25
$$ -161 -87 88 5 -138 -12 107 -25 -66 115 105 -51 -74 178 165 -97 -5 143 3 -119 -22 119 -49 -174
2937a74J81R6j16p4K54kj28M6J36Ml56J65J50k45k09K06K2j13J3J44P6j41J1K72
$$ -174 7 103 -13 -87 167 165 37 83 219 223 -133 32 182 -63 -272 -66 -44 -157 -144 0 76 -65 -54 218
2961B18k1k42mK13r1j87L0J90j29j37K07N0k54J14J51l4j24J0K12j02j75P6J95
$$ 218 197 -45 -49 164 73 -114 -84 106 -23 -160 47 97 -157 -43 108 74 -50 -40 172 70 -105 -29 166
2984A66j21j78K38J16k35j5N0M2k28JK13K0k25R5K24o2j20J9J89j49j01J08O5
$$ 166 45 -133 105 221 -14 -29 21 63 -165 -164 49 69 -156 -61 163 101 -19 0 189 40 -61 47 112
3007A12j83k2J66n2j51J25J12qj70P0J55n2k24J18R5j79j03J92P6r7q1J53Q0j63
$$ 112 -71 -93 73 21 -130 -5 107 99 -71 -1 154 102 -122 -4 91 -88 -191 1 77 -20 -101 52 132 -31
3031c1K1J81o2j82M6O1j8k38J66J17j79QJ41O2j43J2K49r9k41R0J80j04j00O2
$$ -31 -10 171 109 -73 -27 34 16 -222 -56 61 -118 -110 31 93 -50 -38 211 112 -129 -39 141 37 -63 -1
3055aO9j19j58K38J21j60j00J36K6j32oJ89Qk39J65J10j70L1J02O2j73j04J72
$$ -1 68 -51 -209 29 150 -10 -110 26 52 -80 -86 103 111 -128 37 147 -23 8 110 172 -1 -105 67
3078F7k5k10nK02K6j25L8J65l6j25J48O0j46o6N5J6m6j59J46N8j13lJ89j0j84
$$ 67 42 -168 -173 29 55 -70 -32 133 97 -28 120 180 34 -32 23 39 -7 -166 -20 38 -75 -78 111 101 -83
3103h3O6J32l4j07P7P0j61j78K63J21l09Q3J86n1j23j0J81m7k06R3J17j03j98
$$ -83 -17 115 81 -26 51 121 -40 -218 45 166 -143 -60 126 75 -48 -58 123 76 -130 -37 80 -23 -221
3126b21K64O0j17n3J51P2j61k3J11o2q8n1J94m5j07K9J71j63p3K31Nj96l6K32
$$ -221 43 103 -14 -67 84 156 -5 -28 83 21 -67 -118 76 31 -76 -47 124 -39 -112 119 124 -72 -108 124
3150A24j07j46OL05j34j81J36J35j3j80L7J28q1j78J48O3j66K6Q8M5j45RJ55M
$$ 124 17 -129 -123 182 48 -133 3 138 125 -55 -18 110 29 -149 -1 62 -104 -78 10 55 -90 -81 74 78
3174G8j41Q2N7j02q9J10J28k02K1J16M8j93Q5J02j6j56j3J99j10r3J04J12j90
$$ 78 -63 19 76 -26 -115 -5 123 -79 -58 58 106 -87 -2 100 84 -72 -85 114 4 -89 15 127 -63
3197f3m9K47m5j07k0J63lj91OJ33l9j86R4J14m6o5J15O4j58l9K28Nk45K5J78j07
$$ -63 -112 135 90 -17 -37 126 123 -68 -62 71 32 -154 -60 54 8 -57 58 122 -36 -75 153 158 -87 -62 116 9
3223Ij81J59L4o5m3N8R3o1o2N7J46j18j69J71J7j20K9J21l1j43J75K3j36r1J52
$$ 9 -172 -13 21 -44 -87 -29 64 3 -59 -2 144 26 -143 28 45 -75 -46 75 44 -99 76 99 -37 -128 24
3248B4J15j74j64K42N4j76j6K13j2j40Q4N4k7j93J24N8p7j22Q6Q6o2o1J83k6j13
$$ 24 139 -35 -199 43 97 -79 -95 118 106 -34 50 104 77 -116 8 66 -11 -133 -47 39 -23 -84 99 73 -40
3273d0K6J68j36m1j3J00q7j40J56O2j07l0J33K5r0K6P2l1j44O3J12o9n8M3J33
$$ -40 -14 154 18 -23 -36 64 -23 -163 -7 55 -52 -82 51 76 -14 12 84 53 -91 -28 84 15 -43 0 133
3298A33m1j90J14R4j59n6J84m7n9oJ09j1j32N5P4j4j33Q8J17j46k3O7P3j40m9
$$ 133 92 -98 16 110 -49 -105 79 32 -27 -33 76 65 -67 -12 62 48 -85 3 120 -26 -49 18 91 -49 -98
3323i8J50Mj51M4J51m8m7p5K13r1j97J62M3j17m0J08Q9j21l4J24N9j74L7Q8p2
$$ -98 52 56 -95 -51 100 52 5 -70 143 52 -145 17 60 -57 -97 11 100 -21 -55 69 128 -46 -9 79 7
3348Gr5J6J7L9o7N4J95j99j9J32N0j32j3J65p2j09l4J45n6j65J63P9j62l2J66
$$ 7 -88 -72 -55 -16 -83 -29 166 -33 -52 80 130 -2 -15 150 78 -31 -65 80 24 -141 22 101 -61 -93 73
3373G3k3n6r2J59n6j72J88O2n0n8P2N9j38k8J09pq1p9J72m0j31M6J16L2j05P7
$$ 73 50 -6 -98 61 5 -167 21 83 33 -25 47 106 -32 -60 49 42 -39 -118 54 14 -117 -71 45 77 -28 49
3399D9R8m2j93J22R1j13j39J66k3j32k6J26N1j06j9K14m5j05O7R7lj90Q1J11j29
$$ 49 147 105 -88 34 125 12 -127 39 16 -116 -142 -16 35 -71 -90 124 79 -26 41 138 135 -55 26 137 8
3424Hj28K05J4j73J8Q7nj19J4J65o9j34J45J05j81l6J17M5j21N7N9L3j73jJ38
$$ 8 -120 85 99 -74 -56 31 26 -93 -79 86 17 -117 28 133 -48 -84 33 78 -43 14 73 106 -67 -68 70
3449G0o6j34KJ82r7j9J12O7j15r1J87n7j36O4J3P0p5l8J39l8q9P1J15j29p7J30
$$ 70 4 -130 -128 54 -43 -62 50 117 2 -89 98 41 -95 -31 -18 52 -23 -61 78 40 -49 22 137 8 -69 61
3475F1No8o3O5L1j33M1J55J0k04J05J27o8r4Q3M7n8j01J45l2k14O0J33L4j74J45
$$ 61 66 -2 -65 0 31 -102 -61 94 104 -100 5 132 64 -30 53 100 42 -59 86 54 -160 -100 33 67 -107 38
3501C8K4mj37RJ35p7l4P3O6j37pJ41p4j42O3P8rr0M3N5J0j74J07R3O6j84J65Q9
$$ 38 62 58 -79 -70 65 -12 -46 27 93 -44 -51 90 16 -126 -63 15 6 -84 -41 14 24 -150 -43 50 116 -68 97 186
3529A86j63q2J05kj37m1J67pj53J95J8j02PO1L8q0l8J08m1n2j7M3j2j9qJ40n8
$$ 186 23 -59 46 44 -93 -134 33 26 -127 68 86 -16 -9 52 90 10 -28 80 39 -13 -30 13 1 -18 -26 114 56
3556E6j27P3J18j24j9L9M8k10N2K14r7j12P6J09o3j02M6J23j02rPP7j22mQ4n4
$$ 56 -71 2 120 -4 -23 16 64 -146 -94 120 23 -89 -13 96 33 -69 -23 100 -2 -11 -4 73 -49 -53 31 -23
3582b3j7j0J17n2o0J7Q1m3j49J22O8j3j06P4O3k0m2J47q1j32Q2L6l4j97J22J01
$$ -23 -40 -50 67 15 -45 -28 53 10 -139 -17 51 38 -68 6 69 49 7 154 73 -59 23 59 25 -172 -50 51
3608E1q3l9J14J0j1n1J03J5j44M7L3j3j12j5J12r8J0N0R4l4o3J25K9j26m1O5N9
$$ 51 -32 -71 43 53 42 -9 94 109 -35 12 45 32 -80 -95 17 -81 -71 -21 73 39 -24 101 130 4 -37 28 87
3635H7j01pP8q0k1L7P9j6j31N8J1m6j7J56J3r0r4R6J29k03k3J91j11m1J4Q6o8
$$ 87 -14 -21 57 -23 -44 -7 72 56 -75 -17 -6 -52 -69 87 100 10 -84 12 141 -62 -85 106 -5 -46 -32 54 -14
3662a4j18Q0J09q3k5O9P5o8m6R4k1j06O3N8o2j04J29k3p0j2J31O8j89J2J86m2
$$ -14 -132 -52 57 -26 -51 18 93 25 -21 73 52 -54 9 67 5 -99 30 7 -63 -75 56 124 -65 -53 133 91
3688I1j01k4Q3p9k4M7N6p8k1O0P6j30oL0J0l0k2J52p9q2M8J07n0o0OR2j06k2J35
$$ 91 -10 -34 49 -30 -54 -7 49 -29 -50 10 86 -44 -50 -20 -10 -40 -62 90 11 -71 -23 84 34 -26 -20 72 -34 -56 79
3717G9L9j31j38J70M4j03j7J17j9j16J27L9l7j41O1J31j06J3K0M5j28%J37q4k9
$$ 79 118 -13 -151 19 63 -40 -57 60 41 -75 52 91 54 -87 -26 105 -1 12 32 77 -51 -51 86 2 -27
3742b7N4J2Nq5J0N0n2o9J11K9l8p0J11O5j14K8Q1n3j58J36l8J7j09J19J3j3n1
$$ -27 27 39 44 -41 -31 19 -33 -102 9 38 0 -70 41 106 -8 20 101 48 -110 26 -12 5 -104 15 28 15 -36
3769c6M1J35j83L9J13m0j05L6P2j5j41J19L8k2j19J34pj25K9N6Pn4k7R3Mj49J39
$$ -36 5 140 -43 -4 109 69 -36 0 72 57 -84 35 73 51 -68 66 59 -66 -37 19 26 -28 -55 38 42 -107 32
3796C2J3J0j21M6N7ln4R4j7j93O3O1%k2j7P7j3r4J15O3q5k4O2O9j34q9J40J7n2
$$ 32 45 55 -66 -20 37 34 -20 74 57 -136 -73 -12 -12 -34 -51 26 13 -81 34 97 12 -12 50 119 -15 -104 36 53 1
3825Al2K2Lj16J16P3m2n6K2M2r8O8j2P7j54J05L2Jp1p3J51k4j25O0O1l1n0J08
$$ 1 -31 -9 -6 -122 -6 67 25 -31 -9 33 -65 3 -9 68 -86 19 51 52 -19 -92 59 35 -90 -30 31 0 -50 58
3853E8Ko4k0P4L5o3o4J57j23q3N5N1L1n1J2jk9j4K5P7m3j6L9k4j07K8R4qm9J8
$$ 58 60 -4 -24 50 85 22 -42 115 -8 -91 -36 15 46 -5 7 6 -23 -37 -12 65 22 6 45 21 -86 -58 36 28 -21 -3
3883cO8k2J9q0P3k8m7O9K3j26J9N7Q9j38k9O2Nr6K1J27l9o5M5Q1q3j22J68j6k5
$$ -3 65 43 62 -18 55 27 -20 49 72 -54 -35 22 111 -27 -56 6 11 -85 -64 63 24 -41 4 85 2 -120 48 32 7
3912Gj00J09M1j38L3O3K1m8o9J58n4l6J01l2q0K8J14j02Kq3N2N6m8p9M9R8j52
$$ 7 -93 16 57 -81 -48 15 36 -12 -81 77 23 -13 88 56 -24 4 118 16 18 -65 -13 43 -5 -84 -35 63 -89
3939h9Q6Q2M9p7RQj20MJ21p9m1pJ10n9o2M5M3l9n4J00Oo8K3L9K5j11J5J0O4l6
$$ -89 -3 79 128 51 60 68 -52 -48 73 -6 -47 -54 56 -3 -65 -20 23 -16 -70 30 36 -32 -9 30 55 -56 -41 -31 33 -3
3969c%J39p6j01L6J9j5l6R6jj00o6K01n2m5Q4mj2r9J1J28j16j7L8Po7QQ2j8kk5
$$ -3 -3 136 60 -41 -5 14 -1 -37 59 58 -42 -108 93 41 -4 80 76 64 -35 -24 104 -12 -29 9 16 -51 -43 39 21 19 -6
4000fN3J5j17L3R4m0q2O0k6OL2j9M2p9OM8Oj52R8M1k1n3M5Q1j13QM5L%k7j3J23
$$ -6 47 62 -55 -22 72 32 -50 10 -16 -10 22 3 45 -34 -28 20 26 -126 -28 13 -8 -61 -16 65 -48 -40 5 8 8 -19 -32 91
4032I1j08q6J14Q1j06l3J23r2k1k9Q0pq1P4J5Kj05J09k9J1jL3K3q5K7M6rj77O9
$$ 91 -17 -103 11 92 -14 -47 76 -16 -37 -66 14 7 -74 0 15 17 -88 21 -8 3 2 35 58 -27 0 46 37 -140 -71
4061g1M4j6k7L1J40j55R5L5or5QJ07j05r2J20Rk8k6J4L5kn4M9P0j02N6Pp2j5p
$$ -71 -27 -43 -70 -39 101 -54 41 76 70 -25 -17 90 -15 -107 13 22 -6 -32 -18 17 15 -39 10 80 -22 34 41 -31 -46 -53
4091e3K2R2r6N1N0l1m2L7O2j02k1QR1j04l1J53q8p5Q0M4Qj19K6N7n7k0L1P7n4
$$ -53 -31 61 -35 16 66 35 -7 30 92 -10 -31 -23 68 -36 -67 86 -2 -77 3 47 55 -64 -38 19 -38 -58 -27 50 -4
4120dp8J65p0j5r2R6J2m0jJ01k8j35P5M9q1j1O7O3j07j6J26l9l8K7J7j2r7P8M7
$$ -4 -82 83 13 -2 -94 2 14 -26 -27 74 46 -89 -14 35 -46 -57 10 73 -34 -50 76 37 -1 26 43 31 -66 12 59
4149E9j6o0M9N3j24L9N5Kj63Q8J9M8p0L0J3K8m8L6L9q2k7M7P5o9n6J2M3o7mJ78
$$ 59 43 -17 32 85 -39 0 55 57 -106 -18 1 49 -21 9 22 50 2 38 77 -5 -32 15 90 21 -35 -23 20 -47 -51 127
4179A27j24m0J6O1j6m6N1o4km5R0L7n7m3J47m1j22R0mO2j18N7Nm9j8J3M7p0K6
$$ 127 3 -37 -21 40 24 -22 29 -35 -37 -82 8 45 -12 -55 92 51 -71 19 15 77 -41 16 21 -28 -46 -33 14 -56 -30
4208c0Q9j6l3k8J12r4J4j3%M7r5%M1K8OL0p9o6M7J12%p2M1J0p0L5j5M4k6q6J25
$$ -30 59 43 10 -18 94 0 14 1 1 48 -47 -47 -6 22 28 58 -21 -87 -40 72 72 0 41 51 -19 16 1 45 19 -67 58
4239E8j1j9j04P9N5j05K3J13m0j6p3P3k7J1J9P6r1r2J39j1o7J7N4n0n6ON0M0l6
$$ 58 47 28 -76 3 58 -47 -24 89 49 33 -40 33 6 17 36 112 21 -71 68 57 -10 7 61 11 -45 -39 11 51 15
4268A5k9R5l4o2M1L5k0n5JL6m8l4J06nl5m9JO5r0R5K6q0K3RJ8o2L3L6pmn3P4j1
$$ 15 -14 81 47 -15 26 61 41 -14 -13 23 -25 -59 47 42 7 -42 -41 24 -66 29 55 -25 -2 7 25 -37 -4 32 25 21 -32 42 31
4301C1n8m2Q1r3J8P7o3N9k0Q9l6j08R7jk6J4m6J03o5j1j1M3j4NK7m8j4K0L7Lm1
$$ 31 -27 -69 12 -81 -63 14 -49 10 -10 79 43 -65 32 31 5 19 -27 76 11 0 -11 32 18 23 50 2 -12 8 45 48 7
4332Gj02J37J6j17P0ln8OJ13Op8L0k0L2l6K4k8K9m7PJ01j48J6K3Q6n1j7O0l9l2
$$ 7 -95 42 58 -59 11 8 -50 -44 69 75 -3 27 7 39 3 27 -1 28 -19 -12 89 -59 -43 -20 66 15 -2 58 19 -13
4362a3K3J07o9k2%l5L6mo6O3o0J3j3N0k3j3O8N1j12m5J13k4p0J2O0q9M8j4R1l9
$$ -13 10 117 48 26 26 -9 27 23 -43 20 -40 -27 -40 10 -13 -26 42 93 -19 -64 49 25 -45 -33 27 -62 -14 -28 63 24
4392B4j02R9o2L6K5l8Pm6N5M5k7j3J4L4q9m8M3J22j24mOJ58j16m6L3k4l1N9M7
$$ 24 -78 21 -41 -5 20 -18 -11 -57 -2 43 16 3 17 51 -38 -86 -43 79 -45 -49 -43 115 -1 -47 -14 -38 -69 -10 37
4421C7Qr7Q8k7J7%n9K4l6J6N2j7n4N2R1l0l9j2lJk8M6K0q1j9N6m0L4j6K5pk4L2
$$ 37 45 -52 36 9 26 26 -33 -9 -45 -29 23 6 -48 4 95 65 26 14 11 12 -16 30 50 -31 -50 6 -34 0 -16 9 2 -22 10
4454A0Kk6k6K0P8Oj51J42j17J0j5J55n6M1o7%Mm2K4kL5p1P5Lm6r2J03oj5L3N9
$$ 10 12 -14 -40 -20 58 64 -87 55 -62 -52 -67 88 32 73 6 6 10 -32 -8 -10 25 -46 29 32 -14 -106 -3 -9 -24 9 68
4485F8j1n6om7Q3l8mO4k9p0O8lJ4o1nP3p6L9J6J9p4RL3K4nRLk1o7J3P8n9k7MP2
$$ 68 57 1 -5 -52 31 -7 -11 53 24 -46 22 19 33 -28 -33 40 -36 3 19 38 -36 -27 6 30 25 34 37 16 -51 -38 40 -19 -46 -42 30
4520C0m7pK5jNn7R3j5qm7P5p7j1j0Q1o3j7M5K6n6M9J10j05m5J4KO3m4K5J4q4l
$$ 30 -17 -24 1 0 5 -52 41 26 18 -29 46 -31 -42 -52 29 -34 -51 -6 20 -36 13 123 18 -27 -13 -11 52 8 33 47 -37 -40
4552d0L0K2kl3P8l4m1Q6l8k1k3K8Q5j02n1O7pK3r3O2R2j39N0m1K1l0O0RM5r8Q3
$$ -40 -10 12 10 -23 55 21 -20 66 28 7 -16 12 97 -5 -56 11 4 27 -66 -4 88 -51 -1 -42 -21 -51 9 18 63 -35 48
4583D8Jj15K6J1J8Mj4K3l0kMj6Q7r6P7m3L3J0Qn3K8j51J33k6K2J1N5m4m5J7K3
$$ 48 49 -66 -40 -29 -11 -7 -21 2 -28 -30 -26 -42 45 -51 26 -17 16 26 34 -19 9 -142 -9 -35 -13 -2 53 9 -36 -19 4
4614DO9r2O7m1m3LJ8L6J9p9L3J5L2r3K9K7j3lP5K5j43L3K6l0L1M5k1k7n6M8J5
$$ 4 73 -19 48 7 -36 -33 -15 21 40 -39 -6 9 41 -52 -23 4 -9 -12 63 88 -55 -22 4 -26 5 50 29 2 -54 -6 9
4645Il5L2L2nq1J10l6K2p7K9k5NJ3M7n1j8P6j8k2k5N4K2k4l2K3km8q0R9RKm0P7
$$ 9 -26 6 38 33 -48 62 26 48 -29 0 -25 -20 -7 40 -11 -29 47 29 7 -18 36 58 34 2 25 23 -25 -105 -6 3 5 -35 42
4678D2Mq7l2N5RJ2J0Nj3m8%J23r0o6J30p4mM7Km5Rl4J21p3J5k0N8j00j4Q5ll4
$$ 42 46 -41 -73 -18 -9 3 13 18 5 -43 -43 80 -10 -76 54 -20 -24 23 25 -20 -11 -45 76 3 18 -2 56 -44 -58 27 24 -10
4710a0M6j9m8PJ9o7J33p8o1J21l8m6O1J0l9J9j8K1k3rK6L1Kk7kj4k7nM9l3k1P4
$$ -10 36 17 -31 -24 -5 -72 61 -17 -78 43 5 -41 20 30 -9 10 -8 13 -10 -19 7 38 40 13 11 -3 -30 -35 14 -19 -40 34
4742C4m7k1J9M6l2j9k7O6o8k8L7O0o7K1M1Rk2n7P1oMJ0%Rn4N8j5m1pJ3K0nl3N2
$$ 34 -13 -34 -15 31 -1 -20 -47 19 -49 -77 -40 20 -47 -26 15 24 2 -55 16 10 14 24 24 33 -21 37 22 -19 -26 -13 7 2 -31 21
4776B1n9R4k4k2pj3M3L2q8J8j7QM8q6P1L0k2%J0Ql9m1J00o1j8O6m7P%k4K0M5p7
$$ 21 -38 56 32 10 3 -10 33 65 -23 -5 -22 -14 34 -52 19 49 27 27 37 45 6 -35 65 4 -14 52 5 12 12 -12 8 53 -24
4809b4k5J24j27N5j2J6m6N6k3N9n9j3Q9k1n4j9N6Ll7k8N9%p1O2Nn0rN1N2m1l5
$$ -24 -49 75 -52 3 -9 7 -39 17 -6 53 -6 -19 70 49 -5 -24 32 35 -2 -30 29 29 -42 20 25 -25 -34 17 69 28 -7
4840gP1k1n8K4mpK5J8or3M4j8M9k8OP8p8l4K0J6k0k3PP4n7L5o5O3jo3M8ml6M7
$$ -7 64 43 -15 9 5 -2 23 41 35 -58 -14 -32 17 -11 -5 73 -5 -39 -19 -3 -23 -46 -39 35 -22 13 -52 11 10 -53 -5 -9 -45 2
4874Bj2KO6j32J46Kn6J7k2N7j11L1K2j02K7O3L0J6q9N0k3kP0K1r8K6j1J4o5K6
$$ 2 -10 -8 58 -74 72 74 18 35 13 70 -41 -10 12 -90 -63 0 30 46 -43 7 -16 -18 52 73 -25 1 -10 4 -61 -35
4904c5l6J0L1KN3j2j07J38j0jj00L2O8o2Ok3O2j4L3k3N8q8J7K0L7q7J6L0J7l3
$$ -35 -71 -61 -30 -28 25 13 -94 44 34 33 -67 -35 33 -29 -23 -46 16 2 35 12 70 -18 -1 19 56 -31 -15 15 32 -1
4934aj8L6l7M8n4L9k4M4l7M5J5o6MQ3j03nL7m2k2J18j4j43N5QO5n3l8O6K3J6n7
$$ -1 -19 17 -20 28 -26 13 -11 33 -4 41 56 -10 -6 77 -26 -31 6 -36 -58 60 46 -97 -42 -34 31 -22 -60 6 29 45 -12
4965a2K6L1j25R1KL5j60R2Q6j11o3J06oRLRJ7o4jK7J15j68N8O4p4L2N9n1n2o7
$$ -12 14 45 -80 11 13 48 -112 -20 66 -45 -108 -2 -8 1 4 13 30 -34 -35 -8 107 -61 -3 61 -13 19 78 27 -25 -92
4995i2J42J4p1mJ4J2r0P9m5O2j13J9P9nl5K4j2qk0P7j9KOJ2m6nJ3K3jp6M1J3m4
$$ -92 50 64 -7 -11 3 15 -75 4 -41 21 -92 -73 6 1 -34 -10 -22 -30 -50 27 8 10 16 28 -18 -23 -10 13 12 -64 -23 -10 -54
5028e4NN6oo9K9O7no5kM5m9M3r1J88o6l2kJ9k6l5J02m5j2l6R6k6k1K7Ln2j2J0
$$ -54 -49 7 1 -68 -39 28 23 -42 -44 1 -48 -5 -96 92 26 -6 -8 11 -15 -50 52 7 -5 -41 55 29 8 35 38 -14 -26 -16
5060a6O1q9L4L1l0qMl0J15j58J39l5q2pO5K2n1k0M8J0n3J3k4P7m7o5J32J9l8l8
$$ -16 45 -44 -10 21 -9 -17 -13 -43 72 -86 53 18 -64 -71 -6 16 -35 -55 -7 3 -50 -37 -61 16 -31 -96 36 55 17 -21
5090b1M6J1o7N0L3q9M7j8L4l6M6Pq0K4o1J49j17L1K1J8o9jO2J7l9j5N6m0kKJ0
$$ -21 25 36 -31 19 52 -37 10 -8 26 -10 36 43 -37 -13 -74 75 -42 -11 10 28 -41 -42 20 37 -2 -17 39 -1 -3 -1 9
5121IPj4jJ7n6kK9J7l5J6%N2j3m8J8J9k9J7lr3P4O8J5o4oj1M4p5K6L2M8p0M2K
$$ 9 16 2 1 18 -38 -40 -11 6 -29 -13 -13 39 26 -22 -4 15 -14 3 0 -93 -19 49 64 0 -6 -17 27 -48 -22 10 58 -12 30 32
5155C2l1M0n7Rl7P8j3P1o6k9oK6k0m9NJ20j01LQ1jr6L5Qj2JLL3l4Lj7L7m7k3P4
$$ 32 1 41 -16 -7 -44 34 21 92 26 -3 -9 17 -3 -52 -47 73 -28 -25 56 55 -41 -6 2 -10 -9 -6 27 -7 -4 -21 16 -31 -54 20
5189B0j1r3J51l9J9m5o8J10n2l2PO5r5L3O1j6nm7Q1J4l8n3M5O5j20M2J3ml4K1
$$ 20 9 -84 67 28 47 2 -66 44 -8 -40 -33 32 -63 -30 31 15 10 -37 44 58 20 -33 12 77 -43 -1 12 8 -26 -5
5219eR1o2n9P9n3NlO9k9l1q4J15mm1l8N7k1N1k5N2l8Prk7qpM6p4K2MK5j9%J8j
$$ -5 86 24 -35 44 -9 -4 -7 62 33 2 -82 33 29 -12 -50 7 -14 37 12 64 26 33 24 -3 -11 -18 28 -46 -24 -20 5 -14 -14 4 3
5254Co9MJ35j54P2qj0ml5P7K2j3M3n2N6r7j6M7pj1J1J3j1m5J7N7l7j3P4m6No4
$$ 3 -66 -62 73 -81 -9 -17 -27 -31 -66 11 33 20 63 11 67 -30 -46 1 -6 -17 -6 7 -4 -49 -32 25 -12 -25 49 3 8 -56
5286e6L7Ojl4M0M5l1k8P4K9q4m0M6K0k3J6j5l4J6qP2m8j2O5n0K6pn8Q7j08N0J9
$$ -56 -19 -13 -14 -48 -8 37 6 -22 52 81 -3 -43 3 23 0 16 1 -33 -17 -25 47 -1 -13 52 2 28 21 -37 50 -58 -8 11
5318A1Mqj0P5o1J8oJ6k4J8m4M2j5l5K5mk3J0PJ6J0k4N0r9J7R2p7l4N5Jj5M9o8
$$ 11 15 7 -3 72 11 29 23 39 15 33 -11 31 16 -19 6 2 -21 -11 -4 12 22 -2 48 -51 -34 58 -19 -53 2 3 -12 37 -31
5351c1P5n7nn0L1l5J3M2K5Nl1J4K3m4O4J2K5j24P7pNr4R9L3o0k4O2K1j4o5P3R
$$ -31 44 -13 -18 -68 -37 -72 -59 -17 8 13 -18 -4 19 -25 39 51 76 -48 29 22 27 -67 32 65 5 -19 43 64 50 -15 58 67
5383F7n8k5K5j2J0m1M7Jn8k0J41n0m0kL1o5L1n9P3Lk4J0j8j6k3J19o9O4j6Pm6
$$ 67 9 -16 9 -3 7 -34 13 14 -44 -64 77 27 -13 -15 16 -49 -18 -77 -4 -1 -25 -15 -33 -49 -72 47 -22 42 26 33 -13
5414a3l4K7mj3kO4j5n2Q8Oo7QL7k6Pj0lK6q7Q7mL0o0P5Lq4m2N2j3P7o1M7l1Jn
$$ -13 -47 -20 -24 -37 -39 25 10 -42 46 52 -15 -7 30 4 11 1 -2 24 -63 24 20 50 -10 65 68 -16 -58 -6 -19 58 -3 44 13 14 9
5449Ik6Nj6m2P4pl3JL1J4q1L9k8N1m2qQ8p5j3N7qj0j1jN6p8l3J76j19K9M7m4L
$$ 9 -17 -12 -28 -70 4 -3 -36 -35 -4 10 -71 -32 -60 -9 -51 -59 29 -46 -59 -2 -10 -20 -31 -32 24 -54 -87 89 -30 -1 46 2 5
5482Er5R8L8k6k4M1J4q6J8N4Jk7J6nom0k6R4j2m1k2J4%J7Om5K6l3rQ3k6r8J14
$$ 5 -90 8 46 20 -4 37 51 -35 -17 37 38 11 27 22 16 -24 -50 44 32 -9 -31 -17 -17 0 6 -39 -13 -46 -55 28 2 -96 18
5515A8k0j3qJ6Oo4J13m7KoO9j4p3K0N7j0p5oO3J4m1o1M9M2m4K9k4Lj9N1l2n0J5
$$ 18 -2 -15 -23 -7 -1 -65 48 1 3 -3 66 52 -21 -1 56 46 -29 -35 28 42 1 -60 -11 31 -13 16 -8 -5 -24 27 -5 -55 -40
5548d0R3m6K0J6m1M7j01k1J05r4M4%J0N9r0Q5L2p4QKpl9J15q9rJ4n1P3l6k5M5
$$ -40 53 7 27 43 2 49 -52 -73 32 -62 -18 -18 -8 51 -39 46 78 4 12 14 7 -32 83 -6 -15 -1 -52 21 -15 -40 5
5579EP9j32O9k8oJ0M9pJ3o5k0N5l5M6Ono6K4J04m7l4k0N6l5m5k8M3K6m0PN4L6
$$ 5 84 -48 21 -7 -13 -3 46 39 52 -13 -33 22 -13 33 39 34 -32 -8 96 49 15 -5 51 16 -29 -57 -14 12 -28 -21 33 69
5611F9n4K4n1J2k5qQJ4O9okp6K3L9J9j01J7N5m4O1n2l6K6O1No7%kJ00j50O9l3
$$ 69 15 39 -12 0 -25 -33 -25 -11 58 52 50 -26 -3 36 55 -46 -29 26 -18 43 -9 -45 -19 42 47 -20 -20 -22 78 -72 -3 -36
5643c6K8JjO5j4j12k1L5M3M3r9J00k9JK4l1n4KQ9K3q8nN9rn9M6q4P3k6nJ05r1
$$ -36 -8 -7 -8 57 43 -69 -90 -55 -12 31 -68 32 3 4 28 -3 -57 -55 34 57 -31 -36 23 14 -45 1 -83 -10 -36 -41 64 -27
5675b7J1RKJj06J11ONl1O2L1q5lM9n3j1P9Lo6k0K6mj0n%k9K4j2J11j48K1N7J5
$$ -27 -16 -7 -5 -4 -110 1 7 12 -19 43 74 -11 -14 35 -18 -29 50 53 -13 -33 -7 -11 -21 -26 -26 -55 -31 -43 68 -80 -59 -2 13
5708A3Jn4K6N1Jk9Qj6n3L7oMLJL0o9N3K3Pj6M2p8P9p0n9O8j3j6j5K1L9l7J8Pk
$$ 13 14 -40 -14 37 38 9 17 1 -52 -15 -21 -17 -14 -13 17 -52 1 24 31 15 57 -21 58 -12 -71 -3 -16 -32 -47 -26 13 -24 -6 1 -1
5743ao5M7J8p6L8J5Ok4LL7J5j2N5m7opj6J7%omK6K7k2ok9k8Q3k1l0PK7N6j25P1
$$ -1 -66 -19 -1 -77 -39 -24 -18 -42 -39 -2 13 1 56 9 3 -4 -20 -3 -3 -9 -13 13 40 18 12 -17 -45 38 17 -13 -6 21 77 -48 23
5778B3qjO3l6jk1K6j07k0J46j19N6L8l8ol9M6K1m1N5m0J4nk2K2nk0j8M3j14J36
$$ 23 15 14 77 41 40 19 45 -62 -82 64 -55 1 39 1 -5 -44 2 23 -18 37 -3 11 6 -16 6 1 -19 -37 6 -108 28
5809B8k6K2n9O8k9ljj5LJ0l8Q3j0Mk5R9q6n0K7L2m2J9Ok1J8rj5L0k1mK7Ln7J7
$$ 28 2 24 -35 33 4 1 0 -15 -12 -2 -40 43 33 37 12 111 25 -25 2 34 -8 11 17 -4 14 5 -10 20 -1 -5 22 25 -32 -15
5843a5N0n0k7O7K6q7M2Pj3M4m2J1m2l7O8L5o8%j8M1m3LL8P3q4j6J05n2M4j17J58
$$ -15 35 -15 -42 25 51 -36 6 13 0 44 2 13 -29 -66 2 37 -31 -31 -49 -8 -51 -48 -10 63 -21 -37 68 16 60 -57 101
5874A01p6jl3N9j9q8M8j6J7K8M7j7p9n0J50q4J8j1L1J5l5n1O6j9MJ9k1N1r6j7
$$ 101 25 24 -9 50 31 -57 -9 -25 -8 20 67 50 -29 -79 71 -13 5 -6 25 40 5 -46 20 1 5 24 3 54 -42 -59
5904e9J03m4l8J16m3l8k0QK2l7J2mj7R0j05L4NK4j2NnlN7p4N2k6m5M9K8k0K9n2
$$ -59 44 0 -38 78 35 -3 -23 -15 7 -30 -18 -22 -39 51 -54 -20 -15 9 -3 2 -3 -6 51 -23 29 3 -42 7 35 15 44 -8
5936hj9J0N6Rj30J08J0p5Q5K7k9k9QK2p8K3J6J0n7M2j0k0L7oK5o2n2R8O2j01M
$$ -8 -27 -17 39 48 -82 26 36 -39 46 73 44 15 23 45 -33 -10 6 16 -41 1 -9 -29 8 2 27 -35 -87 11 73 -28 -24
5967b4M0O6r5L6%p8LK8J9K4q2R0l6l2K0K1Ml5N6o2R2r3J9M4L5o0K3J9Jp2j8J10
$$ -24 16 82 -13 23 23 -55 -52 -24 -5 19 -63 27 -9 -41 -21 0 4 -31 25 -37 55 -38 -19 25 60 0 23 42 43 -29 -47 63
5999F3o1M1j6k8qj0J7K1k9j2N9O0j14L9L2l5j7O1r3j5O3j8Ln1K2J4J3L7r7R3j4
$$ 63 2 43 27 -1 -9 -19 -2 19 -10 -22 37 97 -17 22 54 19 2 63 -30 -45 18 0 3 -48 -26 -12 1 38 -59 34 20
6030B0j12J7P0L5l9M4k0o3P5J8k7m8m9J19Qk0p1J00p4l4R0J1p0k2M6k8K4q7P5
$$ 20 -92 -75 -5 30 -9 35 15 -48 27 45 18 -30 -79 40 48 28 -43 57 -17 -51 39 50 -20 -42 4 -24 0 -87 -12
6059a2J2L2o7L9N9p5J7M5p7j6O0Qm9rJ6N6jo1K6%L6n1J7J6n9m8J05rjK7p6O5n0
$$ -12 0 32 -35 4 63 -12 5 50 -27 -43 17 25 -24 -33 -17 39 38 -23 3 3 39 -12 5 21 -38 -86 19 10 9 36 -40 25 -25
6092b5j0P1k5m7K7L7o5N3n5rPO0J5l9PJL1j3k7RK9r5j5J39n5j6L4J6L8j20M7M6
$$ -25 -35 36 11 -36 -9 28 -37 16 -39 -48 -41 19 34 -5 2 3 34 21 -6 3 32 -63 -78 61 6 -10 24 40 78 -42 5 51
6124E1q4j9M0rN6q5jj5Q5l2J8L8ql8RJ2q9P4K3n5L7l2L5J3l2k7O3j9l0K5L6p7
$$ 51 -33 -52 -12 -21 35 -50 -51 -66 19 -13 5 43 35 -3 6 18 -71 3 26 -29 8 -24 11 24 -8 -35 28 9 -21 4 40 -37
6156c7OM3k1N0K8mk9n4J5L4M2m6m7K6p5L1ML5k7N0lo1J6K5O4r0P4j1K1q6M5m0
$$ -37 -31 12 -9 41 69 65 36 -18 -3 31 73 27 -20 6 -69 -38 -34 1 -26 24 21 -40 -24 1 65 -25 49 38 59 -27 18 -22
6188b2K4l6M6Jl2lpLol5O3K8ml1J0o1P9j3J3%p3L9j0L5k7l1J28q6r9J35k1k3L5
$$ -22 2 -34 12 13 -19 -22 -29 -26 -32 -67 -4 24 20 -11 -1 -62 17 4 17 17 -56 -17 -27 8 -19 -50 78 -8 -107 28 7 -16 19
6221A9k9N6m9J4n7O1j4p0J13j05J3L2J5lL5nn9K6K1L6Rr3Q1qk3n2KN6o0j0J6L8
$$ 19 -10 46 -3 11 -46 15 1 -69 44 -61 -48 -16 -1 -4 31 26 -33 -7 14 50 59 -34 47 39 16 -36 -34 22 -38 -48 -32 6
6253Fl7p7J06j0mQ6q8j6nK5Q2K5j42P4L1n1o8M0K0k8K2L9j9oJ9J7n1N2l9L9j8
$$ 6 -31 -108 -2 -12 -16 70 -18 -34 -39 -14 68 93 -49 25 56 5 -63 -23 -3 -31 -9 30 11 5 24 41 -10 42 3 42 24
6284B4q0M6k9L2l1P7m5n8L5Q2op6L4n1k0R0o4N2m6O2m3P5m0NK9j9o2RK9J3q0j5
$$ 24 -56 -10 -39 -7 -38 39 -6 -64 -29 53 47 -29 5 -46 -66 24 -40 12 -34 28 -15 60 20 25 54 35 -27 -18 11 24 -56 -71
6316g1O9K3Ln1P6n3m2N9K2n1o7M4P5o7K4N4Nj30P5O0p4K1m0J4m1M1LK4ll1N1k6
$$ -71 -2 21 24 -27 49 -4 -46 13 35 -16 -83 -39 36 -31 -7 47 52 -78 -3 57 -17 4 -36 -22 -63 -22 -19 5 2 -29 22 -4
6348dL0j2L7q3nL1L8l9J1K6J0p7o6J12J8j04K5P4j4k2j3Q%L1K0k6Lk9K0%Nm4L6
$$ -4 26 14 51 -32 -37 -6 32 -7 4 30 40 -37 -103 9 27 -77 -52 22 8 -14 -27 -19 -19 12 32 6 9 -20 0 0 5 -39 -3
6381cJ5m1K9%n2K5kO2q0N0J0k0KK2J6Lq8P0k5M2r5Q8ml1lOP6r2n2J43j9q1J0Q
$$ -3 12 -29 0 0 -52 -27 -29 33 -47 3 13 -7 -5 17 33 36 -52 18 -7 35 -60 28 24 -7 -10 -4 72 -20 -72 71 52 -29 -19 -11
6415a1j4J1J15j24M0j7k4J6K7l1J9Kl5LP6p4K5l6P5n8J1mK1k2l9K8P9j04m0J09
$$ -11 -25 -14 101 -23 17 0 -24 -8 19 -12 7 9 -26 -23 53 -21 4 -32 43 -15 -4 -8 13 -9 -48 -20 59 -45 -85 24
6445B4j8l5L3J1J1m7J1qrl3J20j11OK2J6P4l7p1NQ2j04M8LN0n7l4O0Lm7RN7o6
$$ 24 6 -29 4 15 26 -21 -10 -18 -27 -60 60 -51 -45 -23 -7 67 30 -41 -36 46 -58 -10 -7 43 -14 -48 12 15 -32 -23 34 -32
6477c2K3K5lqo4P1j12L6K6N4om5KP4J4qm7KPr1J39l8j04Q0Qk5j4K1K9j6J4oMn5
$$ -32 -9 16 13 5 -59 12 -100 -64 -38 16 10 -35 -33 41 55 47 0 2 9 -82 57 19 -85 -5 3 -22 -36 -15 14 -2 12 6 10 -45
6511d5O8lm2J3r2Q9L4n6JN5j3nj0k7m4L1L4M3j8J6m5l8J8J16o6o1N8k1j0O2j04
$$ -45 23 20 -22 -9 -101 -12 22 -34 -33 22 9 4 -6 -33 -77 -46 -12 31 13 29 -16 -54 -36 80 14 -47 11 -10 -20 42 -62
6542f2J14j7p3J5N3M1q0k9J9qM5j02Q7k1m7J9N5O0j50J33ol5k0M6l8M2r7L4j2
$$ -62 52 35 -38 -23 30 71 -9 -38 -19 -27 18 -84 3 -18 -65 -46 9 69 -81 52 46 11 -9 37 -1 41 -56 -22 -34
6571c4j5KN9qj4Q1l6j7k3J0N0p2J3OL2m8n4P8k0j5J7O3j15N5m5O3j3l1N7Rk9K4
$$ -34 -49 -47 12 4 -10 71 35 18 -5 5 55 -17 -4 2 34 -14 -68 10 -10 -25 -8 55 -60 -5 -50 13 0 -31 26 35 6 30
6603C0j9j3O8n0PL7n0M7l5j00N5LR8j16L5N1L5j28L3L1J1l2k4J7kORj2jl5R1k5
$$ 30 11 -2 66 16 23 60 10 57 22 -78 -23 -20 78 -38 -3 48 83 -45 -12 19 30 -2 -26 -9 -11 -5 4 -8 -9 -44 47 22
6635B2l6K4LJ5k5KM2o4L5mmJqL4Ln5m7J14m4o5k3J26L2q1j9N5kJ4k0k3L2Lo9M5
$$ 22 -14 10 13 28 3 5 47 -17 18 14 10 11 3 37 40 -15 -62 52 8 -57 -80 46 78 -3 -22 33 31 45 25 2 34 37 -32 13
6669A3n7N8mJ4n1K0KL7l6j7O6p8k9O1Q3j25M0N3j9J6j00J37j8p9p1J42np1m4Q8
$$ 13 -44 14 10 24 -27 -7 -5 32 -4 -21 45 -33 -62 -1 82 -43 -3 50 31 47 -53 84 66 -13 -84 58 53 -18 -62 26
6699B6m6j5K6J1L9o9L3J4j0k8K1K9q9rN4K1p4N2K1m4K9jP6n8n2O9J7j05L1P2q8
$$ 26 -20 -35 -9 2 41 -28 5 19 9 -19 2 31 -58 -67 -13 8 -66 -14 7 -37 -8 -9 67 9 -43 26 43 -62 -31 41 -47
6730d7J4J6M4j8m1k9L4l9J7O2n4JKJ05j03J9n8J02Jj5Ml5J8M0k8M1l2q7M8K6j9
$$ -47 -33 -17 27 9 -32 -61 -27 -66 -49 13 -41 -40 -38 67 -36 -17 -75 27 28 13 17 -18 0 40 12 53 21 -66 -18 8 -11
6761a1j6N8k3l3P3m6J1k9O8n9j6J9l5O3o6J04o8P0p0J8j5J0o9Q4ko6M1j3L4L2
$$ -11 -27 31 8 -25 48 2 13 -16 52 -7 -23 -4 -39 24 -42 62 -6 64 -6 12 -3 7 -62 22 20 -46 -5 -18 16 48
6791D8j4jM9q5l0J9K8p0N4k8M6p7J09l0k0o9N4N2p6J5L2J0pj3O0p3LM2L1j65Q8
$$ 48 34 33 82 -3 -33 -14 14 -56 -2 -30 16 -61 48 18 -2 -71 -17 35 -41 -26 6 16 9 -4 56 -17 -14 28 59 -106 -18
6822a8N4l8Q1j9j9n8J1oM0KRp5oL5j0K5P0o7p8J7L5L5J9j9J4q5Q5n9L4j1mnk9
$$ -18 36 -2 79 60 41 -17 -6 -12 28 30 39 -36 -42 -7 -17 8 78 11 -67 -50 -15 20 39 20 34 -51 34 -25 9 -2 -6 -11 -40
6855d0NN5j7l8M1pM4r4K4O2j9o1O2j9R7j16J3M6m9J6j1J14j16rP3L5j53MJ35n7
$$ -40 -35 20 3 -35 6 -1 43 -51 -27 35 16 -45 17 -2 95 -21 -8 38 -11 5 -6 108 -8 -17 56 91 -62 -58 77 20
6885B0p6j5R1O4n4J5m5J9m1j4L8N6o4O0n8J1n5O0n0K5J4N6o2l9KJ13r2lQ9q3R6
$$ 20 -56 -71 20 84 30 45 0 19 -22 -36 2 58 -6 54 -4 7 -48 12 -38 -13 1 57 -5 -44 -42 71 -21 -24 65 -18 78
6916G8o3l4J9o9M1R7q9n5J04L5j4Qm7m6Q5q0N0M4r9j2N2J9j02P3J0l5kK1R8j25
$$ 78 15 -19 0 -69 -28 69 -20 -75 29 64 50 58 11 -35 50 -30 20 64 -35 -47 5 24 -78 -5 5 -30 -32 -11 87 -38
6946c8JQM3J1K4l1nn1O7l4j6J8K5j6j6N4j18M9o5M1K2ll1J2N5O7m4L3M6j27Q3
$$ -38 -37 -29 14 25 49 18 13 -38 29 -5 -21 -3 22 6 -10 44 -74 -25 -90 -49 -27 -30 -61 -49 6 73 29 62 108 -19 64
6977F4o2%pM8n0j6j6qL2L0p8M1L9P0j33J00k8p7O1l5M2k5lJ1l9pP3n0O0j29J17
$$ 64 2 2 -5 43 -7 -23 -39 -47 -15 15 -63 -22 17 87 -46 54 26 -51 10 -25 17 -8 -11 0 -39 -46 27 -23 37 -92 25
7008B5J2m3NL1p2RN1j1Ok9N0M8n5q9O6N7q5n1P8k4L2q0K9O4j5k9N1jj3j7JKK3
$$ 25 37 -6 -1 30 -42 -33 18 7 13 -16 34 82 27 -62 4 61 -24 -75 3 -21 11 -69 -40 24 9 -20 31 30 17 0 1 3 26
7041B6mqJ9j9kM4m5p3P2Q7o8n8P1L0j3pj7J2l0rK0k2n2N3K8o2K0K0PNm2M5J7q5
$$ 26 22 14 33 14 12 56 11 -62 10 97 29 -29 42 72 59 52 35 47 17 8 28 6 -46 7 35 -27 -7 13 20 25 -17 28 45 -40
7075d0P6m4l2nJ7MJR6n8J0n0N3k6l2M0k1R7r1J9q6P6j3n6J11p4O4k6l9J19o9k9
$$ -40 36 -8 -40 -45 -28 -24 -23 73 15 25 -25 28 2 -30 10 -11 86 -5 14 -72 4 -9 -65 46 -28 36 10 -29 90 21 -8
7106hJ3J4l8K5J9n5K8rO9o8K1L8l0Om0K0j6j3J3olj1M3P8nj41R0jl6rJ9n2l1J02
$$ -8 5 19 -19 6 25 -30 -2 -11 58 -10 11 49 19 25 -15 5 -11 -24 -11 -17 -20 -31 12 90 85 -56 34 33 -3 -12 7 -45 -76 26
7140B6mk5PL2j1Mk7J1R7q5n2OMK4k3M8k6oj6K3l0n1P4P9j02J16m7K9j20%K7M1
$$ 26 22 -3 4 36 25 29 2 13 110 25 -27 -21 -17 7 -16 32 6 0 -16 7 -23 -74 0 79 -23 93 46 75 -45 -45 -18 23
7172B3o5K7PO0j07K2P4n0j1l0J13m0m1L3Ml6J3j1P9j19j6O1j0K0n0M2N3M4j03
$$ 23 -42 -15 -8 52 -55 -33 41 -9 -20 -50 63 23 -18 15 19 -17 -4 -15 64 -55 -71 -10 -20 0 -50 -8 45 89 -14
7201a4L0o5O3j1K8o1m8J16q4j9Q0n0Mk0N4P0n0k4j7jP2r2PJ38j53P2k0L7l1k9
$$ -14 16 -49 14 3 31 -30 -78 38 -46 -65 15 -35 -31 -51 3 73 23 -1 -18 -19 53 -39 -32 106 -47 25 5 42 11 -18
7231a8M9k3k6L1NL2j5n1j7j2M9rM4j8k4K2K8n3lO4m2k9n8R1l3K0j6L1m0LL0M6
$$ -18 31 8 -18 13 18 50 35 -16 -33 -45 4 -5 39 21 -3 19 47 -6 -9 55 13 -16 -74 17 -16 4 -12 19 -21 -18 12 58
7263E8m0o0K8Kj6J9k1l4L2P3j7k6jJ7ok2m1O0j4n8J22n3Jn1P8J2l9p9P7J03j38
$$ 58 18 -42 -14 -12 -28 -9 -30 -64 -32 41 24 -2 -3 14 8 -14 -55 5 -9 -67 55 2 3 -48 30 42 3 -76 1 104 -34
7294c4m9Q4K2l4K8rKp0K6J00j07N3n2P3l9QP0m3k1j2L6%K8q4L2m9O1J3J5j04j6
$$ -34 -83 1 23 -11 17 8 10 -60 -34 66 -41 12 -40 33 -6 2 72 29 8 -4 32 32 60 -24 8 -41 20 33 48 -56 -72
7325g2R8Mp4j7J24m6K2m7Q4o6m3M6jk7j6KJ33r0n6M3M1o9J8M3J4k2o3L6k1qJ1
$$ -72 26 30 -44 -61 63 17 39 -8 76 10 -33 13 12 -15 -31 -29 104 14 -42 1 42 -27 -9 34 48 26 -37 -1 -22 -30 -19
7356a9O2l7QO4q8Lj6M2lkM2p2Rk4j2L3M6q9N3N7j8n6K1J6J6q0P4k1o1R3n3k0j9
$$ -19 43 6 14 78 -10 -7 -23 19 16 14 56 -16 -7 -31 -43 -10 36 -53 0 57 39 -17 4 20 36 -44 30 9 -52 41 -12 -32 -51
7389e1M3Loqj2J6K3n8P7p%l1N0k6k6Mk3m1k9R4O4j66J17K6p4N2ol0K4kq8P9j7
$$ -51 -8 -5 -11 -19 -31 -15 8 -50 27 20 20 -11 39 13 -13 -9 -32 -73 -102 -8 56 -110 7 33 -41 11 5 -25 -1 -3 -91 -12 -29
7422b9L2NO5n5q9N4KL6k9N0o1M3j05Q5o4N7m4O2m3jL2K3j4ql5K3jj0R3j16O4k9
$$ -29 3 8 73 18 -71 -17 -15 21 -8 42 -19 24 -81 4 -60 -3 -47 15 -28 -29 3 26 12 4 -31 -8 -9 -19 74 -42 22 -7
7454gK7m5nk9R3kp8K5OM2m6M0J9j18J05MJ1m6q3R9k5kP5lp5J4l1M3lMK4N2q8k
$$ -7 20 -25 -30 -59 34 32 -46 -21 -15 27 -19 21 40 -78 27 31 42 -4 -87 12 -13 -15 60 57 -18 -4 -35 8 5 9 33 85 -3 -5
7488eM8l5nm9R9n1j2J04r8%k5O7L2q2kpJ6j2N5l8m1k7N2L3Po8Q4N1q9mL7J3q8
$$ -5 43 8 3 -46 53 2 -10 94 -4 -4 -29 38 70 -12 -14 -21 -5 -17 38 0 -41 -68 -16 17 24 -44 40 91 2 -2 35 48 -40
7521d0O9n1O4j2o0R4r9N2l2L3k1KK4no3N0L2kk1o7nJ38j24M1N7Lk8m7J7L2p1N1
$$ -40 29 -22 42 30 -30 64 -35 17 -15 18 -3 -1 23 18 -45 5 37 35 14 -53 -58 80 -44 -3 54 57 29 -18 -1 31 -40 11
7553A1K9p9M7L2k6j4m4L9M3q3P4po4P6q6K7L1m7N2pok8K5J05r2k1L0n3k0J03R
$$ 11 40 -39 8 40 14 0 -44 -5 38 -45 29 22 -42 34 -52 -25 6 -41 11 4 -2 -30 -5 100 8 -13 17 -36 -56 47 56
7584E6q4M4m2MNM4Nmn2n4O3o2N3J1J1J6l0rJ02n4p7J05q8k2M4Pj1M6o2O8J7l5
$$ 56 -28 16 -26 -22 -17 27 32 28 -24 -78 -15 -77 -24 -13 -2 14 -16 -25 77 23 -54 51 -37 -59 -15 -8 -19 27 -35 33 50 15
7616A5j1N8m1l3J7Q9k12O8P0J8o6l2P8l7k5k2J25j44M2N0L0no3J8R1p1l0L8k1
$$ 15 4 62 21 -12 5 94 -118 -50 20 38 -28 -60 18 -19 -44 -66 59 -85 -43 7 37 32 -31 -13 78 7 -23 15 -6
7645fj3K7M2q2P6n7K6o8M8K3j3k9L5K6J6o3l7R1j4j0m3R2J0r9M8m8j8M2j7nM2
$$ -6 -19 8 50 -32 44 -13 13 -55 -7 16 3 -26 9 35 51 -12 -49 42 28 18 -25 67 77 -22 26 -22 -40 2 -15 -20 22
7676B2n7M6ql3oQ7K3r9k7J09%j02P6O2j64Q5pKJ2m4pN5p3R7p4JqmJ11m9q3N1N1
$$ 22 -35 11 3 -30 -36 51 74 -25 -52 57 57 -45 31 93 -71 14 7 9 21 -23 -30 25 -48 49 -25 -24 -32 -36 75 26 -57 -6 45
7709D5K1r3J1K0j5K1l5K9k3K2l1P3m5q1J17l0L7M0r1O1l4pqPn1J05r9k8P6K2q8
$$ 45 66 -27 -16 4 -11 10 -25 4 -19 3 -28 45 0 -81 36 6 43 83 -8 53 19 12 4 11 -40 65 -34 -62 14 36 -52
7740e2L8J6No7P8k9M6n3o4N5L5l8j4M8j1jpL5P8j52M5K6m3L0l3rK2KN1jqk3J6
$$ -52 -14 2 7 -60 18 -11 35 -18 -82 -27 8 -30 -44 4 -7 -8 -15 20 98 -54 -9 17 -26 4 -29 -38 -16 -14 37 36 28 5 21
7773B1j0oOK2q9j9P1l2mKO7l2k8mJ7m5L9RJKk8N3m0J07r0K6L0l4l0N3k2Oj7K8
$$ 21 11 5 11 33 -56 -75 -4 -36 -40 -38 29 -3 -31 -35 -18 -63 -24 -15 -14 -12 -40 13 -27 80 -10 16 46 12 -18 35 13 19 2 30
7807C0p5k3L4N2n8L4N6n1J6PN0r2k3O7m6O5k7kN7m8p7P8o0LJ8RP4q4m6R7l5n8
$$ 30 -45 -68 -34 18 -40 -6 50 -1 15 22 72 -20 -43 24 -22 43 16 14 71 23 -54 24 -36 -33 -15 -6 68 -16 -62 35 0 -58
7839e8N0MQJj0J2j1K4p5R7J3q7%Kl7M1Mm6R0q5J40j46K9K7N0q7l0O0Q9j01K0j
$$ -58 -8 -4 4 5 -5 7 -4 20 -55 42 55 -32 -32 -30 -67 -26 -22 -68 22 -63 77 -69 -40 -13 37 -50 -80 -20 69 -32 -12 -13
7871a3K7m5jP0o5l0J06k3o9O6q2Q5pj9L6m8RoL3j3j12M8J3O7k9JQk5J2P4M7j43
$$ -13 14 -31 -32 38 -27 -57 49 26 -43 23 -59 26 19 0 36 -12 -3 -9 24 11 -101 -53 -40 27 -2 -1 7 -18 -6 68 115 -28
7903b8LK9Po3O3k6O0o9J9N6l9k8Q3Jj39P7qmp0J5L3P0j33R6N8o9Nk0l7N9MPqm7
$$ -28 -25 4 11 -52 11 -15 45 -24 -5 51 12 -16 67 68 -71 6 -2 -6 -76 -61 -28 42 -91 5 63 -6 -1 -21 -58 1 5 12 4 -43
7937d3K3O6n8o9P0J12j10n2J7L8K1r6N9J6k4M6qJ6nn8L8NJ5M0o3M1r4kM0j8JK5
$$ -43 -20 46 -12 -81 -11 101 -9 -61 -44 -6 15 -81 -22 -6 -30 16 8 24 19 -39 -1 4 19 59 -4 37 -57 -59 -19 -37 -36 -11
7969a1N5n7n5M5O5r1j4M6K5m0M4o4M5J6j2k6J1j9M3N7n4o0M6N4m5QO0q2M6l1J06
$$ -11 44 -13 -68 -23 42 -49 -63 -17 8 -32 12 -52 -7 9 -3 -29 -18 -37 6 63 9 -51 -5 49 4 12 72 -10 36 5 111
8000A11q9k5P1om3j8k4P7r5l5J37m2OlMl5K2LJ9o4M2n0QnO0o2O5k1m0L4J6n2M0
$$ 111 22 -3 68 62 19 1 -23 54 -41 -76 61 19 25 22 26 -9 13 16 35 -29 13 -37 -29 -34 26 -36 29 8 -32 2 18 -34 6
8033FK7l8j9J5j5l7kJ06m7K4J3lJ3n9K9m1O0J2m6l3N9l4L0Qk2l8NK3p1K7K6j2
$$ 6 33 -5 -24 -9 -24 -61 -63 43 -4 20 33 30 43 -16 13 -28 32 44 -2 -35 24 -10 20 28 6 -32 -27 -4 -75 -48 -22 -34
8065c4N7l6L5m3N0j4kj7o1N7J2l9jR3r0K4l4N2j9l2N0R5o9j6pk5j9K5P1k5o3Q4
$$ -34 23 -13 22 -21 29 15 13 -4 -65 -8 4 -35 -36 57 -33 -9 -43 9 -10 -42 8 103 34 18 11 -14 -33 -8 63 38 -25 59
8097E9k7o3N5k4K8L3r3mM2pm7P8n7m2O3RO9j14O5K0r2J3M8L1r4J5PP9j14J3J00
$$ 59 32 -31 24 0 28 61 -32 -36 6 -1 -48 30 -27 -69 -6 3 72 -42 23 43 -49 -36 12 43 -51 -36 -29 50 -64 -51 49
8128D9n4J4L5j2no2J8L2n3k3P8O9j39Q2r5J29p3o0J38k9q5K6PMjLM0l1k6J5J7
$$ 49 -5 9 44 32 27 -35 -17 15 -38 -61 17 86 -53 29 -66 63 -10 -70 68 39 -46 -20 -13 -9 -10 -7 33 2 -24 -9 8
8159Hrkj3j1K5J7j3L1m3lJ7O4o4K7j9k4r5L4J00l1oN8J7mp8J9Q6m7p0M9o6M2
$$ 8 -1 -3 -16 -27 -2 15 2 33 -10 -13 4 68 4 31 12 -12 -107 -73 27 -4 -10 48 65 61 -17 2 88 41 -29 20 -46 -4
8191d
$$ Imaginary data points
##PAGE= N=2
##DATA TABLE= (X++(I..I)), XYDATA
0@%%%%%%%%%%%%%%%%%%%JrJ6j6J6j6J6j6J7k5L2l2L3l7M4m9N2o0O8p6Q4r2J01
$$ 0 0 0 0 0 0 0 0 0 0 0 0 0 0 0 0 0 0 0 0 1 -8 8 -8 8 -8 8 -8 9 -16 16 -16 17 -20 24 -25 27 -33 35 -41 43 -49 52
42E2j11J26j40J55j74J92k12K37k68L05l48M03m73N71p11R29j327K271q358p831
$$ 52 -59 67 -73 82 -92 100 -112 125 -143 162 -186 217 -256 315 -396 533 -794 1477 -6881 -14712
62a4712J2712l145p984N548J0487l313k385P473N669m340k844L766K061o902n122
$$ -14712 -2000 -5145 -13129 -7581 2906 -407 -2792 4681 10350 6010 3166 6932 8993 2091 -3031
77c031M153J298q999k235Q531n51q728M324R381m657n461Q344M717o847j415P095
$$ -3031 1122 2420 -6579 -8814 -283 -834 -9562 -5238 4143 -514 -5975 2369 7086 239 -1176 5919
93E919L2o085q6M226j225n707n65M576j184o365J930O849l223n430O686N597o763
$$ 5919 5951 -134 -220 4006 2781 -2926 -3491 1085 -99 -6464 -4534 2315 -908 -6338 348 5945 -818
110h18k149Q232N3q018J380N759l650n209L271L611k816k772L256L689k689l593
$$ -818 -2967 5265 5318 -2700 -1320 4439 789 -4420 -1149 2462 -354 -3126 130 3819 1130 -2463
126b463L538L280n837l794O047R01p640R90P835k226n215N708N490m551k350N152
$$ -2463 1075 4355 -1482 -5276 771 1672 -5968 -4978 2857 631 -4584 1124 6614 2063 -287 4865
142D865Q70n239j990K673m04m771j652L810Q83m523Q04O836m18m865M184N910
$$ 4865 5735 496 -1494 1179 775 -3996 -5648 -1838 -955 -5478 -4674 2162 1744 -3121 1063 6973
158F973m538l705N819J366o623q82M704j947n080Q46L038j807l207J437L550p54
$$ 6973 2435 -1270 4549 5915 -708 -1590 3114 1167 -3913 -3067 -29 -1836 -5043 -3606 -56 -810
174h10k884K942M993k245k976N041L015n786j760N261j722o850J001L683l847
$$ -810 -3694 -752 4241 1996 -980 4061 7076 1290 -470 4791 3069 -3781 -2780 903 -2944
189b944l626L456K666k125n71L883K812j764j346L360J622m487k107M003o46o105
$$ -2944 -6570 -3114 -448 -2573 -3144 739 3551 1787 441 3801 5423 936 -1171 2832 2186 -3919
205c919P41M903l001m001M365L430m046j119M719N93l700M9L042l32l036J04L104
$$ -3919 -3178 1725 -1276 -5277 -912 2518 -1528 -2647 2072 2665 -1035 -986 2056 1724 -1312 -1208 1896
222A896j74l558P74L960j763m181K804L311m353k452M834Q63m811P12M525j280
$$ 1896 1722 -1836 -1062 2898 1135 -3046 -242 3069 -1284 -3736 1098 1961 -2850 -2138 2387 1107
238A107l211K050K667j903k232J483J927j796k304K054K565k733k096L962J443
$$ 1107 -2104 -54 2613 710 -1522 -39 1888 92 -2212 -158 2407 -326 -2422 1540 2983
253B983m561l33M438j473m665K173L271l110k068L516J738k376l28K938Q81k382
$$ 2983 -1578 -1911 2527 1054 -3611 -1438 1833 -1277 -3345 171 1909 -467 -795 2143 3024 642
269F42q65K292J21l788q66L283q98m074J824M005k384k468M290K258l643m90L776
$$ 642 -223 2069 2190 -1598 -2464 819 -79 -4153 -2329 1676 -708 -3176 1114 3372 -271 -761 3015
286C015n27l513N57K253j286k559P55K238q38k477J313K966j934k664K973K194
$$ 3015 2488 -1025 -468 1785 499 -2060 -1305 933 95 -2382 -1069 1897 -37 -2701 272 2466
302B466l674j024M273J03l877J291L530k023k606K044J524k499j611J621R44j843
$$ 2466 -1208 -2232 2041 2144 -1733 -442 3088 1065 -1541 503 2027 -472 -2083 -462 482 -1361
318a361j160K282J541k089o38L551N66l533N17L504k021l623K172K032l229j481
$$ -1361 -2521 -239 1302 -787 -1425 2126 2692 -841 -324 3180 1159 -2464 -292 1740 -1489 -2970
334b970L134P03k462K73K727N7j994J53K025l27k552K51K628j245k821K010K664
$$ -2970 164 867 -1595 -1322 1405 1462 -532 -379 1646 1319 -1233 -982 1646 401 -2420 -410 2254
351B254k675j795L523P89l645J02L113j063k791J429K128j367j366J510J768j230
$$ 2254 -421 -2216 1307 2096 -1549 -1447 1666 603 -2188 -759 1369 2 -1364 146 1914 684
367F84j541J521J480k356j846K413Q66l396l02L602n20k907J983K950k054j679
$$ 684 -857 664 2144 -212 -2058 355 1221 -2175 -2477 1125 605 -2302 -319 2631 577 -1102
383a102K429R63k569q84J795N3k031m99J992N09j927q1K779q7k828J183K674k026
$$ -1102 1327 2290 -279 -1163 632 685 -1346 -1845 147 656 -1271 -1352 1427 1340 -1488 -305 2369 343
401C43k389K490J472l041n45K973m8k491P69J965q68j778O42J424r35j720Q96
$$ 343 -2046 444 1916 -1125 -1670 1303 1255 -1236 -467 1498 630 -1148 -506 918 -17 -1737 -841
418h41K015j206j807K250J852k567r19L117l4l309N38K518j631k232J773J605
$$ -841 1174 -32 -1839 411 2263 -304 -1223 1894 1860 -1449 -911 1607 -24 -2256 -483 1122
434A122j667r15J881J034j463q01J507O83k035r49K166L37k797M52L088r35k381
$$ 1122 -545 -1460 421 1455 -8 -809 698 1381 -654 -1603 563 900 -1897 -1445 1643 708 -1673
451a673K194K157k457j223K251J67k651k98J825m57j708L74J824K6j332O90K279
$$ -1673 521 2678 221 -1002 1249 1416 -1235 -1533 292 -165 -1873 -1499 325 351 -981 -291 1988
468A988n46k079J328J869k261j925K348O03k967j76K677p28k209J207J905j213
$$ 1988 1442 -637 691 2560 299 -1626 722 1325 -1642 -1818 859 131 -2078 -871 1034 -179
484a79j184J281J291j076r05J354J412j423j153J910O84k583p30K336p70k882
$$ -179 -1363 -82 1209 133 -772 582 1994 571 -582 1328 2012 -571 -1301 1035 265 -2617
500b617Q84K197j642j470K473J456j487p7K173M69j545l84J235k25k251n39J557
$$ -2617 -1733 464 -1178 -2648 -175 1281 -206 -283 1890 2359 814 430 1665 1440 -811 -1350 207
517B07n21k317P69K414j086j594K442J709k080n71K465nk313K24J621q63j642
$$ 207 -314 -2631 -1862 552 -534 -2128 314 2023 -57 -628 1837 1832 -481 -257 1364 501 -1141
534a141P00J229p08j349P95J476j065j532J477J378j962r84K491L65k312N32K384
$$ -1141 -441 788 80 -1269 -474 1002 -63 -1595 -118 1260 -702 -1686 805 1170 -1142 -610 1774
551A774r45j864J384J263j688j069J316N80j401n82J332P28j357n88J857M51k077
$$ 1774 829 -1035 349 1612 -76 -1145 171 751 -650 -1232 100 828 -529 -1117 740 1191 -886
568h86m5K136q78k178J264J922j716j104K392P83j848K1J811l22j698j26J044
$$ -886 -931 1205 327 -1851 -587 1335 -381 -1485 907 1690 -158 -137 1674 1352 -346 -472 572
585E72o71j773J60J536m63j476J411K189j148r64K307J000k295l33J926q28k385
$$ 572 -99 -1872 -1712 -176 -639 -2115 -704 1485 337 -627 1680 2680 385 52 1978 1150 -1235
602a235M49J218j324j364J114J108q28n89J340J175r17o65J568R11j837m20K063
$$ -1235 -786 432 -892 -2256 -1142 -34 -862 -1451 -111 1064 147 -518 1050 1961 124 -296 1767
619A767l38k330N82J734j605j701J358Q20j747n50J693N48j134K55J646N02j186
$$ 1767 1429 -901 -319 1415 -190 -1891 -533 287 -1460 -2010 -317 231 -903 -648 998 1500 314
636C14P7J640k66k058J68J427j421k072J262J246j833n93K237O04j583O24J863
$$ 314 391 2031 1765 -293 -125 1302 -119 -2191 -929 317 -1516 -2109 128 732 -851 -227 1636
653A636m55j413N25J006q19j409N16J095r13j154J222J322j484p97J963L96k178
$$ 1636 1181 -232 293 1299 480 -929 -413 682 -231 -1385 -163 1159 -325 -1122 841 1237 -941
670i41Q7J891q19j756J094J289j204p46J409Q42j137m06J162L96j252n41J267
$$ -941 -854 1037 218 -1538 -444 845 -359 -1105 304 1146 9 -397 765 1161 -91 -632 635
687F35K11j754j28J765m09j853J017J614j349j217J748P04j676j43J718Kj157
$$ 635 846 -908 -1036 729 320 -1533 -516 1098 -251 -1468 280 984 -692 -835 883 885 -272
704b72K57J302k14j253J75J055p20j664M81J170j314j281J721J011j493Q1K299
$$ -272 -15 1287 1073 -180 -5 1050 330 -1334 -853 317 -997 -2278 -557 454 -1039 -958 1341
721A341J88j545P30J406r54j466N51N24j307j076O67P86r61o88J515J062j263
$$ 1341 1529 -16 714 2120 1166 -300 251 775 -532 -1608 -941 -155 -1116 -1804 -289 773 -490
738d90j60K001J41j860M41J623j101j575J124R81j522p86J420K55j296k54J217
$$ -490 -650 1351 1492 -368 73 1696 595 -980 144 1125 -397 -1183 237 492 -804 -1058 159
755A59J44j176j9J412L3j269N51J654o63j433J206J031j639j014J506K7j753K2
$$ 159 303 -873 -892 520 553 -716 -165 1489 826 -607 599 1630 -9 -1023 483 510 -1243 -1221
773a221J447k72j149P57J245l93q17O84R18q07j099P96P98j307r65J612N07j623
$$ -1221 226 -46 -1195 -438 807 414 -403 281 1199 392 -707 89 887 -420 -1385 227 734 -889
791h89J59J864m10j486Q44J211j221j111R90N47j166n31J018O78q76j84J245N03
$$ -889 -730 1134 724 -762 82 1293 72 -1039 -49 498 -668 -1199 -181 497 -379 -563 682 1185
809A185j291j27J503l90j792N58J345j322j036J265P31j381k18J466J70j180J23
$$ 1185 -106 -233 1270 880 -912 -354 991 -331 -1367 -102 629 -752 -970 496 666 -514 -391
826c91J140k18j021K95J002l77j097N69J163q50j123J139P65j715n09J547p9j509
$$ -391 749 531 -490 -195 807 430 -667 -98 1065 215 -908 231 996 -719 -1228 319 240 -1269
844a269M20J509m12r38R53J006o53p12P18M15j014q56Q21M67j394m44J421L06
$$ -1269 -849 660 248 -690 263 1269 616 -96 622 1037 23 -833 -12 455 -939 -1383 38 344
862C44j349M73J656m86j283J037R76j262q31J149J86j188k03J000J60r77k3J222
$$ 344 -1005 -532 1124 638 -645 392 1368 106 -725 424 610 -578 -781 219 379 -598 -621 601
880F01qj250J75J305o17j295Q92J089j142p47J489N06j419N6J285l36j272L70
$$ 601 593 -657 -482 823 206 -1089 -197 892 -250 -997 492 998 -421 -365 920 584 -688 -318
898c18Q52n44r02M11R29n11o76Q12R87r36o70J154L81j465j83J311l50j411O30
$$ -318 534 -10 -912 -501 428 -83 -759 53 1040 104 -566 588 969 -496 -679 632 282 -1129 -499
917d99J189p24p95J013P46q96m79Q58L12r70m57R34J59j078q9J358j53j154N47
$$ -499 690 -34 -829 184 930 34 -445 413 725 -245 -702 232 391 -687 -776 582 429 -725 -178
936a78J253q95r69J015O03j296m74J218J06j065P3J135r4q55L22Q89l64r43K77
$$ -178 1075 180 -789 226 829 -467 -941 277 383 -682 -609 526 432 -423 -101 788 424 -519 -242
955b42R91q13j030J002P66j165l39J408K18j248J85J192m33j128N73P06p82p46
$$ -242 749 -64 -1094 -92 674 -491 -830 578 796 -452 -267 925 492 -636 -63 643 -139 -885
973h85P53O35o50m71R09N33r56l90J220mj373R8J170n00j163Q46R63q89n33J098
$$ -885 -132 503 -147 -618 291 824 -132 -522 698 694 -679 -581 589 89 -1074 -228 735 -154 -687 411
993D11M61r62k63Q04M3j016o3Q25o3r45K05J221m03j021Q07R62r35p58J004M56
$$ 411 872 -90 -353 451 494 -522 -585 240 177 -768 -563 658 255 -766 41 1003 68 -690 314 770
1013G70j280j23J153j52r84L45R99m22q15M69O88n97q15N81O79q17o81J149N42
$$ 770 -510 -633 520 368 -616 -271 728 306 -509 -40 648 51 -764 -183 496 -321 -1002 147 689
1032F89j051n4J395j20j193M02Q98q62r10N66O79j060l89P74M62o97p2J063K70
$$ 689 -362 -416 979 859 -334 68 966 104 -806 -240 439 -621 -1010 -236 226 -471 -543 520 790
1051G90r17MJ088k29j227K43R90q31r02Q77O39r30l66J030K19r15n4R82j33q15
$$ 790 -127 -123 965 736 -491 -248 742 -89 -991 -114 525 -405 -771 259 478 -437 -491 491 358 -457
1071d57J99Q10j92p54M24Q66n82q62P55O10j083o54J132K2j114J73J137k17q03
$$ -457 -258 552 360 -394 30 896 314 -548 207 817 -266 -920 212 234 -880 -707 430 213 -590
1090e90N93Q62m69o46N67M57p19o04O12L48r26l54R98K57r86K04J230l94r95O47
$$ -590 3 865 396 -250 317 774 55 -549 63 411 -515 -869 129 386 -600 -396 834 440 -555 92
1110I2P40r46o89Q26L87r79j57R66K90q19rR78nr02J13P20m68j038N23Q20q09
$$ 92 832 -114 -803 23 410 -569 -726 240 530 -289 -298 680 675 -227 -114 606 138 -900 -377 443 -366
1131c66o05R96M98r01j9R68j4q70K12P58l72o83K66O53m51o54N41N78p43n06P20
$$ -366 -971 25 523 -378 -397 571 557 -313 -101 657 285 -398 -132 521 70 -584 -43 535 -208 -714 6
1152FL90r92j99J075K9j034N21J024m17o15O99N89r11n45O30Q0q44m41O63K55
$$ 6 396 -596 -795 280 309 -725 -204 820 403 -212 487 1076 165 -380 250 330 -514 -955 -292 -37
1172c7p92K1J039J18p20M64R75m24q93O89M61j050n03P97R2r08r4Q45P6p49K41
$$ -37 -829 -808 231 349 -371 93 1068 644 -249 440 901 -149 -652 145 237 -671 -765 80 156 -593 -352
1193c52Q62j99o99L85O90n08p51P29O10q76m21R53J13r61p5J055l84q95L92O97
$$ -352 510 311 -388 -3 687 179 -572 157 767 -109 -530 423 536 -425 -500 555 171 -724 -332 365
1213C65m60n75N16O34m98l16O30M44o96m05P68L3q78j08R47k20r73M96Q62n76
$$ 365 -95 -670 -154 480 -18 -334 296 740 44 -361 407 440 -438 -546 401 181 -792 -296 566 -10
1233a0m75P10M29p21l71O05J64p67j10O50M3o09J56R42j83p39M64P06o59p47P12
$$ -10 -485 225 654 -67 -438 167 331 -436 -546 104 147 -462 -306 636 453 -286 178 884 225 -522 190
1254A90K39r64k85Q68J0q09L02Q06r0n58M20O94m22o37M26M80p28n17O34K51q26
$$ 190 429 -535 -820 48 58 -751 -449 357 267 -291 129 823 401 -236 190 670 -58 -575 59 310 -516
1275e16j83R70j2r65K69Q85l58o98M71O60n37l41O45L98o24k87O34J48q26k36
$$ -516 -699 271 259 -706 -437 448 90 -608 -137 523 -14 -355 290 688 64 -223 411 559 -267 -503
1295e03O51j41q71K61Q42k76p19O97P79n98k74P50K71p63k35N25j17q69%P09k10
$$ -503 148 7 -864 -603 239 -37 -756 -59 720 122 -152 598 869 106 -129 396 279 -590 -590 119 -91
1316i1n83L14P64k94n36N55O41p42m89P75J37q41r0Q95k17p01K99P18l90n81N22
$$ -91 -674 -360 404 110 -426 129 770 28 -461 314 451 -390 -480 415 198 -503 -204 514 124 -457 65
1337F5M89n79n61N96L07o77l01Q23J96o64l6R31j55q62K76P72n79o28N47M25o07
$$ 65 554 -25 -586 10 317 -360 -661 162 358 -306 -342 589 434 -428 -152 620 41 -587 -40 385 -222
1358b22k94P24J95n67j20O73L0p72K3P11k32p75L92O49l96n25P53M02o65k73P81
$$ -222 -516 208 403 -164 -284 389 419 -353 -330 381 149 -626 -234 415 19 -506 247 649 -16 -289 492
1379D92J9q18q4O77k65o96K44O54k86m97N41P08n39l56N27L49p83k42O40o6q15
$$ 492 511 -307 -391 286 21 -675 -431 223 -63 -560 -19 689 150 -206 321 670 -113 -355 285 219 -596
1400e96J14P66k31o55N06O87n38m79N99L77o41k69N72J98o87r4P63jo80J12P87
$$ -596 -482 284 53 -602 -96 591 53 -426 173 550 -91 -360 212 410 -277 -371 392 391 -289 -177 610
1421F10l72q03M29M91o08l88O78L33o85j6P46N7o51J03N92j68o81J28N34m09o81
$$ 610 238 -565 -136 355 -253 -641 37 370 -315 -331 415 472 -179 -76 516 348 -333 -205 329 -80 -761
1442g61M82N37m50m13P95L86p44n0O99j00p28J69O05m11n33L91M42l33l88M96
$$ -761 -279 258 -192 -605 190 576 -168 -218 481 381 -347 -178 427 16 -517 -126 316 -17 -405 91
1462I1M29n99k66O36O2p24J3P15j55p62L85P36m31m99N52M57o37m15N73J81o48
$$ 91 520 -79 -345 291 353 -371 -358 357 202 -560 -175 561 130 -369 183 640 3 -412 161 342 -306
1483c06j74O13J05o47R5P94j90o46M31O32n51n79M69K93o72k78P02J31o19L7P28
$$ -306 -480 133 238 -409 -314 480 290 -356 75 707 156 -423 46 339 -333 -611 91 222 -397 -360 368
1504C68j03n14K41N19l22n68L34M57n38l63N20L17n50k03P73P5o67l1P48l41o72
$$ 368 265 -249 -8 511 189 -379 -45 412 -126 -489 31 348 -202 -405 368 443 -224 -255 493 152 -520
1525e20L40M90l54m51N30L94m97k58O07K24n70j39N22q4p10J38O47k46n57L79
$$ -520 -180 310 -44 -495 35 429 -68 -326 281 505 -65 -204 318 234 -476 -338 309 63 -494 -115
1545a15N71m29l76O19J79o05j88N00Q3p02K7P28j54n16K42O83l26n27M09M40o08
$$ -115 456 27 -349 270 449 -156 -344 156 239 -463 -436 292 138 -378 -136 547 221 -306 103 543 -65
1566f5l95M89K32p06j08O87N8o48L11O71k20n04L46M97n26m69L46L47n64m11N67
$$ -65 -460 29 261 -445 -553 134 192 -456 -145 526 306 -198 148 645 119 -350 -4 343 -221 -632 -65
1587f5K30o02l0P84J4o70K87N64l12o33N19M28n63k63M84K50n95j99N61j8o36
$$ -65 165 -437 -467 317 331 -339 -52 512 200 -433 86 514 -49 -312 172 422 -173 -372 189 171 -465
1608d65K5N13n8o38L29O01k01m82O73M16n99k21N45M5o98j25N16j82o40K11N24
$$ -465 -440 73 15 -623 -294 307 106 -376 297 713 114 -107 438 483 -215 -340 176 -6 -646 -435 89
1629H9k70l20N04M83l30l00M82L06o44k77N84Ro79kO65k68n09K84N28l06m63M73
$$ 89 -181 -501 3 486 156 -144 338 644 0 -277 307 316 -363 -365 300 32 -477 -193 335 29 -434 39
1651C9L68n13k85M68J89m91j09O05O9n29P0N85k44n21K30M21m47m68N51L32n98
$$ 39 407 -106 -391 77 266 -225 -334 271 340 -189 -119 466 222 -299 -69 352 -95 -563 -12 320 -278
1672b78j43O88L2m88l3N43r9n91J86N39k51m93L98M30l88l28N21K95o00j94N86
$$ -278 -421 267 299 -189 -222 321 222 -369 -183 356 105 -388 10 440 52 -276 245 540 -60 -254 332
1693C32k00o20J8M73j70m03L81N88l26k64N51L99m98l17M86M7o92k31O25k31o24
$$ 332 132 -488 -470 3 -167 -570 -189 399 73 -191 360 759 261 -56 430 477 -215 -446 179 -52 -676
1714f76J50O14k29m04M93N13l07l28N11K07n19j73N71r1n18j20N27j83n79K22
$$ -676 -526 88 -141 -545 -52 461 154 -174 337 544 25 -148 423 332 -186 -306 221 38 -541 -319
1734c19N00l12m48M22M04l82k14O01K26m75lN83n4n16p0M55l39o47K31M44m13
$$ -319 181 -131 -579 -157 247 -135 -349 252 478 3 0 583 529 13 -57 398 59 -588 -357 87 -326
1755c26l16M75M48m16q2N86J46n30k7N40j69o08J24M17l46m33M03L59m08k22N76
$$ -326 -642 -167 281 -135 -217 369 515 -15 -42 498 329 -279 -155 262 -84 -517 -114 245 -163 -385 191
1776A91K17n82r7M92on29q4O64k53m33L11M93k41l61L98K81n51j28M64K6n99K9
$$ 191 408 -174 -271 221 215 -314 -398 266 13 -420 -109 384 143 -218 180 461 -90 -218 246 272 -327 -298
1798b98M18q3m84J69N61j76m58K99N32m65l53N67J87m79j64N37P4n78N3M23j56
$$ -298 120 37 -447 -278 283 107 -351 -52 480 15 -338 229 416 -63 -227 310 384 -194 -141 282 126
1819A26n57K09M20l77m22L35M48m05j88O49K05l35j53N92m5n87O5L50l46n74K43
$$ 126 -431 -222 198 -179 -601 -266 182 -223 -411 238 443 108 -45 547 502 -85 -20 330 -16 -590 -347
1840c47M15m43j71M55L26l37l0N46K8l97ML68j17n06R8L67l23l64K98L86l98k60
$$ -347 68 -375 -546 -91 235 -102 -132 414 442 45 49 417 300 -206 -108 259 -64 -428 -130 256 -142 -402
1862d02M73J31m36m1N09jm63J56M75k21l56K34L48l35m00L56K29m89k45M41J34
$$ -402 71 202 -234 -275 234 233 -230 -74 401 180 -176 58 406 71 -329 27 256 -233 -478 -37 97
1883I7m76L5O32n0n13K36N29l28l64L39K26m29l12L57K04m14j02M63J51m65N3
$$ 97 -379 -344 288 238 -275 -39 490 162 -202 137 363 -66 -378 -21 183 -231 -333 130 281 -184 -131
1904a31N24j98n19J84M59l13m96M00K78l54j72N72R8l63q1M14l0m16K8L85k41
$$ -131 393 195 -324 -140 319 6 -490 -90 188 -166 -338 234 332 -31 -112 302 272 -144 -116 269 28
1925B8m35K29M08l21l20M52L10m46j38M91N4m48M0L17j15l62J82L57k15l47K96
$$ 28 -407 -178 230 -91 -411 41 351 -95 -233 258 312 -136 -96 221 106 -256 -74 283 68 -279 17
1946A7K85l87k39L91J69m85j02M69L8m50K01M53j53l81K37L73l55l58L27J33l51
$$ 17 302 -85 -324 67 236 -249 -351 118 156 -294 -93 360 207 -174 63 436 81 -277 50 183 -168
1967a68k06M21O1l96N8N53p6l36J57L29k64l58L05K40l62l55M12J99m24o6M73
$$ -168 -374 47 108 -288 -230 323 247 -89 68 397 133 -225 80 320 -42 -397 15 214 -210 -276 197
1988A97N0m44P9M31k11l57K38L04k73k48K80K38k87k12L59J69m47r9M29q7m81
$$ 197 247 -197 -118 313 102 -255 -17 287 14 -234 46 284 -3 -215 144 313 -134 -233 196 109 -372
2009c72J74L95k22l09L81K47k11k00L01J91m01k17L85J8m74L8L53l0m40K66M48
$$ -372 -198 197 -25 -334 47 294 83 -117 184 375 -26 -243 142 160 -314 -276 77 47 -393 -127 321
2030C21k68k50M01K26m28k24M36Qm13j01M11K5m34Q2M68k18l19J98L41k90l14
$$ 321 53 -197 204 430 2 -222 214 222 -191 -292 119 144 -290 -208 260 42 -277 -79 262 -28 -342
2051c42L38J97k87j38M41P7m11L1L71j75l35Q4L64k83l14K52K57k75j49L73J65
$$ -342 -4 193 -94 -232 209 286 -125 -94 277 102 -233 -149 215 -68 -382 -130 127 -148 -297 76 241
2072B41k76r3M66j8m06K3L28k63l33J91L50l50k65M22K75l00j52L90Q9l78j17
$$ 241 -35 -128 338 320 -86 -63 265 2 -331 -140 210 -140 -405 17 292 -8 -160 230 319 -59 -176
2093a76L44k3m45J40L37k04l30L40L04j91l35L44J93m10j16L96n7m36j5M26o4
$$ -176 168 145 -300 -160 177 -27 -357 -17 287 96 -239 105 298 -112 -228 168 111 -325 -340 86 22
2114B2l48K59L23j57l11K64K67l44j95K77J79m23l6M31j23l97J86L52k08l35J53
$$ 22 -326 -67 256 99 -212 52 319 -25 -220 57 236 -187 -223 208 85 -312 -126 226 18 -317 -164
2135a64L22k15k59L68J99k62q3M02O3l04j08L65j03m69J06K24k70l06K70K72k06
$$ -164 158 -57 -316 52 251 -11 -94 308 371 67 -41 324 221 -248 -142 82 -188 -494 -224 48 -158
2156a58j27M81J34k60J7L77r4l66n2K68k33k70L1L11k61k46L16K79l04m0L76P8
$$ -158 -285 196 330 70 87 464 370 4 -48 220 -13 -283 -252 59 -202 -448 -132 147 -157 -197 179 257
2178B57l16oL63m6l96R7L04j92k82J38L32k87k43J87K00l30j26M49O5l45O4M24
$$ 257 -59 -65 298 252 -144 -47 257 65 -217 -79 253 -34 -277 -90 110 -220 -346 103 168 -177 -113 311
2200C11q6k90K24J88k43k36J41Q0k51j61K06K55l43J6L52P6k84k5L35j59l62K13
$$ 311 225 -65 159 347 104 -132 9 89 -162 -323 -117 138 -205 -189 163 239 -45 -70 265 106 -256 -43
2222d3K01k51k51L21K60l55j18M59Q3l72k4L42j29l86L2L21k13k52K72K29k17
$$ -43 158 -93 -344 -23 237 -118 -236 223 306 -66 -90 252 123 -263 -231 90 -123 -375 -103 126 -91
2243i1j30L05K98l35m0L51r1l11K2L29l00k87J57K40k07k41K87J48k62o8K70J90
$$ -91 -221 84 382 47 7 358 267 -44 -22 307 7 -280 -123 117 -90 -331 -44 104 -158 -226 44 234
2265B34l36L8L45M1l34J52L22k53l49J68J19k65l11K56M9k52k7M53R9k51L9M78
$$ 234 -102 -64 281 322 -12 140 462 209 -140 28 147 -118 -429 -173 -124 -376 -403 50 149 -102 -63 415
2287D15n3l15J94J50k24l96K44Q7l00k89L56P9k57R9L89kl16J58K48p1l10J88
$$ 415 362 47 241 391 167 -229 15 102 -198 -487 -131 -52 -309 -210 179 177 -139 19 267 196 -114 74
2309G4J72k12k21K23J12k13j91L07P6k72j04L05k8k64J33K87j71j88K24J94k22
$$ 74 246 34 -187 36 148 -65 -256 51 127 -145 -249 56 28 -236 -103 184 13 -175 49 243 21
2330B1j35K24J21l39j17L08M6l34J7K98r2k27K19K06j99k33K42J51l10q8L35m
$$ 21 -114 110 231 -108 -225 83 129 -205 -188 110 18 -209 10 216 17 -216 26 177 -133 -221 114 110
2352A10k69J4L35Mk43P6L45j54l15J37J11k43k36J88J88l43j2L75Q4k77J74L20
$$ 110 -159 -145 190 194 -49 27 372 218 -97 40 151 -92 -328 -140 48 -295 -307 68 152 -125 49 369
2374C69n2k98J00J85k41k09M3J47k50p8J70J29k88m1L90K2k92O3L82j24k68K13
$$ 369 317 19 119 304 63 -146 -103 44 -206 -284 -114 15 -273 -314 76 98 -194 -131 251 127 -141 72
2396G2K51k68k00K40J27l70j39L21n9k66L6K89o6j88J82K82j03k05K13K65k89
$$ 72 323 55 -145 95 222 -148 -287 34 -25 -291 -255 34 -32 -220 -38 244 141 -64 149 414 125
2417A25j96K18N3l97j7K50j14k61J43L04J4l18K39K26j99j98J60K62l79j05K98
$$ 125 -71 147 200 -197 -214 36 -78 -339 -196 108 122 -196 43 269 70 -128 32 294 -85 -190 108
2438A08m0k92J07J97pk05J08K29j32k16J07K11k48j64L07M1k14j02L22O0k95N1
$$ 108 68 -224 -117 80 73 -132 -24 205 73 -143 -36 175 -73 -237 70 111 -103 -205 117 177 -118 -67
2460f7K98k4m07J09K52k29q6J36J99k68l5K72N8l39K7K39o6k12j0L26q4k47J78
$$ -67 231 207 -200 -91 161 -68 -154 -18 181 -87 -122 150 208 -131 -104 135 69 -143 -153 173 89 -158 20
2483B0K14j89j08J82R4l07l4J64J0l06R1K35r2j78K04K24j31k10K86J38l01j64
$$ 20 234 45 -63 119 213 -94 -128 36 46 -260 -169 66 -26 -204 0 224 93 -117 169 307 6 -158
2505a58K04P3k65j00K93ok57N8L18j56r1R1K79k11k35K50J32k65j33L02Lk21k1
$$ -158 46 119 -146 -246 47 41 -216 -158 160 4 -87 4 283 72 -163 87 219 -46 -179 123 126 -95 -116
2528a16L16j04k98J55K29j07l25J88J76j01j73K63O9k34kK76l1k18p7J92j1k87
$$ -116 200 96 -202 -47 182 75 -250 -62 114 13 -160 103 172 -62 -64 212 181 -37 -114 78 67 -220
2550b20R6K06j56j54J85K25j57j24K61P7l39oK92o6l21Q2K93j90k43J61K85j44
$$ -220 -124 82 -74 -228 -43 182 25 -99 162 239 -100 -106 186 120 -201 -119 174 -16 -259 -98 187 43
2572D3k16K28J47k44j14K62J7k74mK85l2k43R4K79j57k24J85J22j86j35J77R6
$$ 43 -173 55 202 -42 -156 106 123 -151 -155 130 98 -145 -51 228 71 -153 32 154 -32 -167 10 106
2594A06l15O4K61K7k53Q7K47j19k29R5J62j87j86J71O0j72mK16J57k91N8K24l0
$$ 106 -209 -145 116 143 -110 -23 224 105 -124 -29 133 -54 -240 -69 -9 -181 -185 31 188 -103 -45 179 149
2617A49k77J35J30j18k02K09R4j69j79K21J44k38m1K85j5l52J21K05o5j83J16
$$ 149 -128 7 137 19 -183 26 120 -49 -228 -7 137 -101 -142 143 128 -224 -103 102 37 -146 -30
2638c0J89j68j16J92J52k71n4K11N7k99J7K30p4j96J2K65l2l07J94K90k59j20
$$ -30 159 -9 -125 67 219 -52 -106 105 162 -137 -120 110 36 -160 -148 117 85 -222 -28 262 3 -117
2660a17J39J03k55nK28q1j43K5K21jk53Q5K44j82k52K32J24j80k09K44J29j83
$$ -117 22 125 -130 -135 93 12 -131 -106 115 114 -139 -54 190 8 -244 -12 112 -68 -277 -33 96 -87
2682h7p7L39l5k28J05K02j19j75L6J81j63j85J36J90k53o8K26J37k51k2L62r5
$$ -87 -164 175 140 -88 17 219 100 -75 -39 142 -21 -206 -70 120 -133 -201 25 162 -89 -111 251 156
2704A56k27J51J61j89k01J64J55j75k03K31Q2k35lJ81l1j61P3K01p1j80J69J28
$$ 156 -71 80 241 52 -149 15 170 -5 -208 23 105 -130 -133 48 17 -144 -71 130 59 -121 48 176
2726A76q9j32J44J52k81j46J64j3k84P3K66k1j49M3K90q6j98K17J22j44j45J25
$$ 176 87 -45 99 251 -30 -176 -12 -25 -309 -236 30 9 -140 -97 193 107 -91 126 248 104 -41 84
2748H4L5j65j17K23k0j86k1K31Mj60P2J88j60k31K83N6j92l0J89N4k56K3K58l0
$$ 84 119 -46 -163 60 40 -146 -167 64 68 -92 -20 168 8 -223 60 116 -76 -106 83 137 -119 -96 162 132
2772A32j80k4J88r7j92P1K43j98j44J59J44k11n7K30K3k35Q3J82j4k42P3K06j72
$$ 132 -48 -72 116 19 -173 -102 141 -57 -201 -42 102 -109 -166 64 87 -148 -65 117 103 -139 -66 140 -32
2795c2j46K04J38j56j22J56Q8k66PJ99l9j81M3K07m1j30R0K65j67p7N3N4j20k40
$$ -32 -178 26 164 8 -114 42 130 -136 -129 70 31 -150 -107 100 59 -71 19 284 117 40 93 147 27 -213
2819b13J83O4k46l6J70L5j27O1K44p2o0J14R2j31j22J04L8j99r7K45n5k00J3K02
$$ -213 -30 34 -212 -248 -78 -43 -170 -109 135 63 3 117 209 78 -44 60 98 -101 -198 47 -8 -208 -195 7
2843GJ9k10R9J98j28j64J93J36j25n6J54Q0k68j2K42j08k00N2J64j41j19M2K48
$$ 7 26 -184 -85 113 -15 -179 14 150 25 -31 123 203 -65 -77 165 57 -143 -91 73 -68 -187 -145 103
2866A03j47j48K83J05j25j47K83Rk96m2K23j14j65L1K81r7k43J79K03j60o9J88
$$ 103 -44 -192 91 196 71 -76 207 216 -80 -122 101 -13 -178 -147 134 37 -206 -27 176 16 -53 135
2888A35K8k28o0J29P0k05j2K05j1j88J20K27k12j19K10N6k66J5O7N5j90L8J55
$$ 135 163 -65 -125 4 74 -131 -143 62 51 -137 -17 210 -2 -121 89 145 -121 -106 -39 16 -174 -136 19
2911A9M3j73N8J31M8j98Q6K07r9j67R7J02k75pK59k6k32Q3J22j12j79K07J16o6
$$ 19 62 -111 -53 78 126 -72 14 221 122 -45 52 154 -121 -128 131 105 -127 -44 78 -34 -213 -6 110 44
2935D4k21K36J02j50mJ51L4k04k8Q5l6k23O2J70j28j38K05J38j26q4J77J77k17
$$ 44 -177 59 161 11 7 158 192 -12 -40 45 9 -214 -152 18 -110 -248 -43 95 -31 -115 62 239 22
2958B2l6J86m3j70k3J76j8k71N6J96j26j12Q5K27j52o5J64M2j68m1K14j5k36J17
$$ 22 -14 172 129 -41 -64 112 94 -177 -121 75 -51 -163 -78 149 -3 -68 96 138 -30 -71 143 128 -108 9
2982IJ23j01j45Q0J37j22q2J12N8j77m0J89K1j82N7K12o1j73M0J90j21j93J80
$$ 9 132 31 -114 -34 103 -19 -101 11 69 -108 -148 41 62 -120 -63 149 88 -85 -45 145 24 -169 11
3005A1N2j63n3J82P2j55o0K00Mk17O0J63q9j48P0J63o8j65J85Q2r2o3J82J9j92
$$ 11 63 -100 -153 29 101 -54 -114 86 90 -127 -67 96 7 -141 -71 92 24 -141 44 126 34 -29 153 172 -20
3030b0jJ23n6j67o1K45j25j36J72J79j36p4J31J31k14p1K28nj81p8K19r2k29J65
$$ -20 -21 102 46 -121 -182 63 -62 -198 -26 153 17 -57 74 205 -9 -80 148 143 -38 -116 103 11 -218 -53
3054e3J34r6j26J64P2j69m5J83N8k11k6K45n6j33N2J43j10j21mJ30j09j64K57
$$ -53 81 -15 -141 23 95 -74 -119 64 122 -89 -115 130 74 -59 -7 136 26 -95 -99 31 -78 -242 15
3077A5R5k22J9J47Lp5pK10Kk09j9K12j25j92J62O6j38j46J94J60j84l9J76O5k54
$$ 15 110 -112 -93 54 57 -18 -25 185 187 -22 -41 171 46 -146 16 82 -56 -202 -8 152 -32 -71 105 170 -84
3102h4M3J57j04j06K8J45j45p5J17J57j63p8J41L8j58RJ11mj69N9J70n9j25J52
$$ -84 -41 116 12 -94 -66 79 -66 -141 -24 133 -30 -108 33 71 -87 -78 33 29 -140 -81 89 30 -95 57
3126E7Q0j64l6O4J39j56r2J83K7k42Q9J69p6j78J56Q3k0j49J62K7j71n8J09Q6
$$ 57 137 -27 -63 1 140 -16 -108 75 102 -140 -51 118 42 -136 20 103 83 -66 96 123 -48 -106 3 89
3150H9j79M8J04L1j56O9J07j00n6j4J10r6j29J78O3j17m8J87L0j49n4J67j0j87
$$ 89 -90 -42 62 93 -63 6 113 13 -43 -57 53 -43 -172 6 69 -48 -96 91 121 -28 -82 85 75 -112
3174a12N8J11j03r8J28P3r4l1J75m0j20k1K10n8j38J9J49r8j25R8K07j60j16J06
$$ -112 -54 57 -46 -144 -16 57 -37 -68 107 67 -53 -74 136 78 -60 -41 108 10 -115 -17 190 30 -86 20
3198B0Q0n4n5O6L3j35n6J99l3k03O5K05m5k02J88J39k40j27J46M6j24m3J01J11
$$ 20 100 46 -9 57 90 -45 -101 98 65 -138 -73 132 87 -115 73 212 -28 -155 -9 37 -87 -130 -29 82
3222H2k28J27J00j16l8R7R0j56O0k0L3o8j50J86P4j57m6K33l0j34J06J17k16p6
$$ 82 -146 -19 81 -35 -73 24 114 -42 18 -2 31 -37 -187 -1 73 -84 -130 103 73 -61 45 162 -54 -130
3246a30Q5J78j63p6K06k3j15J1J26Pj96M1J18n6q5jJ26q9o7J03J25j46l3J43K
$$ -130 -45 133 -30 -106 100 77 -38 -27 99 106 -90 -49 69 13 -72 -73 53 -36 -103 0 125 -21 -54 89 91
3271I1j28n6J32L1j76J0J84n9j98J20K02j03j34J12R8p8j55J91Lj70KJ57r2q2
$$ 91 -37 -93 39 70 -106 -96 88 29 -169 -49 153 50 -84 28 126 48 -107 84 87 -83 -81 76 -16 -98
3295i8M0J38j36l7J79k7p0r7J00R3j37j0J53k8j48P7J15k8j02P2K3o1j25J35L1
$$ -98 -58 80 -56 -93 86 59 -11 -108 -8 85 -52 -62 91 63 -85 -8 107 79 -23 49 72 11 -114 21 52
3320E2j50j4J53O9j90N5P9L0j48J3J13q3j32J57R3r5j07J38O0j38J1J48l6j38
$$ 52 -98 -112 41 110 -80 -25 54 84 -64 -51 62 -21 -153 4 97 2 -105 33 93 -45 -34 114 78 -60
3344f0K9J02j17n9J21Q2m8j57J06R5k7p2J34k4p5q8P8N4j46PJ18j11n6J20Q8r1
$$ -60 -31 71 -46 -105 16 98 50 -107 -1 94 67 -5 129 105 30 -58 20 74 -72 -65 53 -58 -114 6 94 3
3370Co3J51Nj01p6J54j1r1PR1p5q7J05R3o7j85J40L2q6j16K10J03k28M3J50Nj32
$$ 3 -60 91 96 -5 -81 73 62 -29 -22 69 -6 -93 12 105 38 -147 -7 25 -61 -177 33 136 -92 -49 101 106 -26
3397b6N5J19j53l5n8J44lj15M7O1j15k3J46K2j44L7J67o2j99P2J45j22o0N5J60
$$ -26 29 148 -5 -40 -98 46 43 -72 -25 36 -79 -102 44 66 -78 -41 126 64 -135 -63 82 -40 -100 -45 115
3422A15j08q9J25N3r0m1J51p9j4k5J36j40j09J22J12j28n9J29L2j65j9J58m6j27
$$ 115 7 -82 43 96 6 -35 116 37 23 -2 134 -6 -115 7 119 -9 -68 61 93 -72 -91 67 21 -106
3446a06jJ58n4j73R1J60o2p1P7R7j73l4R2J34k23K8J25j0j74Q0R2m8j27O5J92
$$ -106 -107 51 -3 -176 -85 75 13 -58 19 116 -57 -91 1 135 -88 -60 65 55 -119 -39 53 5 -122 -57 135
3471A35j51j09J21L0j06l9J90N0j61N9R0J9q5LP9p3j54N6J78j55j03R3P5p8o0
$$ 135 -16 -125 -4 26 -80 -119 71 121 -40 19 109 128 43 46 125 52 -102 -46 132 -23 -126 -33 42 -36 -96
3496i6J96M9j94J4J25l0r7k1J45p2j09J12N2q8j9N8j1p1k5R5k0j03J8J86q5l7
$$ -96 100 149 -45 -31 94 64 -33 -54 91 19 -90 22 74 -14 -33 25 14 -57 -82 13 -7 -110 -92 94 9 -28
3522b8O3N5p8L4OKr3k9P8Ll2m0R7K6j99J39J42j56m6J16Q1j41o6J15K0j74L1J26
$$ -28 35 90 12 46 52 54 -39 -68 10 13 -19 -59 38 64 -135 4 146 -10 -56 60 141 0 -66 49 69 -105 -74 52
3550E2Nj54Q6J09j8j73O6J30j30j11J55J9j03n8K28n5j24L3J16%j27L4O5k3j34
$$ 52 57 -97 -11 98 80 -93 -27 103 -27 -138 17 36 -67 -125 103 48 -76 -43 73 73 -54 -20 45 22 -112
3575a12Q5M2r2m3J46O0j25K1J46m7r6n1K15j33p8R0J7l0j16Q4Q6q5m7R8m8m1m8
$$ -112 -27 15 -77 -120 26 86 -39 -18 128 81 -15 -66 149 16 -62 28 45 15 -101 -17 69 -16 -63 35 -13 -54 -102
3602a02J38o8Jl1J17nj52J38J17j21q4J25o6o6m4J10P1j86P1R2j6j20P4O2J4j02
$$ -102 36 -32 -31 -62 55 50 -102 36 153 32 -52 73 7 -59 -103 7 78 -108 -37 55 39 -81 -7 55 69 -33
3628c3J7Q9r0j03J40L6j07mJ06m4q6M3R7m5q7J01N8k8l9L2k2o6mR6Rj20l9K34
$$ -33 -16 73 -17 -120 20 56 -51 -55 51 7 -79 -36 61 16 -71 30 88 60 21 53 31 -35 -39 57 66 -54 -93 141
3656A41j15r0O0O6j09p4P5Q6l4o7O0R6j20l7Q5J3j14J6N3No8M1R1q8p5J67P0j59
$$ 141 26 -64 -4 62 -47 -121 -46 40 6 -61 -1 95 -25 -62 23 36 -78 -62 -9 -4 -72 -31 60 -28 -103 64 134 -25
3684b5p5J77j9j01K4L1k1p7J00O9rj05j1J76r7q3L0P3j29k9J38%j18J5J50j10
$$ -25 -100 77 58 -43 -19 12 -9 -86 14 83 74 -31 -42 134 37 -46 -16 57 -72 -101 37 37 -81 -66 84 -26
3710b6mm8J92j13n1O3K3q6l4N1lJ7mJ34o1r1N6M8j03LK9P2j46kP8Ok4k8R4M1j37
$$ -26 -30 -78 114 1 -50 13 36 -50 -84 -33 -36 -19 -23 111 50 -41 15 63 -40 -37 -8 64 -82 -84 -6 0 -24 -52 42 83 -54
3741e4K2J10l0r2lR0r7j6O2Q6j13K7O7M5j34mL9Kp0L8P8J8j18M0Q8J7j54P3M6
$$ -54 -32 78 48 -44 -47 43 -54 -70 -8 78 -35 -8 59 104 -30 -34 5 7 -63 -25 53 71 -47 -7 81 98 -56 17 63
3770F3j24KO6O3k28J61Q2r8j11R4J56j07o4O7L7l7j47Q2O1k6m9OR8j33P0O5l6
$$ 63 -61 -59 7 70 -158 3 85 -13 -124 -30 126 19 -45 22 59 22 -125 -43 18 -8 -57 -51 47 -86 -16 49 13
3797A3m2P9L6j23m2R0P2j54oJ38K7j65P0R1k7k6l3J46j38n9J7P9k6p2J10L1o4
$$ 13 -29 50 86 -37 -79 11 83 -71 -77 61 88 -77 -7 84 57 31 -2 144 6 -53 -36 43 17 -55 55 86 22
3824B2q8J30l8j18K6J63j31k8N5M8n2J4k7Q1j18RM8J9j0n8Q4o0Jk1J06k2r6L1
$$ 22 -66 64 26 -92 -66 97 -34 -62 -7 41 -11 3 -24 57 -61 -52 -4 15 5 -53 31 -29 -28 -49 57 35 -61 -30
3852c0P1r2L8N7Kj15J7P9j4J3K5rk2p1O5J56j34r1K6J27j33nO5O9j02M7L1J4j13
$$ -30 41 -51 -13 44 46 -69 -52 27 13 26 51 42 20 -51 14 170 36 -55 -29 98 -35 -40 25 94 -8 39 70 84 -29
3881b9j2J27n8q0pJ12o2q5J12njj03Q4P4l5k2j4P0j32R6J1j02j7L0Q7k5o2K3J13
$$ -29 -41 86 28 -52 -59 53 -9 -94 18 13 12 -91 -7 67 32 10 -4 66 -66 30 41 -61 -78 -48 39 14 -48 -25 88
3910H8j06l9J21j8r5pJ24k3r7Q1P8q1o1J58Lj64j4O0J0p8q2J86m9n2P5O2l1m4
$$ 88 -18 -57 64 46 -49 -56 68 45 -52 29 107 26 -35 123 126 -38 -52 8 18 -60 -142 44 -5 -57 18 80 49 5
3938EJ1J56j23j00RN1or4J36m4o9n8J48j4j19J50J2n3nj2O0j0m6N8K5p4QM5M3
$$ 5 16 172 49 -51 -42 9 3 -91 45 1 -68 -126 22 8 -111 39 51 -2 -7 -19 41 31 -15 43 68 -6 2 47 90
3967I0j55K4M1rk8kO3k3o6J63N6j89L5K6M2q2qM0Rn7M7N4q4k1M4J6m8k8P1Ko3
$$ 90 -65 -41 0 -9 -37 -39 24 1 -65 98 154 -35 0 26 68 -14 -22 18 27 -30 17 71 -13 -34 10 26 -22 -50 21 23 -40
3998d0rN7j3o9M1P7l6p6J00%l5k3M5Ll8JN3J6n7j08J58j7j06L0K09j01j35J20
$$ -40 -49 8 -5 -74 -33 44 8 -68 32 32 -3 -26 19 22 -16 -15 38 54 -3 -111 47 30 -76 -46 163 62 -73 47
4026D7l5k4n4J51o0J7r8J01K7o3n0J14K1j23J1L0J7j41J13N5r0l4J47k4n8MK6
$$ 47 12 -12 -66 85 25 42 -56 45 72 9 -41 73 94 -29 -18 12 29 -112 1 56 -34 -68 79 55 -3 1 27
4053B7kp6OO3K0j15O9K6pr3R2m2M2J7N6Nj08q3J47k9j07L1J54n1j05M5Q6n9o1
$$ 27 25 -51 -45 18 38 -77 -8 18 11 -82 10 -32 10 27 83 88 -20 -103 44 15 -92 -61 93 42 -63 -18 68 9 -52
4082e2J1J18n3k3N3J6j17J7P9n6m2O2J8oo4P6o6O8o4K6q7Q1m1J83j05r5P8j7o2
$$ -52 -41 77 24 1 54 70 -47 -30 49 -7 -49 13 31 25 -39 37 -29 39 -25 1 -86 -5 -46 137 32 -63 15 -2 -64
4111f4mk0P7Oj09Q4L3n1kJ12K0j00Km8J13j44J07J5k9p0qR9n4j0P6P3j44nR0O
$$ -64 -68 -88 -11 -5 -114 -30 3 -48 -50 62 82 -18 -16 -64 49 -95 12 27 -2 -72 -80 19 -35 -45 31 104 -40 -45 45 51
4141E1p3N4L8n9q5Q5J7k5MJ5%p3nJ32j4r4rR1n1j14O8J75j40l2NJ21r6%k2O4p1
$$ 51 -22 32 70 11 -74 11 28 3 7 22 22 -51 -56 76 62 -32 -41 50 -1 -115 -47 128 -12 -44 -39 82 -14 -14 -36 28 -43
4172d3pK1Ko1L1Q1n0k9L9QK4m3K3Q6j39J6L6O1n9j01R5L4J3J1jmq6J19j9l9q5
$$ -43 -50 -29 -27 -88 -57 24 -26 -55 -16 -8 16 -27 -4 82 -57 -41 -5 56 -3 -104 -9 25 38 49 48 44 -42 77 58 19 -66
4203f6J13qq8k4J16Jp2j00J65k3r0J00O5q3p5R1K5j23m8J90j01L7j9K6ml2pk1
$$ -66 47 39 -49 -73 43 44 -28 -128 37 14 -76 24 89 6 -69 22 47 -76 -124 66 -35 2 -17 9 5 -27 -34 -55
4231e5K0LM3N0m3j01J9J21n3p9J24l3n9J6J06o2m0L4N9o5L8j4L0j05PN7Qk0m4
$$ -55 -35 -32 11 61 18 -83 -64 57 4 -75 49 16 -43 -27 79 17 -23 11 70 5 43 29 59 -46 -39 18 26 6 -38
4260c8J6M2J7l7J01m3k3m0J6j4m2J7N3p2J0O3k4l2J6J8M1p4%K0J6o3N4L9n4jM3
$$ -38 -22 20 37 0 101 58 35 -5 11 -3 -45 -28 25 -47 -37 26 2 -30 -14 4 45 -29 -29 -9 7 -56 -2 37 -17 -18 25
4291B5O8j40m9R2%Qm6j9M4p9J22%p0L2NM6p3M9N6k0j28M1J03l5m9M6L2j6j9k9
$$ 25 93 -47 -96 -4 -4 4 -42 -61 -17 -96 26 26 -44 -12 -7 39 -34 15 71 51 -77 -36 67 32 -17 29 61 45 26 -3
4321cP8n6r4P3m3k1J6J8P2p4oO1K6j11P5Jp9K9PR1j7j34Q0Q9j03n4L4J17j24L5
$$ -3 75 19 -75 -2 -45 -66 -50 -32 40 -34 -40 21 47 -64 11 12 -67 -38 -31 60 43 -91 -11 78 -25 -79 -45 72 -52 -17
4351a7J8J5m2J5N3M9m4l4J8M6j05L9O7j50P7M1k4n3K9PL0n3k5R0l2l0M6l3Nn6
$$ -17 1 16 -26 -11 42 91 47 13 31 77 -28 11 78 -72 5 46 22 -31 -2 5 35 -18 -43 47 15 -15 31 -2 3 -53
4381e3P4km6qK1Oo4L6J02q6n6N2K0m9O5L5Rj22J3J15l8l3q4J67j48QM8km2O9O6
$$ -53 21 19 -27 -35 -14 -8 -72 -36 66 -20 -76 -24 -4 -53 12 47 56 -66 -53 62 24 -9 -93 74 -74 -66 -18 -20 -62 7 73
4412G3k2n4m5N6n6L4L9M1q2LL5L6j2m1QJ1k6K0NK3K6o8L0J7n2k2P6m3n8P2j7L7
$$ 73 51 -3 -48 8 -48 -14 25 66 -16 -13 22 58 46 5 13 24 -2 18 23 46 72 4 34 51 -1 -23 53 10 -48 24 7 44
4444D4p2O5L7l8m8O5q7J4mK9Nq9OL4k4O2q1J25qj04J06K4l3l3mL2o0kN0Nl8K1
$$ 44 -28 37 74 36 -12 53 -34 -20 -24 5 10 -79 -73 -39 -63 -1 -82 43 35 -69 37 61 28 -5 -9 23 -37 -39 11 16 -22 -1
4476aK7L7l9l3J38p4m8M1O2j00r1J17K5n9p0J01n3mK4K7Lo0jK4J4j8N0on8J6j7
$$ -1 26 63 24 -9 129 55 7 48 110 10 -81 36 61 2 -68 33 -20 -24 0 27 30 -30 -31 -7 7 -11 39 33 -25 -9 -26
4507b6M2n2l9J07q7J9o5R0J7q5Q5P7r7m3J21l2n9lK0k1J8j8P2m0l2J0O0r7N8O7
$$ -26 16 -36 -75 32 -55 -36 -101 -11 6 -79 6 83 -14 -57 64 32 -27 -30 -10 -31 -13 -31 41 1 -31 -21 39 -58 0 67
4537F7n1K4q2M7P0j01l3J20j7j4J9k2m7j7O9q4J3oM9Lk1p5J42o4l7O0j5l1k0O0
$$ 67 16 40 -42 5 75 -26 -59 61 44 30 49 27 -20 -37 32 -52 -39 -45 4 7 -14 -89 53 -11 -48 12 -3 -34 -54 6
4567FnJ7j07J29K3q6k1J2Nj2O0Qk5m6Q3l8j9j2n5J57o5j6M5J1l5L3pl5J4K5k9
$$ 6 1 18 -89 40 63 -23 -44 -32 -27 -39 21 29 4 -42 41 3 -16 -28 -83 74 9 -7 38 49 14 47 40 5 19 44 15
4598A5l9k7N1K4rn4J2L5Q1j12J4J8l2J0J6M6o9K5j4L3q8L2J23o4j05R2K6p3o3
$$ 15 -24 -51 0 24 15 -39 -27 8 89 -23 -9 9 -23 -13 3 49 -20 5 -9 24 -64 -32 91 27 -78 14 40 -33 -96
4627i6J45J2n0L0kj08L4M8L0p3k7M9Mn3J1J46l4r0N1J9m6m9L2O0j7n9N5M3p7K0
$$ -96 49 61 11 41 39 -69 -35 13 43 -30 -57 -8 -4 -57 -46 100 66 -24 27 46 0 -49 -17 43 26 -33 22 65 -12 8
4657Hl4Rm3O4M8j3o3J3J45j50l1LO2L4p7L8k6p9R1oK5r9P7M2l9r7J02k1J2j04
$$ 8 -26 -17 -60 4 52 39 -24 -11 134 -16 -47 -44 18 52 -25 13 -13 -92 -1 -7 18 -81 -4 38 -1 -98 4 -17 -5 -109
4687a09P5J1Nl8R0N7j18PN4O3j31M7lM2j01K2M6m2NO4K0k4n1O4l9k0j6PN1m2p0
$$ -109 -34 -23 -18 -56 34 91 -27 -20 34 97 -34 13 10 52 -49 -27 19 -23 -18 46 66 42 -9 55 16 -4 -20 -13 38 -4 -74
4718g4J07q1J9L4K3mro8J00j34K8N0N3j14Q0M4r4K3RO4q8k5N9O5k6o9JK6m9O6
$$ -74 33 -48 -29 5 28 24 15 -53 47 -87 -59 -9 44 -70 10 54 -40 -17 -8 56 -32 -57 2 67 41 -28 -27 -1 -50 16
4748A6p6J14l4m1N4p7L4J4k8m9L2J3J12j21k3O1P2j30L0O1nn2K9%j3L2Kj9k2O
$$ 16 -60 54 20 -21 33 -44 -10 4 -24 -73 -41 -28 84 -37 -60 1 73 -57 -27 34 29 -23 6 6 -7 25 27 8 -14 -8
4778hK6mq2P8lj9k0JR0m3j16R5no4N5%N7p2K1rP1j21K0L0J9n4QN4j8K4q8P7J7
$$ -8 18 14 -68 10 7 -12 -32 -31 59 16 -100 -5 -10 -74 -19 -19 38 -34 -13 -22 49 -72 -52 -22 -3 -57 -49 5 -13 11 -77 0 17
4811A7qMP3r2L4l8N7l4m6L3L1l1KjL0k3k3RK0j2krM5rj5j8l8J7J6ol5Q6lq7oj4
$$ 17 9 13 86 -6 28 -10 47 13 -33 0 31 0 2 1 31 8 -15 -6 14 2 0 -9 36 27 12 -6 -44 -27 -11 -17 -52 34 31 -56 -62 -76
4847g6J25n2m7L9Jm5M5L7o0m7j2J34r2K5l4O2o6O2J14o1k2r%K%l8O8p2M3k0J9
$$ -76 49 -3 -50 -11 -10 -55 -10 27 -33 -80 -92 42 -50 -25 -59 3 -63 -1 113 52 30 21 21 23 23 -15 53 -19 24 4 23
4878B3q4kQ4k6j3nM9K1j02l9J30j4nq4R0k4jQJ6o1J7M5k6mn3L8R7j20L7K8J6p3
$$ 23 -61 -63 21 -5 -18 -23 26 47 -55 -94 36 22 17 -67 23 -1 -2 6 22 -39 -22 23 -3 -7 -60 -22 75 -45 -8 20 36 -37
4910c7L3P3r6nL1k1%klJ02Kk9m2L1L4j67J25K0n2M3r5M3M7j7q0J03o1K3%mJ1m3
$$ -37 -4 69 -27 -32 -1 -22 -22 -24 -27 75 77 48 6 37 71 -96 29 49 -3 40 -55 -12 35 18 -62 41 -20 3 3 -1 10 -33
4942c3M7k5j4Q2oj04N6J3n9QL7k9%rM4J5o2O3plll2N5M5p6LK4k3l3K4J0J3J2n4
$$ -33 14 -11 -25 57 51 -53 3 16 -43 -35 2 -27 -27 -36 8 23 -39 24 17 14 11 -21 34 79 3 6 30 7 -26 -2 8 21 33 -21
4976b1N3l3N7k9J7m6L4k8m0J3M7m7Q0j04O4J4l9oM9m6M4p8M9l1pM4mJ7j30R4J06
$$ -21 32 -1 56 27 44 -2 32 4 -36 -23 24 -23 57 -47 17 31 -8 -14 35 -11 33 -45 4 -27 -34 10 6 23 -107 -13 93
5007I3j33LQ1j3p9n7J04p6J9O3k0j7J0l0J16j07k5O6J3q8L9Q1o2N7k1J5M1j34
$$ 93 -40 -37 44 31 -48 -105 -1 -77 -58 5 -15 -32 -22 -52 64 -43 -68 -2 11 -77 -38 43 -19 38 17 32 73 -61
5035f1P1K3pj0o2J52j02p8M8J1K5%L1J3j6q0N8l5M5q6M9m2O2q1J1J8j9R7ll9j7
$$ -61 10 33 26 16 -46 106 4 -74 -26 -15 10 10 41 54 38 -42 16 -19 26 -60 -11 -53 9 -72 -61 -43 -62 35 32 -7 -24
5066b4Pm3N4jpk2K4J5L6n1L7K5o0m2MK8M0l2k6JM1K3k6P2m4J3q0L2k1j5P3k4m0
$$ -24 -17 -60 -6 -7 -14 -36 -12 3 39 -12 25 50 -10 -52 -48 -20 20 -12 -38 -37 4 27 1 73 29 42 -38 -6 -27 -42 31 7 -33
5099c3OO5j6p9P2J1n7Q5m1j5m7J3nL0m7OM6Noj5k5JK1J8J9k1o7P5K8m9N0l4N7
$$ -33 -27 38 22 -57 15 26 -31 54 13 -2 -49 -36 -41 -11 -58 -52 -6 -1 -7 -22 -47 -46 -25 -7 12 -9 -76 -1 27 -22 28 -6 51
5132E1n2k5N9L2m6lllm5O0Po1jj3L2k7N0QM7r1oL8k9K1M9j0q7Q1pR3p0r8N6m7
$$ 51 -1 -26 33 65 19 16 13 10 -35 25 32 -29 -30 -43 -11 -38 12 20 67 -24 -30 8 -21 0 49 39 -48 33 26 119 49 -49 7 -40
5166d0N1m7N1o4j2K0PK7l0O1j9K4n6N5l3j6k3L5nj7k2J03m3mJ7j3l6N3K9j9j13
$$ -40 11 -36 15 -49 -61 -41 -34 -7 -37 24 5 29 -27 28 -5 -21 -44 -9 -14 -31 -53 50 7 3 20 7 -29 24 53 34 -79
5197g9M0O8qk8j4N5m9m9Q5n5rpMQ5k5m4O8Jj9l1J9N9k8o4L3Mk4L0l7J6om8O1J7
$$ -79 -39 29 21 -7 -21 34 -15 -64 21 -34 -43 -50 -46 39 14 -30 38 39 20 -11 8 67 39 -25 8 12 -12 18 -19 -3 -9 -57 4 21
5231B1k7N7k1o5p1J36l0l3k4k7J10o7K1L3l3J0RM5l1NNo2Pn0P4J20p9l4J7j5q
$$ 21 -6 51 30 -35 -106 30 0 -33 -57 -84 26 -41 -20 13 -20 -10 -1 44 13 18 23 -39 -32 -82 -8 112 33 -1 16 1 -7
5262gk4J42j08k3l8O7K7p8K5K5n5lM8L3m9qO0n5n1J30j7o4Qj0Q2n8p1O5Ll9oN3
$$ -7 -31 111 3 -20 -58 9 36 -42 -17 8 -47 -50 -2 31 -18 -26 34 -21 -72 58 41 -23 -15 -25 57 -1 -72 -7 -4 -43 -49 4
5294DN2j21l4N8P9q6L8N6o2k9Q4j7%n4J17j5q0Pj6QQQ4o9o9N9J4O1j6j40P8K5
$$ 4 56 -65 -99 -41 38 -48 -10 46 -16 -45 39 22 22 -32 85 70 -10 -3 -19 -11 -3 81 12 -57 2 16 77 61 -79 -1 24
5325B4j44J48m9L4Mm7K6J5k5m5R0J9j7k4M2p7l4M2M4lq4L0K8k1K5k1K4m8l7L0
$$ 24 -120 28 -21 13 17 -30 -4 11 -14 -59 31 50 33 9 51 -26 -60 -18 26 23 -61 -31 -3 -24 1 -20 4 -44 -81 -51
5355e1NN0L2Jn8jl5Q7L5n9N6q8l0O0Jm1K4O8o9K1kj2K3l6O4r2J04p2oo1R2p6L
$$ -51 -46 4 36 37 -21 -22 -57 30 65 6 62 -26 -56 4 5 -36 -12 56 -13 8 6 -6 17 -19 45 -47 57 -15 -21 -82 10 -66 -63
5388f3O0n6k8R6n5Or5J26l4K9k1k7RM4J3pj4n4O2M1j3rk8K8j9M4l6L5j09J16L
$$ -63 -3 -59 -87 9 -46 -40 -135 -9 -43 -14 -35 -62 -53 -9 4 -3 -17 -71 -9 32 19 10 -18 10 -9 35 -1 34 -75 41 44
5419D4l8p5P7J8J7l8k1R6j42N2K4K6k4j5K6k4l4pJ7K9j5m5O8j0L2m4M0l9q1R5
$$ 44 6 -69 8 26 43 5 -16 80 -62 -10 14 40 16 1 27 3 -31 -38 -21 8 -7 -52 16 6 38 -6 34 -5 -86 9
5449Iklj5L6o6J3j0K6oN0j9o3K8JM4m8ln9J25n0j5N8m4o2Q2K9kl8J8J7l2M0m0
$$ 9 7 4 -11 25 -41 -28 -38 -12 -18 32 13 -50 -22 -21 23 -25 -28 -87 38 -12 -27 31 -13 -75 7 36 34 -4 14 31 -1 39 -1
5482ak0%J7L8n0QPm9J18p6Mo7J19q5NM1jm7nJ14j36Q1K2J5k9m5o7Q2n3nJ00m7
$$ -1 -21 -21 -4 34 -16 -8 -1 -50 68 -8 -4 -71 48 -37 -32 9 8 -39 -44 70 -66 15 37 52 23 -22 -89 -7 -60 -65 35 -12
5514a2Ro6M1J9N5r7P5j6l4kk4Q6n8m3J13n8J0P4l8l1J2N2k7l9P4o0m0K1J2N4p8
$$ -12 -3 -69 -28 -9 46 -51 24 8 -26 -28 -52 34 -24 -67 46 -12 -2 72 34 3 15 67 40 1 75 15 -25 -4 8 62 -16
5545a6L3m8J3K5q6J23l8Pk2L0l9k5K0LL5ql2j3J4j4L0Jk8o0O9kjj03J38jj2j2
$$ -16 17 -31 -18 7 -79 44 6 13 -9 21 -18 -43 -23 -20 15 7 -25 -38 -24 -38 -8 -7 -35 -95 -26 -28 -29 -132 6 5 -7 -19
5577a9J3M9q6M4J0j4o5O2L3k9Q8o4m7K1P7o5jkjL5Rq7K1L0L5r7L0M7n9L0K2Rp2
$$ -19 -6 43 -43 1 11 -3 -68 -6 27 -2 86 22 -25 -4 73 8 7 5 4 39 48 -39 -18 12 47 -50 -20 27 -32 -2 20 29 -43
5610d3M9L7q3O1k6p5L6N3l1L5l9RMN6k4n9L3o9K0K2j5L1L4m7N7m8k5OQ0k8k3N3
$$ -43 6 43 -40 21 -5 -80 -44 9 -22 13 -26 -17 -13 43 19 -40 -7 -76 -56 -34 -49 -18 16 -31 26 -22 -47 -41 39 11 -12 41
5642D1Pr8M1K3N0l6o0P8m9Jj8pN1j9j8k8N6k6l3L8L6o4J2N4j06j1P0j3l9P2J8
$$ 41 48 -50 -9 14 64 28 -32 46 -3 -2 -20 -27 24 5 -13 -41 15 -11 -44 -6 30 -34 -22 32 -74 -85 -15 -28 -67 5 23
5673B3m8kL4k6n6j3J00lo1K7N1o3J7K4%q4M5K7N4J6j24jQ4l9j1K0M8m2Rj5J7Q4
$$ 23 -25 -27 7 -19 -75 -88 12 9 -52 -25 26 -37 -20 4 4 -80 -35 -8 46 62 -62 -63 21 -18 -29 -9 39 -3 6 -9 8 92
5705I2m1m9MJ2j7j9KJ4N9k1qr4J84j06j6lK2k6k9N2k7OqnK4%n0M4J2J1r9Q3p5
$$ 92 51 2 6 18 1 -18 -16 -2 57 36 28 -66 118 12 -4 -7 15 -11 -40 12 -15 -9 -17 -22 2 2 -48 -4 8 19 -80 3 -72
5738g2J1P8k5N3o2kK9j1k4M3Lj9j7j3Q1n8J7n8K6M7o5M1NPrN5l1p7R6j9q9M4M4
$$ -72 -61 17 -8 45 -17 -19 10 -1 -25 18 21 2 -15 -28 53 -5 12 -46 -20 27 -38 3 8 15 6 61 30 -47 49 30 -59 -15 29
5771B9J6o8j6Q4j28P5l1K4mj0k8M9q1P4N5n6j8J8M4o1J8K0Ol4nLOPj3oP0o9qM8
$$ 29 45 -23 -39 45 -83 -8 -39 -15 -19 -29 -57 -8 -89 -15 40 -16 -34 -16 28 -33 -15 5 11 -23 -28 -25 -19 -12 -25 -31 39 -30 -38 10
5805A0J1l3L6K6l9q1N6J8m8P2m8M9p7M1R2j03Nn6N3J14j10J8L5j2j2JK6n0LJ2
$$ 10 21 -12 24 50 11 -70 -14 4 -44 28 -20 29 -48 -7 85 -18 -13 -69 -16 98 -12 6 41 29 17 18 44 -6 -3 9
5835IJ7Ml6l6P3l4L0q2L5j01O9R6q9o8J36m4Lk6N7j9Rn7P3J1p5P2K9o3k4M5lk
$$ 9 26 30 -6 -42 31 -3 27 -55 -20 -121 -52 44 -45 -113 23 -21 -18 -44 13 -6 3 -54 19 30 -45 27 56 -7 -31 14 11 9
5867Im0P0j7lk6L5K2j4p1O7Jj01O8L8r7N0J1Nl7j6Q0k3pm9L0L8n7Pl8P4n5N4j
$$ 9 -31 39 22 19 -7 28 50 36 -35 32 33 -68 0 38 -59 -9 2 7 -30 -46 34 11 4 -45 -15 23 -34 -27 -65 9 -46 8 7
5900Gn5KNL4K6k4K6k6q9N0L9%L5l8J1l5M5k9Ol1m6J42m5j5J8nK3p7M5M9n1l0J2
$$ 7 -48 -46 -41 -7 19 -5 21 -5 -94 -44 -5 -5 30 -8 3 -32 13 -16 -10 -41 -87 55 10 -5 13 8 31 -46 -1 48 -3 -33 -21
5933b1J0J6o1M8N8j3o2M8qJ1k8j9jk9M9nk0OJ4k4k4K3L4J7o0k9J07l9m1Q7J2o9
$$ -21 -11 5 -56 -8 50 37 -25 23 15 26 -2 -21 -22 -51 -2 -7 -27 -21 -7 -31 -55 -32 2 19 -41 -70 37 -2 -43 44 56 -13
5965a3K5J5o6O2m5J1N1k1p8lJ33j58K4Q1K6n4R1n8n7L8l9j3M4OK0M5k8o8R0o0
$$ -13 12 27 -39 23 -22 -11 40 19 -59 -62 71 -87 -63 18 44 -10 81 23 -34 4 -35 -48 -4 2 22 67 39 -29 61 1
5995AkjK4on7j1J7O9n6l7J10o9n3P7j2k6P4j0m6l9P4Q6j12l9M1qK2k6m0Q4o0K9
$$ 1 -1 -2 22 16 -41 -52 -35 34 -22 -59 51 -18 -71 6 -6 -32 42 32 -14 -53 21 107 -5 -44 -3 -11 11 -15 -55 29 -31 -2
6027bl2K1l2R4Nr7L9Po1Q9k5JM6r7M1M5o7l2OO5Ml1K2n7J50j38k0L9j7L3k4L1
$$ -2 -34 -13 -45 49 54 -43 -4 3 -58 31 6 7 53 -44 -3 42 -25 -57 -51 14 18 -13 9 -48 102 -36 -56 -17 -34 -1 -25 6
6059Fl2m1O7N5r3P0m9M3l4l1J9L3n9jL2oj5lJ9mM4nj9o6L4J12p0k8%qL6M0j2Q1
$$ 6 -26 -67 0 55 -38 32 -17 26 -8 -39 -20 13 -46 -47 -15 -21 -36 -39 -20 -24 20 15 -4 -70 -36 76 6 -22 -22 -30 6 46 34 115
6093A15r8l5K1L1o6P3j1m7kk4P1J1m5L5p%j4k5K6n8lKR3p0kP0m6%m3l5P5qoK0
$$ 115 17 -18 3 34 -32 41 30 -17 -19 -43 28 39 -6 29 22 22 8 -17 9 -49 -52 -50 43 -27 -29 41 -5 -5 -48 -83 -8 -16 -22 -2
6127bn6JK0P2j17P7k9O9l4m3K8K4j7Mj0L4k9L2k8l3J1QOn3N9l9P6j3M1l5P5j26
$$ -2 -58 -57 -37 35 -82 -5 -34 35 1 -42 -14 10 -7 -3 -13 21 -8 24 -4 -37 -26 -18 -12 -65 -6 -45 31 18 59 24 99 -27
6159b7j2Q1Kj6p3N9l5m2O6K3j34M8J44j01j8M3jL4q3Q1l9J5p4K8L8m8nO2Kn7M2
$$ -27 -39 42 44 28 -45 14 -21 -63 3 26 -108 -60 84 -17 -35 8 7 41 -42 39 0 15 -59 -31 7 -41 -46 16 18 -39 3
6190CN7p0k7K9n9K7MO3N8n4j2J6j5L2o1L4K7o8rR3n5jm3L3Rj4k7j3pJ0K8MJ8n7
$$ 3 60 -10 -37 -8 -67 -40 -36 27 85 31 19 35 20 52 -9 25 52 -16 -25 68 13 12 -31 2 11 -3 -30 -43 -50 -40 -12 -8 10 -47
6224d7N6o9M0K4l5M0k9KN6m5j5L7k6K6j7P9o3n0N0K2J0p3LM8l9L4j8n9M2lPM4
$$ -47 9 -60 -20 4 -31 9 -20 -18 38 -7 -22 15 -11 15 -2 77 14 -36 14 36 46 -27 -24 24 -15 19 1 -58 -16 -19 -12 32
6256C2n0L0rP3n5Q9j12J9l0J1P5j09P4ql7J0n2O0K5q4J24o8r6N1O1J1M6j14J9
$$ 32 -18 12 3 76 21 110 -2 17 -13 -2 73 -36 38 30 -7 3 -49 11 36 -48 76 8 -88 -37 24 35 81 -33 -14
6285a4J00j16N3rJ5l1p9L5P2o4K2M0r9J9R6l8k8qJ7J4J3m8P9m0l7K1Rj8k2M2Q
$$ -14 86 -30 23 14 29 -2 -81 -46 26 -38 -16 24 -75 -56 40 2 -26 -34 -17 -3 10 -38 41 1 -36 -15 -6 -24 -46 -4 4
6316Dmk8N3ol1J1K8J1n6k1J3R4q4j5J24p5m9PL6k1l5M2J4m9OJ02q0rk9L2J0PN
$$ 4 0 -28 25 19 -12 -1 27 38 -18 -39 -26 68 -16 -31 93 18 -31 -24 12 -9 -44 -2 12 -37 -31 71 -9 -18 -47 -15 -5 2 7
6349GNJ3r2L9M5lo6k4R5m6L8L8j9q7N0j6Ln5%L2J0M6J2L6k6j8K4Jk9o0L4M5k2
$$ 7 12 25 -67 -28 17 14 -52 -76 19 -27 11 49 30 -57 -7 -23 -20 -75 -75 -43 -33 13 25 61 35 17 41 42 13 -47 -13 32 10
6382A0k4L0On2Q0L3p8J1j10J12r5j4M8M1k8n5L5M0j3m0O0L4m6j8J03j10l1J23
$$ 10 -14 16 22 -30 50 83 5 16 -94 18 -77 -91 -43 -2 -30 -85 -50 -10 -23 -63 -3 31 -15 -33 70 -40 -71 52
6410E2m9mK8o9P5pm3K1rRM1l2Nm0K5M2o0nK2J3j6OP5k2k9%p9O8m5JJ1l5J3L1J5
$$ 52 3 -1 27 -42 33 26 -17 4 -5 4 45 13 18 -22 3 45 -15 -20 2 15 -1 5 80 58 29 29 -50 18 -27 -26 -15 -50 -37 -6 9
6445Im3m7O2J9K3k2K2K7m9omk6P1m7k0J6q9Q4K4r9J17lk8m2JP1rj0M5%r9K5ql
$$ 9 -34 -81 -19 0 23 1 23 50 1 -5 -9 -35 36 -11 -31 -15 -104 -20 4 -95 22 19 -9 -51 -50 21 12 2 47 47 -52 -27 -35 -38
6479c8N2m7R9n8J4o3P5j9K6j2k9k4K4j8J5%k0O0k7o1LQ2l1j6l8O2j3Pl2P1n8k9
$$ -38 14 -33 66 8 22 -41 34 15 41 29 0 -24 0 -18 -3 -3 -23 37 10 -51 -48 34 3 -13 -51 11 -2 5 -27 44 -14 -43
6511d3J6Ql3kM4K7m7p2Q5J7l5m2L6KOM3O7q8l8J44j00L8q5O0Jo7M0J3Q2j12N4
$$ -43 -27 -19 -52 -54 -10 17 -30 -102 -17 0 -35 -77 -41 -39 -33 10 77 -11 -49 95 -5 33 -52 8 9 -58 -18 -5 77 -35 19
6542A9j1J8k0K6j6K0l0L9M9j23k5J19l1%l9P2m0l8K3pKLj2N8j10LP4j7Km7N3k2
$$ 19 8 26 6 32 16 36 6 45 94 -29 -54 65 34 34 -5 67 27 -11 12 5 7 10 -2 56 -54 -51 23 6 8 -39 14 -8
6574hk2M3K3r6RJ10m3k0r9Q0N7p2j4R8M2q1NJ9L9j04M0LJn4O8L6k1k0k6l2J9K0
$$ -8 -30 13 36 -60 -51 59 16 -4 -103 -23 34 -38 -52 46 88 7 12 31 70 -34 6 9 10 -44 24 60 39 19 -7 -39 -20 0
6606@k6Ml3L4J29j27K3j1M2K1o9M8J7r6L9l0J6k8LN7l9k3OO6p7Q5r2Q6n8j6M3
$$ 0 -26 -22 -55 -21 108 -19 4 -7 35 56 -13 35 52 -44 -5 -35 -19 -47 -44 13 -26 -49 -43 23 -54 31 -61 25 -33 -49 -6
6637fj4K3o8P7Jm8MN3l2m4Q8j9p9M5N2N6r5m8N8L7q6K8J9J9o8N4J8n4OJ3L5j6
$$ -6 -20 3 -65 12 13 -35 -31 22 -10 -54 34 15 -64 -19 33 89 -6 -54 4 41 -45 -17 2 21 -47 7 25 -29 -23 -10 25 9
6669Ik3M5j5o7K4M7%r4K0O9q0QO5j1p7N3R1n7m2%K0O8n6j3pL0j8M0O9r9j1O6N4
$$ 9 -14 31 16 -51 -27 20 20 -74 -54 15 -65 -57 8 -3 -80 -27 64 7 -35 -35 -15 53 -3 -16 -23 7 -11 29 98 -1 -12 54 108
6702A08p3rpJ4n4mP6Jn0p2J17l4o4N9%K1p4R3n4l5J4mM7o5M6k9N5j09M1R0o0k
$$ 108 35 26 19 33 -21 -25 51 52 2 -70 47 13 -51 8 8 29 -45 48 -6 -41 -27 -31 16 -49 -3 -32 23 -86 -45 45 -15 -17
6734a7m1O9n0k7O4pm3L7mm1N6j9k4R2q0P5j6p7KO6K5q0J0P2O3n9k6O3k7q8L2K9
$$ -17 -58 11 -39 -66 -2 -9 -52 -15 -19 -60 -4 -23 -47 45 -35 40 24 -53 -51 15 40 -40 -30 42 105 46 20 83 56 -32 0 29
6766B9k8m7M3L1m2Q%j7N3J7n7J8q2R2j1J0q9J5O5L2k8m9J9m0jM4K2n2P2p2O5o9
$$ 29 1 -46 -3 28 -14 -6 -6 -23 30 47 -10 8 -74 18 7 17 -72 -57 8 40 12 -37 -18 -58 -59 -15 7 -45 27 -45 20 -49
$$ [...]
8191E
##END NTUPLES=NMR FID
##END=
