##TITLE=1H_AM_NV BROMACNEW
 CDCl3
 8 sc, 
 9.9.2024
##JCAMPDX= 6.0         $$ Bruker NMR JCAMP-DX V2.0
##DATA TYPE= NMR FID
##DATA CLASS= NTUPLES
##ORIGIN= UXNMR, Bruker Analytische Messtechnik GmbH
##OWNER= root
$$ XWIN-NMR		Version 3.5
$$ Mon Sep  9 15:41:36 2024 Russian Standard Time (UT+4h)  she@DPX200
##.OBSERVE FREQUENCY= 200.1318
##.OBSERVE NUCLEUS= ^1H
##.DELAY= (6, 6)
##.ACQUISITION MODE= SIMULTANEOUS
##.ACQUISITION SCHEME= undefined
##.AVERAGES= 8
##.DIGITISER RES= 18
##SPECTROMETER/DATA SYSTEM= spect
##.PULSE SEQUENCE= zg30
##.SOLVENT NAME= CDCl3
##.SHIFT REFERENCE= (INTERNAL, CDCl3, 0, 15.7039)
##AUDIT TRAIL= $$ (NUMBER, WHEN, WHO, WHERE, WHAT)
$$ ##TITLE= Audit trail, XWIN-NMR		Version 3.5
$$ ##JCAMPDX= 5.01
$$ ##ORIGIN= Bruker BioSpin GmbH
$$ ##OWNER= she
$$ F:/spectra/data/she/nmr/H-F/1/audita.txt
$$ ##AUDIT TRAIL=  $$ (NUMBER, WHEN, WHO, WHERE, WHAT)
(   1,<2024-09-09 15:40:26.57 +0400>,<she>,<DPX200>,
      <created by zg, POWCHK disabled, PULCHK disabled
       configuration hash MD5:
       00 E9 B6 7A A2 85 ED C7 34 08 36 98 17 FE 4E 26
       data hash MD5: 16K
       65 B4 36 F7 CA 23 A4 51 8E 7B 9A DC A4 DC 54 9E>)
$$ ##END=
$$ 
$$ hash MD5
$$ 09 8A 32 92 88 A1 88 4F 40 1D 5A EF BF 17 76 96
##$RELAX= 
##$RELAX= 
##$RELAX= 
##$RELAX= 
##$RELAX= 
##$RELAX= 
$$ Bruker specific parameters
$$ --------------------------
##$DU= <F:/spectra>
##$EXPNO= 1
##$NAME= <H-F>
##$PROCNO= 1
##$TYPE= <nmr>
##$USER= <she>
##$AMP= (0..31)
100 100 100 100 100 100 100 100 100 100 100 100 100 100 100 100 100 100 
100 100 100 100 100 100 100 100 100 100 100 100 100 100 
##$AQSEQ= 0
##$AQ_mod= 1
##$AUNM= <au_zg>
##$AUTOPOS= <>
##$BF1= 200.13
##$BF2= 200.13
##$BF3= 200.13
##$BF4= 200.13
##$BF5= 200.13
##$BF6= 200.13
##$BF7= 200.13
##$BF8= 200.13
##$BYTORDA= 1
##$CFDGTYP= 0
##$CFRGTYP= 5
##$CHEMSTR= <none>
##$CNST= (0..31)
1 1 145 1 1 1 1 1 1 1 1 1 1 1 1 1 1 1 1 1 1 1 1 1 1 1 1 1 1 1 1 1 
##$CPDPRG= <>
##$CPDPRG1= <>
##$CPDPRG2= <>
##$CPDPRG3= <>
##$CPDPRG4= <mlev>
##$CPDPRG5= <mlev>
##$CPDPRG6= <mlev>
##$CPDPRG7= <mlev>
##$CPDPRG8= <mlev>
##$CPDPRGB= <>
##$CPDPRGT= <>
##$D= (0..31)
0 1.2 0 0 0 0 0 0 0 0.06 0 0.03 0 0 0 0 0.0002 0 0 0 0 0 0 0 0 0 0 0 0 
0 0 0 
##$DATE= 1725882026
##$DBL= (0..7)
120 120 120 120 120 120 120 120 
##$DBP= (0..7)
150 150 150 150 150 150 150 150 
##$DBP07= 0
##$DBPNAM0= <>
##$DBPNAM1= <>
##$DBPNAM2= <>
##$DBPNAM3= <>
##$DBPNAM4= <>
##$DBPNAM5= <>
##$DBPNAM6= <>
##$DBPNAM7= <>
##$DBPOAL= (0..7)
0.5 0.5 0.5 0.5 0.5 0.5 0.5 0.5 
##$DBPOFFS= (0..7)
0 0 0 0 0 0 0 0 
##$DE= 6
##$DECBNUC= <off>
##$DECIM= 24
##$DECNUC= <off>
##$DECSTAT= 4
##$DIGMOD= 1
##$DIGTYP= 9
##$DL= (0..7)
0 120 120 120 120 120 120 120 
##$DP= (0..7)
150 150 150 150 150 150 150 150 
##$DP07= 0
##$DPNAME0= <>
##$DPNAME1= <>
##$DPNAME2= <>
##$DPNAME3= <>
##$DPNAME4= <>
##$DPNAME5= <>
##$DPNAME6= <>
##$DPNAME7= <>
##$DPOAL= (0..7)
0.5 0.5 0.5 0.5 0.5 0.5 0.5 0.5 
##$DPOFFS= (0..7)
0 0 0 0 0 0 0 0 
##$DQDMODE= 0
##$DR= 18
##$DS= 0
##$DSLIST= <SSSSSSSSSSSSSSS>
$$ [...]
##$SUBNAM2= <"">
##$SUBNAM3= <"">
##$SUBNAM4= <"">
##$SUBNAM5= <"">
##$SUBNAM6= <"">
##$SUBNAM7= <"">
##$SUBNAM8= <"">
##$SUBNAM9= <"">
##$SW= 24.0689170037331
##$SWIBOX= (0..15)
0 0 2 0 0 0 0 0 0 0 0 0 0 0 0 0 
##$SW_h= 4816.95568400771
##$TD= 16384
##$TD0= 1
##$TE= 0
##$TE2= 300
##$TE3= 300
##$TEG= 300
##$TL= (0..7)
0 120 120 120 120 120 120 120 
##$TP= (0..7)
150 150 150 150 150 150 150 150 
##$TP07= 0
##$TPNAME0= <>
##$TPNAME1= <>
##$TPNAME2= <>
##$TPNAME3= <>
##$TPNAME4= <>
##$TPNAME5= <>
##$TPNAME6= <>
##$TPNAME7= <>
##$TPOAL= (0..7)
0.5 0.5 0.5 0.5 0.5 0.5 0.5 0.5 
##$TPOFFS= (0..7)
0 0 0 0 0 0 0 0 
##$TUNHIN= 0
##$TUNHOUT= 0
##$TUNXOUT= 0
##$USERA1= <user>
##$USERA2= <user>
##$USERA3= <user>
##$USERA4= <user>
##$USERA5= <user>
##$V9= 5
##$VALIST= <valist>
##$VCLIST= <CCCCCCCCCCCCCCC>
##$VD= 0
##$VDLIST= <DDDDDDDDDDDDDDD>
##$VPLIST= <PPPPPPPPPPPPPPP>
##$VTLIST= <TTTTTTTTTTTTTTT>
##$WBST= 1024
##$WBSW= 4
##$XGAIN= (0..3)
0 0 0 0 
##$XL= 0
##$YL= 0
##$YMAX_a= 19459
##$YMIN_a= -23937
##$ZGOPTNS= <>
##$ZL1= 120
##$ZL2= 120
##$ZL3= 120
##$ZL4= 120
##$ABSF1= 10
##$ABSF2= 0
##$ABSG= 5
##$ABSL= 3
##$ALPHA= 0
##$AQORDER= 0
##$ASSFAC= 0
##$ASSFACI= 0
##$ASSFACX= 0
##$ASSWID= 0
##$AUNMP= <proc_1d>
##$AZFE= 0.1
##$AZFW= 0.1
##$BCFW= 1
##$BC_mod= 2
##$BYTORDP= 1
##$COROFFS= 0
##$CY= 11.3945322036743
##$DATMOD= 1
##$DC= 2
##$DFILT= <>
##$DTYPP= 0
##$F1P= 15.6554695791079
##$F2P= 12.8336369535428
##$FCOR= 0.5
##$FTSIZE= 0
##$FT_mod= 4
##$GAMMA= 1
##$GB= 0.15
##$INTBC= 1
##$INTSCL= 1
##$ISEN= 128
##$LB= 0.24
##$LEV0= 0
##$LPBIN= 0
##$MAXI= 10000
##$MC2= 0
##$MEAN= 0
##$ME_mod= 0
##$MI= 1.114404
##$NCOEF= 0
##$NC_proc= 0
##$NLEV= 6
##$NOISF1= 3.799351
##$NOISF2= 2.8
##$NSP= 1
##$NTH_PI= 0
##$NZP= 0
##$OFFSET= 15.70392
##$PC= 1
##$PHC0= -26152.59
##$PHC1= 13.58748
##$PH_mod= 1
##$PKNL= yes
##$PPARMOD= 0
##$PSCAL= 0
##$PSIGN= 0
##$REVERSE= no
##$SF= 200.130013532006
##$SI= 16384
##$SIGF1= 3
##$SIGF2= 2
##$SINO= 400
##$SIOLD= 16384
##$SREGLST= <1H.CDCl3>
##$SSB= 0
##$STSI= 0
##$STSR= 0
##$SW_p= 3612.71676300578
##$SYMM= 0
##$S_DEV= 0
##$TDeff= 0
##$TDoff= 0
##$TI= <>
##$TILT= no
##$TM1= 0
##$TM2= 0
##$TOPLEV= 0
##$USERP1= <user>
##$USERP2= <user>
##$USERP3= <user>
##$USERP4= <user>
##$USERP5= <user>
##$WDW= 1
##$XDIM= 8192
##$YMAX_p= 0
##$YMIN_p= 0
$$ End of Bruker specific parameters
$$ ---------------------------------
##NTUPLES= NMR FID
##VAR_NAME=  TIME,          FID/REAL,        FID/IMAG
##SYMBOL=    X,             R,               I
##VAR_TYPE=  INDEPENDENT,   DEPENDENT,       DEPENDENT
##VAR_FORM=  AFFN,          ASDF,            ASDF
##VAR_DIM=   8192,          8192,            8192
##UNITS=     SECONDS,       ARBITRARY UNITS, ARBITRARY UNITS
##FACTOR=    0.0002076,     1,               1
##FIRST=     0,             0,               0
##LAST=      1.7004516,     0,               0
##MIN=       0,             -23937,          0
##MAX=       1.7004516,     19459,           0
$$ Real data points
##PAGE= N=1
##DATA TABLE= (X++(R..R)), XYDATA
0 0 0 0 0 0 0 0 0 0 0 0 0 0 0 0 0 0 1 -8 8 -8 8 -8 8 -9 16 -16 16 -19 24 -25 30 -32 35 -41 46 -50 56 -64 71 -76
40 -76 85 -95 105 -115 129 -140 156 -177 195 -220 247 -281 322 -373 438 -527 654 -856 1220 -2093
60 -2093 9452 1782 -6524 8724 -2047 -19891 -15965 -3443 -12863 -20460 -7930 4450 -2085 -4497
74 -4497 9476 17927 6900 2945 15315 15882 -1798 -4043 8329 1685 -15757 -9545 2845 -7940
88 -7940 -17698 -3483 5171 -6196 -7944 7343 10133 -970 406 12212 9892 -2169 -539 9109
102 9109 2958 -9676 -4434 5440 -4144 -13483 -1148 6668 -5978 -8587 6997 7765 -6057 -2803
116 -2803 9635 3437 -7849 -1176 7188 -715 -7709 1137 8019 -28 -4876 5389 9836 -1788
130 -1788 -5489 5707 4524 -10150 -8598 3488 -2829 -13927 -4207 6502 -1945 -6111 6998 12302
144 12302 2382 1037 11056 9988 -1707 -2963 4315 245 -11277 -9394 -134 -5027 -13662 -4961
158 -4961 5361 -1930 -6274 6945 12333 1408 1035 12707 10046 -2075 83 7224 -12 -9655
172 -9655 -5574 -230 -7146 -12855 -5216 1348 -4597 -6803 4549 9751 1250 1306 12765 10995 -1026
187 -1026 1510 9254 490 -9848 -3645 993 -8516 -12219 -2552 973 -5744 -4730 5417 7115 -153
202 -153 1299 9792 7199 -2596 -94 7138 86 -8582 -1549 4085 -5252 -8756 1868 3849 -5537
217 -5537 -4053 5693 3354 -4531 -679 6308 1731 -4464 531 5816 130 -4949 1540 5620 -2158
232 -2158 -5483 3145 4387 -5149 -4418 5000 1937 -6642 -1462 5779 -590 -5868 1317 5042 -2208
247 -2208 -4340 2920 4358 -2448 -2703 4574 4390 -2830 -1669 5619 2207 -5753 -1829 4349 -2427 -8086
263 -8086 -406 3477 -4459 -5175 4194 4802 -2390 63 7426 4471 -2201 671 5299 130 -5974 -1963
279 -1963 2157 -3794 -7716 -493 3206 -3696 -4271 4888 5129 -2787 -117 7504 3081 -3924 931 5399
295 5399 -1281 -5347 594 2674 -3741 -5169 1226 2190 -3928 -3565 3407 2825 -3654 -921 6158 2402
311 2402 -3732 1705 6463 -683 -4523 2217 3298 -4599 -4885 1922 712 -5329 -2647 3617 1311
326 1311 -3134 768 5721 1840 -2783 1721 5040 -1288 -4740 1513 2816 -4650 -4487 3121 1546
341 1546 -4949 -1158 5039 682 -3784 1473 4756 -816 -3399 2077 3474 -2244 -3242 2570 2731 -3444
357 -3444 -2753 3545 1464 -4848 -1499 4249 -457 -4997 1200 4734 -1535 -2969 3868 4082 -2444 -1691
373 -1691 3745 1467 -4214 -2135 2447 -699 -4992 -1236 3386 -507 -3669 2051 5104 -777 -2431
388 -2431 4072 3750 -3330 -2254 3602 373 -5132 -1322 3142 -1182 -4249 840 3441 -1196 -2772
403 -2772 2251 3409 -1893 -2369 3114 2627 -3086 -1665 4081 1167 -4253 -167 4196 -1199 -4521 1199
419 1199 2982 -3046 -3370 2531 2243 -2949 -1341 3722 1864 -2701 -329 3895 514 -3783 33 3470
435 3470 -1345 -4103 1581 3442 -2523 -2717 3561 2361 -3571 -1358 3544 -77 -4417 -538 2842
450 2842 -1152 -3353 1474 3675 -482 -1561 3355 3922 -1451 -1817 2973 1182 -4696 -2751 2041 -1568
466 -1568 -5554 -656 3130 -1302 -2539 3382 4486 -493 -195 4397 3099 -1870 -1009 2651 6 -4487
482 -4487 -2226 1385 -1944 -5192 -704 2492 -1948 -3106 2958 4018 -1153 -69 5469 3405 -1630
497 -1630 751 4100 -85 -4057 -1027 854 -3438 -5469 -1158 755 -3001 -2907 2731 3707 -635 805
513 805 6007 3808 -1396 1040 4338 -687 -4590 -578 886 -4189 -4916 211 805 -3036 -1636 3158
529 3158 2455 -1282 607 4413 1905 -2141 450 3401 -695 -3680 683 2406 -2649 -3258 1976 1593
545 1593 -3320 -1563 2852 530 -3111 -105 3038 -202 -2564 1007 3001 -701 -2153 1803 2782
560 2782 -1661 -2049 2582 1918 -2852 -1168 3185 310 -3612 -203 2624 -1771 -3770 676 1725 -2463
576 -2463 -2307 2342 2359 -1121 178 4239 2838 -1058 605 3587 206 -3872 -1118 1018 -3539 -5523
592 -5523 -646 738 -3460 -2234 3445 2956 -611 2045 5759 2856 -510 1672 3204 -895 -3758
607 -3758 -1210 4 -3969 -4964 -611 317 -3260 -1977 3235 2546 -1135 1674 5375 2198 -977 2285
623 2285 3675 -1015 -2785 588 358 -3838 -3842 -230 -580 -3766 -2059 2131 1185 -1558 1319 4862 1959
640 1959 -791 2667 4064 -895 -2451 1299 687 -4086 -3192 822 -630 -3729 -931 2477 399 -1636
656 -1636 1457 3605 310 -1524 1585 2517 -1612 -2414 1617 1408 -2845 -1491 2876 796 -2702 342
672 342 3025 -511 -2778 689 1742 -2110 -2668 995 1201 -2066 -1356 2516 1885 -1274 182 3607
688 3607 1441 -1901 541 2898 -890 -3296 358 1242 -3046 -3196 1044 481 -2966 -1095 2590 998
704 998 -1409 1161 3797 1332 -794 1838 3259 -341 -2263 682 819 -3439 -3707 194 -656 -4083
720 -4083 -1786 2361 569 -1534 2125 4537 1512 -46 3072 3253 -874 -1814 710 -110 -3850 -3343
736 -3343 43 -895 -3653 -1200 2522 555 -1542 2051 4234 512 -827 2756 2635 -1617 -1501 1684
752 1684 181 -3247 -1589 1194 -789 -3082 -541 1809 -481 -2047 1113 2727 -409 -1163 2402
767 2402 2522 -1381 -984 2484 742 -2767 -738 1859 -976 -3026 147 1698 -1143 -1849 1466 1929
783 1929 -1034 -1058 1985 1439 -1807 -1018 1961 409 -2516 -242 2514 -165 -2098 1384 2599 -1084
799 -1084 -1649 1710 1140 -2432 -1631 1266 -182 -2679 -787 1935 237 -1562 1067 3106 370 -1129
815 -1129 1764 2395 -1289 -1884 1273 520 -3114 -1820 1403 -359 -2858 -69 2263 -271 -1486 1507
831 1507 2582 -335 -880 1878 1814 -1189 -1110 1610 636 -2467 -1273 1385 -575 -3027 -361 1782 -1046
848 -1046 -2046 1577 2317 -716 -387 2641 1821 -1125 -286 1943 130 -2506 -987 977 -1130 -2786
864 -2786 -159 1602 -939 -1628 1781 2348 -877 -575 2596 1305 -1931 -426 1940 -454 -2481 -80
880 -80 1525 -1020 -1942 839 1582 -1041 -1272 1450 1366 -1566 -995 1888 760 -1932 -211 2288 1
897 1 -2044 745 2036 -1119 -1867 1173 1085 -1802 -1298 1497 618 -1655 -286 2038 583 -1554 293
914 293 2037 -342 -1912 511 1547 -1367 -1834 1315 1252 -1678 -825 2154 751 -1721 132 2055
930 2055 -288 -1945 356 1454 -956 -1658 945 1317 -1091 -1036 1643 1210 -1538 -646 1886 238 -2193
947 -2193 -62 1863 -636 -1977 985 1771 -1028 -1165 1637 1140 -1448 -810 1498 268 -1893 -487
963 -487 1542 -101 -1793 395 1989 -401 -1462 1249 1691 -1320 -1363 1514 694 -2019 -705 1728
979 1728 112 -1702 317 1948 -218 -1382 796 1477 -938 -1575 771 947 -1613 -1185 1546 899
995 899 -1503 -34 2232 301 -1649 526 1824 -970 -1846 761 941 -1620 -1375 1116 659 -1388
1011 -1388 -415 1742 679 -1343 140 1913 26 -1650 558 1681 -911 -1624 1102 1065 -1744 -1245
1027 -1245 1363 228 -2069 -432 1575 -102 -1476 708 1987 27 -856 1417 1869 -659 -1117 1126
1043 1126 617 -2113 -1537 812 -323 -2378 -459 1742 -159 -1205 1302 2337 -74 -508 1791 1470
1059 1470 -1148 -1044 1053 13 -2151 -1150 890 -351 -1885 -56 1726 -163 -1261 1118 1958
1074 1958 -701 -850 1690 1151 -1389 -590 1545 211 -1712 -283 1235 -623 -1832 115 1093 -836
1090 -836 -1365 961 1394 -829 -686 1789 1172 -1247 -260 1849 57 -1920 -31 1386 -891 -1769 727
1107 727 1173 -1056 -922 1361 971 -1147 -576 1274 306 -1700 -503 1343 -118 -1559 478 1945
1123 1945 -182 -982 1442 1653 -1019 -961 1204 250 -2127 -991 812 -515 -1924 -99 1449 -104
1139 -104 -905 1257 2012 -8 -523 1474 1279 -1172 -1006 1094 11 -2232 -953 949 -758 -2052
1155 -2052 103 1306 -650 -939 1358 1629 -344 -132 1885 1398 -778 -212 1345 37 -1949 -790
1171 -790 660 -1117 -2385 -192 965 -1061 -1185 1547 1713 -404 260 2376 1208 -808 140 1347
1187 1347 -449 -1983 -497 433 -1367 -1936 217 975 -914 -782 1631 1476 -794 -104 1980 545
1203 545 -1369 68 1383 -507 -1584 388 1071 -967 -1218 830 787 -1069 -830 1128 464 -1269 -354
1220 -354 1435 235 -1263 225 1597 -272 -1285 905 1302 -969 -960 1146 673 -1315 -501 1283 157
1237 157 -1377 -67 1174 -411 -1475 241 1085 -681 -1221 931 1336 -704 -392 1733 1097 -977
1253 -977 -113 1539 -136 -1801 -257 669 -1253 -1941 127 638 -1001 -774 1459 1401 -310 309 1978
1270 1978 1052 -866 29 1270 -517 -2019 -276 561 -1423 -1876 463 703 -1108 -526 1590 954 -673
1287 -673 330 1779 515 -850 366 1266 -457 -1423 172 711 -1326 -1565 455 456 -1453 -837 1332
1304 1332 556 -979 416 2025 388 -710 864 1411 -568 -1173 503 444 -1398 -1294 525 277 -1316
1321 -1316 -415 1413 534 -947 461 1736 -79 -1154 684 1062 -1024 -1168 818 509 -1261 -530
1337 -530 1224 390 -1113 46 1300 -21 -1303 123 1004 -648 -1296 569 927 -908 -753 1330
1353 1330 895 -995 -106 1539 226 -1338 111 1100 -616 -1315 392 869 -818 -1009 781 760 -931
1370 -931 -566 1151 597 -1096 -125 1492 243 -1144 471 1439 -488 -1177 614 703 -1227 -1075 673
1387 673 175 -1380 -499 1170 316 -807 449 1588 254 -741 651 1214 -668 -1175 546 475 -1514
1404 -1514 -1096 817 213 -1319 -82 1508 174 -868 645 1434 -295 -837 695 859 -893 -956 766
1421 766 509 -1182 -605 1055 176 -1309 -63 1217 -244 -1247 551 1196 -566 -800 1060 1010 -851
1438 -851 -456 1079 329 -1210 -396 862 -173 -1363 -15 960 -379 -975 796 1215 -516 -615 1211
1455 1211 807 -1056 -490 1036 3 -1417 -164 1015 -348 -1046 481 1111 -414 -783 840 914 -728
1472 -728 -634 932 500 -1151 -302 1254 101 -1278 205 1172 -468 -1143 604 852 -944 -881 892
1489 892 586 -917 -222 1200 397 -912 102 1177 -88 -1155 140 881 -760 -1274 536 779 -927
1506 -927 -639 1262 650 -837 26 1359 131 -1051 197 928 -481 -1142 321 746 -712 -806 838
1523 838 806 -811 -453 1121 398 -1111 -160 1075 -135 -1219 297 1020 -558 -890 826 908 -719
1540 -719 -530 950 392 -1064 -375 898 -87 -1235 -52 1006 -170 -1023 470 1051 -560 -817 987
1557 987 790 -928 -417 1143 273 -1095 54 1093 -183 -1119 191 778 -698 -1154 256 558 -826
1574 -826 -692 966 855 -641 62 1558 587 -792 237 1113 -547 -1342 -13 355 -1331 -1257 430
1591 430 417 -873 -198 1281 794 -438 417 1537 411 -760 261 935 -625 -1325 112 385 -1240
1608 -1240 -1001 610 295 -1065 -268 1134 362 -689 523 1362 122 -607 679 982 -444 -881 393
1625 393 204 -1273 -1060 466 -16 -1234 -303 1098 229 -718 749 1510 -13 -480 877 876 -767 -807
1643 -807 536 68 -1250 -654 660 83 -999 29 1106 27 -844 540 1040 -540 -815 669 590
1660 590 -877 -580 985 405 -840 110 1142 98 -878 208 786 -528 -1072 201 444 -917 -975
1677 -975 614 549 -766 -265 1217 535 -784 320 1302 10 -867 459 827 -705 -952 345 269 -1178
1695 -1178 -871 399 68 -1030 -238 1074 279 -512 606 1530 278 -343 849 1060 -652 -938 358
1712 358 -98 -1692 -1162 265 -434 -1290 -72 1090 371 -210 1110 1670 293 -213 1011 856 -826
1729 -826 -911 230 -242 -1658 -895 450 -378 -1150 148 1130 -55 -476 992 1290 -190 -192 966 684
1747 684 -692 -503 646 -19 -1213 -442 568 -340 -1205 26 807 -414 -716 801 951 -426 -190
1764 -190 1188 651 -770 -149 811 -151 -1067 -72 592 -401 -983 347 779 -509 -587 739 578 -676
1782 -676 -467 811 153 -1073 -247 947 -70 -764 531 1066 -50 -475 821 707 -624 -640 352 19
1800 19 -1226 -711 367 -241 -1043 28 1131 176 -464 937 1356 -80 -284 855 546 -866 -598 466
1818 466 -217 -1340 -531 401 -359 -1018 161 859 -74 -392 830 1156 -99 -97 1040 782 -665 -381 727
1837 727 -195 -1368 -441 307 -714 -1244 88 591 -415 -318 1006 1107 -11 198 1187 666 -582 -208
1855 -208 668 -314 -1292 -355 367 -683 -1083 363 724 -474 -226 1080 771 -422 -7 989 224 -787
1873 -787 -10 675 -315 -888 131 591 -473 -781 470 493 -673 -463 738 333 -822 -149 903 1
1891 1 -690 245 845 -156 -652 450 604 -533 -617 473 308 -760 -419 741 198 -793 -88 862 -114
1910 -114 -845 220 707 -476 -713 598 681 -492 -302 869 404 -642 -162 735 -146 -922 -129 525
1928 525 -442 -933 242 609 -402 -454 821 739 -407 -55 1006 335 -825 -107 644 -319 -1009 56
1946 56 447 -590 -696 512 601 -515 -371 840 496 -592 -92 846 182 -769 64 727 -271 -774 316
1965 316 607 -625 -652 487 282 -780 -287 747 239 -565 145 882 190 -478 340 725 -370 -804 240
1984 240 312 -788 -733 516 319 -757 -105 915 285 -509 313 868 -78 -588 326 526 -540 -705 384
2003 384 281 -699 -439 662 256 -665 -13 888 72 -651 230 830 -229 -587 511 562 -487 -455 559
2022 559 219 -850 -339 589 -93 -831 -37 696 -96 -512 431 876 -142 -402 684 649 -547 -451 518
2041 518 38 -979 -367 450 -173 -830 186 793 -85 -362 677 829 -237 -318 601 429 -672 -366 518
2060 518 23 -873 -175 615 -223 -700 251 585 -474 -523 548 513 -455 -250 729 345 -552 -42 790 83
2080 83 -676 -13 571 -317 -765 246 511 -524 -560 622 504 -565 -165 745 208 -668 73 606 -238
2099 -238 -709 228 581 -309 -436 520 555 -436 -339 468 140 -796 -360 486 -160 -887 50 751 -117 -434 679
2120 679 886 -144 -153 739 400 -628 -436 321 -158 -1033 -464 349 -309 -718 154 798 -15 -276 791 907
2140 907 -119 -97 796 462 -663 -302 441 -290 -1033 -375 237 -522 -841 154 451 -305 -221 777 869 -57
2160 -57 222 1064 570 -446 -85 548 -450 -1125 -362 102 -835 -965 196 418 -360 -55 906 772 -114 317
2180 317 1053 356 -545 -82 406 -370 -992 -117 273 -611 -697 402 434 -481 -164 771 433 -415 143 832
2200 832 0 -555 151 566 -291 -573 239 414 -410 -451 465 275 -614 -253 618 72 -718 45 679 -130
2220 -130 -557 282 610 -309 -378 561 455 -387 -141 598 265 -525 -155 539 -223 -835 -175 267 -473 -796
2240 -796 201 457 -360 -228 880 702 -128 267 1001 408 -385 23 440 -481 -1103 -357 -84 -851 -953 174
2260 174 370 -243 -20 1016 810 3 439 1092 289 -570 87 352 -637 -984 -211 -103 -865 -756 185 207
2280 207 -461 -1 847 572 -157 460 1053 309 -338 256 494 -465 -774 -7 -45 -1001 -750 151 -29 -614
2300 -614 46 749 278 -215 472 925 151 -323 368 489 -472 -669 96 6 -826 -478 417 87 -599 56
2320 56 739 66 -459 285 606 -292 -446 354 332 -495 -310 504 245 -457 -23 673 130 -509 -30 465 -279
2341 -279 -761 60 272 -545 -554 356 334 -378 -20 769 381 -262 162 744 143 -435 168 423 -402 -684 -70
2362 -70 114 -710 -688 221 104 -499 -115 773 256 -219 468 975 161 -230 426 490 -538 -699 -5 -178 -940
2383 -940 -778 118 -72 -632 32 731 368 -52 663 1019 228 -223 456 420 -595 -620 42 -234 -861 -487
2403 -487 282 -50 -557 119 672 116 -180 546 708 -41 -259 436 470 -534 -348 371 12 -811 -289 393
2423 393 -227 -660 87 506 -189 -327 459 576 -207 -116 585 400 -380 -212 414 28 -662 -209 418 -213
2443 -213 -551 181 494 -260 -350 470 377 -396 -271 435 127 -558 -124 546 -6 -480 224 572 -74 -429 398
2464 398 497 -361 -436 315 62 -657 -448 391 29 -591 97 644 137 -279 384 602 -126 -341 347 288 -478
2485 -478 -422 218 27 -665 -223 387 -70 -507 92 599 -54 -335 419 555 -299 -145 513 308 -400 -217
2505 -217 427 -19 -669 -217 273 -204 -556 178 507 -202 -241 421 628 -165 -97 541 318 -455 -181 332 -213
2526 -213 -702 -147 285 -296 -489 297 463 -172 -177 550 427 -324 -130 448 55 -531 -103 395 -128 -552 148
2547 148 481 -316 -421 296 356 -418 -232 447 253 -433 -87 531 143 -397 89 538 -181 -524 89 278
2567 278 -362 -497 276 246 -420 -183 497 272 -379 42 601 1 -400 96 304 -298 -495 203 252 -451 -288
2588 -288 380 276 -382 -102 539 142 -457 -13 454 -117 -445 190 411 -341 -344 330 311 -385 -176 427 95
2609 95 -437 -143 410 -18 -445 145 529 -155 -399 341 412 -306 -260 314 122 -508 -256 416 28 -577 8
2630 8 514 -39 -298 268 468 -153 -320 293 194 -352 -267 416 123 -418 -74 461 12 -389 149 439 -197
2651 -197 -444 186 234 -409 -358 293 197 -391 -130 505 233 -292 97 536 -81 -485 83 330 -385 -570 187
2672 187 267 -480 -327 361 153 -355 50 541 92 -304 175 484 -93 -307 241 360 -364 -399 209 109 -544
2693 -544 -410 233 -48 -547 8 574 79 -196 417 742 -30 -56 422 241 -451 -408 104 -160 -733 -358 253
2714 253 -177 -500 112 660 190 -179 468 593 -112 -139 406 154 -508 -387 163 -102 -607 -140 347 -191
2734 -191 -368 235 464 -156 -246 323 429 -221 -200 385 266 -455 -118 384 27 -537 -135 282 -222 -496 135
2755 135 365 -227 -261 459 352 -184 -58 488 173 -402 -51 421 -109 -509 92 403 -112 -310 338 370 -360
2776 -360 -309 323 105 -521 -224 273 -86 -473 73 485 39 -185 366 585 -82 -145 354 241 -519 -431 120
2797 120 -214 -632 -245 383 -52 -407 195 535 18 -54 430 544 -90 -77 444 138 -491 -306 185 -207 -624
2818 -624 -212 209 -273 -471 149 428 -56 -78 583 574 -32 23 616 180 -368 -177 238 -264 -703 -210 72
2839 72 -424 -528 144 427 -101 -24 659 582 -130 99 558 113 -429 -134 203 -324 -615 -16 244 -298 -312
2860 -312 289 327 -224 -5 500 240 -247 -26 446 55 -401 62 292 -101 -433 223 334 -289 -294 319 152
2881 152 -429 -189 368 -16 -384 -19 387 -54 -323 187 362 -188 -236 309 297 -219 -198 363 213 -350 -99
2902 -99 353 -72 -417 -156 176 -283 -454 191 233 -193 -155 532 396 -126 119 553 150 -373 -131 279 -347
2923 -347 -614 -161 202 -376 -438 240 335 -229 62 603 408 -110 151 549 41 -419 -52 184 -348 -554 -59
2944 -59 135 -382 -361 265 277 -276 6 486 268 -210 163 537 29 -264 136 260 -224 -413 92 71 -482
2965 -482 -349 238 62 -280 -67 465 144 -226 215 470 -10 -314 198 302 -355 -379 153 57 -442 -227 282
2986 282 141 -303 23 439 18 -282 146 333 -147 -353 144 295 -288 -201 341 231 -253 -25 443 30
3006 30 -347 -31 306 -210 -410 29 239 -276 -288 314 231 -165 -30 478 139 -261 17 477 -29 -420 58
3027 58 296 -205 -386 112 205 -312 -231 226 118 -285 -6 429 89 -179 167 453 -28 -239 115 303 -296
3048 -296 -367 108 22 -489 -326 237 86 -325 40 486 181 -118 299 419 -100 -223 147 182 -323 -351 96
3069 96 30 -386 -121 343 45 -290 73 413 -2 -167 113 312 -218 -257 242 137 -326 -235 281 75 -345
3090 -345 -48 315 -38 -392 -5 329 -166 -254 238 314 -155 -208 327 197 -343 -105 304 -10 -478 -17 351
3111 351 -25 -261 121 262 -169 -199 284 302 -263 -259 265 39 -379 -126 345 66 -300 119 398 -97 -277
3132 -277 247 251 -245 -280 231 122 -355 -130 250 12 -252 74 397 10 -236 152 283 -176 -278 95 167
3153 167 -275 -212 235 108 -371 4 321 -28 -352 101 265 -123 -331 191 249 -203 -173 259 216 -299 -128
3174 -128 285 81 -317 -13 340 -75 -323 146 243 -156 -240 265 244 -172 -138 328 91 -360 -146 272 -95
3195 -95 -365 -21 291 -86 -296 207 294 -140 -161 279 224 -245 -138 238 50 -401 39 316 -130 -227 80 316
3217 316 -138 -250 211 224 -287 -134 305 116 -307 -72 278 79 -378 67 297 -53 -319 114 211 -262 -227
3238 -227 170 129 -189 -66 317 124 -110 69 341 -5 -296 96 274 -184 -327 89 193 -208 -226 282 206
3259 206 -237 -56 347 -25 -253 -16 292 -106 -419 118 256 -197 -201 181 173 -327 -187 264 103 -245 -16
3280 -16 360 29 -255 115 365 -119 -206 240 212 -230 -258 202 55 -364 -141 258 40 -331 79 352 0
3301 0 -207 220 274 -127 -207 168 187 -290 -221 188 39 -338 -23 364 71 -251 70 290 -57 -236 116 113 -200
3324 -200 -231 219 153 -187 -79 380 71 -337 8 306 -26 -318 31 217 -175 -342 147 147 -219 -131 291 186
3346 186 -230 -41 267 18 -226 74 294 -123 -288 185 257 -227 -221 183 108 -344 -232 216 -10 -249 77
3367 77 272 31 -207 208 369 -63 -119 145 135 -266 -238 113 0 -386 -182 186 51 -165 105 420 2
3388 2 -93 294 296 -171 -160 181 74 -287 -149 193 -1 -324 29 327 -30 -206 144 318 -139 -168 233 181 -136
3411 -136 -159 275 107 -232 -78 283 -33 -319 -9 205 -81 -283 69 235 -140 -174 289 234 -207 -65 267
3432 267 45 -294 -50 229 -134 -330 36 232 -128 -219 243 266 -176 -170 193 86 -288 -99 257 -10 -300
3453 -300 63 299 -83 -212 208 263 -143 -154 222 130 -304 -198 224 -29 -350 -72 261 12 -225 187 372
3474 372 61 -164 289 158 -205 -163 242 32 -327 -194 195 -3 -316 23 165 -102 -181 126 230 -123 -123
3495 -123 332 263 -146 -22 302 126 -327 -83 157 -149 -381 -38 163 -155 -209 217 234 -120 -24 329 201
3516 201 -77 -63 366 -30 -316 -98 107 -194 -351 60 175 -110 -208 277 254 -176 -60 217 156 -256 -25
3537 -25 285 -52 -281 135 219 -107 -196 159 149 -186 -136 191 122 -208 -142 226 2 -213 -46 275 11 -213
3559 -213 157 310 -85 -230 135 184 -185 -179 107 57 -186 -16 232 -71 -234 53 231 -44 -191 170 260 -104
3581 -104 -126 291 201 -166 36 294 92 -291 -45 200 -161 -307 59 156 -156 -190 160 196 -82 -56 286 122
3603 122 -171 9 262 -54 -220 -70 143 -122 -231 66 196 -174 -128 204 157 -179 -62 280 120 -220 -13
3624 -13 259 -34 -215 65 235 -150 -307 87 101 -228 -199 150 103 -240 -49 238 130 -161 124 310 -68
3645 -68 -151 103 169 -216 -296 136 96 -218 -95 206 67 -143 -34 301 -6 -175 100 203 -183 -235 64 140
3667 140 -149 -103 219 146 -175 -80 273 -37 -207 40 161 -64 -180 65 234 -102 -103 163 200 -195 -77 240
3689 240 73 -224 -102 257 -60 -278 45 251 -106 -93 153 186 -151 -124 103 22 -270 -95 243 18 -219
3710 -219 8 296 -40 -133 171 212 -97 -153 126 84 -238 -139 145 68 -227 49 274 54 -161 79 223 -72
3732 -72 -200 72 193 -248 -226 123 72 -262 -35 275 91 -185 86 136 -44 -272 52 151 -153 -150 90 157 -135
3755 -135 -59 269 103 -166 -106 138 -27 -224 69 205 -91 -164 145 239 -81 -113 255 157 -193 -102 159 -43
3777 -43 -203 -42 244 -75 -210 137 198 -77 -160 202 159 -190 -122 188 22 -282 -117 110 -6 -249 72 171
3799 171 -11 -175 184 152 -124 -122 126 121 -136 -59 231 35 -190 -24 183 -65 -227 49 109 -156 -200 181 154
3822 154 -164 -48 224 128 -122 52 205 25 -260 -40 164 -186 -261 33 133 -138 -116 225 212 -171 -20
3843 -20 305 102 -200 21 168 -34 -217 -7 157 -91 -145 125 167 -119 -162 221 88 -216 -64 256 11
3864 11 -254 74 257 -57 -174 148 238 -73 -116 141 137 -182 -79 135 28 -225 -35 166 -64 -189 32 256
3886 256 -36 -145 118 144 -201 -93 206 73 -174 -43 253 28 -186 23 120 -144 -245 54 68 -195 -211
3907 -211 131 151 -44 -43 256 137 -106 -8 223 -17 -260 -33 71 -158 -195 47 84 -193 -131 235 137 -94 27
3930 27 254 143 -181 51 170 -107 -236 13 116 -159 -254 71 125 -225 -139 196 72 -131 -3 248 -15
3951 -15 -213 66 278 -93 -158 128 132 -210 -198 69 14 -236 -133 203 31 -118 41 198 13 -120 102 193
3973 193 -16 -190 129 118 -218 -149 150 15 -209 -53 141 91 -192 64 189 -83 -240 89 142 -222 -132 152
3995 152 56 -178 -20 184 74 -110 0 156 -78 -231 -2 184 -167 -175 133 74 -103 -110 150 89 -113 20
4017 20 158 25 -52 42 196 -35 -210 89 195 -116 -149 125 78 -226 -95 82 34 -179 43 241 73 -170
4039 -170 92 204 -156 -181 81 39 -230 -153 33 109 -215 -73 159 9 -107 135 208 55 -68 138 160 -93
4061 -93 -167 48 79 -142 -88 86 35 -193 -9 208 -30 -137 98 192 -65 -152 133 138 -102 -79 156 57 -181 -38
4085 -38 159 -43 -215 -51 138 -83 -268 58 203 -86 -108 151 143 -133 -82 139 -1 -194 -72 131 -52 -219
4107 -219 90 102 -71 -147 104 154 -118 -170 177 62 -164 -130 143 10 -188 -42 155 21 -101 108 186 -130
4129 -130 -118 121 91 -118 -137 120 -38 -130 -41 174 0 -112 63 197 -67 -181 130 119 -169 -122 144 6
4151 6 -108 -10 171 1 -131 17 200 -74 -184 62 143 -100 -214 90 126 -146 -93 156 84 -143 -78 161 -54
4174 -54 -196 -39 147 -37 -206 130 161 -117 -14 193 127 -132 -24 170 -8 -140 -56 143 -48 -181 55
4195 55 94 -74 -143 207 154 -94 -107 163 109 -178 -46 154 -5 -173 -16 123 -162 -207 61 119 -116 -137 176
4218 176 104 -191 -66 152 85 -135 -7 153 -70 -170 21 122 -146 -192 36 39 -119 -17 163 128 -60 -9
4240 -9 244 131 -180 3 129 -121 -170 79 32 -141 -140 105 25 -140 -31 238 127 -92 50 245 -6 -182
4262 -182 71 237 -56 -129 61 60 -112 -127 59 36 -232 -52 154 -18 -134 14 199 8 -101 135 187 -145
4284 -145 -114 124 83 -164 -110 81 -31 -195 -41 227 10 -107 96 206 59 -196 51 150 -170 -121 82 -24
4306 -24 -188 -44 185 9 -125 90 185 -61 -122 28 153 -138 -152 110 88 -200 -22 149 110 -59 36 226
4328 226 27 -97 -2 131 -83 -163 42 48 -156 -134 124 8 -141 -83 124 102 -79 3 201 -11 -108 128 192
4351 192 -63 -40 145 -25 -199 -109 51 -30 -195 -37 183 19 -145 148 235 30 -58 146 158 -108 -112 94 -20
4374 -20 -259 -127 45 -77 -245 -27 142 -15 -128 141 238 22 -60 163 59 -138 -92 155 46 -218 -63
4395 -63 74 -63 -141 22 117 -77 -132 94 78 -46 -92 160 93 -127 -35 119 26 -124 25 163 -51 -182 50
4418 50 84 -115 -134 114 105 -121 -61 109 28 -132 -68 179 10 -170 26 190 15 -75 106 143 -55 -83 88 77
4442 77 -170 -69 138 -55 -174 -61 202 -36 -106 103 167 26 -6 171 158 -138 -45 122 35 -158 -72 125 -65
4465 -65 -185 -3 175 15 -89 155 235 -23 -62 156 103 -97 -60 126 26 -304 -57 66 -51 -185 -26 109
4487 109 -128 -142 97 131 12 64 191 137 -88 -56 166 -23 -197 -50 77 -121 -218 12 60 -120 -104 146 208
4510 208 -24 70 157 75 -135 -10 40 -45 -200 44 115 -61 -192 44 33 -193 -109 153 52 -134 68 150 0
4533 0 -148 -4 128 -38 -120 143 166 -56 -99 54 21 -151 -76 103 47 -103 12 194 -24 -114 54 129 -82
4556 -82 -103 73 109 -76 -37 121 126 -155 34 162 64 -148 -22 72 -45 -166 39 106 -83 -96 140 125 -53 40
4580 40 194 152 -72 -26 87 -45 -226 -34 91 -157 -155 87 120 -123 7 151 83 -62 -34 100 24 -117 -58
4603 -58 95 -81 -93 -47 147 -131 -111 69 32 -132 -141 130 92 -140 51 182 53 -104 90 88 -57 -126 71 94
4627 94 -113 -194 39 -36 -123 -52 188 46 -145 48 143 58 -115 130 118 -20 -98 74 20 -143 -115 146 22 -173
4651 -173 -40 163 -13 -108 96 139 -31 -86 76 109 -57 -106 61 4 -109 96 75 21 -135 -16 119 -42 -99
4674 -99 -16 83 -60 -88 48 74 -6 -94 106 111 -103 2 91 -3 -165 7 40 5 -83 94 68 -51 -39 107 72 -59
4700 -59 -61 71 -3 -122 -51 185 14 -132 39 163 -92 -106 103 63 -106 -149 50 17 -137 -26 82 3 -98
4723 -98 38 123 -57 -152 7 126 -122 -166 40 122 -120 -86 104 27 -105 -31 109 20 -113 101 144 -43 -111 99
4747 99 59 -44 -73 107 48 -98 -24 115 51 -123 -59 122 -18 -23 26 166 9 -102 123 101 -66 -25 76 -38
4771 -38 -177 -5 92 -43 -135 -11 63 -29 -21 124 78 -67 -91 180 -7 -172 -39 106 45 -198 -21 65 -23 -119
4795 -119 -5 99 -91 -139 57 82 -93 -27 158 48 -75 66 107 34 -103 -20 76 -105 -180 22 97 -66 -23
4818 -23 129 123 -71 23 168 87 -125 17 138 -31 -134 -14 85 -98 -90 104 101 -40 -54 79 78 -143 18 97 25
4843 25 -89 9 78 -68 -95 42 94 -70 -6 107 24 -109 -25 101 59 -122 19 104 -42 -134 8 162 -91 -60
4867 -60 72 93 -77 -42 58 21 -164 -34 87 66 -157 25 87 -23 -117 90 64 -72 -90 121 106 -123 -15
4890 -15 106 95 -72 10 128 -36 -100 63 65 -145 -98 14 63 -96 -69 147 65 -65 40 139 23 -115 -32 90
4914 90 -36 -142 1 13 -129 -155 40 35 -14 -14 133 79 -93 3 187 63 -124 36 136 -50 -141 72 30 -97
4938 -97 -137 62 39 -113 -30 105 34 -123 7 172 35 -41 97 116 -26 -143 -43 10 -120 -141 65 59 -79 -5
4962 -5 99 63 -114 95 73 -28 -71 14 26 -55 -73 27 100 -122 -4 117 88 -105 76 143 16 -102 19 135
4986 135 -39 -122 81 38 -60 -80 114 21 -118 68 42 -9 -75 -31 38 -2 -116 -14 69 -115 -49 78 6 -84 -24
5011 -24 87 72 -7 -7 135 58 -94 67 78 -65 -126 81 43 -140 -146 65 25 -78 4 147 25 -24 98 136 59
5036 59 3 155 90 -60 -45 57 -3 -149 -114 45 -2 -144 23 141 11 -55 98 143 21 -28 90 86 -82 -81 50
5061 50 86 -168 -3 80 12 -130 1 110 -12 -49 97 89 -33 -72 41 51 -109 -9 27 48 -174 49 38 -87
5085 -87 -187 69 86 -100 -39 78 84 -51 -44 77 21 -16 -39 68 46 -119 34 3 -29 -71 80 110 -30 -84 86
5110 86 50 -146 -71 55 22 -155 -5 106 -33 -44 117 136 91 -72 57 11 -109 -53 44 -28 -107 -72 60 -21 -81
5135 -81 -21 197 19 -5 54 46 43 -54 116 63 -45 -9 48 -30 -103 -39 90 20 -76 -25 7 -52 -80 17 84 -73 -43 143
5163 143 116 -134 -9 120 -33 -124 -14 81 -62 -68 8 130 -43 -64 92 54 -45 32 131 65 -91 -16 102 28 -135
5188 -135 40 78 -72 -81 81 84 -87 -42 64 32 -98 -30 136 -32 -57 -19 36 15 -98 64 55 -72 -167 78 53
5213 53 -117 -102 138 38 -49 9 125 3 -102 -15 109 -28 -91 18 45 -12 -103 13 46 -79 10 117 5 -13
5237 -13 62 175 -92 -111 50 106 -42 -100 115 26 -57 6 109 58 -90 -5 132 31 -170 -39 102 -69 -92 13
5261 13 84 -68 -40 115 99 -107 -84 47 4 -93 8 66 -26 -111 -2 60 -59 -59 78 34 -85 -14 65 -7 -122 -37
5287 -37 83 3 -72 55 71 -43 -65 29 85 -53 -21 124 34 -71 -48 90 6 -110 67 65 57 -51 76 29 -69 -52
5313 -52 32 50 -125 -14 60 1 -26 -58 88 52 -61 27 89 12 -106 66 54 -81 -45 24 39 -64 -53 75 3 -78
5339 -78 17 51 -17 -83 -21 69 -57 -21 49 141 -59 -12 105 61 -68 -79 115 7 -87 3 72 14 -64 59 117 -45
5365 -45 -34 14 -4 -86 10 86 -19 -76 -8 102 -41 -70 -11 123 -91 -71 116 39 -6 -124 74 36 -87 -31 104
5390 104 72 -76 -8 98 -26 -107 14 108 -83 -71 28 47 -96 -11 102 85 -53 -40 76 -29 -92 20 93 -64
5414 -64 -99 41 37 -116 -34 41 28 -72 18 60 -2 -85 -33 82 3 -85 11 113 -25 20 66 1 -30 -5 36 -3 -50 -22
5442 -22 48 42 -132 17 30 -43 -123 41 70 9 -66 102 56 -95 -17 48 25 -99 27 115 -27 -49 59 70 21 -73
5468 -73 33 33 -27 -41 68 43 -58 -30 123 37 -94 -33 20 -45 -15 -25 52 -46 -80 144 19 26 -10 125 42 -50 -46 37
5496 37 -13 -151 70 89 -105 -81 71 99 -78 -43 40 70 -65 -35 78 -10 -32 9 60 -58 -87 23 32 7 -85 75
5522 75 10 -56 -2 20 -16 -37 -14 48 1 -108 108 12 -37 -34 67 6 -96 -80 36 39 -77 -27 75 36 -77 -6 72
5549 72 -16 -75 -1 62 -35 -34 -21 26 -41 1 116 7 -87 -25 70 -10 -59 -21 67 -3 -66 -39 44 28 -23 19 75 -52 12
5578 12 117 73 -78 17 85 15 -57 -36 72 -22 -65 110 79 -32 -43 81 2 -2 -50 65 38 -79 10 49 -72 -94
5604 -94 -28 83 -60 -43 13 32 -95 -78 43 33 -29 25 80 26 -56 14 -8 13 -93 1 8 -69 -3 29 41 -74 -13 42
5632 42 -30 -78 21 69 -52 -2 34 58 -45 -63 52 -32 -26 -48 71 34 -44 -25 78 -37 -49 -5 -78 -17 -102 75 2
5659 2 9 -35 12 67 -91 12 94 13 -73 -13 121 -44 -135 21 70 -54 -131 5 35 -66 -21 10 75 -50 -16 47 -27
5686 -27 -124 67 53 -7 -77 -4 0 -88 -42 3 23 -30 12 104 -10 2 -43 100 -59 20 60 18 -44 -14 44 52 -105 -18 14
5715 14 32 -63 -67 68 44 -35 -18 86 12 -94 -9 102 -46 -20 61 -18 -49 15 20 6 -88 -9 164 22 -11 13 51 -42
5743 -42 -12 49 53 -15 19 126 42 -76 -27 29 -24 -111 -28 -3 -57 46 29 65 8 8 59 63 -36 -23 138 -29 -88 54 110
5772 110 30 -51 116 77 -28 -71 64 93 -27 -29 34 4 -12 -32 75 -48 -27 65 -41 -26 -13 74 92 -48 -49 73
5798 73 6 -4 -24 57 34 -68 16 130 -5 -10 24 26 -38 -44 91 71 -22 -18 88 36 -44 59 94 -16 -118 -83 70 -69
5826 -69 -12 103 46 -81 -85 93 90 -42 54 55 -27 -82 -8 89 -26 -62 -28 21 4 -38 93 61 -59 50 64 24 -68 -73
5854 -73 111 -17 -82 30 75 15 -40 53 63 -54 33 60 1 -62 -13 72 6 -56 17 65 30 -100 -11 3 -30 -36 56 -20
5882 -20 -27 -40 100 19 -30 -55 88 12 -58 19 86 10 -98 5 77 -6 -65 74 -11 -37 -85 95 -2 -50 58 44 27
5909 27 -91 -59 11 -24 -72 35 56 -11 -53 75 3 -15 -14 91 10 -24 -12 25 -8 -35 -1 83 23 -5 29 28 -75 -91 45
5938 45 -49 -57 2 45 89 -78 -17 111 7 -48 55 91 -41 -47 60 15 -79 1 21 60 -17 -1 85 -87 -38 -8 62 31
5966 31 -3 53 -10 -39 51 52 50 -47 -7 42 37 -39 1 59 -29 -69 52 103 -49 -47 56 45 -25 -17 60 -27 -119 -43 14 4 0 13
5998 13 56 -39 13 61 46 -63 -21 30 -11 -63 -59 36 -30 -37 29 48 11 -26 13 59 -10 -27 103 -9 -24 -18 -23 -29 -18 -7 93
6029 93 -21 -73 25 76 17 -10 125 16 -62 -70 -9 1 -59 -5 31 1 -71 35 139 -28 -70 44 41 9 -36 44 43 -33
6057 -33 -71 15 -22 -12 2 8 -34 -96 51 62 22 -66 37 34 -77 -30 43 51 -70 -72 77 68 -44 18 38 -24 -48 28 67 -29
6087 -29 33 32 69 -36 -33 37 -28 -30 -14 39 -31 -34 -31 105 50 49 54 46 1 -59 3 26 -34 -10 11 -40 -113 32 23 17 -23 32 64 -8
6121 -8 -19 11 11 -75 -25 -7 -16 -78 16 75 -47 -116 43 13 59 64 9 49 27 30 10 38 -21 -39 79 10 -65 6 113 -45
6151 -45 -16 -51 33 -76 -78 12 43 -47 22 93 21 -79 -25 52 10 -65 -24 -8 13 -26 55 69 -32 -15 2 31 -56 -12 40
6180 40 -29 -102 -61 78 -1 -27 -2 62 -102 -40 75 6 -29 -17 71 16 -11 4 11 6 -72 -45 49 -9 -37 76 18 -19 -57
6209 -57 -21 20 -50 -42 62 -26 -83 -7 -9 7 7 9 64 -4 -6 11 -3 27 -40 48 0 -21 23 27 -61 -28 -34 65 -6 -61 2 26 -20
6242 -20 -52 19 5 21 -34 90 3 -76 19 24 19 -39 -4 45 -50 -6 23 40 -10 -41 30 -32 -44 -49 8 -37 -116 0 38 29 19
6273 19 2 45 -41 -74 35 92 -14 -95 60 65 -112 -55 69 -21 21 91 56 -35 -10 74 98 -41 45 22 8 -68 49
6300 49 9 36 -50 75 33 11 -13 -17 64 -43 -102 -18 10 -93 4 75 72 -59 -25 14 30 -40 84 73 -9 -59 24 30 -71
6329 -71 -40 59 -5 -30 -29 28 -42 -24 -50 34 -49 -42 29 -30 -12 -78 39 2 -86 -85 17 -7 -56 -45 45 -9 -56 -8 33 8 -54
6360 -54 61 73 -17 -58 25 50 -88 -50 28 77 -37 -15 33 5 -37 -22 29 -42 22 69 113 -10 -3 6 15 -41 -33 80 -39
6389 -39 -43 -67 50 -38 -40 16 19 -36 -31 58 91 -48 -36 16 -6 -112 35 21 -4 -40 -30 45 -7 -31 -40 54 -13 -71 107 -11
6419 -11 -33 -29 72 37 -52 -30 -1 -22 -106 19 87 9 3 36 75 -75 -19 40 30 -31 -61 16 3 -33 -28 59 27 -65 60 -1
6449 -1 0 -42 11 23 -86 -66 61 -29 -46 -25 83 -55 12 1 104 -10 -10 44 71 -29 14 56 -43 -76 -48 32 -12 -11 54
6478 54 59 -21 -124 25 13 -19 -83 62 70 26 30 99 -18 -47 -24 11 16 -121 -17 -58 -33 -64 84 59 -42 -43 30 57 -41
6507 -41 37 22 23 -49 6 95 -78 -46 -2 62 -5 -34 60 -8 -18 25 37 57 -30 -28 -10 -14 -21 94 15 -18 -13 33 9 -16 -39 -5
6539 -5 20 -50 -2 -25 -5 -71 -12 22 -41 -90 -52 18 28 -78 8 9 -9 20 36 -3 2 -51 -2 -15 -141 -54 61 -105 -41 69
6569 69 11 -1 20 67 23 -25 -1 64 7 -16 -20 39 -40 -49 -4 38 -39 -73 22 -20 -6 74 26 47 -26 -31 31 64 -33 -17 32 -24
6601 -24 -16 7 55 -58 -113 2 -32 -34 -10 -12 -22 -37 -3 80 -44 -16 9 15 -60 -61 -31 5 -34 -43 -19 30 -10 -33 39 18 -13 -3
6633 -3 18 -6 -8 80 -6 -1 -66 43 38 10 -21 27 73 -7 2 -17 -25 -25 -43 39 0 -70 1 59 -74 0 51 1 28 -16 99 -58
6665 -58 -8 25 39 -38 -32 14 100 -85 -19 5 -24 19 -45 7 37 -30 7 102 59 16 36 -16 -45 -24 -44 31 -91 -64 -4 53
6695 53 -29 28 72 -16 23 11 89 69 3 -43 13 -12 -49 -2 15 -27 6 103 18 -35 -2 28 -9 -75 21 64 5 -39 65 41
6725 41 -46 -9 25 23 -29 -11 -35 4 -34 -62 29 11 -44 -45 114 -8 -68 60 3 -13 -85 15 -9 -21 -11 29 13 -29 66
6754 66 -7 -47 -61 24 85 -41 16 39 15 -74 -3 74 33 -13 -26 54 -11 -22 26 6 -24 -72 23 24 17 11 16 45 -24 -18 -2 2 -78
6787 -78 5 17 -13 -11 8 28 -66 -15 29 -27 -45 29 38 -7 -46 31 61 -32 -18 -19 27 -21 -36 -23 -2 -35 -65 0 41 -54 8 17
6819 17 -14 -109 -34 41 -3 -62 -14 110 27 -7 50 40 12 41 48 6 -33 69 66 -26 -27 -19 32 16 27 49 47 -56 16 -11 44
6850 44 -18 -26 87 -18 -40 -15 39 -35 -45 14 39 -28 -39 1 40 1 -16 88 35 -61 2 29 -46 -17 24 106 -69 -1 30
6879 30 -3 -15 20 3 47 -16 -19 59 -17 -55 -31 73 6 -18 -27 39 -14 -104 40 29 -14 -53 123 60 -36 39 -15 -7 -122 9
6909 9 69 -9 -85 13 36 -45 -54 45 39 -53 -3 -12 -21 -7 -51 42 4 14 41 25 32 -44 -15 11 -63 -26 -44 -15 -55 48 62 12 -79
6942 -79 -29 20 34 8 24 14 -28 -25 19 -27 -22 36 23 56 -99 28 48 41 -1 1 74 8 -66 24 -42 -2 -33 -18 38 -84 -58
6973 -58 49 -16 -73 31 62 -35 -1 10 -27 16 -60 43 49 11 -25 50 20 -38 -24 30 -36 -36 -25 47 -2 -31 39 -12 5 -18
7003 -18 32 -13 -3 10 71 1 -7 -12 124 -42 30 -72 25 -7 -39 1 18 -18 -41 34 8 -22 -35 31 12 -7 15 45 1 -2
7033 -2 54 -42 -16 -14 16 -11 -13 -9 69 35 -9 3 57 -33 -36 -23 34 34 -31 58 82 -34 -8 60 7 -62 -33 61 -45 -45 18 45 55
7066 55 -53 -2 37 -10 -16 -14 73 -16 -19 8 42 -53 -46 44 17 -30 3 103 33 -25 14 32 -73 -30 84 6 -9 -19 29 16
7096 16 12 41 68 35 -80 -45 73 35 -51 -9 42 -25 -114 -23 -2 -4 -25 89 -17 -9 42 39 -27 30 1 33 -25 -143 -9
7125 -9 -47 -82 -46 42 5 6 41 44 -31 -39 0 13 -24 -3 84 37 -53 -27 61 -29 -30 6 52 17 14 42 22 9 8 28 34 53 -20 4
7159 4 41 59 -34 -30 -3 -46 -40 42 36 36 -10 25 -71 -45 -32 15 -29 15 51 -18 -42 -12 5 9 48 -35 117 -31 -26 44 38 2 -39
7192 -39 27 -6 -3 -27 53 21 -25 -13 37 61 -16 13 6 -35 -17 67 -22 -10 -1 55 -16 -53 19 4 15 9 -69 27 -22 -9 -9 34 44
7225 44 -24 108 -27 -36 -71 108 6 -25 -38 14 -13 -30 21 57 56 -75 2 16 57 0 60 29 7 -31 37 -2 3 -81 65
7254 65 53 -38 40 56 -87 6 -18 42 -30 -45 76 20 26 19 32 3 17 -16 24 -43 -22 -1 -28 -39 -87 20 8 -67 -25 50
7284 50 20 -56 19 71 -38 -29 20 26 -30 -110 28 -1 -32 -44 34 59 -29 -40 34 -2 -30 -69 -12 57 -75 -25 43 26 -18 16
7314 16 14 -69 -59 64 6 -12 2 15 -42 -47 -35 -13 7 11 14 62 -35 20 17 -39 -8 -18 31 -41 -88 -14 -32 -41 -25 -73 -2 -3 32
7347 32 -5 69 -119 1 46 28 -23 -26 -14 -26 -26 29 22 -35 61 29 55 -29 -65 -3 38 31 70 22 54 -16 -41 54 -31 1 -62
7378 -62 -11 37 -23 52 5 34 5 1 -18 -72 -16 20 -8 -6 -32 21 -23 -16 4 57 32 -89 47 -8 -36 -45 5 0 -41 -53 -2 0
7410 0 13 -67 -13 -12 -18 58 15 -1 -40 -4 28 -38 2 66 27 -7 50 32 25 -38 16 -15 -52 -47 45 48 3 -23 47 -14 -40 -35 29 -23
7444 -23 -101 26 16 -54 -22 4 40 -3 -117 48 12 -17 61 3 -34 -71 -50 35 10 25 24 29 -60 -65 18 38 -45 3 105 5
7474 5 -16 -16 35 4 -15 6 60 27 -38 31 65 -15 -12 31 -31 57 -11 103 -80 -37 -19 12 -7 -42 3 -30 -24 -46 10 57 -95
7505 -95 -59 -11 -14 -30 -15 47 11 -47 -35 -51 -28 -46 55 15 -26 -9 -19 42 -45 31 83 3 2 -58 47 -38 -54 9 15 -5 -16
7536 -16 19 4 -13 21 41 1 -19 -62 -4 6 -49 15 42 23 -57 2 47 -16 -2 36 6 -16 -81 -2 31 -37 36 -26 -14 -49
7566 -49 -9 83 -55 -22 55 53 -20 12 24 47 -52 -56 31 -25 9 -53 60 -26 -41 59 4 -35 -14 4 -16 -59 68 78 -10
7595 -10 28 -4 65 73 14 -28 49 -19 -9 7 40 9 3 13 60 -3 11 14 -28 -33 -19 29 -60 -86 -20 7 -52 -70 2 -36 49 -22
7627 -22 16 31 -39 -30 24 57 -27 -42 86 -21 -41 23 8 -46 -140 -4 1 -23 31 45 32 -108 58 28 33 -21 -15 73 4 -56
7657 -56 26 31 33 3 31 65 -31 10 27 38 36 -32 -3 -8 -36 -30 -34 0 -24 45 -29 12 3 32 6 -23 -13 49 -32 -21 2 2 -33 -29 25
7692 25 -57 -19 22 42 -4 -35 -52 73 35 -29 -43 65 -64 -92 19 -12 -19 -57 44 26 -56 -36 23 80 -9 20 30 5
7720 5 -20 19 -13 -35 6 20 72 -72 -50 107 1 -28 -29 9 56 -35 21 62 -31 -9 13 100 -56 5 62 53 -56 13 38
7749 38 61 41 -49 -6 107 -2 1 -41 2 -64 64 42 29 -17 16 -36 -37 50 73 11 -89 -14 4 -59 -3 -19 17 38 -44
7778 -44 15 -2 -58 -24 35 -8 83 -2 66 -1 -33 -39 -47 0 -72 23 -9 -18 10 37 50 -21 -21 49 -42 26 5 7 -1 -25 44 74 52
7811 52 -7 76 2 -40 34 -20 -74 -37 -61 122 -35 -21 46 31 -11 -38 30 14 -64 37 4 28 -70 -68 33 69 35 47 39
7840 39 -37 -28 45 27 4 -23 7 35 -77 -38 6 34 -70 16 43 -68 -48 -4 60 -27 -47 41 1 16 -60 4 22 -45 21
7869 21 -87 26 -55 11 41 33 0 22 -7 -45 -26 20 10 -15 21 8 41 -60 -59 54 8 28 -17 65 -50 -76 22 90 39
7898 39 8 -42 -30 8 -31 -11 -18 10 9 -18 24 -18 1 64 12 -63 32 46 11 -31 21 5 -7 -30 11 7 25 27 33 -18 48 9 31
7931 31 15 -25 22 -7 -1 -81 2 67 -1 54 9 36 -74 28 59 50 -2 -9 11 -5 5 6 72 -81 -23 44 -23 -15 31 -51 12
7962 12 29 -30 54 -8 -40 -23 47 3 -23 32 -21 -44 -43 12 0 -33 -9 49 -21 -65 24 48 -28 -109 -11 -67 -18 20 79 -5 -32
7993 -32 25 59 36 -12 29 61 -13 -15 3 27 24 -29 19 66 -12 42 70 -62 18 10 61 -17 -19 16 -10 -30 -54 -8 9 -31 33 49
8025 49 -28 16 32 -49 16 -27 25 7 -52 -11 28 14 -46 12 50 -8 -76 6 -5 25 -45 -36 20 -5 26 63 15 21 -48 2 -2 -6
8057 -6 58 -39 30 -18 -26 16 -48 12 -83 -24 19 -17 -15 44 -22 -42 -4 -39 -37 50 64 -81 -6 48 49 -6 14 23 47 28 -25 29 -16
8090 -16 -20 -6 -9 13 -4 -20 27 -51 30 -7 -7 -42 58 79 45 10 -10 63 44 -33 8 11 11 8 -21 -19 19 -33 -28 -35 -18 -43 41 56
8124 56 -7 20 -51 -54 -6 -35 54 51 -46 20 75 82 -35 80 4 19 37 -45 14 15 11 6 -37 -30 -1 11 -79 -31 -30 29 62 6 -16
8157 -16 -15 -27 -47 17 25 -43 -40 -27 -2 12 40 77 40 62 -5 32 -41 -68 64 63 -47 -40 -8 21 24 18 31 21 -63 45 14 -71
8189 -71 -54 -15
8191a5
$$ Imaginary data points
##PAGE= N=2
##DATA TABLE= (X++(I..I)), XYDATA
0 0 0 0 0 0 0 0 0 0 0 0 0 0 0 0 0 0 0 6 -8 8 -8 8 -8 8 -10 16 -16 16 -19 24 -24 27 -32 34 -40 43 -49 55 -59 66
40 66 -74 82 -90 99 -112 123 -136 152 -171 192 -217 248 -285 332 -393 481 -609 816 -1217 2265
60 2265 -10576 -23937 -4075 -8564 -22386 -14225 4676 -34 -6297 6884 19459 10736 4206 13715
74 13715 18131 3453 -4863 4067 4370 -12744 -15495 -1281 -3458 -18215 -10450 5926 -923 -10419
88 -10419 3833 14397 2540 -1980 11618 13436 -489 -2092 8087 4938 -8057 -7196 2771 -1528
102 -1528 -12815 -6938 4982 -1720 -10438 1366 10884 -1071 -5945 8393 9974 -5151 -4308 8499
116 8499 3209 -8987 -2454 7452 175 -7151 1473 8543 167 -5911 2764 6887 -4760 -9528 1451
131 1451 2493 -10551 -8821 5464 2544 -8004 1302 13234 4771 -2239 8591 12713 58 -4586
145 -4586 3875 2601 -9446 -10705 -1725 -3097 -11969 -8133 3546 1656 -5726 2455 13236 5954
159 5954 -1090 9212 13426 306 -3807 6130 3447 -9841 -8513 371 -4835 -13204 -6921 1571
173 1571 -2756 -6855 1868 9487 3892 400 9316 13130 2479 -1189 7566 5142 -8269 -7502 1430
188 1430 -5027 -14344 -6308 1980 -4757 -7447 3529 8476 1300 732 9385 9499 269 -784 5963
203 5963 2919 -7227 -5453 2503 -2417 -10395 -2995 4812 -2746 -6827 3819 7042 -2755 -2787 6886
218 6886 4888 -4211 -1259 6023 1488 -5223 -649 5021 -399 -5714 240 4890 -2270 -6060 2155
233 2155 4510 -4514 -4774 4916 3156 -5763 -1527 6427 665 -5524 1372 5883 -1333 -4248 3030
248 3030 4777 -2199 -3159 3703 3564 -3969 -3563 3494 978 -6925 -3314 4097 -1077 -6774 995 6398
264 6398 -1014 -2880 6075 6795 -1787 -1033 5725 2286 -5384 -3013 2141 -2179 -7571 -2868 2710 -1751
280 -1751 -5129 2062 6507 -103 -2034 6163 6365 -2608 -1741 5571 1486 -6334 -1947 3547 -2442 -6634
296 -6634 -168 3126 -2782 -4204 2400 3936 -1993 -2078 4569 4286 -2524 -1027 5646 2238 -4784 -532
312 -532 4610 -1891 -6468 401 2863 -4467 -4834 2893 2738 -3332 -843 5463 3135 -2184 744 5142
328 5142 913 -4228 -372 3248 -2372 -5941 469 3067 -3703 -3900 3950 3377 -3541 -665 5732 1493
344 1493 -4069 782 4498 -1237 -4153 1201 3140 -2417 -3656 2096 2745 -3244 -2994 3312 2015 -4243
360 -4243 -1427 4774 834 -4283 1348 5360 -966 -3557 3017 3567 -3407 -3301 2527 841 -4725 -2447
376 -2447 2777 533 -3644 44 4842 1194 -2658 2124 5167 -979 -3722 2310 2734 -4384 -3799 2733
392 2733 658 -4982 -1148 4096 58 -3445 1485 4333 -514 -2555 2094 3398 -1838 -2829 2494
407 2494 2426 -3219 -2316 3347 1242 -4477 -1052 3909 -788 -4567 1060 3755 -2059 -2970 3149 3197 -2327
424 -2327 -1258 3665 1885 -3137 -1093 3104 109 -4139 -629 3351 -846 -3893 1425 3911 -1929
439 -1929 -2963 3128 2576 -3802 -2121 3380 430 -4151 -122 3787 16 -2517 1990 4172 -465
454 -465 -2281 2027 2562 -2916 -3769 1275 488 -4848 -2812 2898 495 -3556 1168 5385 907 -1480
470 -1480 3655 4557 -1248 -2062 2305 988 -4124 -3238 917 -913 -4698 -2016 2338 -110 -3159 1127
486 1127 4823 561 -1429 3847 4893 -957 -1276 3725 1630 -4085 -2310 1564 -2078 -5700 -1972
501 -1972 1066 -2154 -3570 1310 3893 323 -230 4700 5127 -105 -256 3999 1637 -4254 -2455 1372
517 1372 -2627 -6248 -1586 1569 -2604 -3110 2616 3629 -524 130 4501 3276 -1224 -257 3187 628
533 628 -3557 -1275 2089 -1241 -4315 -45 2540 -2070 -3079 2270 2500 -2548 -1396 3356 1351 -2732
549 -2732 -34 3417 224 -2505 826 2947 -729 -2561 1172 2425 -1831 -2539 1910 1755 -3020 -1941
565 -1941 2709 425 -3797 -645 2955 -951 -3205 1386 3195 -963 -1289 3327 3222 -882 -397 3134
581 3134 1477 -2995 -1896 1271 -1573 -5195 -2145 1200 -2055 -3578 1769 4018 -153 178 5353
596 5353 4406 -465 697 3743 362 -3859 -1881 226 -3255 -5361 -1834 528 -2251 -2739 2041 3573
612 3573 -69 424 4994 3993 -689 681 4054 486 -3604 -734 1168 -3104 -4775 -756 155 -3331
628 -3331 -2811 1662 1896 -1112 467 4317 3111 -363 1429 4272 893 -2699 75 1696 -2913 -4610
644 -4610 -263 303 -3794 -2625 2168 1385 -1825 693 4138 1633 -1146 1333 3122 -358 -2613 401
660 401 1693 -2079 -2873 1296 1640 -2300 -1441 2891 1202 -2745 -277 2763 -616 -3216 399 2007
676 2007 -1638 -2224 1737 2281 -1036 -614 2850 2208 -1393 -581 2508 427 -3130 -1011 1705 -1597
692 -1597 -3845 -61 1674 -2046 -2321 2240 2258 -1307 -7 3701 2047 -1029 834 3161 376 -2322
708 -2322 -176 1185 -2131 -3989 -659 386 -3038 -2953 1514 1769 -1505 476 4606 2567 -496 2182
724 2182 4147 198 -2283 422 706 -3256 -3983 -760 -542 -3411 -2354 1604 1538 -1106 850 4338
740 4338 2166 -775 1747 3583 -365 -2510 802 1176 -3059 -3018 740 20 -3169 -1326 1894 439
756 439 -1880 521 3014 655 -1327 1410 2942 -327 -1664 1539 1884 -2116 -2129 1525 349 -3176
772 -3176 -1246 1962 -342 -2504 621 2512 -407 -1451 1664 2196 -1035 -1324 1603 1257 -2019 -1372
788 -1372 1795 623 -2282 -282 2660 111 -2210 815 2328 -1370 -2517 1091 1006 -2434 -1721 1648
804 1648 768 -1790 119 2806 1111 -1153 965 2705 -155 -2179 425 1323 -2188 -2925 654 693
820 693 -2627 -1376 2312 939 -1756 721 3148 542 -1250 1327 2317 -742 -1746 958 1124 -1925
836 -1925 -2010 943 411 -2465 -1317 1703 258 -2257 285 2812 147 -1343 1915 2790 -704 -1099
852 -1099 1888 1096 -2178 -1572 935 -475 -2828 -1060 1362 -234 -1855 745 2653 246 -1068 1894
868 1894 2508 -1102 -1381 1695 779 -2651 -1219 1562 -349 -2516 17 1935 -467 -1585 1037 1913
884 1913 -746 -1351 1373 1397 -1466 -1137 1682 935 -1890 -540 2089 23 -2290 292 1925 -1059
900 -1059 -2083 1074 1413 -1576 -1151 1832 1060 -1381 -301 1976 531 -1706 -174 1677 -451 -2224
916 -2224 235 1656 -1044 -1763 1419 1665 -1352 -803 2110 837 -1934 -324 1794 -335 -2140 265
932 265 1564 -707 -1491 1032 1595 -914 -1037 1390 1119 -1702 -1077 1665 345 -2153 -245 2038 -248
949 -248 -1768 947 1982 -959 -1406 1342 1109 -1681 -1151 1347 452 -1749 -345 1758 375 -1553
965 -1553 381 2039 -267 -1680 782 1474 -1410 -1649 1273 997 -1815 -726 2014 496 -1644 269
981 269 1886 -226 -1662 490 1308 -978 -1574 838 1258 -1160 -916 1702 1199 -1344 -326 2027 194
998 194 -2076 -50 1510 -986 -2152 611 1220 -1267 -1074 1568 1194 -1102 -321 1855 661 -1423
1014 -1423 -203 1587 -200 -1907 131 1442 -940 -1847 866 1232 -1528 -1244 1549 762 -1614 -168
1030 -168 2071 414 -1266 712 1949 -190 -1364 681 1148 -1377 -1856 427 439 -1990 -1408 1366
1046 1366 684 -1423 302 2648 679 -950 1305 2146 -572 -1492 852 591 -2016 -1766 549 130
1062 130 -1856 -744 1500 563 -1166 461 2170 282 -1070 994 1822 -850 -1451 1157 861 -1710
1078 -1710 -1128 1162 38 -1963 -468 1361 -281 -1494 413 1571 -252 -987 1181 1653 -581 -891
1094 -891 1441 980 -1600 -945 1278 10 -2133 -213 1534 -457 -1510 900 1562 -710 -983 1256
1110 1256 984 -1293 -850 1199 422 -1549 -357 1708 246 -1263 492 1967 -210 -1377 782 1164
1126 1164 -1535 -1638 738 261 -1912 -808 1439 258 -1102 719 2155 511 -650 999 1706 -517
1142 -517 -1342 501 576 -1832 -1650 658 72 -2024 -680 1530 152 -1301 772 2130 51 -621 1460
1159 1460 1683 -590 -730 1055 546 -1640 -1202 536 -434 -2221 -906 982 -407 -1543 755 2071
1175 2071 91 -337 1947 2074 -624 -446 1420 244 -2028 -1072 460 -946 -2286 -485 925 -512
1191 -512 -1196 1035 1884 -36 -430 1671 1491 -1010 -654 1345 180 -1864 -477 1117 -579 -1683
1207 -1683 328 1246 -743 -1134 941 1069 -906 -626 1172 709 -1081 -285 1448 336 -1292 45
1223 45 1507 -294 -1407 580 1187 -1020 -1253 962 720 -1318 -617 1186 206 -1362 -129 1306 -94
1240 -94 -1286 425 1373 -244 -873 1025 1394 -650 -750 1326 684 -1561 -818 952 -492 -2122 -422
1257 -422 985 -702 -1308 950 1656 -190 -142 1742 1567 -482 -378 1217 183 -1824 -1034 466 -740
1274 -740 -2177 -230 1062 -652 -1075 1295 1642 -374 -157 1884 1156 -848 -170 1297 -5 -1543
1290 -1543 -342 776 -700 -1746 1 738 -847 -1244 979 1165 -694 -279 1813 1075 -817 302
1306 302 1617 67 -1356 72 804 -1071 -1665 168 498 -1148 -970 1026 946 -722 -51 1727 693
1323 693 -941 84 1373 -331 -1532 244 895 -1049 -1225 883 878 -1076 -497 1307 540 -1112 -135
1340 -135 1151 -146 -1315 -7 1069 -466 -1101 705 1268 -557 -722 1247 892 -1107 -494 1246
1356 1246 1 -1555 -194 1121 -497 -1390 445 1064 -610 -807 912 1045 -740 -510 1193 694
1372 694 -975 -317 1259 217 -1265 42 1174 -637 -1429 374 767 -1081 -980 863 724 -883
1388 -883 -66 1543 640 -704 311 1399 -4 -1222 10 785 -936 -1542 324 600 -1190 -806 1217
1405 1217 832 -902 166 1686 321 -1026 334 1136 -491 -1271 287 723 -982 -1022 680 755 -944
1422 -944 -586 1179 478 -1111 -106 1342 5 -1103 506 1338 -475 -909 882 879 -999 -851 868
1439 868 247 -1277 -512 920 25 -1104 178 1270 62 -820 672 1269 -551 -968 780 609 -1285
1456 -1285 -869 938 144 -1359 -84 1286 14 -938 540 1226 -317 -803 692 850 -901 -848 847
1473 847 514 -1090 -463 1137 210 -1242 42 1185 -318 -1142 544 997 -735 -765 953 741 -844
1490 -844 -311 1059 352 -1062 -176 924 -237 -1332 -58 921 -551 -1065 768 1101 -593 -487 1173
1507 1173 805 -993 -335 1058 -64 -1336 -81 933 -482 -1065 436 968 -464 -644 829 850 -753
1524 -753 -578 963 401 -1221 -347 1074 -89 -1140 258 1239 -398 -913 725 859 -854 -786 750
1541 750 439 -1047 -431 938 255 -969 16 1162 -36 -978 409 1138 -430 -881 782 829 -1003
1558 -1003 -598 1064 353 -1176 -200 999 -234 -1221 116 758 -510 -1032 583 929 -453 -388 1137
1575 1137 1028 -619 -173 1127 113 -1310 -428 590 -701 -1614 5 750 -678 -705 1078 1086 -248
1592 -248 -13 1414 812 -655 -102 883 -168 -1359 -435 530 -817 -1449 187 788 -734 -660 1068 884
1610 884 -496 2 1371 569 -755 277 1171 -216 -1072 103 535 -948 -1255 160 289 -1048 -766
1627 -766 819 688 -657 135 1517 527 -595 526 1284 -370 -1099 313 424 -1123 -1143 380 312 -979
1645 -979 -417 970 434 -669 173 1257 97 -868 299 935 -546 -1026 550 741 -839 -538 1098
1662 1098 524 -878 -149 1003 32 -1101 -71 651 -509 -1052 268 740 -495 -616 874 957 -505
1679 -505 -193 1183 574 -874 -38 985 -251 -1268 5 548 -821 -1158 295 445 -811 -480 931
1696 931 688 -530 247 1319 687 -505 348 1263 -124 -1143 74 392 -1229 -1442 34 12 -1245
1713 -1245 -665 1028 589 -331 697 1744 649 -232 743 1107 -414 -1025 -40 33 -1381 -1382 93 35 -1171
1732 -1171 -417 1131 519 -477 651 1567 266 -413 750 952 -535 -846 406 223 -1164 -881 404
1749 404 -49 -1164 -364 775 35 -769 316 1261 -56 -558 801 1050 -432 -528 772 315 -1019 -514
1767 -514 617 -166 -1074 -168 804 -178 -796 440 926 -265 -651 663 606 -703 -588 742 369 -873
1785 -873 -165 1092 193 -712 434 1081 -326 -791 377 403 -966 -940 245 74 -942 -417 905 460
1803 460 -497 430 1429 366 -481 610 901 -532 -972 270 194 -1252 -1004 379 -10 -1016 -230 956
1821 956 293 -463 479 1230 232 -391 763 951 -403 -708 437 188 -1206 -886 354 -217 -1317 -321
1839 -321 727 -134 -652 738 1237 128 -42 1034 982 -310 -464 518 64 -1210 -795 235 -436 -1294
1857 -1294 -159 789 -80 -551 755 1230 -113 -315 1000 664 -676 -356 626 -17 -1065 -300 571 -223
1875 -223 -880 83 737 -328 -611 524 752 -544 -464 736 474 -659 -187 917 56 -771 103 768
1893 768 -301 -866 227 461 -594 -632 523 529 -599 -299 752 402 -753 -130 830 -30 -846 154
1911 154 811 -324 -632 530 698 -433 -369 699 327 -886 -397 569 -144 -914 -148 632 -99 -628 514
1930 514 913 -130 -308 834 771 -549 -376 626 11 -1077 -380 609 -352 -936 169 721 -205 -474
1948 -474 741 772 -361 -345 685 446 -699 -386 588 19 -915 -98 691 -274 -884 205 637 -464 -606
1967 -606 577 565 -471 -255 846 400 -581 82 695 -4 -781 -52 511 -430 -886 154 479 -570 -476
1986 -476 667 597 -432 -78 975 362 -730 76 715 -295 -857 36 456 -568 -718 371 490 -476
2004 -476 -347 762 454 -581 -101 784 75 -757 66 740 -315 -706 314 551 -579 -548 509 208
2022 208 -685 -387 698 169 -580 143 900 123 -497 426 788 -245 -675 342 335 -784 -702 339 115
2041 115 -888 -181 868 185 -414 406 991 5 -454 429 577 -481 -636 319 225 -808 -496 530 136
2060 136 -729 -94 788 1 -709 265 819 -303 -525 477 597 -489 -378 611 301 -670 -291 555 -117
2079 -117 -831 -53 588 -233 -735 267 698 -351 -411 572 602 -503 -277 725 171 -747 -58 609 -108
2098 -108 -656 199 672 -267 -544 424 493 -461 -530 388 196 -671 -288 649 142 -563 220 1004 90 -432 497
2119 497 731 -397 -626 304 95 -893 -804 196 1 -773 -169 793 253 -335 487 1050 117 -270 585 614
2139 614 -500 -648 284 -16 -949 -640 307 -159 -855 -72 625 -14 -364 537 913 108 -90 794 790 -314
2159 -314 -321 463 14 -1083 -541 160 -568 -1119 -145 520 -222 -351 740 982 123 131 968 621 -419 -244
2179 -244 425 -185 -1000 -476 174 -501 -871 37 619 -238 -330 668 761 -264 -89 818 404 -505 -127 589
2199 589 -126 -710 75 528 -297 -619 208 445 -447 -498 467 366 -485 -305 621 205 -493 86 665 -13
2219 -13 -510 321 628 -279 -436 370 442 -448 -398 433 76 -676 -350 365 -192 -768 -91 549 -130 -479 498
2240 498 844 -26 -102 860 702 -387 -205 439 -156 -979 -548 110 -628 -1012 -119 407 -225 -229 752 971 204
2261 204 283 1008 654 -380 -223 408 -284 -1118 -503 15 -737 -1030 -2 432 -305 -248 781 832 35 228
2281 228 1000 583 -278 54 538 -198 -883 -250 77 -729 -965 13 156 -613 -355 688 529 -117 267 1042
2301 1042 440 -253 260 565 -267 -799 -125 153 -696 -850 85 240 -489 -225 662 335 -307 124 793 59
2321 59 -497 85 501 -356 -508 277 339 -351 -256 524 388 -452 -180 526 -11 -686 -215 357 -334 -752 123
2342 123 489 -258 -317 562 610 -183 -61 704 265 -505 -142 411 -168 -741 -208 219 -420 -709 108 344 -335
2363 -335 -304 605 611 -178 149 889 483 -418 169 608 -176 -750 -103 110 -792 -901 18 64 -551 -294 702
2384 702 543 -35 397 970 531 -221 337 534 -417 -834 -129 -35 -879 -826 61 51 -462 -91 760 383 -211
2405 -211 400 854 205 -285 249 475 -306 -583 119 156 -644 -538 283 81 -557 -172 556 77 -405 239
2425 239 732 22 -283 401 536 -288 -396 312 193 -607 -371 309 81 -643 -130 476 -6 -368 243 544
2445 544 -155 -475 402 448 -443 -328 416 220 -489 -63 557 141 -429 138 601 -135 -545 112 318 -484
2465 -484 -566 184 215 -441 -200 636 256 -343 111 765 177 -355 195 421 -342 -560 45 191 -572 -446 283
2486 283 172 -491 -128 581 195 -335 151 667 -47 -398 276 535 -313 -408 297 185 -506 -374 343 -71
2506 -71 -659 -142 480 39 -349 317 598 71 -262 472 502 -251 -377 329 90 -613 -340 314 -50 -661 42
2527 42 482 9 -350 367 562 -113 -261 459 362 -461 -335 362 128 -570 -160 385 -33 -514 55 540 -179
2548 -179 -365 369 416 -315 -267 427 338 -393 -106 475 118 -520 -90 457 -178 -565 26 380 -357 -464 337
2569 337 480 -237 -165 549 285 -405 -96 417 -92 -599 15 336 -275 -525 181 371 -281 -248 461 361 -323
2590 -323 -119 440 177 -496 -103 461 -138 -559 100 423 -217 -412 278 374 -340 -214 379 230 -485 -68
2610 -68 520 41 -396 -14 574 -134 -459 236 361 -358 -478 232 196 -444 -211 478 132 -405 48 594 -71
2631 -71 -405 176 402 -268 -382 194 210 -391 -272 414 242 -389 -31 528 16 -457 55 450 -196 -561 182
2652 182 319 -284 -268 337 300 -205 -8 594 177 -422 -86 420 -164 -587 1 274 -276 -503 247 391 -317
2673 -317 -204 490 350 -276 -44 526 139 -452 -25 430 -199 -440 70 196 -401 -457 187 228 -398 -273 458
2694 458 226 -303 66 741 219 -287 279 501 -302 -569 58 57 -676 -496 147 5 -476 -20 516 253 -115
2715 -115 263 681 198 -278 240 340 -338 -557 79 22 -599 -482 244 27 -411 31 521 106 -210 261
2735 261 520 -5 -281 344 324 -316 -372 238 91 -512 -283 293 23 -545 -66 394 -67 -372 265 501 -156
2756 -156 -271 396 371 -325 -206 348 68 -456 -187 399 -51 -449 50 437 -37 -452 252 269 -336 -368 280
2777 280 184 -429 -252 451 132 -262 161 611 73 -275 250 340 -303 -462 121 58 -579 -534 160 41 -405
2798 -405 -76 565 173 -249 355 647 90 -252 222 335 -350 -414 94 -19 -599 -402 210 4 -450 55
2818 55 498 99 -180 487 618 26 -60 434 418 -338 -290 284 -140 -715 -349 120 -197 -563 -18 426 0
2839 0 -124 514 636 50 -43 574 336 -311 -306 217 -70 -655 -306 160 -300 -548 111 469 -100 -189 403 492
2861 492 -148 -82 368 162 -329 -250 361 -18 -474 21 286 -96 -400 147 339 -260 -283 277 246 -379 -160
2882 -160 413 120 -373 -8 434 14 -364 111 342 -145 -290 188 242 -336 -362 241 115 -416 -208 339 -40
2903 -40 -415 62 327 -40 -298 321 531 -42 -24 448 299 -276 -216 316 -50 -626 -302 101 -258 -545 82
2924 82 379 -74 -121 529 541 13 -18 521 240 -365 -206 184 -219 -598 -222 183 -241 -430 109 354 -28
2945 -28 -145 471 400 -129 -43 535 245 -394 -116 327 -157 -537 -148 176 -294 -515 68 190 -249 -192 385
2966 385 324 -84 41 504 225 -238 15 349 -107 -513 -42 209 -320 -403 227 194 -241 -98 471 175 -231
2987 -231 40 383 -39 -371 60 250 -163 -394 153 324 -202 -204 371 274 -266 -123 336 17 -494 -58 319
3008 319 -226 -339 164 326 -73 -151 392 315 -163 -126 341 93 -378 -112 309 -69 -497 -57 303 -186 -393
3029 -393 162 274 -154 -153 360 316 -242 5 461 94 -311 -14 330 -98 -444 7 195 -330 -375 124 171 -281
3051 -281 -168 384 277 -97 147 575 116 -284 13 224 -195 -477 -30 87 -405 -298 217 177 -271 -40
3071 -40 408 209 -242 60 395 -80 -400 90 290 -227 -341 160 174 -351 -222 232 98 -354 -32 305 32
3092 32 -290 50 404 -3 -255 263 340 -171 -235 266 202 -347 -207 338 -15 -355 -17 379 -16 -307 91
3113 91 374 -138 -284 165 217 -307 -279 210 183 -281 -59 388 64 -320 75 381 -127 -296 107 237 -283
3134 -283 -392 229 153 -310 -124 353 184 -255 55 341 26 -292 5 223 -281 -331 106 221 -313 -218 251
3155 251 184 -240 10 422 31 -348 27 395 -61 -330 92 245 -115 -262 248 184 -241 -151 320 70 -362
3176 -362 -56 303 -22 -312 111 321 -74 -220 236 255 -241 -178 234 56 -405 -111 196 -25 -321 -7 314
3197 314 -46 -231 230 353 -165 -241 224 179 -347 -198 298 93 -339 29 398 82 -294 97 300 -130 -265
3218 -265 187 222 -230 -202 251 187 -273 -57 263 81 -289 -70 232 -148 -344 125 246 -140 -278 309 238
3239 238 -188 -96 320 121 -330 -93 251 -31 -488 -23 218 -180 -305 174 364 -101 -147 304 236 -211 -100
3260 -100 276 73 -342 -67 210 -89 -301 71 253 -132 -243 199 237 -215 -145 269 181 -228 -42 318 -16
3281 -16 -251 84 299 -124 -296 110 199 -281 -298 199 155 -218 -35 351 185 -225 46 412 -37 -278 90
3302 90 248 -207 -366 130 171 -324 -228 265 120 -248 -81 374 25 -271 21 289 -188 -309 96 213 -175
3323 -175 -205 281 146 -183 -86 301 81 -312 -5 241 -62 -386 47 281 -116 -254 233 244 -132 -126 318 203
3345 203 -258 -96 308 38 -276 64 205 -143 -243 75 261 -294 -258 183 161 -227 -143 324 100 -205 48
3366 48 393 107 -239 97 255 -198 -277 60 59 -347 -247 126 77 -221 17 374 129 -156 160 459 -12 -294
3388 -294 179 174 -247 -288 107 28 -319 -145 230 85 -234 47 347 46 -201 43 344 -90 -223 190 177 -195
3410 -195 -219 200 125 -288 -92 222 34 -255 46 296 -97 -205 163 298 -71 -117 288 213 -201 -93 127
3431 127 42 -315 -89 247 -11 -286 117 329 -63 -171 201 183 -156 -183 159 113 -251 -75 272 76 -223
3452 -223 75 303 -46 -256 66 217 -194 -300 78 121 -341 -198 237 56 -270 19 341 60 -159 162
3472 162 331 -35 -238 77 189 -289 -236 101 50 -342 -87 253 -30 -201 58 347 24 -140 161 299 -51
3493 -51 -115 208 139 -213 -171 126 15 -381 -200 158 -30 -278 11 302 27 -81 263 371 -86 -101 279 148
3515 148 -232 -140 150 -60 -427 -95 164 -70 -193 144 321 6 -141 216 305 -127 -172 188 109 -283 -41
3536 -41 187 27 -218 53 215 -131 -214 102 194 -214 -203 163 181 -199 -27 209 81 -208 9 278 -38 -221
3558 -221 65 251 -137 -238 154 177 -177 -107 244 140 -212 -44 179 -15 -210 50 258 -45 -220 128 285
3579 285 -56 -163 225 162 -148 -150 206 7 -355 -78 181 -92 -297 121 254 -62 -162 268 220 -113 -116 258
3601 258 145 -268 -143 150 -38 -283 1 164 -62 -241 101 253 -106 -151 193 153 -142 -83 224 61 -222
3622 -222 -43 178 0 -251 22 212 -118 -266 51 170 -83 -147 234 198 -246 -43 312 79 -215 -4 229
3643 229 -79 -284 -10 217 -115 -208 142 186 -169 -14 302 133 -119 -39 209 -11 -253 44 194 -39 -205
3664 -205 119 204 -88 -138 226 165 -158 -94 188 -2 -293 36 195 -85 -226 134 251 -123 -168 160 154 -192
3686 -192 -186 150 68 -212 -62 156 12 -218 57 260 -79 -197 103 190 -98 -187 165 143 -189 -149 245 83
3708 83 -148 24 238 10 -189 41 151 -80 -157 147 137 -129 -130 230 110 -208 -75 235 33 -150 44 149
3730 149 -51 -260 2 202 -128 -176 213 164 -183 -53 268 -19 -217 -14 247 -88 -224 115 160 -87 -202
3751 -202 109 206 -156 -129 235 69 -202 -41 190 70 -198 8 220 -26 -177 169 261 -123 -140 165 76 -310
3773 -310 -142 175 26 -281 43 218 -11 -144 114 279 -63 -193 92 106 -224 -180 109 74 -272 -88 189
3794 189 -35 -135 94 213 0 -144 149 240 -144 -163 109 157 -162 -115 149 44 -251 -35 148 -44 -206
3815 -206 24 189 -101 -129 184 209 -70 -36 249 66 -196 -62 158 -17 -268 -3 171 -129 -274 55 235
3836 235 -116 -134 207 219 -98 -29 238 73 -285 -61 182 -63 -248 84 155 -86 -158 74 183 -146 -167 150
3858 150 108 -202 -141 130 5 -160 -12 224 -35 -208 69 260 -89 -171 119 112 -180 -109 195 57 -196 -47
3880 -47 228 5 -196 38 212 -89 -185 100 199 -113 -149 184 121 -157 -84 146 64 -233 -66 134 -144 -226 17
3903 17 221 -50 -115 172 271 -72 19 182 126 -221 -94 112 -60 -312 -73 120 -93 -184 114 239 -7 -16 244
3926 244 161 -141 -47 162 54 -255 -47 160 -118 -274 -1 103 -132 -152 187 206 -80 -165 264 200 -103 33
3948 33 262 21 -157 -6 178 -83 -231 37 79 -210 -167 96 146 -184 -92 219 48 -151 40 211 -10 -176
3970 -176 -17 107 -101 -233 29 67 -183 -141 172 78 -178 7 200 43 -126 5 145 -66 -201 68 147
3991 147 -123 -95 185 63 -95 -32 225 45 -188 -18 155 -8 -263 98 181 -78 -147 113 154 -86 1 158
4013 158 127 -175 -90 175 46 -217 35 114 -63 -213 80 103 -168 -161 97 138 -113 -131 183 132 -151 -20 265
4036 265 60 -176 66 172 -47 -194 21 108 -233 -139 145 100 -194 40 264 92 -122 123 229 -50 -173
4057 -173 49 84 -158 -260 42 65 -153 -103 179 99 -135 25 218 48 -171 58 114 -16 -158 110 154 -110
4079 -110 -94 114 -5 -206 -89 145 14 -165 6 183 0 -151 76 199 -90 -143 167 96 -132 -66 129
4100 129 44 -218 -105 134 35 -140 83 237 -12 -133 113 167 -64 -137 103 52 -195 -79 188 -10 -186 -36
4122 -36 174 5 -186 59 165 -145 -187 78 63 -140 -87 171 65 -164 -60 184 38 -202 -9 203 -32
4143 -32 -223 -5 173 -129 -125 112 91 -167 -66 162 62 -182 4 131 -41 -167 46 242 -49 -145 126 65
4165 65 -133 -107 124 108 -201 -72 165 -2 -195 -6 194 -80 -154 75 159 -2 -89 105 169 -149 -118 149 -17
4188 -17 -161 -43 148 17 -164 106 240 -83 -137 102 138 -213 -96 156 75 -108 -51 177 6 -159 -30 153
4210 153 -2 -59 24 114 -90 -149 132 184 -115 -52 219 100 -150 -25 133 -53 -213 -46 114 -109 -140 60
4232 60 175 -139 -49 189 96 -97 -14 197 6 -168 -31 175 -64 -240 17 59 -136 -58 161 111 -66 -27 244
4255 244 87 -160 7 194 38 -162 9 164 -66 -117 64 78 -127 -94 139 103 -168 3 139 34 -100
4276 -100 56 202 -13 -90 78 148 -132 -133 61 12 -178 -174 165 61 -83 -40 196 95 -74 57 151 -80 -138
4299 -138 46 61 -81 -134 128 91 -164 -39 215 54 -212 -5 166 -38 -192 35 120 -100 -116 67 144 -101
4321 -101 -53 169 112 -86 1 152 0 -250 3 -5 -46 -157 44 89 -53 -91 128 118 -89 69 191 114 -125
4344 -125 31 204 -8 -121 13 40 -99 -99 70 9 -121 -51 128 92 -102 26 259 168 -111 129 261 -26
4366 -26 -159 3 19 -155 -208 -60 51 -175 -147 160 107 -101 12 229 57 -10 123 179 -34 -78 103 40 -199
4389 -199 -141 36 2 -130 -20 152 48 -81 57 219 16 -100 64 136 -68 -90 149 98 -142 -128 95 51
4411 51 -192 -58 95 -130 -150 12 151 -41 -81 136 81 -93 -110 110 65 -120 -52 136 -26 -146 35 130 -28
4434 -28 -156 28 120 -54 -123 106 78 -132 -104 123 42 -129 30 159 52 -52 113 155 -54 -137 33 49 -103
4457 -103 -138 67 -20 -209 -48 143 34 -143 60 209 45 -137 59 115 -27 -75 52 40 -143 -98 32 8
4479 8 -216 -14 102 -29 -121 49 210 -23 -50 189 231 -22 -69 126 64 -103 -100 34 -38 -254 -34 163 -31
4502 -31 -120 127 215 17 -60 194 149 -74 -4 168 -3 -158 -43 100 -51 -169 17 124 -91 -130 116 149 -66
4525 -66 -45 130 68 -123 -118 163 50 -150 49 142 -15 -160 20 112 -158 -87 74 69 -74 -101 139 42 -175 -31
4549 -31 115 16 -113 59 171 -106 -140 49 122 -110 -120 150 108 -112 -57 84 61 -185 -90 132 30 -169 -3
4572 -3 133 -23 -55 175 169 -57 -35 162 15 -157 -40 62 -120 -194 -62 66 -25 -98 109 232 32 -16 148
4595 148 56 -102 -93 94 3 -111 -51 133 -53 -200 29 52 -19 -113 151 109 -19 -32 182 147 -96 15 93 10
4619 10 -122 34 138 -125 -171 -59 123 -174 -96 103 60 -25 -11 139 76 -144 41 220 0 -206 -5 50 -134
4642 -134 -176 72 42 -55 -64 164 64 -143 11 128 58 -110 7 86 -25 -135 107 72 -32 -93 145 108 -91
4665 -91 -51 104 63 -109 -17 134 -44 -77 89 29 -83 -112 93 170 -63 -61 73 44 -124 -88 99 12 -154 -40
4689 -40 108 -23 -97 57 82 -129 -116 11 70 -105 -63 93 50 -99 -44 124 4 -128 47 156 -27 -90 11
4712 11 84 -111 -133 83 60 -115 -4 175 49 -49 -2 124 -52 -78 38 86 -146 -130 94 66 -90 -15 168 57
4736 57 -165 -17 97 -2 -108 34 104 -62 -169 64 113 -136 -122 113 40 -147 -59 62 27 -131 -62 120 26
4759 26 -90 127 151 2 -137 42 99 -80 -95 38 -5 -104 -38 138 45 -101 104 145 23 -78 98 128 -90
4782 -90 -108 72 62 -175 -72 116 -26 -94 56 129 -28 -53 13 111 10 -35 20 48 -65 -54 66 111 -78 -68 123
4807 123 -78 -188 -69 81 -71 -159 83 77 -16 31 156 106 -89 -32 141 43 -119 -13 59 -45 -199 0 109
4830 109 -87 -49 100 211 -39 -5 186 88 -63 -48 113 -67 -117 -47 93 -30 -77 32 82 -12 -82 66 20 -134
4854 -134 -18 95 61 -74 -35 143 -21 -101 6 94 -63 -101 91 22 -21 -89 86 66 -88 -3 72 22 -100 45
4878 45 165 -27 -113 94 146 -35 -53 106 47 -64 21 90 17 -56 -50 135 -62 -148 -41 81 -96 -149 145 150 -27
4903 -27 12 202 107 -30 85 132 59 -94 -29 57 -132 -152 40 -6 -11 5 112 52 -88 -1 188 73 -82 34 135
4928 135 17 -127 -8 109 -112 -78 56 53 -116 -63 154 49 -25 35 122 93 -52 11 125 -22 -124 25 109
4951 109 -111 -67 3 24 -49 -90 77 67 -80 -16 113 64 -49 35 101 -27 -98 13 83 -120 -69 62 71 -67 -51
4976 -51 136 -64 -22 -61 20 -12 -110 54 59 -3 -126 98 118 -69 -43 124 13 -100 -20 76 5 -116 -23 27 -67 -164
5002 -164 33 83 -33 -45 91 35 23 -28 166 95 -64 -24 114 -15 -168 -16 22 -60 -142 17 67 -140 -51 58
5026 58 76 -73 38 154 68 -44 -64 137 -1 -119 -13 53 -211 -78 67 41 -134 -73 111 30 -28 18 129
5049 129 77 10 -27 159 -54 -139 28 44 -152 -56 49 -13 -83 -71 93 -3 -54 35 165 -21 -59 91 161 -64 -88
5074 -88 81 73 -112 -36 51 31 -135 -46 140 19 -46 17 63 24 -83 30 102 -51 -26 61 76 -78 -17 108 29 -80
5100 -80 -24 84 -35 -50 10 24 -58 -76 21 44 -65 -86 69 38 -52 -13 100 87 -40 34 117 -16 -75 22 116 -101
5126 -101 -80 30 57 -82 -77 101 72 -72 79 188 -24 -96 -8 90 -61 -123 45 3 -110 -46 80 12 -122 -2
5150 -2 45 55 -140 -12 153 -34 -26 70 93 -39 -56 155 45 -79 -68 75 -33 -98 22 89 54 -9 72 112 -34
5175 -34 -70 106 93 -71 -31 79 -52 -141 -78 55 -37 -134 12 134 -3 -7 -8 130 -22 -59 34 52 -116 -66 67
5200 67 -6 -72 32 117 -13 -84 1 35 -76 -79 53 83 -72 -49 112 51 -83 -21 130 43 -99 55 67 -47 -101
5225 -101 73 87 -71 -55 54 105 -85 -80 137 -14 -106 -30 75 -42 -85 41 96 -22 -15 84 75 -63 -84 90 71
5250 71 -95 -2 68 -34 -179 -38 53 10 -90 98 59 -72 -81 -3 51 -129 -48 105 -18 -70 -7 65 28 -47 7 141
5276 141 -34 -134 88 116 -133 -138 103 30 -129 -10 46 93 -39 -2 135 -21 -56 -16 22 -63 -120 77 25 -41 -55
5301 -55 35 -28 -54 -32 76 -31 -140 13 19 -30 -168 35 16 -36 5 78 120 -48 27 70 19 -85 -16 70 -31 -52
5327 -52 -5 27 -5 -100 79 74 -47 -31 48 -27 -100 -6 80 -11 -80 78 92 -1 -65 41 45 -91 -39 94 18 -54 -64 99
5355 99 -11 -55 2 86 28 -102 -64 86 -38 -82 42 30 -51 -64 75 55 29 17 122 6 -8 -20 77 24 -72 -2
5381 -2 39 -52 -38 78 85 -87 8 62 13 -17 3 72 60 -88 8 54 -42 -26 91 104 -21 6 68 31 -106 21 73 -16
5409 -16 -70 -2 95 -28 -81 93 70 -28 -72 73 100 -109 -27 96 49 -46 -66 61 -34 -83 28 71 -22 -49 59 73
5435 73 -59 -64 61 70 -141 -69 78 24 -23 82 72 42 -27 63 75 -46 -38 14 13 -166 18 59 -5 -81 12 64 -15 -49
5463 -49 -50 89 -1 -103 20 9 -75 -33 113 44 -114 -18 68 37 -90 -10 -3 -50 -93 3 54 -18 -62 44 50 -60 8 76
5491 76 -6 -101 -48 20 -22 -83 61 80 8 -61 100 91 -62 -128 100 64 -89 -58 55 -4 -80 -5 44 -20 -44 22 49 -81
5519 -81 -78 19 28 -107 -82 -6 -25 -97 9 54 -27 -84 54 139 5 -69 62 61 -62 -49 129 62 -119 -41 104 -46 -121
5546 -121 -8 73 0 -125 18 51 -22 -71 40 49 -46 -58 77 17 -17 -37 109 76 -135 62 83 -15 -24 68 109 -17
5572 -17 28 105 29 -81 -32 87 -7 -153 8 44 -70 -74 22 97 -13 -24 56 57 -59 -52 72 85 -79 -56 55 -7 -64
5599 -64 6 24 -9 -57 50 27 -20 -43 66 64 -58 -18 104 26 -68 11 57 -58 -4 10 16 -79 -109 15 12 -130 -4 54
5627 54 73 -82 30 120 37 -36 -52 65 -17 -103 14 28 -70 -49 29 90 -61 24 102 11 -80 20 31 13 -40 -45 38 1
5655 1 -30 -42 15 -36 -57 107 22 -34 1 65 -17 -105 2 30 -15 -72 49 149 -31 -52 38 89 -2 21 43 76 -27 -37
5683 -37 125 2 -51 -17 93 -32 -44 45 114 -54 -63 -11 41 7 16 86 -16 -32 14 45 -13 -61 66 98 -93 -65 108
5710 108 15 -64 -52 25 109 -114 56 105 -24 -30 7 18 -17 -29 36 88 -27 -28 76 38 -35 9 65 -1 -32 -18 71 6
5738 6 -27 60 40 -8 -38 35 -6 -40 -33 105 72 -39 -60 19 -38 -105 -1 123 -73 -57 50 38 40 -23 41 8 -71 -50 11
5767 11 -24 -38 46 68 18 -69 -30 47 16 -22 43 67 0 4 94 82 -63 -16 45 -41 -28 -33 30 52 -77 -53 36 -45 -51 46 0
5798 0 -86 31 71 38 -13 16 44 -1 -117 61 66 -73 -106 98 27 -19 -12 30 33 -51 -25 76 -24 -105 -23 31 -55 -63 5
5827 5 34 -61 -7 52 23 -50 4 24 7 -98 18 95 0 -41 -7 77 -40 -36 48 70 -9 -58 15 -4 -94 -29 39 47 -34 31
5857 31 74 -27 -7 23 44 -2 -79 58 19 -4 51 28 33 -85 -20 112 -18 -102 -47 58 -15 -36 -5 41 -18 -20 88 -18
5885 -18 -11 18 48 -16 -31 -18 -4 -11 -31 -6 33 -34 -38 72 57 3 -18 79 13 -40 14 28 -44 -71 13 58 -14 -25 7 13 -60 -103
5917 -103 74 33 -32 -82 36 -43 -148 -3 99 -5 -19 17 51 -23 -59 -25 75 40 -18 20 18 -25 -3 109 19 -47
5943 -47 40 28 -37 -20 11 26 -26 -23 12 28 -52 -34 83 51 -46 32 66 39 -90 37 63 -8 -72 44 57 4 -70 9 29
5972 29 -28 -51 7 98 -60 0 42 28 -3 9 117 -4 -13 45 33 -6 10 80 -27 -20 33 52 24 -71 34 53 18 4 42
6001 42 16 -24 -20 63 38 -22 -24 109 26 -50 28 36 -3 -92 -5 66 -15 -80 -6 -2 -43 -33 5 6 -8 -29 116 44 -14 4 59 -13
6033 -13 -81 27 -29 -41 -102 33 -26 -45 14 -1 37 -42 39 76 14 -7 -25 -20 -13 -28 63 80 27 -42 8 49 -12 50 76 34
6063 34 -14 18 39 -56 -54 25 39 -52 -31 40 36 -5 -67 68 -9 -23 -18 59 -24 -28 5 97 -45 -70 37 -18 -12 -23 45 -83 -85
6094 -85 -65 55 26 -79 -10 73 -36 13 -11 72 24 -15 81 57 -21 -18 41 -22 -31 0 62 -9 -46 26 58 3 -77 95 64
6123 64 -79 -23 4 40 1 46 92 50 6 29 134 11 -53 25 40 -4 -68 -9 -59 -67 13 79 -5 -36 -63 15 73 -18 -9 94
6153 94 -59 -25 56 102 -42 -33 2 18 -72 -22 27 47 -55 -47 97 77 -56 43 58 56 -20 40 81 -73 -53 32 24 -116 -5
6182 -5 102 -12 -9 8 77 -13 -83 39 13 -35 -1 10 23 -70 26 46 78 -45 -68 35 -16 -77 -14 53 -43 -54 56 40
6210 40 -1 -10 45 40 -34 24 86 4 -102 -20 96 -53 -23 74 17 -61 -35 42 16 -54 -41 4 11 -77 -17 60 -92 -10 2 30
6240 30 -38 -50 54 24 -48 -33 37 -40 -6 6 20 21 -62 -33 14 13 -54 13 24 -61 12 -4 -1 -41 -20 -30 51 -36 29 71 -12
6271 -12 -78 20 3 -65 -36 43 51 -93 8 53 39 22 -20 125 68 -74 -33 39 26 -92 34 18 -25 -6 81 8 -20 -4
6299 -4 63 -6 -37 65 19 13 -59 -3 26 13 -54 -3 78 -27 -64 66 5 -35 -32 39 -27 -46 -17 37 11 -74 76 46 -6 -48
6329 -48 46 -2 -36 -40 72 26 -16 -48 101 43 -51 9 57 -1 -2 38 42 -62 64 17 58 2 -68 63 38 -61 1 97 44
6358 44 -18 13 74 -2 -63 19 38 -57 -10 -24 25 -26 -42 64 15 -7 58 28 -45 33 16 26 -51 -39 39 37 41 -1 26 15 -46
6389 -46 -12 57 31 -8 73 28 18 -45 53 77 -51 21 92 35 -32 -27 106 -14 34 -19 23 -12 -24 42 26 -26 9 10 -22 -28
6419 -28 -6 70 46 -42 -46 45 -30 -39 52 79 -12 -35 -9 53 -41 -24 12 35 -16 40 45 26 8 23 43 5 -11 -4 37 5 -33 29
6451 29 7 -118 -1 45 37 -81 3 78 14 -14 -38 62 12 -47 -7 -17 -44 -32 23 5 -58 -44 45 2 -94 -22 -4 5 -14
6480 -14 33 115 -67 -39 52 107 7 14 114 -16 -36 -41 35 -39 -87 57 18 -35 -13 68 65 6 -1 50 37 -64 1 41 -20
6509 -20 -55 -10 103 33 -31 -37 29 -49 62 60 29 -45 -9 47 -11 -87 -5 -16 -7 0 -58 2 -40 -75 8 55 -99 -7 -24 -14 -32
6540 -32 31 4 -4 -22 10 127 -79 -57 19 32 -1 15 98 8 65 -46 58 21 -27 -16 54 26 -13 -108 22 47 -1 15
6568 15 128 -8 -80 65 131 -50 -60 62 -37 -39 -58 56 -54 -88 -25 11 -59 -12 8 9 -17 2 11 19 -25 -28 67 51 -42
6597 -42 56 20 -69 -72 -71 27 -64 -40 46 75 -35 5 128 74 43 43 17 32 -96 22 -45 26 -69 7 34 -4 -10 -29 -33 -9 -17
6628 -17 84 -13 -58 -2 -1 -13 -36 -25 38 -49 -76 30 71 -54 -27 -41 30 -21 -28 44 -46 22 30 48 -45 39 85 70 19 -18
6658 -18 61 28 -25 -28 47 -14 -118 8 64 66 -29 39 51 -1 -13 -2 58 -29 16 -47 85 -26 23 17 -26 -1 55 92 29 -75
6688 -75 62 10 -15 18 33 39 -63 5 56 64 -76 -50 25 -28 -77 41 -15 -80 -18 6 37 -63 -40 8 80 -4 40 52 56
6717 56 -18 14 39 25 -57 4 -8 -16 -34 49 53 -29 -9 75 53 -51 15 25 26 -2 28 83 15 -52 64 12 -8 17 67 -23 -61
6748 -61 -15 71 -41 -39 -1 28 34 -1 -24 6 4 -15 4 18 -34 -61 44 70 -44 12 60 19 -68 49 33 44 -56 -53 80
6777 80 -41 -63 56 72 13 19 62 -104 -57 2 -16 -55 -22 54 51 10 -13 16 34 17 -14 64 24 -32 30 25 24 -42 7 32 26
6808 26 24 -2 -18 -33 -55 77 32 12 -28 -6 -20 22 14 94 5 -48 11 83 31 -43 33 131 -50 8 31 4 -35 -1 23 36
6838 36 -71 23 39 4 -21 -10 47 -75 -86 11 68 -16 -28 62 -15 -23 7 36 -19 -45 -18 -50 -8 -76 26 49 -21 -20 23 22
6868 22 -10 -6 16 36 -22 -32 29 -43 13 20 58 47 -24 60 -7 0 41 41 21 -13 -10 33 -13 -29 56 -42 0 -15 63 31 -22 19 50
6901 50 39 -79 20 18 -34 -36 11 9 -3 -61 28 29 58 -40 55 65 1 11 14 19 -42 -40 31 -11 -63 24 28 -70 -104 -25 69 -10 -68 65
6935 65 -7 -35 -20 5 20 -6 7 10 8 -28 2 -8 -10 -116 58 18 -11 -62 89 28 -22 28 19 -25 -59 7 32 41 -13 11 74
6966 74 -15 -58 48 19 -58 -26 41 21 1 -12 37 -11 -47 -70 14 -17 -72 39 17 -42 -9 87 79 8 3 50 -70 25 29 44
6996 44 20 -19 46 57 -34 -10 20 13 -8 -13 72 27 -22 -22 47 -7 -48 52 43 8 -108 -9 21 -17 3 31 20 -32 -42 53 125
7027 125 0 -12 120 53 -43 -8 2 -44 16 -2 -37 -64 -86 30 5 -1 -23 -5 69 22 0 8 -31 12 -63 20 -47 -44 106
7056 106 28 -13 -65 70 9 -93 3 -24 -26 19 3 76 -32 -63 8 15 -29 -39 -40 -31 -29 -9 33 36 7 31 69 -52 3 25 68
7087 68 -50 -31 -7 -11 -48 1 38 11 -26 -27 39 95 -33 -20 24 -56 -1 10 25 -50 42 55 79 -37 -39 82 19 -48 0 -37
7117 -37 -55 -33 -47 29 -51 -40 66 -15 -36 -24 45 -3 -24 6 48 -23 -1 11 44 -41 36 34 1 -54 -75 84 -11 -70 -6 3
7147 3 15 -34 30 22 25 7 125 55 -23 -59 56 -19 24 -57 28 36 -85 -21 70 -23 -1 56 117 22 -20 -8 1 -51 -77 63 53
7178 53 -41 -16 60 15 20 -27 55 11 -4 -8 35 -42 -9 -17 -36 -71 -18 26 -3 25 56 36 -35 -12 27 -12 -98 -95 11 90 8 -41
7210 -41 6 8 -50 59 51 39 25 -48 70 9 -18 -11 43 -55 -35 87 54 -48 24 25 25 -19 13 49 53 72 47 41 -58 -31 54 69
7242 69 -34 15 -18 -55 -63 -51 53 -18 -49 27 10 -17 -59 48 41 -30 -62 15 -39 -33 -6 44 16 -22 43 54 22 -50 -16 30
7272 30 -53 -13 7 7 -11 26 35 54 -7 37 46 -6 -39 -49 35 -17 -49 9 19 20 7 -38 62 -61 -31 5 -37 -92 -13 32 -92
7303 -92 -97 -4 31 -26 -16 71 18 -51 -10 -1 -11 -60 -34 -33 26 -110 -14 61 -8 -12 1 27 -41 -36 15 -30 -11 -34 38 13 1 -6 -7
7336 -7 -6 52 -1 99 -57 -8 -25 10 -4 1 20 3 -27 -45 -1 -41 -4 6 89 63 -22 3 51 -49 -14 20 -14 -11 20 26 47
7367 47 -61 -28 42 32 -31 -7 10 -65 -52 3 -3 13 -31 25 73 -21 -52 6 -31 -52 52 103 50 -78 -45 36 10 -82 6
7396 6 53 -45 -6 11 77 -14 3 35 0 68 4 52 26 -55 44 31 -24 -7 38 -3 6 -66 54 15 -71 50 54 15 -8 -62 37
7427 37 -44 -16 10 23 -74 -38 -11 39 -31 -12 -11 28 -61 4 -22 -1 -47 -33 -11 -18 -69 47 10 -61 -10 -1 60 -70 -6 -5 6
7458 6 13 -13 -4 70 23 60 25 -23 -19 19 0 -41 -32 9 10 0 -17 -3 -29 -103 -6 -59 62 -67 9 60 -35 -46 31 39 -32 -8 40
7491 40 31 -2 46 41 -31 -71 -16 41 -57 -30 31 10 -27 1 54 -72 -24 -10 3 -32 -79 -41 34 -1 14 16 90 34 -13 62 58 16
7523 16 1 26 3 28 7 50 -39 -31 36 -17 -26 -7 84 30 -73 32 -13 -2 -33 -20 42 -17 -99 -51 47 31 50 68 20 -45
7553 -45 12 24 43 11 -4 54 83 -55 -24 13 -9 -34 -10 29 11 33 29 97 55 -2 14 12 -18 -43 11 55 -22 6 56 -48
7583 -48 -44 2 41 -46 -36 53 -33 -8 -29 38 33 -65 -37 36 -55 -38 -67 22 -102 -36 -36 -23 -14 -39 -31 17 19 21 18 -22 -37 -47 25 -36
7617 -36 -46 1 40 -1 -76 -13 51 -7 19 18 40 -41 -56 -1 3 -15 8 55 5 15 17 73 -54 0 70 11 -63 -20 35 -31 -12
7648 -12 15 35 80 -2 -36 65 -67 11 20 12 -2 8 10 3 10 23 -2 19 26 10 62 41 -29 48 19 2 11 67 10 47 -5 -1 6 -16
7682 -16 -58 1 2 15 17 42 -34 -35 3 74 55 -40 56 32 -2 23 17 21 -38 3 -40 -64 -11 37 55 -57 -15 87 43 -39 10 49
7714 49 29 -95 3 31 -21 29 62 13 -50 36 15 30 8 -17 9 9 -22 54 -7 38 13 19 52 -21 -17 52 25 -20 -33 2 14
7745 14 8 38 56 -24 18 20 32 -27 -80 -18 61 -41 -44 -56 14 -7 -11 51 9 -3 -44 15 40 -8 -30 10 -17 -9 -45 45 -29 -12
7777 -12 30 28 -31 -34 2 25 -1 66 30 -15 -40 -34 43 -21 -17 36 76 48 45 44 20 -94 -11 -10 21 20 -9 47 31 -36 9 39 0 -39
7811 -39 -62 11 24 -108 -25 34 -51 2 51 -19 -64 -41 23 -38 -40 -4 59 -16 -49 -25 45 42 48 83 -3 -57 4 -3 67 7 24 6
7843 6 -34 -13 2 4 -17 -67 36 -14 -40 -42 -6 41 -12 13 -16 -19 -47 36 60 -46 -7 7 57 20 0 57 -15 -3 -17 -27 -22 -67
7875 -67 -19 -31 -62 -45 17 6 2 -31 -21 66 -43 21 10 23 -21 -91 63 -13 -16 17 7 -17 -5 -23 42 -41 -76 117 -20
7904 -20 -17 54 48 57 -27 12 55 -30 -75 35 -15 -2 -13 27 -46 -70 -17 69 -36 -5 3 22 -16 7 -22 43 56 -63 -60 -13 20
7935 20 -35 62 52 -59 4 -35 -25 29 3 45 -46 -51 65 88 -12 -20 50 53 -53 -47 -2 12 -39 53 87 2 -32 2 -10 -33
7965 -33 -59 37 -3 49 -23 33 42 -66 10 24 -9 -68 4 43 -81 -73 28 -17 -83 -27 60 -28 3 -21 43 11 61 -66 62
7994 62 12 5 40 17 0 19 38 -63 25 -48 107 35 -56 16 3 36 8 21 -6 -48 -24 11 3 1 -34 16 82 15 -16 51 -1
8025 -1 -33 -14 74 44 -42 33 -14 -3 21 9 -21 -54 25 66 60 -36 -9 76 31 -69 -6 34 -17 27 35 24 -41 -29 -44 29 -89
8056 -89 -28 49 33 -81 -19 91 -51 -90 10 61 -28 -49 -77 26 -30 -89 21 35 -56 58 10 2 -26 -49 -36 -40 -40 -66
8084 -66 22 22 -14 -40 13 -54 -8 62 3 -9 -15 19 23 -43 -23 5 -27 -80 13 28 -62 -1 46 33 -47 -56 -3 -29 -107 -12 -30 -33 -10
8117 -10 37 -13 -43 -90 3 9 37 -45 5 50 -34 -8 44 68 21 12 64 22 33 -34 -16 -62 2 24 -57 2 -10 25 -10 -42 2
8148 2 27 -21 -31 -30 18 4 -66 15 -46 -56 -23 45 -27 -26 36 38 17 -4 21 39 53 51 -17 9 -28 31 9 57 -43 14 72 83
8180 83 -29 -61 34 13 -32 -7 16 -19 -22 -2 39
8191C9
##END NTUPLES=NMR FID
##END=
