##TITLE=1H_AM_NV Acrylon
 CDCl3
 8 sc, 
 12.2.2024
##JCAMPDX= 6.0         $$ Bruker NMR JCAMP-DX V2.0
##DATA TYPE= NMR FID
##DATA CLASS= NTUPLES
##ORIGIN= UXNMR, Bruker Analytische Messtechnik GmbH
##OWNER= root
$$ XWIN-NMR		Version 3.5
$$ Mon Feb 12 14:24:48 2024 Russian Standard Time (UT+4h)  she@DPX200
##.OBSERVE FREQUENCY= 200.1305
##.OBSERVE NUCLEUS= ^1H
##.DELAY= (6, 6)
##.ACQUISITION MODE= SIMULTANEOUS
##.ACQUISITION SCHEME= undefined
##.AVERAGES= 8
##.DIGITISER RES= 18
##SPECTROMETER/DATA SYSTEM= spect
##.PULSE SEQUENCE= zg30
##.SOLVENT NAME= CDCl3
##.SHIFT REFERENCE= (INTERNAL, CDCl3, 0, 15.7039)
##AUDIT TRAIL= $$ (NUMBER, WHEN, WHO, WHERE, WHAT)
$$ ##TITLE= Audit trail, XWIN-NMR		Version 3.5
$$ ##JCAMPDX= 5.01
$$ ##ORIGIN= Bruker BioSpin GmbH
$$ ##OWNER= she
$$ F:/spectra/data/she/nmr/H-F/1/audita.txt
$$ ##AUDIT TRAIL=  $$ (NUMBER, WHEN, WHO, WHERE, WHAT)
(   1,<2024-02-12 14:23:25.18 +0400>,<she>,<DPX200>,
      <created by zg, POWCHK disabled, PULCHK disabled
       configuration hash MD5:
       00 E9 B6 7A A2 85 ED C7 34 08 36 98 17 FE 4E 26
       data hash MD5: 16K
       6A E6 E6 73 C6 6A 9B AE 6A EC 6A D2 F4 8F 2D 7F>)
$$ ##END=
$$ 
$$ hash MD5
$$ 8D F4 C3 9C D0 09 98 C5 7A 6C 83 67 8A F3 27 F9
##$RELAX= 
##$RELAX= 
##$RELAX= 
##$RELAX= 
##$RELAX= 
##$RELAX= 
$$ Bruker specific parameters
$$ --------------------------
##$DU= <F:/spectra>
##$EXPNO= 1
##$NAME= <H-F>
##$PROCNO= 1
##$TYPE= <nmr>
##$USER= <she>
##$AMP= (0..31)
100 100 100 100 100 100 100 100 100 100 100 100 100 100 100 100 100 100 
100 100 100 100 100 100 100 100 100 100 100 100 100 100 
##$AQSEQ= 0
##$AQ_mod= 1
##$AUNM= <au_zg>
##$AUTOPOS= <>
##$BF1= 200.13
##$BF2= 200.13
##$BF3= 200.13
##$BF4= 200.13
##$BF5= 200.13
##$BF6= 200.13
##$BF7= 200.13
##$BF8= 200.13
##$BYTORDA= 1
##$CFDGTYP= 0
##$CFRGTYP= 5
##$CHEMSTR= <none>
##$CNST= (0..31)
1 1 145 1 1 1 1 1 1 1 1 1 1 1 1 1 1 1 1 1 1 1 1 1 1 1 1 1 1 1 1 1 
##$CPDPRG= <>
##$CPDPRG1= <>
##$CPDPRG2= <>
##$CPDPRG3= <>
##$CPDPRG4= <mlev>
##$CPDPRG5= <mlev>
##$CPDPRG6= <mlev>
##$CPDPRG7= <mlev>
##$CPDPRG8= <mlev>
##$CPDPRGB= <>
##$CPDPRGT= <>
##$D= (0..31)
0 1.2 0 0 0 0 0 0 0 0.06 0 0.03 0 0 0 0 0.0002 0 0 0 0 0 0 0 0 0 0 0 0 
0 0 0 
##$DATE= 1707733404
##$DBL= (0..7)
120 120 120 120 120 120 120 120 
##$DBP= (0..7)
150 150 150 150 150 150 150 150 
##$DBP07= 0
##$DBPNAM0= <>
##$DBPNAM1= <>
##$DBPNAM2= <>
##$DBPNAM3= <>
##$DBPNAM4= <>
##$DBPNAM5= <>
##$DBPNAM6= <>
##$DBPNAM7= <>
##$DBPOAL= (0..7)
0.5 0.5 0.5 0.5 0.5 0.5 0.5 0.5 
##$DBPOFFS= (0..7)
0 0 0 0 0 0 0 0 
##$DE= 6
##$DECBNUC= <off>
##$DECIM= 32
##$DECNUC= <off>
##$DECSTAT= 4
##$DIGMOD= 1
##$DIGTYP= 9
##$DL= (0..7)
0 120 120 120 120 120 120 120 
##$DP= (0..7)
150 150 150 150 150 150 150 150 
##$DP07= 0
##$DPNAME0= <>
##$DPNAME1= <>
##$DPNAME2= <>
##$DPNAME3= <>
##$DPNAME4= <>
##$DPNAME5= <>
##$DPNAME6= <>
##$DPNAME7= <>
##$DPOAL= (0..7)
0.5 0.5 0.5 0.5 0.5 0.5 0.5 0.5 
##$DPOFFS= (0..7)
0 0 0 0 0 0 0 0 
##$DQDMODE= 0
##$DR= 18
##$DS= 0
##$DSLIST= <SSSSSSSSSSSSSSS>
$$ [...]
##$SUBNAM2= <"">
##$SUBNAM3= <"">
##$SUBNAM4= <"">
##$SUBNAM5= <"">
##$SUBNAM6= <"">
##$SUBNAM7= <"">
##$SUBNAM8= <"">
##$SUBNAM9= <"">
##$SW= 18.0518050122584
##$SWIBOX= (0..15)
0 0 2 0 0 0 0 0 0 0 0 0 0 0 0 0 
##$SW_h= 3612.71676300578
##$TD= 16384
##$TD0= 1
##$TE= 0
##$TE2= 300
##$TE3= 300
##$TEG= 300
##$TL= (0..7)
0 120 120 120 120 120 120 120 
##$TP= (0..7)
150 150 150 150 150 150 150 150 
##$TP07= 0
##$TPNAME0= <>
##$TPNAME1= <>
##$TPNAME2= <>
##$TPNAME3= <>
##$TPNAME4= <>
##$TPNAME5= <>
##$TPNAME6= <>
##$TPNAME7= <>
##$TPOAL= (0..7)
0.5 0.5 0.5 0.5 0.5 0.5 0.5 0.5 
##$TPOFFS= (0..7)
0 0 0 0 0 0 0 0 
##$TUNHIN= 0
##$TUNHOUT= 0
##$TUNXOUT= 0
##$USERA1= <user>
##$USERA2= <user>
##$USERA3= <user>
##$USERA4= <user>
##$USERA5= <user>
##$V9= 5
##$VALIST= <valist>
##$VCLIST= <CCCCCCCCCCCCCCC>
##$VD= 0
##$VDLIST= <DDDDDDDDDDDDDDD>
##$VPLIST= <PPPPPPPPPPPPPPP>
##$VTLIST= <TTTTTTTTTTTTTTT>
##$WBST= 1024
##$WBSW= 4
##$XGAIN= (0..3)
0 0 0 0 
##$XL= 0
##$YL= 0
##$YMAX_a= 39652
##$YMIN_a= -39754
##$ZGOPTNS= <>
##$ZL1= 120
##$ZL2= 120
##$ZL3= 120
##$ZL4= 120
##$ABSF1= 10
##$ABSF2= 0
##$ABSG= 5
##$ABSL= 3
##$ALPHA= 0
##$AQORDER= 0
##$ASSFAC= 0
##$ASSFACI= 0
##$ASSFACX= 0
##$ASSWID= 0
##$AUNMP= <proc_1d>
##$AZFE= 0.1
##$AZFW= 0.1
##$BCFW= 1
##$BC_mod= 2
##$BYTORDP= 1
##$COROFFS= 0
##$CY= 11.3945322036743
##$DATMOD= 1
##$DC= 2
##$DFILT= <>
##$DTYPP= 0
##$F1P= 15.7292609196834
##$F2P= 12.9074282941183
##$FCOR= 0.5
##$FTSIZE= 0
##$FT_mod= 4
##$GAMMA= 1
##$GB= 0.15
##$INTBC= 1
##$INTSCL= 1
##$ISEN= 128
##$LB= 0.24
##$LEV0= 0
##$LPBIN= 0
##$MAXI= 10000
##$MC2= 0
##$MEAN= 0
##$ME_mod= 0
##$MI= 1.114404
##$NCOEF= 0
##$NC_proc= 0
##$NLEV= 6
##$NOISF1= 3.799351
##$NOISF2= 2.8
##$NSP= 1
##$NTH_PI= 0
##$NZP= 0
##$OFFSET= 15.70392
##$PC= 1
##$PHC0= -24853.05
##$PHC1= 5.052696
##$PH_mod= 1
##$PKNL= yes
##$PPARMOD= 0
##$PSCAL= 0
##$PSIGN= 0
##$REVERSE= no
##$SF= 200.130013532006
##$SI= 16384
##$SIGF1= 3
##$SIGF2= 2
##$SINO= 400
##$SIOLD= 16384
##$SREGLST= <1H.CDCl3>
##$SSB= 0
##$STSI= 0
##$STSR= 0
##$SW_p= 3612.71676300578
##$SYMM= 0
##$S_DEV= 0
##$TDeff= 0
##$TDoff= 0
##$TI= <>
##$TILT= no
##$TM1= 0
##$TM2= 0
##$TOPLEV= 0
##$USERP1= <user>
##$USERP2= <user>
##$USERP3= <user>
##$USERP4= <user>
##$USERP5= <user>
##$WDW= 1
##$XDIM= 8192
##$YMAX_p= 0
##$YMIN_p= 0
$$ End of Bruker specific parameters
$$ ---------------------------------
##NTUPLES= NMR FID
##VAR_NAME=  TIME,          FID/REAL,        FID/IMAG
##SYMBOL=    X,             R,               I
##VAR_TYPE=  INDEPENDENT,   DEPENDENT,       DEPENDENT
##VAR_FORM=  AFFN,          ASDF,            ASDF
##VAR_DIM=   8192,          8192,            8192
##UNITS=     SECONDS,       ARBITRARY UNITS, ARBITRARY UNITS
##FACTOR=    0.0002768,     1,               1
##FIRST=     0,             0,               0
##LAST=      2.2672688,     0,               0
##MIN=       0,             -39754,          0
##MAX=       2.2672688,     39652,           0
$$ Real data points
##PAGE= N=1
##DATA TABLE= (X++(R..R)), XYDATA
$$ [...]
406d444K021M111K841j237l587l210k57L128K982Q06j741k937p85J005J812J127
422A635q60r12l53K40N86n45n58J12P27J382j25j344j362m60J591J716K44j091
440F23j961l98J249J350O52j170j231O0R06J150m59j657q10N80K240J383j099
457A408k353k036P21L040K333Rl024l206m09K169L550J523j684k916k299N67K491
474a16K093O67j466k026j018pJ271J395P91K26j189j460j079j03J742J945R27
491B593r49k685j753J97K299K857O20j648k873j961R37K467K343M16k004k296
507a440j158Q55K184J448J62j338j820o18L48J271J261J45m26j117q35R7N06R70
525D95N70l07n42r34k70L83N66Q62N9m18n90p35J40M81N49N75l38n71n44k98N73
$$ y = [-4444, -2423, 1688, 4529, 3292, -295, -3505, -3762, -634, 2348, 3154, 1413, -1524, -2309, -1304, 508, 1635, 775, -137, -490, -250, 336, -209, -767, -655, 72, 1454, 1329, -15, -1377, -1837, -246, 1470, 1714, 623, -1338, -1736, -487, 863, 1515, 345, -886, -826, 80, 1230, 771, -886, -1696, -1116, 1124, 2507, 1408, -945, -2981, -2260, 780, 3113, 3122, 98, -3108, -3517, -1348, 2202, 3725, 2041, -875, -3174, -2607, -116, 1977, 2644, 1178, -848, -1866, -1873, -602, 793, 1584, 1810, 621, -839, -1918, -2021, -279, 1666, 2593, 1644, -1041, -2794, -2597, -298, 2559, 3179, 1531, -1342, -3303, -2366, 101, 2444, 2860, 856, -1440, -2598, -1743, 441, 1889, 2051, 713, -1107, -1725, -1377, -106, 1155, 1300, 874, -243, -1078, -981, -475, 495, 1065, 758, 216, -718, -988, -605, -39, 823, 882, 464, -126, -861, -721, -240, 309, 884, 546, -25, -569, -867, -294]
546b94N60M41M2p27m47l25K18O61K76J50k70n70r1p5L46M78P2J9m95n10K8R6O48
569B31M09j64l10o80j12M14M01N29k37o23m06k14O16O79J79r9q39n30R2N21Q72
590G29J70n60q33p04M69J023Q54J35j147j216l86O98J610P61n23j412j391K51
608a472J331J445N49j156j479q02L38J440R65J57p58j209m03J07P10R65L95o2
626A061q82j218n04L47J488J547Q5j299k170j076J195K316J963m84k583k369m26
643c009K218K815J004j360k789j600Q04K157J817j19j648j422m81R11J101L92
659G91p2m94j94j68m21j42K16Q11R36k07j091j347l13J348J685O76j056k079r35
678b056P63J931J343o67j657j317L22J656J082k74j318j098M32J138Q29l27j333
$$ y = [-294, 266, 707, 749, 22, -425, -750, -532, 129, 405, 555, 285, -285, -376, -451, -105, 373, 445, 464, -31, -541, -513, -417, 231, 640, 476, 166, -514, -626, -212, 189, 718, 481, -142, -548, -762, -146, 533, 712, 613, -226, -756, -664, -143, 729, 899, 339, -494, -1198, -729, 294, 1148, 1283, 136, -1080, -1466, -768, 842, 1603, 1080, -332, -1723, -1472, -141, 1304, 1853, 697, -782, -1584, -1246, 194, 1159, 1316, 558, -651, -1054, -947, -237, 728, 1123, 1061, 179, -1039, -1543, -1196, 292, 1839, 1924, 625, -1545, -2621, -1426, 890, 2853, 2369, -214, -2583, -3009, -791, 2024, 3028, 1668, -1121, -2721, -1917, 240, 2057, 1938, 290, -1132, -1613, -702, 399, 791, 719, 225, 31, -137, -558, -700, -484, 327, 1263, 1056, -35, -1382, -1695, -347, 1338, 2014, 958, -1121, -2056, -1293, 638, 1981, 1314, -343, -1660, -1338, 318, 1400, 1126, -192, -1290, -858, 280, 1109, 782, -551]
695e51o24N40J228Q27o94j275q04M16J395Q04l31j081r82K40Q75P39J16o67n02
714c31o9J52K72j48PL12K27J14o20p51m7O44J212M19q96j315q72O02J602J104
734A618r0j536j449j42J069J565N85p81j319r64L23J092R55K89p60q80m27J19
752g33P10N58J33k14o50l68o2L55O41K75j03m93o58o4L45O21M64l00n37n15r1
773f86O05N30K32l00o91l24O6N61N80j6l04n80l40L62M75M38l3n82m67k12L89
794b97O76K67j50o07n22J01M12O25J60m16n15m13J63N72L64J69l68m80j58K2L89
815fL28L0o3m10k48K6J36M45J89l3k75m40j31J48L61M08l6k71l82k99K33L74L34
838D18J32l88l52k93M7M00L00K03j91m23j93q0L14L45R3l8l01k87j3L5K99K46
$$ y = [-551, -1175, -635, 593, 1420, 726, -549, -1353, -937, 458, 1262, 931, -150, -1132, -892, -17, 722, 838, 171, -331, -400, -248, 24, -124, -117, 195, 422, 536, -84, -835, -882, -238, 974, 1393, 497, -818, -1690, -1088, 514, 1618, 1528, -8, -1457, -1599, -530, 1035, 1620, 839, -480, -1444, -1121, -29, 926, 1215, 455, -425, -852, -733, -23, 535, 668, 454, -196, -564, -626, -271, 370, 645, 542, 49, -609, -673, -328, 293, 757, 457, -80, -595, -686, -81, 449, 681, 381, -310, -634, -568, -7, 573, 557, 253, -327, -667, -305, 170, 608, 575, -7, -474, -686, -297, 379, 646, 496, -111, -633, -532, -120, 505, 665, 249, -266, -679, -516, 56, 420, 589, 221, -259, -417, -395, -6, 322, 352, 289, -121, -369, -343, -207, 238, 427, 394, 119, -321, -452, -304, 57, 465, 429, 158, -224, -523, -290, 84, 418, 550, 162, -190, -483, -436, -36, 264, 467, 276, -147, -340, -420, -106, 239, 332, 294, -7, -294, -307, -272, 27, 273]
860B73K1j5l28k63p6J28M09L05J7l07n71k17K20N89N73o9n52p05l20N04P02M95
882H13j54p27n39q4M33O92K18j95n39m14N6K59L11K01o8j02k55k16J1J11L89K80
904D81o0l65n51j31L79N74M56k65o55m85k7O32N72R7m26o74j87L71M86L58k57
925C23m27k67Q2L54K02j04k02j63P2J98O4m5j61oQ1R0K6j77p1P9Q6R9p0j51K2
950f6M1J41J9j66j06k6J48K35l6j26k41q9K19K21J52j38l44j50M4L03L01q4j77
973G5l02j11K11K45J91k8l28k10m6J83K81R9n8k65j80M7J28K70O5j66j96j59R0
996a64K03J02K7j38j11k5O4J06L6p0l6m5RL3l7Q2M0rl7j48m3P8J41J78j10k40
1022a14j59K8L56K44k2l27l86p0L50M45J84l33m77k59J84N64L22q6m31m81J1L90
$$ y = [273, 294, 279, -49, -312, -388, -260, 149, 454, 471, 164, -407, -624, -404, 185, 758, 689, 137, -568, -888, -384, 318, 813, 659, -68, -607, -691, -258, 434, 652, 457, -82, -496, -440, -181, 130, 331, 263, 161, -94, -310, -299, -188, 201, 481, 421, 56, -495, -626, -247, 327, 783, 518, -137, -622, -649, -17, 555, 652, 226, -448, -635, -264, 222, 580, 323, -104, -371, -289, 65, 267, 163, -39, -202, -130, 68, 132, 87, -74, -80, 1, 91, 117, -60, -131, -52, 34, 133, 63, -88, -66, -25, 116, 135, -31, -137, -163, -15, 220, 184, 58, -183, -272, -53, 168, 320, 182, -162, -312, -268, 35, 336, 252, 75, -227, -338, -127, 118, 309, 281, -47, -257, -303, -120, 161, 260, 202, -63, -243, -196, -68, 202, 267, 101, -95, -254, -164, 39, 141, 168, 30, -81, -106, -42, 64, 100, 30, -6, -51, -42, -9, -46, 36, 76, 67, 30, -118, -161, -83, 58, 236, 126, -114, -273, -245, 111, 355, 333, 6, -380, -450, -100, 345, 529, 196, -281, -540, -356, 208, 530, 444, 13, -468, -457, -67]
1044f7L34J76k32l20j92Q4K24J46M0n8j05p7j31p4J31K06K58ml65l18j59K93N39
1067C29K37j82n98l85J08M89N45O4m00n54k10K57N29K30p6m24k72j8K42K60O2
1088B33r7j10j23qM4rP9J10O5n2k14j70J2K19K88lj78k83j40J77K41K01n6k45
1112a9j67j6J42K17qq2r3o5M7L8L0Oj8O8l6k4l2q6O4N8Q5Nj10j18oN5J35O1j6
1141A15r3j81MR5J04Q9k5j26n1n0J05Q1N5m8j15l5lL6J07L3k8k6r3J3KO6N1m6
1169C6n8n9L0M1N3J1Op5k6kO3L8K1n7p5l2P0M2N2k5m9n0n7O5J02K3pj28n0J8N7
1200b2J11L5l8j17j10kJ56J10O0j17j50p7J1J98J53pj46k00o7J40J59J36j04j69
1224e7j39P9J61Q2n0p2p8K6L0J8Ql7L9M9K0o3j19m7J46J21O6j11k01n8R7K32J06
$$ y = [-67, 267, 443, 211, -109, -301, -217, 7, 153, 193, 135, 30, -47, -178, -252, -121, 85, 343, 339, -26, -344, -503, -210, 329, 566, 384, -214, -599, -491, -2, 543, 607, 207, -347, -557, -300, 229, 459, 383, -41, -313, -331, -89, 171, 233, 136, 26, -97, -105, -61, -70, 9, 119, 184, 132, -82, -252, -240, -21, 267, 264, 86, -197, -337, -160, 81, 282, 226, -19, -186, -202, -60, 157, 149, 67, -26, -91, -44, -6, 24, 30, 12, 80, 44, 20, -12, -98, -34, 24, 109, 114, 4, -114, -120, -65, 70, 131, 115, 22, -159, -155, -60, 44, 133, 108, -18, -69, -119, -14, 67, 122, 74, -41, -76, -79, -43, 64, 97, 69, 43, -50, -37, -35, 31, 82, 36, -22, -81, -51, -10, 43, 54, 60, -15, -41, -43, 20, 58, 79, 22, -53, -85, -15, 27, 79, 54, 5, -45, -102, -37, 65, 88, 81, -47, -97, -79, -22, 89, 124, 86, -31, -141, -143, 13, 123, 183, 66, -84, -161, -150, 48, 201, 194, 48, -152, -219, -79, 80, 216, 112, -57, -196, -117, 44, 126, 76, 4, -74, -48, -18, 0, 8, -29, 10, 59, 79, 16, -103, -150, -4, 117, 183, 72, -129, -187, -90, 142, 248]
1251B48j39k00j03Q5K21J11j27j99r1J42K16N5j76k04m0J89K15K9k24k47o7K40
1273f6L00P3j97l07j35K00K89J10j16k62j23O9K41J02p4j21n9K8R9l2r3l0Q7J69
1297A52J6j85k25qK69K44N0k31l69r9K06L83K00j55l86k76J06L76K48n1k52k78
1319b65k3K32K22N2j54j38k6N1P7nj1K7Nj1l7r9J0P1J52M1j14j61r9R4J92J15
1345A98n5k25j21O2J53K06m9j77j27l5J11J43L0m5j52k8L6J11N1l6n1m1k0L0M3
1370A2LKm0JQJN8k8J0rl5k4K7K5L6j2j9m6k5N7QM9l8n6Kk5M8K5M6m2k2m1j2J8
1404c8P8Pk0k4o4RN6N4Ql9o8j2K2L8M4k6k2n1K0L5NJ4j8j4K4lk6mLK1PK1J0o9
1438b2j5kRQ2Ml0m3j7K8j1K5L4k1l0j6lK8PK7Ml4j0k3lN2K9J2l8m7l1L6K6L5K6
$$ y = [248, 109, -91, -194, -109, 112, 223, 96, -103, -194, -52, 164, 219, 43, -161, -201, -12, 203, 232, 8, -239, -306, -66, 234, 307, 110, -197, -332, -132, 157, 267, 151, -111, -234, -165, 76, 178, 104, -17, -76, -48, 51, 19, -74, -104, -17, 152, 168, -17, -242, -250, 19, 263, 313, 82, -287, -386, -180, 203, 403, 248, -138, -414, -308, 68, 316, 265, 13, -265, -288, -56, 166, 218, 64, -74, -100, -49, 28, 23, 12, 39, 44, 33, -4, -103, -93, -22, 130, 171, 57, -104, -203, -109, 83, 198, 143, -82, -203, -141, 12, 218, 169, -8, -135, -170, -59, 84, 114, 69, -83, -111, -75, 36, 87, 51, 0, -41, -61, -31, 12, 15, 17, -23, -22, -14, -13, 45, 17, 27, 18, -17, -41, -14, 11, 47, 35, 16, -30, -55, 2, 10, 59, 21, -35, -33, -58, -10, 15, 61, 19, -3, -44, -56, -38, 40, 47, 27, 3, -61, -52, 4, 58, 66, 27, -41, -53, -31, 7, 51, 25, 3, -48, -28, 7, 12, 26, 8, -6, 18, 15, -11, -15, -12, 9, 16, 37, 47, -22, -37, -39, -30, 52, 56, 26, -17, -34, -6, -17, 8, 42, 21, -9, -25, -28, 0, 7, 34, 38, 4, -6, -29, -32, 20, 49, 61, 23, -24, -55, -19, 7, 42, 68]
1472F8j6n4l8k0K5O8L1k0o0n5J1L0P3L2n8o3m1N4O9J1Km9o3J6M6J7J8l2k1K9K2
1503C2%n5j4J1L7PK3k7o1M1N2M2o4m0m2M5L7K7qn2k7oL6L9nm1l2L5J7kLm4nL4
1537gO8j2l9o9k7O4N8M0m4n8l4L7P2L7n3n0l7J7O5J3Mm0k6JmN2j9pl0K7oj7K7
1570Cl0O0j9Jk0j8j4K3K5nJ1o2J2j2O4L7om6l2oJ3M0qMlm7OK1L8L5m9l7j9J0M4
1605A4J2Ko5NLM1K4J7n0n9OM8jL1k2l3qN8mj6j4RRj0J0orjO0l2J1l1j8k7P5M1
1641G0k5l0p1k6P9L6L8m4m6m7K6N8J9or3pN5J7L2k1l6NNM6k5J0m9OM0K9l9j4M
1674dpL1K9k7n8MK6O1Jqn7l7M6K4J5k5l5j6L4kO7m6om9L9NL9m5k5j3K9JK1j4j9
1709b1nJ8M1j4j6orK4J2Jl7J8k8J7M1l9j1J3J4Qj6lk0KJ2K0pm6J6PPj7L3Lm0J
$$ y = [68, 52, -2, -40, -60, -35, 33, 64, 44, -16, -71, -60, -30, 43, 75, 17, -46, -87, -33, 36, 47, 49, 0, -63, -47, -1, 16, 34, 2, -19, 10, 32, 32, -23, -37, -26, 11, 18, 41, 14, -47, -6, 46, 88, 24, -16, -58, -13, 24, 51, 43, -9, -36, -42, -6, 33, 28, -13, -45, -10, 7, 5, 8, -36, -41, -7, 61, 49, 10, -59, -86, -22, 36, 76, 32, -26, -60, -23, 49, 86, 33, -17, -54, -37, 28, 41, 45, 5, -21, -20, -24, 28, 9, 2, -28, -1, -7, -24, 3, -27, 33, 14, 15, -5, -23, -37, -14, 11, 6, 17, -45, -33, -45, 19, 56, 50, 4, -28, -34, -21, 19, 11, 15, 12, -35, -29, -8, 30, 65, 16, -21, -40, -30, 14, 26, 28, -37, -32, -29, 12, 36, 53, 3, -56, -50, -2, -3, 28, 6, -27, -35, 23, 19, 3, -11, -2, 7, -3, 7, 1, -8, -9, 51, 19, 30, -1, -19, -46, 29, 70, 45, 15, -56, -82, -3, 33, 71, 27, -19, -66, -40, 18, 37, 31, -62, -69, -14, 3, 35, 14, -22, -17, -12, 34, 9, 19, -30, -24, 16, 45, 6, -8, -4, -11, 20, 49, 22, -36, -32, -6, 55, 56, 48, -9, -46, 0, 24, 39, 14, -21, -37, -3, -5, 62, 16, 10, -39, 0, 5, 44, -1, -26, -39, -10, -9, 12, -2, -21, -26, -8, 33, 19, 3, -3, -12, 12, 24, 25, -12, 6, -22, -5, 36, -3, -14, -1, 13, 21, 5, 2, -18, -16, -4, 16, 9, -37, -21, -14, -7, -24, 9, 12, -28, -27]
1745b7OK4J0j3J2k3Oj0N2jrj9J5k3kOLmqK8k1kJ9Nj1Pl6J1RlOj8lOJj2JM2oLl7
1786a6pL0Ok5Omj8K8LmNJ9Jj6Ok4K6rM1nl8Ok4lM3mjk4k3J8K5k5qoPK7plk9K1
1826eL2l2L1j8Ojm0L0j0nJ4j6j1K3K2Qm1j2J9K6K2j4l4Lj5L6km7JjMN9lrl9j0
1862b9K1K0J3k7n1K7J3QK7m7NoM7pKl9j8MN9L5k5m3m1K9M2QL3o4j4j8M7M4l2n5
1896c2j0L5K8J5l0n0oK6L7J2l1k8lM6QJ2l8rj0J6M4Kk2l8k5Q1K3Lo1j7k0M2M6
1929D6Po6l1L0L7K7l9k2k5%O3Mk3k5k0K2J0N2l0m2nJ2M7Oj1m0k4J5L6J5m3Ml4
1962d7K7K7L3k4n1K4PLL7k8j0noL4J3m0QnNlK9k3k0J1PJ7j0lj6%J7Nk1L5k8nj0
1999a6NL6j6Ln7K3J2M7k5j2Rk0KL5J3rpm3LM1j9mpj1K0J6MNl5%j8K2L5j5j7m1
$$ y = [-27, -21, 3, 13, 0, 12, -11, -5, -15, 37, 36, 27, 8, 23, 0, -2, 4, 7, 3, -5, 23, 2, 0, 19, 24, 13, 20, -16, -5, 4, 1, 7, -11, -14, -8, -7, -19, -18, 24, 18, 21, -16, -23, 7, 13, -12, -6, -10, -28, 0, 3, -1, 4, 23, 24, 8, 14, -10, 16, 7, 48, 43, 5, 11, -13, -16, 27, 23, 22, -2, -25, -7, 18, -7, -15, -21, -14, 13, 6, 3, -26, -5, 27, -5, 26, 8, 14, 13, -27, 3, -7, -12, 2, -14, -25, -2, 20, 28, -13, -25, -6, 20, 42, 28, -6, -3, -18, 18, 16, -31, -30, -31, -27, 32, 29, 20, -19, -29, -8, 12, 25, -2, -53, -26, -13, -5, 22, -25, -20, -26, 21, 14, 16, -23, -41, -37, 22, 57, 32, -11, -52, -23, 19, 27, 60, -4, -18, -36, 11, 55, 23, -32, -42, -7, 21, 36, 6, -44, -50, -24, 13, 25, -6, -34, -37, 9, 17, 29, -9, -18, -28, -12, 32, 34, 12, -26, -51, 30, 53, 56, -5, -22, -42, 0, 46, 53, -13, -44, -14, 23, 50, 11, -11, -36, -36, 27, 31, 8, -17, -37, -15, -5, 47, 17, -25, -30, -18, 29, 35, 24, -16, -40, -25, 11, 26, -17, -13, -47, -20, 7, 40, 16, -35, -11, -4, -1, 36, 8, -2, -7, -13, 21, 34, -6, 2, -3, 2, -1, 28, 5, -15, -4, 3, 20, 10, 7, -9, -9, 8, 13, -8, 27, -1, -6, -16, -11, 25, 9, 12, -45, -22, -10, 37, 12, 0, 9, -11, -9, 26, 39, 30, 23, -20, -17, 24, 5, 1, -6, -17, 3, 19, 23, 28, -7, -7, -25, -3, 32, 17, 0, -41]
2035d1J0K7JJQl5pK1J7L9n7k4j3P3Qoo7PK6oN7nl2l5K1K6L4j8Jl2l1L4J2%pl7
2071c0RK3k0J6Onl4J8L5qnprJ5Okj6j2qL1J4K4j2n1j9J6O3L3l4k4n4m6Q1N8L0
2106H2o5k1l6lN7M6m1k8k9K8L2rjqj4J1L4k4l5k8N9L6J1k8o9n7L9J15L9o0q7q3
2138a37L6J27Q4j7j00q7NJ06P6ro7m7m4O3P0pp9j7L0K9K2l2k8m3O6K1L5n2o7O
2168e7O0P1pq3k8l7P9O4rm4m7%L1M9M2j7j11k9N4N7K3m7o0j2K4M1L3jn9om0M7
2200a9K8RK0k4m7oK0M8J8k1o0l2K0K8Q3m5k4j8nM4Kj9k3j3O8Nm0l1k6K8O6P1o4
2233D1q9l3K4J04M1l1j03o8L9J09P0m7o4j32N6J35P1k6j64p8N9J33J28p3j70j07
2259a75P3J52J07n6j58r8K1J70J31n2j50p8J8J28Q8q3q0k2K5J17nr2r3L0J18J16
$$ y = [-41, -31, -4, -3, -2, 6, -29, -36, -15, 2, 41, -16, -40, -53, 20, 28, 22, -45, -38, -12, -18, 39, 34, 2, -33, -12, 14, 48, 30, 31, -1, -32, 2, 14, 14, 7, -30, -21, 2, -18, -2, 4, -1, -35, -17, 18, 10, 5, -2, -11, 4, 10, 8, -8, -20, -28, 3, 17, 41, 29, -22, -41, -25, 38, 71, 37, 13, -41, -87, -6, 52, 82, 17, -4, -40, -43, 14, 60, 19, -9, -38, -10, 22, 13, 12, 4, -10, 1, 35, 11, -24, -52, 7, 43, 54, 26, -43, -100, -61, 54, 93, 33, -54, -137, -101, 26, 110, 93, -7, -94, -89, 17, 93, 84, 17, -30, -74, -11, 59, 52, -27, -44, -14, 15, 37, 5, -23, -66, 0, 21, 56, 4, -63, -57, 3, 74, 67, -16, -44, -81, -2, 62, 53, 9, -38, -38, -7, 42, 84, 67, -44, -73, -19, 38, 61, 14, -46, -58, -34, 7, 40, 39, -20, -26, -66, -19, 9, 18, 38, 14, -33, -39, -19, 29, 47, 26, -34, -66, -46, -18, 65, 20, -4, -22, -27, 17, 19, 0, -23, -36, 32, 37, -3, -34, -60, -32, 34, 105, 41, -48, -81, -57, 47, 88, 57, -46, -114, -75, 34, 104, 57, -7, -139, -83, 52, 123, 97, -67, -145, -86, 47, 175, 102, -68, -175, -102, 50, 157, 101, -57, -155, -134, 36, 167, 115, -35, -113, -95, 33, 121, 38, -42, -64, -39, 78, 73, -19, -112, -82, 36, 152]
2285A52j5j99j36K4J95J91mk32j82j7K08K35L0j97k11j13J60J92J07p0j83p9O6
2308g8J11R8q8m9n1P3Nk2o2j1R3Q6J5j04j32j7Q0J82L2j01j68j04R5J95J28m1
2334A65j95j15OR9J41j3o5j04rN4M9N3n2k6K4j0jk7j9K8M1MK9o3m1l5O2N0M8l9
2364C9r2j4J2O0O6%m9n7j1OL7N4k7ol2j0%OM2QJ1l5k7j8K1K8M9j4l7pk1J9K8j1
2398A8K1m4k8k2j5R8j0K1l2m6PN9OQk4n1j9mK8O9K7n2m3l3RJ07K2l2l3j01l3P4
2430d8J22O1m2j05j13qQ5J34P0r8j27q4L6J36J29%j15r4k3L7P6M5op5m3L6j8k3
2458e5K2M1P5J0j18q5l0P7J93Q2j43j97j03P6K46J75r5k23j82L2K06J85kj56k05
2483a74MJ67J41L2k01j04J3J40J21q7r6j35R1J88R3r9k03r1P2K37R3r5j94j18
$$ y = [152, 137, -62, -198, -174, 21, 212, 208, -24, -206, -223, -15, 220, 250, 53, -158, -271, -111, 81, 188, 118, -65, -144, -78, 33, 131, 43, -6, -57, 16, 21, -1, -63, -74, 19, 105, 120, 16, -116, -133, -53, 129, 161, 60, -108, -212, -117, 78, 206, 165, -30, -145, -139, -40, 101, 88, 23, -81, -90, -36, 13, 66, 14, -12, 12, 2, 1, -26, -45, -17, 24, 28, 57, -6, -47, -82, -20, 30, 78, 39, -53, -67, -55, 5, 71, 71, 22, -35, -46, -40, -3, 51, 24, 18, -14, -24, -24, -18, 24, 32, 43, 8, -19, -37, -16, 12, 61, 47, 10, 3, -18, 1, 29, 18, 39, -5, -33, -55, -70, 28, 18, 39, 7, -39, -32, 27, 33, 41, 17, -34, -53, -57, -29, 40, 67, 15, -28, -61, -52, 55, 77, 45, 12, -89, -122, -48, 74, 135, 93, -12, -125, -133, -48, 86, 156, 58, -69, -153, -117, 19, 148, 148, 33, -61, -84, -47, 29, 74, 68, -7, -50, -14, -32, -55, -33, 8, 83, 93, -25, -110, -140, -63, 130, 212, 69, -128, -231, -155, 91, 266, 171, -52, -234, -202, 4, 189, 187, 31, -174, -170, -3, 138, 170, -31, -135, -122, 18, 139, 52, -44, -179, -88, 100, 193, 94, -109, -200, -128, 109, 202, 107, -87, -205]
2507b05Q6K10Q2q9j60p5J15J19L4j30j40L3J70J59k2k32k07O4K24K56m3k66k75
2530b92k0K55L24J00k59l13j14J36L06J23p3k40j38M5J37J45Lp7n3m7L5k3m6O0
2554b6R2P0j1j72j43J0J87J99N6j94k72r5J25L33J40r0k79k03L5K25K26K8j68
2577G3k10r1J18J66J01j8j54p3j7L5J05K1L1q0n7k5%R2L2L6o5p4k2jQ7L8L1m5
2605C4r6nJ3Q3Q9j9o7p7n9N6P4N6Rq2p6l5P1P4Q4m5j11j04j9P4J68N9p4j29r5
2634a49N7J15J29m2r8j07l0O8Q4O0k3p1k2%L4j4K8mK3L4n4o5l9J0J37O0k3r1j11
2663a04j7Q7J27K4k3j43r2J6R1R0M7o4l8q4J9J5M4N2J2mm4o7m5J1J16R0L1j04
2691D3j30q3L4J61J26L5r7j93j08Q4J63J28K9j21k11p3M7K12J74k8j16k09o7O1
$$ y = [-205, -119, 91, 173, 84, -76, -151, -36, 83, 117, -13, -153, -120, 50, 209, 187, -45, -252, -188, 36, 292, 249, -17, -292, -312, -57, 267, 367, 108, -205, -319, -183, 123, 246, 173, -67, -205, -160, -23, 122, 125, 48, -5, -52, -17, -40, -86, -26, 66, 136, 125, -47, -190, -180, 7, 206, 262, 68, -204, -299, -174, 159, 299, 209, -70, -273, -238, -13, 213, 241, 73, -137, -228, -110, 56, 157, 139, -15, -88, -105, -70, 35, 56, 87, 7, -50, -75, -75, 17, 49, 85, 20, -54, -76, -77, 10, 48, 79, 34, -62, -67, -54, 29, 118, 99, 32, -45, -104, -48, 26, 82, 91, 9, -67, -102, -31, 43, 127, 82, -29, -133, -152, -78, 90, 149, 75, -54, -149, -92, 23, 152, 110, 12, -95, -125, -57, 27, 87, 64, -7, -29, -29, 5, -9, 19, 15, 38, 72, 18, -47, -86, -76, 61, 121, 98, 7, -104, -121, -34, 93, 117, 94, -49, -141, -125, -34, 56, 103, 39, 1, -83, -64, -49, -5, 47, 59, 55, 11, -56, -101, -90, 26, 116, 147, 43, -87, -170, -136, 25, 151, 186, 89, -104, -212, -128, 35, 163, 192, 71, -140, -213, -166, 46, 220, 192, 76, -133, -200, -139]
2715a39J73J33oj29j49k6N4R2R5Mp5n2n8k1O2N0Q8L6n9j33p9L1J37J45J4j43j42
2742i7r4Q4J84Q9k4j80j13O6J05N5K7j35p2N0P6O2n3r2o4R5J33J8q4j39n2R6J55
2769I6Q1p2j58j16N7J02J19N0q6j45n9N4J02N6kj0m0o3m2PN3Q8L4m1j21j10L6
2796a30J47J22N7j21j54j47P9J42J86Qj43j80n7Q6J80J37l7j47j70l6R8K08N9
2819A87n5j86j25JJ94J68M0j51k23p5R6J82J45l3j85j30k9J50J70K0j01j35n3
2842a28L6R7Q9K2l7p1p7o4J8Q3J72M1p4k20j71M5K80K56Q3k83l63j97K74M14K53
2867D78j52m47l49O9L75L99P5k93m10j27J60L19J51k9j81j95JO0Q9O6M7K1p2r4
2891c9j65l6J81K31J69j15l52k65M7L93L19J5l08l98o9K33L74J78j78l02j93R2
$$ y = [-139, 34, 167, 161, 32, -117, -143, -89, 3, 98, 102, 27, -25, -83, -104, -42, 8, 96, 132, 73, -60, -139, -108, 29, 174, 188, 45, -97, -191, -107, 77, 166, 142, -38, -151, -85, 20, 75, 102, -33, -105, -55, 21, 83, 30, -62, -126, -31, 102, 120, 36, -103, -155, -59, 96, 177, 105, -53, -169, -112, -10, 109, 159, 73, -72, -131, -77, 25, 81, 79, 69, 29, -34, -76, -69, -16, 72, 106, 65, -56, -166, -130, 17, 139, 196, 75, -79, -226, -147, -5, 181, 189, 46, -134, -191, -105, 75, 212, 175, 28, -142, -178, -80, 128, 187, 132, -54, -179, -178, 16, 184, 224, 73, -150, -225, -129, 53, 198, 165, -20, -150, -179, -29, 141, 161, 60, -75, -128, -92, 5, 94, 116, 79, 8, -69, -133, -115, -32, 140, 181, 107, -113, -284, -239, 41, 297, 380, 97, -266, -463, -189, 225, 478, 326, -121, -470, -401, -26, 373, 448, 155, -255, -382, -222, 97, 248, 219, 38, -157, -156, -96, -7, 59, 106, 127, 55, -39, -204, -240, -59, 172, 341, 226, -126, -391, -344, 49, 368, 383, 75, -323, -392, -159, 215, 393, 215, -87, -280, -188]
2913a88K28J58j9j84j06l3J64M6l6q1J3Q8K8Oj73p4N8J60J44n1j70j83O2J22J86
2938A65Nr9j53n6R6P6M8o3l0ON1l1m2m4M5N6J10l0j36j52L2J31J44P6j27k06p6
2965b04N5J80J38K7j62j57p4R2J63Q6j6j24j01l3L6Q5Q4K0p2n8p5L0R7N5K4o6
2991C0p9l6M0N4N1Mrr2j2K1rP3jl3k7l6L6J7L0L0m6k8J9K7%J0k2n7pN4J7K5j0
3024C4l3m8J0M3M7J5n2l5l4NN2P2J9l2r9n8JQ4P2K5o4j06l3M2J15O1l9q6n5k7
3054a04J00N2om7n1K7N6M3l6p1qK1J11M3p6j50o9N9J93O8j1j32j35qJ35J02K2
3081A28q6q3k5M2M4l6L3K7O1k7j33j47PJ54K55Q3j51l40k12J55L73L06m8m18l88
3106d26k6L24M03J98k22m13k30O9L68K36J9j89k74o8L6J75J46L6J5r2j34j74l6
$$ y = [-188, 40, 198, 179, -5, -111, -144, 20, 66, 30, -51, -38, 50, 78, 84, -89, -163, -105, 55, 199, 148, -22, -205, -143, -21, 165, 170, 71, -82, -138, -42, 34, 82, 19, -11, -5, 46, 15, -27, -71, -26, 30, 140, 110, -26, -178, -146, -15, 129, 205, 78, -128, -204, -149, 31, 169, 196, 34, -123, -197, -105, 58, 144, 128, 4, -97, -130, -94, -9, 75, 95, 23, -35, -110, -80, 17, 72, 96, 30, -49, -85, -45, 9, 60, 64, 55, -37, -49, -28, -37, 36, 35, 2, -25, -61, -25, -8, 22, 52, 6, -22, -3, 24, 24, 34, 12, -45, -52, 2, 19, 44, 34, 1, -47, -37, 6, 53, 68, 16, -19, -53, -48, 4, 76, 95, 63, -36, -94, -93, -9, 63, 88, 24, -82, -115, -73, 42, 103, 64, -22, -77, -104, -4, 48, 42, -5, -56, -29, 27, 70, 34, -37, -45, -24, 87, 130, 54, -96, -165, -106, 87, 155, 144, 12, -123, -131, 4, 106, 128, 42, -41, -66, -24, 20, -16, 17, 44, 105, 78, -55, -202, -195, -41, 214, 297, 146, -194, -406, -251, 122, 428, 380, -38, -426, -452, -128, 275, 473, 251, -162, -392, -323, 45, 281, 300, 111, -163, -231, -195, -20, 126, 162, 177, 85, -49, -223, -259]
3129b59J78K88J16j14l33l17N0L70M31N0k87m93k02K29M86K71q8m14l53J1L48
3150c2L08N8k00k84j11J28J94Q3kj20o3j6M9m2L3N3O9nj21r1k1M8K01O9r2j84
3176i1r4N9J64J49p4j51j60L4J77J78Pj85j77oJ17J78O6j46j57n8R1J44R8k2j48
3201gj02j3J05R1L0l7q2j32O1L8J18K5j8p8r3J0N5J12M%j09n6jM2R1Rjp5l6k5
3231g4M8K5M0K3n1n5k6M4L7Q3l4o8o9JL5J22Po7j02kO1Q0L0o3r8p2Q8J34P9q2
3261G4j27j43O7J67R0J0j35j61nQ4J47N9lj22j19k8P4J21N2K2p9j22l7K2J02R3
3287A03O5p2j38r4m7J15J63Q6n6j82j17j1J47J99N3p4k03j41J1J35J39R7o5j73
3311f0q9MQ9J59M4l7j36q6k1P7J00P4j3q8l5q7L2P3N3K9k0o0o2o3L3P6J42J0q9
$$ y = [-259, -81, 207, 323, 209, -124, -441, -391, -21, 410, 460, 173, -320, -522, -293, 193, 464, 376, -38, -391, -380, -32, 276, 334, 134, -150, -261, -133, 61, 144, 142, 22, -41, -57, -8, -50, -17, 36, 105, 100, -21, -112, -133, -85, 116, 185, 93, -91, -185, -126, 38, 187, 113, -38, -198, -164, 13, 191, 198, 13, -164, -170, -53, 125, 191, 45, -112, -170, -79, 65, 163, 141, -7, -109, -122, -17, 74, 104, 67, -15, -147, -86, -48, 70, 95, 77, -1, -94, -84, -29, 83, 87, 87, -22, -78, -79, -37, 54, 63, 62, -13, -49, -74, -26, -1, 39, 62, 11, -44, -70, -26, 11, 94, 60, -8, -77, -76, -41, 81, 88, 21, -81, -83, -22, 58, 88, 25, -73, -145, -57, 77, 156, 74, -53, -196, -129, 38, 128, 138, 3, -158, -163, -79, 68, 127, 124, 2, -117, -145, -71, 50, 102, 124, 45, -77, -114, -92, 10, 103, 168, 96, -42, -136, -183, -68, 95, 181, 125, -57, -174, -185, -38, 161, 214, 140, -63, -204, -193, -58, 81, 178, 113, -60, -149, -145, -56, 103, 147, 110, -26, -112, -133, -56, 44, 118, 105, 17, -18, -105, -73, 0, 53, 82, 62, 2, -60, -123, -90, -14, 128, 138, 49]
3340D9j19q8K3J41J42K7j25j45j17P6J42J45J2j13r7j02L0J19N8K2mn0p6p6L8
3365h8J16Q4M8q2j60r8K0J80J64O9j69k21j06J08K01J71n8j79j57p0J30J90J03
3388A96o2j70j18K0P5J28P3o0j04r3OL9J38M7m9o1j07PL3J17N8k4j19p2k7J04
3414b5J14O0n9j28j11K8J16J12L6p7j30p8O1J38Q2Kj10j34q5O8J54J20nj38j79
3439a68l8R8K28Q4o2j85j73K5J63J71M1j05j70p1L5J35J09J1j09o2l6J9K7N9Q1
3464A07l0m6q6n6oJ15J22L3j11j66p3P7J93J01j0j88j68K5J38J62K2j09j73lP7
3489e3J53L5j07j04l1R8R7nr8r2L9P4J17j2j23p4RL2J10K5p1p8mK9M3JOn6P2o
3519B6j7r0k8O7J04O8n9j39j16L9J69J78j9j76j99rJ25K26P7r2k07j35O0J62J56
$$ y = [49, -70, -158, -135, 6, 148, 175, 50, -95, -212, -136, 6, 151, 163, 50, -47, -149, -119, 0, 58, 80, 76, 26, -50, -126, -88, 28, 112, 160, 78, -82, -180, -160, 20, 184, 253, 84, -137, -243, -135, 66, 237, 179, 0, -157, -227, -97, 93, 196, 134, -36, -154, -134, -59, 69, 142, 82, -22, -115, -109, -70, 68, 115, 66, 5, -102, -95, -62, 55, 113, 89, -30, -102, -129, -25, 89, 149, 90, -38, -149, -121, -5, 107, 143, 66, -64, -142, -81, 57, 139, 141, 31, -103, -188, -120, 34, 154, 149, 11, -168, -206, -108, 120, 204, 142, -43, -216, -191, -28, 143, 184, 79, -91, -162, -127, 8, 117, 128, 19, -43, -79, -60, -33, 26, 107, 77, 31, -55, -111, -117, -2, 120, 153, 42, -124, -197, -120, 73, 174, 164, -24, -192, -167, -29, 133, 155, 46, -127, -130, -53, 100, 135, 28, -76, -107, -9, 88, 83, -15, -107, -68, 6, 123, 111, -12, -86, -77, -45, 65, 90, 19, -59, -63, -34, 9, 10, 16, -40, 32, 26, 9, -81, -109, -42, 62, 130, 71, -68, -184, -145, 24, 202, 183, 7, -192, -201, -76, 150, 227, 135, -72, -207, -147, 15, 171]
3544A71j6j02j34o4N2R3P1J1m0o6o5j1O5O6P4l3n9j07k5K1J32Q9Lr3j41n3O2J53
3572E4R1k5j26j02pR6O7N8n5j11k5J7P0L2L9j2p3j8qL0J6K3J6p1J9k0nK8j8M8
3602B8Ll5l2L8KJ3k1nOQj9J9J9nl5JJ5Jk6J9j0QOK2j7KJ8m7J3K2j9J3jNo%orj5
3641b7K3OKJ7l2Jl2M1Oopk0Kj2M7K0j6lNo2K6PK7N2ol3n4Kj1N6P0jq0n8m0O5O3
3678C8L5j5r2n6l6J26O0%k5q6m0K8O0P2k4jp3J7n3M5M7K0n%o1l4nM7Q6J5m9p3
3710c2q3L7J07Q8J3j24q8l8J17P0M2o4j06k0L6N1O4k5m4m2kL8M1Kl9k4mM7mk9
3740a5OQK9Ol2j9j4L5K8j7lk1n8N0M0OKl7k7J3R0j2n4m2k3M0O1k5on5rjN9L8L
3775D4p5k0K7J9N0j2j1m9j7K9J0L4l3lJ0m1K0j5L3J6J0j8k7l7K3L3J2oLm0MJ1
$$ y = [171, 155, 53, -81, -145, -93, 0, 71, 82, 42, -24, -89, -100, -35, 31, 105, 72, 13, -94, -119, -98, 34, 123, 126, 33, -108, -161, -99, 54, 145, 120, -6, -108, -115, -19, 48, 106, 51, -60, -85, -68, 2, 34, 73, 61, -12, -30, -38, -8, 8, 31, 47, -24, -5, -25, -30, -2, -20, 28, 31, -4, -36, 2, 4, 17, -4, -9, -3, 5, -14, 5, 24, 19, -16, -15, 0, 1, -25, -6, -16, -8, -2, 20, 3, 5, 23, -24, -11, 11, -8, 5, 4, 9, 3, 3, -3, -12, -27, -4, 2, 4, 21, -11, -10, -42, -1, 5, -1, -8, -28, -26, -38, 9, 29, 13, 10, 15, -47, -21, -14, 13, 65, 59, 26, -28, -26, -37, 19, 89, 88, 8, -50, -90, -25, 38, 73, 58, -34, -90, -126, 0, 60, 60, 35, -51, -91, -63, -3, 69, 45, 44, -29, -12, -65, -20, 27, 47, 42, 42, -19, -53, -58, -11, 75, 90, 41, -32, -115, -78, 29, 117, 130, 6, -82, -120, -3, 67, 109, 45, -61, -81, -45, 6, 70, 45, 1, -41, -43, -5, 36, 38, -1, -25, -29, 18, 14, -15, -9, -1, 28, 34, 2, -17, -31, 4, 32, 15, 12, -9, -67, -17, 23, 29, 31, -6, -33, -20, 70, 58, 4, -38, -61, -21, 40, 15, 9, -46, -55, -56, 3, 41, 44, -31, -51, -24, -5, 45, 33, 22, -27, -44, -15, -5, 29, -4, -7, 3, -38, -18, -33, 0, 16, 26, 8, -19, -56, -33, 0, 12, 6, 9, -31, -27, -16]
3807a6J6K8kl5j1l1O3j1N2m5k3j4k6N7JJ0mk5nj2N4mm%k3l3K7L8kk1%k0J1K2K
3842A4K0j4k6J3j8j2L8j6J3j1m8J8J5J4J3jk0m5J6L3J9J3j7l5rpN5J6j6j1l7m
3874c7L0K3J4nk3j5l4N5K7j8j2j8j9J4OJ8O6m5k1k4j9K1K0J6J1l8J4j1oJ6M4k1
3906B9j5l4Mj7K1K8qlj8j1K5j0K6Rlm6J6rJ0MK7j8J3j6j0NKJ5L1n4k2J3k2M2J
3941EK0pm5%mJ6M1mjk2j7J2j6P9m4J2k6k4OK7J9J1j8Kk6j3K7Kj0Qk9JJ0NJ4K4
3977C5j9m6J7k1L2KQOk3k4j2K4M3ok0k8J4oK5L1j3k7m6N3j0L3k1o%j1L3j2oJ3
4011A2j5J4j6J2K5l0K2l2%%jL2l0Mj6K%M1k2mRoMk5M0J7k7j6J2Nj1J9Ok9K7p5
4047e2K9L1ONoj1k0lJ8M5kn4j9nM4%J9j3m9KK1K8L7m0k7o5P6k4P2j1o1j2KK6N1
$$ y = [-16, 0, 28, 26, -9, -20, -51, 12, 1, 53, 8, -15, -29, -55, 2, 3, 13, 9, -16, -21, -33, 21, 17, 13, 13, -10, -43, -16, 22, 20, -1, -1, -21, -10, 12, 14, 34, 20, -6, 7, -11, -23, 15, -1, 12, 1, -47, -29, -14, 0, 13, 12, -8, -53, -37, -4, 15, 28, 11, -24, -33, -40, 15, 31, 15, 4, -33, -37, -7, 16, 30, 25, 2, -13, -47, 8, 35, 17, 5, -13, -32, -18, -12, 6, 72, 27, 6, -18, -37, -16, 4, 20, 31, -7, 7, -4, -10, 6, 50, 29, 14, -20, -16, -33, -12, 16, 8, 5, -13, -24, 1, -9, 17, 26, 23, -23, -7, -16, -6, -2, 25, 7, 20, 4, -6, -1, 1, 16, 47, -7, -29, -16, -38, 4, 5, 25, 18, -27, -27, -31, -15, 26, 22, 21, -1, -18, -6, -22, 57, 13, 25, -1, -25, -19, 8, 27, 38, 20, 22, -4, -17, 10, 12, 2, 10, -19, -18, -8, -3, 11, 35, 16, -30, -13, -34, -2, 0, 8, 14, -9, -33, -45, -21, 22, 16, -4, -32, -18, -24, 1, 32, 19, -8, -54, -1, -11, 22, 1, -5, -5, -16, 17, 5, -1, 12, -3, 11, -5, 7, 32, 2, 24, -8, -8, -8, -9, 23, -7, -3, -19, -17, -17, 24, 2, -2, 7, 1, 5, -20, 20, 37, 10, -6, 6, 11, 0, 19, 25, -4, 23, -52, -23, 8, 14, 19, 13, 2, -18, -21, -3, 42, 40, -14, -33, -38, 6, 6, 25, 12, -37, -35, -14, 14, 51, 11, -16, -81, -5, -29, 43, 32, -29, -41, -39, -13, 38]
4082C8j7j4k1j8MM1j1POJ1m3l9L6J2M1K5k8o3rl6P9M8L7n2p2o8M2Q0Q6k3r8n7
4114g6qL9Q4N0l5p5n9J0N3O4K0k6k3o8%J5L3N0L8n5n3l9j5O4P5L0j6j05p6K4Q5
4145EJ01j6n7r2j9L6Q4N0m0o5n3K0J8M9pJ5qk1k7MK9LK8j7J7n7JK1oK7L7k7m2
4178il4J3N2J6ql4k5OK0j6J9nJlK4rl5pJ6LJ4j8K9n3K3J1KL8nj9m2RL2M3j7m1
4214ik2L0kj4M4pqk5J0%NK3k7k5Nj0M3k9QJoRj0OJ6mqopLL2On3L1k5QOL4j1Jn3
4255d0K8j2L2K0L1l4m4l3M4J4QK1j9l4qk6N8L2qJ8p8J9m4L1N4MKo0k4rM6L6K9
4288E4j1p7l1J4O2L3j8ll0k5L7MKj5K1qj2j0L2j6k3M4K9m0j6m2J7K6O3k5j3p9
4320e6pP4L7Lm1nj1Jj1Nj8JL4L6j9j2n4k3N1Q1L0p8p3n3M6J22O9m7j11q5J7J19
$$ y = [38, 21, 7, -14, -32, -28, 13, 2, 9, 15, 26, -17, -56, -20, -8, 33, 58, 30, -33, -42, -78, 1, 49, 86, 34, -38, -106, -64, 16, 102, 79, -19, -76, -84, -45, 39, 89, 54, -21, -80, -70, -17, 47, 67, 41, 18, -50, -50, -35, -2, 48, 86, 31, -22, -61, -76, -12, 63, 93, 77, -28, -104, -80, 5, 106, 90, 33, -59, -78, -42, 42, 92, 52, -13, -66, -46, -28, 21, 14, 29, 21, 0, -27, -23, 6, 9, 37, 20, 37, -20, -19, 2, -4, 23, 60, 33, -9, -43, -30, 22, 38, 30, -4, -29, -23, -3, -19, 0, -5, -4, -7, 17, 8, -27, -34, -18, -15, -1, -19, 10, -43, -20, -9, -7, 31, 26, 7, -35, -26, 6, 49, 32, -9, -31, -1, -3, -17, 27, 20, 12, -13, -3, -3, 2, 25, -2, -27, -22, -32, 11, -18, -10, -9, -15, -6, -16, -10, 6, 2, -6, -12, -19, -16, 16, 22, -31, 0, -25, -17, -11, 23, 12, 13, -40, -12, -24, 8, 28, 59, 25, -19, -52, -8, 6, 14, 35, 16, -18, -26, -52, 6, 38, 30, 48, -30, -11, -55, -24, 30, 34, 36, -24, -48, -57, -11, 25, 54, 43, -34, -65, -51, 11, 44, 26, 23, -7, -32, 5, 9, 11, -4, 17, 9, -3, -13, 19, 3, -20, 24, 53, 13, -3, -45, -28, -2, 61, 36, 23, -56, -63, 11, 48, 51, 10, 5, -6, -5, -16, -11, -29, -28, 6, 42, 23, 11, -43, -66, -15, 66, 96, 18, -55, -108, -62, 60, 129, 82, -29, -114, -97, 22]
4352B2N1Qo3o9j5J6M2O8j7jo2ok1kN8N4k2Lo6m9oP9Q7J7n9j09m2J4J42P4j1j13
4384Bj09J0P4R4K9k5j15m2J8N2N9K3l3q3j0M8nM9K1n1j0l0oJ8N1J1j3l7j9k4L9
4415a4L9M5m0m2n9K1M9M2K2o6j8j3k6Q9M2rq5m5j6O3R0j4k3m3k9j5P1L8J4o1j5
4446hn6RN4L5J0m5l8j9J4N4K6%n2Jk8K7NL4j0J1m0J9L%rK2J2k5k4m2M8L0J7lk1
4481A1o9J4M0J2L1j6m8kj0M4K9k2m0nL1L2kl0m4L9N6j1K1o7o0L9J7M5K2o1n5O
4513e3K2M0M5j7j2m0m2K2K5N1j0m3J3n2L1k1M9K7Qn8k8l6K4N2K7J4l2o4l5P5K9
4544A1M7Qm3o6j6K0N8M5j5n5k2l3K8M9K9j3rm3l9K6N3J8Jm2k3j9J4J7NJ9Rj4j9
4577a4j2NK3J9pJ4m5l1J8KN5J0%l7m3PJ6N8J6m6j0K6n9K8nL4j3J9k6j9pjN0Qr
$$ y = [22, 73, 81, 18, -51, -66, -50, -8, 60, 43, 42, -20, -26, -47, -49, 9, 63, 41, 44, -22, -71, -77, 2, 89, 106, 47, -62, -104, -90, 52, 126, 115, 2, -107, -97, -23, 71, 100, 75, -40, -82, -64, -12, 47, 70, 37, -46, -56, -8, -13, 36, 57, 6, -4, -34, -40, -22, 29, 40, 27, -10, -29, -53, -14, 25, 70, 30, -12, -71, -50, -1, 41, 63, -3, -21, -34, -60, 29, 71, 62, -23, -68, -84, -21, 69, 55, 32, -11, -40, -55, 16, 54, 68, 7, -8, -64, -55, -1, 34, 44, -1, -39, -58, -44, 10, 36, 36, -16, -15, -43, -16, -11, 23, 13, 24, -16, 3, 6, 6, -3, 19, 31, 6, -18, -60, -12, 18, 35, 32, 11, -58, -44, -4, 8, 39, 23, -25, -27, -37, 7, 36, 14, -26, -31, 0, 32, 30, 0, -44, -5, 51, 40, 61, -6, -66, -27, -10, 35, 57, -4, -59, -53, -31, 9, 54, 37, 25, -15, -57, -35, -10, 41, 31, -12, 1, -51, -20, -41, 8, 35, 43, -15, -43, -79, -55, -3, 24, 38, 6, -58, -93, -18, 11, 58, 66, 23, -43, -59, -39, 19, 64, 49, -6, -28, -61, -33, 16, 45, 32, 23, -20, -59, -33, 20, 38, 39, -3, -26, -45, -31, -14, -9, 10, 19, 5, -14, -26, -21, 2, 21, 14, 28, -17, -48, -30, -28, 27, 37, 37, 0, -43, -36, -20, 38, 54, 8, -2, 24, -35, -7, -12, 22, 9, 28, 2, -17, -24, -25, 25, 33, 24]
4612B4l3j7k7JO3M4Lo8o1K1O0K3J5m4k4l2K2M0M5j7rn0l7M7L1K1j5k2k5j8jN6
4644A6L0nl5n5K6K7J5nK5n5m3K7L1L0k%n6j6LJL3L7pm4n0oK7N8P0Kj09n5JO1R4
4679G1L6m3j20p2M6J09Q9j2j03j06J8P0P5O5p5q9o0K6O3M6%jl0l1J2j9KN5L9%
4709F1m9r2qL1J22L1k9p9j11QJ14R9J5q4j13m2Q7J01Nm5p5k2K7O7M7n9j7%lL7
4739B4Rm6j1J1O9j9k7n2lK4O4J8m3k4n2L0N4L8o1k4pK4J6J2j7o4M4L6N1j0m7q5
4771f8NO4Q3l5n8o0J0L8O1L9m9n1l8J3Q2j6L6k3r8K1K7J7L0l1OJk6j8QL7L7k1
4803B3j9k2l5J2L9O7jk7p8j0K5N6kMm6k4jmQ3J3k2n0%k2J6M8J8l5k8mj3L2MJ3
4837A0kj1j0J8LkJ9m3kJ1MJ4Pjj8JJkJ2KJ0k7j0NJ7K9nnk9l1M1pJ1lJj5j2J8k0
$$ y = [24, -9, -26, -53, -52, 11, 55, 58, -10, -71, -50, 10, 33, 48, 4, -20, -52, -30, 10, 55, 38, 29, -21, -58, -11, 20, 41, 26, 4, -21, -39, -40, 16, 46, 41, 6, -49, -23, 4, 19, 14, 39, -16, -59, -32, -1, 29, 27, 27, -29, -45, -42, -41, -8, 29, 22, -22, -72, -78, -51, 7, 77, 79, -30, -85, -84, -23, 71, 107, 64, -56, -128, -82, 27, 116, 104, 1, -105, -87, -17, 58, 123, 48, -41, -101, -75, -12, 34, 34, 33, 3, -28, -16, -35, -33, 22, 61, 61, 12, -80, -88, -57, 65, 96, 67, -12, -123, -115, -1, 98, 113, 29, -84, -126, -39, 62, 67, 22, -53, -75, -48, 19, 66, 7, -10, -10, -13, 24, 33, -13, -24, -13, 56, 37, 10, -42, -45, -21, 43, 61, 18, -6, -58, -28, 26, 64, 3, -21, -28, -4, 12, 24, 7, -57, -13, 23, 74, 64, 17, -68, -63, 1, 84, 49, -9, -69, -59, -21, 40, 79, 30, -21, -59, -46, 36, 20, 56, 33, -65, -44, -17, 0, 30, -1, 5, 6, -20, -38, -30, 7, 44, 23, 4, -18, -53, -41, -2, 65, 64, 37, -41, -51, -26, 30, 28, 32, -14, -38, -39, -43, 40, 53, 31, -19, -19, -41, -25, 23, 41, 6, -22, -26, -39, -7, -3, 10, 8, -3, -13, 5, 8, 6, 25, -18, -20, -9, -5, 9, 16, 15, -3, -2, -1, -3, 9, 11, 21, -6, -16, -11, 6, 35, 30, 25, -4, -35, 6, -1, 10, 7, 8, -7, -19, -1, -21]
4876b1J8K1nln5nL0J8Nj5J2l9J6qP0k1Pj4n4K6OJ6j3j7M4k5oOOj2L5oj5k1l8J9
4912c8L9K7K9m0m8m0j3O0N0M2n2o5o3N2P5M8k0m9o1J7K6M2M2m4nk4%j1lK7L1J7
4944D8l0l2n1%Q2M3L9p9r0k3M2J11M6m7j02p0J9R1P4J3p8o8k2N8P3j0k3l5j9K
4974c8L1J0J6k2KK9oo0pM1j1O8l5n9k5K9M4M1j1n2Rl9M3N4j2m6m0j4N7L8Mm7l8
5007d6j4M1M1K6m9n1ML2M9nl2Jpj1K9J1k0j6mj5RJ1L5k5J9l1KPk0JL5K9m2j1m2
5042e9L4K5J2J2n0rJ0J3K8K2ml5k8j3K0L8j4K4m1k6J3K3L6Kl1k7j6MO0nj1k2l0
5075d5K9M5L4j7o5l2K9M0j5J4%m3KmL3oK1l3%qK6k4JJ5L1Mm8k0oM4M2K4n1l7n2
5110g2K7N9O6j4o9m3k8P0L6M9m0o3k3ML4L9Kl0k0j7qL2lL3Kj4pk1m6N6jM6pm0
$$ y = [-21, -3, 18, 13, 10, -45, -50, -20, -2, 3, -12, 0, -39, -23, -31, 39, 18, 25, 11, -43, -17, -11, 5, -8, -25, 19, -6, -12, -6, 0, -12, 23, 17, 2, -19, -57, -38, 1, 28, 57, 17, -31, -71, -84, -24, 26, 68, 16, -49, -112, -60, 15, 63, 43, -6, -67, -50, -24, 18, 60, 16, 11, -13, -13, -24, -27, 0, 31, 48, 18, -14, -65, -65, 17, 60, 99, 20, -70, -93, -51, 60, 106, 59, -43, -113, -94, -3, 71, 84, 6, -62, -84, -26, 47, 37, 14, -21, -40, -38, -7, 3, 19, -3, -1, 28, 22, -38, -45, -4, -15, 53, 18, -41, -66, -37, 7, 48, 37, -15, -6, -45, -2, 52, 40, -6, -46, -60, -3, 35, 39, -8, -46, -60, -19, 22, 48, -1, -52, -48, -16, 33, 28, -4, -3, -10, -21, 8, 19, -1, -17, -21, -36, -27, -16, 19, -6, 13, -18, -16, -9, -29, -28, 7, 36, -6, -17, -59, -25, 0, 12, 24, -26, -35, -25, -12, 16, 38, 34, -1, -29, -42, -22, 16, 2, 26, -15, -41, -28, -5, 31, 33, 2, -25, -41, -37, 23, 18, 7, -15, -45, -16, 29, 63, 46, -19, -51, -22, 18, 3, 17, 17, -26, -24, -28, 5, -1, 20, -13, -13, -21, 5, -19, -18, -3, 28, 32, -16, -36, -42, 2, 44, 68, 17, -20, -72, -45, 14, 80, 66, -3, -46, -74, -4, 32, 81, 41, -22, -45, -41, -7, 32, 34, 4, -16, -33, -41, -9, -12, 21, 23, 9, 2, -19, -65, -9, -10, 36, 29, -11]
5144a1k0j4K4L7M0k6k3l0j1L4O2mo3l3J1J2RK3KLk6j5JpJ3RRJ0k5J0l2%J9QJ7
5179A3qj2l%MK1j3K4l2l5J4J2N8ok7l9j7L0K2J7Kj3k1l1L1M0l0K5j6j5j5RQJ8
5213A5l7M6m5NMj1KJ1Oj0k8L7J3J1mj1mj0qJ4J0KRk9oL1J2Kl0nk7MJ9K5J5Mo8
5250c6j8M6J8Mj2nqj2J0J9oKl7K3J8j0J0Rnpj9NJ2nk7L4kJpNkJK9L2p3j7j4M0
5288dL2Ol4n2j0J8M4L6k6n1J4ML4M6k9o3mL8K1K6l1l8k9N1L5Kl4l0k2O1M6rl2
5321A6n7LJ6M5L1l6n7nM2M4Mo9pl2P9N4n5n9j3J8P4K4k8p2n8N1N9P0k9p6n9J3
5353f9P4O3Pn2n4k5M2M3J0k4n0J0M0J6Qk5k5rP7l8k6n2K7J3O4J3r9j9j0O4L8K2
5385E4m8m4lMM8N5m3p8l0O2M7K0j7l7k6K9J1OJJ8p8L9L8k8J1l0oL7j2K3j2J5k7
$$ y = [-11, -31, -45, -21, 16, 56, 30, 7, -23, -34, 0, 62, 58, -5, -38, -27, -15, -6, 17, 19, 22, -4, -19, -18, -25, -12, -3, 6, 16, -9, 1, -31, -31, -12, -4, 13, 5, -7, -10, -10, -6, 15, 2, 26, -6, -41, -27, -15, 43, 37, 10, -29, -46, -16, 6, 23, 25, 12, -9, -40, -9, 31, 1, 26, 10, -5, -20, -11, -3, 15, -22, 24, -21, -16, -12, -23, -21, -10, -4, -14, -42, -5, 8, 19, 15, 4, 0, -10, -18, -4, 6, 8, 17, -12, -18, 13, 25, 27, -3, -8, -35, -31, -12, 13, 28, 32, -36, -54, -8, 10, 14, 2, -3, -11, -23, -13, 6, 0, 2, -35, -12, 6, -4, 6, 15, 10, 3, -16, -11, 1, -4, -31, 3, 1, 2, -5, 0, -2, -1, 28, 60, -13, -30, -44, -4, 28, 34, 0, -52, -62, -44, 0, 36, 10, -41, -27, -23, 11, 57, 28, -35, -39, -1, 20, 46, 15, -23, -52, -1, 34, 36, 2, -28, -50, 11, 57, 48, 16, -41, -38, -22, 23, 54, 18, -39, -44, -2, 42, 46, -23, -30, -62, 17, 71, 16, -43, -56, -38, 36, 60, 32, -40, -98, -47, 12, 82, 53, -23, -82, -69, 5, 68, 75, 23, -31, -56, -14, 29, 39, 15, -35, -25, 15, 31, 39, 14, -11, -20, 57, 19, -7, -59, -32, -19, 45, 58, -41, -60, -70, -6, 32, 54, 6, -38, -41, -37, 11, 66, 23, -55, -85, -23, 24, 44, 27, -10, -36, -7, 4, 10, 11, 29, -49, -10, 28, 0, 11, -19, -25, 12, 0, 23, 11, 26, -1]
5418aJ2qK4l8k5K1K3j0J7j3lj7J2J3Qj0m1M7l6K5J0%j2k1QL2k2J5Nk4k0L2qK9
5452B4mRj0m7J6K6k3lj4K5qqJmM4kj9Mj4j5PMK9m1L7mqj3L2k0pRj2J4rK3jJJ8
5491C7m9PpNK7k0k2OPJ8Nj2J0n1K0K3J6n3K7l0L8KJjj6jrL8jl2Mm8L7M8mj0Jj8
5529gj1M2J0j7m7mlN1J0qk0j2oM9Nk6l4PK9K5j9k1k8lN0K4nk9m8%O3L1nj7m7l0
5565e1L9N7km4m9PN0J7K0n6j0oK8L2qo1K1l1M7N8k0m9n6M8K7L2k6j4n2lQ9%k2
5598A2k9l7K7L0L8k6l0l6L9K9J0ko5LLP3j6jk0k4J0L6J7k6m4j3M0J0J6k6l4L7
5630Aj1O1n7kpl1K7K3QQl1k3oM5Lj8k2Rj1K5L9m8K4k1K2j8J5J8j4oj6LJ7RK0l9
5666dKoK7j%m1Qk1K9j0J2NJj6kJ0NQp1M8lN2Jm6%m1M9J3RKn2K2kN3j5m3l7K0M6
$$ y = [-1, 11, 3, 27, -11, -36, -15, 8, -2, 15, 2, -1, -18, -6, 7, 15, 5, -36, 11, -25, 0, 10, 10, -2, -23, -15, 17, -5, 10, 15, -9, -29, 3, -5, 24, 20, 29, 19, -28, -12, 14, -9, -12, -26, -1, -9, -17, -16, -20, 24, 22, 3, 7, -7, -22, -15, -11, 18, -23, 14, 10, 2, -11, 21, 1, -6, 3, -9, 5, -4, 19, 18, 19, 37, -12, -5, -12, -7, 20, 0, -22, -16, -9, 9, 14, 2, 12, -39, -19, 4, 20, -33, -6, -36, 2, 4, 5, 4, -12, -13, -22, 16, 15, -17, -13, -61, -24, 24, 20, 10, 11, -7, -18, 24, 34, 17, -30, -34, -37, 14, 24, 16, -4, -16, -22, 27, 32, 6, -28, -21, 8, 33, 14, -7, -35, -38, 12, 36, 31, 2, -46, -46, 17, 48, 43, 26, -21, -51, -12, 45, 43, -1, -50, -43, 7, 24, 44, -12, -22, -28, 0, 32, 24, -37, -16, -47, 0, 58, 38, -11, -67, -19, 8, 40, 14, 0, -52, -55, 34, 34, 12, -17, -54, -27, 3, 41, 15, -15, -51, -12, 17, 27, 25, -40, -37, -34, 39, 23, 22, 2, -22, -12, 24, 41, 15, -29, -42, -2, 8, 24, -2, -36, 1, -10, 51, -6, -8, -15, -46, -19, 4, 12, 20, -11, -34, -40, 5, 8, -10, -32, -23, -34, -9, 30, -18, 6, -15, 7, -11, 4, 22, 8, 2, -14, -11, 6, 15, 35, -4, -2, -8, 19, 18, 18, -23, -15, -36, -7, -17, -5, 0, 1, -15, -17, -7, -2, 6, -65, -17, -20, 32, 33, -13, -13, -54, -5, 8, 17, 19, -33, -11, -13, 40, 25, -18, -55, -35, 11]
5705A1K8j8m8jj2L2L5l1ml0J7J3K9l2J4n2J1M1L2l5qn8L7N0LPo5RrN5pj7l5L0
5739hj0K2J6j3Jj1mK4j4J5l8J9k2K5kJ0Jl0j4N0J5k3k6jJL1j2M6n2l4%M4JJk7
5774a9lK8j1L2nj1knm0O5j7Nl2M2k1j5k0J7j0L1j6K5k0j1k2L0J0j4lNMj3nk3P6
5809C2pk6k5jM1j5J9Jm0K7k8K6OK3m5mQKK6k2kjK1Ll0J2j8QLK4K7n1nj8L8lKj1
5847cj2j9L6Rrl%n%J0j8J3qKklL0j3K3k4J6k7kj4K3J6k0nJ8J2nj2l6L0J5Jj8k9
5885c3rK4K7kRl1k8J3M7J5On0l9J4N1MJj0l5mK5L2K1m7m7j1N2N2Jl0l8lK9ML2
5920D2n4k2M8LNj4m8lN8L0j0p0j3j7N7P2po3k6n2N5Q7K2p7n3l8N0R4K2m9o3j8
5952e2L7N8mk9l6lJ4L0Rl8l2RL7M2k2n0k6J6N8L2m6n1pJ4K0M9J2o8k3LO2J0%m4
$$ y = [11, 39, 21, -27, -28, -40, -8, 27, -4, -8, -38, -21, -8, 21, -11, 3, -49, -38, 3, 35, 0, -8, -66, -29, 21, 24, 31, -34, -25, -34, 21, 14, -3, -38, -8, -18, 4, 20, 7, 8, -3, -7, 17, 3, 18, -20, -1, -23, 2, 0, 10, 11, -19, -33, 17, 32, 9, -17, -18, -17, 14, 2, 48, -4, -38, -38, 6, 7, 8, -19, -22, 6, -5, 27, 22, 11, 9, 4, -36, 29, 12, 17, -15, 27, 6, -9, -29, -12, -22, 9, -7, 18, -2, -13, -35, -5, 5, -9, -12, -7, -3, -16, -21, -44, 32, 25, -1, -26, -27, 14, -1, 18, 19, -21, 6, -22, 4, 10, 33, -12, -16, -8, -6, 20, -2, -4, -5, 16, 19, -11, 1, -17, -9, -6, 18, 45, -6, -11, -29, 9, 6, 8, -3, -15, -34, 2, 11, 2, -1, -1, -6, -6, 4, -14, -1, -9, -7, -9, -12, 18, 5, 28, 4, 20, -7, -9, -23, 0, 16, -4, -9, 9, 21, 16, 4, -32, -2, 13, 14, -4, -33, -42, -18, 9, 7, 16, -15, -43, -30, 17, 32, 38, -12, -51, -37, 14, 18, 19, 9, -26, -30, -5, 27, 48, 1, -46, -57, -5, 47, 48, 18, -20, -23, 6, 10, 42, -12, -34, 14, 17, 22, 8, -40, -43, 15, 45, 35, -35, -48, -65, -8, 64, 57, -6, -32, -84, -29, 58, 80, 3, -50, -88, -38, 56, 78, 29, -34, -52, -15, 43, 39, 10, -26, -29, -15, 15, 24, -14, -46, -37, 0, 42, 20, -30, -56, -40, 18, 50, 4, -47, -54, -40, -20, 29, 41, -27, -50, -47, 15, 25, 25, -19]
5986a9j9J7L6Rjm8QK4J6N0m4m0l3QL9L6k5m0k9L9K8J6j5l9j7PK4J3Qk1OKj2lk0
6021c9K2LkJ7qj7l7M3PM3om5k0J4L1K6pj2k4pLK8J8j8Qk6pNj3K1j1r%mK2Pqk8
6059c0QRJ4j3K2j4k6K6J2rrl1N0lJ6m3lL4Nk7J8m1K8NM5k9j1kml4K8J6j2NK5l5
6095a0kJ8j1j1rj1J1MK1J2kLlj7k2K2L3j7K0l3k7jL6J9jqm8L9j1%mJ2l0L2QMm
6132A2j7j1j1L1L2l4l3JlN7MMn4nj4J5O5j9rm7J3kK3K4Kk0j6J7k8K7k6K1K3K2
6166D4l4j3n8K1M5M3%n0k8m3N7O0K9n1m7k6j0P2L4Jm7pn1M8J4K9jk0j9pLk9NL5
6200a%L4k0l5k3J6N2Pl5k5Pj3O0L2lq1l7jN8O0k1k1q2J0M7J3L2k1n4MLK6L8l7
6234a1l6K9lOJ9Kk5PlL4k2j6K7pLQj3m2M7K5Ml3j6K3j1K8j1j3k2%k3N0j2K8j5
$$ y = [-19, -38, -21, 15, 24, 23, -25, -17, 7, 23, 73, 29, -11, -44, -36, 3, 39, 14, -26, -55, -16, 12, 28, 13, -26, -43, -36, -12, 1, 9, -12, -6, -4, -16, -19, -39, -17, -14, -16, 1, -7, -24, -61, -18, -11, 32, 26, -19, -39, -25, 6, 32, 25, 13, -11, -18, -15, 13, 31, 13, 21, -5, -12, -7, -20, 1, -10, -19, -19, -23, -1, 6, -2, -30, -22, -13, 1, -12, 10, -4, -30, -4, 8, -1, -10, -41, 9, 6, 22, -21, -24, 10, 15, -12, 6, -35, -7, -2, 43, 14, 3, 1, -3, -37, -9, 7, -5, 0, 25, -10, -12, 6, -5, -16, -25, -36, -25, -21, 0, 12, 10, 13, 10, -7, -29, -7, 26, 9, 29, -4, -31, -32, 4, 23, 22, 14, -34, 5, -6, -6, -10, 2, -28, 4, 12, 16, 12, -5, -16, -27, 4, 36, 2, -31, -30, -33, 24, 28, 32, -22, -27, -41, -26, 39, 20, 11, -36, -23, -25, -2, 22, 24, 4, -12, 5, -23, 4, -22, -1, 22, 44, 10, -3, -61, -40, 5, 48, 48, -2, -30, -73, -16, 44, 73, 22, -25, -51, -61, 11, 45, 46, -1, -8, -59, -11, 3, 32, 31, 11, -8, -15, -12, -41, -36, -1, -1, 33, 13, -22, -45, -29, 23, 30, -5, -30, -23, -36, 24, 56, 53, -28, -65, -66, -8, 52, 31, 10, -72, -62, -15, -2, 30, 9, -45, -41, -38, -12, 26, -11, -47, -18, -21, -15, 4, 6, -19, -12, -15, 19, -3, -19, 8, 1, 4, 12, -1, -43, 4, 29, 33, 0, -16, 7, -4, 24, 13, 0, -22, -22, -45, 5, -7, 21, 6]
6269FMl9RjJ2J8Qm8MOJ6L3J2k4o0K4RJ1L3j5k1kk8K0K9Ll1j2J5mJ4Jk7jK3QJ1
6306A6l6l3PJ0L5Nk8MjL5Mkj0l8J8NM0n0k2rN1RL4k2m4l3N1RM2j4l3m5j8L3N1
6341B1Qk5k1j4L2J3Nj5J5j0o6L7%K5qRJ3l3j0j6J9L7J0Ml5m0J3M3K8k6J0l0k7
6374c4KM1L8j2m2j6j5K8K6k1Rmj7j4nL5j3OJ2Lmk9KM1nlMn3K3oj5L5J2j1j9jj7
6411c9J1K7L0l6oQl3L9RJ5k1K0m3%j6M0J8lrk4k4K4J9j7K7j2j3mqKL1Nqj0n2L0
6447b3J5J7Ql0j0ljJ3K3k4Mj9LqL6J9k2Nk9J4K6pJ6k8%j5KL9rJ1l2Qk6l1M9K0
6483A1Lk1k4j3L1JoJ5j8qRnPL5Jj9k2j9K9mK2M1l0k4j4pM4K2k3j9l1l2M4L7Qr
6519A2o3j0L3K5lL2m4j3JmK7J5ml3J6K5j1k5mK2j3L1rKj2k5M4qJ9k9j9qL4L9j7
$$ y = [6, 10, -29, -20, -21, -9, 9, 17, -31, -27, -21, -5, 28, 40, 16, -44, -20, -11, 0, 33, 18, -3, -5, -33, -13, 16, 19, -12, -24, -9, -13, 1, 2, -25, -26, -3, 5, 16, -20, -53, -46, -36, -1, 4, -24, -20, -21, 14, 18, 16, 6, -32, -14, -9, 31, -19, -41, -50, 1, 10, 44, 22, -22, -55, -4, 5, 47, 33, 0, -45, -63, -30, 21, 29, 4, -17, -31, 1, 14, 19, 4, 19, 9, -57, -20, -20, 5, -3, 6, 19, -14, -24, -40, -21, 16, 26, 30, -5, -45, -32, 11, 39, 13, 23, -7, -34, -32, 9, 47, 35, -7, -23, -38, -10, 16, -5, 4, 0, -17, -31, -36, -1, -14, -8, 4, 7, 3, -26, -24, 17, 12, 9, 13, -40, -17, -23, -38, -3, 9, -2, -21, -22, -39, -28, -1, 29, -7, -13, -5, -38, 1, 10, 25, 4, 24, -19, -19, -35, 5, 23, 20, 11, -13, -37, -13, 6, -11, 16, 4, -9, -13, -21, -19, 12, 17, 9, -1, -53, -23, -8, 9, 17, -13, -23, -26, -27, -14, 9, -15, -11, -30, -27, -35, 1, 20, -2, 3, -26, -12, 14, 7, 23, -5, -5, -20, -18, 21, 12, 23, -9, -1, -27, -58, -9, 11, 14, -7, -31, -44, -13, -12, -18, -3, -21, -29, -20, -25, -18, 17, 18, -1, -23, -42, -13, -17, 5, 46, 16, -8, -22, -29, 15, 37, 14, -5, -36, -68, -24, 13, 21, 12, -51, -61, -28, -3, -6, 26, -18, -31, -30, -34, -7, 8, 4, -29, -13, 12, 1, -24, -28, -6, -19, 12, 3, 5, -7, -32, 12, 4, 23, -6, -25, -33, 1, 40, 23]
6554B3l9j7NL6Ol6j8lpL9N4l2k5l3RK8M7k2m2j5K0j3M8kl4p%J6K1NQk4k0%NpJ3
6591a3%jL5k8j1rJ0K8K5j8l7k9j8O4M7l1j5p0KN0K7J9J2o3m0J8L8kL4j7j2j7q
6624c0PM4nLqk5K5l1JN4l7pK0n9K0K3N2l3m7j5K4K9lJ4j8j6k0J3K5j7lJ2%j5p
6659c0K2k1L7ml7J5j1L6J2Nm7NJ3Pkj9J8kj0pmJ9K7j8omLrrJ2J2k4RJrJ3Lk0J1
6698a3j1J9oJ1NLm7K9JkmJ3Lj9Rkj3J8J0%j3j9J9Kk6K9J0k6K5q%kpKk3M3k0j1
6736b1J3nKK7Nm6K6j6ok2N4Mk5l0K1NK0J7j8k8JPPJ8Pqj5NkPKj4J9l0J3lj4J4
6774iK9m4J2j1loJ5L9Mk0j9l0J5QO1l4m5P%K5kK5l1pkK2K2k3J2k1oL3poj3mJk0
6812c3K6mlJ1k7MJ1j7Qj5K6RK2m7j9J1M9k3LloLK6Mn7J9j5L1OJ0jPl3PJ4mok0
$$ y = [23, -16, -33, -28, 8, 14, -22, -40, -43, -50, -11, 43, 11, -14, -47, -38, -10, 37, 15, -27, -42, -22, -35, 13, 11, -23, -30, -30, -14, 7, 12, 20, -4, -24, -24, -19, -26, -13, -13, -14, 21, -7, -18, -27, -17, 11, 36, 18, -19, -48, -66, -2, 45, 14, -1, -71, -69, -19, 8, 27, 39, -24, -64, -46, -8, -10, 24, 7, -5, -22, -30, -23, 21, 16, 19, 11, -14, 11, -20, -19, 35, -2, -9, 11, -48, -28, -5, 47, 14, -33, -48, -24, 5, 2, 16, -2, -18, -38, -25, 0, -17, -20, -8, -8, -23, -30, -8, -29, 8, 4, -33, -18, -29, 7, 19, 24, -23, -18, -5, 2, 0, -19, -1, -3, -13, -20, -24, -5, 22, 4, -2, -6, -3, -12, -21, -9, 3, -21, -12, -11, -20, -7, -4, -24, -13, -24, -5, -11, 0, 5, 8, -39, -10, -9, -11, -15, -2, 1, -18, -9, -11, -24, -6, 4, 4, -9, -28, -9, -7, -33, -4, 6, -20, 5, -3, -3, -5, -12, -10, -33, 10, -10, -21, -8, -13, -11, 16, 21, -25, 1, -15, -21, -43, 11, 15, -10, -40, -19, -14, 6, 23, 5, -23, -22, -15, -8, 10, 17, 9, -6, -1, -3, 4, 6, -8, 11, -19, -6, -9, -23, -9, 20, -24, -12, -23, -26, -32, -17, 22, 26, 6, -13, -43, -28, -20, 41, 7, -38, -31, -31, -6, -8, 17, -14, -21, -23, -1, 21, -2, 10, -11, -17, 16, 9, 3, -10, -14, -13, -33, -7, -11, -14, -3, -30, -26, -15, -32, -24, -39, -13, -4, 18, -29, -48, -37, 12, -11, -8, -11, -17, -14, 12, 16, -41, -22, -37, -6, 0, 10, 9, 16, -17, -10, 4, 0, -6, -26]
6850b6K0k9L2rJ0J3kj2k5L4j5OOpJ6k7Nj6M3l4K1l6K4Lk0J7Pj0j6OJ3mKJ6%k4
6886a8j0J7K9%jk8KK9n2M0lj1Qm3L4k1K7Mk8QrJ2J3Nj8ok8N2kKJjj7nL5j9LJ3
6924A4j4k1%LJ5K7k4Nkl3jJ6K1mKlj6j7LL9j1lk5jLK0L1j2j6qqJ2RlJ5j9J6j8
6962hRk7K9oJ7jj1j1k2M2jOJ2m9j3LK1J5k5K7m3NJ1L4Mj7mj8QJpQKk2NnJ3pJ1
7001a4oJ5j1K4k2J8Mk4M1l4J3m9L6kRK9ol9L0k6j1QQPkl8J6J8K1mk3mJ2m9M2J5
7037Bk6Qjj0pK5J3%k6J5J4k8J8lnoJ7k5K5k9M1j8J3qkj4qL6k6k3NL5roJ6k1L0
7074A2j8JnPj8rJ5K0j4jJ0qj2mrL4rJ7Ll4K0k1ML2Ok8NPj0J6lj1Qoj7Olkj1jM3
7115A2k8%j8ML0PKll3K2k6K4J3j3lj1J6J1j2j6k2N8lj5Rk9j5K8K9j9qlk6NM2k
$$ y = [-26, -6, -35, -3, -12, -2, 11, 9, -3, -28, 6, -9, -3, 3, -4, 12, -15, -10, -26, 17, -17, 4, -32, -8, -5, -25, -8, -1, -11, -27, -21, -8, -12, -10, 6, 6, -18, -28, -11, 18, 18, 17, -11, -9, 20, -32, 8, 5, -6, 2, -41, -7, -28, -1, 3, -25, -17, -26, -14, -1, 4, -14, -20, -48, 4, 2, 4, 5, 4, -13, -18, 17, -2, 1, 14, 0, -21, -21, -18, -3, 24, 0, 5, 3, -30, -31, -15, 6, 2, 4, 1, -15, -32, -29, 10, -1, -4, -29, -30, -27, -7, 24, 12, -4, -12, -20, -8, 1, -2, 13, -6, 10, -8, 1, -26, 3, -3, 14, 13, 2, -9, -31, 11, 10, 16, 28, -21, -34, -31, -10, 5, -20, 7, -36, -31, -20, 14, 18, 1, -3, -21, -13, -12, -19, -11, -9, -31, -26, -31, -18, -25, -14, -20, -5, -16, 8, -14, 4, 8, -16, 25, -9, 4, -45, -9, -11, -2, 27, 21, -18, 12, -14, -25, -17, -9, -2, -4, -42, -26, -8, 13, 9, -14, -18, -6, -55, -13, 2, -24, -16, -17, -27, -34, -9, 4, 4, -22, -7, 7, -21, -3, -6, -11, -17, 0, -25, 0, -29, 12, -6, 7, -1, -3, -17, -25, 11, -15, -38, -33, 2, -7, -13, 3, -18, 12, -6, -5, -10, -3, -21, -30, -15, 5, -9, -10, 0, -8, -20, -24, -33, 1, -8, 9, 12, -22, -2, -23, -19, 13, 19, -9, -4, 3, -7, 9, 6, -5, 3, -3, -20, -14, -17, -19, -30, -31, 12, -16, -16, -34, -30, 0, 7, 9, 6, -27, -5, -31, -7, 6, -7, -10, -21, -5, 6, -6, -22, -44, 14, 11, -4, 5, -24, -39, -11, 18, -1, -9, -12, -38, -33, 9, 7]
7151GJ8k3k8pnJ8M7j7j2m1L4l1J5K7j4K2j7mNj1J3RJ3On4j9K2L7LK5n3k7kM5L3
7186C4oj2l4k1oM7J7MLm4k8J7M3k7K3ppj2m0K7L2LJ1j6l4kqN6J4j3j4l8J2lN8
7221B9jMl0k9j2J6L8k2j4nJ3k2O2k3qj4JOj9%NK2mj2M6k3nj8MM3m1j0M8l0J7n
7257Gl2L4l0J9qpK7k4K7oPjJ2j8rqmLj1J8J8k1JQlj0%Mj5%J9J0Jj7Ql6K0L2l1
7296a6K0l0PjN2l6Romj4L4mnj1KqJ2PpKomjOK7k0ql5KJ1RK2kj4k6jJ2K2J9Nj0
7337A1l6j9L3J6J0Jl0Lp%J4M2j2k9j4Kqj0M3J9j4j1k9KJ7L5k3Nl0RNqK9l8L8k1
7373ej5LLjOK1k9Pk4K7j4J7J3%l0J0j3QK4N0j5o1J9k7J1RkM7l3j4mK0j2j6K1L0
7409C1l6k6k0LN0%K4k1l2l1jO0M5k9k3n5J3%K5O4j5k0l3oJ4K2J3Lj1ln3L1mO3
$$ y = [7, 25, 2, -26, -33, -38, -20, 27, 10, -2, -43, -9, -40, -25, 2, -12, 10, -7, -11, -6, -17, -4, 5, 18, 24, -30, -49, -27, 10, 13, 38, -15, -42, -44, 1, 34, 28, 16, -18, -39, -45, 2, 19, 23, 26, -18, -46, -29, 14, -13, 10, 3, -4, -16, -56, -29, 3, 6, 17, 1, -33, -35, -43, 13, 27, 14, 0, -38, -26, -29, 29, 28, 32, 2, -27, -39, -23, 15, -7, -21, -26, -13, -35, 27, 4, -4, -18, -17, -11, -30, -30, -25, -3, -7, -19, 27, 4, -1, -19, -15, 28, -13, -23, 25, -5, 12, 7, -25, 9, -21, -2, -10, -17, 10, -14, 13, 7, 14, 13, 25, 7, -2, -10, -14, -11, -22, -4, 14, -7, -6, 2, -1, -11, -11, -7, -22, -22, -3, 7, 8, -9, -1, -37, -17, 15, -16, 4, -26, -19, -20, 32, -4, 5, -1, -5, -19, 15, 11, 6, -5, -3, -11, 1, 8, 1, 3, -3, -7, -8, -2, 25, 5, -3, -38, -36, -25, -16, 6, 4, -10, -36, -37, -25, -3, 16, 21, 11, -25, -44, -11, 5, 15, 16, -14, -11, -18, -18, -4, 38, 26, -3, -17, -15, -23, -33, 10, 29, 15, 4, -25, -23, -6, 29, 6, 11, -19, -10, -5, -13, 16, -22, 16, -5, -20, -17, -14, -15, -9, 12, -17, -10, -34, -7, -21, -4, 9, 9, -21, -11, -24, -16, 8, 58, 43, -18, 1, -26, -15, -6, -8, 39, 6, -8, -12, 8, -4, -20, 1, 31, -5, -31, -51, -48, 2, 2, 26, 5, -27, -58, -59, 1, 46, 17, -6, -61, -48, -48, -23, 41, 26, 6, -27, -33, -19, 3, 16, 19, 8, 5, -48, -17, -21, 42]
7443D2l2J7k3l5nK0L5J4k4n2JJ3rO6kl4k4j7M3MM3j7m1Jj9M0qK1Jl1k5J1K4K1
7477A9oj3j8rj2M2K2m6j1M3n1J6M3noj6k0pkM5L8m4Kk7k2K2J4L0J4l3k7j4j2L9
7511a2N4j7l2m0j0K8L2M9J5r6pkM2K9K2n2j3l4K9J5J7J1j7l7K4j1MJ0J0k9K1j5
7543a2jrj3J2K6Mk1l6PM6J7mrl3MKqL3j2j2L0j1Nj6Jk6L1mK1Kl1n2K8M7K4rk9
7580hk5k6K9L3Q%l2j5nK1L4j0KK0l4k0J4nL4K3l7Nl0k0M2L3Jk3Lm5%J9L2J9j0
7615B7l1l9NQM4onk1l2LK8PJ6K0o4KLK6K4mj1rk5NJ1L3j5K3k7K3m9KM1k9N3m7
7651a0Nj0Kj4L3Nj7J1j4k0LK5KQk4nj8M1kj1K8j5k0J5k9K0J8j8OJk0pM0j5K4k9
7687a1pj6J3qK4Rnjoj0K8Qk4K7l0J7m3K1NRKk6J5j5K9J5k5Ml4MK7K3K1l3j4l3
$$ y = [42, 10, 27, 4, -31, -36, -16, 19, 33, 9, -43, -42, -29, -38, 28, 26, -8, -32, -49, -6, -2, 41, 24, -17, -16, -35, 5, -3, 18, 19, -12, -37, -26, -2, 19, 13, 0, -18, -27, -39, 3, 25, -21, -32, 11, -40, -24, 19, 14, 8, -8, -28, -35, -37, 8, 46, 2, 4, -23, -45, -23, -9, 21, 35, 2, -25, -39, -51, -12, 42, 25, -7, -47, -57, -29, 3, 52, 67, -29, -36, -38, 4, 33, 55, 3, -10, -44, -15, 0, 17, 28, 11, -26, -2, -13, -9, 1, 11, -18, 3, -12, -13, -22, -35, -23, 3, 7, -14, -50, -43, 3, 20, 16, 7, -26, -22, -20, -28, 5, -7, -19, 11, 0, 5, -11, -10, -36, -5, -9, 12, 14, -17, -69, -41, 6, 30, 21, -8, -33, -59, -30, 3, 11, 11, -21, -36, -41, -20, 14, 4, 6, 26, -8, -28, -14, -19, 15, 38, 1, 6, -24, -44, -2, 31, 32, 9, 12, -33, -33, -14, 18, 37, 27, -4, -43, -38, -30, 14, 8, 3, -18, -50, -47, -19, -12, 4, 24, -40, -38, -35, -9, 15, 11, 0, -9, -34, -29, -18, 15, 0, 23, -4, 19, -30, -28, 13, -16, 37, -10, -5, -15, -13, -27, 6, 11, -6, 5, -9, -29, -26, -1, 1, 9, -15, -20, -38, 3, 1, -10, 18, 3, -17, -2, -31, -11, 7, -11, -5, -4, -24, -31, 9, -6, 18, -11, -18, -34, -21, -29, -5, 4, -1, -2, -8, -18, 10, 18, -6, 21, -9, 8, -35, -14, -9, 0, 2, -24, -9, -24, 5, 20, -5, -1, -35, -31, -4, 19, 40, 7, -7, -40]
7723d0OM7L6k2k9j6rK3K2J2Mk0pk9Pk3O5pLj2k4l0JM0N9j7k3n6k9K8N9M6l3o9
7757c7l9L2L4M9J8p8j7j0pM4K9Mk7k8J0JK3MQj0qk2k7L0K1K4Kj3m3j7L2jO2J4
7791E7n2m8k4M9O2j9j5l9MQJ1Ooj8j6K0M1k0rl2K0L7qrj8rPM4k1L0j6k7j2oJ2
7826a6K7k0JK1m2K0pl6L2K2J0l2j8rLL7N0l0k7l7kK6N1Mj3l5Lj5J2O2m0On7J7
7860c2%K8OK4m0j0orM5k5J5Lnl3%J7K3J0kk7JjJ7L1m5L6l5j4OL1kJ4o3oJ6J9L6
7897B3l3Moj8MJ0K9Lql0j1K8j1J6K7k4k2jJ0kK2k0J5l4Oj0L7J7k3rj9j4K6J7n
7932fL6m3j3Kj1J6J2K8pl7KmK5OJ1j1j1ok0N0k0oL2Ln6J9n%L0k1lk2NmJ6K9j0
7969Fj2rJ0roK6%kk1j3Qj8M2K7mkm2l3RL5K9Oom4k4K6K0M2J4n7k9j7K1M1k2K5
$$ y = [-40, -34, 13, 49, 27, -2, -18, -27, -4, 18, 30, 34, 14, 7, -22, -15, -38, 27, 20, 23, 11, -13, -43, -42, -2, 57, 40, 17, -39, -68, -40, 19, 65, 32, -37, -76, -44, -10, 39, 57, -21, -38, -48, -55, -11, 18, 22, -5, -33, -23, -22, 1, 5, 13, 3, -5, -27, -54, -24, -3, 21, 23, 10, -33, -50, -18, -19, 43, 57, 5, -43, -67, -18, 44, 25, 10, -29, -25, -17, -6, 0, -6, -24, -40, -20, 21, 1, -8, -40, -20, 17, 9, 0, -18, -27, -20, 24, 3, 33, 17, -10, -22, -28, -16, 11, -9, -8, 13, -29, -9, -16, -52, -20, 2, 12, -20, -38, -47, -44, -7, 43, 13, -14, -51, -53, -27, 24, 28, 15, -20, -17, -32, -20, 42, 2, 8, -49, -32, -32, -4, 2, 26, -14, -24, -30, -39, 6, -19, -4, -1, -6, -39, -39, -22, 1, 11, 9, -18, -17, -18, -1, 30, -15, 21, -14, -28, -22, 9, 7, 21, -42, -48, -32, -13, 23, -10, -6, -12, -30, -26, -16, 13, 16, 8, -22, -33, -5, -16, 0, 27, 3, -19, -20, -10, -12, 10, -10, 5, -29, -23, -33, 4, 21, -2, -11, -30, -44, -18, -1, -6, 30, -13, -26, -24, -35, -19, -7, 21, 14, -23, -21, -25, 0, 6, 17, 6, -5, -11, -31, 19, -1, -7, 25, 28, -28, -9, -14, -14, 16, -5, -8, -30, -25, -29, -13, 16, 6, -6, -15, -5, -14, -20, 6, 6, 4, -17, -30, -22, -40, 2, 29, 25, 23, -19, -52, -43, -8, 21, 27, 21, -23, -47, -21, -1, 41, 55, -2, -31, -48, -27, 14, -8, 17]
8005A7qk7j1j4RL7qj7Oj4j7J4M0NJ6m9k2oJ5M7J8j9qn6OL0M2%l4j6j5J2N1qpl9
8041c0j1L8Njj4jj7K4j8L8k6mj3LL8m3kK5qK3rk1K0nJ3J9k8j7k5L7K9l3K2k8q
8076b8%L3QRk4k5j2M8k0K1kj5l9mK8J2PKj2l2%L5J9Oql9kK4JL9kl6j5Lj0M2lk5
8114a6j5%L3J0KqKpj0k3J6J8%J6mk9pNJ9K4k3l4J4lKL2J3k8k6jKN3lk0k4m2L6
8151b6L2L2j1nn3j7L8K2K7nl8jj9J9OJ6Nrj7j1m0MN7L1k1k0l6k7K4N3L3J7o3n2
8185e5OL7M3%Qn4
$$ y = [17, 9, -18, -29, -43, -34, 3, -5, -22, -16, -30, -47, -33, 7, 12, 28, -21, -43, -49, -34, 13, 31, 12, 4, -52, -46, -16, 26, 26, -8, -24, -39, -27, 24, 16, 9, -30, -41, -3, 2, 1, -13, -14, -31, -7, -25, 13, -13, -17, -30, -27, 11, -32, -34, -9, -17, 6, -3, -24, -4, -9, 4, 23, -5, -22, -47, -10, 19, -14, 8, -20, -28, -28, 5, 13, 22, -2, -27, -39, 9, -11, 10, 8, -7, -46, -50, -22, -10, -3, -1, -13, -45, -45, -10, 9, 15, 7, -32, -34, -10, -9, 30, 28, -8, -23, -20, -30, 12, 9, -16, -31, -31, 2, 12, 14, 6, 8, 1, -9, -32, -16, 2, 2, 18, 14, -15, -22, -17, 2, 26, 3, -31, -17, -20, -18, 14, 27, -1, -27, -28, -26, 27, 24, 4, -20, -62, -26, 6, 38, 27, 22, -31, -48, -10, 12, 39, 34, -4, -5, -24, -5, 1, 17, 22, 13, -4, -15, -55, -51, 6, 37, 16, -4, -40, -67, -43, 10, 43, 60, -3, -55, -49, -12, 31, 31, 39, -15]
8191a5
$$ Imaginary data points
##PAGE= N=2
##DATA TABLE= (X++(I..I)), XYDATA
0@%%%%%%%%%%%%%%%%%%%%%%%%%%%%%%%jMj0J5j6J6j6J6j6J6j7K1k7L1l2L3l6M1
49B2m5M9n5O1o7P5q3R2j03J14j29J48j72K04k45L02l89N37q36J655q025l2210
71c9100K65K9960L7414J1113k2169l2835j8679J1064K7500J8486K37j7524j7364
84a1632n144M910J1395Q072K776k37p084q870p331j01J2348J4086O006r222k0562
99a0590j1952N603K0394J9235j276j8196k0881n868J5858J9993Q735r733j9489
112h167r285N522J5028J1063l768j0666q704M16Q730N324k53n171n010J953L760
127G72K624o74m202r72J125K199J940k389j664l19M89K138n86o47M11O6J669j105
145H75k729r33K96L972K652j318l021m432Q2M433M037K102l766n479k334R46N584
$$ y = [0, 0, 0, 0, 0, 0, 0, 0, 0, 0, 0, 0, 0, 0, 0, 0, 0, 0, 0, 0, 0, 0, 0, 0, 0, 0, 0, 0, 0, 0, 0, 0, -1, 3, -7, 8, -8, 8, -8, 8, -8, 8, -9, 12, -15, 16, -16, 17, -19, 22, -23, 26, -29, 32, -35, 40, -43, 49, -54, 60, -69, 79, -93, 111, -134, 168, -221, 316, -520, 1135, -6890, -39100, -38835, -8875, 28539, 39652, 17483, -15352, -34031, -22967, 4533, 23019, 23256, 5732, -11632, -16776, -11866, -471, 7601, 10377, 10140, 3056, -5814, -13145, -13246, -898, 13188, 19194, 9972, -10590, -22542, -16939, 3455, 22690, 21414, 3218, -17663, -23531, -7673, 12320, 21055, 11322, -8167, -17452, -11930, 3098, 14161, 10393, -273, -8977, -8561, 169, 5493, 5240, 69, -4941, -2988, 772, 3396, 2722, -1480, -2452, -1327, 872, 2812, 423, -1241, -1560, -1071, 1067, 481, -166, 245, 311, 1980, 875, -1854, -2787, -2491, 1481, 4133, 2815, -206, -4638, -4556, -123, 3914, 6016, 2250, -3229, -5563, -4617, 967]
162I67M103m10l131n165j212K637L589L461j400l743k925j214L176L332J355o85
178B735l790j731P52K015K775p93k157j826p75K799K059J45j305l025k48J703
194f67K224J809k109k816j606J43L440K478M75j604l794j346P70K454L422J61
210C434j721l271k847J113K758L753J916k503l696l533k84L930L896K422j706
225C661n020l367o33L754N292K115j267n261m807l27L193N916L206j956m723n348
241e572m94M221N098L225k421n236l756m68M172M209J278j321l696j893L25J198
257a131J991L07J44J74j140j086j778m34K416K936K270j501m724l356j67M366
273g13N207J075k866n566k867K173M202L834j47l344k895j608J146K049J096J331
$$ y = [967, 5070, 4660, 1529, -3636, -4848, -2211, 1378, 4839, 3439, -304, -3229, -4443, -1267, 2065, 3420, 2735, -1055, -2786, -2034, -19, 2756, 1963, -194, -2020, -2795, 4, 2063, 2208, 903, -2122, -2370, -667, 1557, 3366, 1257, -1559, -3165, -3022, 418, 2896, 3371, 1767, -2027, -3373, -2603, -149, 3273, 3434, 1713, -1558, -4405, -3292, -534, 3219, 5135, 2632, -1064, -4597, -4881, -951, 2945, 5367, 3661, -1359, -4726, -5359, -1605, 3687, 5802, 4535, -726, -5533, -5860, -2667, 3249, 6455, 4499, -224, -5572, -6066, -1845, 3253, 6478, 4057, -1179, -4935, -5403, -1231, 2978, 4256, 2935, -761, -2654, -2329, -1131, 860, 1167, 1311, 1485, 345, -741, -2519, -2953, -537, 2399, 4669, 3168, -1556, -4912, -5079, -713, 4494, 5569, 2703, -2863, -5730, -3557, 645, 4479, 4332, 988, -1907, -3515, -2369, -320, 776, 2107]
289B107J98o34j690l119q99J822M309M025j206n343n916j537N639P479L841l416
305E660q733n717J247P402P657P60n566p553l425L755O320M517m85m962m282j682
321e087J894L851K357P70j597l143k179q59K181L858K446j08m118m679j242K774
337b881N791L311j833n089n065J60M783N164J910l699n519k705J553N261L683
352D825m83l575m332p03K558L549K263j538l206k475l47K748K813J190j041l176
368i30j919J63K047K972O48j417k722k133Q44K340K503Q74j965k497j711L97K538
385C2K051P48j248k758j550j8K181K882J019r72l198k733J42K465L723J487k079
402B174l680k893Q75L969L325N14l220m065j173J846L967K060j267k816k340M21
$$ y = [2107, 2305, 1671, -19, -3138, -4037, -2215, 2094, 6119, 4913, -430, -6346, -7883, -2244, 5235, 9076, 5660, -3073, -8790, -7543, -141, 7516, 8276, 2710, -4843, -8268, -4513, 1807, 6324, 5839, 877, -3405, -5087, -3193, 658, 3015, 3785, 2188, -955, -3134, -3993, -1812, 2046, 4492, 4384, 266, -4413, -5655, -2881, 2910, 6221, 4388, -701, -5766, -5606, -823, 4341, 6251, 2552, -2967, -5672, -4119, 1142, 4825, 4342, 767, -3565, -4268, -1710, 1839, 4102, 2564, -642, -3117, -3464, -716, 2097, 3287, 2246, -930, -2849, -2686, -639, 2333, 2981, 1564, -1158, -3291, -2447, -107, 2396, 3270, 1305, -1192, -2903, -2506, 32, 2083, 2831, 1583, -1175, -2725, -2743, -562, 2320, 3339, 2367, -831, -3564, -3422, -957, 2766, 4253, 2174, -1506, -4399, -3524, 445, 3770, 4284, 1064, -3001, -4174, -2328, 1639, 3699, 2432, -384, -2724, -2303]
418b303K246J622K70j489j228J34M27O17l54n21N25O95O21n76j711n96N75J731
436F85J301q80j579j341L72J927J025k89j398j183P42J079N58p21j576n0J345
453A7J682L85k053k137m55J865L107P97j912l216j869J601L297K444l34l249k792
470b822m22K028L040J039j006k269j834K17J235J593J074l41q06j430j145J45
486a704R94J891J220o51j847k249m36J858K527J657j063k898k204j63K404K770
502B106R23j185k791j733M77J869K229M30j254j729j379M05J324J301P03p10j106
519a20q56l18P75Q78N95Q1q78o98m46J78Q99N76K84k84r01m54j94M75P92K67Q4
540G35o06p08j25J62P40N37j09k78p95l42K52M35O56J04l37l62n22J15L31K58
$$ y = [-2303, -57, 1565, 1835, 346, -882, -748, -321, 296, -58, -579, -54, 641, 1262, 686, -1025, -1621, -1046, 685, 1986, 1106, -473, -1814, -1442, 485, 1510, 1221, -177, -1360, -618, 461, 1019, 298, -1278, -1328, 17, 1699, 2084, 31, -2106, -2561, -696, 2411, 3208, 1296, -1920, -3789, -2188, 1109, 3553, 3219, -30, -2822, -3244, -1216, 1824, 2863, 1857, -412, -2246, -2029, -794, 799, 1873, 1532, 726, -704, -1849, -1704, -710, 1181, 2401, 1750, -97, -2346, -2782, -924, 1603, 3260, 2197, -701, -2905, -3068, -664, 2106, 3029, 1844, -947, -2680, -2203, -334, 1895, 2325, 1071, -658, -2037, -1632, -308, 993, 1696, 986, -120, -976, -1294, -519, 359, 954, 1035, 157, -541, -987, -809, 90, 666, 950, 666, -235, -689, -883, -408, 384, 651, 735, 129, -579, -704, -542, 198, 735, 626, 348, -447, -789, -537, -102, 554, 658, 321, -41, -563, -448, -117, 141]
560A41M25k12l28l30l52L50M01L97K11n67m56l25J05P31L12N2l96p18q2K65O54
581B78N29k81m66o55k68O32N99M96k30r79m88r9Q23J113J35n33j280q09N24J190
601B31J192L5j358j329m76J018J690P60n21j610j296J88J120J467M37p98j063
618c13r45J52Q83P70N90k04q10q16p40L25J106J269P07r98j837j351K39K162K035
637B224M04j767k821j085J340K812K061p78k564k318k46K175K299P15j289k136
653i74q90N76J419J096k03o57o08k53R0p9J58M92N63L49p37j240n85N47J664J114
673A842m73j606j703J15J715J702L76j525j773m15J092J785M51j098j337n46R92
690d06J295K04q07j244j10J104R74J70j159j215l0R91J291K70j040j100m67P85
$$ y = [141, 566, 354, 26, -304, -656, -306, 95, 492, 703, 136, -320, -645, -540, 191, 503, 555, 159, -559, -641, -376, 278, 807, 526, 60, -595, -863, -231, 368, 864, 634, -345, -833, -932, -109, 1004, 1139, 606, -674, -1483, -959, 231, 1423, 1458, 100, -1229, -1705, -687, 1003, 1763, 1242, -368, -1664, -1476, -356, 1111, 1548, 750, -313, -1258, -1106, -223, 547, 1137, 933, 123, -693, -1433, -1108, -2, 1267, 1974, 976, -861, -2212, -1973, 189, 2224, 2628, 861, -1960, -3045, -1705, 1107, 3168, 2390, -174, -2492, -2738, -563, 1736, 2451, 1162, -974, -1864, -1288, 131, 1227, 1024, 367, -241, -494, -404, -483, -325, 167, 730, 1079, 342, -898, -1483, -936, 728, 1842, 1369, -237, -1940, -1825, -110, 1592, 1968, 443, -1330, -1745, -653, 1132, 1583, 485, -852, -1398, -406, 889, 1093, 286, -958, -1068, 36, 1010, 1180, 21, -1194, -1224, -233, 1058, 1328, 288, -812, -1279, -494]
708d94J132K89l42q61m25K93L43L00j15r9K66L0j99n14m29M27Q66O73k23j273
728c55j020M8J210J542K22j044j612q39Q68J495J066k18j469j169j69R68J352
745H76M00m68j036p98J41O30P64K95l37m85n65p4L89M49M85l8n48m93l51K86O73
766A95M11R8n94o26j14K73O84L57k20m96o06j4M90N42L14l23n70l20k7N74M71
787D99Q3l43o70k25K41N29N29p7m81n30k69M71N64L11j02o94m02j2M15O46J03
808E86j97m87m27J03L16L68K12k18k87k80r1K61K66K86Ol01l12l01J33L95K84
829C15J68k49m43k02l1L98M11N5j05m65l16J6K70M70J91j67l04l82l9K41L09K38
851C79q2k60k47k05K03K46K35J29j96k00k80j29K07K12L58J19l13l97l79Q0N52
$$ y = [-494, 638, 927, 585, -276, -701, -408, -65, 235, 120, 21, 287, 317, 118, -396, -825, -398, 468, 1141, 918, -355, -1375, -1327, -117, 1425, 1647, 603, -1009, -1848, -980, 515, 1581, 1363, -106, -1275, -1444, -476, 876, 1276, 808, -228, -1026, -885, -255, 509, 804, 467, -18, -583, -657, -268, 181, 666, 628, 80, -413, -764, -478, 195, 606, 704, 110, -516, -630, -357, 327, 684, 464, -32, -638, -652, -162, 380, 694, 371, -199, -519, -546, 28, 499, 582, 239, -431, -656, -415, 114, 643, 566, 85, -445, -714, -243, 321, 632, 530, -164, -566, -578, -163, 483, 586, 389, -98, -525, -422, -106, 262, 474, 256, -31, -311, -402, -141, 125, 411, 417, 116, -196, -497, -364, 31, 315, 483, 234, -209, -411, -442, -44, 367, 422, 317, -148, -464, -448, -178, 292, 483, 316, 12, -370, -409, -168, 141, 379, 297, 37, -210, -415, -212, 34, 269, 398, 202, 2, -278, -407, -200, 12, 370, 489, 176, -221, -600, -520, 32]
872C2M99J90m07p40l59J33P45O56j4n15p73k65M36O07M73j47n49m33j75L68M02
893A64J91L1k92k08j19r9K02K05K44J25l56l80k65J31O04M41Ln19o81j43L84O95
915C58L93l47o12m45J21O13M62j6m17n24LK69L51J44k54k27j19J76K34n0q0j28
937i5k5J74J0l3r3o5J43N6K8p7j66O3J11N2Mk08o3R8J37J86j28k27j17M7K84J98
963B94q0k18l58M0K69K46J78k32l10j60P8K99K56n1j35l48r0J48K54K53q9k17
985B7j84j28J97J79J45m5k70j38jJ42K76Nj24j59j29J21J11M5J5j02j5k8K3O6
1009B9l1O0Km1l7j06K0J28Q4O3j55j91k9J61L07Q5k14l76k08J61M90K70r1m76
1033i5m21O2M03N03J02l92m98k39K94M85K43j11l53l30K9K29K57N1q3j22j25l3
$$ y = [32, 531, 721, 314, -426, -785, -652, 93, 749, 735, 220, -553, -818, -382, 225, 698, 551, 2, -431, -606, -238, 164, 355, 386, 94, -114, -233, -332, -130, 75, 319, 444, 88, -292, -557, -426, 178, 619, 622, 103, -578, -721, -337, 358, 751, 404, -208, -653, -532, 81, 543, 527, 110, -414, -411, -142, 209, 353, 99, -128, -247, -71, 163, 113, 33, -95, -120, 54, 64, 31, -62, -127, 16, 72, 100, 23, -143, -80, 31, 83, 87, -121, -184, -86, 51, 237, 109, -118, -235, -188, 96, 294, 214, -4, -362, -322, -53, 193, 371, 139, -171, -331, -253, 46, 302, 251, 116, -232, -322, -174, 80, 333, 244, 27, -157, -285, -88, 91, 236, 191, -79, -217, -218, -76, 200, 205, 81, -78, -207, -86, 25, 70, 85, -17, -32, -60, -37, 29, -2, 58, 60, 19, -18, -124, -104, 24, 108, 171, 16, -175, -204, -43, 264, 349, 135, -241, -449, -288, 202, 472, 381, -95, -516, -454, -51, 452, 554, 162, -336, -575, -281, 204, 447, 336, -17, -347, -318, -89, 168, 219, 136, 14, -111, -144]
1055a44j4K9J93J82M2j86l41j72J27L83M09n9m26n03j31M23N42K89k56o28l34
1076e75J05M93M65j1l63l99j49K45K99J85p6k18j20l9L1J15K7Q0M9l8j18j91j0
1099b13J49K15J30j20k56j97J7K65K46J9j67k36j17J64J51J75r6j40j07k5J01
1120d2J02j9jn9L3Ln2k3m3P7J06J9l6j36o8O8P9Q8N3j35j03n6N2J25P1M9j13j21
1148h2m1M2J07Q8m5k5j42j4N1O3J01Or2m8n2K4Q6L0J4o9n1j8j6J01L9j9l0n5j2
1177e9L6K0M7j5n1k5rR2LM5n6j16L1J4M8Q6l3n4o2m5R6P7N0k3j25o2l8M6J59P0
1207A47k1j52j28MJ05J68R4j48j79j16O6K20J42pj97j59j0J03J76L1j04o8r7Q7
1231d3R8%m8mqN3m6m1n1K6J40Q8o4j54j54O8J44J91rk19j61j1J85J92pj75j74
$$ y = [-144, -158, -129, 64, 246, 288, 102, -239, -411, -284, 99, 508, 449, 23, -480, -611, -188, 354, 643, 387, -241, -575, -470, 23, 488, 477, 114, -285, -434, -189, 110, 295, 219, 1, -119, -158, -127, -12, 15, 95, 144, 106, -12, -203, -213, -64, 151, 281, 161, -95, -292, -275, -10, 236, 255, 88, -148, -265, -101, 50, 225, 129, -11, -118, -143, -42, 60, 41, 40, -19, 14, 17, -35, -58, -101, -24, 82, 101, 65, -71, -139, -71, 8, 96, 149, 14, -89, -145, -93, 32, 103, 152, 39, -82, -123, -81, 26, 114, 69, 44, -98, -112, -61, 2, 103, 109, 17, -31, -83, -59, 27, 57, 71, 2, -49, -67, -83, 18, 57, 38, 8, -47, -59, -23, -3, 44, 29, -22, -47, -56, 36, 39, 84, 28, -88, -57, -43, 5, 91, 58, 4, -58, -103, -7, 70, 120, 97, -28, -90, -128, -82, 77, 147, 126, -26, -154, -150, -45, 123, 217, 69, -110, -226, -160, 60, 202, 195, -2, -161, -171, -68, 108, 139, 35, -33, -130, -43, 55, 55, 7, 3, -5, 48, 2, -39, -90, -64, 76, 164, 100, -54, -208, -140, 4, 195, 186, -33, -194, -205, -20, 172, 165, -10, -184]
1258a84K3K08J31l6k06j64R1K19J14k3k86j56P2L01K12j09k73k45N3L10K21k3
1280B50k13k84L5K00J51O3j79j31j1O1J20o3p5L0O6J43r0j92j09R3K87J38j16
1303A74l15k52R4L83K75Jl83l33RK52L68R4k33l08j59J59K47J51m4k20j11K2J13
1326a6Q1rn5LKqn9m4N9J01R3o3j71j11M0J92J67j2j64j72r3J95J66P8j09k24o2
1353a95Q7J60J10o9j09j23K4J29M6O6j06o7k9N2L7M9k7Po1j4K8kL3j5kk9l3L3
1381b0J3pN9jo5rk8N6O7k9j5m8l9M2N2M1j5l8n2j1K4N9oMOj05RK5J04Kj9m6q8
1414g8J1P4M0j7j7m8J0mN8m2J6nj7NL0k6%k0N5J3Nl2l0k1L9K3J9j5l2kl4K9K9
1447A6K4J4q0Pj6JM9J5j4j3j5k5L3j9L7J1k7j5j9J0J5L0K2j0l8n9k4K9O8L1Om1
$$ y = [-184, -161, 47, 178, 142, -64, -228, -137, 82, 196, 173, -113, -269, -197, 104, 316, 207, -66, -311, -258, 52, 273, 250, 37, -247, -212, -12, 139, 202, 23, -108, -119, -58, 62, -1, -76, -46, 20, 163, 73, -119, -228, -135, 152, 290, 174, -141, -393, -299, 84, 359, 360, -23, -356, -347, -95, 273, 367, 134, -174, -333, -174, 73, 224, 180, -40, -151, -129, -16, 65, 56, 1, 4, 6, -2, -61, -105, -46, 55, 148, 85, -86, -197, -157, 35, 202, 190, 26, -146, -239, -44, 122, 200, 91, -133, -195, -108, 52, 162, 93, -16, -139, -115, 14, 60, 126, 20, -47, -76, -24, 13, 62, 35, 42, -19, -33, -5, -7, 26, 11, 9, -20, -53, -20, -7, -14, 45, 44, -21, -30, -58, -2, 65, 36, 21, -27, -66, -24, 28, 69, 54, 16, -36, -47, -23, 36, 30, 34, 40, -65, -56, -31, 73, 75, 56, 10, -78, -67, 7, 47, 30, 13, -35, -25, -29, 29, -13, 3, -2, -19, -14, 16, -10, -10, -30, 25, 38, 43, 11, -19, -40, -1, 22, 41, 26, -6, -8, -42, -13, 16, 40, 54, -26, -19, -35, -34, 15, 30, 16, 3, -12, -37, -4, -23, 14, 25, -2, -17, -36, -26, -11, 19, 41, 31, -7, -66, -90, -61, 7, 38, 44, 3]
1479Cm4k9QJ20K2m1o3m5oQ8M0lm9l5m8P3M3kj5l0Mk2L1%l3J1QL6kk4o1K4J4Q9
1513F2j8m6p6k4N9R3Pk7o4k5K8O3K6l7n1J7K5OJ5n1Nk3L8O9m0j7m8k4R2L0k0o7
1545b3n0L0N1M8pm9n3l4N1N1J8pn5k9L8K3J1k4K4k5Pj1K9k0lLM3j5k2ok%K0kk9
1580a9QqL9Rk1K1l1l8j4O4K4j4m5j3mK7L1J8pj9n4ML1L2jj9j9j6L3J1L3j3m3k8
1614d1M6O%J8l1mJkM1k7kj2j4L6j9opJ1J5L2n3l0rK3O7J5k8o7j2PP1M3l4n1o5
1649h2M2O2J9K7p3n4K4K9N0j1l5k3J3K0K5m1qqK5K9j2j6l0KPN4Ol5o8K9%N6j0
1682A3k9l1NK2N8Pm3m2kM5J7K3l1m7L9QK9nn3J9k2J4L5K2o7qL2j1K2jll3pL4j
1717HJ9m2L1j9Nlj4LmJ6j4M3m6K1k8M9K2l6l7J3LJ6J4pj5%j2L3jNpl5J6Ql1N1
$$ y = [3, -41, -70, -62, 58, 80, 39, -24, -69, -75, 13, 53, 50, 1, -34, -82, -9, 34, 32, 17, -13, -9, -31, 0, 0, -33, -22, -14, 22, 20, -4, -65, -41, -27, 62, 44, -2, -78, -102, -43, 50, 57, 30, -34, -59, -31, 32, 58, 21, -30, -13, 12, 18, 33, -18, -13, -36, 2, 71, 31, 14, -34, -58, 34, 64, 44, -23, -73, -43, 8, 56, 49, 0, -53, -87, -36, 15, 33, 26, -29, -58, -20, 3, 14, -10, 14, -11, -4, -15, 14, -6, -9, -6, 37, 22, 0, -6, -8, -8, 12, 10, -19, -11, -19, 20, 29, 8, 29, -2, -40, -54, 10, 34, 20, -25, -38, -42, -15, 16, 34, 27, 8, -46, -42, -11, 21, 20, 1, -18, -34, -1, 10, 43, 30, -13, -41, 5, 11, 11, 29, -2, -6, -5, -7, 34, 7, 5, -7, -21, 15, -4, -10, -17, -6, 9, 41, -12, -42, -51, -28, 39, 54, 26, -41, -53, -46, 25, 68, 34, -17, -82, -40, 22, 41, 68, -5, -59, -35, -6, 44, 33, -2, -25, -12, 8, 33, -8, -16, -24, 1, 30, 18, 2, -28, -26, -19, 35, 41, 6, -62, -33, -33, 23, 13, -16, -47, -42, -20, 38, 45, 2, -40, -42, 3, 20, 43, 12, -35, 4, 12, 41, 36, -17, 2, -20, -6, 29, 51, -16, -24, 8, -3, 19, 18, 15, -18, -25, 9, 8, 27, -15, 16, -3, 2, -1, -15, -12, -16, 0, -14, 29, -17, 4, -24, 25, 47, 11, -26, -13, -10, 6, 20, 13, -2, -2, -14, 19, 18, 23, 16, -19, -3, 5, -26, 25]
1753B5Lj0k7J7k0QJ3Qk3k3M0k0J4l2K6j1J8k4mL3ojrj3K7j6%pQK7j8J1l3K4k1
1788a6LJ7L1m0k2NK6J2k5LQJ%J6k9J3J1ol3OJ8Om6L5k5J6K1J4k6oJ1KJ2J1m0J9
1824CJmJ6J9l5OrJ6k6L9j4k8J0J1j2Mjl1L1j3K9j6J6l3nJ8J0M6q9J0pM1J8om5
1859c0K1k5L2L2oj4m8M7J9J5l4j9j7K4J0L1l7lm5L0L5jkn4qN6J6Nj9p9K3K9N1
1892C5J7m0m8j0J8M4J4o0j3L9K4L3j3m6k4KN1J2lm0l3L3J1L8Kq0mK7M6L5m4n2
1924b9k0K2M8K4n3j1n0N4M6Jj8n0j6L7M9J4l5l0j5M3QJ0n9m2L0L5L4om5JQK0N2
1957E7m6k3j6j8M9L3on7k3J0M3K8qk4m5K8kK8K3l9j1K4LJ3j9Lk7J4MNJ1k0pRO
1992@K0ok3j2NL3j3k7Mj1K4%J3QNj6j8OpK0K8l8j2pJ6L3rRql6K3JL9n3l0L0j4
$$ y = [25, 28, 18, -9, 8, -12, -4, 9, 17, -6, -29, 11, -9, 5, -27, -1, -12, 6, -18, -22, 11, 5, 4, -5, -18, 9, -7, -7, -14, -6, 21, 3, 14, -19, 5, -16, -13, 4, 35, -5, -27, -22, 4, 16, -9, -6, 2, 3, 3, 19, -10, 3, 14, 8, -25, -19, -1, 5, -41, -6, -31, -15, 6, 20, -6, -12, -1, 1, 13, 24, -16, 3, 4, 0, 16, 35, 0, 6, -3, 13, -13, 26, 12, -16, -6, 5, -7, -3, -4, -35, -4, -17, 12, -4, 12, -21, -26, -8, 2, 48, -41, -31, -38, 3, 21, 15, -30, -9, -34, -2, 30, 24, 10, -38, 9, 28, 43, 9, -10, -27, -3, 7, 38, 1, -2, -47, -17, 18, 17, 15, -39, -47, 9, 25, 30, 11, -68, -45, -16, 35, 52, 12, -36, -46, -28, 16, 30, -30, -43, -4, 20, 53, 40, -6, -30, -28, 23, 35, 32, -8, -41, -8, 3, 41, 43, -37, -41, -14, 32, 67, 23, -29, -49, -27, 21, 45, -8, -19, -69, -15, 31, 32, 14, -36, -52, -15, 34, 48, 13, -17, -32, 11, 19, 29, -30, -72, -42, -7, 27, 21, -24, -23, -15, 5, 57, 11, -12, -28, -46, 3, 36, 30, -27, -50, -40, 3, 31, 23, -1, -46, -18, -20, 8, 31, -8, -19, 5, 8, 21, 2, 5, -22, -8, -4, 1, 12, -8, -15, -6, 0, 20, 14, -9, -21, -16, 17, 4, -23, -19, -30, -6, -6, 7, 15, 20, 4, -14, -8, -15, 5, 33, -5, -17, -24, -8, 25, 16, 25, 17, -19, 4, 5, 44, -9, -39, -9, -23]
2029b3J2L8Kp0J3K0L2pj8kk4M5mK3k4k5lM0J3ln6jj0K6J1j3J3k2oK5j2K6l0K2
2063Hn3L2J4M2l3l3j0J3J6rJ0L3m5k0M8k5K6j4PpJJ8nk5j5mK2M8Kn4l4J4J5M6
2097B9jk8n7l2M5O4M1kq4m6mP2N1k0k8m9J6M1L6l4j7jMK6J6m3l9L4L4N6n3n4n0
2130g7QQ0O5J9j00r4j9J08R6K5o7j12l5N0J21K9l9j00m4M1P7K1j9m5k3L6K1rP
2159B1l6k1M7K4j7k7k3L4M7N1m9j11k6P3M2N1n4p0k2JP6L0j3n0n7kJ00L0l8l6
2189b5k9j5L1Q3j0l6k2%l5P5J1J3l8m6JL4K9J0Pk9m7OJ0N5j0rj7n5M3L9Ll1m2
2222d6jP0J7m5m6j0N6N9k8k1q4qP3N8K5q1q3J3O6J22K9j06j11q4J46J35K5j12
2250B8j40k8J18J25M4j23j54k6J37J27L9j10j66l8J14J55L5q8j64k3J12J16K1
$$ y = [-23, -11, 27, 29, -41, -28, -8, 24, 17, -1, -3, -27, 18, 14, 37, 13, -12, -15, 25, 38, 35, -21, -22, -32, -6, 5, -8, 5, -17, -23, 2, -10, 16, -14, 8, -45, -13, 1, 43, 10, -23, -33, -20, -4, -13, -3, 30, -15, -35, 13, -12, 14, 0, 7, 0, 1, 19, 14, -11, -26, -30, -8, 40, 42, -12, -46, -32, -17, 29, 28, 0, -57, -89, -44, 20, 61, 59, -25, -71, -75, -3, 48, 28, 0, -49, -33, 8, 44, 10, -7, -8, -4, 22, 38, -5, -44, -10, 24, 80, 27, -27, -77, -69, 11, 76, 95, -5, -99, -118, -10, 86, 111, 44, -68, -103, -53, 68, 97, 58, -42, -86, -45, 32, 53, 34, -11, -34, 2, 23, 14, 21, -15, -36, 11, 35, 18, -9, -32, 2, 49, 100, 51, -60, -86, -13, 29, 80, 26, -44, -66, -65, 11, 41, 28, -22, -79, -81, 19, 49, 11, -25, -54, -69, -38, 45, 35, -1, -23, -23, -58, 17, 28, 41, 3, -43, -42, -8, 21, 31, 38, 9, -38, -32, -22, 33, 23, 14, -3, -58, -15, 24, 27, -4, -46, -47, 23, 40, -5, -51, -61, -5, 54, 26, 5, -79, -87, -14, 44, 69, -12, -95, -82, -16, 106, 135, 29, -82, -166, -20, 115, 140, 28, -112, -140, -22, 103, 147, 24, -130, -156, -19, 108, 147, 37, -129, -167, -53, 102, 137, 49, -115, -138, -26, 90, 111]
2273A11q1j06RO9N9pj09m6M8J40M1j05j44o1J03K29N8j12k25j08J20K31J59r8
2297A75k51j70O2K49J44k6k03j39KJ36J19Oo2j28ON8M5k4o8L6R4K6l2j04o7N3
2323f3J32J09p0j24j67N1J43J39L9j57j43m8O6J55Q4p1j08p3M5Q9K2K5p2j3J4
2348DRm8j4K6J9N8ll2p7k3N0M5M5k3n0p5J0Q6O4k4Jn1o8L6M1LN5o6J3m9nM7L0
2381C4J4k3j1p0J1J5K3M4lk6n0J6J5K6PLl1m4RoL3N1k0j8m7J4L1L1J3l0kk8j6
2414c5%P7lj2n1k5J5QR4Kl9o2n9kJ09Q2ql7j32q2O1J63O6k6j28j30QJ20J53K5
2444A52q7j45n7M9J10O9k6o7j2j4J1K0K6J7K1Km3r7n8P9J30R3m1j64j66J8J66
2471a4J98N9j85k22j14J72K31J10j17j87j44R5J76P7r1j48n4Q1J55Q6j46j30k6
$$ y = [111, 30, -76, -67, 2, 61, 54, -55, -101, -53, 87, 128, 23, -121, -182, -79, 150, 208, 96, -129, -237, -117, 114, 273, 175, -76, -246, -184, 65, 209, 183, -20, -159, -157, -21, 98, 104, 42, -86, -80, -22, 23, -1, -69, -33, 61, 87, 55, -49, -116, -63, 69, 178, 108, -16, -183, -132, 11, 150, 189, 32, -111, -159, -93, 62, 146, 75, -33, -106, -61, 28, 50, 75, 3, -10, 4, 13, -35, -49, -23, -4, 54, 51, 19, -58, -81, -31, 14, 59, 36, -14, -89, -79, 7, 71, 47, 48, -3, -71, -35, 6, 9, 64, -2, 11, -38, -43, 4, 34, 48, 25, 14, -56, -45, -30, -7, 37, 34, 8, -42, -26, -11, 15, 22, 25, -6, -50, -41, -47, -14, 37, 17, -1, -48, -34, -3, 28, 41, 11, 9, -19, -35, -35, 42, 39, 27, -24, -49, -34, -26, 68, 70, 31, -31, -90, -92, 17, 99, 91, 54, -78, -160, -99, 64, 130, 104, -24, -154, -146, -26, 127, 152, 65, -80, -137, -88, 22, 91, 65, -2, -14, -28, -17, 3, 29, 46, 67, 69, 26, -71, -129, -50, 80, 173, 132, -32, -198, -180, -14, 184, 243, 58, -164, -278, -106, 125, 235, 118, -69, -213, -118, 58, 135, 44, -104, -158, -77, 78, 164, 18, -112, -138]
2494a38J18J93k8j49j78MJ87J49K0j68j66k4J81J46K7j66j43K4J16J04Rj50r9
2517a31N8J82P7j10k15p1J09K68J08j53l27j43J59L45J86r4l24k58L1L03K55L4
2539B89k34k23q1J57J94N2n4j13n4lL6L1l1M7O5%p0j42o6J14K40R6r9k74j69N8
2565b34K76K35J8k69k51o9J46L10R7j01k42j47N5J78J53Qr2j51o9P4J19L0K9o7
2589C6q1k4J3N9O1M9m0r0p1J9M5O7M4n3p3o4J7P8O0N1m9j03m1KR1P7K1r9o7o5
2619a30N9J00J04l0j02j35MN1J49Q7m6j44r8j1J25J25M3j02j19p0M6J14P9J4r4
2644A9m4m0N1RK5J1j5%j1l3n1kJ11N6J5o4j22p2Q0J04P3K7j51o5l2O4Q5Q3j5j13
2674a7o1KK6M0N1J9Lm0o7m8JR1Q2M5q8j15p5J8R5J70L9o7j63j41PJ44J65O8q4
$$ y = [-138, -20, 173, 145, -4, -182, -178, 9, 158, 178, 10, -156, -180, 1, 147, 174, 8, -135, -111, 5, 109, 118, -32, -131, -73, 109, 186, 76, -139, -210, -101, 167, 275, 122, -205, -348, -189, 156, 342, 248, -76, -334, -303, 0, 255, 289, 55, -168, -249, -92, 102, 154, 100, -13, -67, -70, -34, -3, -34, 13, 78, 78, 8, -134, -200, -86, 154, 250, 151, -123, -292, -234, 42, 277, 295, 26, -225, -294, -148, 162, 259, 158, -84, -231, -176, 2, 155, 163, 71, -80, -149, -75, 44, 74, 103, 36, -45, -69, -56, 3, 64, 113, 73, -17, -88, -69, -24, 43, 87, 34, -39, -103, -86, -8, 52, 103, 54, -49, -90, -88, 3, 80, 101, 2, -65, -130, -71, 29, 133, 103, 1, -134, -130, -79, 70, 157, 111, -33, -131, -142, -17, 108, 151, 49, -70, -140, -94, 20, 99, 113, 19, -25, -65, -14, -5, 20, 31, 16, 16, 5, -28, -79, -81, 30, 86, 101, 37, -85, -157, -77, 27, 100, 127, -24, -89, -121, -57, 28, 111, 96, -17, -78, -76, -50, -10, 41, 60, 63, 23, -44, -92, -91, 0, 82, 127, 39, -76, -151, -133, -38, 132, 171, 104, -59, -200, -193, -49, 116, 184, 100]
2703A00j76j13NJ63J90Q7j52j86j32L4J73J73L5j25j72m5K7J20Q8kl1j11m9J0
2727h9L4R8L0Ok5r8j01rJ35J53J1o9j42j32M9J43J28M6j37j50k6P8J42M1o6j06
2753e6m5Q0J25m2o3r8J6J03Q7j2j60q8M7J49R6rr4j63n2J06J72M2p0j18r9L0J10
2780fQ5J1m8m7l8k0J9N4L6L0k5n9q1m8J02J10R3p2j50j13PJ17J73O5q2k04q3J9
2808a55J56J85Kj20j94n9M3J39J79Lj53j72m5J06J75J37j01j69j60L5J62J80K3
2831A97j63k00k0R0J84P5l0j50j45M5J03Q8M8l0p6p3m9L5L7J29O6l4j45k07JJ71
2857e3K77J04j40l42k49P6L69L70Kl62m11j39L14M48K01j74m27l10J10L23L01
2878B88L1k06k50o9R5J48Q2k4J0p2l1j34m8P2J99J84l0k60k78o1K49L69J37j92
$$ y = [100, -76, -189, -184, -21, 169, 256, 104, -82, -214, -180, -7, 166, 201, 76, -96, -141, -114, 6, 94, 92, 61, -50, -99, -89, -55, 43, 73, 79, 54, -44, -145, -154, -19, 134, 145, 76, -66, -198, -149, -6, 122, 168, 31, -119, -145, -67, 75, 116, 50, -56, -101, -21, 104, 62, -1, -99, -83, 20, 107, 95, -65, -153, -106, 43, 139, 130, 36, -127, -179, -73, 99, 141, 71, -47, -146, -116, -6, 79, 90, 42, -5, -43, -63, -44, 10, 46, 76, 51, -8, -89, -137, -35, 75, 168, 96, -54, -167, -160, -43, 130, 195, 113, -91, -174, -155, 1, 186, 188, 68, -126, -185, -142, -3, 176, 179, 26, -146, -191, -85, 90, 227, 126, -43, -203, -168, -6, 174, 197, 34, -166, -186, -96, 88, 163, 133, -17, -162, -117, -14, 74, 122, 92, 16, -57, -106, -71, -34, 95, 161, 127, -18, -225, -224, -53, 224, 328, 188, -154, -403, -327, 42, 412, 414, 52, -359, -498, -184, 264, 465, 291, -136, -446, -336, -13, 288, 319, 113, -137, -206, -111, 37, 119, 95, 105, 33, 2, -132, -180, -108, 91, 275, 245, -15, -293, -354, -105, 264, 401, 209]
2902B09m14k28J18L82L02ml51l13l6K29L08M7j58j97o9J04J54Rq1n4K3O8L4r1
2926ij22J6J01J70J5q9k16q3J44J74P9m0j73j34N9J10J01k1n5p6M6RQm0l5M4J02
2953H5J3p1j16q2P0J79J23m7j80j71j5J87J56P7j07k13r9P8J46J47Kr1j53o7L4
2978a15J50M5K7o3p1q1K2M8J12Pl1j13l2mP6P9K4j8q1k9k1M9N9J8l3q1RJ6L4N2
3008E4j3j8k3o6P0L3j1j4l7j2K5K9L5jo4Kl2J8M8K3Om8o7LL1P4M7k4q3n7k7O7
3040c2Q1L9l6q6n3LJ04Q9J2p2j08n5P9N0N3k7p6l9O3O1K1q5l7m0J23M7jj16j11
3069a49M0J35J02Rj14j38p0R8J37Q6q4q1j00L5O7N8l3%M4J2q0q9o9J17J70J66
3095B69p8k61k47J2L07L17J08k85m36j85J99M54L27j04m36l39m5K85L86J33j73
$$ y = [209, -205, -433, -315, 67, 369, 365, 14, -299, -335, -106, 202, 249, 91, -106, -175, -71, 83, 92, 11, -43, -20, 48, 82, -9, -131, -115, -14, 156, 171, 82, -134, -217, -73, 101, 180, 140, -33, -167, -108, 2, 103, 82, 27, -49, -3, 6, 14, -26, -61, -17, 85, 98, 27, -89, -171, -101, 78, 201, 154, -26, -197, -212, -25, 131, 208, 101, -112, -211, -133, 13, 160, 162, 71, -82, -149, -115, 35, 80, 107, 44, -27, -108, -86, -38, 74, 81, 50, -63, -95, -99, -23, 56, 80, 62, -19, -48, -69, -20, 39, 57, 24, -57, -48, -32, 2, 54, 41, 23, 0, -66, 4, 37, 26, 12, -25, -37, -12, 17, 52, 51, -13, -11, -43, -25, 23, 46, 52, 4, -63, -60, -29, 45, 92, 68, -15, -72, -99, -32, 49, 88, 52, -34, -87, -84, 20, 109, 121, 49, -59, -114, -35, 15, 68, 41, -35, -74, -11, 50, 71, -14, -51, -91, 32, 79, 78, -38, -149, -109, 26, 128, 137, 23, -115, -185, -87, 50, 136, 52, -29, -129, -94, -27, 31, -2, -2, 42, 54, -26, -115, -184, -67, 103, 269, 191, -70, -317, -305, 2, 319, 427, 142, -294, -479, -280, 174, 501, 397, -39, -378, -423, -138, 248, 381, 208]
3116B08l27j83M8K11J47Q3o5p1j20j32j6J04K16J96l2k79l07o2K60L86K23j86
3138C02m65l33P4M39M07N4l53m56j20K47L99K10j37l50k36N1K34J99K1r8j47n6
3160a14M5K3M3J0O1J0q5l8r0P7J34R5k5j66j52%J43J99J8j30k05l1J11J67J01
3185B01q0k16q0O0J58J27o1j51j31L7J45J35Pj27j41m1P8J38P5m7q7j09%O0J07
3210E7P8j2j23r5mN0P2P3qp2q8k3O2Q8L7qo7m5o0M7M4M4lk4k3p4K1N3M6M5p1p0
3242e3m8K2J23K9l8o3o4J1J11N9j9j17o7J0J26R5j5j08j12l0J38J21N2q4j72r5
3268a88O7J53J01Pj30j11n9R0J13M7K7p5r6n8J5O4J15P3l8j12j21o8Q6J78R8k5
3294A53j66j48l9J14J98J23p6j51j77l1J16J69P6k3j37j38l9J25J30P4k2j02j60
$$ y = [208, -119, -302, -254, -43, 104, 187, 122, 51, -69, -201, -217, -113, 103, 299, 267, -12, -319, -381, -121, 265, 488, 302, -163, -496, -422, 17, 424, 478, 125, -331, -451, -204, 195, 405, 268, -82, -318, -267, -33, 166, 187, 89, -58, -114, -69, -46, -3, 7, 68, 78, -7, -45, -135, -58, 76, 171, 146, -20, -172, -172, -29, 170, 188, 58, -147, -178, -67, 100, 201, 121, -95, -175, -115, 43, 170, 109, -42, -173, -136, 9, 144, 151, 24, -117, -158, -80, 58, 133, 86, -1, -110, -110, -50, 57, 135, 123, 0, -95, -99, -49, 23, 96, 88, 16, -72, -95, -33, 55, 92, 84, 17, -28, -88, -41, 3, 47, 44, 20, -3, -77, -56, -3, 43, 88, 17, -53, -101, -79, 44, 73, 35, -28, -92, -81, 30, 89, 70, -47, -114, -104, 22, 117, 102, -6, -118, -148, -10, 111, 163, 79, -93, -188, -121, 32, 133, 140, 10, -101, -160, -70, 43, 90, 117, 42, -54, -112, -97, -33, 82, 155, 117, 5, -116, -184, -98, 80, 178, 153, -13, -161, -200, -86, 112, 235, 159, 8, -169, -200, -84, 85, 161, 138, 1, -137, -176, -51, 79, 153, 131, 29, -131]
3317a31k1N6J23J10l1l5j19l8QN0L5O7qn5q8k0QP5R4O0o3j05j12j2J12J22P1n5
3345I8j21j37oJ45J39M2o0j25j19JJ08R7N7pr9o9n6K7N5J14O7n5j46j10l9J33
3371f6K07Q7r4j93j57M4J70J79N7j47k05j27R6K12J29j2j47j61o2R1J56Q6l4r4
3395A5j25l7J07Q5N2Jo2j36k6N8Q1P9oo1q5p5N9J09J03k6j11j33j3J04J39M6m9
3422I3j24j03jJ05J32N7j03j15j01M3J27J48M5j54j50q3O5J85J33k6j41j89m8
3445b05J51J71P4o9j35j53%J32J39J6n2j12o9K4P3P7K0J0m6p2r1K4M6J39P0p7
3471H5j43j00K2J49J76qj07k05p7J26J62J19o7j93j04O9J32J05n4j35p7J9J25
3494A9N8k8r6o9O7J01N7n6r4o5M7Q8Q4n3j05k1K2N6K3qo1M0J4L9o6k7l1Q8R5j8
$$ y = [-131, -152, -96, 27, 137, 106, 71, -48, -86, -78, -28, 7, 74, 66, 11, -77, -97, -89, -14, 80, 140, 77, -28, -140, -152, -40, 82, 153, 98, -23, -160, -166, -21, 118, 160, 100, -25, -144, -143, -35, 62, 119, 112, 13, -56, -112, -85, -30, 84, 151, 96, -50, -160, -199, -66, 141, 228, 134, -59, -216, -172, -2, 177, 234, 87, -118, -245, -149, 63, 192, 180, 33, -128, -190, -99, 57, 143, 109, 15, -110, -147, -40, 45, 97, 98, 36, -100, -126, -68, 13, 92, 86, 25, -60, -135, -76, 33, 136, 110, -1, -134, -147, -43, 96, 142, 93, -31, -134, -135, -30, 102, 159, 56, -59, -160, -117, 10, 158, 203, 49, -101, -184, -119, 66, 199, 173, 32, -157, -205, -54, 117, 191, 122, -13, -166, -166, -34, 105, 121, 69, -43, -112, -88, -15, 62, 82, 92, 46, -26, -117, -93, -47, 92, 162, 85, -58, -158, -136, 13, 189, 181, 74, -131, -208, -82, 80, 199, 132, -61, -165, -96, 36, 141, 87, -48, -125, -106, 19, 77, 49, -47, -116, -49, 52, 109, 53, -41, -106, -59, 29, 113, 60, -45, -66, -44, 12, 35, 27, -34, 6, 20, 59, -7, -34, -65, 23, 118, 100]
3524A00r6j01m4J10J73M2p1k19j13R8J75J43lj95j67m1J27K41K9q1j63j06M9P3
3548d0J46J4l6j02o7qM1R1K8K5l6q2n4lP4J03N9o5j37r5K3J64P8Kq6j11o2P7R6
3577C7O2j2q8p8k2O9N4M3k8l7m2LK6L0ROk1m1j4L5nL7j8Pk2j3J9J2%J3j7J3k5
3610hQOK3k5j0J1k1L0l1K0l8N2n1ML2j2KJ2kk0jOJ2jJ3k%k4lL9k2kj0LlmL3OJ
3649B3Nk2j6k2K0OJ8Ll1J1l2L4oM2k7J7p1kkL4N0K7k0q5k9L4N2N2J6o4p2j3J4
3682e6J19K0l8m9q6K3M9O7J9l2n9l6J9K7K3M1Nk7J1j01oL6N9L7lq8m7k4J02Q2
3712H7jl7r7o7L7P8Q2np9p6KP8N7K5o6l5k8J3N4qNn0J5J3K3Ln1L1KJ8qk2k0j2
3746c9N2N6l2j5m3k1M9M0j3m1m5K7K2L0Jn1k4K0K5M2Nn5m0MM0N1onp0MK4N0lj2
$$ y = [100, 4, -97, -141, -31, 142, 184, 113, -106, -219, -121, 54, 197, 194, -1, -168, -209, -82, 159, 188, 107, -56, -162, -113, -40, 106, 120, 84, -18, -85, -93, -52, 39, 67, 92, 56, -26, -80, -83, -9, 94, 153, 88, -49, -144, -121, 43, 121, 123, 37, -74, -136, -59, 37, 99, 87, -1, -79, -101, -32, 22, 65, 37, 0, -42, -39, -13, 17, 26, 32, 11, -30, -44, -9, -14, 23, 5, 12, -10, -23, -4, 8, 8, 21, 4, 17, -8, 0, 6, 29, 4, -6, 5, -16, 14, -17, 3, -35, 17, -34, -30, 2, -10, -8, 4, 2, -18, -19, -13, -1, -2, 11, 9, 9, -15, -18, 21, -1, -3, -13, -10, -13, -17, 16, 22, 23, 28, 6, -10, -32, -12, -6, 12, 15, -16, -5, -37, -3, -9, 33, 6, 23, -48, -50, -52, -18, 32, 59, 39, -46, -75, -41, 11, 63, 79, 15, -57, -70, -56, 63, 83, 45, -4, -90, -67, -18, 49, 68, 36, -23, -59, -40, -13, 10, 51, 56, 29, 40, -61, -67, -31, 28, 65, 62, -26, -73, -97, 5, 87, 86, 49, -48, -115, -78, 0, 82, 77, -2, -78, -76, 2, 59, 84, 18, -17, -45, -32, 22, 14, 19, -31, -16, -3, 20, 23, -28, 3, 5, 23, 15, -7, -27, -39, 13, 69, 37, 22, -21, -42, 7, 47, 34, -7, -52, -25, -3, 27, 28, -23, -47, -27, -2, 40, 45, -10, -50, -46, -6, 45, 39, 34, -36, -32, -8, 42, 39, 27]
3780B7j5m2LJ7L4Jj6noj8J8j0QJ5J4No8J9J4M1j1j5l2l3J6M1M3Jk5n9j7M2K9J7
3814C3On5l2J9N0J2jl2kj0j3K8K2mj8j7j3j7M0Oj7L1nkj5jK9J6p4K8qK3J2k8N1
3849D2m1LqpK1K1%m8J2J3j4L0Qj6k3oj7M0jK6m2j8mk1N8M0j5rn0k1K9L5Oj5j2
3884dj5nJ2L3J0Qm7j6J2J2nM2ool2J3j2J4J9QMm7k5K1MM0mj5k0k3MJ9M6j1nl9
3920a6Oj0LK9J9m0J0k5j1K9J5K7nk0k1pQLJ8N5l9j0m8J9K7J1Rj4j1n5J2O6qL9
3954F5l0l1n3J3M4J3j0Ok0l3OlM6K0j2l1j3JJ7jN6j8l2k0OrM4kPk5j0oJ4OK1N
3990C1m7lJ2rM3nol6JKPK6k0K2k1OmK3k3JJ8l6pL0pJ5j4j3J1PK8j7j4j9NOJ9j7
4028eM0l7p%J3MJ6l0KpqOK3MQl8J5Jk9K3K7j8Jn6K1L2NK3k2%m4L8j6K9K9m9l7
$$ y = [27, 12, -30, -27, -10, 24, 25, 9, 4, -2, -20, -2, -12, -4, 11, 25, 30, -38, -19, -5, 36, 25, 10, -22, -55, -39, 2, 45, 46, 21, -38, -55, -13, 16, 33, 39, -16, -48, -29, 21, 33, 32, 0, -2, -12, -25, 3, 25, 21, 3, -14, -27, -44, -4, 2, -15, 16, 11, 9, -6, -7, 22, 38, -36, -8, -16, 7, 19, -9, 42, 1, 4, -4, -11, 10, 31, 31, -17, -5, 8, -6, 24, 32, 16, -7, -13, -30, 10, 9, 35, -7, -25, -29, -50, 8, 48, 33, 24, -26, -47, -18, 17, 23, 8, -4, -19, -24, -12, 21, 31, 39, -8, -24, -12, 0, -5, 37, 31, 25, -7, 6, -6, 8, 27, 35, 39, -8, -33, -12, -8, 32, 28, 13, -7, -30, -26, -7, 39, 28, 23, -16, -10, -20, -17, 12, 31, -9, 1, -24, -35, -6, 9, 36, 31, 11, -10, -17, -9, -6, 12, 67, 28, 18, -30, -11, 16, 27, 36, 22, 11, -44, -32, 34, 26, 65, 35, 4, -49, -36, 8, 21, 11, 17, -3, -36, -30, -33, 13, 33, 21, -10, -23, -22, -5, -6, 50, 32, 0, -20, -14, -23, 21, 19, 26, 1, -9, -15, -1, 5, 26, 31, -16, -19, -7, -16, 27, 22, 16, -20, -19, -17, -10, 16, -4, 18, -3, 3, -1, 22, -1, 0, 18, -18, -25, 5, -2, 13, -1, -14, -3, 4, 32, 15, 1, -18, -13, -7, 12, -5, 35, -2, -9, -9, 4, 8, 24, -6, -4, -11, -19, -13, 10, 14, 22, -16, -1, 0, -29, -6, 21, 3, 4, -52, -31, 1, 6, 29, 7, 7, -37, 1, -15, 14, 43, -6, -43]
4065d3K5L3K2nl5k0RK0K1J9m1m1k0K9L0M4on5l2J3RN8l0RLk6kl0M5j7M6J6n1n3
4099e6j2L9Q0N3m3j00o5K0J07R0kp1q9o8O1J26J%m9j15J7O1O8J8k4m8pl9K3RO8
4130E3Rl6m3k6k9M0N0Q9k2q8r5NP9P2N7n4j07m5K5N5J05k7m4o3k9J0P0N2k5j8
4160B0k2Kj6M0J4k2Mjl2J6k3J1M8K4m7l4Ok9L5L7Ol8l2J2J6L7j5j7K7m2L2j8J0
4193Il3KJ0K8jj1k2j4j2M2J2K2k9j7oJ7L0k0j4j2k3K7K3O%K7k4j8jmJ4NqK2l7
4228a0j4K2PL3mm9J5oK1pJ9j7j7J2J3K1om0k9K0J9K0oK1o5KJ1%OJ7Jm5Jj0K9N6
4264D1l8L0l2l8%L1K4K4kl0j3o2L7M0M4pn2l3l3N9N8Mrm8o1QK3N2K6k1p3J2K7
4297a2K5K3l4J2j0J4ppl3J7J9%K6mm6l2L1O3%po6k3K0L4N4m3ql8J4K5j0J1k1K9
$$ y = [-43, -18, 15, 37, 32, -3, -23, -14, 6, 27, 46, 5, -36, -56, -27, 3, 47, 41, -14, -46, -33, -24, 34, 4, 13, 16, -10, -12, -42, 3, -14, 32, 48, -3, -56, -68, -29, 51, 104, 61, -39, -104, -84, 23, 113, 111, 40, -49, -117, -56, 70, 71, 71, 22, -93, -76, -15, 53, 71, 47, -1, -8, -47, -24, -15, 53, 62, 26, -17, -43, -72, -32, 18, 107, 85, -3, -98, -93, -14, 58, 115, 61, -46, -91, -66, -11, 94, 67, 23, -40, -69, -59, 11, 63, 38, 20, -2, 0, -16, 24, 38, 16, 20, 19, -13, 3, -20, -9, 39, 63, 16, -18, -12, -41, -6, 31, 37, -1, -33, -21, -5, 32, 17, 0, 27, -15, 17, -1, 9, -24, -22, -12, 16, 15, 4, -18, -32, -44, -2, 10, 32, 3, -14, -20, -3, 27, 7, -7, -19, -42, -15, 8, 14, 14, 41, 17, -1, -2, -6, 8, 13, 5, 27, -10, -24, -2, 5, 38, 34, -15, 0, -6, 15, 8, 27, 10, -7, 5, 18, 39, 33, -7, -36, -16, 3, 23, 17, 38, -27, -25, -14, -14, -8, 9, 10, -35, -34, -44, -15, 41, 3, 33, 1, -37, -37, -6, 18, 42, 40, 10, -3, -65, -28, 12, 56, 49, -3, -36, -69, -10, 48, 52, 43, -5, -66, -58, -35, 17, 43, 22, -51, -39, -12, 13, 36, 2, 14, 4, 18, 11, 4, -29, -12, 7, 7, 33, 29, -17, -49, -18, 45, 45, 38, -28, -51, -31, 3, 57, 14, 6, -32, -18, 7, -3, 8, -13, 16]
4331A6ML5n4n5J6J4P6M4n2p2o6M4Q0P3Jj20r3k1Q7J09M7l9j03m8LM8R4J4m0o7
4361b5k2rN8K1J2J5j7k7n4nL1M1Q7n0m8j30L4R5R5N8j37o8r4N8R8J18m2j01r0
4390i8j5J08N5N0l0r4m4M0K1M4rk3j6k0j4MN4J8J1m9k7PJ0K5K7J3l3q6J6L8N5
4421C8J9k5q0j4JP0K3jj7o8j3K8P4nK0m5l5l4K5P6M4j2p3k3j6M4M6K7l8n6l1q
4453e9P1K4J6l2o8K3J1LN1j8rk0jj2oJ4J1N3k9l0n7L8M4K5j2k9n4j0K1N1K7%l6
4486An0L6J0L3Ml2k8OJ7NNjm6J9M0J0j7m1m4N2K5N7n2l2n6J1P8M6k0l7m2rJ3L7
4520bN0k4J3j9n0J1j0M4L9Rm3n0k7K1O4J1K3pr1m8L6J6J06J2n5n3n1J9M2R1k2
4551E5l4m5n0K1M3N0K3m3n1j8mN9M9k6pm5oJOK0L2J2k4k5j2pPN8j4Pj6l1j1RM4
$$ y = [16, 20, 55, 1, -54, -38, -24, 52, 96, 44, -28, -94, -50, 30, 103, 104, -16, -109, -130, -43, 66, 113, 74, -29, -77, -74, -26, 68, 82, 42, -25, -47, -56, 2, 23, 35, 50, 33, 6, -48, -53, -22, 19, 106, 56, 8, -122, -88, 7, 102, 160, 23, -45, -139, -81, 17, 135, 93, -8, -98, -113, -5, 50, 100, 70, -24, -68, -28, -7, 37, 28, 5, -11, -31, -45, -41, 13, 31, 42, -7, -34, -27, -17, 8, 35, 48, 15, -71, -55, -17, 38, 57, 32, -48, -62, -61, 9, 32, 31, 14, -54, -67, -39, 35, 30, 50, 5, -30, -64, -39, 37, 81, 69, -4, -27, -43, 1, 47, 74, 36, -20, -51, -59, 12, 36, 52, 20, -48, -25, -14, -11, 40, 22, 13, -7, -8, -20, -26, -12, -1, 52, 23, -7, -64, -26, 18, 43, 31, 2, -52, -62, -41, 10, 37, 37, 1, -49, -13, -3, 30, 34, 2, -26, -20, -3, 2, 7, 6, -40, -21, 19, 29, 12, -29, -73, -21, 4, 61, 9, -23, -79, -68, 10, 56, 36, -1, -43, -52, -39, -2, 48, 24, 37, 18, -32, -21, -31, 13, 52, 61, 18, -32, -59, -38, 26, 37, 60, 53, -38, -86, -50, -34, 72, 84, 29, -24, -75, -56, -14, 77, 55, 21, -24, -74, -53, -10, 40, 63, 20, -31, -49, -53, 6, 55, 29, 22, -23, -29, -28, -22, -2, 30, 42, 18, -7, -19, -26, -19, 39, 25, 32, 16, -15, -26, -17, 27]
4586B7JK1p6j5K1j2N8J2k1l0qOj8L7Qk2J1lk2qJ6jN1pj1k7m4kN4Q2k3n6m8J9Q
4621b2M4M3ro5o9K3K4N9j9J0l0l4JL6M8rkl8m9OM5K2Lk4k6rJ6J5M6j5j7o2L5K8
4655ENN5k5l5%l3L5L7Mk5om9k2M6J7O1qm0q3j2L5J11L3m6q7p2qQ5R8N0q8j48k1
4688a31J4J46P4j2r0p1J3N0M5J9Rp0lj9JrM8N5j1k5o7k5L4N3P4mq6j19nO9J15
4719G2P7q7j28m4L2J27K7Or5r2K5P3O5k8j8o8K8M0J0nm4RM1K5k3k4j0l8J6O0K5
4750E4m3o2K4K6N1pq6NJ1M8K4m1k8j6J0P5J3n1p2l4O1J05kl4o7m6M3O4N4k2p3
4781a6n3lP2J6L1kn0n7K0N5K2k0J4m2k0j2K5L3LJkl4m5K8L9L4Pk0p0k3K1L3P4
4814E9j8n0n3L2NL4K6J5m2l2j5L7Rj4K7j9k9J0K5MK4j7Ol3lK5nK4k9j6Rj2O0j9
$$ y = [27, 28, 49, -27, -42, -21, -33, 25, 37, 16, -14, -22, -16, -34, 3, 11, -11, 0, -3, -25, -33, -17, -18, 33, 26, 15, -12, -56, -58, -4, 78, 55, -1, -49, -30, -22, 22, 65, 56, -9, -78, -55, -31, 28, 9, 19, -11, -45, -44, -8, 40, 31, 29, -9, -58, -52, -7, 15, 18, -6, -32, -41, -25, -10, 36, 21, 4, -58, -23, 5, 10, 65, 40, 5, 5, -28, 7, 44, 48, 23, 17, -32, -54, -8, 9, 70, 62, 22, -61, -73, -38, 73, 106, 60, -27, -99, -107, -22, 76, 126, 38, -110, -131, -117, 29, 103, 91, 1, -70, -57, -7, 38, 57, 66, -4, -7, -26, -25, -34, 14, 69, 58, 33, -34, -59, -25, 28, 102, 98, 12, -107, -112, -43, 72, 149, 62, -66, -110, -78, 49, 76, 82, -13, -105, -80, -7, 58, 30, 12, -56, -28, 12, 22, 17, -27, -18, 23, 48, 25, 1, -9, -47, -31, 29, 54, 11, -51, -27, -1, 50, 43, -43, -38, -27, 21, 45, 4, -24, -40, -30, 45, 58, 7, -65, -99, -38, 67, 65, 31, -36, -82, -39, 25, 79, 57, -16, -69, -72, 0, 16, 47, 45, -5, -62, -42, 13, 35, 15, 29, -13, -33, -45, -20, 13, 16, 17, 15, -19, -64, -36, 3, 37, 44, 24, -46, -69, -48, -15, 59, 41, -9, -62, -30, -25, 9, 35, 50, 8, -24, -39, -2, 7, -7, 20, 1, -28, -18, 7, 11, 35, 18, 24, -9, -12, 13, 8, 32, 3, -13, -4, -16, 44, 25]
4848B5j9k0rJ0K5j0qQnroK1kMK0m2RpJ1K6k6L4j8m4L2PJK9Lm0j2k6L6J2J0RQm2
4886ej9qJ5M2kj6qn6ML4L8nk9J1kqJ2NOj2J5Mk5p1O5M0K2jk5p1n2R7P5Rl6n4p1
4923h2K4K7J15ql2r8k8L6O7Kk4J0l6lnK4NpM8j1l8l6j2L1R1K9l6p9q1L4J02O5
4955I4Lr7r6pR4N6O0n5r3m0K0P5M1j4l1m9QKO5j6j2k1OK0j9k3k8P0J3J1n1n0q
4988g2M2N6%K9q4j6L5O4K7n3m9k9M5N6K7m5o9J7qM7M5l0n2k9K6L7j2L9j7m5l3
5019e1M1N0lj4m4K4l4J6J0J8j9PJ1k4k4M9J6j2J5l9j8j3M2rL4J5l8k6L1j4K8J2
5051C7j1m9j1K3%J5QJ2m3k3L0N0jj6l2m6J1L8K2L7m3j3m7O1L6rj7n8nM4J7J6l1
5084Bk1kL2KK0lm6jJ1oj9L2j0M5qk9m3J5JL2K7j1m8k0j8M8M4L0m8l6k8J3Q4L5
$$ y = [25, 6, -14, -23, -13, 12, 2, -6, 2, -3, -12, -18, 3, 1, 5, 25, -17, -8, -15, -4, 22, -4, 30, 12, -32, 0, 7, 8, 37, 40, 0, -12, -38, -2, 10, 20, 29, 37, -5, -24, -32, -17, 25, 23, 7, -1, -57, -53, -19, 19, 14, -15, -4, -6, -14, -2, 3, 9, -3, 12, 16, -9, -80, -15, 25, 47, 46, 21, -50, -102, -5, 70, 79, 43, -11, -82, -58, -31, 84, 76, 44, -54, -82, -46, 21, 23, -1, 9, -27, -30, -35, -11, -6, -13, 35, 24, -14, -50, -62, -31, 60, 89, 53, -26, -107, -73, 29, 94, 97, 0, -96, -103, -9, 47, 107, 52, -41, -81, -61, 14, 55, 41, 10, -39, -31, -29, 36, 20, 8, -13, -7, 13, -6, -29, -57, 13, 26, 37, -14, -64, -72, -30, 26, 26, 55, -29, -45, -10, 54, 81, 28, -21, -50, -5, 51, 78, 33, -36, -19, -27, 20, 65, 35, -17, -46, -20, 17, 5, 44, 27, -18, -51, -10, 40, 37, 23, -21, 3, -31, -15, -5, 13, -6, 1, 12, -12, -36, 13, 29, 17, 32, -7, -25, -38, 4, -5, 29, 44, 6, -20, 11, -3, 25, 37, 26, -23, -34, -11, -11, 4, 12, 24, -19, -42, -12, 38, 37, 21, -11, -57, -46, -8, 14, 51, 8, -5, -52, 9, 45, 36, 19, -39, -44, 0, 17, 33, 2, -19, -21, 11, 13, 33, 30, -16, -17, -6, -12, -31, 1, -9, 36, 28, -1, -44, -29, -28, 4, 31, 20, -28, -48, -66, -18, 26, 56, 8, -28, -56, -43, 41, 76]
5118G6k4k9n9j7N0M2J7m6mrqJ6j2K1J3Kl5k9JK8nO0lk4n1k0K0L3L1J3n2k5j9K7
5152b1M3L2lp2KrJ0L7%K3l8j6P%K1qN0m3qJ9n0M0NPk0J6lm0pRM0j3JJl2k0K0M
5190a6N8k6k7l2K6K5K6j0pk7j8PL8k1MjnpJ1K0mJ8j9Pj5K8k9k0K5k0L5l3Oj1J8
5225DJQk1j0k0J8M1j2Ll8oM1j6RK7m3K1l6J1M6Nk1k0J7k2K2J4j6JLl1J5M0Pll5
5261Dk5K2j0M6k1rl1J5k1L7mJm4J6K7mrl2J6K7K0Jm3m1N5lM9Qm3m3j5L1N0K6m6
5296Gl7k1O5N7j4l0m4k4M9K6kl1n1L2K7K4Nn4n2N7pP3j6n9l1QN9K0%o7j8J1L3
5329eN4n2k0JQL9K3m4n3nO6O4Qp0p2j9O6O2N0r3o8M%J00M3m3q3l8L0N5M9k6m9
5362a8l1O2%Rj8j6NJ2L7k9j3n0O0J8J5j2n5m8NJ00K2l8k6l0JN4L5Mp8m0J3K0P5
$$ y = [76, 52, 23, -36, -53, -3, 39, 56, 10, 6, -3, -11, 5, -7, 14, 27, 29, -6, -35, -34, -6, -11, 49, 46, 22, -29, -49, -29, 4, 35, 48, -4, -29, -48, -21, 22, 54, 51, -21, -19, -28, -18, 19, 19, 42, 4, -12, -5, -5, 16, 8, 58, 15, 7, 26, -24, 16, 21, 28, 8, 24, 21, -19, -26, -17, 23, 10, 11, 12, -20, -40, -20, -16, 42, 16, -11, -43, -17, 8, 34, 24, 17, -10, -28, -21, 17, -4, 0, -1, -6, -13, -2, 18, 14, 32, 13, 20, 5, 33, 4, -16, 9, -11, 24, -9, -3, -14, 4, 5, 13, -8, -18, -38, -20, 21, 9, 12, -26, -32, 9, -7, 2, 29, -14, 7, -29, -18, 28, 33, 12, -8, 9, -13, 9, 23, 7, 8, 11, -20, -5, 35, 42, 39, 4, -21, 1, -9, 37, 16, 7, -24, -9, -30, 7, 3, 4, -40, -24, 3, -1, -10, -42, -26, 1, 21, 22, -21, -62, -7, -10, 39, 47, 4, -39, -54, -23, 27, 53, 7, -30, -51, 14, 71, 57, 27, -17, -41, 8, 34, 32, 1, -50, -18, 9, 33, 38, -16, -68, -11, -18, 55, 39, -20, -51, -43, 16, 36, 36, -31, -49, -38, -5, 49, -3, -23, -22, -14, 25, 48, 4, -49, -54, 12, 76, 84, 14, -58, -77, -11, 51, 101, 8, -60, -56, -56, 44, 87, 44, -39, -77, -47, 8, 57, 31, -18, -49, 13, 13, 22, 4, -12, -7, 5, 42, 13, 0, -50, 10, 28, 43, 31, -24, -72, -67, 33, 55, 17, -9, -39, -38, 16, 51, 55, -23, -63, -50, -30, 45]
5395D5Rn7l3j4M1M2j6Mj8l3K6jk2L7l6MJ1OK0l6kJ9PJ9l2pJ1K6J5mj0l2J4k1N0
5430C2k0J4l2k7J3M3k5QOn4LK0N2m3K7plJ9l3J6J7k4j4JK0mj6%K5k8J9kkmoL4
5466B5l3J8k3L2ol9L4j%j4K4k1NJ3omj9lK2j3jKPJ1j6qK6J5j8rpOlPJ1j6j0j4
5504b6J6oK9nl2K6L4j2Nj7ok2K4%j7Rl8K0J2J4K3k8j3kKK6Rk6m8L0J7L7%m4j1
5539b0j7N4J7K2o4oJ1OM2k8j4n4L0L9Jok3mRJ1M9j9m5k9LN4J0%l3m4J1O5J6l0
5573A4k3m2K8N1K4k4l1k5nN9J0l2ol9M1M0J7m7m9JN8J6Ql1k1j3PM8Qk1n6oL0M5
5607C4mn0nrK0M2K1o8j4J0J0J6K5l7nj8OL5J2k6k0J7L4pK3pl7MJN3m0k5J1k3L5
5642A4LRl5K0lk3L1Jj5jj9K3Orj8OJ2j7J3j3L0j3J2j7QRK0k0k3l5L2K2K2K7n8
$$ y = [45, 54, -3, -36, -50, -9, 33, 17, 21, 3, -30, -4, -5, -27, 10, -26, -22, -11, -5, 15, -21, -23, -4, 3, 22, -10, -17, -6, 20, 35, 31, 21, -11, 3, -18, 32, 12, 26, -6, -33, -20, 23, -2, 6, 12, -42, -39, -19, 33, -10, 17, 10, 7, 26, -7, 9, 26, 2, -12, -11, 9, 5, -11, -11, 14, -14, 5, 3, 1, -3, -9, 25, -8, 10, -13, 19, 13, -26, 8, 7, 7, -7, 17, -4, 1, 14, 8, 4, -15, -18, 4, -9, -10, -8, -1, 10, -6, -14, 12, 27, 9, 0, -7, -1, -4, 3, 14, -2, -12, -26, -10, -16, 13, 8, -24, 2, 36, 24, 29, 12, 6, -16, 8, 8, -9, 0, -38, -18, -6, 8, 31, 3, -10, -12, -10, 16, 25, -1, -49, -19, -2, 35, 35, -9, -20, -37, 17, 34, 56, -8, -14, -3, 3, 45, 17, 3, -51, -21, 18, 19, 13, -10, -14, -5, 6, 55, 36, -9, -38, -35, 19, 29, 29, -4, -48, -37, 28, 44, 14, -9, -51, -23, 28, 52, 28, -3, -28, -33, 26, 36, 4, -2, -41, 0, 40, 57, 10, -39, -38, 20, 36, 44, 13, -8, -21, -14, 34, 42, 21, -35, -41, -11, 34, 30, -20, -25, -34, -14, 28, 49, -19, -33, -23, -13, 3, 28, -9, -14, -32, -26, 9, 21, -5, -25, -8, 26, 19, 42, 35, -2, 2, 3, 56, 16, -9, 2, -21, 14, 17, 26, -9, 11, 8, -15, 16, 17, 2, 1, -18, 5, 11, 2, -16, -10, 2, -15, -2, -15, 15, 2, 14, -3, 5, 14, 34, 14, -9, -44, -12, 10, 32, 59, 1]
5677AJ7k0kJ8PJm9L2J5j3Om5K1J1K7l4K4m4L0mJ3j%j3k4J7M3j3k9j6Oj1J4N5l5
5712Enl1N5J0Km4Jj3K0M2k2%m6mO8j2mj4k0l1L1K2NJ5l7j9J5L1Krj4j5K1J2Qj6
5748Ik0lK0J9pm4oK3J7J1Kk5j7J7J1J3Oj0n0J1J3pM2k0J0k3kJ4JJPl4M7k7oNK9
5785B7l9M7m2J3%jmook4L1j1K7k0J4K5k4K2m8M0j4mlK4m1%%L4j5J7k8j1J9j4K3
5820Hj0j8K0mPJ3l4J7k1J7LNooj0K0J6Njrk9jK2K0j6J6m3j7N4k0OMJ4l6qJ9kr
5858a4J6J0k6mMLK2k0k0rL9j9K1Kk1QmK0Om5L4Qj5NNl0K8J5l1K5k4j2K3K6J2J
5894C9n0k0mO1PJ6l9n8j0L0N1Oj6n7j7L0N9jql7kOM2J9k7k7k5M8J3l4j4kK4M9
5928E2Mn4l6LK6M2K8k1r1j5PQ3L0jp8n1L9N0L7j9l6o9K1M0N6on3mk0J4L8om0j5
$$ y = [1, 18, -2, -4, 14, 21, 22, -27, 5, 20, 7, 13, -32, -11, 0, 27, -7, 17, -27, 3, -1, 12, 11, 11, -2, -26, -9, 34, 21, -8, -24, -18, -29, -15, 40, 5, 0, -31, 24, 34, 36, -8, -7, -20, 0, 42, 20, 20, -26, -30, 38, 26, 22, 8, -12, -43, -12, 10, 15, 30, -7, -26, -11, 20, 22, 13, -1, -16, 5, 17, 25, 9, -11, -14, 6, 25, 18, -26, -32, -9, 8, 19, 21, -4, -21, -4, 7, 20, 26, 16, -34, -23, -10, -17, 25, 5, 15, -8, -10, 4, 5, 6, 13, -21, 26, -1, -7, -2, 27, -12, 35, -7, 6, 6, 5, 1, -5, -11, -35, -4, -15, 12, -8, 6, 31, 7, 29, -19, 21, 7, 3, 0, 24, -17, -17, -17, 17, 2, 19, -9, -20, -1, -15, 8, -2, -20, 0, -4, 3, 16, -18, -1, -22, -5, -2, 3, -3, -9, -19, 1, 17, 22, 21, 12, -17, -18, 4, 24, 8, 24, -19, -36, 18, -2, 4, 8, 22, -14, -22, -3, -5, -14, 2, 12, -14, -18, -14, -11, 11, -9, -29, -38, 1, -18, 3, 5, -16, -8, -12, 8, 14, -31, 3, 11, -4, 1, 6, -24, 4, 19, -12, 13, -11, -23, 0, 26, 38, 39, -11, -31, -35, 26, 33, 49, 10, -48, -58, -28, 23, 29, 13, -44, -61, -31, 28, 27, 19, -18, -20, -14, 28, 47, 20, -7, -32, 16, 29, -5, -19, -21, 3, 52, 56, 2, -34, -31, -5, 37, 65, 44, -47, -62, -55, 28, 58, 57, -21, -72, -33, 17, 54, 35, -1, -70, -49, -9, 47, 41, -12, -16, -36, -22, 16, 10, -30, -45]
5962d5L8L3j2Ko0K0M5J9J5n2m5k6P8P3k2l4p8QN8K1%l5l3pK2N5jj1p4MM3M0j0
5995B9l4n3J8M4K3Qk6m6OJ6N6k9Nk7k1L5%jkJ2j1K0Rk3Jj8rN8Mo3k0J5J5N2k7
6030A6km8LK4J4N2m1n5pK4L0L5rk7l0RJ7pK6J2l1J8l9QK4j1J3nj2LJ7mk4J7kp
6066ARKjl1pJ1J5%Kjj5K1k7J1L5l7OqK2k9Oj4K1K7%j9k3J1M4n4J8K8J8l7j8OM
6103cM9k3k9j7pLK5K1Ol5roJ1RM9k2k2nk5J1jJ6OJ4k9L7k0j1rKL1Lpk5Jj9L9M7
6141E6qk1n0k5K4K9K5mm0K3k1K7K8m7J8j4j6mPK5j9J6Rlj2n7LM1M5K1m4m1n0L3
6175d6R2K2kq0m9jP0N9j4j7o2l5K3P4kK5m7j8%J2j2QKJ0K4m0%n8O7j6N6j3l9l6
6209d3PM9K4Pl9l6k1L3P1k2Qp3oM5L5ML4r7nK1KK9qj5k8QK7Qj0j1oj5L5J5j0n
$$ y = [-45, -7, 26, 14, 16, -44, -24, 21, 40, 55, 3, -42, -68, 10, 83, 61, 27, -51, -43, 15, 36, 36, 1, -32, -39, -17, 38, 37, 26, -48, -44, -1, 39, 29, -5, -58, -40, 4, 27, 35, 9, -37, -31, -15, 41, 12, 17, -10, -31, 4, 4, 3, 1, 13, 2, 22, 31, 8, 9, -9, -18, 40, 44, -19, -39, -24, -9, 43, 16, 14, -34, -31, -7, 7, 59, 18, -37, -44, -20, 10, 45, 36, 9, -21, -12, 5, -2, 24, 36, 5, 23, -16, -8, 16, 5, 18, 13, 1, 4, 21, 17, -7, 10, 8, 1, 10, 12, 11, -20, -27, -16, -1, -1, 1, 0, -15, 6, -21, -10, 25, -12, -6, -14, 8, -21, -15, -29, -8, 19, 19, 0, -23, -12, 32, -22, -4, 24, 42, 5, -13, -7, -3, 46, 23, -6, -23, -30, -27, -2, 19, 25, -10, -19, -25, -14, -5, 44, 22, 0, -5, -30, -19, -20, -4, 2, 16, -13, 24, 4, -7, -16, -14, 17, 20, 13, -12, -11, -30, 9, 56, 48, 27, -23, -48, -24, 5, 30, 26, -14, 9, -12, 15, 43, -4, 14, 0, -16, -20, -13, 12, -7, 9, 18, 15, 3, -54, -51, -10, 35, 56, 12, -29, -79, -46, 46, 68, 66, -14, -63, -64, 6, 65, 51, 34, -28, -63, -40, 34, 32, 57, 10, -8, -8, 4, -8, 0, 2, 12, 36, -4, -4, -62, 5, -11, 45, 32, -7, -43, -36, 13, 37, 44, 5, -31, -52, -19, 52, 30, 38, -35, -41, 4, 39, 43, 77, -20, -25, -4, -2, 27, 19, 4, -24, -16, 11, 19, 9, -2, -8, -23, 12, 27, 17, 12]
6245A2k1J0L3m4pNRK2k4jnj3RK5nQ%j8OK3J5%Jl9k4K1PK2Mrn3JM1L1J8m1k9mk9
6284d3L7L5j5k6Mk9K9J4Pql3J0J1QJ1Jl5K3NL9l8nj4k1L2L0k2k4QK5Lj1J0k7o
6319a5L9jOj9k0l0O2Nj6K7o1j4N4J8J3k8m2k5K9L6M6j9l4l5j9M3J2K3j2qj9jk
6352gK2j6N0k6k3o%OJ8J0k8J0l6j0K6L3PJk1p1J8M4L1pk5jl6K3lPK0Rl0k0K0J6
6388EkL1qJ2m9J7jokN1n7K4Mk1QJ3mj2LJ1k2kK1j4K1l5j3j9K4K7J3j0k3J5k1J9
6424bJ1QNj8%%j9M9l0K2j5k6oj8P1j5kPj1m0J8PJ0K9nk3jk4J9Pj3K2j8Jm0M0K8
6461B8rj2pj3kOJ1j8M1k9j5N1k4M0k2l1k9M4K0j5RKm3L1n3M1L0l0K0l2J6k5N0
6494C1l5K0K3k4l9j1J5J0J9kj2l7j5M0N3Mqo3MMM1M8j9m4l3K3ML4K9n5k0QqM0
$$ y = [12, -9, 1, 34, -10, -17, -12, -3, 19, -5, -6, -11, -24, -15, 10, 5, 13, 13, -5, 1, 24, 39, 39, 40, 1, -23, -2, 5, 27, 31, 22, -31, -30, 11, 42, 60, 19, -10, -14, -43, -6, 29, 14, -12, -8, -37, -8, 6, 13, 5, -28, -18, -7, 1, 12, 13, -22, 1, 6, 45, 7, 2, -12, -33, -1, 29, 7, -17, -9, 16, 19, 8, 18, -9, -15, 24, 23, 29, 10, -10, -40, 22, 27, 11, 38, -23, -37, 17, 35, 48, 20, -22, -47, -18, 18, 64, 45, 11, -24, -43, 0, 12, 35, 23, 15, -4, -5, -7, 15, -1, 49, 23, 0, -6, -6, 0, 18, 28, 0, 10, -26, -36, -10, 23, 30, 31, 10, -61, -43, 1, 32, 25, 0, -1, -37, -14, -17, -10, 10, 19, -11, -31, -11, 5, 3, 34, 26, 38, -11, 6, 5, -1, -3, 48, -9, 15, 19, -2, 6, 19, 15, 3, 6, 17, -5, -7, 14, 0, 21, -14, -27, -46, -22, 5, 18, 8, -15, 0, -21, -2, 9, 17, 22, 4, 4, 4, -15, 34, 4, 26, 11, -15, -21, -39, 32, 17, 15, 22, 11, -29, -11, -4, 6, 35, 30, 7, 6, -18, 1, 8, -5, 17, -1, 0, -40, 0, 28, 19, 7, 0, -13, -15, -9, 2, -16, 25, -4, -19, 32, 8, 48, 26, -5, -34, 10, 30, 15, 24, 26, -17, 14, -39, 2, 32, 2, 22, -10, 6, -19, 31, -4, 16, 39, 15, -24, -35, -20, -10, 9, 7, -5, -42, -57, -17, 36, 40, 32, -31, -27, -23, 18, 66, 47, 3, -30, -7, -3, 31, 60, 5, -15, -7, -15, 25]
6528B5j9L2l3l3K7L7k4k5%J6J6k8K1loj0RRk2qoK1LM6n7rOjM7j5j6l1KM4J4Ok0
6565A5l3pK5M7lm0j0l1J4N8nKm1onM7J7n2kJ8j4L7l4Jj8K6lOj6nl0N4L0l5j7j6
6601b6K1kN0ml2l8JNM6N3k6l3l6k1J6O3j6j4k6j9QK2L2Lj4Km0K5J7k4nK3Lk2M
6636dJQJ4J9k4l9RK4j4K2LJo8L7RJ9K0Lk6j4k0JK3J6j0nk0K4KKk5rL0j1J5j5q
6673a0PNk8Nj3L1K7j6k9K0j2k5O2j8J6mlPMLj6j2J7rl0M0j2mJ2j9K3j6JMj2JO
6710CrK3l4NJ7j7L2k3J0k7J0OkJ2jlj8K0KQNmPk9J9k3K7K1km1nmQM7m1K0j3j6
6748a0l5N3K0LKl6nnj6J7K2qj8k0L5POj0J0k8k7L3pN9l2k3L0Qn5O1m7RM3k5j4
6783cRl8K7L6j0k0j5JJ5K2j2j2k6NJ6L2k0J7k9l4J8K2OJrl0M6k2QK3k9j1K8o%
$$ y = [25, 6, 38, 5, -28, -1, 36, 12, -13, -13, 3, 19, -9, 12, 9, 3, -7, 2, 11, -11, -19, -25, -4, -1, 45, -12, -21, -15, -16, 31, 16, 0, -31, -29, 15, 29, 35, 15, -18, -25, 0, 47, 44, 4, -6, -37, -23, 35, 30, 32, -9, -15, -20, 27, 44, -8, -10, 8, -6, 31, -3, -2, -20, 6, 3, 9, -7, -12, -42, 12, 42, 7, -10, -26, -5, -7, 43, 39, 7, -31, -30, -25, 21, 74, 48, 15, -21, -42, -26, 37, 21, 7, -19, -38, -30, -8, 24, 27, 13, 15, -25, 0, 17, -7, -12, 11, 14, -8, -4, -3, 5, 19, 38, 14, -25, -16, 8, -6, 16, 19, 20, -48, -11, -2, 17, 37, 40, 14, 0, -20, -19, 4, 20, 10, 5, -15, 9, 11, 13, -12, -21, 9, -2, 13, -2, -10, -3, 2, -26, -21, -34, -3, 24, 8, -21, -1, -13, -38, 24, 6, 22, 18, 15, 22, 26, 29, 13, 1, 18, 9, -21, 19, 7, 3, 15, -4, 19, 3, 4, 8, -4, -3, 3, -6, 17, -17, -12, 5, -12, 20, -3, 7, -20, -10, -4, -6, 6, 5, 2, -16, 4, 6, 14, 19, 15, 22, -7, 12, -11, 16, 37, 35, -6, -11, -15, -7, 40, -1, 19, 6, -10, -45, 8, 28, 31, 33, -3, -8, -13, -29, -12, 10, 2, -16, -36, -1, 6, 12, 2, 12, -16, -43, -10, -17, 42, 10, -13, 17, 25, -30, 31, -16, -7, 36, 11, -3, 6, -32, -5, 31, 21, 1, -14, -13, 2, 24, 12, 0, -26, -21, -5, 27, 7, 24, -5, -39, -21, 1, 7, 8, -1, -31, 15, -7, 1, 24, -5, -16, 12, 6, 6]
6818FmJ0NQk4mK3j6J6k5j4K4nl7K1K8k1Qk1J9jJ5j8Lj1k4L6j4J1Qpj8K6LqJ3R
6855B0j3j4J2j1K3j5L2l4QkJ2j6J0j3J2k7J8j7L0J1l1mnj7J5K3j0Jj5J6l9J4K5
6888aojmkl9N2J2J7k5Ql0K3L8ol5qLRJ6mK7n4J2j1jnL5k2Pjj7J9QjoQk9j6J4n
6928b1K1k5L5j7Nk2L3j1L2j3j7j7J6j0M6k1j3k3J6K7pJ7k7Ol6L8oL7n0NmL3j9
6961Hoj2mQj4J1Nj3ML0k1J2j1mj6J7j6L7Ml4QlK7mJ6j3nNJ0rQJ1k6qj1pJ3k5K2
7000fK1j8Lj1J3nqjJ8j0Lmj5NK9j3lMkj0rM6j1l8L1k0L9oMk2%l7L5J1J8%l2pJ6
7039Hk9K6POj3Kj8j2L5rk4M1j3j7MJ6j0mK1l2mL7n8K5K7J5k9K6k9J5K0m6L3Jj6
7074BJ1prJjj6%J8Nj0Mj1NRNpJ2k8KK1j6K1j7Ok5J1J6l8M6NNk3Pj2OL7l4J4k7
$$ y = [6, 2, 12, 17, 25, 1, -3, 20, 4, 20, -5, -19, 5, 0, -37, -16, 12, -9, -1, -22, -3, -4, 11, -7, -4, -15, -39, -3, -17, -6, 2, -5, -23, 3, 6, -2, 11, 20, 7, -7, 5, -6, 17, 2, 34, 0, 8, 6, 18, 2, 12, -1, 11, -16, 2, -15, 15, 26, -5, -9, -14, -31, -16, 7, -3, -2, -17, -1, -40, -26, -1, -7, -8, -12, -14, -53, -1, 11, 28, 3, 11, -19, 4, 42, 36, 1, -7, -4, 5, 21, 17, 44, -10, 2, -9, -10, -15, 20, -2, 5, 4, -13, 6, 14, 13, 7, 15, -14, -30, -16, -21, 0, -25, 10, -7, -2, -24, 9, -2, 30, 17, 0, -17, -1, -11, 35, 14, 1, -22, -6, 21, 14, 31, 4, 10, -26, 12, 6, 43, -7, -2, -6, 27, 8, 2, -10, -14, -6, -20, -9, -4, -17, -13, 17, -4, 8, -3, -7, -23, -6, -22, 15, 19, -15, -7, -10, 17, 13, 29, 16, 11, 16, 26, 17, 25, 36, 10, 2, -9, -16, -3, -28, -6, 15, -3, 0, -11, 2, -3, -11, -12, 6, -4, -1, -5, -20, -15, 14, 1, -2, 2, 0, -10, -19, 27, 16, -22, 9, -11, 28, 22, 26, 4, 4, -33, 2, 13, 31, 31, -1, -8, 8, -21, 5, 12, 18, 5, 7, -11, -23, 12, 3, -21, 20, 7, -10, -6, 10, 0, -4, 17, -15, -19, 18, -40, -15, 12, 27, -2, 24, -5, 10, 30, -16, 17, 18, 2, 13, 6, -3, -2, -3, -19, -19, -1, 4, -6, -2, -13, -8, 1, 6, -1, 11, -17, -15, 6, -10, 11, -6, 0, -25, -14, 2, -36, 10, 15, 20, -3, 4, -8, -2, 35, 1, 15, -12]
7113a2K7l4K3j2%J6j8LJ2k2J5nJ6k6K1j9J4J0nj9j4J7L8k1%k6l9N0J1L0j1j0k9
7146a9Lj5J1N4k5L0m4j8K3M4j2J3k2j9oJ5J0lJpj3k6QPJ6%ql7J4%L6K5j5k8k0
7181b7l0M4J9M0j9m8j8JJ9M0J8mm0j9L6J5j3RnojMl1J4%K1Oj4j3j9kJ6M9l4rl9
7217d0J3L2L1j6k1k4k1L3L2j4Rj5pPJ6K7k5n0J6KMK8l2J2K7%pj2K7j1j9MK8m2
7251hK5j6j1K2j1j4K8l3rJ9Jj1LOJ5j0rPJ4k4J1K2J5k8j5M0k2k6N7j5k1J3l0K2
7285GrQPQJl8L2j4mJPJ4k1J7rj5KOPl2K6J1k1J2J1k4J7j1J7m3K5jJ4K8k5l5L5
7322A1l0KL2k7RNJ1l8L3l9M9pj0onrJ3K4JKk6J3j0%k5N6k6jl1j2J3L9J8J2n2k3
7358c4jM2%jMNk7qQK2JK2l1j2L6j5k4MK1L5k8mm7RJ2L0J0k2l4%L4J1J6m0J5m8
$$ y = [-12, 15, -19, 4, -8, -8, 8, -10, -7, 5, -17, -2, -7, 9, -17, 4, -15, -1, 9, 4, -15, -29, -12, 26, 5, 5, -21, -60, -10, 1, 31, 20, 10, -19, -16, -31, -20, 34, 9, 39, -5, -23, 0, 44, 32, 45, 23, 4, -2, 13, 23, 20, 21, 14, 1, -25, -17, -10, 6, 6, -2, -39, -25, -25, 11, 36, 21, -7, -27, -57, -13, 6, 46, 27, -21, -39, -38, -19, 21, 39, 35, -5, -24, 12, 27, 14, 23, 18, 12, 11, 15, -16, -2, -2, 19, 25, 11, -2, -21, -23, -7, 42, 8, -1, -40, -27, 5, 36, 20, -1, -25, -46, -13, 19, 5, 14, -1, -8, -1, 15, 42, 17, -33, -17, -15, -11, 17, -15, -3, 24, 24, 17, 5, 32, 21, 2, 6, 34, -8, 17, 1, -10, 12, 1, -13, 15, -18, -27, -8, -7, -18, -15, -9, 6, -4, -13, -6, 8, -16, -5, 17, 32, 4, -11, 29, 7, -19, 38, 23, 2, 15, -15, 7, -2, 6, 13, 21, 22, -16, 16, 2, -2, -1, 6, 20, -1, 16, 7, -8, -6, 0, 7, -25, 1, 12, -9, 3, 14, -10, 7, -4, 13, -30, -5, -6, 8, 36, 11, -24, 11, -19, -17, 15, -12, -3, 2, 13, -25, 8, -31, 18, 11, 1, -5, -10, -19, -6, 18, 19, 21, -5, 8, -2, -2, -27, 29, 3, 2, -29, -41, -28, 11, 29, 41, -11, -34, -35, 7, 7, 6, 10, 15, -12, -20, -12, 10, 11, 33, 2, -10, 26, 11, -13, -9, 12, 47, 19, 15, -32, -23, -11, 19, 29, 7, -27, -27, 7, 18, 34, -6, 9, -39]
7394c9L4k2K9%LmK5k4OrMJ3Pmk6ljJ4J7J7j1j4o7J8J8N7Kk4o0JJ9M7Rok9k2j2
7431c7K7NNK1j2k1jk7M4J0NOj8m4J5L9jPml8j6J2K0K9K1j9m4l5K2L9L6Jm0j6l
7466a2jJ5J7Pk6j0l7N1J1lNl6k8K0J3M5k5k1Ml2J7N8j6J5j9k6J0l3P0mmk3j3j7
7500b8K4rM1Pl5%k1nK8J6J6l1l7l2M8J1M9Jm5k8m7M8K6L1J0o8j9lN8J8j8Mqk6
7534b4%J0K5j8nM5Mk7k2j5L2L9k6k6pj4PPK6Rj1k8pL1k0L3l1j1M4pl3NjJ2LL1
7570C0kJo2k5O6J1L8l4m1k2RO1J9j3l3Mk5l4N2K7Pm2Lj0LkK4L3nn6j2pjO9l%k3
7607En2J3J3K8K9oj5m5k2L6L2L2mk8k6l4K0N5Pmj3k8pLjM1l5j1mJ2RnL8k1Nk4
$$ y = [-39, -5, -27, 2, 2, 5, 1, 26, 2, 8, -1, 3, 16, 23, 19, -7, -10, -11, 3, 20, 37, 26, 12, -55, -37, -19, 38, 40, 16, -44, -43, -24, 23, 32, 26, -3, -25, -37, -10, -5, 0, 21, 9, -12, -13, -40, 4, 14, 19, 25, 7, -37, -22, 17, 16, 23, 19, -19, -35, -23, -3, 26, 47, 28, -16, -51, -29, 10, 46, 47, 7, -9, -12, -13, 2, 19, 26, 0, -10, -47, 4, 15, 12, 17, -19, -47, -27, -14, 31, 6, -15, -11, -43, -26, 32, 16, 31, 12, -14, -4, -37, 33, 29, 25, 2, -11, -28, -4, -13, 28, 35, 0, 0, -21, -26, 2, 18, 34, 3, -34, -66, -18, -7, 42, 43, -2, -30, -77, -29, -3, 28, 38, -30, -49, -52, 6, 24, 6, 10, 2, -24, -24, -14, 11, -7, -12, 33, 37, 10, -12, -27, 5, 44, 18, -8, -15, -29, -22, -15, 11, 20, 9, -19, -26, 5, -15, 18, -13, -24, 20, 13, -20, -15, -16, -4, -1, 30, 28, 29, -33, -58, 8, 19, 57, 23, -18, -40, -31, 30, 49, 36, 3, 7, -18, -52, 0, 27, 34, -8, -5, -15, -12, -14, 10, 43, 38, -18, -30, -37, -38, 31, 28, 28, 5, -47, -34, -21, 7, 36, 30, 15, -30, -52, -16, 16, 48, 44, 16, -10, -44, -24, 31, 38, 34, 21, -7, -14, -11, -12, 29, -6, -17, -21, -9, 0, -5, 33, 12, 17, -7]
$$ [...]
8191e2
##END NTUPLES=NMR FID
##END=
