##TITLE=1H_AM_NV 64.2
 
 8 sc, 
 23.10.2023
##JCAMPDX= 6.0         $$ Bruker NMR JCAMP-DX V2.0
##DATA TYPE= NMR FID
##DATA CLASS= NTUPLES
##ORIGIN= UXNMR, Bruker Analytische Messtechnik GmbH
##OWNER= root
$$ XWIN-NMR		Version 3.5
$$ Mon Oct 23 14:12:08 2023 Russian Standard Time (UT+4h)  she@DPX200
##.OBSERVE FREQUENCY= 200.13135
##.OBSERVE NUCLEUS= ^1H
##.DELAY= (6, 6)
##.ACQUISITION MODE= SIMULTANEOUS
##.ACQUISITION SCHEME= undefined
##.AVERAGES= 8
##.DIGITISER RES= 18
##SPECTROMETER/DATA SYSTEM= spect
##.PULSE SEQUENCE= zg30
##.SOLVENT NAME= CDCl3
##.SHIFT REFERENCE= (INTERNAL, CDCl3, 0, 15.7039)
##AUDIT TRAIL= $$ (NUMBER, WHEN, WHO, WHERE, WHAT)
$$ ##TITLE= Audit trail, XWIN-NMR		Version 3.5
$$ ##JCAMPDX= 5.01
$$ ##ORIGIN= Bruker BioSpin GmbH
$$ ##OWNER= she
$$ F:/spectra/data/she/nmr/H-F/1/audita.txt
$$ ##AUDIT TRAIL=  $$ (NUMBER, WHEN, WHO, WHERE, WHAT)
(   1,<2023-10-23 14:10:58.76 +0400>,<she>,<DPX200>,
      <created by zg, POWCHK disabled, PULCHK disabled
       configuration hash MD5:
       00 E9 B6 7A A2 85 ED C7 34 08 36 98 17 FE 4E 26
       data hash MD5: 16K
       16 4D 5C C3 9D BA B6 BC 61 0C A7 80 CF 2E 63 AB>)
$$ ##END=
$$ 
$$ hash MD5
$$ BB FD 7D 3D A3 B2 05 51 6E 8C 87 44 F8 72 01 0C
##$RELAX= 
##$RELAX= 
##$RELAX= 
##$RELAX= 
##$RELAX= 
##$RELAX= 
$$ Bruker specific parameters
$$ --------------------------
##$DU= <F:/spectra>
##$EXPNO= 1
##$NAME= <H-F>
##$PROCNO= 1
##$TYPE= <nmr>
##$USER= <she>
##$AMP= (0..31)
100 100 100 100 100 100 100 100 100 100 100 100 100 100 100 100 100 100 
100 100 100 100 100 100 100 100 100 100 100 100 100 100 
##$AQSEQ= 0
##$AQ_mod= 1
##$AUNM= <au_zg>
##$AUTOPOS= <>
##$BF1= 200.13
##$BF2= 200.13
##$BF3= 200.13
##$BF4= 200.13
##$BF5= 200.13
##$BF6= 200.13
##$BF7= 200.13
##$BF8= 200.13
##$BYTORDA= 1
##$CFDGTYP= 0
##$CFRGTYP= 5
##$CHEMSTR= <none>
##$CNST= (0..31)
1 1 145 1 1 1 1 1 1 1 1 1 1 1 1 1 1 1 1 1 1 1 1 1 1 1 1 1 1 1 1 1 
##$CPDPRG= <>
##$CPDPRG1= <>
##$CPDPRG2= <>
##$CPDPRG3= <>
##$CPDPRG4= <mlev>
##$CPDPRG5= <mlev>
##$CPDPRG6= <mlev>
##$CPDPRG7= <mlev>
##$CPDPRG8= <mlev>
##$CPDPRGB= <>
##$CPDPRGT= <>
##$D= (0..31)
0 1.2 0 0 0 0 0 0 0 0.06 0 0.03 0 0 0 0 0.0002 0 0 0 0 0 0 0 0 0 0 0 0 
0 0 0 
##$DATE= 1698055858
##$DBL= (0..7)
120 120 120 120 120 120 120 120 
##$DBP= (0..7)
150 150 150 150 150 150 150 150 
##$DBP07= 0
##$DBPNAM0= <>
##$DBPNAM1= <>
##$DBPNAM2= <>
##$DBPNAM3= <>
##$DBPNAM4= <>
##$DBPNAM5= <>
##$DBPNAM6= <>
##$DBPNAM7= <>
##$DBPOAL= (0..7)
0.5 0.5 0.5 0.5 0.5 0.5 0.5 0.5 
##$DBPOFFS= (0..7)
0 0 0 0 0 0 0 0 
##$DE= 6
##$DECBNUC= <off>
##$DECIM= 32
##$DECNUC= <off>
##$DECSTAT= 4
##$DIGMOD= 1
##$DIGTYP= 9
##$DL= (0..7)
0 120 120 120 120 120 120 120 
##$DP= (0..7)
150 150 150 150 150 150 150 150 
##$DP07= 0
##$DPNAME0= <>
##$DPNAME1= <>
##$DPNAME2= <>
##$DPNAME3= <>
##$DPNAME4= <>
##$DPNAME5= <>
##$DPNAME6= <>
##$DPNAME7= <>
##$DPOAL= (0..7)
0.5 0.5 0.5 0.5 0.5 0.5 0.5 0.5 
##$DPOFFS= (0..7)
0 0 0 0 0 0 0 0 
##$DQDMODE= 0
##$DR= 18
##$DS= 0
##$DSLIST= <SSSSSSSSSSSSSSS>
$$ [...]
##$SUBNAM2= <"">
##$SUBNAM3= <"">
##$SUBNAM4= <"">
##$SUBNAM5= <"">
##$SUBNAM6= <"">
##$SUBNAM7= <"">
##$SUBNAM8= <"">
##$SUBNAM9= <"">
##$SW= 18.05172834244
##$SWIBOX= (0..15)
0 0 2 0 0 0 0 0 0 0 0 0 0 0 0 0 
##$SW_h= 3612.71676300578
##$TD= 16384
##$TD0= 1
##$TE= 0
##$TE2= 300
##$TE3= 300
##$TEG= 300
##$TL= (0..7)
0 120 120 120 120 120 120 120 
##$TP= (0..7)
150 150 150 150 150 150 150 150 
##$TP07= 0
##$TPNAME0= <>
##$TPNAME1= <>
##$TPNAME2= <>
##$TPNAME3= <>
##$TPNAME4= <>
##$TPNAME5= <>
##$TPNAME6= <>
##$TPNAME7= <>
##$TPOAL= (0..7)
0.5 0.5 0.5 0.5 0.5 0.5 0.5 0.5 
##$TPOFFS= (0..7)
0 0 0 0 0 0 0 0 
##$TUNHIN= 0
##$TUNHOUT= 0
##$TUNXOUT= 0
##$USERA1= <user>
##$USERA2= <user>
##$USERA3= <user>
##$USERA4= <user>
##$USERA5= <user>
##$V9= 5
##$VALIST= <valist>
##$VCLIST= <CCCCCCCCCCCCCCC>
##$VD= 0
##$VDLIST= <DDDDDDDDDDDDDDD>
##$VPLIST= <PPPPPPPPPPPPPPP>
##$VTLIST= <TTTTTTTTTTTTTTT>
##$WBST= 1024
##$WBSW= 4
##$XGAIN= (0..3)
0 0 0 0 
##$XL= 0
##$YL= 0
##$YMAX_a= 591516
##$YMIN_a= -793290
##$ZGOPTNS= <>
##$ZL1= 120
##$ZL2= 120
##$ZL3= 120
##$ZL4= 120
##$ABSF1= 10
##$ABSF2= 0
##$ABSG= 5
##$ABSL= 3
##$ALPHA= 0
##$AQORDER= 0
##$ASSFAC= 0
##$ASSFACI= 0
##$ASSFACX= 0
##$ASSWID= 0
##$AUNMP= <proc_1d>
##$AZFE= 0.1
##$AZFW= 0.1
##$BCFW= 1
##$BC_mod= 2
##$BYTORDP= 1
##$COROFFS= 0
##$CY= 11.3945322036743
##$DATMOD= 1
##$DC= 2
##$DFILT= <>
##$DTYPP= 0
##$F1P= 15.7292609196834
##$F2P= 12.9074282941183
##$FCOR= 0.5
##$FTSIZE= 0
##$FT_mod= 4
##$GAMMA= 1
##$GB= 0.15
##$INTBC= 1
##$INTSCL= 1
##$ISEN= 128
##$LB= 0.24
##$LEV0= 0
##$LPBIN= 0
##$MAXI= 10000
##$MC2= 0
##$MEAN= 0
##$ME_mod= 0
##$MI= 1.114404
##$NCOEF= 0
##$NC_proc= 0
##$NLEV= 6
##$NOISF1= 3.799351
##$NOISF2= 2.8
##$NSP= 1
##$NTH_PI= 0
##$NZP= 0
##$OFFSET= 15.70392
##$PC= 1
##$PHC0= -23050.87
##$PHC1= 2.252711
##$PH_mod= 1
##$PKNL= yes
##$PPARMOD= 0
##$PSCAL= 0
##$PSIGN= 0
##$REVERSE= no
##$SF= 200.130013532006
##$SI= 16384
##$SIGF1= 3
##$SIGF2= 2
##$SINO= 400
##$SIOLD= 16384
##$SREGLST= <1H.CDCl3>
##$SSB= 0
##$STSI= 0
##$STSR= 0
##$SW_p= 3612.71676300578
##$SYMM= 0
##$S_DEV= 0
##$TDeff= 0
##$TDoff= 0
##$TI= <>
##$TILT= no
##$TM1= 0
##$TM2= 0
##$TOPLEV= 0
##$USERP1= <user>
##$USERP2= <user>
##$USERP3= <user>
##$USERP4= <user>
##$USERP5= <user>
##$WDW= 1
##$XDIM= 8192
##$YMAX_p= 0
##$YMIN_p= 0
$$ End of Bruker specific parameters
$$ ---------------------------------
##NTUPLES= NMR FID
##VAR_NAME=  TIME,          FID/REAL,        FID/IMAG
##SYMBOL=    X,             R,               I
##VAR_TYPE=  INDEPENDENT,   DEPENDENT,       DEPENDENT
##VAR_FORM=  AFFN,          ASDF,            ASDF
##VAR_DIM=   8192,          8192,            8192
##UNITS=     SECONDS,       ARBITRARY UNITS, ARBITRARY UNITS
##FACTOR=    0.0002768,     1,               1
##FIRST=     0,             0,               0
##LAST=      2.2672688,     0,               0
##MIN=       0,             -793290,         0
##MAX=       2.2672688,     591516,          0
$$ Real data points
##PAGE= N=1
##DATA TABLE= (X++(R..R)), XYDATA
0@%%%%%%%Qj6K4m0N0o6Q8j12J44j77K18k71L34m02M82n79O86q07R49j108J285
28F90j487J714j968K251k566K915l301L726m193M709n276N897o576P318q130R016
44D739r981J1037j2191J3451j4829J6336j7992J9814k1822K4047k6526K9300l2424
57a7041L5979m0057M4787n0358N7031o5194P5448q8781J06930j33308J75812k59634
69a58386O74350r31458J95222M89968r27811J243937n40979j1979k60902J45970
79h2068J56654q5353L19780n47652J91711L8020k7330K84302m73426L89532l38819
90a74649J88672K05425m79634M12477k32316N6153K23113l58058J37989J9799
100a029q274J04356N98k88994J67096Q3697j12928K88349l27234l2900J45936
$$ plain form
0 0 0 0 0 0 0 0 0 8 -8 16 -24 26 -40 48 -64 80 -97 121 -150 184 -218 264 -315 371 -436 513 -595 690
28 690 -797 917 -1051 1200 -1366 1549 -1752 1974 -2219 2490 -2786 3111 -3465 3853 -4277 4739
44 4739 -5242 5795 -6396 7055 -7774 8562 -9430 10384 -11438 12609 -13917 15383 -17041
57 -17041 18938 -21119 23668 -26690 30341 -34853 40595 -48186 58744 -74564 101248 -158386
69 -158386 515964 -415494 -220272 269696 -658115 585822 44843 32864 -228038 -82068
79 -82068 74586 -10767 309013 -238639 -46928 -8908 -36238 248064 -225362 164170 -174649
90 -174649 14023 219448 -260186 152291 -80025 -23872 199241 -158817 -20828 -1029
100 -1029 -9303 95053 95651 -193343 -26247 57450 -55478 232871 -94363 -127263 18673
111A8673p1254K18266j56975m1190m4797J2610J50287k8308m0789p5461N2208
122f730o6746J47373j0644j49164J75916j88188J00260N3838j21624J53926j22452
133c4235K5574P316l0653L8381L1314O052j19120J14514j05641N6869J35328j89029
145f3330Q7899p6084K0655P6649l1575M5546j50588R9273j3869j0338J04385j37064
157d8441N3152l6854L2741L7662o8686P7339r1558M6618J8162m8036N3164m5998
169b0735N1893m3138k258K7405n0400P4476k3032j9933j0002l245K7282n527M2525
182D5311o4887j3889L9236j6692M0886r176l6577j2977K7590J0189L434J1142
194B3590n0337J5527R721L998K0289k9720P314j4704J1638J4906j8420K0455k1006
$$ plain form
111 18673 -52581 165685 8710 -32480 -77277 -64667 85620 57312 16523 -58938 -6730
122 -6730 -73476 73897 63253 -85911 90005 -98183 2077 55915 -65709 88217 -34235
133 -34235 -8661 -1345 -31998 6383 37697 43749 -75371 39143 -66498 -9629 125699 -63330
145 -63330 24569 -51515 -30860 45789 14214 59760 -90828 8445 -5424 -15762 88623 -48441
157 -48441 4711 -32143 598 38260 -30426 46913 -44645 1973 20135 -27901 25263 -20735
169 -20735 31158 -11980 -14238 13167 -37233 37243 14211 -5722 -15724 -18969 8313 2786 45311
182 45311 -19576 -33465 5771 -10921 29965 20789 -15788 -28765 -1175 9014 12448 23590
194 23590 -26747 -11220 -1499 2499 22788 -6932 382 -14322 -2684 12222 -6198 14257 -6749
207f749q17J2424j2766J1569N194p930p835R276j1669P305K1395k4596L240K56
221a703j0109J7154O816j0846r098O572m480O874J1260j3830m672N331J98l472
235d005J4083r293j0078J9225j8416N960J1597j5403J2467n427o425L072K989
248C46N203m157K028j1468J595J2060k081J632o678n988J507J2524O79q674L281
263A809j2179P033J4097j0512J259l198o598J0194M491o559qj823k132P719j747
278A846k082p87p18M060l526K674k590j889Q003n496n48J014l606N501K430m452
294a66k570J187l82N069J530p342O64l25J921N220l565k595j427P16M409Pj342
311A009k471j739L970O55n62K74l771K189J561j673J932j822l39J352o11l20J43
$$ plain form
207 -6749 -7566 4858 -7908 3661 8855 925 -6910 2366 -9303 -1998 19397 -5199 -1959 -1703
221 -1703 -11812 5342 12158 1312 -7786 -1214 -5694 1180 12440 -1390 -6062 -731 -533 -4005
235 -4005 10078 785 -9293 9932 -8484 -2524 9073 -6330 6137 710 -5715 -2643 346
248 346 5549 1392 3420 -8048 -6453 5607 3526 5158 -1520 -7508 -6001 6523 7202 -1472 1809
263 1809 -10370 -3337 10760 248 1507 -1691 -8289 1905 6396 -163 -171 -1994 -4126 3593 1846
278 1846 -236 -1023 -1741 2319 -1207 1467 -1123 -3012 4991 -505 -1053 -39 -3645 1856 4286 -166
294 -166 -2736 -1549 -1931 3138 4668 -2674 -2010 -2335 -414 4806 1241 -1354 -2781 -2065 2344 2351 1009
311 1009 -1462 -3201 769 1424 862 1136 -2635 -446 1115 -558 1374 -448 -787 565 -46 -366 -223
328b23Q73r77J158q98j602K148k25Q54q81j236J80Q4K837j668r40K38j379K454
346G97M08q71p16m70M71N81Q94j093k97k05K54O40l63N06j033M28J79o39R93n88
366a24M85l16n84N03l18J005l02m52l28j09Q99j17L95r35l56O62j42R15o23n87
386d29K13j73Q38j44l50q0j08L07JP0k16pK15k41QQ4k3J94k0l03q0J09L68K1j42
411A12l08l57O74K06j50r9n69L12K82K68k21l71O1j55O88j91k04O6n05O75r6p4
433D4Q1m25L79j04J02j8k32L00j77J54j53j02K66j26K12l58N3J02r5M51m16q1
455a43Q6j20M04j27j36o4m0J87Q3l9j74j0K2R9J00j53M1p2J2J51j52P4jr3J16
480E1p8K4M0m9M4j1r4O1J3K9K2r6l9J01j3L6j1j08N9K4L5K8j12PL0%R8r9pK6j1
$$ plain form
328 -223 650 -327 831 -67 -1669 479 254 1108 227 -1009 -829 -745 2092 424 -516 -278 -1657 797
346 797 1205 334 -382 -852 -381 200 1094 1 -296 -501 -247 393 30 536 -497 -69 110 -529 464 -124
366 -124 361 45 -539 -36 -354 651 349 -103 -431 -540 359 242 637 -298 -654 8 -134 781 158 -429
386 -429 -216 -389 449 305 -45 -125 -233 74 75 145 -71 -78 137 -104 -96 -12 -35 159 139 -164 -244 -135 233 254 112
411 112 -196 -553 121 327 177 78 -491 -179 103 371 150 -221 -160 -315 373 182 -22 44 -461 214 118 44
433 44 125 -300 79 -25 77 59 -173 127 -50 104 -49 -151 115 -11 201 -157 -104 -2 -97 354 -62 -143
455 -143 -57 -177 227 100 -36 -100 -140 47 130 91 -83 -93 -71 28 128 -25 16 -56 -44 107 -45 29 28 -65 51
480 51 -27 -3 37 -12 32 21 -73 -12 1 30 52 -44 -83 18 5 41 30 -78 -19 5 40 68 -44 -37 -7 -7 91 -8 -15 11 0
511@L8k0m0K5Jk5M0k9j3P0l6J5k5m7N1j3K6j0p2Q4j1L3l0q1M2mN0l8K7l6J7M3
543C2k1K9n9J5L7m4O7n7k7K3RJ1l3L2j6NK7n1nK1K5Ml5J4k4N5Kn0jlL3j0K1l0
577dl3N6l2J4%j2kJ1qOj8K0OQPk7J4okK1k8M0k0j0J4l0NJJ4Nj9J1k0J9L6m4j6
614b3j2M2k7RLkmJ4k0Qj5K5k8J6Nj8L5k5J9Nj4J6m0O4j9J5l4k5O1l0K1m0J9J9
648B0ok0J4j4J2Pjj9lj8K9J5m0K7j4RK5qk5Oj4Rj0L1j1Pqj0K5m1lK9Qrj8PJJ9
686HKj8PJ7kk3rNPpL9l3j6M0m2J9Oj0J4k9M8ol6QJ9j4kJ9m9K5L0m7M9k8%K3rM
724Ij7K8lk6K2k7M1j8qQj3k3K0J2j6qK1j1JPk7J9%J6k4Mlj3K7j9J0pj2PJ8J2o
761AJ3l0pM7j9j3RK6m4K4Pj4nj1K5k0nJ1Rk6J3K4k1J5j5Qnm0N7j2k5J6Qk0rL7
$$ plain form
511 0 38 18 -22 3 4 -21 19 -10 -23 47 11 26 1 -46 5 -8 18 8 -64 20 9 42 12 -69 -27 -31 19 -19 8 -28 -11 32
543 32 11 40 -19 -4 33 -11 56 -1 -28 -5 4 15 -18 14 -2 3 30 -21 -26 -5 20 24 -11 3 -21 34 36 -14 -15 -18 15 5 26 -4
577 -4 -37 19 -13 1 1 -11 -13 -2 -10 -4 -22 -2 4 12 19 -8 6 0 -2 19 -9 31 11 1 15 -15 -10 -9 5 10 -9 2 -18 1 37 -7 -23
614 -23 -35 7 -20 -11 -8 -10 -14 0 -20 -12 -27 -2 -30 -14 -9 -27 8 -17 2 7 -7 9 -31 33 14 29 -5 -30 31 1 22 -18 1 20
648 20 14 -6 8 -6 6 13 12 -7 -10 -28 1 16 -24 3 -11 -2 23 15 -10 -4 -18 -9 -19 12 1 8 0 -10 15 -26 -29 0 8 -1 -19 -12 -11 8
686 8 10 -8 -1 16 14 -9 -18 -13 -6 -13 26 -7 -23 17 -25 -6 0 -10 4 -25 23 17 -19 -11 8 -6 -8 11 -38 -13 17 -30 19 -9 -9 14 5 9
724 9 -8 20 17 -9 13 -14 27 9 1 9 -4 -27 -7 5 -11 -19 2 -9 -8 -1 -28 -9 -9 7 -17 -13 -16 -29 -2 -21 -11 -18 -30 -23 -5 7 1
761 1 14 -16 -23 24 5 -8 1 27 -17 7 14 0 -5 -16 9 -11 -16 -5 4 -22 -9 15 -6 9 -6 2 -3 -43 14 2 -23 -7 1 -19 -28 9
797Ij5JpRK4j8pRk4J4J4J3j7lj0j2L9k5j0kL6j9L0n3K4JJ0k6L3kk5K%QJk1j1L6
835Fl0M4mok3OJ%NoK2j9k2L0lJ6j6j5K2J6k8K8j1J3n5K0L6m6LqL2j4jqJ0jj3J2
873gj2K2J8k6lK1j2k7K5j0%K2p%j3J2j3J2MjOj6Kqj2LJ5kMkJ6J3l2L0l0lMOrJ0
913@J3k0lJ3oNk5J4j1J7J5j6j0M2l5j5K1Kk3K6%k1J0J2k1RMjLJ1Ok5J4Qj0k3K7
950Gk5j2K3J2m4M7j4Qj4J0PMm4K8LLL%j0j2K2Rk0K0l4K5Qk0%K6j0l1L5jl6L3J
987Gk2J9LJL5k7%k7nL5j4kkqMOJ5n2L5k5Pq%M2j5o%j6K0lJ0j2p%MK3k0mj6K0J0
1028EMj5j6L0k2J1koPOm5K8J3nj0J5jjJNk6J0Mj1L7j7Oj8PR%Ql4qK9J9j4pJ1k0
1068a3K7pLPk5K4k0J7j3k5K4k1L6ppOpj4J4Lnk7J4lLJ8k3NjK1k4LMJ6K3k1J8k5
$$ plain form
797 9 -6 -5 -12 -3 21 3 -4 5 -19 -5 9 22 5 2 -8 -20 19 -6 -16 -18 18 -1 29 -24 0 1 11 -15 18 16 -9 -7 -7 1 2 -19 -30 6
835 6 -24 20 16 10 -13 -7 -6 -6 -1 -7 15 -4 -26 4 1 17 1 -14 8 24 -4 24 13 26 -29 -9 27 -19 -16 -24 8 -6 -7 -15 -5 -6 -19 -7
873 -7 -19 3 21 -5 -8 13 1 -26 -1 -11 -11 11 4 4 -9 3 -10 2 6 5 11 -5 -3 -11 -23 -20 -5 -7 -3 -5 11 24 -8 22 -8 -11 -7 -1 -10 0
913 0 13 -7 -10 3 -3 2 -23 -9 -20 -3 12 -4 -14 28 -7 -22 -1 1 -22 4 4 -17 -7 5 -16 -7 -3 -4 -1 10 16 -9 5 13 3 -20 7
950 7 -18 -30 -7 5 -39 8 -6 2 -12 -2 5 9 -35 -7 -4 -1 2 2 -8 -20 2 11 -9 11 -23 2 10 -10 -10 16 6 -25 10 9 -27 6 7
987 7 -15 4 7 8 43 16 16 -11 -16 19 5 3 1 -7 -3 3 18 -34 1 -24 -17 -25 -25 17 2 -4 -4 -20 0 -3 7 -5 -12 -12 -8 15 -5 -9 -25 -5 5
1028 5 9 -6 -22 8 -14 -3 -5 -11 -4 2 -43 -15 -2 -7 -17 -2 -3 -4 -3 2 -24 -14 -10 -21 16 -1 5 -13 -6 3 3 11 -23 -31 -2 17 3 -4 7 -13
1068 -13 14 7 10 17 -8 16 -4 13 0 -25 -1 -22 14 7 0 6 -1 -15 -1 2 -3 -30 -16 -19 -16 2 -21 -16 -17 4 -20 -17 -13 3 26 5 23 -2
1106bj9J5J8j3jj5PNJjk6rN0l2M1m8L0j4K6j7k1jKK4Ll7K2L7j5j7JRl1M0j6j5
1142a9J7j1K5mj0KJ9Lm1K7nk1KK8Mk0j2jK3nK1j2l2K2rk7L9j2j8K2Lmj2J6K4o
1178A6j6k0k4N1k6J9LnP%Moj0L7j6j9K1Nj3Jjj5LK1k1K0k7J0j2ML0n0J2J9j1j
1214a0M2m1Rk1lL2j0Mk%k5J5k2K9jJ7qkklJ4k2K1k5J9joJ9j5j9J5k0J9mNmJ5j
1252HqoKK2k0j7LJ0lJ9j9Rkj8L1Komk0L0j4J3m0J3J2K6Pk0ml0J3j0L3rJ3Mrqq
1291eL3l7LPpnK1j2mrKK7%j5j3L0j5j6J0kJpK2K2j4onqPJ4k0lRnK8m3K0j7K8l4
1331a8j5L5J8m1MK8j3j8L1rj6PJ5kj8J3jJ0j1j7J2K4j7J0kl5L8rnJ9j9K1K1n1
1365a1M0k5K1k3Oppj9K2Rl3L5j2Lj8J8j7L6kn3J9J9l1J7K0Njj4Jj1nJ1J9kj6L2
$$ plain form
1106 -2 -21 -6 12 -1 -2 -17 -10 -5 -4 -5 -31 -40 10 -22 19 -29 1 -13 13 -4 -25 -26 -24 0 3 -34 -12 25 10 -7 -6 3 -28 12 -4 -19
1142 -19 -2 -13 12 8 -2 0 19 22 -19 8 3 -18 -16 12 16 -4 -16 -17 6 1 22 10 -22 0 -9 -36 3 -9 -27 -5 -2 -6 -18 -2 22 16
1178 16 0 -20 -44 7 -19 0 3 -2 5 5 9 3 -7 30 14 -5 16 21 8 9 8 -7 -4 17 -4 16 -11 -1 -13 -9 21 -29 -17 2 -9 -10
1214 -10 32 -9 0 -21 -24 8 -2 2 0 0 -25 -10 -32 -3 -4 13 5 3 1 -2 12 -10 11 -14 5 4 -2 17 2 -17 -2 -22 -3 -7 -2 -6 9 8
1252 8 0 -6 -4 18 -2 -19 -16 -6 -9 10 -9 0 -2 -20 11 13 7 3 -17 13 -1 12 -28 -15 -3 23 30 10 6 -24 -11 -21 12 3 16 20 11 3 -5
1291 -5 28 -9 -6 1 -6 -11 10 -2 -6 -15 -13 14 14 -1 -14 16 1 -15 -5 -7 -6 -13 9 31 17 11 6 -2 5 19 -1 -4 5 0 28 -15 5 -12 16 -18
1331 -18 -33 2 20 -21 -17 11 -2 -20 11 2 -14 -7 8 6 -12 1 0 10 -1 -18 -6 18 1 11 9 -26 12 3 -2 17 -2 19 40 -11
1365 -11 29 4 25 2 8 1 -6 -25 -3 6 -27 8 -4 -1 -19 -1 -18 18 16 -37 -18 1 -30 -13 7 12 11 -3 -2 -13 -18 -7 12 10 -6 26
1401B6j9j0noJ8J6j9jQj3L4n0J1J3J4k4j2J6J5j0LjLl6N4l6nMK2m4L2%J0j6qK
1437a4j9J4JM2k4k1M1k2j0J7K1k4J9j5qj2J3J7l1J6k9J1MK3oqJ0j7J3j2J7j5J4
1470Fj4%J7NOj5j1NJ5j3K4k4lJ0j6mM9l6QL8k2j5Lkk0K2%l6K5j6K3j7J1lqJ7N
1507A4pj9J6j9j4K4nrRlJ2qK5rrr%QnM6l4J3j6J3j3QLj6J7k4KK0Mk6%L0k7K4K
1546A8j0qOLk2J5kJ5oK1k8J1k6QnL6l6LJ3k7jQpRK0j0oJ4K6l2J4j8P%J4Nkk4J2
1585HJj1oj9K9Lj0J5k1PPk2J2j0Rj0K3J3j7lL6m1J2Ll8L8Kk2L0j4K3l5J8Ol1Q
1621gMlK4L0m8J5l1NRjj0J5J3mj5j3J4J9l7L6k2J0rPNK3pl5L9ml8lL1NmoJ2k6
1659gK3Kk5NK3Jl3J8J7k2J2mj8J8k1rPj7L9k8J4JK7l5J1J0k8K7knk8K3qJ2J2%
$$ plain form
1401 26 7 -3 -8 -14 4 20 1 0 8 -5 29 -21 -10 3 17 -7 -19 -3 12 2 5 4 7 -29 25 -11 -16 -12 10 -34 -2 -2 8 -8 -16 -14
1437 -14 -33 -19 -18 24 0 -21 20 -2 -12 5 26 2 21 6 -2 -14 -1 16 -15 1 -28 -17 -13 10 4 -4 6 -11 2 -10 7 -8 6
1470 6 -8 -8 9 14 20 5 -6 -1 14 1 25 1 -2 8 -8 -12 37 1 9 47 25 10 13 11 -9 13 13 -23 2 -14 9 -8 3 0 -8 9 14
1507 14 7 -12 4 -15 -29 -5 -10 -19 -10 -13 -1 -9 16 7 -2 -11 -11 -3 -8 38 4 17 1 14 1 9 12 -4 13 -11 -9 11 15 -11 -11 19 -8 16 18
1546 18 8 0 6 9 -13 2 0 15 9 30 2 13 -13 -5 -10 26 -10 -7 6 -21 -22 -14 -21 -12 8 -2 -8 6 32 0 14 -4 3 3 17 22 20 -4 8
1585 8 9 -2 -8 -27 2 5 -5 10 -11 -4 3 -19 -7 -17 -8 -18 5 18 1 -2 34 -7 5 8 -30 8 10 -12 18 4 27 -8 10 16 -15 -7
1621 -7 -3 -6 18 48 0 15 -16 -11 -2 -3 -13 2 15 11 -4 -17 -3 16 -21 15 -7 3 -6 1 6 29 22 -13 26 22 -16 -19 12 17 13 7 19 -7
1659 -7 16 18 -7 -2 21 22 -11 7 24 2 14 10 -8 10 -11 -20 -13 -30 9 -19 -5 -4 23 -12 -1 9 -19 8 6 1 -27 -4 -12 0 12 12
1695A2qj1K8kj8Oj0K2Lj9J6j7J3qj3OJ2llj8K7j3qJ4j0K8l9kQJ0KKRk0k5J3J4
1732bk4J1Rj2oQM0l5QJOj6L2j2mK6j8l4J7oL1k3qK2J2j4l2QJ9K2k4kK0m0K0JL
1769Dj3Rj3M4j7k3J2j1J5j3ONj6OK1k6J5pJ0J9k2ooK3k4K4k5K1j5M1n1LL1k2J6
1804A5l9J9MoK5Pl8J4pOJj2J7j3J7pJ3mqJ0qj%j8J3olK3k5J1lkK5Lk0j4J4K9j8
1843A4nl5L9l2M2lm3K8mlJ2KnrJJ5l9L0J2k0j1J9qj5J4K7m4N8k2kk0K4oj4M3k7
1879A3j7L0J4j0k9JLL1l8l8NK7pK7k4K7j3lK2m2L7Km0R%L6j9%j3J6PkQmQk8L7
1916C3j8j0rK8k8PJ9l5J8kOK2l6Oj6rkK6pQrjj1qM2k4jNj1J8Kk9J6K3j1PlqJ6
1955A4Jj6jL2kl6oK7kj0lj5N7n4M3n8L2koj7J4j5jrK3J9j4rK4J3rmqPj6J5l0K1
$$ plain form
1695 12 4 -7 21 19 1 7 -3 19 22 3 19 2 15 7 -6 0 12 9 6 -12 15 2 -6 8 -2 26 -13 -15 -7 3 5 7 16 -4 -29 -16 -2
1732 -2 -26 -15 -6 -18 -24 -16 24 -11 -3 -2 4 -12 20 8 4 30 12 -22 -5 -11 20 -3 -11 11 23 9 -23 -15 4 26 2 0 20 -20 0 1 4
1769 4 -9 0 -13 31 14 -9 3 -8 7 -6 0 5 -11 -5 16 -10 5 -2 8 27 5 -1 -7 16 -8 16 -9 12 -3 38 -13 -10 21 -1 15
1804 15 -24 -5 -1 -7 18 25 -13 1 -6 0 1 -11 6 -7 10 3 16 12 4 14 6 5 5 -13 0 -6 -9 14 -11 0 -3 -5 20 23 3 -11 3 32 14
1843 14 9 -26 13 -19 23 20 -23 5 1 -2 10 12 7 -2 -1 14 -25 5 17 -3 -14 5 -3 -18 -4 23 -21 37 15 13 -7 17 11 -3 40 13
1879 13 -4 26 40 30 1 2 5 36 -2 -40 -35 -8 -15 12 -12 15 2 -1 21 -21 16 18 -22 -13 -13 23 4 4 -9 7 14 12 20 16 24 -4 33
1916 33 15 5 -4 24 -4 3 22 -13 5 3 9 31 -5 1 -15 -24 -26 0 -7 1 -8 -9 -20 -28 14 -10 -11 -6 -17 1 3 -26 -10 13 2 9 6 -2 14
1955 14 15 -1 -2 30 28 -8 -14 13 11 1 -2 -17 40 -14 29 -29 3 1 -5 -22 -8 -23 -24 -33 -10 9 -5 -14 10 23 14 10 2 9 -7 8 -22 -1
1993aOj6K3OOj1k5MK5j6K0ppj5M0k8LQjpj8J5oLj3J2q%J7Rpj0jJ7j7J4k0K1j7
2032bnK4j5KJ2k2j4M1j1J7rLPj6Qk4oQOj5KJ7J2k3LL2l5j6K3J8k4lmJ7J3J4ok3
2070FoKrJ4k5%L6J6m5RJ4qj3J3J9oMl1K6nl3K4K9j0rqj4kK1lk8K8j2JJ9k8J2m
2108fj7K5kJ0l1J2j2J9M5n9J1L9l2Qjj4K2kj3J8j1Mj7J0J2k5JJ3k3J4j1K4rMk9
2143b3J6j2K2k1M1k3mrJ4lnj8M5j9j2Pmk6K8NKMj4J2Pj7qPnK3rkJ6j2%k4jJ1J7
2182Fj3rK8j2oj7K0l2K8j7j7N4j9j9J3L6k8K2j9pJ7j3NK8j0qpPJ1Rk8qJ7k3K3
2217A2j4J4qj1J1%j4mRqmkL6ok5J0J2k8J8j4K6jk3K3k3K8k3J0Oj1KLmJj2J0L3
2254B9Jk6J1j4K4k9QjJ2J3j8k3K9j1k8L4k0K1k0j6pL0ljpL8l0kJ4k9K7rKJ6j5
$$ plain form
1993 -1 5 -11 12 18 24 13 -12 -8 17 1 21 14 7 -8 32 4 7 15 14 7 -11 4 -2 1 -12 0 -8 -8 9 18 11 1 0 17 0 14 -6 15 -2
2032 -2 -7 17 2 4 16 -6 -20 21 10 27 18 21 28 12 20 -4 -10 -2 4 -11 -9 8 20 -3 0 32 -3 -19 4 22 -2 -5 -9 8 21 35 29 6
2070 6 0 2 -7 7 -18 -18 18 34 -11 -2 12 4 -9 4 23 17 21 -10 16 11 -22 2 31 21 12 4 -10 -12 9 6 -22 6 -6 -5 14 -14 -2 -6
2108 -6 -23 2 0 10 -21 -9 -21 -2 43 -16 -5 34 2 10 9 -5 17 15 2 20 9 13 -4 6 18 -7 -6 7 -16 -2 -13 11 2 6 -23
2143 -23 -7 -19 3 -18 23 0 -4 -13 1 -2 -7 -25 20 1 -11 -4 -8 -34 -6 -1 1 5 -9 3 10 -7 -15 -8 -13 10 1 -1 15 3 3 -21 -22 -11 6
2182 6 -7 -16 12 0 -6 -23 -3 -35 -7 -24 -41 13 -6 -25 -12 24 -4 18 -1 -8 9 -4 1 29 19 11 4 11 22 31 3 -5 12 -11 12
2217 12 -2 12 4 -7 4 4 -10 -14 -5 -13 -17 -19 17 11 -14 -4 8 -20 -2 -16 10 9 -14 9 -14 14 -9 1 7 -4 -2 1 -3 -2 -14 -4 29
2254 29 30 4 15 1 25 -4 4 3 15 28 10 -13 16 5 -23 11 -9 12 -8 -24 -31 -1 -4 -5 -12 26 -4 -6 8 -21 6 -3 -1 15 0
2289@J8ok8K6Ppqk7J4J8mjlJ4k1OLnK3j6mopK5j4j7k6N3j2rlM2n8K1NJ7Lj7J5
2328A1j0k1K4J8j7j1j2J5nQj2M2m5RMJ9j1J0J5k5k6K2NMk6J8opQqL2k6qJ5j2K0
2364A1J1kk6j0L9k2lpjrL4mj2J3j2J4j9J4lPjJJNl1J1K9m6K4j2J5j3opK0KLlJ7
2403B2k0J2m0M0njqkJ4rRj0pKPjrJ2Rj4J4oLj6J0mL0lj2j4J7qjk7K6Nkj3oK0j4
2444@JnmqJ0J4lqK3l6J3l0N4nj7J7j8mJ5Pj7K6l2J9J1Rl6K3qKk0J3Rj1j7J8Rj3
2482AJ3mmkK0k6JlnJ9Lk3K3lKk0L6j8Lj3J4rQrJ0k0j6J7j0J2RRj5LPpJk4PJ3k5
2523b5j0J7K2j9J1mj0K5k9oK2J8k9QJ3j4L9l0k2M4oJ2j7qK%J6Rj7J0j9Jk2K9k4
2558a3L5lm3JK2j0pkPj4RK2k5L5k1kNkpJ7rK6j3j3J0J1Lnk2LmJK6l0L6l0L7j2
$$ plain form
2289 0 18 12 -16 10 17 10 2 -25 -11 7 3 2 -1 13 -8 -2 1 -4 19 3 -1 -7 -14 11 -3 -20 -46 7 -5 -14 -17 25 -33 -12 -7 10 13 -4 11
2328 11 1 -20 4 22 5 -6 -18 -3 -8 0 -12 30 -15 -6 -2 17 6 16 31 6 -20 2 7 11 -15 3 -3 -10 -2 -10 22 -4 -12 3 -9 11
2364 11 22 20 -6 -16 23 1 -2 -9 -10 -19 15 11 -1 12 0 14 -5 9 6 13 12 13 14 19 -12 -1 28 -18 6 -6 9 -4 -10 -17 3 5 8 5 22
2403 22 2 14 -26 14 9 8 0 -2 12 3 12 2 -5 -3 4 3 -6 6 15 1 15 9 12 -4 6 2 32 29 17 3 20 12 11 -16 10 15 13 0 -6 14 0
2444 0 1 -4 -8 -16 -6 8 5 -3 20 -16 -3 -33 21 16 -1 16 -2 -6 9 16 -1 25 -7 12 23 32 -4 19 11 13 -7 6 15 4 -13 5 14 1
2482 1 14 10 6 4 24 -2 -1 -4 -9 10 13 -10 13 10 12 -8 28 10 13 0 14 5 13 4 14 -6 -22 -5 -15 -3 6 15 0 3 10 3 4 -20 -13 0 -25
2523 -25 -35 -18 4 -15 -4 -8 -18 7 -22 -28 -6 12 -17 -9 4 -10 29 -1 -23 21 15 27 10 2 4 4 20 29 12 22 3 4 -18 11 -13
2558 -13 22 19 -24 -23 -1 -11 -18 -20 -13 -27 -18 4 -21 14 -7 -9 -4 -6 -13 4 -5 21 8 -5 5 16 19 14 -8 -5 -9 -8 18 -12 24 -6 31 19
2596A9l4OK1J6k5Pj8rJ2j0jQL3k4J5k4PJ7k3k1K5j9M0pl5L1j9L5k8MqK5l6M7k3
2631Dj%PrpJ1j7K2Opmn%j1L5l7N3o4qN5m9K6J8ol2mJK1j2K4j2j7L2qk3L1l2J9
2669@lNmJ8j9J7jPj8J0Kj5Kl0M4j0Ml0K2j3L6j4j8K2j9RnOj0J8l0%ROmJ6Jm3L9
2708Gk5J9Rk4K2ok1RJ4j2J7pQNk2J8J3m8M0Ll0J3Kj4%K1lmJ2Pk7kmmPlLJ1j4J4
2748Dk1k2J6RJ1llK5rlPlj3L1j6Nj0j9K3rJ3m6L1k4J4J1Pl0K4j5Nk5K5NJ1qj1
2785a3Qpj8L1ml1L6pnMJ1j1J6nJ1j6J2qK0j5J8j6j4MnOk5J7J5k2PKj1J0k8K8r
2822a4J5j9M7k4J5Pl3JoK0k7J3j5M9m3K5J8l0J0kMo%K1lj3qJ0j3nJ4J1k1oJ2j7
2858a3OJ1k9Rj6J2K1qRl5J9J2k2K4j0j3qL2J0oQl8PL4j2j3M6m2RJrJ0K6l5k5Q
$$ plain form
2596 19 -15 -9 12 28 3 10 -8 -17 -5 -15 -16 -8 25 1 16 -8 -1 16 -7 -28 -3 -22 18 11 -24 7 -12 23 -5 -1 -9 16 -20 27 4
2631 4 3 3 10 1 -6 5 -12 10 16 9 5 0 0 -11 24 -13 40 -24 -32 23 -26 0 18 12 -20 -24 -23 -2 -14 10 -2 -19 13 5 -18 13 -19 0
2669 0 -3 2 -2 16 -3 14 13 20 2 12 14 -1 1 -29 15 5 9 -21 1 -12 24 10 -8 14 -5 4 -1 5 -5 13 -17 -17 -8 -2 -6 10 11 -32 7
2708 7 -18 1 10 -14 8 2 -19 -10 4 -8 9 2 10 15 -7 11 24 -24 16 19 -11 2 4 -10 -10 11 8 4 16 23 -4 -6 -10 -14 -7 -10 -7 4 -10 4
2748 4 -17 -39 -23 -14 -3 -6 -9 16 7 4 11 8 -5 26 10 15 5 -14 9 0 13 -33 -2 -26 -12 -1 6 -24 0 -15 -10 -35 -10 -5 6 -2 -13
2785 -13 -5 -12 -30 1 -3 -34 2 -5 -10 -6 5 -6 10 5 16 0 12 4 24 9 27 11 -3 1 -4 2 -23 -6 9 -13 -6 -4 -15 -5 -33 -5 -14
2822 -14 1 -18 29 5 20 27 -6 -5 -11 9 -18 -5 -20 29 -14 11 29 -1 9 7 11 5 5 26 23 10 2 12 -1 -6 8 19 -2 -8 4 -13
2858 -13 -7 4 -25 -16 -32 -20 1 -7 2 -33 -14 -2 -24 0 -10 -23 -31 1 11 5 13 -25 -18 16 4 -9 37 -5 4 5 -4 6 32 -3 -28 -20
2894b0K6nPj1nK9lj9KKjm8K7RKlj9J5J6k3J2j2L3Rn0L7rL6j6k3J0jj7K1Pj2Nl
2932Ek5J7j0J0K9j3J2l8L0ok2kJ0J2k1J9j6K0Pk0K3l1pnJ2K5qRk5K9k0KJ3j1j3
2967ij5MN1ok6kmQKlJ7mqK2k3J8k7OpOjlNJ7m4K7jj5K1j6Lj5J4k1K5Qj6nJ5jO
3008CjRqPnoOQk5M3l3J0MLjl7K5mRj2K0pj6%lLJJ6k6j7L3j7jK3K2m4J0QoQrJ7
3050A0l0K7nk0J3L8k4okppJ5K7m0M2l8%j4J1J5plj1onK2NmpNk2J8k1lK6j3RL7
3088B5k7K4k1j7JNJ9q%jj0K1k7LM0j0k0kNNk1M6k2J2l1QlJ9j3Kkl5K5rK1J5k0
3125cK1j8j4K0l1KJ8K0l3j1O9n9J3OJ3lj2j4J9Rj6K9kj2pRk6L0Mj9k2L2qj3nP
3161gj9MK5k1QoK1j8K3jl3J9K3k3J3j9rJ2J8m0M0k4K8NJj8j5L0Pk3J5k2JRJNk1
$$ plain form
2894 -20 6 1 8 -3 -8 21 18 -1 1 3 2 -46 -19 -10 -8 -11 -30 -15 1 -22 -10 -22 11 20 -30 7 -2 34 18 -5 5 4 -13 8 15 3 8 5
2932 5 -20 -3 -13 -3 26 13 25 -13 17 11 -11 -13 -3 9 -12 7 -9 11 18 -2 21 -10 -17 -22 -10 15 7 16 -9 20 0 2 15 4 -9
2967 -9 -24 -20 31 25 -1 -3 -7 1 3 0 17 13 5 27 4 22 -5 1 -6 0 -1 -4 1 18 -26 1 0 -15 6 -10 -7 -22 -8 -29 -4 4 -12 -17 -2 -3 3
3008 3 2 11 3 10 5 -1 5 13 -12 31 -2 8 12 15 14 -23 2 -2 7 -5 15 8 -8 -8 -11 -8 -7 9 -17 -34 -1 -18 -19 4 26 -18 -8 0 -6 2 -7 10
3050 10 -20 7 2 -18 -5 33 9 3 1 -6 -13 2 29 -11 31 -7 -7 -21 -10 5 -2 -5 -16 -22 -27 -5 0 -4 -11 -6 -28 -10 -31 -34 -8 -21 -12 25
3088 25 -2 22 1 -16 -15 -10 9 1 1 0 -10 11 -16 -13 27 17 -3 -5 0 5 -16 30 8 20 -11 -3 -6 13 0 2 0 -35 -10 -19 2 17 -3
3125 -3 18 0 -14 6 -25 -23 -5 15 -18 -29 40 -19 -6 0 13 10 -2 -16 3 12 -4 25 23 11 4 13 -13 17 21 2 -20 12 4 -9 -14 -7
3161 -7 -26 -22 3 -18 -10 -16 5 -13 10 9 -24 -5 18 -5 8 -11 -20 -8 10 -30 10 -14 14 19 20 2 -13 17 24 1 16 -6 -5 4 5 10 -11
3198a1JlL9m2jOOmJ5k5QRqpJ4l2M7j4j2M7k8k4J6J6KJJOOl2J3k6J4J2j4M0n0L3
3236A9j9J1j5mQJ9l1NRk0J1qJ0J2rqPj3K3Ll0K5JPj4J7J4j8j3j0K7J1m1J4j8L1
3272A3J5m1J9j4J5j9KK7k4k0K8jpJ7mj0Rj2KJ3kj5QnOJj5L4k7J9j6qNlJJ8J7j5
3310A1OKj9qK3Qk4Rj3J2jJkRpl1KK8%kk1JrJ0J8J4j0j4J1jJ0j4qK%K2j1j3k4L7
3350DJ3k0MJ0J4l3L3lk4RKnL6l8%jK8l8L4j7oJ7k8J3k9M1j7pJJ6j1Jj9J0K%OJ2
3388A0k8L0k9RnJ7k0K3K1j8k0J3k1L9k7MJ4j8Jj6L6j6j6NJ5k0nK6j7Lj1L8j4L
3422FK4k9k6J8LK5j0j9QRj5rJ0mJ6Npk0J7%J1oJ1l3j0K7Lk4J0J3k8K9j0j2K6j3
3458dJ0J0j6Lmj3lkK8j9J5k0L4mrk7KJ8j3Rj8L2Kj1J8j0qPjRJ0k7LJ1k8pK0Qk
$$ plain form
3198 -11 -10 -13 26 -16 -17 -11 -5 -9 6 -19 -11 -2 -10 -17 -3 -35 12 -2 -14 33 5 -19 -3 13 15 16 17 23 29 -3 10 -16 -2 10 -4 36 -14 19
3236 19 0 11 -4 -8 0 19 -12 -7 2 -18 -7 -15 -5 7 -2 -10 -3 -16 7 10 -20 5 6 13 -1 16 30 12 -1 -11 16 27 -14 0 -18 13
3272 13 28 -13 6 -8 7 -12 -10 17 -7 -27 1 0 -7 10 6 -4 5 -7 -5 8 6 -9 -1 -6 0 1 -14 20 -7 12 -4 -12 -7 -10 -9 9 26 11
3310 11 17 19 0 -8 15 23 -1 8 -5 7 6 7 5 14 7 -24 -22 6 6 4 -17 -16 -25 -15 3 17 7 -7 4 3 13 -1 -9 -7 -7 15 4 -9 -33 4
3350 4 17 -3 1 11 25 -8 25 22 -2 7 9 4 40 2 2 1 29 -9 25 8 2 19 -9 4 -25 16 -1 -8 -7 9 -2 -1 -20 -10 -8 -8 -2 10
3388 10 -18 12 -17 -8 -13 4 -16 7 28 10 -10 3 -18 21 -6 -2 12 -6 -5 -21 15 -1 -17 -12 3 -17 -22 4 -13 -10 -21 17 3 6
3422 6 30 1 -25 -7 -4 21 11 -8 0 9 -6 -15 -5 -9 7 12 5 -15 2 2 13 7 18 -15 -25 2 5 -19 -9 4 -24 5 -5 -17 9 -4
3458 -4 6 16 0 3 -1 -14 -17 -19 9 -10 5 -15 19 15 6 -21 -19 -1 -14 -5 -23 9 11 0 18 8 0 7 6 15 25 -2 1 12 -16 -23 -3 5 3
3497CKK3j6rqLpj2M8m7L2rl1M0nj4K8j1KOl3J1J8Ql2L5J7p1L3qLqlL0j3mnoRk1
3537b2KL3m0J4J3QJj2J9ol2K8qoj4L9k2moJ7J1j4pK1J4k4j8L2j0k4M9n6J2MnL7
3573B4ql5J7LMKqj6lK6k8L7k3L1kl2ooJ1J1NmJ4k4K0j4K2j3J1k6J5rK8Jk6K2k0
3610AJ9L4l4k2jL1j4j9J2Oj2jJ8k5j4OJ0jNj5K2j9J1PNJ0l8L2k3J8J6rrn%j2J7
3647GlJ2mrk6L8k1RJ1ml3L9l6K7j0%K7l7LmPlJ6k4RJ3J2rJ2l6L1k1K4j6J5l9J9
3684dqJ8MkL0k6j0k1K8K4l2MrkqM3n4KL2j1Mk7N3m1mJ5%lK0j7j4MmJ0J2j9J5j3
3722a1MNrPJ8mj2j3N6l2Pmj4J4Qj8MNk4M5k6K2j8Pl8M4j4k2J6k6J3Qj3j0M2j8
3758aj9L2j3ok7K0J0K1j7jk8J8J6lJ7l4J1J6%j6K5jj4j2j0K4J4k7j8L1oj9J7J1
$$ plain form
3497 3 5 28 12 3 -5 -2 -9 -21 27 -20 12 3 -28 12 7 -7 21 10 12 18 -15 -4 14 22 -10 25 42 -29 4 -4 -1 -9 -12 18 5 1 -4 -10 -1 -22
3537 -22 -20 13 -27 -13 0 8 9 -3 16 10 -22 6 -2 -8 -22 17 -5 -9 -15 2 13 -1 -8 13 27 3 -15 17 7 -17 32 -24 -12 -8 -13 24
3573 24 16 -19 -2 1 5 7 -1 -17 -20 6 -22 15 -8 23 21 -11 -17 -23 -12 -1 4 0 14 -10 10 -4 18 5 16 -10 5 -4 24 25 -1 21 1
3610 1 20 54 20 -2 -3 28 14 -5 7 13 1 0 18 -7 -21 -15 -5 -6 -1 -16 6 -13 -2 5 10 20 -18 14 -9 9 25 16 7 2 2 -10 7
3647 7 4 16 12 3 -23 15 -6 3 14 10 -23 16 -20 7 -3 -3 24 -13 -10 -14 -7 -10 6 -18 -9 4 16 7 19 -17 14 -7 17 1 16 -23 -4
3684 -4 -12 6 10 8 38 12 2 -19 9 33 1 5 -4 -6 -14 29 -25 -23 9 -2 2 -25 28 -13 -17 -2 -2 -5 15 -2 -16 -12 -16 -6 6 -13 2 -11
3722 -11 -7 -2 -11 -4 14 10 -2 -15 41 9 16 12 -2 12 20 2 6 11 -13 32 6 28 10 17 -21 23 9 -13 3 -23 -10 -2 -15 -25 17 -1
3758 -1 -20 12 -1 -7 -34 -14 -4 17 0 -1 -29 -11 5 2 19 -15 -4 12 12 -4 21 20 6 -6 -16 8 22 -5 -23 8 2 -17 0 11
3792A1J2mk2Qk6M4k2j1K9j1K1%j5l0M0n1L5kk2QqQNmKLL4k6mJ3l6L9l8L0k8J8
3828@oJ9J5n4K6j8K3%j3Q%j2K1k3K7j1pL4k7j0J9k8K0oMqLqpL4Ok2L8k3j9ROO
3866A6mK4k5mk5LQRJ2nj9J2J2k5K1j3QJj9J2qj2RpJ8K8Ol2kJ4Mk2J8j4J7j8nN
3904bkRk5K0J8ppkmNK6n5L3J9k1Oojkj2J1k8J6K5k1nK4qJ2k0MjqK5L3k4j8K0l4
3943gJ7oJ3LmmK8k3K5l1OmOj1J7k6rJ7mj8L4m6K7J9k6NJj7K1Rj1k1L1j4J4k6J0
3980eoKK3kJ3l2K2nPJLl4K3pJ5nMMl1mK4jjk2J1%MJ%M%K5l9J4k6J1J8qKJ5J1q
4022B1l0LJ9Nj4KkKNL3m8J2K1k3K2k9L4ql6J7Jl1L8opJj3K8ok1J5Ql2K2k4L4p
4059Fmj2mK3j8K4Kj6RJ2j6qk5J7K8j9PJ6MRl9L0j5J2j7j3oMJ5jl%kj9J8J1Pj3
$$ plain form
3792 11 23 19 -3 5 -21 23 1 -10 19 8 29 29 14 -16 24 -27 8 6 -16 -8 -16 -8 -3 -7 -5 -2 32 6 2 15 -21 18 -20 10 -18 0
3828 0 -6 13 28 -26 0 -18 5 5 -8 0 0 -12 9 -14 13 2 -5 29 2 -8 11 -17 3 -3 1 -7 -4 -12 -19 15 21 -1 37 14 -5 4 10 16
3866 16 12 36 11 7 -18 -15 -7 2 14 9 -10 2 14 -11 10 -3 5 6 -13 -1 -9 -21 -12 -19 -1 27 33 1 -1 13 17 -5 13 -1 16 -2 -7 -2
3904 -2 -4 5 -20 0 18 11 4 2 -2 3 29 -26 7 26 5 11 5 4 2 -10 1 -27 -11 14 -7 -12 12 4 16 -4 0 -1 -9 16 49 25 7 27 -7
3943 -7 10 4 17 20 16 12 40 17 42 11 17 13 19 8 25 -1 -10 7 3 -15 19 -27 0 19 -7 -2 -1 -18 3 12 1 -20 11 -3 11 -15 -5
3980 -5 -11 -9 14 12 25 -7 15 10 17 18 21 -13 10 3 18 13 17 21 -10 -14 10 9 8 -14 -3 -3 1 2 2 6 6 31 -8 6 -20 -9 9 1 3 18 29 21
4022 21 -9 -6 13 18 4 6 4 6 11 44 -4 8 29 6 28 -1 33 25 -11 6 7 -24 14 8 1 2 -11 17 11 -10 5 13 -19 3 -21 13 6
4059 6 2 -10 -14 9 -9 15 17 1 10 22 6 -2 -27 -10 18 -1 6 22 26 35 -4 26 11 23 6 -7 -13 -9 6 5 2 2 0 -19 -1 10 17 4
4097Dj0mJj4L4Jrj1JNkQj9L0l6K2J3jNLk0pPK4j1j2rJ0j7KJL1k4pKJ1j8MM1k4
4137EK2k1kj1j3K7j3j2oL2l0K3QrlL1k0k2J7j0QJ6j6J0p%PKmLjKkj8J1J4pkJ4
4176B3lm4K5K1j8kj3K8lNk4J8Pj9K2j1lJRj2jj9jJ8J1J4l4JMK1j0lknj8J7Plk3
4215a9RmJ1oL9k9J2pj7J2KqPK2k6qJ3j2krK1JJ2J5k2k5K2Qr%OK6l6K4k4K5rJj4
4254Bk4J0K4n6J1L1L3k6jj7J8%j6K2l8K4pRJ2k2rK2j4PoJ3JK3k3NNk9K9k5L1k1
4290bK5l7K6pr%RRMk9J8J6l8qJ1K5m6L2rj2kJ6j1KMLJ2l5J3K7J9j6J3mnJ2%ml8
4329a6J7jJ0Rm5N3l2J2k1K2jOj3KK2m1K3qNj8NoK3pJ2k2L8l8RKQMj3J2lj3oJ1
4367AJ6Qnl0RKK3rkJ5k2k5K5KPJk7LOjjK4m0J2LJ4l6M3j8MnJ8qkMJ0Koj5M%J2
$$ plain form
4097 4 -6 -10 -9 -23 11 12 3 -8 -7 -2 -4 4 -15 15 -21 1 14 13 18 21 1 -6 1 25 14 2 -7 3 -14 -12 -11 20 -4 -11 -9 2 -16 -12 29 5
4137 5 27 6 4 -7 -20 7 -6 -18 -24 8 -22 1 9 0 -3 28 8 -14 3 -7 1 17 1 11 4 4 11 13 9 12 11 13 11 -7 4 18 11 9 23
4176 23 20 -24 1 22 4 2 -11 17 14 19 -5 13 20 1 23 12 9 10 19 7 6 -13 -14 4 15 29 -5 -4 0 21 11 8 6 1 -17 0 7 4 -19
4215 -19 -10 -14 -3 -9 30 1 13 6 -11 1 3 -5 2 24 -2 -10 3 -9 -11 -20 1 2 14 29 7 -18 4 12 3 3 9 35 -1 23 -1 24 15 16 2
4254 2 -22 -12 12 -44 -33 -2 31 5 4 -13 5 5 -11 11 -27 -3 -10 -1 11 -11 -20 2 -12 -5 -11 2 3 26 3 8 13 -16 13 -12 19 -2
4290 -2 23 -14 12 5 -4 -4 5 14 18 -11 7 23 -15 -23 -12 13 -33 -1 -10 -22 -24 -8 -19 -17 -13 -10 2 -33 -20 7 26 10 23 19 14 26 26 22 -16
4329 -16 1 0 10 19 -26 27 -5 7 -14 8 7 13 0 2 24 -17 6 -2 3 -15 -10 -16 7 0 12 -10 28 -10 -1 1 9 13 0 12 9 -4 -10 1
4367 1 17 25 20 -10 -1 1 24 15 13 28 6 -19 6 8 15 16 -11 -8 -2 -3 -4 20 -20 -8 -5 9 -27 16 -2 2 -3 15 7 5 9 19 21 15 0 4 4 16
4409A6k0K0kl4K6pj5RJRK2k5j8K5Oj6%Qpj7K4mKnnmOJ6j7lRj7K0Jk1J1J3J6j0
4448A3J4nn3K1J5j6lL3j9lrK6k9K4prJ5q%J8kl0L0j4mjmKQmk9J2%K5k3pRJ7no
4488hoK0l6L8OJJ2j8J0k8JJ1K3l1J4NQm3J8l%JK9l3J0jOl3M9qk1j0J0jJ4j8Nk
4526iJ1lj2K1j3Ok%ONpJ2Mj1rKK7nk0Rn1M5jMj6Qj0J8j9MoJ1Lpj9J7J8pj0J6j3
4567cO%j1OLrMO%mjL6l3oK5Jl3J9JqKK4k2NpL3m0J1Rl1MKMJJ6l1pM2j9lK9k4j3
4610a6K3LporqL0roJ6oJ7ommK1l5J1j3J5Rk0LK3j2k8mL9j6J3nl9L0Qj3j8L1k9
4648b1RJ3qpK3rjJ8k2K4%k0L1oj6j7JJ5lK0Nl2K0qj0J5pk1K3qK1j6KmKMk8MJ4
4687@Qk0OpQnNj2pK9k2J5j8K5j0K3k1K7l8K5k2J0K5nKk4K0j8J5k5J5kl2K6JJ9
$$ plain form
4409 16 -4 16 14 -20 6 -1 -16 -7 -6 3 25 0 -18 7 13 -3 -3 5 -2 -19 5 1 3 -2 -7 -11 -5 11 -6 -9 0 -17 3 4 -17 -6 7 23 13
4448 13 27 22 -31 -10 5 -11 -14 19 0 -3 -12 14 -15 9 2 -7 8 0 0 18 16 -14 16 2 -2 -3 -7 -5 3 -1 -30 -18 -18 7 -16 -23 -14 3 -2 -8
4488 -8 -14 6 -30 8 14 15 27 9 19 -9 -8 3 26 -5 9 14 22 -21 -3 -6 -6 -5 24 -9 1 0 6 -27 22 14 -7 -17 -7 -8 6 -12 -7 -9
4526 -9 2 -1 -13 8 -5 1 -1 -1 5 10 3 15 19 8 -1 1 28 23 3 12 -39 6 5 9 -7 1 -9 9 -10 -6 -12 -1 2 -5 -24 -7 11 4 -6 10 -3
4567 -3 3 3 -8 -2 1 -8 -4 2 2 -2 -3 33 0 -6 19 20 -13 6 7 -1 1 25 3 8 1 34 -6 5 14 -17 -13 -11 -7 -6 10 -21 -28 14 -5 -8 21 -3 -16
4610 -16 7 10 3 -3 -12 -20 10 1 -5 11 5 22 16 12 8 29 -6 5 -8 7 16 -4 -1 22 10 -18 -22 17 1 14 9 -30 0 8 -5 -23 8 -21
4648 -21 -12 1 -7 -14 9 0 -1 17 -5 19 19 -1 30 24 8 -9 -8 7 4 24 29 -3 17 9 -1 14 7 -14 9 1 22 6 8 4 6 10 -18 -14 0
4687 0 8 -12 -6 -13 -5 -10 -5 -17 -24 5 -17 -2 -20 5 -5 18 -3 24 -14 11 -11 -1 24 19 21 -3 17 -1 14 -11 4 2 -30 -4 -3 16
4723A6j6J2Lj7j3nK1rQj1K9k6Jqj1K5K7j1ml3J8j0OJ2k8J2oJ9KRMJk1pk0L3j3
4760a1OJ5k3K8rppMK%lj%OQl2lJ3K1k7K8j2K4k4J7j7J0k2J6j1NJ7Ll5J0J4j2J2
4798CKrOj3NqqK7Mk2%K7k2PoK3kok3Qk1L6m0K9j0J5jj6M0l0jJ0jJ0Kjj1NqJ9j0
4839IMJ2k6LKlj2J8j2J5Jk0mK0qNmK4Pm9J5j5K8J0l3QnK%PQl6K0J7opK3j2J8m0
4879a6QMJ5JrQj9K4l1J0pK4k6J1KOqnK3j8%K5j3Rl4K2OKk7kJ1LL1n9K1K5j7Kj5
4918a3L5m7M7l1K4k3K7j0OqJ0j3j7K4qK1k8pK0k8RNK0k5OlMOk7%Oj4L0LrJ8MJ
4956A5j9oL1j8Kpj4J1J8J3k3K2l4OL2j8rJ8j3%k4rJ9KNl4L4J%j9Ojmj6K8LJ2l8
4994b8%K2rk0K8JJ6J8m4K1K1kj3l2M1plkK0n8J5J1Pj8K2k3qK6l9M0jKk7OrL8L
$$ plain form
4723 16 0 12 15 -2 -15 -20 1 -8 0 -11 18 -8 -7 -15 -26 -1 26 15 11 -22 -4 -14 -8 4 -24 -12 -18 1 3 12 16 17 -4 -11 -31 2 -11
4760 -11 -5 10 -13 15 6 -1 -8 -4 -2 -2 -5 -6 -6 0 8 -24 -27 -14 7 -20 8 -4 20 -4 13 -4 6 -16 0 -11 -6 11 14 -21 -11 3 -9 3
4798 3 5 -4 2 -11 -6 -14 -22 5 9 -13 -13 14 -8 -1 -7 16 14 8 -15 -7 -28 8 -32 -3 -13 2 1 -15 25 -5 -6 4 3 13 15 14 3 8 0 19 9
4839 9 13 25 -1 2 4 1 -11 7 -5 10 11 -9 -13 7 -1 4 0 24 31 -18 -3 -18 10 20 -13 -5 -10 -8 -8 -1 7 -29 -9 8 2 -5 18 6 24 -16
4879 -16 -8 -4 11 12 3 11 -8 16 -15 -5 -12 12 -14 -3 -1 5 -3 -8 15 -3 -3 22 9 18 -16 6 12 14 -13 -15 -4 -1 30 -29 -8 17 0 2 -13
4918 -13 22 -25 22 -9 15 -8 19 9 15 7 17 4 -13 11 3 24 -4 -11 9 -19 -10 -5 15 -10 -4 -7 -3 3 -24 -24 -18 -32 -2 1 -8 10 14 15
4956 15 -4 -10 21 3 5 -2 -16 -5 13 26 3 25 -9 -3 29 11 2 20 7 7 -17 -26 -7 -5 0 -34 0 1 1 -18 -12 -13 -17 -33 -5 -2 10 -28
4994 -28 -28 -6 -15 -35 -7 -6 10 28 -16 5 26 24 11 -21 20 13 10 8 28 -30 -15 -4 3 -15 7 -16 -24 2 -37 3 2 4 -23 -17 -26 12 15
5031A5l9J5mL1m0OPjJ1Lk0K0j4K1J3j8J2JJ9m1J4l4L3k0J6K3jk2rNK0k0j8J8J0
5066A2lj0oj6K5%k4M3popOlj1j9K4J8rj0J3j4k4L1K3k1J9l4QPJ5j2KJ1k5k1QK1
5103Dj5NJ4k5J2j0nJ5j9J8mJ2k2Rj3L5k9J6nj3kQQlJ5j2J0LL3l6K1k8J7qNK3k7
5140GNoMnJ8m1%J4Pmj5J6rJ3l6M1j4j1J2Qj1lJ8rqK4Jj0j6lLJ2njK5rj1K1Rj4
5180A7%j8k5K9J3qk3J6PMMk7MK1j4%njk5J4J3jQk0K6l1J4kJ9j2J4JnpKrK2lj8
5219fK7k6L0k0J3k3%J7j2oL0l4J6Jnj7LmL3n4K6J0j5K6j0Kj2nJ6onj5K3l1L5K4
5255B6l4nK3kLlj8K9j6JnOJ5l2L0j7j2J7j5K9k3Ok6K6RLk7J6Jl0J1mLjpJ1K2K
5293A2j4K0k7J5K0l2%%JK1k0J2Nk6PM2m7K5j6kJ3omNOnoj1kj5K4J7rl3L8k0mk1
$$ plain form
5031 15 -24 -9 -13 18 -22 -16 -9 -10 1 4 -16 4 -10 11 24 6 18 19 38 -3 11 -23 10 -10 6 29 28 6 -3 2 22 2 -16 2 12
5066 12 9 -1 -7 -23 2 2 -22 21 14 8 1 7 4 -7 -26 -2 16 7 -3 10 -4 -28 3 26 5 24 -10 -2 5 20 8 10 21 -4 -25 -17 4
5103 4 -11 -6 8 -17 -5 -15 -20 -5 -24 -6 -10 2 -20 -11 -24 11 -18 -2 -7 -20 -22 -14 -6 -9 6 -6 4 7 40 4 25 -3 14 6 11 34 7
5140 7 12 6 10 5 23 -18 -18 -4 3 -1 -16 0 -9 4 -32 9 -5 -16 -4 4 -7 -10 8 -1 -9 15 16 6 -10 -13 -10 2 -3 -4 21 12 1 22 31 17
5180 17 17 -1 -26 3 16 8 -15 1 8 12 16 -11 -7 14 0 0 -5 -6 -31 -17 -4 -5 3 -17 9 -22 -8 -10 9 -3 11 12 7 0 2 -7 15 12 -6
5219 -6 21 -5 25 5 18 -5 -5 12 0 -6 24 -10 6 7 2 -15 -12 -16 17 -37 -11 -1 -16 10 0 2 -10 -15 1 -5 -10 -25 -2 -33 2 26
5255 26 -8 -13 10 8 11 8 -10 19 3 4 -1 5 20 -12 18 1 -11 6 -9 20 -3 3 -23 3 12 15 -12 4 5 -25 -14 -18 -15 -16 -23 -12 10 12
5293 12 -2 18 -9 6 26 -6 -6 -6 -5 16 -4 8 13 -13 -6 36 -11 14 -2 -4 9 3 -1 4 10 5 -1 -12 -14 -29 -5 12 3 -30 8 -12 -16 -37
5331c7L7j0kK5l5mK2jJ4%pmJ6j3J4k0J7l%%J5k3J9j9mJ2Pj4j5K3j4lJ3pj0pJK7
5369A0j8J1pj0PMk4J3K4ql2K0J0RrqJ1%LnK1j6K3l7K5Lk2Oj0rJ2rOj1%J3J9k7
5407a2LNrJ5rnK3l5OJ7MQJl2J7J6m0K4J3pk3M8k5k4KK2RQl4K2oj6K9JJl2J0j6
5445b1L3j7KmKK5j4j7%j0K4j4K4j5k4L7j8K4j5KQk2J4k4LK5j1K3j3nQj8Q%qK1
5481A3k6K5mk1K6Ll2L2k8J0j6J2j4K4j5rJ9l7N2k3rNJ2K2j9k1L4k1NK4%j4j2J1
5515HJ8k8oJ1j3J5J1lJRl9QJ4Nk4mKJ9j4oK8j5J2L%m2K4lOmmJ4MK2j6Nk2J2K6
5554C4m0KJ8k0kK3Nk9OK2pj3oK7k0%J1k3J1j6J8l2L1Pj6nJ2k3K2jJ2k0n%N1l3
5590AJ5l4J2K0lrkJ8j6J6J0l6MK7j9mrK8k6jK5j1k2K6l7K9j6k4L7j9qM3Jk7j4
$$ plain form
5331 -37 0 -10 -12 13 -22 -26 -4 -5 9 9 2 -2 14 1 15 -5 12 9 9 9 24 1 20 1 -3 9 16 2 -13 10 -4 -7 6 -1 -11 -18 -17 10
5369 10 -8 3 -4 -14 -7 -3 -27 -14 10 2 -30 -10 0 9 0 -8 3 3 6 1 22 6 29 -8 17 20 -2 4 -6 -15 -3 -12 -6 -17 -17 -4 15 -12
5407 -12 -9 -4 -13 2 -7 -12 11 -24 -18 -1 3 11 12 -20 -3 13 -27 -3 10 3 -20 28 3 -21 -19 3 12 20 -14 8 2 -14 15 16 17 -15 -5 -21
5445 -21 12 -5 -3 -7 -5 20 6 -11 -11 -21 3 -11 13 -2 -26 11 -7 17 2 4 12 -10 4 -20 -17 8 -3 20 7 2 10 -8 0 0 -8 13
5481 13 -13 12 8 -13 13 16 -16 16 -12 -2 -18 -6 -20 4 -11 -20 -1 -38 14 -9 -18 -13 -1 21 2 -19 15 -6 -1 23 23 9 -3 8
5515 8 26 -2 -8 3 -10 5 16 13 14 23 -16 -8 6 11 -13 -17 -15 4 -10 -16 12 -3 9 12 12 -30 -6 -9 -3 -7 -11 3 7 29 13 18 -4 8 34
5554 34 -6 -4 14 -6 -8 15 20 -9 -3 19 12 -1 -7 20 0 0 11 -12 -1 -17 1 -31 0 7 -9 -14 -2 -25 -3 -4 8 -12 -17 -17 34 1
5590 1 16 -18 -6 14 11 2 0 18 2 18 28 -8 -4 23 4 0 -9 19 -7 -8 17 6 -16 10 -27 2 -14 -38 -1 -20 -28 15 16 -11 -25
5625b5J8kJ3k7K6mj9M4l3R%KK6k7Ok0L3k8NLNPj6M0j7l6L6j5rjoK9j9lj4KK1L
5663Gj4J4k7OQoMlJ9j9K7k3Pj8J9j4J7ojJ3l1Pj0L5l5N0l7L8k0k6NK6J0Jk6J1
5699Hk6PJ9k1nj1J3qL4k8J5pJ2rNk8L1j5L0nj8J3k0J8RMl0LK4j6kPpkK0j7J4j5
5737dJ1JJ0j1jpRoj5rJ0J6J1jj8PJj3j6L3l7MPL1OMk4jlL6n1K6qnM7m6QK6k7q
5777gqK8mj8M0j9l4J2JQk9JJ5k4J8rL0j3KJ8j4kj1J7JmnOJ6j9j2L5j3J2j3j2J8
5814Hj3K4k3K6j6k7K8Jqj5OJOQj1rj9K6k1K0r%K5k9J1Jj7K1J0l7J5K5Mj4j4KO
5851hrK9J1k1J8j2k2J5j9ORJ0rlMJ4j5oJ4j9J6l0J4qj0K6lPmj3ljJK1PjMk0J0
5890@k8L6j0jK9n4K0KOjj2jK3l1M5k5k9K1j5J4KJ4j0Rml1J7J3J1k6Omj9K8rK2
$$ plain form
5625 -25 -7 -9 4 -23 3 -1 -20 24 -9 0 0 2 28 1 7 -13 20 -8 -3 0 5 12 -4 36 19 -17 19 4 -5 -6 -12 17 -2 -5 -19 -17 4 7
5663 7 -7 7 -20 -14 -6 -12 -8 -11 8 -11 16 -7 0 -18 1 -13 4 -2 -3 10 -21 -14 -24 11 -24 26 -11 27 7 -19 -14 12 22 23 -3 8
5699 8 -18 -11 8 -13 -18 -29 -16 -24 10 -18 -3 -10 2 -7 -2 -30 1 -14 16 11 -7 6 -14 4 13 17 -13 -10 14 -2 -4 3 -4 -6 14 -3 11 -4
5737 -4 7 8 18 7 6 -1 8 2 -13 -22 -12 4 15 14 -4 3 4 -9 -25 8 -29 -25 -18 13 19 23 -1 -2 -5 31 -20 6 -2 -7 40 -6 2 28 1 -7
5777 -7 -15 13 9 -9 31 12 -22 -10 -9 -1 -30 -29 -14 -38 -20 -29 1 -12 -10 8 -6 -8 -19 -2 -1 -5 -10 -4 12 -7 -19 16 3 15 2 -10 8
5814 8 -5 19 -4 22 6 -21 7 8 0 -15 -9 -8 -2 6 -5 -14 -33 -7 -28 -8 -17 -17 8 -21 -10 -9 -26 -5 5 -32 -17 8 12 -2 -16 -14 -8
5851 -8 -17 12 23 2 20 8 -14 1 -18 -12 -3 7 -2 -5 -1 13 -2 -8 6 -13 3 -27 -13 -21 -31 -5 -8 -1 -5 -18 -21 -22 -21 0 7 6 10 -10 0
5890 0 -28 8 -2 -3 26 -28 -8 -6 0 -1 -13 -14 9 -22 23 -2 -31 -10 -25 -11 -9 5 -5 4 0 -31 -14 -1 10 -16 -10 -14 -33 -5 -14 8
5926HJ0m2Nj4M5m0K1RQj6lj7J4Pk2K9lkk1L3KrJ4%m5J7oK8j8j0J0j7MJJ4mPnj4
5965b2K8nk4J4Nj3M0k3o%J7j9J7k2J8plJ5mJ9l5K8kk6J8k1PJ0n3N8j2rrJ6k1R
6001a7J9k6J9l5M2j8M1n5L1Oj6J2j4J6lj2KL4j3Pmj2J3j4rK0Knm9L0NjrrK8Lj2
6038ck0J7J2LMm0L2k0K3j9j3K1J1j1J5k3rJ8rK0j0J9k5Rj0K3j1PJ8n7JM8k1k1
6072b1K1nPm0L0Rj4lj8K2J6j3J0J1ok5J1j0%L6l5rK3k2lK9MJ5l4RK0l1RPk4J3
6108a1K8qj7jM4k6Rl5N2l6%Jk4QkK7j7L1m6L1J6j0k3rN0j9k3J8k2QONq%lJ8j0
6145BJ1kKk9J8Ojj5lQJ8Qk4Pk9J2Lj5J9Pm0K9PqKKmMj9J8j0K0j8NnqJ5RK1k0O
6186Ij4J5J0j0L9l0njjJ5k2j1QkL3m3K4Mqk8L1Kk3Qj6kJ0J7k0NJ3k6mK3qrL2q
$$ plain form
5926 8 18 -24 -19 -33 12 -28 -7 2 10 -6 -9 -26 -12 -5 -27 2 -1 -3 -24 9 11 2 16 16 -29 -12 -18 10 -8 -18 -8 -25 -21 -20 -6 -10 -3 -8 -22
5965 -22 6 1 -23 -9 -4 -17 23 0 -6 -6 11 -8 9 -13 5 -2 -5 10 6 25 -10 18 16 -10 8 -13 -6 4 -49 9 -3 -12 -21 -5 -26 -17
6001 -17 2 -24 -5 -40 2 -16 25 -30 1 7 -9 3 -11 5 2 -10 -8 26 13 20 16 4 17 3 -6 14 16 11 -38 -8 -3 -4 -13 -22 6 9 -3
6038 -3 -23 -6 6 9 13 -27 5 -15 8 -11 -24 -3 8 -3 12 -11 -20 -2 -11 9 -1 18 -7 2 -8 15 4 11 29 -28 -27 21 0 -21
6072 -21 0 -5 2 -38 -8 1 -13 -16 -34 -12 4 -9 1 12 6 -19 -8 -18 -18 18 -17 -26 -3 -25 -28 1 5 20 -14 -5 15 -16 -7 0 -24 -11
6108 -11 17 9 -8 -9 35 9 18 -17 35 -1 -1 0 -24 -16 -18 9 -8 23 -23 8 24 14 -9 -18 32 13 -10 8 -14 -6 0 5 -3 -3 -6 12 2
6145 2 13 11 13 -16 2 8 7 -8 -11 -3 15 23 -1 6 -23 -11 -8 -23 -4 3 -37 -8 -1 -9 -7 -5 -9 -5 -24 -6 -16 4 -14 -9 -14 -22 -7 2 23 3 9
6186 9 -5 10 20 10 49 19 14 13 12 27 5 -6 2 0 33 -10 14 18 10 -18 13 15 -8 0 -16 -18 -8 9 -11 -6 7 -19 -23 0 -8 -17 15 7
6224Gl5OJ2NlJJ7mj9RlK9k0jlL6l2j0J1Ok3K0Ok9OJ5j4Qj2K2j6MqoK7m2J3L0k0
6263a0j3lJ9oM4k5NJJ6j4n1M6J1nj6K4ok0PJ5j9j2K6j8J7pl1K9kmP%Rpj3pQJK0
6302A6k3k9N6j0j2K0j4j0OnJ5j7K0k4K2oL8m8J9jj9L4k4jL3n0K7l3J6pJ6j5nJ9
6336Dl9L6j3KqK3Kj3kpkMl5L5j0j1O4k6j5K5k0K0kk1j3%J7J4qj4OJ0OK7k3qLk3
6374a5J7RPk4MJ7m2K8q%j2K0k5J9J6k1K6%oj5j8K9Klj7PpLK7j7QJ5l1K7k3JMJ7
6412A9j8pOmj1QJ7pj2RMk9K2KmPm0K9Qj5PK0k0K9l1J8kJ5Km1K3K3k7OJ3k0QNq
6451Djrj1J1j7KK0M1l6l5M9j2rj7J3rnK5j2MmOjplQk3J6NJ6j1nKqM0l0RqjPK2
6492B6l3L5Pk6j7Jj2rL4j2J1qj3J8KrQNk2K1k8R%K3mqj5LJ4Rj2NJ5j6oJ3%j4J4
$$ plain form
6224 7 -28 -22 -10 -5 -8 -7 10 6 -13 -4 -7 22 2 1 -2 34 2 -8 3 9 -14 6 12 -17 -11 4 -10 -2 -14 8 -8 -4 -12 -18 9 -33 -20 10 -10
6263 -10 -23 -26 -7 -13 31 6 11 12 28 14 -37 9 20 15 -1 23 17 -3 4 19 0 -12 14 -4 13 6 -25 4 2 -2 5 5 14 7 -6 -13 -5 -4 16
6302 16 -7 -36 20 10 -2 18 4 -6 0 -5 10 -7 13 -11 11 5 43 -5 14 13 -6 28 4 3 36 -14 13 -20 -4 -11 5 -10 -15 4
6336 4 -35 1 -12 -10 -18 5 7 -6 -8 -15 -17 -13 -48 -13 -23 -34 30 4 -11 14 -6 14 12 -9 -22 -22 -5 9 1 -13 -7 3 9 36 13 5 8 -15
6374 -15 2 11 18 -6 -2 15 -27 1 -7 -7 -19 1 -24 -5 11 -10 16 16 10 -5 -23 6 8 5 -12 -5 -12 -9 18 1 9 24 -7 20 -3 -2 2 19
6412 19 1 -6 0 -4 -15 -7 10 3 -9 0 4 -25 -3 -1 -5 2 -38 -9 -1 -16 -9 11 -9 20 -11 7 5 20 22 -19 4 27 0 6 19 -1 7 12 4
6451 4 3 -6 -17 -6 -23 -21 -1 40 4 -31 18 6 -3 -20 -7 -16 -21 4 -8 -4 -8 -2 -3 -10 -13 -5 -28 -12 -7 9 -2 -7 -5 -13 27 -3 6 -2 -3 4 26
6492 26 -7 28 35 9 -8 -7 -19 -28 6 -6 5 -3 -16 2 4 -5 3 8 -14 7 -21 -12 -12 11 7 -1 -16 -13 1 10 -2 3 18 2 -4 9 9 -5 9
6531IJ9j0j9K0j4j2MqK0moLL2m3Qjj2MK3Pj4j4oJ5MOk3KQJ2l1K1pJ5Jj8j3K7j2
6570gK9l4J9j2J4k0NJ2Mk5NJ4K3l3K2k4MNRk8L1j9J2oKrMok8J1K3PnN%Kk0K5q
6609Cj6L9k1kLKJ4mLlj1J4lpk9K5RlNJ7m5lJ6mnlMk2N9n2J4JJ6j9%mRKoj6K2O
6651EJ8oj6%pj4J2mL2k8L3JPj7l2QM1k3k4K7j7k8M2j3pklKj2NK2j4pK1j4J8k5
6688a9J2J3mPj9Mj0L3j8oJ3mkRj4j6K9J2k7J1j9K1J8j7Oj5J0rK1k2%Pk1L5k1q
6724a0Oj4M1j9k8J7J3k5LJ5J2jj0j3K6j4k7L7Nj6Pk0M1j6j0Q%Rj2KRLn%j2J3n
6761A0k4K7j0j6qK2J3rk2RlJ0m5L8j8K6kJ1nLJ2m0M2j3pkM1l7J7%j8Oj6mL4pQ
6798B3k1kOqj4J4%J1oj2j5K2pj2K0lk1K5pjJ0j9J9j7OQJ2k0RQLml3L0j2mL8k9
$$ plain form
6531 9 28 18 -1 19 5 -7 -3 -11 9 5 -1 2 34 -9 -1 -2 -14 -10 13 20 6 -8 -14 1 5 11 -12 -10 -2 10 -21 0 -7 8 9 -9 -22 5 -7
6570 -7 22 -12 7 -5 9 -11 -6 6 10 -15 -10 4 27 -6 16 -8 -4 1 10 -18 13 -6 6 0 2 -7 -3 -9 -37 -26 -3 4 -1 4 4 6 -14 11 3
6609 3 -13 26 5 3 6 8 22 18 21 18 7 21 18 11 -18 7 16 13 18 35 -10 -13 3 -1 -6 -9 -5 -27 32 -20 -6 -5 11 -8 -8 -12 -3 -1 -7 -23 -1 5
6651 5 23 17 1 1 -6 -20 -8 -12 20 -8 25 26 33 16 -16 -8 33 10 -14 13 -4 -32 10 -3 -10 -12 -15 -13 -25 -20 2 -12 -19 2 -12 6 -19
6688 -19 -7 6 2 9 -10 -6 -16 17 -1 -7 6 2 0 9 -5 -21 8 20 -7 4 -15 6 24 7 13 -2 8 -1 20 -2 -2 5 -16 19 -2 -10
6724 -10 -4 -18 23 4 -24 -7 6 -19 -16 -1 11 10 0 -13 13 -1 -28 9 14 -2 5 -15 26 10 0 8 8 17 5 7 16 19 14 14 2 15 10
6761 10 -14 13 3 -13 -21 1 14 5 -17 -8 -11 -1 -46 -8 -26 0 -2 9 4 7 19 -21 21 8 1 -1 40 3 20 20 2 8 -8 -12 22 15 23
6798 23 2 0 6 -2 -16 -2 -2 9 3 -9 -24 -2 -9 -21 -1 -4 -25 0 -7 -8 2 -17 2 -15 -9 -1 11 -9 0 8 11 7 -26 4 -8 -12 26 -3
6836cJ9j5j2J8lnn%Ql7M6l7K9j8LK3m%mJ7j3j0k9L7Kk2K0oj9L7j6QK0ll0JL2j5
6874A4k6J3K9k7j2J5L0l3nqMpK0Jj2J4m3QOK4j3j2J4lK3j0rJ0k7PJ8nPJ1k3kj
6911a0K3j3mL3m7K9k7M0k8lkQj5J7oj3L6k8J4l4M5jk3LJ3k9MnK1j5J4j5%M3mn
6947A6k9L0qkpK0j0jnNmjO%Rj6JRj4K2kj2rLj8OK2k7K5lqqnkNNOj2J9j2J4K0l6
6990hmROmK2lj1oMQl2K8K3k2qK5m2M1l6qL2j8J4k9k7L6J4j5MKrlJ3kJ8Qj3qMm
7030aJk2J2J9kk0J3L2l2K6l2j6N8j8pqJ4rpj1L3n3L1Rj4Nj1pJ8mqKJ3mppQK1k3
7069hkoQjLlJqJ4K%J0j4J9j6QqpKJL0j2l0K8j9K4k1J%Nk8L3Pj1Kk9K6qJ9j6JJ0
7111Gj4kPj4K0jj5J4j5j0M0j9krJ1kK7m1J5J2j6K0j9NLpJ4k6J3k5L3qMql2N3l5
$$ plain form
6836 -3 16 1 -11 7 4 -1 -6 -6 2 -35 11 -26 3 -15 -12 11 7 7 3 20 7 -3 -32 5 7 -15 5 -1 -20 17 1 9 29 26 -4 -3 29 14
6874 14 -12 1 30 3 -9 6 36 3 -2 -10 -6 -13 7 8 -4 10 -33 -25 -19 5 -8 -20 -6 -9 14 4 -5 5 -22 -15 3 -2 5 16 -7 -9 -10
6911 -10 13 0 -4 29 -18 11 -16 24 -4 -7 -9 -1 -16 1 -5 -18 18 -10 4 -30 15 14 -9 -6 7 -22 -18 -23 -2 -17 -3 -18 -18 25 21 16
6947 16 -13 17 9 7 0 20 10 9 4 9 5 4 10 10 19 3 4 13 -1 21 19 7 -2 1 -17 -11 11 -16 9 6 -2 -10 -15 -17 -12 -7 -1 -13 6 -6 8 28 -8
6990 -8 -12 -3 3 -1 21 18 7 1 5 13 -19 9 32 10 2 27 -15 26 -10 -18 14 -4 10 -19 -46 -10 4 -11 -7 -5 -14 -17 -4 -6 12 20 7 -1 3 -1
7030 -1 0 -22 -10 9 7 -13 0 32 0 26 -6 -22 36 18 11 3 17 8 1 -10 23 -30 1 10 -4 1 -10 -17 1 -3 -11 -9 4 0 -7 -14 -6 15 -8
7069 -8 -10 -16 -8 -9 -6 -9 -8 -16 -2 0 0 10 -4 15 -1 7 -1 -8 -6 -5 25 13 -17 11 -8 16 -5 -4 -4 1 -27 6 13 2 4 -25 1 -7 12 -4 -3 7
7111 7 -7 -9 -2 -16 4 3 -12 2 -13 -23 17 -2 -4 -13 -2 -4 23 -18 -3 9 -7 13 -6 -1 2 -5 9 -17 -4 -29 4 -4 0 -8 -40 13 -22
7148b2LJ0J2k6J7Rj7k5O7k2k7KQK9l0oK4lK4j7pK5j6J1k1oJ4nj2M5l9J1kj3j2
7183a7j0j2M1ljrLJj7RL2j9j4J8m9O5n9L3J2njk9L9qNpOQjoj3J0JMk6M0j8j3L3
7222B3l8L3l0l0L9j8OpL8l5%J0Rk2jK1j7QK0J4l0Jj0qNK0j8KJ1%J4nLNj9QJ1o
7260Gj7J5mJ1rl2PJ2M4l2k6K8k0qJ5J7j7kPK0m4K1L2j7l8K7J0j3J4oJ2%l4PpJ1
7296iK1j5J2j2K6k9j1oL1m3L6k2J6k0%K7pk0L9j3Qj2Nj8j2L0kk3PK9nj6mK4k6
7331a4%PJ4JMn8L4K3OoJ3m5K5Rmj8JoL4J5o3L4%l3L7j3JOm6M7okj1%K2j2lOMM
7371Gj4J5pj7L2k4J8Nk2OJ1J4pk0KoJ3J1k5J5l3M0j5Pok3J7Omk4M5k7NJ4rj6K3
7408Gk2%K2J1k8lNK2j4j0NMj2K5k7K9Mk7K1o%J9k1j5J4jj0J0j4j4LoKJ2mPpRo
$$ plain form
7148 -22 -19 -9 3 -23 -6 3 -14 -39 28 6 -21 -19 -11 18 -12 -18 6 3 27 10 3 28 12 23 2 -4 10 5 -7 38 -1 10 8 -5 -17
7183 -17 -27 -39 2 -1 -2 -11 -8 -7 -24 -15 17 -2 -16 2 -47 18 -41 -8 4 -1 -2 -31 8 0 5 -2 4 12 11 5 -8 2 3 7 -19 21 3 -10 23
7222 23 -15 18 -12 -42 -3 -21 -15 -22 16 -19 -19 -9 0 -22 -23 -2 -19 -11 9 23 -7 -6 -16 -24 -19 1 -17 -15 -4 -4 10 5 8 13 -6 2 13 7
7260 7 -10 5 1 12 3 -29 -22 -10 34 2 -24 4 -16 -24 -9 8 -9 -11 -4 16 -28 -7 25 8 -30 -3 7 -6 8 2 14 14 -20 -13 -20 -9
7296 -9 12 -3 9 -3 23 -6 -17 -23 8 -35 1 -21 -5 -25 -25 2 -5 -25 14 1 9 -3 2 -16 -28 2 0 -23 -16 13 8 -8 -12 12 -14
7331 -14 -14 -7 7 8 12 -46 -12 11 17 11 24 -21 4 13 9 -9 -8 -14 20 35 -28 6 6 -27 10 -3 -2 4 -42 5 -1 -3 -14 -14 8 -4 -7 -1 3 7
7371 7 -7 8 1 -16 16 -8 10 15 -7 -1 10 24 17 -3 -1 -7 6 17 -8 7 -26 14 -1 6 0 -23 -6 0 -4 -28 17 -10 -5 9 0 -16 7
7408 7 -15 -15 7 18 -10 -13 -8 14 0 -10 -5 -1 -13 12 -15 14 18 -9 12 6 6 25 4 -11 3 2 -8 2 -12 -26 -23 -29 -27 -15 -19 -12 -19 -10 -16
7447a6J1Ok0K4J1m9J6OOK5jl1J4RpRk5J4jL0m4nJ8rKJ5Ojnj0LlJ8m3NL0l8M0j0
7486@j8K8Nkk2jK5l8PrL4k3PK0k1J9rj6J8qML%lJQJ2j1j7K6k0kj3PlK5k7j7Nn
7526c1K0J9J0m6K1qk2M0Mk2J6pK0l5K0rJ6Lk1J2JK2k8ppK4NqjJ5l0J7QRl8L9o
7563A5j7j5J3RJ3k0KjORlk5KkL5l1k1L4j2jj3L1j6K4%NOk7kJ3j3J2rj8K8oK3m4
7601a6M1l0JK%l1J7K3mmj0jnJ4j9K1k7M4l2RJ7j3k8L4nKl3K7Qqj1O4k1k4J4l4
7637a8L4k0J4nK1jk4RqK3m2kL0k5%JpJ9j0jrJ9k6QJ5lqrNQJ1K1l0RRj8J5j1L1
7676B5l7kJ3L4k8rqJ8k1j5K4qOj3Qj1K6j1NkmJ0jj3JJ7Jj2K6m2J8j1Okk0L0qQ
7714bLqj0K7jrpj2L4oj1lK5k0oJL4l4J1Jlj9j3K3k4L9j0pj1R%k2K5J3j9j4K0n
$$ plain form
7447 -16 -5 1 -19 5 16 -33 -17 -11 -5 20 19 -12 2 11 4 13 -12 2 1 31 -13 -18 0 -9 -7 8 14 13 8 -2 1 -2 16 -27 -22 8 -30 10 0
7486 0 -18 10 15 13 -9 -10 15 -23 -16 -25 9 -14 -7 13 -8 11 2 -14 4 -4 0 3 3 0 1 9 21 10 -7 19 -1 -3 -16 -9 -12 13 -14 -31 -26 -31
7526 -31 -11 8 18 -28 -7 -15 -37 3 7 -15 1 -6 14 -21 -1 -10 6 9 -12 0 1 23 -5 -12 -19 5 10 2 1 16 -14 3 11 20 -18 21 15
7563 15 -2 -17 -4 5 18 -2 0 -1 5 14 11 -14 -12 -14 21 -10 -31 3 -9 -10 -23 8 -8 16 16 21 27 0 -2 11 -2 10 1 -17 11 5 28 -16
7601 -16 25 -5 -4 -2 -2 -33 -16 7 3 -1 -11 -12 -17 -3 -22 -1 -28 16 -16 -7 10 -3 -31 3 -2 0 -33 -6 2 -6 -17 47 26 2 16 -18
7637 -18 16 -4 10 5 26 25 1 10 2 25 -17 -19 11 -14 -14 -13 -20 -1 -11 -12 -21 -2 -28 -20 -5 -8 -16 -25 -20 -12 -1 20 -10 -1 8 -10 5 -6 25
7676 25 -12 -14 -1 33 5 -4 -12 6 -15 -30 -6 -14 -8 -21 -13 -24 2 -9 -4 -6 -10 0 -1 -14 -13 4 5 -7 19 -23 -5 -16 -10 -12 -32 -2 -10 -2
7714 -2 1 -7 -17 10 9 0 -7 -19 15 9 -2 -5 20 0 -6 -5 29 -5 6 7 4 -15 -28 -5 -29 10 0 -7 -18 -9 -9 -31 -6 7 -12 -26 -6 -11
7752a1J7MLJ5k1mMLrj8K0J8ljrj1%J0j7LKlPJ1krj0QQj6J9kokklK2l4K3Jj9K1
7794Gj0k7K3J0RJ0m2J6K0j4OrJJ7pNk4Rk4LK1lJ9j1k8MJ7j6OKK3m8L2mpNoj9L5
7833Ak1LJ8K6n3J8OPk8J6J9j3J9j5k2J7Rj9K1k5K1lj6K1k7L2mj5Roj2K5k5Jj1
7868b6J9j8RJ4j7roK5k0K5qlJ9J9j9%k6J7OrMJOr%MOpNK5l8Q%J3l0J8kj6L7j7
7908@j5J4J0Nk8KJ9l6J7L3m5J2Pk2N0jl1J6j5Kj4K4K5k7j1L1j6j0KJ0j5jJ8j5
7942ek7K2%NmrPQj0jlOj6qJ1QK7j3j6J6qJNJ1pMJ6j2j1j2J1K0J8l9K5k6j4K7J9
7981B6m6j6J6QK2j0%Q%j7K9k1oj7M3m6PJ8j4kJ9J1l9K4Nk8K2Qj6MK8j4j2K4Nl0
8017gJ0J0k3J2rJ8J1l1lkM4k5pj0K3j0%k3J0Nj5K5Nk4J6j5J5JRk5j8L1Okj8J6
$$ plain form
7752 -11 6 10 13 28 7 3 7 10 1 -17 3 21 18 17 8 -3 -3 7 -10 -7 -5 -8 -1 10 8 -1 -11 -3 5 -11 8 6 0 -2 -4 -7 15 -19 4 5 -14 7
7794 7 -3 -30 -7 3 12 22 -20 -4 16 2 8 -1 0 17 10 15 -9 0 -24 -21 0 -3 16 5 -23 -19 -2 -18 -12 -10 13 -35 -3 -7 -14 -9 -15 -34 1
7833 1 -20 -17 1 27 -26 -8 -2 5 -23 -7 12 -1 18 3 -19 -2 7 -12 9 -16 5 2 -14 7 -20 12 8 -7 2 -4 -16 9 -16 -15 -26
7868 -26 -7 -25 -16 -2 -19 -28 -34 -9 -29 -4 -12 -15 4 23 4 4 -22 -5 1 -8 -4 -3 3 -6 -6 -2 4 -3 2 27 -11 -3 -3 10 -20 -2 -4 -20 17 0
7908 0 -15 -1 9 14 -14 -12 7 -29 -12 21 -24 -12 -5 -27 23 22 -9 7 -8 -6 -20 4 29 2 -9 22 6 -4 -2 8 -7 -8 10 -5
7942 -5 -32 -10 -10 -5 -9 -18 -11 -3 -13 -14 -17 -11 -27 -35 -24 -16 11 -2 -18 -2 -10 -9 -4 7 0 4 20 8 -3 -15 -4 16 34 -5 20 -6 -20 7 26
7981 26 -20 -36 -20 -12 10 0 0 8 8 -9 20 -1 -7 -24 19 -27 -20 -2 -16 -18 1 12 -27 -3 2 -26 -4 4 -12 -8 20 6 -6 18 23 -7
8017 -7 3 13 -10 2 -7 11 22 -9 -12 -14 30 5 -2 -12 11 1 1 -22 -12 -7 -22 3 8 -16 0 -15 0 1 10 -15 -33 -2 4 2 -16 0
8053@lJ6J1rnMpk0JK0KLk0J2mmk1L8l3K0J1mLMk1k3QQqJ5j1J2PJk7QJ3moJ0Jj3
8095a5K3j3RNQNl4J8pj0J4j1L4k8J9k1LlpJRJ1l2J2P%lk2QJ0lK4mj0j1J3pK0j9
8134gJ0mQpnJ0j1J3J0l7LRK7k9K1k6jM1m1jK7Ml3J6nNjOJ8k4%K0k3%lpK2k9mJ4
8174a4OmrJ1k0J4J4PJ3j9KJ5k6J1k1NK8
$$ plain form
8053 0 -3 13 24 15 10 14 7 -13 -12 8 10 13 -7 5 1 -3 -24 14 -19 1 12 8 11 15 -6 -29 -21 -13 -21 -6 -17 -5 2 3 -24 -16 -3 -7 -13 -3 -2 -15
8095 -15 8 -5 4 9 17 22 -12 6 -1 -11 3 -8 26 -2 17 -4 -1 -4 -11 -10 -1 10 -22 -10 -3 -3 -6 -28 -20 -10 -13 11 7 -3 -14 -1 -8 12 -7
8134 -7 3 -1 7 0 -5 5 -6 7 17 -20 -17 -8 19 -10 11 -15 -16 25 -16 -17 10 14 -19 -3 -8 -3 -4 2 20 -4 -4 16 -7 -7 -10 -17 5 -24 -28 -14
8174 -14 -8 -12 -21 -10 -30 -16 -2 5 18 -1 1 16 -10 1 -20 -15 13
8191A3
$$ Imaginary data points
##PAGE= N=2
##DATA TABLE= (X++(I..I)), XYDATA
0@%%%%%%Qj6J6j6J6j6K4l2M0m8N6p2Q8j03J19j40J61j85K14k43K75l14L58m03
30b13M52n08N70o36P09p88Q72r66J068j175J292j421J563j717J883k065K264k483
48a299K724k991L287l617L990m416M905n468O127o911P857r021J0483j2362J4848
63H136j8264K3181l0692M3176o6822J23882m48076m27811J384806j056664P84252
74C19104L3813p00571K92025j21933M36518k89070K04717k95295j24141M48026
84B03193k98481L26029l78601J02744J21023k48058M76712n18375K03407J36638
94A26231k82806L67932l30784J8934J91524r1617N8377q681j95680N4608K66231
105A74269k20474J57366j23293k21471L39113j01695R9799o7637j63244J01699
$$ plain form
0 0 0 0 0 0 0 0 8 -8 8 -8 8 -8 16 -16 24 -24 32 -40 48 -55 64 -76 85 -100 114 -129 146 -168 190 -213
30 -213 239 -269 301 -335 374 -414 458 -508 560 -615 677 -744 819 -898 985 -1080 1184 -1299
48 -1299 1425 -1566 1721 -1896 2094 -2322 2583 -2885 3242 -3669 4188 -4833 5650 -6712 8136
63 8136 -10128 13053 -17639 25537 -41285 82597 -365479 -793290 591516 -465148 319104
74 319104 352917 -347654 -55629 -177562 258956 -30114 174603 -120692 -244833 203193
84 203193 -95288 230741 -147860 -45116 75907 -172151 304561 -213814 -10407 126231
94 126231 -156575 211357 -119427 -100493 91031 -586 57791 49110 -146570 -91962 174269
105 174269 -46205 111161 -12132 -233603 105510 3815 103614 35977 -127267 -25568
115b5568j7417J52237n2613q3350m2635N0284K1495K0700Q4231k19890J40189
126B7663l3157o7735J93164j85783J04108k4979p9764J00658o4618N4915j084
137B3388Q500j01095N9569L3280p4866J84165j80673n683P0645p0593J34541p7891
149C287J7759q0346J8190J07901j03001J09866j02278j9322O8005m2899Q2892
160F0054r1219M3772j8308l1619Q8047q2808M8672j6900k14J3716n1566O4790
172B6417m6355L6941J3208o1078K2387p263L6479j1535J0493k8399m1854P1240
184B0681j2914Q408K132m6305L082K9308K0225j9794O251l3726P01L9631j5132
197B548J6197k5772o060J1052m460K5971k3886P014j977j6091K4528j1258L375
$$ plain form
115 -25568 -42985 109252 56639 -26711 -69346 -19062 2433 23133 107364 -112526 27663
126 27663 -5494 -73229 119935 -65848 38260 13281 -66483 34175 -30443 24472 23388
137 23388 31888 -69207 -9638 23642 -51224 132941 -47732 -53415 17230 -53363 81178 3287
149 3287 21046 -59300 -41110 66791 -36210 73656 -28622 -47944 20061 -22838 60054
160 60054 -31165 12607 -5701 -37320 50727 -32081 16591 -309 -523 13193 -38373 26417
172 26417 -19938 17003 30211 -30867 -8480 -15743 20736 9201 19694 -8705 -50559 20681
184 20681 7767 16175 18307 -27998 -24916 4392 24617 4823 11074 -22652 -21951 17680 2548
197 2548 18745 -7027 -13087 -2035 -6495 19476 -4410 2604 627 -15464 9064 -2194 1181
210A181P953j0829p084Q199J259m769K1949k0377j0224J6043j0496J2739P147
223A2691j4618r062Q836L929j221J0645j3130p993R726K984l909O097m09j7103
237a2537J8129m857r391K1218j6544L005N058j2282Q194K231L379n482j827k837
251d543j898J5316m046m728l041m553N690Q750J548j3656K316j641M69J6946j1508
266A421o417M355n571Q470N856r166k503K713j963O042K43n950J720q62L658j773
282B73j212J949m196O956k512n126M759k726L181K965n568k569L031J466J668
297B339J686p520k29M219j0L888l570m350J530J304L723n04l357j044o48L675
313A132J614k873K41k075P60L549k693P31k29j594K180o12m63J94P23n77j33M33
$$ plain form
210 1181 9134 -1695 -8779 -580 679 -4090 17859 -2518 -12742 3301 -7195 5544 12691
223 12691 -1927 -10989 -2153 1776 555 11200 -1930 -9923 -197 2787 -1122 4975 4566 -12537
237 -12537 5592 735 -8656 12562 -3982 -977 4081 -8201 -7 2224 5603 121 -1706 -4543
251 -4543 -6441 8875 4829 101 -2940 -7493 -1803 6947 8495 -5161 -2845 -4486 -4017 12929 1421
266 1421 -4996 -641 -6212 2258 8114 -1052 -3555 -842 -2805 3237 3480 -2470 -750 -1612 2046 273
282 273 -939 1010 -3186 3770 1258 -3868 891 -1835 1346 4311 -1257 -3826 -795 671 2339
297 2339 4025 -3495 -3724 495 485 4373 803 -3547 -2017 -713 3010 2506 -851 -1895 -2543 1132
313 1132 2746 -127 114 -1961 -1201 2348 -345 386 157 -1437 743 131 -332 -138 585 8 -125 308
331C08j916K146N12q26m1j660J191L15J586q13k493J558p12J501J064k129l00
348g09j35R26M34L71r55p65O29K8Q16n43L8l38l25J013r13P57j18l76L92r22P45
369E0OL44L9r72J99l8Q81r0k86l31o57J139n0K06j91j004O73M4M24L7p28J31K7
392a47K78M3j24j31q2K61j60q8K40p4N7J3l10K8K28K06l6l32p2j36N38K72m97
415b5n0l41K62M75l3j59m85K20N8L56R8o84L15k65L23L12n47K76l36K22J95k65
437g8J70k71K77l6r4N2k10L35j28N6j32k34M34j99K65k00l23L73j34K64m0l02
459a55O9NJ58P0j23j09n8J77M0O4j59m0P9m7J43j10n0P9r1J08l4p6J33p5J2oo6
486f2N7L8k0mp6m6J35K2l4kr5J3J31m8K6q2m2R7J4K9n9n7O5JK3J1l9J2J2kj8k
$$ plain form
331 308 -1608 538 1050 224 183 -1477 -286 29 1615 802 -1691 -133 -845 656 1720 -409 -709
348 -709 -844 82 516 887 -68 -833 -204 -176 640 97 135 -203 -528 485 -428 329 211 -165 227 -695 50
369 50 56 400 439 -533 -334 -372 509 419 133 -198 -855 284 234 440 249 -755 -82 -38 386 423 -305 -174 -147
392 -147 131 174 50 -81 -163 98 -62 -150 90 16 73 86 -224 -196 32 238 202 -130 -202 -338 200 472 -25
415 -25 -75 -416 -154 321 288 129 -356 -136 -78 278 376 -308 7 -258 65 377 -170 106 -230 -8 187 -78
437 -78 92 -179 98 62 -32 20 -190 145 17 73 -59 -293 141 -58 207 7 -316 57 -77 187 147 -155
459 -155 -86 -81 77 147 24 -85 -143 34 74 138 -21 -61 18 -29 114 4 -46 33 -58 50 16 -60 73 -2 10 4 -62
486 -62 -5 33 13 9 -67 -113 22 44 10 8 -87 -74 57 9 35 -47 -89 8 22 51 -8 -65 0 1 24 35 -4 8 20 18 0 -2
518bk5N1j8k5K0l4Q0k2m0Qo1R1k8J8j2n6L2M4ok5j6J3mN6k6j8k0m1J17n5M5m5
550d%L3l2L4k4m5L1lN0l0j3nJ3J3j8J5k3j8M7m0K3l0rN7m4K0l9L4Pj9jQOK8l1
585iK4m3K3KPJ4j7Mj2rL1l0L4jm9M2kj2J1k5J0lOPj5K8l7L3k9RM3o6J4j2JJ4j9
622c3N1k7j6J4j9M3k7K8Pl1J2m9Q5k4j3J8k1J8m4L3J2l1N2o3L4Ql1K3l0PK3pl2
655c0K7pj2j2J2j5KL9nqMOk6J3K6l1POK3j1k0QJ1qQJ2j0j9RJ4JJ7k7j1J9j3rj3
693b3J4oNJ3k2L8l5J7rNj2oJ9Ql1PM6k0Ql9PmK4J1Npk6ON0m4K0j5j1j8K0K2k8
730a1M0n7M3j5m0L0j6L4qLj0MMk9K9pQkmj9K7K4k4KJ3j7j1j8J2LK2j8J4J0k0J9
766A5Nk0J0orkPNlo%%J3j4MjNk2L1m0N7n5L4j7j1rJ6J6m4M7j1J9Ql5J2lJj7L6
$$ plain form
518 -2 -27 24 6 -19 1 -33 47 25 -15 -7 -68 23 -5 13 1 -55 -23 21 15 -10 -26 -13 -17 39 13 -5 -25 -66 51 -4 41 -4
550 -4 -4 29 -3 31 7 -38 -7 -10 40 10 -3 -8 5 18 0 15 -8 -26 21 -19 4 -26 -35 22 -22 -2 -41 -7 0 -19 -20 -12 -6 22 -9
585 -9 15 -28 -5 -3 4 18 1 5 -7 -16 15 -15 19 18 -31 11 9 -3 8 -17 -7 -10 -4 3 -12 16 -21 12 -17 -8 35 -31 -17 -29 -28 -14 -33
622 -33 18 -9 -25 -11 -30 13 -14 14 21 -10 2 -47 38 14 1 19 -2 16 -28 5 17 -14 38 -25 9 17 -14 9 -21 -14 9 2 -30
655 -30 -3 -10 -22 -34 -22 -37 -35 4 -1 -9 -5 1 -25 -12 14 -17 -10 -4 19 8 -12 -4 7 -1 7 19 9 -10 -1 13 14 31 4 -7 12 -1 -10 -23
693 -23 -9 -15 -10 3 -19 19 -16 1 -8 -3 -15 -21 -2 6 -25 -18 28 8 16 -23 -16 -20 4 15 20 13 -13 -7 43 -1 19 4 -7 -25 -5 17 -11
730 -11 29 -28 15 0 -40 -10 -26 8 0 3 -7 -3 1 -28 1 -6 2 0 -4 -23 4 28 4 6 19 2 -9 -27 -15 -12 10 -8 6 16 -4 15
766 15 20 0 10 4 -5 -7 0 5 2 -4 -4 -4 9 -5 -1 -2 3 -19 12 -28 29 -26 8 -9 -20 -29 -13 3 -41 6 -5 14 22 -13 -1 -4 -3 -20 16
805A6Kk6L3KJ5j9nm1K1J3lJ2Nm8J6jL2n0K2J8j3rR%Mj5j7L3qoj6j3K1K1Opk7J7
843fJ8Jj1J0j9oK9nojqJ8Ok9N2k0k1Lj6J1rK1j9J9l1J5QMk6j0QL0l2J4Lj3K1l
881@j5J6pNJ3nJ4l0K0m5K6Rj7J3L1l5K8j7kPj8J9%J1j7J4m6K8rnOJ2pl0K6MJk5
919b7K8j5k0L6nMk4K4%K2l2ROkkLM2n4J5Qj5k8QK1k3K9J5k0MKl1L1pKnj0j2J6
957glk1K0Pqj2J7j1L9k9QPJ2Ll8J1oL7k4j2K0Nk8L0j0JJK2m3j4K4J5J3k2j1Lj5
994a9kJ2J8k4OQk3kKM2k6J6lK6k7k1PNK7k4JRqL3Lk5Lj2K1l4L5l7K1Jj1J7j5o
1032fJ1mJ0k7pLMqMJ2rpL0j9MON%njk1M4Pj1k6K5NrnJ9pJ2j5J0l3lK6j1Oj0L8
1073C7j5j3L2n4K5qK3k2l2N%J4rJ7j2J1j8%J7nJ4j4oK3RKj0j1J2%j0L3k6J3j5
$$ plain form
805 16 18 -8 25 27 42 23 18 -23 -2 11 8 20 25 -23 -7 -8 24 -26 -4 14 1 -8 1 1 5 -10 -27 6 -2 -8 -24 -37 -16 5 11 4 -23 -6
843 -6 12 13 2 12 -7 -13 16 11 5 4 -4 14 20 -9 43 23 2 5 -11 0 -9 12 -7 12 -19 -4 4 8 -18 -28 -20 10 -22 -8 -5 -18 3 0
881 0 -15 1 -6 -1 12 7 21 -9 11 -34 -8 1 -16 -3 28 -7 21 4 2 9 -9 10 10 21 4 18 -28 0 -9 -14 -8 4 -3 -33 -7 -3 -2 -27
919 -27 1 -14 -34 2 -3 1 -23 1 1 23 -9 0 6 4 2 5 47 -7 8 16 1 -27 -19 2 -21 8 23 3 7 9 -22 9 2 4 -1 -11 -23 -7
957 -7 -10 -31 -11 -4 -12 -24 -7 -18 21 -8 0 7 19 22 -16 -5 -11 26 2 -10 10 15 -13 17 7 8 9 31 -12 -26 -2 13 26 4 -7 -4 -19
994 -19 -21 -9 9 -15 -9 -1 -24 -26 -24 18 -8 8 5 31 4 -17 -10 -5 22 -2 -1 8 0 33 36 11 14 2 23 -11 24 -13 8 9 -2 15 0 -6
1032 -6 5 1 11 -16 -23 -20 -16 -24 -20 -8 -17 -24 6 -13 -9 -3 2 2 -3 -4 -25 19 26 15 -11 14 19 10 5 24 17 29 14 24 -9 -12 14 3 9 -1 37
1073 37 22 9 41 -13 12 4 27 5 -27 -22 -22 -8 -17 0 -12 -1 -19 -19 -2 -7 7 -7 -13 10 19 21 11 0 12 12 2 35 9 22 7
1108GqJ4qMj4oJ0lJ6oRj9okj5MKK2mJ8m1L5rKJ5j5l3K9J3J3k8j1J7O%rJ5K5k6
1147A3oj2M1n9K8KJ0pPk2J8k2K0k4J4J1k5j1J6RKqrK8l1j0JnL9j1J4k6J6Oj2J4
1183IkJ0jk6kPJ5%j5QrJ0RjNk6J4Qrk0nL2j6j4K4k9M1k6pK7l5J1J8r%OkqqJ4Q
1224Flj3K1OPk9K%J6J6k6J6Oj9kNnj1NJ5l7K9J0j1lJ7nj3j4LJ0k7K8k5OJL3j8
1262cmj9L1K7k9k7L5J5k3J8%oj7J0J1k6L1k1k1K6j1K4j1j8NONQj1KqoJ1k7lJ2
1298a4NMk6L2Rl1JJ0MRj1J2Oj2J7NLj5K7l3L2k9jMJ5k9J1lJ2j8KNkmJ9j2l1J6
1336a1OmMqKKJ3j2j2J9MopK5K1k1Nj1J9l7K5J7k4j3J3K1j0K0n0K1JJ4j1j2Lk3
1372a7KRNoJ3J2k6Mm5N0pqOPnnl2L9j8J1kP%J1oJ0j1k0J5j8M1J0k5k0NRK8m8O
$$ plain form
1108 7 -1 13 5 9 -5 -11 -1 -4 12 6 15 -4 -10 -12 -27 -23 -21 1 -3 15 -26 9 0 2 17 2 -31 -2 11 24 -4 -15 2 8 8 -1 14 39 13
1147 13 7 -5 36 -23 5 7 17 10 17 -5 13 -9 11 -13 1 12 -13 -24 -8 1 3 -5 -14 14 -17 -27 -26 -31 8 -3 11 -15 1 7 -5 9
1183 9 7 17 16 -10 -12 -5 10 10 -5 3 -6 4 13 12 17 -9 5 13 4 -16 -21 11 -5 -19 5 -24 17 -9 -16 11 -24 -13 5 -4 -4 2 0 -8 -16 -2 6
1224 6 3 -10 11 17 24 -5 -3 -3 13 29 3 19 25 6 4 9 4 -7 -2 13 -24 5 15 4 1 18 13 0 -14 -11 -1 -28 0 -25 -19 -18 15 -3
1262 -3 -7 -26 5 32 3 -24 11 26 3 21 21 15 -2 8 19 -7 24 3 -18 8 -3 21 10 -8 -3 3 8 16 5 7 -1 -7 4 -23 -26 -14
1298 -14 -9 -5 -31 1 10 -21 -20 -10 -6 3 -8 4 10 -2 15 20 23 8 35 2 34 5 4 8 23 -6 5 2 14 -4 -2 3 1 -3 16 4 -27 -11
1336 -11 -5 -9 -5 -13 -11 -9 4 -8 -20 -1 3 -3 -10 15 36 15 20 9 28 -9 16 33 9 -4 9 30 20 40 -10 11 12 26 15 3 6 -17
1372 -17 -15 -6 -1 -7 6 18 -8 -4 -49 1 -6 -14 -8 -1 -6 -11 -43 -4 -22 -11 -13 -6 -6 5 -1 9 -2 -22 -7 -25 16 26 1 -19 -14 -5 23 -25 -19
1411a9J9Lnj6mK9ojpknj2nPK3Mk9K6k2J1LJ6k3k4L9k9K0lK6l3L5k4%PKJ6l8L7
1449A6ok3K1kmJjnJ0jK3m4j1RJ5nNLrj8pN4l3Qk7J0K2rLMJ7m6N0k5K0k2j0Lj6
1488c0N9k5L8m7L1l6kK8k9L0k7Nj2%K1pJ6Kl6joK4Nj6j4nJ3L0kjlj0KJ4J3k1L3
1525C4lj3J6m4MpM4l6L%oJ4j5J6%j4K8k1j1QOr%PJ1j3qnK0j2K2npj0pj5K1NJ5
1564A3J3j3k2RJ4mOj3Qkj0k5N4kl6K1k8J6J1j1nnJ0K9l6J6k8j2K3j1J0J2Jj3J1
1599Ak0%RqkK8lrJ5Jq%KJ4k8%jK2PLk2K1k8Lj7rL0qKJ1JrK5m0j3OM0l5%OnK0k1
1642a9L0k6L1k2NK8k5qLJ0J7%l5j0N6n2LK6lK4l3rJ5Jk4J8Nj6nJ1%j4J4j6PJ3
1678@j5pJ0J1njK5jpm%J7l4J1Oj4J3J4k7NJ1k3K1jmj7N0l2j9J0K1k0j7RLK0n6
$$ plain form
1411 -19 0 3 -2 -18 -22 7 1 0 -7 -9 -14 -26 -31 -24 -1 3 -26 0 -22 -11 -8 8 -15 -39 0 -29 -9 -12 14 -19 16 -8 -8 -1 1 17 -21 16
1449 16 10 -13 8 6 2 3 2 -3 7 6 29 -15 -26 -17 -2 -7 -2 1 -8 -26 -33 21 -12 -4 -31 -21 1 -8 -5 -1 16 -30 20 -5 15 -7 -17 -14 -30
1488 -30 29 4 42 -5 26 -10 -12 16 -13 17 -10 -5 -17 -17 4 -3 13 15 -21 -22 -28 -4 1 -15 -29 -34 -21 9 7 6 3 -7 -5 9 22 1 34
1525 34 31 18 34 -10 -6 -13 31 -5 -2 -2 -8 6 -9 7 7 -7 21 0 -11 -3 3 -6 -6 1 12 -1 -9 -14 6 -6 16 11 4 -6 -13 -28 -7 -2 13
1564 13 26 13 -9 0 14 10 16 3 11 9 -1 -26 28 26 -10 11 -17 -1 10 -1 -6 -11 -1 28 -8 8 -20 -32 -9 -20 -10 2 3 -10 1
1599 1 -19 -19 -10 -18 -20 8 5 -4 11 12 4 4 6 20 -8 -8 -9 13 20 23 1 22 -6 -3 -20 -29 1 -7 -5 6 7 -2 23 -17 -30 -24 16 -19 -19 -13 -18 2 -19
1642 -19 11 -15 16 -6 -1 27 2 -6 -3 7 24 24 -11 -21 35 -17 -14 12 9 33 0 -9 6 7 -17 1 6 -10 -15 -4 -4 -18 -4 -20 -13 0
1678 0 -15 -22 -12 -1 -6 -7 18 17 10 6 6 23 -11 0 6 -8 5 19 -8 -3 8 -15 6 5 1 -16 34 2 -17 -7 14 -6 -23 -14 -11 9 -47
1715d7L7L5l8J5j2pJ6%oj4J5K4j5k6K3j2J1J0k2N4j2j5j3OL0j8MrJK0k4Kj2J5
1749A6j6j7KJ0Nj1JNJ0k5M7m3Nnj7J7opK8J9qmk2K1k6K4qOj4J3L4Kl8K4m3L7j4
1786BPjNOl3P%J6j4J4k7K%J2pj9N1l8MJ0j8J1J9Kk1j2L1mj5RQPnj7pJ9omK6k3
1826cJ3J4j5j7K8k3RJ0j1k6J5J7j6j6rJ3L3j8kQj5pJL2k2J4Qj0j1J4Kj4L1l3J4
1861Hk3L3nLJ8l1nJ3Pj1L0k4Lj8NMj7L3l0oPKpJ6k7K1J3l4nM8n8pK1L4k8J0L9
1898C2m2K0k8K1j0OJ1j0J1j9K9%J2k1J0lm5L3%JrnRpJnk1K9pj5K0K0j8l1J0NK2
1935Fj5J4j3K1k4J0Pj1J0NL%j2J8j4kKJL3l9J1%j5K0j3K8l3mL4o3K5OlOlJ8mj9
1973iKj6J0Kj4J3%j2J0J9j7jM4k2Jk6K7J2k7k5L1J3k1%J7m0M2mrLJ5Pn9K5MjL0
$$ plain form
1715 -47 -10 25 -13 2 -10 -17 -1 -1 -7 -21 -6 18 3 -23 0 -12 -1 9 -13 41 29 14 1 7 37 19 23 14 15 35 11 13 1 16
1749 16 0 -17 -15 -5 0 -11 -10 -5 5 -20 27 -16 -11 -16 -33 -16 -22 -29 -1 18 10 6 -16 5 -21 3 -5 1 -13 0 34 36 -2 22 -21 16 2
1786 2 9 8 13 19 -14 -7 -7 9 -5 9 -18 -16 -16 -4 -11 -30 21 -17 -13 -3 -21 -10 9 11 -10 -22 9 5 -10 -1 7 14 9 -8 -15 4 -2 -6 20 -3
1826 -3 10 24 9 -8 20 -3 6 16 5 -21 -6 11 -5 -21 -30 -17 16 -2 -4 4 -11 -18 -17 15 -7 7 15 5 -6 8 10 -4 27 -6 8
1861 8 -15 18 13 16 34 3 -2 11 18 7 37 13 16 -2 3 7 -10 23 -7 -13 -6 -4 -11 5 -22 -1 12 -22 -27 21 -37 -44 -23 11 -17 -7 32
1898 32 -10 10 -18 3 -7 -1 10 0 11 -8 21 21 33 12 22 19 -26 7 7 8 -1 -6 3 -4 -3 -8 -29 0 -7 -22 -2 18 0 -31 -21 -16 6
1935 6 -9 5 -8 13 -11 -1 6 -5 5 10 13 13 1 19 5 3 5 6 39 0 11 11 -4 16 3 31 -2 -6 28 -35 -10 -4 -7 -1 -4 14 10 -9
1973 -9 -7 -23 -13 -11 -25 -12 -12 -24 -14 5 -12 -13 31 9 10 -16 11 23 -4 -29 2 15 -6 -6 11 -29 13 9 0 3 18 25 -34 -9 -5 -6 24
2010B4m7QOQJ1k3J7Rk0NlJ7j5rlQQMJ3j3j7J8J1j9K2J2j6Rk2L4l4pj7K3jRlj6
2048iJ9oj3rM9m6K2j8NK7k6Lnj7MmPJ4OLRqk0LJ6Mj6J8Qj6L3k2j3mK1KK4l7KJ
2088A1j5QNkq%l2N6k7j6J5K7j3NJ7l2k2J4MJ2R%j4l%qk6N5pRj7K6j4qj1KK3kj8
2127CmOqkPKoj7%J0J1Ql2QJ0j3k1JM3k6Rj3J0J6kmNrJ6K9l7oj1L9j7Jnk7M1l3
2167a8J1J5MJ3Mk8J2j7J7l5L4l3jJ9k2J9j7L8j3k7N2m0J7%l1L5pJk2L7kk1K0l
2201A1J7m1L5Rj9J5l8OJ4j3J9j9J4kmqrJ9j1KKl0L3j7K5l2K3J3opmRmj0j9M2l7
2238b2K1K4k9J1%lOkQjK5l8Rmj7K3Kj6K1k9%J6Jj7L3l7K8k0LNNJ4j1Ll7K2J9j5
2276Akj4K8j0nMpPpL6k4j6jJ2J9j7K7m8L1J7k1OKQl5%M0j6k9J4KL9m6k6J8J6k
$$ plain form
2010 24 -23 -15 -9 -1 10 -13 4 13 -7 -2 -5 12 -3 -12 -15 -7 1 5 18 5 -12 6 17 -2 20 32 16 25 3 37 3 -4 -21 2 1 10 7 -9
2048 -9 10 4 -9 -18 31 -15 7 -11 -6 21 -5 -2 -7 -24 -20 -24 -17 -3 3 6 15 7 -13 -10 6 10 -6 12 20 4 37 15 2 -2 19 21 45 8 10 11
2088 11 -4 4 9 7 -1 -1 -33 23 -4 -20 -5 22 9 14 31 -1 -23 -9 -5 7 16 16 2 -1 -1 -9 -35 20 13 22 5 31 17 9 -2 0 23 21 3
2127 3 -1 5 -3 -5 2 4 -2 -19 -19 -9 2 10 -22 -14 -4 -17 -38 -37 6 -20 -11 -24 -14 2 0 -4 1 -8 8 37 0 -6 -17 22 5 6 1 -26 15 -18
2167 -18 -7 8 12 25 29 1 13 -4 13 -22 12 -21 -22 -3 -25 -6 -23 15 2 -25 27 -13 4 4 -27 8 1 2 -20 17 15 -6 14 11
2201 11 28 -13 22 31 12 27 -11 -5 9 -4 15 -4 10 8 4 -4 -13 6 -5 -3 -1 -31 2 -15 10 -22 1 14 8 1 -3 6 2 -8 -27 15 -22
2238 -22 -1 23 -6 5 5 2 8 6 14 13 38 0 9 5 -12 11 13 -3 18 -11 -11 5 6 -11 22 -15 13 -7 -4 1 6 20 9 12 -25 -3 16 1
2276 1 -1 -15 13 3 -2 2 -5 2 -5 31 7 -9 -10 2 21 4 31 -17 14 31 10 16 18 26 -9 -9 31 15 -14 0 2 41 -5 -31 -13 3 1
2313A%pk7K9lqQj1L7j7LJ0J4j9qNnJ3j2L5k2j1%J4%j2Mmj0J5k2L4rk0J9j0Jj7
2351a2j2J8j8M6j9Kj0Mj5LLQNlJ0k7J1%qK7PrnQJ3j6l0K8RlL%Nj2jj9K1k7L8k
2391B1k3LkpMM%nKJLl0K8J1j6j1M0nj4L8m9j7L6J3j3k2K2lj2%jkJ0K0m7L0j0m
2429gJ3j4J5j2j6kL4k6rK1oJ6k0J7Ooj7mPjQK1oj3j5JK8l3L6j5j4KK2j1K0j9m
2466cK4j6J1k0J9oJ2k3Qj1J2k1j2M3j8nL3j8m5K0j8J3ORk0K0LK1k1J9j4j5NJ2
2500DKJ0j8QK1j1j8K4j8J4j9J9k0j5J9lqj5K5Pjj7lK2l8NJ0K5k0j1K1j8k3L1Q
2535al3M5mj4J2LJ1j3P%J7jl1KLol4N6jk3Ok6J1k5L4Po%lK1k8LJJ0j2%nJK2j7
2575a1J1Mj1j7J5L3j3j6LNmK0Mj1KJ3Nj0l1K3j7K9l4QKj1J0l4K5J0Kk8Nj1K2P
$$ plain form
2313 1 1 -6 -33 -4 -7 -15 -7 -18 19 2 5 15 29 10 2 7 2 15 3 38 16 5 5 19 19 7 11 7 -3 12 -10 24 15 -5 14 4 5 -12
2351 -12 -24 -6 -24 22 3 5 -5 -1 -16 -13 -10 -2 3 0 10 -17 -6 -6 -14 13 20 11 6 14 27 11 -19 9 18 15 18 18 23 11 10 -9 12 -15 23 21
2391 21 -2 1 -1 -8 -4 0 0 -5 -3 -2 1 -29 -1 10 -6 -17 23 18 4 42 -7 -24 12 25 12 -10 12 9 -3 -3 -4 -6 4 24 -23 7 -3 -7
2429 -7 6 -8 7 -5 -21 -23 11 -15 -24 -3 -9 7 -13 4 10 4 -13 -17 -10 -11 -3 18 12 -1 -16 -15 13 -20 16 1 -13 -11 11 0 20 1 -3
2466 -3 21 5 16 -4 15 9 21 -2 6 -5 7 -14 -26 17 -1 -6 27 9 -36 -16 -34 -21 -15 -6 -26 -6 -3 18 -3 16 2 -13 -8 4
2500 4 6 16 -2 6 27 16 -2 22 4 18 -1 18 -2 -17 2 -1 -9 -24 1 8 7 -10 -13 9 -29 -24 -14 11 -9 -20 1 -17 -40 -9 -1
2535 -1 -34 11 7 -7 5 8 19 6 13 13 30 29 -2 0 3 -3 -37 19 18 -5 1 -25 -14 -39 -5 2 -4 -4 -7 14 -14 -11 -10 0 -12 -12 -17 -16 6 -11
2575 -11 0 4 -7 -24 -9 24 11 -5 -2 3 -1 19 23 12 14 27 32 22 -9 14 -3 26 -8 0 2 -9 1 -33 -8 2 4 -24 -19 -30 -8 -1
2611akk7L8l8J7j2M3k1KlrPRk6L3qPk3j0K4OJ8k3J3knJ2Jl8M1nk9J2lj6J3j9N0
2649B6k9lK6m9K3kk3K3J7k8K1kJ3k2J6k2L3j0jJ1j8JJ7KMj2jqj0K6j0lj9J2J6
2684A5l8Qj0K7j4jnJ8mj5MKMjK1l2jlK3j4K1J7j3j6lJnJ0L0k3L0j5OrmpNLj4%
2724bRrJj6pM7j5l4RK2j1M%j0J6j5oJ5J7j6k6K7rj9L0KJ3kKj6K0k5j7M3j0j3J
2761@L4l2Ml2%KJ0J4kQPk3kl%j4%lM6l0J5j4OLj4J5mqj1L0LqK5Mk2nMpj9K6lJ9
2803A9l1J3%J9l8PL2j5pKj5rjJ6J1j7NKLlkpj2K3j6J0Mj7%OL2%k5rKJ3J5j8K6
2842A8k5LL4Mm8MMJ2jJpoj0KkPolK0l3K1qPMkj7K3oJ2j9J0OkK3J1m7J4j3K8Rl
2883A9J3m8K2k2L2jk1J9O%pj0l3M4k4KK9k2j8oL6k3j1OJ8J6m3J8J0kQNk8J0pK7
$$ plain form
2611 -1 -3 -30 8 -30 -13 -25 18 -3 -1 -4 -13 -6 3 -23 10 2 9 -14 -24 0 6 24 1 14 12 7 19 20 -18 23 18 -11 1 -2 -18 -5 -24 26
2649 26 -3 -6 20 -29 -6 -8 -31 -8 9 -19 2 0 13 -9 7 -15 18 8 7 18 0 1 18 20 24 12 11 3 -7 19 9 6 -13 -1 15
2684 15 -23 -15 -25 2 -12 -13 -18 0 -4 -19 -15 -13 -9 -10 11 -21 -22 -25 -2 -16 5 22 9 -7 -10 -9 -14 -4 26 3 33 18 24 15 11 4 9 12 -2 -2
2724 -2 7 -2 -1 -17 -24 23 8 -26 -17 5 -6 -2 -2 -12 4 -11 -17 -2 15 -1 -27 0 -9 -28 2 4 17 15 17 1 21 -4 -21 22 12 -1 0
2761 0 34 2 6 -26 -26 -24 -14 0 -2 6 13 -10 -12 -15 -15 -29 -29 -32 14 -16 -1 -15 -9 -6 -20 -5 -9 -17 -28 2 5 -3 22 26 4 -1 3 -4 -23 3 0 19
2803 19 -12 1 1 20 -18 -11 21 6 -1 1 -14 -23 -24 -8 3 -14 -9 -7 -4 -7 -9 -16 -28 -5 -21 -11 -7 -24 -24 -18 14 14 -11 -20 -18 -5 10 -8 18
2842 18 -7 -4 30 34 -14 -10 -6 6 5 6 -1 -7 -17 -15 -17 -10 -16 -19 1 -32 -11 -19 -12 -8 -10 -27 -4 -10 2 -17 -7 -1 -3 20 31 -16 -2 -15 13 22 19
2883 19 32 -16 6 -16 16 15 -6 13 19 19 12 2 -31 13 -11 -9 20 -2 -20 -26 10 -13 -24 -18 0 16 -27 -9 1 -1 7 12 -16 -6 -13 14
2919A4rl7J2NK4m5K8J6K0j3Jj7j2M6l2qKJ6Lj4j4KJ2k3J8J5j8jj6J0Mj3M1l8K3
2954BJ0k2k4L4oJ0k4K5Lj7LRKL2l6J4k0J3qkQJ3j3j9J2J1J0j9Plj7llLJ3J1nk0
2992a6K8k0rMp%M1l5K5rj8%OrJ9Qjlk3L4nP%Rm5KK9qJ6k0Kmj3nL7k9OMRj5mnP
3035a0J6j9lJ8kkL3l6K3k9JJ9mj0nJnLJ6L3j8k2KMLj7J3k8L0%okrL3l5%qNnK3
3075Aj3JN%%j3jOJ0J4j9J3j3Qj2lO0l3J9k3Qk7J7J0k8K0Ol8N1l2OL5k3j8Ml7Q
3112c1J2K8k7opK2pK2qj6J2J4k4kJ1j0J9j3PK7k8Qj0J6j0Qj2jK4OOj8lj0PRl1
3149a6nL4l7L0kk1MnqK4qk0L1j8j3L9rj3j2M2k4j4k6M2j8L9k6J3Rj6K8j0nlj9
3184a3K0jNJol%K1Rl7L8l6kmlJ2k0oK0k4M3k0Rj3lL8j0j4j0rJ3L4m5M3k1J7k4
$$ plain form
2919 14 5 -32 -20 -15 9 -36 -8 8 28 15 16 -1 -13 33 1 -7 -5 11 14 0 -14 -12 0 -23 -5 10 -8 -9 -25 -15 -11 -24 17 -21 2
2954 2 12 -10 -34 0 -6 4 -20 5 8 -9 -6 3 5 37 1 15 -5 8 0 -2 6 19 6 -13 -1 10 20 1 8 5 -12 -15 -18 -15 -2 9 4 -16
2992 -16 12 -8 -17 -13 -20 -20 21 -14 11 2 -16 -16 -10 -19 0 8 7 4 -19 15 10 17 17 26 -19 -17 12 4 20 0 2 -2 -15 -20 17 -12 -6 -2 7 -8 -12 -17 -10
3035 -10 6 -13 -16 2 0 -2 31 -5 18 -11 -10 9 5 -5 -10 -9 -14 -11 5 38 20 -2 0 4 7 -10 3 -25 5 5 -1 -3 -12 21 -14 -14 -22 -17 -22 1
3075 1 -12 -11 -6 -6 -6 -19 -20 -14 -4 10 -9 4 -9 -1 -13 -16 44 11 30 7 15 -12 5 15 -13 7 13 -25 26 -6 0 35 12 -6 -2 -39 -31
3112 -31 -19 9 -18 -24 -31 -9 -16 6 -2 -18 -6 8 -16 -18 -7 -17 2 -11 -4 23 -5 3 -7 9 -1 7 -5 -6 18 24 30 12 9 -1 6 15 -16
3149 -16 -21 13 -24 6 4 -17 -13 -18 -26 -2 -10 -30 1 -17 -30 9 0 -13 -25 17 -7 -21 -47 -5 -23 16 -10 3 12 -4 24 14 9 6 -13
3184 -13 7 6 11 12 6 3 3 24 33 -4 34 -2 -4 -8 -11 1 -19 -25 -5 -29 14 -6 3 -10 -13 25 15 1 -9 -18 -5 29 -16 27 6 23 -1
3221ak0M4pkj6jK9j1j8J0k1k0jJ8QMRj7j0J2K4m1L1j4J6j4rJ8j%Ml7L3pklJ7J9
3259B3mj3%J2k5J4JJ6olnn7O2Pqj0k3L8l1J1j0J7j7N1m5ok1L4J2l3pK7k2L5m5
3294c1mK1j1M4j1j4KK3Mml5J2RlK3j5j2K5J0rk1Mk8L6Mm6ROrK1k4K9k0KJ0J1j5
3331gL0l1J5nkqk8K4oNPrj0J9MMj5MJ0OPj2J2J2Nl3M0k9lJ0%m2OK8j2J2l7MK2
3370cj2qK2l9J4K5kknLNmJ0J7j5nrJ2mL5l0K1J6m7KnKK7j6J2Ppk9L0k2K8k6J2
3408A0mk2K3Jk0kJ6%j5K3j1Rl5J1K4klj4NkK6Noj4K3k7lkK0k1M1k9LJ7l1ORLr
3447CJ7ol6K3j9PK2%pnMj7Qj1L7m9OJ5J2k6J2K2j8jJ3Qj9K7j5LK3l2J8rJ3K0j3
3484C0l0J7Njk0o%J9k1J8k3lJ1K1%j8Ok7K8j3L4l1j1K1Mj3L1j9njJ6Kj3JKkJ5
$$ plain form
3221 -1 -21 23 16 14 -2 -3 26 15 -3 7 -14 -34 -35 -17 -9 -5 4 -13 -23 -11 13 -28 3 -11 5 -9 -18 0 -1 -1 3 -34 -1 -8 -10 -13 4 23
3259 23 19 6 6 18 -7 7 8 24 18 15 10 -47 15 22 14 4 -19 19 -12 -1 -11 6 -11 40 -5 -11 -32 2 14 -19 -26 1 -21 14 -31
3294 -31 -35 -14 -25 19 8 -6 -4 19 23 19 -16 -4 5 2 25 10 -2 23 33 24 3 7 -21 15 19 -27 -18 -12 -21 0 -24 5 -15 -13 -3 8 -7
3331 -7 23 -8 7 2 0 -8 -36 -12 -18 -13 -6 -15 -25 -6 -2 2 -13 -9 1 7 14 2 14 26 31 -2 38 9 6 16 16 -26 -20 8 -4 8 -29 -25 -3
3370 -3 -15 -23 -1 -40 -26 -1 -3 -5 -10 -7 -2 -6 4 21 6 1 -8 4 0 35 5 26 42 -5 -3 -8 -6 21 5 17 24 17 -12 18 -4 24 -2 10
3408 10 6 -16 7 8 -12 -14 2 2 -13 10 -1 8 -27 -16 8 6 3 -11 -6 -8 18 23 17 3 26 -1 -4 -6 14 -7 34 5 8 25 -6 0 9 12 3
3447 3 20 14 -22 1 -18 -11 11 11 4 -1 3 -14 -6 -17 20 -29 -23 -8 4 -22 -10 12 -6 -7 6 14 -5 22 7 10 33 1 19 10 23 43 30
3484 30 0 17 22 21 1 -5 -5 14 -7 11 -12 -15 -4 17 17 -1 5 -22 6 -7 27 -4 -15 6 10 -3 28 9 4 3 19 21 8 9 11 9 24
3521B4Kk5K1k5K6k1KK0qJ1m3J8qR%j8J5Kj6K0j9j4L1pjkJ4oJ6l1L8l5K4k3J8n
3557DK4k5j5K6pknM0l3MJ9j2j2j1L0k4J4Mj7Nj9L3j7j8J4l7j1K5J0oMRj5J2J4
3592Ek7K4K9m2M0l4%K1k6K9j1PLj9J6k1J9RLk8J3Mpmj1K2k9M9l8j1j1J9kMj3L
3628a5J5NRj1j3LpK7l6K7j2j1N2j5jqROk5J9mqPj1J8k4J3qJ0j6J9j2MJ3Ok3J1
3665A3qk8J8mK3mk5k4K0K8k2QJ4KqoKjL3n8M6OqJ6j0ml0RML1k3Qrlk6J1J0J4l1
3704a6PoJ7j7j3J3j6L9l1MJ8lmL4l3J4nJ1Ml8K1OlLMk1J5J7J8k5rJ7j2Qj4J0J4
3741B8j5k7K8%j6l0J9K4l3K1Njj1jJ1jj5qJ8kJ9jLloMKjk5J7J1j8J2l9L9%J8J
3779B7j8Kk8J3k0J7j1JK0Nj2J6k7J5rqNj7J1J7k0KK9oloRj8J4J6k2nj3L6K1k3
$$ plain form
3521 24 26 1 22 -3 23 2 4 24 16 27 -16 2 -6 3 3 -15 0 2 -14 6 -13 -27 4 -3 -4 -6 8 2 18 -13 25 -10 14 -9 9 4
3557 4 28 3 -12 14 7 5 0 40 7 11 30 18 6 -5 25 1 15 19 2 7 -12 21 4 -14 0 -37 -48 -23 -13 -19 -15 -6 -21 -9 5
3592 5 -22 2 31 -11 29 -5 -5 16 -10 19 8 15 18 -1 15 -6 13 22 25 -3 10 14 7 3 -8 14 -15 34 -4 -15 -26 -7 -9 -5 -18 -15
3628 -15 0 5 14 3 -10 -7 -14 13 -23 4 -8 -19 33 18 17 9 18 24 -1 18 14 6 13 2 20 -4 9 1 11 -5 14 2 6 19 25 2 13
3665 13 5 -23 -5 -9 14 10 -15 -39 -19 9 -13 -5 9 11 3 -3 -1 -2 31 -27 19 25 17 33 23 19 -11 -2 2 33 10 18 9 6 -20 -9 1 15 -16
3704 -16 -9 -15 2 -15 -28 -15 -31 8 -23 -19 -1 -4 -8 26 -7 7 2 13 17 -21 0 6 3 6 10 -11 4 21 39 14 5 22 10 18 4 14 28
3741 28 13 -14 14 14 -2 -32 -13 11 -22 -1 4 3 -8 -9 2 1 -14 -22 -4 -6 13 12 15 12 6 10 12 11 -14 3 14 -4 8 -31 8 8 26 27
3779 27 9 11 -17 -4 -24 -7 -18 -17 3 8 -4 12 -15 0 -9 -17 -12 -29 -18 -1 -21 -19 10 4 1 -5 4 -14 0 16 -6 -11 -24 12 33 10
3815A0J9J6m1J3j6K5%llj8QNl0rJ2OJ5k3j8L1K6m7K6k8KJJ0rLjqLJ8oL7ql4K2
3853Fj1Okk1L4nqJ9Rj3LPmj3J8qk4J3nk1K2kJ3l1j0L5Nl3j5J0Q%rJ9JjL7k2j2
3892ejJ1j7NL%k2L9k3L4k4j0QJ6koK8K2o4J8nk6L9j1j2j3K9j7oj%krM0j7J4j9
3929fl1K9kJ5J1k6MK3k7L7JJl3J3njJ7j4J7Rj1k9L8k3OjJ0j2k4NKJ0j3MJjK2%
3967A6k0l0J9pJ5PnPpJ7l1L0l6K9MNk9L2kLj3J3rRJ9l1joJ5Pj5J0k4lK0mk2K5
4005Gk2K3j1J2l0K7m0M1j9j2J5J3j3j6J7OJ0j3mQLj0L5j2j5J9j1jJ7k5J3k5kK6
4039A1%pj4K3k4j1QRk4NJ7Kk5J1L2k4K7k4nj5PJ3OK6Mj4k6K6olQJrj0OqJJ3j1
4078dJ6NNjmml0J6j4j3nM7k9Jj5J8Mj5j4K4K3jl6LJ7J0j7L0J6l9K0k3L9l2K5j4
$$ plain form
3815 10 29 45 4 17 1 26 26 23 20 2 10 15 -15 -24 -12 -6 9 -14 -32 -1 25 -22 4 -24 -22 -21 -11 -20 -17 -18 -26 -23 -5 -11 26 18 -16 6
3853 6 -5 1 -1 -22 12 7 -1 18 27 14 17 24 20 7 25 17 -7 6 1 -20 2 0 13 -18 -28 7 12 -21 -36 -26 -18 -18 -27 -8 -7 -8 29 7 -5
3892 -5 -6 5 -12 -7 -4 -4 -26 13 -10 24 0 -10 -2 14 12 6 34 56 -8 10 5 -21 18 7 -5 -18 11 -6 -12 -13 -13 -15 -24 16 -1 13 -6
3929 -6 -37 -8 -10 5 16 -10 -6 17 -10 27 28 29 -4 9 4 3 20 6 23 32 21 -8 30 7 13 12 22 10 -14 -9 -7 3 -10 -6 -5 -6 16 16
3967 16 -4 -34 -15 -22 -7 0 -5 2 -5 12 -19 11 -25 4 8 13 -16 16 14 17 4 17 8 17 36 5 4 -2 13 20 5 15 -9 -12 8 4 -18 7
4005 7 -15 8 -3 9 -21 6 -34 7 -12 -24 -9 4 -9 -25 -8 -2 8 -5 -9 -1 2 -8 27 15 0 19 8 7 24 -1 12 -13 -15 11
4039 11 11 4 -10 13 -11 -22 -14 -5 -29 -24 -7 -5 -30 -19 13 -11 16 -8 -13 -28 -21 -8 -2 24 28 14 -12 14 8 5 13 14 5 -5 1 -7 -6 7 -4
4078 -4 12 17 22 21 17 13 -17 -1 -15 -28 -33 14 -15 -14 -29 -11 -7 -22 -36 -12 11 10 -26 -23 -6 4 -13 17 33 -6 14 -9 30 -2 23 9
4114ILj4J7j7J8l3L4Qk9L7k7K1l6J5nJ6j0l0J4KqK0k5J1n%LKK1j4Mk4L7k3qJ0
4150fM0Nm7J1J3nmj6K0k5J4L2m6L1k4L1rk1kMJ6k7J4moKJ4Pk2J3j5j1PK0j7j3
4186b6M2m1RK4j1LmQk3M9j6j9J4K5j9J3j9J3k1j0J9pLQj1pjj0L3k8JJ8k7J5lm
4222a0pJpJ9j4QK4l6J8j4K5nkj8J6NjKoJ6j3JJ0J0kl1QJ1oKJ0k5jOok2L5nk4K8
4262@j2Mpj9M9j1rj0OJ0Mj6K5l5M0j5K5m7M0%k6L6l7J1RrRqk0QLJ5k7jK0j4k1
4299c0L3j6J2lQl4RK9j1PnJj6J7j9lJ3J6j8j4J9RkrmOJ3mK5j8Qmk3OkPk2%N3l4
4339@k0K9pl9J4L8l6oKL4Kk8N4m6L0l6L0j4j4K1pL2m2K6Rj3k0QJ4Kj3K0j1oK4
4374C1j5j7J4k7K7K8l9Oj2RPJk3K5j0l8K9k6J2K5k8j5K9K4LrJ3l1nK0l9J7L7l4
$$ plain form
4114 9 12 -2 15 -2 16 -17 17 25 -4 33 6 27 -9 6 1 17 7 -23 -9 -7 -15 5 -20 -9 -14 -14 -11 -9 12 -2 2 -22 15 -8 -16 -6
4150 -6 34 39 -8 3 16 11 7 -9 11 -14 0 32 -14 17 -7 24 15 -6 -8 -4 12 -15 -1 -5 -11 -9 5 12 -10 3 -12 -23 -16 4 -13 -26
4186 -26 16 -25 -16 8 -3 0 -4 4 -19 30 14 -5 9 34 15 28 9 22 1 -9 10 3 6 14 3 -4 -5 -15 18 -10 -9 9 -18 -3 -6 -10
4222 -10 -17 -16 -23 -4 -18 -10 14 -22 -4 -18 7 2 0 -18 -2 3 2 4 -2 14 1 2 12 22 20 -11 -3 8 2 4 14 -11 -12 -6 -12 -34 1 -4 -28 0
4262 0 -12 -8 -15 -34 15 4 -5 -15 -9 1 5 -11 14 -21 19 4 29 -18 22 22 -4 32 -5 6 15 6 15 7 -13 -5 -2 13 -14 -15 5 -9 -30
4299 -30 3 -13 -1 -4 4 -30 -21 8 -3 4 -1 0 -16 1 -18 -21 -8 8 -10 -24 -5 4 2 -7 -11 -5 8 4 29 11 19 15 -8 -2 -4 3 -19 -19 34 0
4339 0 -20 9 2 -37 -23 15 -21 -27 -25 9 11 -17 37 -9 21 -15 15 1 -13 8 1 33 -9 17 26 13 -7 1 15 17 4 24 13 7 31
4374 31 16 -1 13 -14 13 41 2 8 -4 5 12 13 -10 15 5 -33 -4 -30 -18 7 -21 -36 -7 17 20 11 24 -7 -12 8 -31 -14 23 -11
4408a1J7mK0nkj8lL6l7PklK5lrpRK5l9lqK1j9J4j2Mlk5K4Mkpj0RK6lj3L3m3L3
4448A6j2Rk6J5J0oL4m4KqM2qk9K1k7PJ2K1l6j7L6j9J6j0k7L0nKj0J7kk4OJ7j8
4483a5%J3k3M2j5KL5l9J0P%j7MjJ6Oqj5J5rk6K8j1LrOj9K1nl0RL4k4LMqMk3L9
4522Dj6rRjJ%LPpQOmmRQJ7j7mJ0Pj7OPl5K1%j8RmJ7k3K2j3k3J3K4l7OJ4Krk2J0
4565b3JlNK3L4l7Ok0J9j3lK5j6LL7j9k1LJ6Mk0J7Ok7j2NL8l8K8j7nMJ1J0l0J1
4601Bj4nK1j2nj1J0RJ4Rk8J5J0j3j7K7pjjJ1j5J5J0k9J0RjJ7j1k5PNk1J3J0mK
4638FJ9m1LJ3J7j6kkj0OJ5n2L2kLJ8k9K6K0j2jJ1j5kJK0j5Rl1M7k8J2ommj7pJ9
4676Aj4NljK0M%qJ1k3mJ0%%j0J6l0M2k3J0k0PK4k8L4j0qKK7l5J0L3k4Oj1mJ0j2
$$ plain form
4408 -11 6 2 22 17 15 -3 -6 30 -7 0 -2 -5 20 17 8 1 10 35 -4 -7 -15 6 -13 1 -11 -7 -10 -35 -11 -7 -9 -16 -26 -17 9 6 -7 26 -17 16
4448 16 4 13 -13 2 12 6 40 -4 -2 -10 32 24 -5 16 -11 -4 8 29 -7 -24 12 -7 9 -1 -28 2 -3 -1 -11 6 4 -20 -14 3 -15
4483 -15 -15 -2 -25 17 2 4 39 0 10 17 17 0 4 3 19 25 17 2 17 8 -18 10 -1 2 -7 -1 -20 1 -4 -34 -25 9 -15 -12 -8 -16 -12 -35 4
4522 4 -12 -21 -12 -13 -12 -12 -9 -2 -9 -1 5 1 -3 6 14 31 14 10 20 27 10 16 23 -12 9 9 -9 0 -4 13 -10 12 -1 -24 -11 13 -24 -18 -4 -2 -11 -33 -23
4565 -23 -22 -25 -20 3 37 0 6 -14 5 -8 -11 14 -2 1 38 19 -2 1 17 21 1 18 24 -3 -15 -10 28 -10 18 1 -4 0 11 21 -9 2
4601 2 -12 -17 4 -8 -13 -24 -14 -5 9 18 -10 5 15 2 -15 12 5 4 3 14 -1 14 24 -5 5 14 13 30 19 -6 1 6 -15 -2 8 4 6
4638 6 25 -16 -13 0 17 1 -1 -3 -13 -7 8 -44 -12 -14 -11 7 -22 4 24 12 11 22 7 5 6 26 11 20 -11 36 8 20 14 10 6 -11 -18 1
4676 1 -13 -8 -11 -12 8 12 12 4 15 -8 -12 -2 -2 -2 -12 4 -26 16 -7 3 -17 -10 14 -14 20 10 2 4 31 -4 6 39 15 21 10 6 16 4
4714DMJ1pj3nM0m6K2j5mK3mn%NMj8qj7K9Oj6mj8M1m2L8j6OK5l3KJK1oK3ml2J9
4753A1PmlJ0jk3L2j2l1J4QJ0m6K8%Rl2QK0oQJl6L9j1rk2RL3j7JJ9j4j3J8j5jJ8
4791Gj2K8krRmj3J9Jk9J6j1J0jJ4j6J1oJj7qJ4k4J3KLQNonMj7qJ3J1J0j0NOj6
4831dL9lk0rm%K0rJ4K1n5Pj5J2OnqQJ0Mj2j3L8l3%Jj1mpM0k3jJ4k1RNJ8kQk3k
4872a0J1RpJ1j0JPNJ5k9%MJ1Km2J2lQKjPj4pJJ5l2M5k0qQJj4k0J6OkK3Ooj1J9
4913IkPk%j6Ol0M4qJ7k7PMkJ0jj2rkk6L2j3m%j2J8J2rj8MK2nJKrK6j0j8L1%k5
4954hQpkLoMmJ6j3K6m0M7m7L8j7K7k9J0qrK0pj0j5%PK2k8J8qpLJ7j3oO%J1j8K4
4994Ek2J1LK1pj1J3nkkj5K1j9J8ORnmj4j9LL0ml2L3j0k8J5J0nk9K3J4nJQk4oK8
$$ plain form
4714 4 8 19 12 -1 -6 34 -12 10 -5 -9 14 10 5 5 10 14 -4 -12 -29 0 6 -10 -14 -32 9 -33 5 -11 -5 20 -13 -11 -10 11 5 28 24 -8 11
4753 11 18 14 11 21 20 -3 29 17 -14 0 8 18 -28 0 0 9 -23 -15 5 -1 7 8 -28 11 0 -9 -31 -22 11 -6 -5 14 0 -13 5 -10 -11 7
4791 7 -5 23 21 12 21 17 4 23 24 -5 11 0 10 9 23 7 18 12 13 -4 -12 2 -22 -9 -7 -4 4 9 3 -2 2 -15 -23 -10 1 11 1 6 12 -4
4831 -4 35 32 12 3 -1 -1 19 10 24 45 -10 -3 -18 -6 0 -5 -13 -5 5 9 -3 -16 22 -11 -11 -10 -21 -25 -32 8 -15 -16 -2 -23 -14 -9 9 7 15 -8 -10
4872 -10 1 10 3 14 4 5 12 17 32 3 3 7 18 20 -22 -10 -13 -5 -3 -4 3 -11 -18 -17 -2 -34 11 -9 -17 -9 -8 -22 -42 -26 -20 -22 1 7 1 -10 9
4913 9 7 14 12 12 -4 2 -28 16 8 25 -2 5 9 7 17 16 4 -5 -7 -33 -1 -14 -18 -18 -30 -12 0 -9 -27 -23 -1 -6 -5 -3 -12 14 4 -14 17 17 -8
4954 -8 0 -7 -9 -6 -12 -8 -12 4 -9 17 -23 24 -23 15 -2 25 -4 6 -2 -11 9 2 -8 -23 -23 -16 6 -22 -4 -12 -19 -16 1 -12 -18 -12 -12 -1 -19 5
4994 5 -17 -6 -3 18 11 0 13 8 6 4 -11 10 -9 9 15 24 19 15 1 -18 -15 15 11 -21 12 2 -26 -11 -1 -6 -35 -12 2 -3 -2 6 -18 -24 4
5033DjrqNJ7kJ3l7ORJ1qPj7K8ONk9K4k2j8K3J1rj9KoK2j6Kk3K6k9j8L9Oj1pkJ2
5073a3%RqpNJ9KMk9L2j3qL6l3nrJ5%j2jK7kJ9m3M0j8j9J6%q%k6L2Rm0K0%J1oL
5113a%j0L9j3j1l4L0Nj2%MJ9%N%k9PKj4K3Mj3PQrjLJk3L2j4KMk1kPMJkl1J2m3
5155f4N4J0l3M1k6nj5K0pK0Npj0MJ3jLLJ2%l0L0j8J5j0QJ8j4j3pnNK4j9j1kj2
5192b4K2mj7K4k2RJ0QpJ2n4L3j2J8RlnjLjJ4r%jLJ4k0J0J0k0j0OOk6O0j8j4l7
5230c4M3l8K2j0K1K2l8j1Qj7MK4k5K0JJ3k4K1pJ1k4L1Kql0L2Pnj8J4Ml4J9J5k0
5265iK9mooJ2k0J3rl6J6K0MoJj0kQl2J6J5j3NJ1n%j4MJ2okL3k0j1J1jMj0PqL0
5305B1k7QQMj2MKkpj2J1JJMk1jK7k5J7k5M1n0J4pqRK5rJ4nj6jK9j9J2%lQj9K9
$$ plain form
5033 4 3 -6 -14 -9 8 6 19 -18 -12 -3 8 0 7 -10 18 24 29 0 24 2 -16 7 18 9 -10 -8 -14 8 -8 -6 -29 -3 -32 -50 -11 -5 -16 -23 -25 -13
5073 -13 -13 -4 -12 -19 -14 5 7 11 -18 14 1 -7 29 -4 -9 -18 -3 -3 -15 -16 11 9 28 -15 25 7 -12 4 4 -4 -4 -30 2 11 -29 -9 -9 2 -4 -1
5113 -1 -1 -11 28 15 4 -30 0 5 -7 -7 -3 16 16 21 21 -8 -1 1 -13 10 14 1 8 16 7 6 9 10 -13 19 5 7 11 -10 -12 -5 -1 0 -2 -33 -21 -64
5155 -64 -10 0 -33 8 -18 -23 -38 -18 -25 -5 0 -7 -17 -13 0 -1 2 5 17 17 -13 17 -1 14 4 12 30 16 3 -4 -9 -4 20 1 -10 -12 -24
5192 -24 -2 -6 -23 1 -21 -12 -2 6 -1 11 -43 -10 -22 -4 5 2 -3 -4 -1 -2 12 3 3 2 5 19 -1 9 19 -1 -11 -5 1 -25 35 17 3 -34
5230 -34 9 -29 -7 -17 4 26 -12 -23 -15 -32 -28 -4 -29 -9 -8 5 -19 2 -5 6 -18 13 15 7 -23 9 16 11 -7 7 11 -23 -4 11 -9
5265 -9 20 16 10 4 16 -4 9 0 -36 -20 0 4 -2 -1 -11 -13 -5 -37 -21 -6 -19 -14 -3 -8 -8 -22 -18 -6 -12 -14 19 -1 -12 -1 -2 2 -8 -1 -9 21
5305 21 -6 2 10 14 2 6 8 6 -1 -13 -2 -1 0 4 -17 -18 9 -16 1 -24 17 -33 -19 -26 -34 -25 0 -9 5 0 -16 -17 12 -7 5 5 2 10 -9 20
5345B0j0j4mL8rk3NMqj6J0Qk6K4j5K3j6j1J1j8J4Qj9J3k3LL6Ol2MJ0J3QoK0m0
5381a2Lk2M2k1J3J7j1pJ6n5N3j1j2Rj2L5j4nk3J8J2l1jJ6j1OJ5k3J8k5J6j5oK8
5415@j1qlK8Lk5QRNqJ6j7nRK8j4mnMj2J9l5J1rJJ8pj8J5Oj4Omj5L7nj9NJ8j9j
5456a2Rk4M4k1pJ5j2J2oJNl5J9J8pl2O1l6KK1k2J8j2jL9l2JjJj5pJ7j8RJ5l2J
5493b4RnOJ0Ql7K0J8lK3n0J6j3M3j6Mk2J0K1k3J7rnJ7Ok3J4m1M8j1k7j0L9Nk9
5528a4J3nk2KJ3K4n0K8j6L2Nj7j0LJ4KJ1rJ8k9K2k1PJ9lk0J5J8pqOj6nL5j1l8
5564a4J1MJ8m2J2J9J1k3j7J8ml8M3j5NnJ7j8OJ6j7J7j7K4j3QJj3MJ2k5J5J8l1
5598a3J1J0oK5Jk5Nkkj3J2LnpoK5kJk7K3k4jj9K6j8kJ3J0lJ3k0J4%j6L1lj4mJ1
$$ plain form
5345 20 10 -4 -8 30 21 -2 3 7 -1 -17 -7 1 -25 -1 -16 7 -9 -20 -9 -27 -13 -5 -24 -11 -34 -31 5 11 -21 -17 -7 6 14 8 28 -12
5381 -12 -9 -31 11 -10 3 20 9 2 18 -37 16 5 -7 2 -10 25 11 6 -17 1 13 -18 -19 -3 -14 -8 7 -16 2 -23 -7 -22 -28 0
5415 0 -11 -19 -22 6 9 -16 -8 1 6 -2 14 -3 -8 1 29 15 11 6 10 -2 17 -18 -7 -16 -15 3 -4 -22 -7 -1 -15 -9 -13 -28 9 4 -15 -10 8 -11 -12
5456 -12 -3 -27 17 -4 -11 4 -8 4 -2 -1 4 -31 -12 6 -1 -33 28 -8 -6 15 -7 11 -1 -2 37 5 6 5 6 -9 -16 1 -17 -8 7 -25 -24
5493 -24 -15 -20 -14 -4 4 -33 -13 5 2 25 -25 -9 -22 21 5 9 -13 -3 18 -5 12 3 -2 15 21 -2 12 -29 19 8 -19 -29 10 15 -14
5528 -14 -1 -6 -28 -26 -13 11 -39 -11 -27 5 10 -7 -17 -14 0 2 13 4 22 -7 15 -6 1 20 17 -3 12 30 23 15 21 5 0 35 24 -14
5564 -14 -3 1 19 -23 -11 8 19 -4 -21 -3 -7 -45 -2 -17 -12 -17 0 -18 -12 4 -13 4 -13 11 -2 6 7 -6 -2 10 -15 0 18 -13
5598 -13 -2 8 2 27 28 3 8 6 4 -9 3 6 1 -6 -12 13 11 12 -15 8 -16 -17 -36 -10 -28 -30 -17 -7 -10 3 -17 -3 -3 -19 12 9 -5 -9 2
5637BK1j4l7lM9K9o1K0KJ6j1Nml7J9OL1%n3K1kj5QJl2L3J0j1J2J0j7j4qK3J2j6
5673ekJ5%k9J5%J3j0Ok2J3qL6l1OK7lm3K4J6Ll3Rk5L7k6K0J7k0ok4K5k3K4J0j5
5709iRJ3l7M2l1K3j3OmLrJ4j9JJ8K3k7J7j7MMj8K9j8Nk0J3k8J4J0Qj4j0klM8m3
5746a8PJ7j9LkmqJ7k1J9j4J0lQJ5NjJ6k8J1qJ4J3j8rK7k0j2J0KNj0J6pj7jJ7l2
5784b0K9l4L4l1K6kk7QJ4Jk8K2klRL2l0K0j4j0K3k7OK5j0j4J7rOJ1j5J7k8J5k
5819Ik2kMJ3%j2J1k1J0jkJjl1L2jJ8mj1j0J6kj5J2pJ3j3J3NJj0J3lk5K5Lj5M1
5857C2l4K5Mj6Rk4KJ3j5k4MK1j0KJ3k2K6l2M1k7J4j2j6L7k4J8k1N3j5k8J7K2k5
5890HkJ2k0J3K1l5J6rJ0j2pMK0j6K9nk7rOk2%LK5j0J0kj0Kk0K2Qj5PMqJ7J1m6
$$ plain form
5637 2 23 9 -28 -31 18 47 -14 6 8 24 13 18 14 -23 -4 2 33 33 -20 1 -1 -16 -8 -7 -39 -6 4 -7 5 15 -2 -16 -24 -1 11 -5
5673 -5 -7 8 8 -21 -6 -6 7 -3 3 -19 -6 -14 22 -9 -3 24 21 -22 2 18 21 -12 -3 -28 9 -17 3 20 0 -6 -30 -5 -28 -4 6 -9
5709 -9 0 13 -24 18 -13 10 -3 3 -1 2 -7 7 -12 -11 7 30 3 20 3 7 11 -7 22 4 9 -11 2 -26 -12 -2 6 -8 -18 -20 -23 25 -18
5746 -18 -11 6 -13 -10 -12 -16 -24 -7 -28 -9 -23 -13 -16 -8 7 12 11 27 -1 10 2 16 29 11 2 29 9 -3 7 9 14 4 20 13 -4 -5 12 -20
5784 -20 9 -25 9 -22 4 2 -25 -17 -3 -2 -30 -8 -10 -13 -4 28 -2 18 4 -6 17 -10 -4 21 11 -3 14 5 11 22 7 24 -4 11 9
5819 9 -13 -15 -11 2 2 -10 1 -20 -10 -11 -13 -12 -13 -44 -12 -13 5 1 -10 -20 -4 -6 -21 -9 -16 -3 -16 -3 2 3 -7 6 3 -22 3 6 -9 32
5857 32 -2 23 27 11 20 -4 -2 11 -4 -28 -24 -3 -13 -11 2 -20 6 -26 15 -12 2 -10 -26 11 -13 5 -16 37 22 -6 11 33 8
5890 8 6 18 -2 11 32 -3 13 4 14 2 -5 -1 19 3 32 27 0 -9 -3 -25 -25 -22 3 -7 3 1 -9 -7 -27 -5 3 -12 -5 -1 -9 8 19 -27
5928b7L1j5RMPRj5J2Jj0j1nKK2lKoJ2j0nLj2rj0RJ7%j4Nk4J8MRp%%roO%J9k8M
5971b1%L3j1J7Jj2J1j2PJrK3l1Qj6K2l5K2j7Qk0K4k1L3Rl4J8j5K5l2J6j2L6j0
6005FOj3rOMJJ5l4J3j4N7k8j5K2j1Mj5J5J2j5k0NL5l9K7m3K0J9j9J9k5K3l3j4
6039c8L7ok2K8J7m%m6K9j0J2QJ3j2j4PJ2j5lM6j3k6J3Rm4K6k1L1qNj6K2nj1j8
6074a7K3Lj2k5K4nkJ0j5J7k2lK4oj2pPJQnj0rL5pJ0J3k6K9Nk3k8M6j1kj4Rj1K
6112fJ8Jlk0K5k1J1J2k0J8j2l2nL6j6MJ4j4J3Kj7J4pj0J1qJ5k0J1K0LrLj0jJ5
6148A5ok9NL5j0KJ5m1J0KMkJ6j4k1K7k5L1%k0Pk1J9J4l5J1kj9J5J0kMj7L2k8J9
6184Aj1j7K3rK5kkj5J4Pj1%%JjK3k9jMj3K2j0j3JMKoK8j9Qj9M2l0oPj1PMKk9K3
$$ plain form
5928 -27 4 -11 -2 2 9 18 3 15 16 6 -5 -10 -8 14 11 13 7 19 9 4 7 -5 -14 -24 -15 2 2 -12 -7 -31 -13 -9 0 -7 -7 -7 -16 -22 -16 -16 3 -25 -21
5971 -21 -21 12 1 18 19 7 18 6 13 14 5 28 -3 5 -11 11 -24 -2 -19 -11 -31 -7 -28 5 14 -20 -2 -17 8 -24 -8 -20 16 6
6005 6 12 -1 -10 -4 0 1 16 -18 -5 -19 38 10 -5 17 6 10 -5 10 22 7 -13 -8 27 -12 15 -28 -8 11 -8 11 -14 9 -24 -38
6039 -38 -1 -7 -29 -1 16 12 12 -34 -5 -15 -3 5 18 6 -8 -1 11 -4 -7 39 26 0 13 22 -22 4 -17 14 6 11 -5 17 12 1 -17
6074 -17 6 9 -3 -28 -4 -9 -11 -1 -16 1 -21 -24 0 -6 -18 -25 -18 -17 -9 -14 -24 -33 2 -5 5 18 -8 21 26 3 -25 21 10 8 -6 3 -8 -6
6112 -6 12 13 10 -10 15 -6 5 17 -3 15 3 -29 -34 2 -14 -10 4 -10 3 5 -12 2 -5 -15 -4 -12 3 -17 -6 14 17 8 11 1 0 15
6148 15 9 -20 -15 20 10 12 27 -14 -4 -2 2 0 16 2 -19 8 -17 14 14 -6 1 -20 -1 13 -22 -11 -13 -32 -17 -7 -9 -5 -22 10 -18 1
6184 1 -10 -27 -4 -13 12 10 8 -7 7 14 3 3 3 4 3 26 -3 -4 0 -13 9 -1 -14 -13 -9 -7 -13 15 -4 4 -15 27 -3 -9 -2 -13 -6 -2 0 -29 -6
6225fJ8kl3L8j3j0J0QQrkRj1j1K4j6Mj9J0Qj5jJ9oJj2Pjl5M0%ppk9O7m0noPL6
6265A8m1kJ6K5k5J6Qj5j0K5k1K6oJKk2JK7j4nk9ML4rl6LL0k2kJ4j1K7k0K0k4J6
6301aj1K1k2lkPK9j6Pj1nJ2j4L0k7LK1k2Nnk1L8m3K4oJ0%K7l4MoPJ0lj3kJ5k3
6339b0qL7j1j8J3k0K7J3l9L5j3j3K0j0K2k5lJ9Jj0J7k5LL2l1J9kONj1J8k8NJ9
6373B4m7L0l3MJ4l2L9rk0K2Rk0ORk0J7mrJ4J0j7J7k1M1k2j4PJKk0L3K1j5j0j7
6408a0NK3ll0nRJ6LrpJ3k6J6j3j0PqrK3oK7Lk5J3PJk8K3J0l0J2NJ4l3j0J6K1n
6446@jJ0%omj1RnK1mJ2j3l1K8k0OK5l8mK4j6jlJ7mJ4k7JJPJ4j2QKj6K3J9k6Ql8
6486c1J8NK0K3j6lj4J2k3J1QjLj5k4K5mJ4j1Oj5j1JM1k6ol7L9J4Jj5kK5j2kRk6
$$ plain form
6225 -6 12 10 -23 15 2 -8 2 10 18 9 7 16 5 -6 18 2 6 -13 -3 5 -10 -11 8 2 3 -9 -2 -3 -38 2 2 -5 -12 -41 26 -14 -19 -25 -18 18
6265 18 -23 -25 -9 16 -9 7 15 0 -10 15 -6 20 14 15 17 -5 -4 23 9 4 -25 -21 13 4 -32 -29 1 -21 -23 -9 -20 7 -13 7 -17 -1
6301 -1 -12 9 -13 -16 -18 -11 18 2 9 -2 -7 5 -9 21 -6 -3 18 -4 1 -4 -25 13 -30 -6 -12 -2 -2 25 -9 -5 -11 -4 6 3 -10 -12 3 -20
6339 -20 -28 9 -2 -20 -7 -27 0 13 -26 9 -4 -17 3 -7 15 -10 -13 6 7 -3 14 -11 -8 24 -7 12 10 16 21 10 28 0 5 24
6373 24 -23 7 -26 -22 -8 -40 -1 -10 -30 -8 1 -19 -13 -4 -24 -7 -11 -20 -6 4 -13 4 -17 24 2 -12 -5 -4 -2 -22 11 32 17 7 -10
6408 -10 -5 18 15 -15 -20 -11 5 8 -1 -8 5 -21 -5 -18 -28 -21 -29 -38 -15 -21 6 9 -16 -3 4 5 -23 0 10 -20 -8 -3 11 -22 -32 -16 5 0
6446 0 -1 9 9 3 -1 -12 -3 -8 13 9 21 8 -23 5 -15 -9 16 -22 -26 -2 -18 -19 -22 -5 -9 5 -22 -21 -20 -13 1 -11 -3 -1 -17 6 25 -1 7 -31
6486 -31 -13 -8 12 35 19 16 2 14 -9 2 10 9 12 -3 -27 -2 -6 8 -3 3 -12 -23 -22 19 -7 -13 -50 -11 3 4 -11 -13 12 0 -2 7 -19
6523a9K1j6KJ8k7J7J1Mk0J5J0%p%j0J5l4J3K1mJ3qk9J1Oj4j6J6J5%j9oK4k2j0
6558b9j9M6k8L1rJ9Mj9J7j0Lj7OJ3J1plRk7J5j2KRj4K1j0MkK0k9Ol1M0mk2J2k
6595fJ3k6%K7mlpkK6j9k6K4J6k3J0oN0o1K7lj8J7J2k0j2K0Kl7K8J6%l4jK9j2n
6631hrJ6mpj1Mj8L9k7L0Kj1mK0j0nJJ4j2J5pj3jJ2jJ2qPJ9l3J1j4RL1k5MjKj3
6670FJ1l9L0j7oKj5K1J1lk5NKK0k6J1mJ9Oj6mK1j2Mj0K9j3Pk6K5j7J9j0j6L8j8
6706A0k6K0MroJ5j7j5k1RK0J9j1j5JJ3Ol2K8Mk2rKRJ7qQk4L4l9L1JJ8Nj1LQj0
6744A0j7K2k1J5j4J7j2Ml5M9j8J5j2j2J7l7jK9RKl5%J5j7K7n6M3J2j2PJ0Rl5K5
6778CRmJ1kj5J8j5J3k4JJ9J4m9J8J1j7L1j4j4%j2j3jK2k2M3j9Jj6L1j9LK4l0p
$$ plain form
6523 -19 2 -14 -12 6 -21 -4 7 11 -9 6 16 16 9 9 -1 14 -20 -7 14 10 23 15 -14 -3 3 -11 -27 -11 4 4 -15 -21 3 -19 -29
6558 -29 -48 -2 -30 1 -8 11 15 -4 13 3 6 -11 -5 8 19 12 9 18 -9 6 -6 -4 5 -9 12 2 6 4 24 -5 1 -30 10 6 -16 -4 -6
6595 -6 7 -19 -19 8 4 1 -6 -8 18 -1 -27 -3 13 -10 0 -6 44 -17 10 7 -11 6 18 -2 -14 6 8 -29 -1 15 15 -19 -20 9 -3 -8
6631 -8 -17 -1 -5 -12 -23 -19 -37 2 -25 5 7 -4 -8 12 2 -3 -2 12 0 15 8 -5 -6 6 5 17 9 16 35 2 13 -1 8 39 14 18 17 19 6
6670 6 17 -22 8 -9 -15 -13 -28 -7 4 1 -24 -19 -17 3 -23 -12 -16 3 9 -7 -11 10 -2 2 -8 21 8 15 -11 14 -3 16 6 -10 28 10
6706 10 -16 4 8 -1 -7 8 -9 -24 -45 -36 -16 3 -8 -23 -22 -9 -3 -35 -7 -3 -25 -34 -32 -23 -6 -14 -6 -30 4 -35 -4 -3 15 20 9 12 20 10
6744 10 -7 15 -6 9 -5 12 0 4 -31 18 0 15 3 -9 8 -29 -30 -1 8 10 -25 -25 -10 -27 0 -56 -13 -1 -13 -6 4 13 -22 3
6778 3 12 8 19 17 2 20 5 18 -6 -5 14 28 -21 -3 8 -9 22 8 -6 -6 -18 -31 -32 -10 -32 11 -8 -7 -23 8 -11 -8 16 -14 -21
6813b1K8M0m6ql2M2j3kJlJ1K3kl4K4oK3Pk6Om2M5Qj2j3OKjJJ4l4J1lJ4k7KL3l2
6851a6j0K4j2J2kj1K0J4l1qPJ4k8L1Nk4M4l8J0KK5k2NlPmj5Ok0L2OK%l1j4okL
6889b8K2kJ7l5J3k3L3pLL9j6lj7K0Nj6j8J6lQJJJ5koj9ONj3K9l2jL3j2j5LJ6m0
6927b3j0M1j8j7L1j1Pl2J4j5K2j2J9lK2k2j4J5L0m4L9j5J2lLm2L0MJ9nRm3j1K1
6961bJ4Lj6L1k3lk6L0nj5J0j0lKJ6Rk9k0J8J4jj3K1j2K4pJ6l2K0k1J8OqpJ7j4
6997BK4k4K1j4rMJ3j1j3k1L4j%k3%J4k3J9J3k3lK8j1J8l0L7k8Jj1K2J1Jk2J2O
7032A3pmK1qj0J2%ppoJ8j1K2k1k3L6j8%Jj1j9N6m1J6l8K5J0j6j2K4jj6%J7oll
7069a7qJ5jJ2J5j9KL3m8J7JK1j1Pj2oK2l3L8j9pj7L1k4Rj8J6Km2J0K1j2K0j7k9
$$ plain form
6813 -21 7 47 1 -7 -39 3 -10 -12 -11 -14 -3 20 18 -16 8 2 25 32 6 12 -30 15 23 11 -2 4 6 5 6 20 -14 -3 -6 8 -19 -17 16 -16
6851 -16 -26 -2 -14 -2 -4 -15 5 19 -12 -20 -13 1 -27 4 9 -15 29 -9 1 3 28 6 11 8 15 11 -4 2 -18 14 20 22 22 -9 -23 -29 -31 -28
6889 -28 -6 -8 9 -26 -13 -36 -3 -10 -7 32 16 13 -4 16 21 5 -13 3 0 8 9 10 25 23 17 -2 4 9 -4 25 -7 -8 25 13 -2 1 17 -23
6927 -23 -33 8 -10 -27 4 -7 0 -32 -18 -33 -11 -23 -4 -7 15 -7 -21 -6 24 -20 19 4 16 13 16 -26 4 8 27 22 31 -12 -23 -2
6961 -2 12 15 -1 30 7 4 -22 8 3 -12 -2 -12 -15 -13 3 12 -17 -37 -19 -5 -6 -19 2 -10 14 7 23 -9 11 -10 8 14 6 -1 16 2
6997 2 26 2 23 9 0 4 17 6 -7 -28 6 5 5 -18 -18 -4 -27 -8 5 -18 -21 7 -4 14 -16 21 -7 -6 -17 5 16 17 -5 7 13
7032 13 6 2 23 15 5 17 17 10 3 -3 15 4 26 5 -18 18 0 0 1 -10 -29 27 -14 2 -36 -11 -1 -17 -29 -5 -6 -22 -22 -5 -11 -14 -17
7069 -17 -25 -10 -11 1 16 -3 -1 32 -16 1 2 23 12 19 7 1 23 -10 28 9 2 -15 16 -8 1 -17 -1 1 -41 -31 -10 -22 -2 -19 -48
7104d8K3K9l1jL0kpOoQlJ0j9J7j2Jj1M2j3mJj7L3oj9J7Jj3Rk5J1j0J0J9k1Ol5
7141c0N8k5l2L4j8J2rLj4K8rj1Rj0j4J3J2pL7k3L3l5J5j2k6M0j5K5l0j2J8J5J0
7174C0m6J8Kj9O%J3J5k2qpJ1j2MPJ3j5Rj6LJK1j4Ojj1K4nMj1K8l4lj0K6J1j5P
7212A0Pk4J4j1J4jj8OJ6j0%oj0Jk4M8m9J3J7M%j8QK4ql5M3l6L1k9kK1M0n3L0J
7248A4j4jJ3Kj1%Rkj6K7j9pK5k2Pl7M4k6OJ0j6KoJ9j8J9k2K1k2j2J1kK1oJ5k9
7284b3K8k5K4MK7k9J9k7kK7n6M6k3J2rJ6j6j4J5knJ9k1lJ8pqPlrJ7j6%J9k3K0
7320cjk8LL0j7JL0%ok1J4j1L9m5K5kJ0j8K5Jm4K2J2K8o5J1J5Rj4Ol0K0jK1j5k0
7356a9j6L9j8PpmnmJ9Lj7lL5k2J4Pj5K2Lk0K6l2J5%j3NJ0J0Lm5PJ6J2k1J1j4k5
$$ plain form
7104 -48 -25 4 -27 -28 2 0 -7 -1 -7 1 -2 8 -11 6 -6 -5 -16 26 13 9 10 -7 26 20 1 18 19 6 15 -10 1 -9 1 20 -1 5 -30
7141 -30 28 3 -29 5 -13 -1 -10 -7 -21 7 -2 -13 -4 -14 -28 -15 -3 -10 27 4 37 2 17 5 -21 19 4 29 -1 -13 5 20 30
7174 30 -16 2 4 -15 -9 -9 4 19 -3 -11 -18 -7 -19 -15 -8 5 -10 -1 -17 -14 -13 8 -6 0 -1 -12 12 7 11 0 28 -6 -9 -19 7 18 3 10
7212 10 17 -7 7 -4 10 9 -9 -3 13 3 3 -3 -13 -12 -36 12 -37 -24 -7 -3 -3 -21 -13 11 3 -32 11 -25 6 -23 -25 -4 36 -17 13 14
7248 14 0 -1 12 14 3 3 12 10 -6 21 2 -5 20 -2 5 -32 12 -14 -8 2 -14 -12 -18 1 -17 2 -20 1 -21 -33 -22 -24 -3 -9 6 -23
7284 -23 5 -20 4 8 35 6 25 -2 -4 23 -33 13 -10 2 -7 9 -7 -21 -6 -8 -13 6 -15 -18 0 -7 -15 -8 -11 -20 -3 -19 -19 0 -23 -3
7320 -3 -4 -32 -29 1 -16 -15 15 15 9 -12 2 -9 30 -15 10 8 18 0 25 26 -18 4 16 44 -21 -10 5 14 0 6 -24 -4 -5 16 1 -19
7356 -19 -35 4 -14 -7 -14 -18 -23 -27 -8 -5 -22 -25 10 -12 2 9 -6 16 19 -1 25 -7 8 8 -5 0 10 20 23 -22 -15 1 13 -8 3 -11 -36
7393c6RK2pj0MK4jk1oK2j3Kj8K9j1k1K9Lk8K2nJ4mpjJ8lK6j4j4j5J1j6J4L1m4
7429a5L5l9J4%lpoL0j9j7Nj8M1k6K5j9J0l1L5K4k1j0JLJ8oK5k7JK%mKKmRj9J7
7467HqJ6k1KmK8j3j9qO1l7nk8J4K2k1j3KLOkJ0%Kk5J5J0J4l2J2QJ3loL0m0L9k0
7505A0j7RQj5J7NMj0qPj2J2Npk7J8PKk3J2mk8J8klkML3l1K2j3K6l8NK9mLjj1O
7545F%Mj2NkL3pj3l9L0k8K8Jk0K4l4K9l2M2mm5L3J1m8K7k8K3PLlJj1KLPJ7lml
7584@j2L8j2j9J4KJ0j0K0KLl6MJ0j9MPoj1J9k5oJ1jJ5Lj0k2J6j0L5k0k3J0qK5
7620bJ0%k3K1k7J1J1J3J0k5J1JLoK7m4K2j2J1J4k0lJ2j8NkNj7oJ3j7LJ8l2L0N
7656Bkk5K8k8lL0pJ9nonlJ9oJommmkM4j6k7J4j3QlK6nj3Lj2kJ6rpj2K0j8kkJ0
$$ plain form
7393 -36 -27 -5 -12 -22 -18 6 5 -16 -22 0 -13 -11 -29 0 -11 -32 -3 0 -28 -6 -11 3 -1 -8 -9 9 6 32 18 4 -11 0 -16 -2 29 -15
7429 -15 20 -19 -5 -5 -8 -15 -21 9 -10 -27 -22 -40 1 -25 0 -19 -9 -40 -5 19 -2 -12 -11 -8 10 4 29 2 3 5 5 1 3 5 1 10 -9 8
7467 8 0 16 -5 -3 -7 21 8 -11 -19 42 5 0 -28 -14 8 -13 -26 -24 -21 -15 -17 -7 -7 -5 -30 -15 -5 9 -23 -11 -3 10 7 1 31 -9 30 10
7505 10 -7 2 10 -5 12 17 21 11 3 10 -2 10 15 8 -19 -1 6 8 -15 -3 -7 -35 -17 -19 -22 -24 -20 13 -18 4 -9 17 -21 -16 13 9 12 11 0 6
7545 6 6 10 -2 3 1 34 27 14 -25 5 -23 5 6 -14 10 -24 5 -27 15 11 -34 -1 10 -38 -11 -39 -16 -9 -6 -9 -8 -19 -17 -14 -7 10 7 3 0
7584 0 -12 26 14 -5 9 11 21 11 31 33 36 0 4 14 -5 -1 6 0 -11 8 -17 -23 -12 -13 2 5 -5 -27 -11 -21 14 -6 -29 -19 -27 -2
7620 -2 8 8 -15 6 -21 -10 1 14 24 -1 10 11 14 8 35 -9 13 1 12 26 6 3 15 -3 2 0 5 -12 -18 -5 -22 -19 -1 -33 -3 2
7656 2 0 -25 3 -25 -28 2 -5 14 9 3 -2 -5 14 8 9 3 -1 -5 -9 -11 33 17 -10 4 -9 -1 -4 22 17 4 7 -5 -7 9 0 -7 -19 1 -17 -19 -21 -11
7698a1j1Nlj5K6jJ6Ok3N6p5K9Lj9K3MKPj8L3k9J0k4K2j2mMpK2j4kj4KK5j4j2J9
7735F%k9jQK3rLj3j6K7ro%j0M5k3OJJj4K0l3L4rMPqMk1K2j6MM3m2Okj0mJ1nj0
7776a5NJ5Ll0Pqj3L5j8K0m5L7mK1kKRpk0L0k9J3j0j6M0J2Ok4j6J6j8JJ5rjk0J8
7813@k2L6qj4j2K7j7Oj8KoKK8k9oNRkqK8rOjMRj1L5m7L4Qm6J0K3j9lL0k2Nj9O
7853fPK0m1K1J4m0J5NoqMj0K0k0JROj9K1j1qJ5j9M3J2Oj7l8J3J0KM6m4o%K3l1
7890a1K5k2k1M3%mj6K0l6K1Pmj4L4j2l2QJMK5k9Rk3M2k2K1j0k8J9KQJ4j6J8j1
7925A0%j0%mLk0KM0k5K1k0Mj6J7j7NoRj1L1m1J3j3RmPj1NK8j8K4k7L5qpnRpl5
7964c3L9oJ3l0RL7l0J1k6J1K6j7plj6%jJ3RrJ8m8M6Qj3j1Pm3K0jj0L0k2pNK1J2
$$ plain form
7698 -11 -22 -17 -20 -35 -9 -10 6 12 -11 45 -30 -1 2 -17 6 10 12 19 1 34 5 15 -9 13 1 -3 1 -6 16 2 0 -14 -12 13 -1 -13 6
7735 6 6 -23 -24 -16 7 -2 1 -12 -28 -1 -10 -16 -16 -26 19 -4 2 3 4 -10 10 -23 11 2 6 13 5 9 -12 10 -6 -2 41 -1 5 3 -7 -11 0 -5 -15
7776 -15 -10 5 8 -22 -15 -23 -36 -1 -19 1 -44 -7 -11 10 8 10 19 12 -8 22 -7 6 -4 -20 20 32 38 14 -2 14 -4 -3 12 3 2 -18 0
7813 0 -22 14 6 -8 -20 7 -10 -4 -22 -20 -26 -24 4 -25 -31 -26 -17 -19 -27 1 -8 -2 -3 1 10 -1 34 -13 21 29 -17 -7 16 -3 -6 24 2 7 -12 -6
7853 -6 1 21 -20 1 15 -25 -10 -5 -11 -19 -15 -25 -5 -25 -24 -15 -9 -28 -7 -18 -26 -11 -30 13 25 31 14 -24 -11 -1 1 47 3 -3 -3 20 -11
7890 -11 14 -8 -29 14 14 10 -6 14 -22 -1 6 2 -12 22 10 -22 -14 -13 -9 16 -13 -4 -27 15 -7 14 4 -24 -5 -3 5 19 3 21 10
7925 10 10 0 0 -4 -1 -21 -19 21 -4 17 -3 1 -15 2 -15 -10 -16 -7 -18 13 -28 -15 -28 -19 -23 -16 -27 -22 6 -12 12 -15 20 12 5 0 9 2 -33
7964 -33 6 0 13 -17 -8 29 -1 10 -16 -5 21 4 -3 -6 -22 -22 -23 -10 -1 -10 8 -40 6 14 1 -10 -3 -46 -26 -27 -37 -7 -29 -36 -31 -10 2
8001Bj9PJ3l3L3j8JkJ1K3j6J0j2oJ5PonNnKJ4j1noJ6k4j2J3j1J4mj0qJ0mK3j0
8039hj7M0Jk0j0J6jJJkL2Nk3Oj3jK3j3k7M2pJ0k1Mk3noj5M7%j0oj5%K0j9MKmo
8079a8K6n6M4K4j3Lj3k5M3j8KRRJ0%Mpj2k2LnM2J1n3LOJ1jk1OJ4Kl1mK5k1kL4
8117I%k0llk3KNJ2oM1J5n4J8J7j9OpJ6KKj3RJ5q%Ol7K5j0J4Kk0K0k8QmK5j2nl1
8157c4L9mjqjj1jJK5Jk5J4J8k1J1qJ2JK4qKk2j7K9k0J2qk6L6oj9J5Pj0
$$ plain form
8001 2 -17 -10 3 -30 3 -15 -14 -16 -5 18 2 12 0 -6 9 16 10 5 10 5 7 21 10 5 -1 15 -9 -21 -8 -19 -5 -9 -19 -27 -17 -21 2 -8
8039 -8 -25 15 16 -4 -14 2 1 2 3 1 33 38 15 21 8 7 30 17 -10 32 25 35 14 18 -5 -10 -16 -31 16 16 6 0 -15 -15 5 -14 -10 -8 -12 -18
8079 -18 8 -48 -4 20 7 10 -3 -28 15 -3 -1 8 17 27 27 31 24 12 -10 -7 -12 30 41 -12 -9 -3 8 7 -14 -8 6 8 -23 -27 -2 -23 -25 9
8117 9 9 -11 -14 -17 -40 -38 -33 -21 -27 14 29 -25 -7 10 -9 -3 -10 6 8 10 -3 6 21 13 13 19 -18 7 -3 11 13 -7 13 -15 -7 -11 14 2 -3 -34
8157 -34 5 1 0 -8 -9 -20 -21 -20 5 6 -19 -5 13 -8 3 -5 7 8 32 24 26 4 -13 16 -4 8 0 -26 10 4 -15 0 7 -3
8191c
##END NTUPLES=NMR FID
##END=
