##TITLE=1H_AM_NV 188.1
 200.13MHz,,
 8 sc
 
 22.4.2025
##JCAMPDX= 6.0         $$ Bruker NMR JCAMP-DX V2.0
##DATA TYPE= NMR FID
##DATA CLASS= NTUPLES
##ORIGIN= UXNMR, Bruker Analytische Messtechnik GmbH
##OWNER= pz
$$ XWIN-NMR		Version 3.5
$$ Tue Apr 22 15:41:37 2025 Russian Standard Time (UT+4h)  she@DPX200
##.OBSERVE FREQUENCY= 200.1313
##.OBSERVE NUCLEUS= ^1H
##.DELAY= (6, 6)
##.ACQUISITION MODE= SIMULTANEOUS
##.ACQUISITION SCHEME= undefined
##.AVERAGES= 8
##.DIGITISER RES= 18
##SPECTROMETER/DATA SYSTEM= spect
##.PULSE SEQUENCE= zg30
##.SOLVENT NAME= CDCl3
##.SHIFT REFERENCE= (INTERNAL, CDCl3, 0, 14.3821)
##AUDIT TRAIL= $$ (NUMBER, WHEN, WHO, WHERE, WHAT)
$$ ##TITLE= Audit trail, XWIN-NMR		Version 3.5
$$ ##JCAMPDX= 5.01
$$ ##ORIGIN= Bruker BioSpin GmbH
$$ ##OWNER= she
$$ F:/spectra/data/she/nmr/H-C/1/audita.txt
$$ ##AUDIT TRAIL=  $$ (NUMBER, WHEN, WHO, WHERE, WHAT)
(   1,<2025-04-22 15:40:12.06 +0400>,<she>,<DPX200>,
      <created by zg, POWCHK disabled, PULCHK disabled
       configuration hash MD5:
       00 E9 B6 7A A2 85 ED C7 34 08 36 98 17 FE 4E 26
       data hash MD5: 16K
       2D 63 F2 6A 0E F4 C1 16 BD 9D CF 63 3B 72 22 7D>)
$$ ##END=
$$ 
$$ hash MD5
$$ 2D 09 15 DD E4 89 E0 CA A5 80 93 93 E5 A6 CF 65
##$RELAX= 
##$RELAX= 
##$RELAX= 
##$RELAX= 
##$RELAX= 
##$RELAX= 
$$ Bruker specific parameters
$$ --------------------------
##$DU= <F:/spectra>
##$EXPNO= 1
##$NAME= <H-C>
##$PROCNO= 1
##$TYPE= <nmr>
##$USER= <she>
##$AMP= (0..31)
100 100 100 100 100 100 100 100 100 100 100 100 100 100 100 100 100 100 
100 100 100 100 100 100 100 100 100 100 100 100 100 100 
##$AQSEQ= 0
##$AQ_mod= 1
##$AUNM= <au_zg>
##$AUTOPOS= <>
##$BF1= 200.13
##$BF2= 200.13
##$BF3= 200.13
##$BF4= 200.13
##$BF5= 200.13
##$BF6= 200.13
##$BF7= 200.13
##$BF8= 200.13
##$BYTORDA= 1
##$CFDGTYP= 0
##$CFRGTYP= 5
##$CHEMSTR= <none>
##$CNST= (0..31)
1 1 145 1 1 1 1 1 1 1 1 1 1 1 1 1 1 1 1 1 1 1 1 1 1 1 1 1 1 1 1 1 
##$CPDPRG= <>
##$CPDPRG1= <>
##$CPDPRG2= <>
##$CPDPRG3= <>
##$CPDPRG4= <mlev>
##$CPDPRG5= <mlev>
##$CPDPRG6= <mlev>
##$CPDPRG7= <mlev>
##$CPDPRG8= <mlev>
##$CPDPRGB= <>
##$CPDPRGT= <>
##$D= (0..31)
0 0.7 0 0 0 0 0 0 0 0 0 0.03 0 0 0 0 0 0 0 0 0 0 0 0 0 0 0 0 0 0 0 0 
##$DATE= 1745322011
##$DBL= (0..7)
120 120 120 120 120 120 120 120 
##$DBP= (0..7)
150 150 150 150 150 150 150 150 
##$DBP07= 0
##$DBPNAM0= <>
##$DBPNAM1= <>
##$DBPNAM2= <>
##$DBPNAM3= <>
##$DBPNAM4= <>
##$DBPNAM5= <>
##$DBPNAM6= <>
##$DBPNAM7= <>
##$DBPOAL= (0..7)
0.5 0.5 0.5 0.5 0.5 0.5 0.5 0.5 
##$DBPOFFS= (0..7)
0 0 0 0 0 0 0 0 
##$DE= 6
##$DECBNUC= <off>
##$DECIM= 32
##$DECNUC= <off>
##$DECSTAT= 4
##$DIGMOD= 1
##$DIGTYP= 9
##$DL= (0..7)
0 120 120 120 120 120 120 120 
##$DP= (0..7)
150 150 150 150 150 150 150 150 
##$DP07= 0
##$DPNAME0= <>
##$DPNAME1= <>
##$DPNAME2= <>
##$DPNAME3= <>
##$DPNAME4= <>
##$DPNAME5= <>
##$DPNAME6= <>
##$DPNAME7= <>
##$DPOAL= (0..7)
0.5 0.5 0.5 0.5 0.5 0.5 0.5 0.5 
##$DPOFFS= (0..7)
0 0 0 0 0 0 0 0 
##$DQDMODE= 0
##$DR= 18
##$DS= 0
##$DSLIST= <SSSSSSSSSSSSSSS>
$$ [...]
##$SUBNAM0= <"">
##$SUBNAM1= <"">
##$SUBNAM2= <"">
##$SUBNAM3= <"">
##$SUBNAM4= <"">
##$SUBNAM5= <"">
##$SUBNAM6= <"">
##$SUBNAM7= <"">
##$SUBNAM8= <"">
##$SUBNAM9= <"">
##$SW= 18.0517328524113
##$SWIBOX= (0..15)
0 0 2 0 0 0 0 0 0 0 0 0 0 0 0 0 
##$SW_h= 3612.71676300578
##$TD= 16384
##$TD0= 1
##$TE= 0
##$TE2= 300
##$TE3= 300
##$TEG= 300
##$TL= (0..7)
0 120 120 120 120 120 120 120 
##$TP= (0..7)
150 150 150 150 150 150 150 150 
##$TP07= 0
##$TPNAME0= <>
##$TPNAME1= <>
##$TPNAME2= <>
##$TPNAME3= <>
##$TPNAME4= <>
##$TPNAME5= <>
##$TPNAME6= <>
##$TPNAME7= <>
##$TPOAL= (0..7)
0.5 0.5 0.5 0.5 0.5 0.5 0.5 0.5 
##$TPOFFS= (0..7)
0 0 0 0 0 0 0 0 
##$TUNHIN= 0
##$TUNHOUT= 0
##$TUNXOUT= 0
##$USERA1= <user>
##$USERA2= <user>
##$USERA3= <user>
##$USERA4= <user>
##$USERA5= <user>
##$V9= 5
##$VALIST= <valist>
##$VCLIST= <CCCCCCCCCCCCCCC>
##$VD= 0
##$VDLIST= <DDDDDDDDDDDDDDD>
##$VPLIST= <PPPPPPPPPPPPPPP>
##$VTLIST= <TTTTTTTTTTTTTTT>
##$WBST= 1024
##$WBSW= 4
##$XGAIN= (0..3)
0 0 0 0 
##$XL= 0
##$YL= 0
##$YMAX_a= 416976
##$YMIN_a= -582128
##$ZGOPTNS= <>
##$ZL1= 120
##$ZL2= 120
##$ZL3= 120
##$ZL4= 120
##$ABSF1= 10
##$ABSF2= 0
##$ABSG= 5
##$ABSL= 3
##$ALPHA= 0
##$AQORDER= 0
##$ASSFAC= 0
##$ASSFACI= 0
##$ASSFACX= 0
##$ASSWID= 0
##$AUNMP= <proc_1d>
##$AZFE= 0.1
##$AZFW= 0.1
##$BCFW= 1
##$BC_mod= 2
##$BYTORDP= 1
##$COROFFS= 0
##$CY= -3
##$DATMOD= 1
##$DC= 2
##$DFILT= <>
##$DTYPP= 0
##$F1P= 0
##$F2P= 0
##$FCOR= 0.5
##$FTSIZE= 0
##$FT_mod= 4
##$GAMMA= 1
##$GB= 0.15
##$INTBC= 1
##$INTSCL= 1
##$ISEN= 128
##$LB= 0.25
##$LEV0= 0
##$LPBIN= 0
##$MAXI= 10000
##$MC2= 0
##$MEAN= 0
##$ME_mod= 0
##$MI= 1.114404
##$NCOEF= 0
##$NC_proc= 0
##$NLEV= 6
##$NOISF1= 3.799351
##$NOISF2= 2.8
##$NSP= 1
##$NTH_PI= 0
##$NZP= 0
##$OFFSET= 14.38212
##$PC= 1
##$PHC0= -835.0564
##$PHC1= 12.3922
##$PH_mod= 1
##$PKNL= yes
##$PPARMOD= 0
##$PSCAL= 0
##$PSIGN= 0
##$REVERSE= no
##$SF= 200.129724274929
##$SI= 16384
##$SIGF1= 3
##$SIGF2= 2
##$SINO= 400
##$SIOLD= 16384
##$SREGLST= <1H.CDCl3>
##$SSB= 0
##$STSI= 0
##$STSR= 0
##$SW_p= 3205.1282051282
##$SYMM= 0
##$S_DEV= 0
##$TDeff= 0
##$TDoff= 0
##$TI= <>
##$TILT= no
##$TM1= 0
##$TM2= 0
##$TOPLEV= 0
##$USERP1= <user>
##$USERP2= <user>
##$USERP3= <user>
##$USERP4= <user>
##$USERP5= <user>
##$WDW= 1
##$XDIM= 8192
##$YMAX_p= 0
##$YMIN_p= 0
$$ End of Bruker specific parameters
$$ ---------------------------------
##NTUPLES= NMR FID
##VAR_NAME=  TIME,          FID/REAL,        FID/IMAG
##SYMBOL=    X,             R,               I
##VAR_TYPE=  INDEPENDENT,   DEPENDENT,       DEPENDENT
##VAR_FORM=  AFFN,          ASDF,            ASDF
##VAR_DIM=   8192,          8192,            8192
##UNITS=     SECONDS,       ARBITRARY UNITS, ARBITRARY UNITS
##FACTOR=    0.0002768,     1,               1
##FIRST=     0,             0,               0
##LAST=      2.2672688,     0,               0
##MIN=       0,             -582128,         0
##MAX=       2.2672688,     416976,          0
$$ Real data points
##PAGE= N=1
##DATA TABLE= (X++(R..R)), XYDATA
$$ [...]
$$ plain form
1337 -201 -277 379 158 -386 76 389 -377 -48 307 30 -326 2 297 -216 -409 295 194 -363 53 193
1357 193 -253 9 283 133 -185 86 199 -155 -240 405 -71 -291 32 263 -241 -169 320 -4 -224 223 391
1378 391 -203 -157 266 30 -421 -24 444 -209 -149 337 32 -480 374 322 -387 -153 199 35 -147 125 332
1399 332 -156 -263 81 -22 -346 -27 217 -210 -363 -5 167 -204 47 502 -12 -319 364 215 -386 -133
1419 -133 351 -12 -269 67 421 -58 -211 549 9 -248 285 323 -186 -23 267 -31 -454 91 370 35
1439 35 -9 118 83 -348 206 301 -187 -118 194 91 -279 18 94 6 17 40 -57 -78 63 203 -112 -61 334 58
1463 58 -317 191 249 40 -1 266 34 -271 -40 307 -148 -221 65 -91 -174 243 108 -109 -105 165 5 -463
1485 -463 124 316 -28 -391 272 144 -436 -19 98 -151 -309 140 255 -88 -92 166 -81 -214 139 254 -361
$$ packed form
1337b01p6O56k21n44M62L13p66L29L55k77l56L28K95n13j93P04j01n57M16J40
1357A93m46K62K74j50l18K71J13l54q5O45m76k20L23K31n04P2M89l24k20M47J68
1378C91n94M6M23k36m51L97M68o53O0M86l05n12Q54n2p09K34L52j64j82K72K07
1399C32m88j07L44j03l24L19K44m27j53L58J72l71K51M55n14l07O83j49o01K53
1419a33M84l63k57L36L54m79j53P60n40k57N33L8n09J63K90k98m23N45K79l35
1439C5m4J27l5m31N54R5m88O9L12j03l70K97P6q8J1K3r7k1J41J40l15N1L95k76
1463E8l75N08N8k09m1K67k32l05K31L47m55p3K86j56q3M17j35k17MK70j60m68
1485d63N87J92l44l63O63j28n80M17J17k49j58M49J15l43mK58k47j33L53J15o15
$$ plain form
1506 -361 -189 239 -132 -106 262 114 -275 -50 99 87 -266 75 357 -236 -91 63 -1 -15 61 71 -258 -52
1528 -52 68 74 -399 -112 193 -81 -90 119 -218 -162 -11 34 -17 -27 51 63 -154 63 320 -150 -217 206 -84 -172
1552 -172 105 111 -109 28 183 129 -190 76 284 -146 -151 100 74 -382 -50 185 -255 -161 265 278 -249 63 255
1575 255 -94 -85 129 33 -119 0 135 -199 -135 48 114 -315 -74 432 -27 -67 -34 131 -160 -112 217 -15 -223
1598 -223 243 236 -176 3 217 -131 -205 86 -26 -200 -38 58 81 -201 135 154 -175 -66 277 85 -31 86
1620 86 79 -105 -171 88 132 39 54 101 -84 -24 19 91 -154 71 70 -149 80 97 -81 -223 -4 110 -187 -9 195
1645 195 165 -110 -16 -17 -172 -38 103 -36 -30 -44 19 -84 -235 184 111 -71 41 55 -132 -10 223 -9 -241
1668 -241 -19 118 -141 14 299 164 -177 -21 15 -105 -82 -3 176 -159 -27 -14 -34 -7 110 48 -183 -141 108
$$ packed form
1506c61J72M28l71K6L68j48l89K25J49j2l53L41K82n93J45J54o4j4P6J0l29K06
1528e2J20Om73K87L05k74rK09l37N6J51M5n1j0P8J2k17K17K57m70o7M23k90q8
1552a72K77Ok20J37J55n4l19K66K08m30nK51k6m56L32K35m40R4M26J3n27L12J92
1575B55l49RK14r6j52J19J35l34O4J83O6m29K41N06m59m0L3J65k91M8L29k32k08
1598b23M66pm12J79K14l48p4K91j12j74J62R6K3k82L36J9l29J09L43j92j16J17
1620H6pj84o6K59M4r3J5M7j85O0M3P2k45K25jk19K29J7j78j42K19J14k97J78K04
1645A95l0k75R4jj55J34J41j39Oj4O3j03j51M19p3j82J12J4j87J22K33k32k32
1668b41K22J37k59J55K85j35l41J56L6j20K3P9J79l35J32J3k0K7J17o2k31M2K49
$$ plain form
1691 108 15 -193 -43 -18 -154 -203 193 123 -18 26 91 -149 -176 47 172 -54 52 -20 -93 204 54 196 -22
1714 -22 22 -51 -16 -65 94 -62 -40 -166 73 92 104 10 -27 33 125 169 -64 -49 6 190 -201 136 181 -9 -136
1739 -136 81 123 -161 23 189 -6 -106 0 -5 -88 66 -152 -112 7 46 104 -5 83 145 -20 -149 18 22 -27
1763 -27 77 285 -47 -124 11 47 -236 83 72 -171 -16 139 63 -46 -74 122 3 -92 116 131 30 -139 123
1786 123 7 -304 -121 168 -156 -213 21 15 -50 -41 121 -27 -218 199 13 -105 -111 6 -195 79 157 -99 -30
1809 -30 -27 48 -23 34 -77 20 70 -158 206 -29 15 -33 89 100 -14 82 -97 -68 -22 5 89 89 53 21 -98 8 -89
1836 -89 -90 104 -3 -2 -34 67 3 -48 -3 -5 -55 -76 166 -69 -121 137 145 -90 -109 88 -61 -93 -8 64 -107 -125 166
1863 166 74 -111 101 -76 -21 -48 -55 188 -128 -11 124 53 -72 -43 11 -35 -88 166 110 -86 47 18 -47 -82 -109
$$ packed form
1691A08r3k08J50K5j36m9L96p0j41M4O5k40k7K23J25k26J06p2p3K97j50J42k18
1714b2M4p3L5m9J59j56K2j26K39J9J2r4l7O0R2M4k33J5N5J84l91L37M5j90j27
1739a36K17M2k84J84J66j95j00J06nq3J54k18M0J19L9N8j09Q8O2j65j29J67Mm9
1763b7J04K08l32p7J35L6k83L19j1k43J55J55p6j09k8J96j19r5K08J5j01j69K62
1786A23j16l11J83K89l24n7K34oo5RJ62j48j91M17j86j18oJ17k01K74P8k56O9
1809c0LP5p1N7j11R7N0k28L64k35M4m8J22J1j14R6j79K9M6K7Q4%l6l2j19J06r7
1836h9jJ94j07Jl2J01o4n1M5kn0k1K42k35n2K58Qk35j9J97j49l2Q5P2j71j8K91
1863A66r2j85K12j77N5k7pK43l16J17J35p1j25K9N4m6n3K54n6j96J33k9o5l5k7
$$ plain form
1888 -109 64 55 -61 70 -89 114 -22 -176 -22 -63 -48 6 -151 55 -82 -136 -140 8 53 -162 212 234 -98
1911 -98 118 156 100 -60 95 -157 57 80 -25 30 51 142 51 -33 -8 84 33 40 93 29 -136 0 138 29 74 -11
1937 -11 -40 -128 -36 109 -12 180 70 73 -273 -145 18 -19 -291 157 86 -58 3 171 -106 -8 38 59 -100 -31
1961 -31 -159 56 11 53 -19 -156 12 106 115 -39 51 -28 -78 -7 -90 -170 10 -43 52 -30 97 -91 90 -70 -17 -27
1987 -27 -58 85 -121 -68 -82 -115 107 -162 -147 157 127 3 -56 -130 -12 -143 14 -88 -116 48 -47 5 91 17 114
2012 114 -23 -142 85 13 -43 224 -95 -11 -32 -12 -56 -89 98 45 -27 91 192 1 -117 202 186 -135 -22
2035 -22 -222 140 -58 -99 -67 -173 -13 -62 -64 49 86 11 -269 106 70 0 20 73 34 0 45 -88 -130 49 -143
2060 -143 44 -57 -48 150 129 -209 -103 36 -27 74 47 -36 59 44 42 -4 -64 -64 -24 3 101 38 -19 74 -82 -48 -79
$$ packed form
1888a09J73rj16J31j59K03j36j54J54m1J5N4j57K06j37n4mJ48M5k15L74K2l32
1911i8K16L8n6j60J55k52K14K3j05N5K1R1r1q4K5R2n1PN3o4j65J36J38j09M5q5
1937a1k9q8R2J45j21J92j10Ll46J28J63l7k72M48p1j44O1J68k77R8M6K1j59O9
1961c1j28K15m5M2p2j37J68R4Rj54R0p9n0P1q3q0J80n3R5q2J27j88J81j60N3j0
1987b7l1J43k06N3j4l3K22k69J5L04l0j24n9p4J18j31J57j02k8J64r5N2Q6p4R7
2012A14j37j19K27p2n6K67l19Q4k1K0m4l3J87n3p2J18J01j91j18L19j6l21J13
2035b2k00L62j98m1L2j06J60m9kJ13L7p5k80L75l6p0K0N3l9l4M5j33m2J79j92
2060a43J87j01RJ98k1l38J06J39o3J01k7q3R5j5km6o0%M0K7R8o3n7R3j56L4l1
$$ plain form
2087 -79 18 -100 15 64 67 -35 -105 30 -48 2 57 95 69 -51 132 26 -44 125 30 67 86 -32 -12 -130 -146 -63
2113 -63 -25 6 21 -2 -125 -73 88 -46 -81 105 109 52 63 -86 98 26 19 14 53 -16 145 -41 -151 -86 -2 -15 -115
2140 -115 236 -58 81 91 85 123 -3 -23 15 63 -44 -127 -138 18 76 179 -99 12 -76 112 25 -67 119 -152
2164 -152 -33 -17 -120 -153 -11 -69 13 -84 98 -6 81 75 64 103 37 175 40 -103 141 1 -164 126 -46 -183
2188 -183 -31 -67 141 -25 82 58 -195 130 -94 -28 -117 -167 -27 37 -72 -33 -90 -144 -105 0 -16 157 73 -2
2212 -2 70 -96 72 39 -94 -122 138 103 56 77 -49 161 6 46 -95 -36 -34 118 103 129 73 20 91 -118 3 -84
2238 -84 -47 -43 164 -78 58 42 -202 -183 -175 -54 -111 146 -125 -52 -72 27 67 -180 -23 -31 -46 -84 56 -158 -98 -20
2264 -20 7 -74 -26 93 33 -86 33 47 109 55 -72 -70 -18 -23 -10 -133 29 75 64 -93 -62 -23 37 -54 -79 -26 -41 123
$$ packed form
2087g9R7j18J15M9Lj02p0J35p8N0N5L8k6j20J83j06p0J69r5L7J9j18K0j18j6Q3
2113f3L8L1J5k3j23N2J61j34l5J86Mn7J1j49J84p2pnL9o9J61j86j10O5Q4j3j00
2140a15L51k94J39J0oL8j26k0L8M8j07q3j1J56N8J03k78J11q8J88q7r2J86k71
2164a52J19J6j03l3J42n8Q2r7J82j04Q7oj1L9o6J38j35j43K44j40j65K90j72j37
2188a83J52l6K08j66J07k4k53L25k24O6q9n0J40O4j09L9n7n4L9J05j6J73q4p5
2212bP2j66J68l3j33k8K60l5m7K1j26K10j55M0j41N9KJ52j5K6n6n3P1k09J21q7
2238h4L7MK07k42J36j6k44J9QJ21n7K57k71P3k0R9M0k47J57qj5l8J40k14O0P8
2264b0K7q1M8J19o0j19J19J4O2n4j27KN2nJ3j23J62M6j1j57L1L9O0r1k5N3j5J64
$$ plain form
2292 123 101 178 -53 -51 94 -148 21 44 -62 -43 51 27 -114 165 -17 -37 40 -133 93 104 34 61 -141 -45 -51
2317 -51 -2 -61 192 -66 -81 81 75 56 97 -36 1 7 -59 -25 2 58 -190 -86 -30 -17 37 82 -80 -98 -129 49 98
2344 98 84 62 -4 76 49 -71 39 7 17 22 -68 -79 135 -133 74 78 -97 -44 23 130 -80 38 113 71 -81 81
2370 81 -12 47 -137 69 -59 -103 -80 57 56 -165 148 86 -131 -41 12 60 -60 12 -228 -32 22 -100 -27 -52 57
2395 57 -13 43 135 -33 -109 28 94 -88 -33 89 57 67 -129 3 60 -101 -231 80 41 128 -40 124 20 -59
2419 -59 -215 -122 41 -1 -77 -110 4 66 57 19 50 -107 -132 -270 -128 21 218 183 -31 16 18 -84 37 50 -43 -135
2445 -135 91 41 -49 -69 -154 45 -41 -47 -90 171 -152 -133 -70 -38 -121 33 -84 -73 -24 -80 -8 114 -6 -14 152 -36
2471 -36 -46 93 -60 -43 -17 -51 -4 192 51 97 36 -93 -22 -18 25 -44 -72 -41 -75 -11 -167 -70 4 42 93 -1 61 41
$$ packed form
2292A23k2P7k31KJ45k42J69K3j06J9R4k4j41K79j82k0P7j73K26J1p0K7k02R6o
2317e1M9n9K53k58j5J62oj9M1j33L7Oo6L4K7N6k48J04N6J3N4M5j62j8l1J78M9
2344I8j4k2o6Q0k7j20J10l2J0Nr0j1K14k68K07Mj75N3O7J07k10J18P5m2j52J62
2370H1r3N9j84K06j28m4K3J37jk21L13o2k17R0N3M8j20P2k40J96N4j22P3k5J09
2395E7p0N6R2j68p6J37O6j82N5J22l2J0j96J32N7j61j30L11l9Q7j68J64j04p9
2419e9j56R3J63m2p6l3J14O2rl8L1j57k5j38J42J49J97l5k14M7Kj02J21J3r3r2
2445a35K26n0r0k0q5J99q6om3K61l23J9O3L2q3J54j17J1M9n6P2J22j20qJ66j88
2471c6j0J39j53J7K6l4M7J96j41M6o1j29P1MM3o9k8L1l4O4j56R7P4L8N1r4O2k0
$$ plain form
2499 41 81 113 105 249 -96 -105 44 -16 178 60 -149 -28 1 66 -4 49 -14 -72 -97 -33 69 -20 219 71 -51 217
2525 217 147 99 133 -48 58 174 -39 28 -27 -118 -114 -11 36 15 -39 -102 -2 30 9 -106 -9 -12 19 15 -61 120 107
2552 107 108 43 55 27 17 -36 46 171 -19 80 20 188 -58 89 80 54 -203 -153 -145 179 101 27 113 -104 -36 26 91
2579 91 -58 88 -89 81 -53 144 -57 -104 112 -17 187 -26 26 14 -1 -61 20 -12 71 85 12 101 -43 -39 101
2604 101 -107 -54 -174 13 44 -61 -20 121 74 -62 18 123 41 4 -82 -87 -53 22 5 -35 -124 168 -4 13 -34 68
2630 68 65 -21 190 -94 -73 28 107 -3 -212 -68 -26 16 -90 19 60 14 -75 111 84 -23 -17 -33 -62 61 177
2655 177 75 141 93 18 95 127 80 145 -71 9 -95 -33 -187 108 -142 -67 40 161 -66 -158 41 14 112 -215
2679 -215 1 -195 -37 93 39 -115 -73 18 99 6 39 96 21 -49 -79 72 -15 -14 -34 -69 -54 -72 -14 -295 -135 -53
$$ packed form
2499D1M0L2qJ44l45rJ49o0J94j18k09J21K9O5p0N3o3n8k5O4J02q9K39j48j22K68
2525B17p0m8L4j81J06J16k13O7n5r1MJ03M7k1n4o3J00L2k1j15R7lL1mp6J81j3
2552A07Jo5J2k8j0n3Q2J25j90R9o0J68k46J47rk6k57N0QL24p8p4Q6k17O8O2O5
2579I1j49J46j77J70j34J97k01m7K16j29K04k13N2j2j5o0Q1l2Q3J4p3Q9j44MJ40
2604A01k08N3j20J87L1j05M1J41m7j36Q0J05q2l7q6nL4P5j7m0q9K92j72J7m7J02
2630F8lq6K11k84K1J01P9j10k09J44M2M2j06J09M1m6q9J86k7j07Oj6k9J23J16
2655A77j02O6m8p5P7L2m7O5k16Q0j04O2j54K95k50P5J07J21k27r2J99k7R8l27
2679b15K16j96J58J30n4j54M2R1Q1r3L3N7p5p0l0J51q7Jk0l5J5j8N8k81J60Q2
$$ plain form
2705 -53 66 -54 -63 44 54 115 89 -33 -24 -36 -67 -43 -45 12 21 10 73 -35 -90 223 45 35 -138 10 -30 84 41
2732 41 -13 95 62 54 -101 -61 -79 37 -73 -91 -20 -97 73 -75 69 -23 102 20 -107 -221 57 37 -54 45 -111
2757 -111 -98 -135 90 -236 55 -47 75 -51 -178 42 -18 -44 4 -54 9 100 98 55 111 54 -18 -33 -53 6 72 -202
2783 -202 -77 19 85 -81 101 186 -121 19 -92 -8 -9 -48 -60 168 -127 -112 -89 -116 -9 27 5 -62 90 -5 59
2808 59 120 16 -52 -30 -82 21 -30 88 -10 -51 -29 -66 -39 1 -23 86 61 71 -5 -89 38 8 -27 -57 60 -1 9
2835 9 -79 -8 33 77 10 147 35 88 16 -47 119 -79 -75 -10 -60 -141 -18 6 16 37 74 -72 -109 78 85 -94 148
2862 148 -129 198 -56 -160 37 -16 -162 -66 175 -90 24 122 -1 114 -133 -47 -130 -64 45 -78 -70 84 -8
2885 -8 -13 -24 178 -64 33 211 83 25 25 155 -82 57 -52 -26 95 -66 39 42 -34 -48 129 2 -16 -27 47 19
$$ packed form
2705e3J19j20rJ07J0O1k6j22Rj2l1K4kN7Rj1O3j08n5L13j78j0j73J48m0J14m3
2732D1n4J08l3qj55M0j8J16j10j8P1p7J70j48J44r2J25q2j27j14K78k0r1R9j56
2757a11J3l7K25l26K91j02J22j26j27K20o0k6M8n8O3R1km3N6n7p2j5k0N9O6k74
2783b02J25R6O6j66J82Q5l07J40j11Q4jl9j2K28k95J5K3k7J07L6k2o7J52r5O4
2808E9O1j04o8K2n2J03n1J18r8m1K2l7K7M0k4J09k5J0p6q4J27l0l5l0J17o1J0
2835Iq8P1M1M4o7J37j12N3p2o3J66j98MO5n0q1J23K4J0K1L7j46l7J87Pj79K42
2862A48k77L27k54j04J97n3j46R6K41k65J14R8j23J15k47Q6q3O6J09j23QJ54r2
2885hnj1K02k42R7J78j28n8%J30k37J39j09K6J21j61J05Lp6j4J77j27j8j1P4k8
$$ plain form
2911 19 -17 -52 11 143 -3 -58 -10 -31 -78 30 -84 20 149 -84 66 -33 120 45 7 -55 -66 83 -107 -112 67
2936 67 -29 -95 57 118 37 171 -224 50 6 -22 68 -6 -45 90 -1 70 -26 -135 44 30 108 -139 -88 -116 -1 -100
2962 -100 -121 -66 -31 -24 37 -36 -36 -100 95 -120 82 17 -172 -105 -107 141 -129 53 -191 -183 55 78 -13 60 -121 89
2988 89 20 50 -36 -134 -82 75 -126 107 -64 92 -80 46 -37 147 -60 69 58 36 -227 127 -44 78 142
3011 142 -125 65 -35 135 27 -28 64 59 -53 -22 26 -159 -55 176 28 -147 13 20 -18 0 -88 9 109 73
3035 73 23 -143 -105 100 31 -137 -89 -142 -43 216 -110 29 5 -127 -135 -45 -35 -45 12 -87 57 56 14 -125 231 34
3061 34 96 11 -29 -71 88 106 4 160 -82 46 -93 64 154 105 -121 -130 -52 109 -131 -77 76 60 -32 16 -25
3086 -25 141 -56 121 -131 24 -17 8 30 -111 -145 -152 30 -48 -15 -48 103 -79 77 -23 44 -167 97 -50 -88
$$ packed form
2911A9l6l5O3J32j46n5M8k1m7J08j14J04J29k33J50r9J53p5l8o2j1J49j90nJ79
2936F7r6o6J52O1q1J34l95K74m4k8R0p4l9J35r1P1r6j09J79j4P8k47N1k8J15r9
2962a00k1N5L5PO1p3%o4J95k15K02o5j89O7kK48k70J82k44QK38K3r1P3j81K10
2988H9o9L0q6r8N2J57k01K33j71J56j72J26q3J84k07J29j1k2k63L54j71J22O4
3011A42k67J90j00J70j08n5R2nj12L1M8j85J04K31j48j75J60Pl8J8q8R7J00l6
3035G3n0j66L8K05o9j68M8n3R9K59l26J39k4j32qR0J0j0N7r9J44jm2j39L56j97
3061C4O2q5m0m2J59J8j02J56k42J28j39J57R0m9k26rP8J61k40N4J53j6r2M8m1
3086b5J66j97J77k52J55m1K5K2j41l4pJ82p8L3l3J51j82J56j00O7k11K64j47l8
$$ plain form
3110 -88 118 161 -194 58 -98 -183 82 218 -63 -83 6 45 -155 107 57 37 15 -147 20 -28 105 -103 -28 143
3134 143 115 -50 162 -99 -62 136 22 41 -140 -4 74 155 -5 -31 -31 -57 43 86 -115 -29 -107 7 54 -79
3158 -79 12 72 82 56 131 -80 45 -97 74 84 -126 74 -120 -89 -110 235 -12 -42 -16 191 -151 -47 154 -258
3182 -258 -106 74 -146 -17 -41 45 -15 -52 124 233 -56 -78 89 22 -67 41 4 70 -149 -141 94 -79 -52 -53 31
3207 31 -87 -73 79 23 -142 -48 63 -60 -5 16 10 -120 -45 0 -63 41 -58 83 -65 104 -45 59 -9 104
3231 104 -27 17 31 83 -85 27 24 -125 8 -137 207 19 84 -67 -65 -23 71 78 6 107 117 -307 111 27 -111
3256 -111 100 -19 48 -106 -59 -91 63 -1 -58 137 97 -19 -27 -189 217 -66 -122 25 -211 120 2 -14 32 100
3280 100 107 -4 40 -70 45 -147 85 -29 -87 -52 140 69 95 75 -104 -175 -84 -140 72 -55 -72 -3 147 -103
$$ packed form
3110h8K06M3l55K52j56q5K65J36k81k0Q9L9k00K62n0k0k2j62J67m8J33k08P5J71
3134A43k8j65K12k61L7J98j14J9j81J36P8Q1j60k6%k6J00M3k01Q6p8J14M7j33
3158g9R1O0J0k6P5k11J25j42J71J0k10K00j94L1k1L45k47l0K6K07l42J04K01m12
3182b58J52J80k20J29k4Q6o0l7J76J09k89k2J67o7q9J08l7O6k19QK35j73K7jQ4
3207C1j18J4J52n6j65R4J11j23N5K1oj30P5M5o3J04r9J41j48J69j49J04o8J13
3231A04j31M4J4N2j68J12lj49J33j45L44j88O5j51KM2R4Pp2J01J0m24M18q4j38
3256a11K11j19O7j54M7l2J54o4n7J95m0j16qj62M06k83n6J47k36L31j18j6M6O8
3280A00Pj11M4j10J15j92K32j14n8L5J92p1K6k0j79p1R1n6K12j27j7O9J50k50
$$ plain form
3304 -103 -2 35 35 35 141 -62 -34 93 -2 -81 1 32 -44 76 92 82 88 -73 -111 110 189 52 140 184 9 -163
3330 -163 -36 -82 -117 21 128 -30 7 -12 -46 -29 -13 53 54 -110 -61 -35 -133 10 -52 -174 -5 13 -55 -77 51 -111
3356 -111 -160 51 84 -41 -92 28 -139 5 66 125 -4 119 -77 -44 -139 -20 -31 78 -98 176 56 -19 113
3379 113 -45 150 32 0 148 90 -74 -67 -103 7 -105 -109 -60 41 -26 -136 105 89 -2 14 -150 -98 -136 -41 73
3404 73 -27 39 36 -63 66 -27 -114 -142 -133 -1 -12 -76 54 15 53 72 -34 -100 132 -86 -81 -29 43 -49 65 -40 26
3431 26 -33 -75 -42 51 -141 39 163 115 87 100 62 19 -47 153 60 112 8 -128 -124 -51 -130 -61 -73 -14 92 -58 -59
3458 -59 -16 99 -99 226 28 -75 -4 -76 -22 -60 53 -148 -10 67 -10 -97 -9 -9 38 76 56 -81 -50 -13 -66 -82
3484 -82 59 -14 26 -36 43 -109 -33 96 101 97 -136 -27 -126 -9 -130 26 -156 -51 -59 153 111 -47 -25 -68 -135 -131
$$ packed form
3304a03J01L7%%J06k03K8J27r5p9Q2L1p6J20J6j0Oj61l8K21P9j37Q8M4j75j72
3330a63J27m6l5J38J07j58L7j9l4J7J6O6Jj64M9K6r8J43o2j22J69J8o8k2J28j62
3356a11m9K11L3j25n1J20j67J44O1N9j29J23j96L3r5J19j1J09j76K74j20p5J32
3379A13j58J95j18l2J48n8j64Pl6J10j12mM9J01o7j10K41j6r1J6j64N2l8R5J14
3404G3j00O6lr9J29r3q7k8RJ32j1o4J30l9L8J9j06o6K32k18NN2P2r2J14j05O6
3431B6n9m2L3R3j92J80J24m8k8J3l8m3o6K00r3N2j04j36MP3p9O9j2N9J06j50j
3458e9M3J15j98L25j98j03P1p2N4l8J13k01J38P7p7q7Q8%M7L8k0j37L1L7n3j6
3484h2J41p3M0o2P9j52P6J29Nmk33J09r9J17j21J56j82J05qK12m2j58K2m3o7M
$$ plain form
3510 -131 191 -9 76 -51 -14 33 103 -55 -4 72 66 -61 47 12 72 -120 72 42 43 23 176 16 -86 41 105
3535 105 -189 125 139 -52 76 -67 93 9 -209 85 -207 -75 -93 -102 23 151 -12 -225 164 -46 -130 194
3557 194 -40 74 10 -17 34 202 -40 -128 129 18 -87 -55 -51 -67 36 90 -251 -53 -38 12 144 -61 -208 -20
3581 -20 11 80 -34 30 122 -193 127 -108 -25 27 104 -44 -27 -59 -126 5 28 -88 -93 -144 -74 -62 50 -127 -20 95
3607 95 6 -8 65 -101 143 -116 24 94 -36 76 43 -11 -87 99 33 193 106 7 29 21 -93 17 5 7 -51 -147
3633 -147 0 -33 -134 38 51 113 67 -21 -16 -72 -40 -51 65 -110 10 4 206 66 -84 -168 -132 28 48 139 -66
3658 -66 106 -68 44 -37 -4 78 32 -18 -26 -36 169 -135 -101 38 153 46 47 51 -66 202 19 -77 44 76 157 -32
3684 -32 -8 76 -69 52 51 33 -37 1 129 14 -81 96 70 -42 33 -55 56 -139 20 13 -79 -201 39 -63 -63 130
$$ packed form
3510a31L22k00Q5j27L7M7P0j58N1P6oj27J08l5O0j92J92l0Jk0J53j60j02J27O4
3535A05k94L14J4j91J28j43J60q4k18K94k92J32j8rJ25J28j63k13L89k10q4L24
3557A94k34J14o4k7N1J68k42q8K57j11j05L2Mj6J03N4l41J98J5N0J32k05j47J88
3581b0L1O9j14O4R2l15L20k35Q3N2P7j48J7l2o7J31K3j16nn1P0J2J12j77J07J15
3607I5q9j4P3j66K44k59J40P0j30J12l3n4p6J86o6J60q7r9K2qj14J10j2Kn8r6
3633a47J47l3j01J72J3O2m6q8Nn6L2j1J16j75J20oK02j40j50q4L6J60K0R1k05
3658f6J72j74J12q1L3Q2m6n0qj0K05l04L4J39J15j07JMj17K68j83r6J21L2Q1j89
3684c2K4Q4j45J21jj8p0L8J28j15r5J77k6j12P5q8J11j95J59pr2j22K40j02%J93
$$ plain form
3710 130 114 166 -61 28 -67 -116 -29 150 26 232 -105 123 16 44 42 -70 -8 -22 59 112 18 -65 5 -68 -4 65
3736 65 61 -5 130 -30 144 26 14 -52 52 197 35 -110 -68 -186 -27 114 -77 172 26 31 43 66 -100 -130
3760 -130 9 165 35 24 189 74 -87 83 -111 37 -99 41 42 -116 205 58 59 144 92 -1 75 130 94 -58
3784 -58 -49 98 34 116 148 79 141 -10 -19 -105 -78 70 5 -32 13 -86 -119 -164 -61 133 62 -40 -170 -186 -116 58 -118
3811 -118 -94 -9 69 51 3 -91 -89 11 -24 152 48 -10 -106 -120 2 143 125 -80 6 -117 -180 47 4 146 -64
3836 -64 15 -95 21 -258 -121 -93 -89 19 51 -221 -27 -55 0 27 -13 -23 74 55 130 36 -32 -8 -132 34 60 75
3862 75 3 17 75 95 -72 36 21 18 123 -41 -28 15 -129 -169 -73 -4 81 80 -11 56 -110 44 -64 181 0 117
3888 117 -120 -97 -81 -42 -92 35 -77 160 91 40 38 133 122 83 -60 -39 236 89 20 43 -37 1 96 183 30 -60
$$ packed form
3710A30j6N2k27Q9r5m9Q7J79j24K06l37K28j07K8kj12O2j4Q1N3r4q3P0p3O4O9
3736F5mo6J35j60J74j18j2o6J04J45j62j45M2j18J59J41j91K49j46NJ2K3j66l0
3760a30J39J56j30j1J65j15j61J70j94J48j36J40Jj58L21j47JQ5n2r3P6N5l6j52
3784e8RJ47o4Q2L2o9O2j51rq6K7J48o5l7M5r9l3m5J03J94p1j02j30j6P0J74j76
3811a18K4Q5P8j8m8r4KJ00l5J76j04n8r6j4J22J41j8k05Q6j23o3K27m3J42k10
3836f4P9j10J16k79J37K8MJ08L2k72J94k8N5K7m0j0R7j9P5r4o8K4j24J66K6J5
3862G5p2J4N8K0j67J08j5lJ05j64J3M3j44m0R6O9Q5jr1O7j66J54j08K45j81J17
3888A17k37K3J6L9n0J27j12K37o9n1kR5j1l9j43K1K75j47o9K3q0L8R5Q7j53r0
$$ plain form
3914 -60 107 73 -95 23 80 32 41 120 60 -115 33 96 -12 -195 -36 53 -76 156 -77 -199 -24 -18 17 -239
3938 -239 81 -108 -68 -28 -1 -14 58 111 -19 15 16 17 86 11 -96 27 12 -38 41 -162 56 -76 -128 129 83 -113
3964 -113 71 137 -57 -90 142 -41 30 -44 15 12 -54 89 195 24 -43 9 -21 0 -168 -64 -197 3 -94 137
3988 137 -45 -19 46 54 84 -54 -55 7 -189 27 40 -28 5 -1 4 31 -105 96 46 13 -227 -287 6 13 68 -81 73
4015 73 -54 -18 -138 104 -43 202 -4 -19 34 8 96 -1 -130 -83 85 -6 15 -117 122 70 35 -92 -136 54
4039 54 20 -156 -40 -150 4 -110 -51 43 -86 91 119 -32 22 127 5 66 -33 -13 19 -138 86 131 -78 -37
4063 -37 55 -34 -59 -95 -160 33 -126 -65 -70 -55 -41 -138 -86 -10 63 29 -113 -127 92 -32 79 -99 79 -91 -84 65
4089 65 25 -187 -105 -100 27 -125 67 -48 73 50 102 -50 20 262 -243 -42 74 147 48 41 -63 -23 -89 43 46
$$ packed form
3914f0J67l4j68J18N7m8RP9o0j75J48O3j08j83J59Q9j29K32k33j22J75OL5k56
3938b39L20j89M0M0K7j3P2N3j30L4JJO9p5j07J23j5n0P9k03K18j32n2K57m6j96
3964a13J84O6j94l3K32j83P1p4N9lo6J43J06j71o7N2l0K1j68J04j33K00r7K31
3988A37j82K6O5QL0j38jO2j96K16J3o8L3oNK7j36K01n0l3k40o0K93PN5j49J54
4015G3j27L6j20K42j47K45k06j5N3k6Q8r7j29M7J68r1K1j32K39n2l5j27m4J90
4039E4l4j76J16j10J54j14N9R4j29J77K8j51N4J05j22O1r9K0L2j57K24M5k09M1
4063c7R2q9k5l6o5J93j59O1nJ5J4r7N2P6P3l4j42j4K19j24J11j78J78j70PJ49
4089F5m0k12Q2NJ27j52J92j15J21k3N2j52P0K42n05K01J16P3r9pj04M0o6J32L
$$ plain form
4114 46 -172 137 121 133 -21 98 43 -109 -55 73 -36 5 108 42 -104 -167 61 48 -29 93 -193 37 66 -7
4138 -7 77 69 -151 32 105 77 108 -92 -57 150 -92 47 8 -23 122 -31 48 -33 129 -120 -9 59 146 -110 68
4163 68 -17 -84 19 57 56 0 -6 -98 30 57 80 -56 -105 -75 128 148 45 -4 -2 -184 -75 0 55 -41 -3 82 56 38
4191 38 -168 59 160 -9 202 90 172 -50 78 -63 -132 -83 64 -158 -23 -28 -50 -1 -30 125 81 -22 -60 108
4215 108 76 -78 -143 49 -83 52 55 -48 145 -109 -64 77 -67 52 -4 -30 -21 -67 -21 65 63 69 38 -17 141 26
4241 26 110 -73 148 -25 -207 -53 48 46 -10 36 -24 127 -64 55 -19 -44 -1 28 90 -9 114 4 -86 44 54
4266 54 -23 46 48 99 -47 -18 37 -70 26 142 -15 55 -135 -129 69 190 -87 -98 -163 -70 -56 -103 18 36 110 -117
4292 -117 -126 -36 39 22 73 49 -18 -55 -68 116 70 43 -120 129 18 -178 27 -161 172 -105 -19 -97 -97 -16 -27 33
$$ packed form
4114D6k18L09j6J2j54J19n5j52N4J28j09M1J03o6j46o3K28j3p7J22k86K30K9p3
4138gQ4qk20J83P3k8L1k00L5K07k42J39l9l1J45j53P9q1J62k49J11O8Q7k56J78
4163F8q5o7J03L8jn6or2J28K7K3j36m9L0K03K0j03m9Kj82J09P5N5r6L8Q5k6j8
4191C8k06K27J01j69K11j12Q2k22J28j41o9M9J47k22J35nk2M9k9J55m4j03l8J68
4215A08l2j54o5J92j32J35Lj03J93k54M5J41j44J19n6k6Rm6M6Q6kOl1n5J58j15
4241B6Q4j83K21j73j82J54J01kn6M6o0J51j91J19p4k5M3K9O2r9J23j10r0J30J0
4266E4p7O9KN1j46K9N5j07R6J16j57P0j90OJ98J21k77j1o5R3J4m7J21J8P4k27
4292a17rR0P5j7N1k4o7l7j3J84m6k7j63K49j11j96K05j88L33k77Q6p8%Q1j1O0
$$ plain form
4318 33 106 -58 20 -117 43 -157 77 90 44 -4 -47 103 141 237 37 -58 138 23 94 -244 71 -36 9 37
4342 37 1 -121 34 85 36 44 -50 165 -52 42 124 -150 -87 61 -9 33 -94 36 -15 69 -63 -94 162 10 158
4367 158 219 40 198 -29 -73 10 -27 96 -136 -126 -39 -67 89 -47 -85 -79 239 44 221 145 114 -47 52 -9 -143
4392 -143 -95 -115 94 100 146 37 48 133 -97 -23 111 105 -40 7 -65 22 -80 -125 72 68 44 -98 -155 -182 83 -18
4418 -18 -42 -63 -58 71 140 89 55 23 -45 -54 16 -120 -69 142 -218 -18 48 -151 75 -54 59 53 0 93 44 134 27
4445 27 6 192 -66 -84 83 -37 -2 41 66 -71 6 167 15 -30 55 -167 10 -23 -72 67 -205 28 37 55 -152
4470 -152 -92 -26 7 95 -18 129 79 38 -24 -80 0 -102 1 -71 -96 6 -54 122 61 166 52 -25 -76 -22 -30 34
4496 34 -54 -177 -85 -159 1 92 63 10 27 -113 49 -62 50 99 -74 -123 -98 70 42 82 -119 -77 129 57 65 147
$$ packed form
4318C3P3j64P8j37J60k00K34J3m6m8m3J50L8R6k00r5J96j15P1l38L15j07M5K8
4342C7l6j22J55N1m9Qr4K15k17R4Q2k74O3J48p0M2j27J30n1Q4j32l1K56j52J48
4367A58O1j79J58k27m4Q3l7J23k32J0Q7k8J56j36l8OL18j95J77p6l1j61R9o1j34
4392a43M8k0K09OM6j09J1Q5k30P4J34oj45M7p2Q7j02m5J97mk4j42n7k7K65j01
4418a8k4k1NJ29O9n1l4l2o8rP0j36N1K11l60K00O6j99K26j29J13on3R3m9R0j07
4445B7k1J86k58j8J67j20L5M3K5j37P7J61j52m5Q5k22J77l3m9J39k72K33RJ8k07
4470a52O0O6L3Q8j13J47n0m1o2n6Q0j02J03p2k5J02o0J76o1J05j14p7n1N4qO4
4496C4q8j23R2p4J60R1k9n3J7j40J62j11J12M9j73m9K5J68k8M0k01M2K06p2QQ2
$$ plain form
4522 147 66 -3 -37 -60 122 44 90 98 -32 -74 98 -16 -20 -163 -48 -9 156 -126 -14 86 -61 -29 -32 -23 53 111
4548 111 206 63 50 -65 140 -118 110 -18 -49 -141 80 19 7 16 117 -93 -59 -2 -60 -3 -107 5 -45 5 -79
4573 -79 39 28 -82 -79 -67 205 -95 -46 -125 -135 23 28 -44 -32 81 -36 -12 111 -123 12 -147 -99 151 -80 104
4598 104 -134 -205 36 10 -57 116 11 -99 87 -85 -176 -44 124 8 -19 284 95 55 -107 19 134 -109
4620 -109 -99 126 -82 93 60 75 -21 -136 2 30 93 -38 -33 -40 -91 4 -63 -46 43 -141 -203 -89 -20 51 -16 -37 121
4647 121 -185 -60 37 59 46 4 88 -48 129 92 56 109 53 -8 7 -114 -17 156 80 -1 -123 -57 56 31 76 45
4673 45 127 44 -102 119 -32 -14 -233 48 37 -145 -82 -62 -51 -132 -51 -79 -14 -132 -58 30 -105 -2 -113 -60 -79
4698 -79 -149 49 -91 69 115 -69 120 -126 120 -11 106 -31 62 17 -58 60 -27 -100 35 70 -97 -89 30 114
$$ packed form
4522A47q1o9l4k3J82p8M6Qj30m2J72j14mj43J15L9J65k82J12J00j47L2lRP6N8
4548A11R5j43j3j15K05k58K28j28l1r2K21o1j2RJ01k10L4N7n8N7j04J12n0N0q4
4573g9J18j1j10LJ2K72l00M9p9j0J58Np2J2J13j17K4J23k34J35j59M8K50k31J84
4598A04k38p1K41k6o7J73j05j10J86j72r1J32J68j16k7L03j89m0j62J26J15k43
4620a09J0K25k08J75l3J5r6j15J38K8O3j31Npn1R5o7J7Q9j84o2J14O9P1o7k1J58
4647A21l06J25R7K2j3m2Q4j36J77l7l6N3n6o1J5j21R7J73p6q1j22O6J13k5M5l1
4673D5Q2q3j46K21j51J8k19K81j1j82O3K0J1q1Q1k8O5j18P4Q8j35J03j11N3j9
4698g9p0J98j40J60M6j84J89k46K46j31J17j37R3m5p5J18q7p3J35L5j67QJ19Q4
$$ plain form
4722 114 -21 -38 -59 -28 231 28 -67 13 -190 -28 -292 -14 133 -162 99 22 174 -29 126 -21 -207 21
4744 21 -35 62 -55 -136 -6 -67 73 -67 15 189 -2 35 -127 8 -9 65 43 -1 23 -7 164 22 -64 -119 95
4769 95 -94 -110 -14 -59 31 -54 -100 -75 -20 25 -48 8 16 -31 -54 50 -37 -122 -7 -41 -118 -269 -80 16 -30 -118 32 8
4797 8 -104 21 65 -109 -100 -128 132 114 74 -90 90 -43 -3 -20 -37 77 -98 77 43 75 -72 44 -18 -83 -34
4822 -34 -53 75 34 57 -50 143 1 65 -160 -25 80 24 -98 48 -52 177 -63 17 62 82 82 70 66 -138 29
4847 29 63 75 -133 15 -70 16 115 -75 26 118 -19 -57 86 56 -203 -16 55 -106 93 -41 -9 -85 24 -154
4871 -154 165 38 21 -97 55 -54 16 -26 52 84 10 50 -6 42 78 111 -126 -16 181 14 -19 -230 78 -20
4895 -20 24 65 25 -30 183 -105 17 -113 -37 -30 -20 -9 64 135 31 155 -37 84 15 -41 124 22 -16 68 59 -78
$$ packed form
4722A14j35j7k1L1K59k03r5Q0k03J62k64K78J47k95K61p7J52k03J55j47j86K28
4744B1n6R7j17q1J30o1J40j40Q2J74j91L7j62J35j7P4k2m4K4l0J71j42q6n5K14
4769I5j89j6R6m5R0q5m6K5N5M5p3N6Qm7k3J04q7q5J15l4p7j51J89R6m6q8J50k4
4797Hj12J25M4j74Rk8K60j8m0j64J80j33M0j7j7J14j75J75l4L2j47J16o2o5M9
4822c4j9J28m1K3j07J93j42O4k25J35J05n6j22J46j00K29k40Q0M5K0%j2mk04J67
4847B9L4J2k08J48q5Q6R9j90J01R2j37l8J43l0k59J87P1j61J99j34L2p6J09j78
4871a54L19j27j7j18J52j09P0m2P8L2p4M0n6M8L6L3k37J10J97j67l3k11L08r8
4895b0M4M1m0n5K13k88J22j30P6PJ0J1P3P1j04J24j92J21o9n6J65j02l8Q4rj37
$$ plain form
4921 -78 33 -24 18 208 -15 -130 -51 135 -13 -47 5 -26 -129 -71 -140 -67 -25 -25 61 -86 55 -139 -68 -60 109 -126
4947 -126 -166 -31 63 -100 -124 -37 -31 -41 -153 82 60 113 41 -51 9 -54 108 18 63 217 -36 73 50 -57 177
4972 177 85 -16 31 -85 -3 -56 53 -33 -110 -110 118 -157 -34 124 24 -168 -117 -34 -78 0 -183 -127 21 117 -173
4997 -173 -39 -201 28 213 -8 -44 35 -30 87 -123 47 -172 30 131 44 -95 127 39 62 123 61 20 71
5020 71 -227 6 63 -91 -218 29 -214 -159 21 -49 11 -48 121 130 -44 -48 33 100 3 -33 -83 -25 131 79 -41 -90
5046 -90 -26 -26 90 136 -111 64 55 -84 117 -190 100 141 -150 66 -71 87 29 -73 145 25 -99 -5 -59 100
5070 100 1 -38 119 -17 132 -68 131 -100 7 -59 -99 52 41 44 215 54 124 112 24 -53 -38 -204 -103 -15
5094 -15 28 -120 -164 -62 -148 74 -110 276 -144 -69 -79 -76 -17 -46 156 -125 -143 -90 -61 36 62 25 -98 -5 -160 16
$$ packed form
4921g8J11n7M2J90k23j15P9J86j48l4N2l1j03N8o9P3M2%Q6j47J41j94P1QJ69k35
4947a26m0J35R4j63k4Q7Oj0j12K35k2N3p2r2O0o3J62r0M5J54k53J09k3j07K34
4972A77r2j01M7j16Q2n3J09q6p7%K28k75J23J58j00j92N1Q3m4P8j83N6J48R6k90
4997a73J34j62K29J85k21l6P9o5J17k10J70k19K02J01q7j39K22q8K3O1o2m1N1
5020G1k98K33N7j54j27K47k43N5J80p0O0n9J69Rj74mQ1O7r7l6n0N8J56n2j20m9
5046i0O4%J16M6k47J75rj39K01l07K90M1k91K16j37J58n8j02K18j20j24R4n4J59
5070A00r9l9J57j36J49k00J99k31J07o6m0J51j1LJ71j61P0j2q8p7J5j66J01Q8
5094a5M3j48m4J02q6K22j84L86m20P5j0LN9k9K02k81j8N3K9R7K6l7j23R3j55J76
$$ plain form
5120 16 -6 -79 -140 35 -29 42 91 148 5 -104 -3 22 -49 -103 125 -91 50 -40 14 -14 27 -50 -57 -77 -165 2 -154
5147 -154 -25 23 -17 -129 47 64 -102 -101 91 65 -154 58 -5 -75 -6 210 -59 -155 8 136 -19 8 -187 30
5171 30 30 -43 29 -68 -222 -98 -97 -156 -9 -21 -80 41 105 -81 -84 -26 25 -208 -64 43 196 -135 55 14 -30 7
5197 7 -129 -196 -49 14 54 -57 157 66 -5 26 -149 94 -73 32 -21 -23 32 33 -65 -18 -7 16 -22 -85 20 -92 -125
5224 -125 173 -126 202 98 59 -69 -10 -37 12 102 -132 89 -129 99 194 0 152 22 -79 -43 -171 -165 16
5247 16 20 143 49 79 -8 -6 79 -50 -41 -163 -63 -29 93 -17 128 -93 -5 -75 -113 65 55 70 108 -7 14 -2 94
5274 94 79 62 -27 134 87 -106 91 -123 -91 -54 -225 -98 53 -87 -7 219 -36 -4 7 -141 154 45 102 81
5298 81 -82 -103 97 -19 96 67 -15 33 -92 -260 32 -6 118 63 -17 -120 -128 40 -13 -116 -161 93 31 35 -117
$$ packed form
5120A6k2p3o1J75o4P1M9N7j43j09J01K5p1n4K28k16J41r0N4k8M1p7pk0q8J67j56
5147a54J29M8m0j12J76J7j66JJ92k6k19K12o3p0O9K16k69r6J63J28j55K7j95K17
5171C0%p3P2r7j54J24Jn9J47j2n9J21O4j86lN8N1k33J44J07J53l31J90m1m4L7
5197Gj36o7J47O3M0j11K14r1p1L1j75K43j67J05n3kN5Jr8M7J1K3l8o3J05j12l3
5224a25K98k99L28j04l9j28N9k7M9R0k34K21k18K28R5j94J52j30j01L6j28OJ81
5247A6MJ23r4L0q7KQ5j29Rj22J00L4J22j10J45k21Q8p0l8J78j0J5L8j15K1j6R6
5274I4j5j7q9J61m7j93J97k14L2L7j71J27J51j40Q0K26k55L2J1j48K95j09N7k1
5298H1j63k1K00j16J15k9q2M8j25j68K92l8J24n5q0j03qJ68n3j03m5K54o2Mj52
$$ plain form
5323 -117 -77 86 38 -193 73 -23 -78 22 -54 -3 111 237 4 -73 106 -5 292 69 17 22 -37 54 -10 10 284
5348 284 -81 43 -40 -5 -129 74 70 -1 -3 -20 -35 -131 -2 -66 -37 -166 19 -35 -92 -56 216 60 -32 -22 64 59 -27
5375 -27 -131 34 -80 80 -233 -49 48 -89 -104 87 -76 40 3 32 33 158 -59 -134 -6 -96 -17 -71 -63 114
5399 114 138 51 31 -93 40 -10 81 -57 17 97 54 -1 -119 76 7 3 -40 6 113 -39 67 -100 -33 108 -96
5424 -96 21 105 -19 29 -103 4 -260 -4 52 -25 143 -68 37 -98 43 63 -8 -7 -143 70 96 17 -32 143
5448 143 150 77 4 -27 -2 137 153 -3 33 9 99 -118 103 208 -43 48 146 38 -176 69 98 -50 -55 -19 -7 123
5474 123 25 -116 82 -83 -67 26 -40 -72 -87 -79 32 75 4 174 -49 -52 53 14 -4 40 -125 101 93 -92 25 39
5500 39 -35 -63 -47 -74 -22 53 -14 130 101 -32 -87 41 -10 -117 -10 59 43 -80 -21 -126 -50 -131 -16 19 41 82
$$ packed form
5323a17M0J63m8k31K66r6n5J00p6N1J14J26k33p7J79j11K97k23n2Nn9R1o4K0K74
5348B84l65J24q3L5j24K03mp1kj7j5r6J29o4K9j29J85n4n7L6K72j56r2J0Q6nq6
5375b7j04J65j14J60l13J84R7j37j5J91j63J16l7K9JJ25k17p5J28r0P9n4QJ77
5399A14K4q7k0j24J33n0R1j38P4Q0m3n5j18J95o9mm3M6J07j52J06j67O7J41k04
5424i6J17Q4j24M8j32J07k64K56N6p7J68k11J05j35J41K0p1Jj36K13K6p9m9J75
5448A43Pp3p3l1K5J39J6j56L6k4R0k17K21J05k51R1R8j08k14K45K9j48nL6J2J30
5474A23r8j41J98j65J6R3o6l2j5QJ11M3p1J70k23lJ05l9j8M4j65K26qj85J17J4
5500C9p4k8J6k7N2P5o7J44k9j33n5J28n1j07J07O9j6j23N9j05P6q1J15L5K2M1
$$ plain form
5526 82 -59 49 71 103 124 -82 -72 -24 205 73 -8 -53 -129 -11 91 32 -95 251 76 94 -10 -52 -108 112
5550 112 -23 -74 -80 -93 -4 -31 111 19 -44 -111 79 -49 -65 -1 -13 -65 -71 -99 -41 84 -201 -11 89 -36 27 92
5576 92 -45 75 -93 -52 -4 -28 -145 120 44 25 155 168 -126 62 109 -9 129 -49 -69 66 -90 0 115
5599 115 -108 -71 -43 11 -4 182 -15 -192 -57 -11 -22 -215 -161 -23 82 -26 41 7 -76 105 36 -50 123 -112
5623 -112 81 109 7 36 11 -25 82 -109 11 24 221 48 -50 -37 -50 -12 -145 13 -77 -180 -39 23 -173 -4
5647 -4 -124 122 13 19 -36 -176 -74 32 12 99 24 -10 -30 24 -30 70 -216 180 19 -43 -16 90 -111 -37 -16
5672 -16 -206 -37 -21 -235 25 -116 -76 -59 -76 49 -50 -20 44 5 -70 67 8 -3 191 2 -86 -83 18 9 51 -117
5698 -117 93 55 122 38 75 -76 -189 2 11 177 201 -16 25 37 31 -174 -7 46 149 -49 -15 -7 -130 33 43
$$ packed form
5526H2j41J08K2L2K1k06J0M8K29j32q1m5p6J18J02n9j27L46j75J8j04m2n6K20
5550A12j35n1oj3Q9k7J42r2o3o7J90j28j6O4j2n2ok8N8J25k85J90J00j25O3O5
5576I2j37J20j68M1M8k4j17K65p6j9J30J3k94J88M7j18J38j78k0J35j56R0J15
5599A15k23L7K8N4j5J86j97j77J35M6j1j93N4J38J05j08O7l4q3J81o9q6J73k35
5623a12J93K8j02K9k5l6J07j91J20J3J97j73r8J3j3L8j33J58r0j03J41O2j96J69
5647dj20K46j09On5j40J02J06k0Q7p5l4k0N4n4J00k86L96j61o2K7J06k01P4K1
5672a6j90J69J6k14K60j41M0J7j7J25r9L0O4l9p5J37n9j1J94j89q8LJ01rM2j68
5698a17K10l8O7q4L7j51j13J91RJ66K4k17M1J2ok05J67N3J03j98L4Qj23J63J0
$$ plain form
5723 43 -24 -37 -299 -55 -33 4 27 28 168 -75 -61 -21 81 35 -62 1 29 -92 -22 -16 86 -85 -68 -97 -83 134 69
5750 69 -1 -49 103 -133 -15 182 -127 241 -78 -28 -74 -66 172 -43 136 71 -172 50 55 4 -157 59 -21 69
5774 69 -104 94 95 94 102 20 30 -187 -147 23 -106 -38 75 -163 -180 -67 17 -1 -80 184 25 -46 65 32 -68 146
5800 146 63 273 35 38 50 80 89 2 33 22 187 -57 -109 -56 58 -130 -57 -56 -204 151 55 29 16 -24 169 -123
5826 -123 -191 18 263 -59 -64 21 154 -57 10 93 151 31 -42 281 13 -10 -53 13 -17 -42 -48 102 -48 133 139 -42
5852 -42 3 -40 59 17 80 96 112 92 -13 81 -215 -223 45 49 86 104 85 -9 12 -80 -180 -119 -90 67 -9 77 -21 -207
5880 -207 -27 -165 -20 -117 50 26 0 -132 112 -64 -38 178 -55 31 -113 -29 -136 48 70 -123 -195 -59 -99
5903 -99 -112 82 -124 90 -112 -73 99 -115 -34 -59 93 -17 2 -220 68 -122 -46 22 35 -76 99 42 -46 -153
$$ packed form
5723D3o7j3k62K44K2L7K3JJ40k43J4M0J02m6r7O3K8j21P0OJ02j71J7k9J4K17o5
5750F9p0m8J52k36J18J97l09L68l19N0m6QK38k15J79o5k43K22Nn1j61K16q0R0
5774F9j73J98JjQq2J0k17M0J70j29O8J13k38j7J13Q4j8p9K64j59p1J11l3j00K14
5800A46q3K10k38LJ2L0Rq7L1j1J65k44n2N3J14j88P3Jj48L55r6k6j3m0J93k92
5826a23o8K09K45l22nQ5J33k11O7Q3N8j20p3L23k68k3m3O6l0k5oJ50j50J81Oj81
5852d2M5m3R9m2O3J6J6k0j05R4k96qK68ML7J8j9r4K1r2j00O1K9J57p6Q6r8j86
5880b07J80j38J45r7J67k4k6j32K44j76K6K16k33Q6j44Q4j07J84K2j93p2J36m0
5903i9j3J94k06K14k02L9J72k14Q1k5J52j10J9k22K88j90P6O8J3j11J75n7q8j07
$$ plain form
5927 -153 29 86 84 173 45 20 -27 26 -17 75 -148 89 -80 -74 -50 15 21 65 -171 23 -11 149 -132 -115 -198 -196 69
5954 69 85 176 53 127 -50 -42 42 -184 83 -5 3 5 -90 -32 11 71 -8 3 93 124 -48 -116 -6 -105 -128 -100 15 -65
5982 -65 19 -46 107 71 -59 -100 78 -40 -42 20 39 8 0 199 51 83 -189 43 134 63 33 159 -50 73 39 -101
6008 -101 -41 4 -24 177 58 126 28 -75 -141 -144 53 -96 -234 -17 -146 8 -85 50 -77 11 -85 -43 38 -6 -83
6033 -83 125 153 68 106 -21 -143 -37 24 -127 39 87 144 126 0 55 31 29 78 -36 111 -15 -87 49 36 -95
6058 -95 -41 16 -31 59 -4 -23 38 61 -109 0 -117 14 -87 199 87 35 -40 -270 -60 -23 -197 28 6 -1 -11
6083 -11 79 103 121 94 102 84 -49 -60 29 -33 -20 40 49 -168 92 73 -93 26 -17 68 50 96 5 -110 -19 -79 11 -15
6111 -15 55 -98 -37 119 -69 -123 159 98 -23 -86 5 -108 49 -139 233 -34 234 -58 -89 121 -54 120 -42
$$ packed form
5927a53J82N7kQ9j28k5m7N3m3R2k23K37j69OK4O5OM4k36J94l4J60k81J7q3KK65
5954F9J6R1j23P4j77QQ4k26K67q8QKr5N8M3O0p9J1R0L1j72o8J10r9k3K8J15q0
5982f5Q4o5J53l6j30m1J78j18kO2J9l1qJ99j48L2k72K32R1p1l0J26k09J23l4j40
6008a01O0M5k8K01j19O8r8j03o6lJ97j49j38K17j29J54r3J35j27Q8r6M2Q1m4p7
6033h3K08K8q5L8j27j22J06O1j51J66M8N7j8j26N5k4kM9j14J47j26p2J36j3j31
6058i5N4N7m7R0o3j9O1K3j70J09j17J31j01K86j12n2p5k30K10L7j74K25k2pj0
6083a1R0K4J8k7Qj8j33j1Q9o2J3O0Rk17K60j9j66J19m3Q5j8M6r1j15R1o0R0k6
6111a5P0j53O1J56j88n4K82o1j21o3R1j13J57j88L72k67K68k92l1K10j75J74j62
$$ plain form
6134 -42 -103 27 -15 -228 -72 16 60 1 144 -267 24 -78 -50 14 78 -43 -138 -60 -9 154 -88 55 -90 143
6158 143 -29 -198 39 -81 -144 20 211 10 24 -105 -108 130 18 -52 -82 54 49 49 -105 29 43 -109 -85 -100
6182 -100 66 -128 26 -15 -7 -13 -75 84 -15 125 -43 -115 -3 175 179 -116 61 -78 -151 -162 -101 -42 32 -26 72 56
6208 56 -24 40 -94 13 -15 80 20 44 -30 2 -33 55 -30 68 9 48 17 -13 -57 -47 -9 77 175 26 -13 -48 -49 16 38
6237 38 133 17 -147 31 -48 69 -87 49 -32 26 -12 -35 -105 -67 -9 -26 -157 -84 73 29 8 253 -111 -53 -24
6262 -24 106 -155 -59 31 -28 -141 -195 97 12 46 -60 2 68 141 -115 35 -103 -47 -35 -33 -87 -107 -170 156 7 93
6288 93 234 -2 94 -31 -77 93 -257 46 15 68 55 -5 -4 -55 9 45 -22 72 64 -45 201 -64 42 -37 40 -135
6314 -135 -83 86 -72 15 150 44 129 30 -36 -84 -6 86 -33 64 -127 -77 -41 -99 -18 -185 14 54 52 110 -136 -91
$$ packed form
6134d2o1J30m2k13J56Q8M4n9J43m11K91j02K8O4O4j21r5P8N1J63k42J43j45K33
6158A43j72j69K37j20o3J64J91k01J4j29lK38j12p0l0J36n%j54J34J4j52K4j5
6182a00J66j94J54m1Qoo2J59r9J40j68p2J12J78Mk95J77j39p3j1O1N9P4n8R8j6
6208E6q0O4j34J07k8R5o0K4p4L2l5Q8q5R8n9L9l1l0m4J0L8Q6R8j49l9l5jO5K2
6237C8R5j16j64J78p9J17j56J36q1N8l8k3p0L8N8j7j31P3J57m4k1K45l64N8K9
6262b4J30k61R6R0n9j13n4K92q5L4j06O2O6P3k56J50j38N6J2Kn4k0o3L26j49Q6
6288I3J41k36R6j25m6J70l50L03l1N3j3o0Jn1O4L6o7R4qj09K46k65J06p9P7j75
6314a35N2J69j58Q7J35j06Q5r9o6m8P8R2j19R7j91N0L6n8Q1j67J99M0kN8k46M5
$$ plain form
6340 -91 113 -34 -33 26 -5 -208 28 1 -71 -34 123 -137 -57 40 -26 -94 6 -70 67 -9 -131 20 -7 114 -111
6365 -111 1 -37 -143 46 -47 26 125 98 27 -116 55 45 59 42 89 -222 -240 226 55 177 104 136 -57 170
6389 170 131 -57 84 -8 -24 -183 -21 -39 8 15 -87 4 -57 92 13 32 -105 36 117 -42 -41 -22 -10 -191 -62
6414 -62 -6 -28 -105 142 132 75 48 139 54 64 -11 108 -222 -25 -106 87 -56 71 -70 54 -63 25 26 66 -88
6439 -88 -62 -15 -132 -144 48 80 -205 24 -67 -140 164 54 -121 -67 30 -43 -25 -5 180 88 23 98 12 183 -106
6464 -106 -143 18 40 -11 86 -122 -21 53 -136 -72 -36 -219 173 -15 -117 -88 77 122 -66 -96 16 -128 -105 58
6488 58 -106 59 -131 -88 -41 -18 -215 27 45 -2 -291 81 -2 -6 -34 121 -35 -135 71 60 -103 62 66 -62
6512 -62 33 -101 -98 -9 -281 -36 90 -24 -16 35 -38 -123 -4 -6 20 -18 -48 136 -16 4 -18 63 -71 -32 -66 81 -62
$$ packed form
6340i1K04j47JN9l1k03K36k7p2L7J57k60Q0R7o6o8J00p6J37p6j22J51k7J21k25
6365a11J12l8j06J89r3P3R9k7p1j43J71j0J4j7M7l11j8M66j71J22p3L2j93K27
6389A70l9j88J41r2j6j59J62j8M7Pj02R1o1J49p9J9j37J41Q1j59JJ9J2j81J29
6414f2N6k2p7K47j0n7k7R1q5J0p5J19l30J97q1J93j43J27j41J24j17Q8JM0j54
6439h8K6M7j17j2J92L2k85K29r1p3L04j10j75N4R7p3J8K0J85r2o5P5q6J71k89
6464a06l7J61K2n1R7k08J01P4j89O4L6j83L92j88j02K9J65M5j88l0J12j44K3J63
6488E8j64J65j90M3M7K3j97K42J8m7k89L72q3mk8J55j56j00K06j1j63J65Mj28
6512f2R5j34LQ9k72K45J26j14QN1p3q5J19kK6l8l0J84j52K0k2Q1j34L9l4J47j43
$$ plain form
6539 -62 -68 -16 67 119 91 177 -60 -11 7 95 -52 173 22 -36 208 8 -27 -38 61 -76 70 -35 12 60 -120 64
6565 64 -107 126 -130 123 -48 -46 29 78 124 -16 -111 156 59 -16 15 -167 53 13 -48 -109 -43 -49 -198 -46 56
6590 56 -43 -69 -26 125 31 19 158 -106 -71 15 -49 -17 -19 -39 -1 82 48 9 -49 31 10 -36 -109 29 29 65 -4 -71 -62 -111
6620 -111 -72 40 -127 -139 -125 -173 -53 -18 -132 -58 -53 -142 -110 78 -50 70 87 -117 2 -90 -201 100 -126 -1
6644 -1 37 -73 100 57 -42 -142 -62 11 19 -43 90 116 -99 -47 -98 145 67 13 2 -84 -90 -185 -80 69 2 11 -47 -119
6672 -119 7 86 -11 -126 -115 -40 -121 -104 25 -95 117 -36 68 -127 26 -5 -29 48 -15 -58 -26 -30 23 59 -56
6697 -56 -86 -88 117 -95 84 -59 83 4 -35 -222 -61 -6 -132 206 -119 -139 203 -42 -100 149 68 50 -17 2
6721 2 146 -21 120 -2 -58 -69 -258 -178 -22 -200 -6 -48 9 2 -56 -20 -124 -20 -36 67 -38 109 -136 -9
$$ packed form
6539f2oN2Q3N2k8Q6k37M9J8Q8j47K25j51n8K44k00l5j1R9j37J46j05M7M8j80J84
6565F4j71K33k56K53j71KP5M9M6j40r5K67r7p5L1j82K20m0o1o1O6oj49J52J02
6590E6r9k6M3J51r4j2J39k64L5Q6o4L2kk0L8Q3l4l9n8Q0k1m6p3J38%L6o9o7Rm9
6620a11L9J12j67j2J4m8J20L5j14P4Nq9L2J88j28J20J7k04J19r2j11L01k26J25
6644aL8j10J73m3r9j00Q0P3Qo2J33K6k15N2n1K43p8n4j1q6or5J05J49o7Rn8p2
6672a19J26P9r7j15J1P5q1J7J29j20K12j53J04j95J53l1k4P7o3m3L2mN3L6j15
6697e6l0kK05k12J79j43J42p9l9j87J61N5j26L38l25k0L42k45n8K49q1j8o7J9
6721BJ44j67J41j22n6j1j89Q0J56j78J94m2N7pn8L6j04J04j6J03j05J47k45J27
$$ plain form
6745 -9 65 -9 126 -177 29 -90 -47 -57 70 78 -63 -88 -74 86 127 151 181 60 0 98 41 -103 71 86 91 159 -31
6772 -31 41 -97 -98 46 157 -74 109 -3 -180 -23 -108 -8 -118 89 24 -11 -62 24 -43 110 272 -33 21 28
6796 28 57 116 0 -90 42 37 -96 130 127 -17 -62 -44 -88 -67 -30 -94 112 97 -55 144 158 72 231 65 -64 -152
6822 -152 13 7 9 124 129 -50 8 1 -119 1 125 69 -18 50 -165 -80 -78 -23 13 -152 -77 78 108 -53 0 11 82
6849 82 -134 -37 47 57 -48 53 -22 -103 9 182 57 -337 60 41 -20 -125 32 -23 -4 -38 74 42 46 117 -106
6874 -106 -144 -223 -80 -91 -46 86 -59 29 34 28 124 -238 -57 70 90 -48 -35 63 104 123 -167 19 -8 -82 68 -65
6900 -65 -15 15 50 8 33 -47 92 12 -73 103 -102 25 71 -81 16 -38 -206 68 -62 236 65 -98 83 -25
6924 -25 -22 -10 101 10 -2 -135 -17 75 18 53 -69 72 23 -67 -11 -119 137 116 88 -38 -160 -56 24 52 21 -110
$$ packed form
6745iP4p4J35l03K06j19M3j0J27Qj41k5J4J60M1K4L0j21o0R8n7j44J74J5NO8j90
6772c1P2j38jJ44J11k31J83j12j77J57q5J00j10K07o5l5n1Q6o7J53J62l05N4P
6796B8K9N9j16r0J32nj33K26lj44m5J8m4K1L7o4K06j5j52J99J4q6J59j66j29q8
6822a52J65oKJ15Nj79N8pj20J20J24n6q7O8k15Q5KN5L6j65P5J55L0j61N3J1P1
6849H2k16R7Q4J0j05J01p5q1J12J73j25l94L97j9o1j05J57n5J9l4J12l2MP1k23
6874a06l8p9J43j1M5J32j45Q8NoR6l62J81J27K0j38J3R8M1J9k90J86k7p4J50j33
6900f5N0L0L5m2K5q0J39q0q5J76k05J27M6j52R7n4j68K74j30K98j71j63J81j08
6924b5LJ2J11r1j2j33J18R2n7L5j22J41m9r0N6j08K56k1k8j26j22J04Q0K8l1j31
$$ plain form
6950 -110 -33 83 49 12 15 74 -14 -66 -162 15 -22 13 -7 -66 62 50 -36 35 54 -25 -3 -54 118 64 -79 28 -111
6977 -111 -23 51 100 32 -79 41 -67 -106 -90 35 -70 -77 40 63 167 -173 -25 -105 -11 54 18 -75 19 19 -46 69
7003 69 41 12 79 29 -48 8 10 176 -130 -54 -154 44 -119 -28 67 -81 -130 117 13 -40 225 79 40 -107 15
7028 15 -193 -104 -71 -29 45 -185 44 46 -5 -18 53 110 132 -14 0 -44 -148 -38 -17 202 72 103 192 90 -38 -10
7054 -10 -29 200 -82 47 17 46 79 -12 25 -147 28 110 37 15 -137 -55 24 -28 -107 33 41 41 73 60 202 -85 54
7081 54 -81 -31 112 -72 170 -17 -23 -21 83 -54 -30 -92 -69 36 124 98 -124 -48 -96 141 -157 -41 25 97 -11
7106 -11 -140 94 -83 -50 69 -12 121 82 -152 173 -14 -46 180 72 -50 43 -65 -162 -29 193 90 -108
7128 -108 69 8 212 54 118 -57 27 57 58 63 101 -3 14 18 -57 -94 -167 -109 -37 40 -184 69 45 -89 107 107 -138
$$ packed form
6950a10P7J16l4l7LN9q8n2r6J77l7L5k0n9J28j2q6P1J9p9K2n1J72n4j43J07j39
6977a11Q8P4M9o8j11J20j08l9J6J25j05pJ17K3J04l40J48q0R4O5l6r3R4%o5J15
7003F9k8k9O7n0p7N6KJ66l06P6j00J98j63R1R5j48m9K47j04n3K65j46l9j47J22
7028A5k08Q9L3M2P4k30K29Kn1j3P1N7K2j46J4m4j04J10K1K19j30L1Q9j02j28K8
7054a0j9K29k82J29l0K9L3r1L7j72J75Q2p3k2j52Q2P9n2p9J40Q%L2j3J42k87J39
7081E4j35N0J43j84K42j87oKJ04j37K4o2K3J05Q8k6k22P6m8K37k98J16O6P2j08
7106a1j29K34j77L3J19q1J33l9k34L25j87l2K26j08j22R3j08r7J33K22j03j98
7128a08J77o1K04j58O4j75Q4L0JNL8j04J7Mp5l7p3N8P2P7k24K53k4j34J96%k45
$$ plain form
7155 -138 171 -87 -32 102 179 -84 -167 -80 64 15 -71 -155 2 -56 58 65 -75 -52 -12 103 104 -128 92 155 28
7180 28 -142 41 123 44 -72 11 71 -151 23 -58 6 118 -119 -101 46 -47 7 94 -27 132 35 -150 147 -154
7204 -154 66 -48 73 66 -17 33 0 151 -6 -105 1 43 -112 150 -19 -19 68 -61 -20 -84 142 110 -121 65
7228 65 -103 66 22 -31 125 -19 -20 49 48 54 101 -22 92 -80 -28 51 -72 19 -77 -11 38 -145 -7 95 -23 43
7254 43 -3 -121 -122 -188 -52 60 55 23 -30 -29 -12 -40 -36 71 -172 -37 -16 -32 5 -61 63 -3 68 -55 -67 100 -67
7281 -67 18 23 -56 -38 -83 -107 110 -173 142 -72 8 -13 97 -94 109 -25 131 -45 -85 -26 81 -6 -32 14 29
7306 29 84 72 -169 37 72 -151 -106 99 12 -111 -73 -28 -84 137 0 -221 9 -34 -12 46 150 -36 -117 73
7330 73 33 38 -36 205 51 55 -166 -120 -67 126 -177 85 38 126 17 -21 85 -25 25 71 91 -20 60 83 -6 63
$$ packed form
7155a38L09k58N5J34P7k63q3Q7J44m9q6q4J57n8J14Pj40K3M0J15Jk32K20O3j27
7180B8j70J83Q2p9j16Q3O0k22J74q1O4J12k37J8J47r3N4Q7j21J59r7j85K97l01
7204a54K20j14J21pq3N0l3J51j57r9J06M2j55K62j69%Q7j29M1o4K26l2k31J86
7228F5j68J69m4n3J56j44jO9jOM7j23J14j72N2P9j23R1r6O6M9j83J38J02j18O6
7254D3m6j18jo6J36J12nl2n3JJ7k8MJ07k43J35K1j6L7o6J24o6P1j23j2J67j67
7281f7Q5Np9J8m5k4K17k83L15k14Q0k1J10j91K03j34J56j76m0N9J07q7k6M6J5
7306B9N5j2k41K06L5k23M5K05q7j23L8M5n6K21j37k21K30m3K2N8J04j86q1J90
7330G3m0Np4K41j54Mk21M6N3J93l03K62m7Q8j09l8J06j10N0M6K0j11Q0K3q9O9
$$ plain form
7356 63 142 44 103 37 43 16 20 30 -70 -64 -88 1 186 74 84 -32 -135 -147 6 -4 -244 5 6 158 37 -12 3
7383 3 108 58 -79 -46 -23 -57 -18 1 62 11 46 -70 47 -17 118 64 -272 -55 -42 64 -91 173 -155 99 68
7408 68 52 38 19 -80 -120 98 98 -14 30 11 -14 -4 34 -43 -54 -56 141 73 -26 83 -101 23 84 -146 68 -11 -56
7435 -56 -101 176 -36 43 67 -63 -10 19 145 -88 97 -105 6 -70 42 46 -68 51 78 -142 -2 -101 59 194
7459 194 179 -16 -108 103 86 151 131 -32 30 -29 71 -20 12 -11 -40 34 -18 123 89 46 125 161 77 -38 -33 40 -190
7486 -190 11 -55 189 -12 54 -45 109 -33 -142 84 -117 105 146 36 -8 6 92 37 -29 -111 14 -24 -58 101
7510 101 -94 -18 -64 -60 -157 -46 -31 124 9 -52 8 -7 -119 11 58 -59 97 -54 -176 35 53 -17 199 -60
7534 -60 -7 -12 -21 60 -19 147 -29 165 89 -66 77 -23 -44 -92 -36 -66 37 -108 4 94 -161 -71 -74 -28 -3 -89 15
$$ packed form
7356F3P9r8N9o6Ok7MJ0j00Ok4Q9J85j12J0j16j03j2J53j0k40K49JJ52j21m9J5
7383CJ05n0j37L3K3l4L9J9O1n1L5j16J17o4J35n4l36K17J3J06j55K64l28K54l1
7408F8j6j4j9r9m0K18%j12M4j9k5J0L8p7j1kJ97o8r9J09j84J24O1k30K14p9m5
7435e6m5K77k12P9K4j30N3K9J26k33J85k02J11p6J12Mj14J19K7k20J40r9J60J35
7459A94j5j95r2K11j7O5k0j63O2n9J00r1L2k3k9P4n2J41l4m3P9L6q4j15NP3k30
7486a90K01o6K44k01O6r9J54j42j09K26k01K22M1j10m4J4Q6n5o6q2J25l8l4J59
7510A01j95P6m6Mr7J11J5J55j15o1O0j5j12J30M7j17J56j51j22K11J8p0K16k59
7534f0N3nrQ1p9J66j76J94p6j55J43j00k1m8N6l0J03j45J12R0k55R0lM6K5q6J04
$$ plain form
7561 15 20 -33 -76 28 -9 -100 -185 161 67 1 -38 10 80 -138 88 -42 -11 37 11 -78 -88 -107 -31 46 -157 -73 -47 79
7589 79 52 44 -49 111 -51 -239 -35 29 95 65 -121 45 39 46 -10 110 -58 -3 111 -17 -44 62 -55 74 19
7614 19 -61 2 73 29 97 -19 42 37 51 -67 156 262 131 -4 -69 -30 18 -85 -36 43 -123 -62 57 77 116 -180
7640 -180 85 141 -161 20 -42 75 55 109 -1 8 86 -59 109 25 53 55 -40 72 110 27 77 -55 -36 66 23 49
7666 49 -12 47 20 -93 -126 170 90 -20 -11 163 -175 93 -95 0 66 1 194 -19 -37 154 7 -1 143 -107 42
7691 42 -43 -31 -44 -75 38 -12 117 32 76 128 5 85 134 9 79 27 -115 193 41 137 5 126 73 2 -135
7716 -135 -72 -24 -52 214 46 -9 -31 -162 -172 -12 -20 -12 43 22 -80 15 82 0 -88 -18 126 -17 92 102 -66 -59 26
7743 26 -21 -39 -126 209 118 -142 57 105 -75 11 -56 137 114 32 57 -8 68 140 65 93 -129 -144 13 34 -17 -164
$$ packed form
7561A5Nn3m3J04l7r1q5L46r4o6l9M8P0k18K26j30L1M8k6q9j0j9P6P7k03Q4K6J26
7589G9k7qr3J60j62j88K04O4O6l0j86J66oPn6J20j68N5J14j28k7J06j17J29n5
7614A9q0O3P1m4O8j16O1nJ4j18K23J06j31j35o5L9M8j03M9P9j66O1J19K0L9k96
7640a80K65N6l02J81o2J17k0N4j10RP8j45J68q4K8Kr5J12L8q3N0j32J9J02m3K6
7666D9o1N9k7j13l3K96q0j10RJ74l38K68j88R5O6o5J93k13j8J91j47qJ44k50J49
7691D2q5J2j3l1J13n0J29q5M4N2j23Q0M9j25P0n2j42L08j52R6j32J21n3p1j37
7716a35O3M8k8K66j68n5k2j31j0J60qQN5k1j02R5O7q2q8P0J44j43J09J0j68PQ5
7743B6m7j8q7L35r1k60J99M8j80Q6o7J93k3q2K5o5P6P2p5K8k22j5J57K1n1j47
$$ plain form
7769 -164 32 -14 119 5 -120 -164 -21 64 57 112 92 -100 2 -36 -98 -111 55 101 189 -59 -82 25 -69 88 -72
7794 -72 154 111 -30 -43 125 31 -148 -11 -64 -65 91 -100 47 -33 -153 -87 33 -109 42 4 -148 32 -68
7817 -68 41 79 193 37 224 37 -2 -22 -104 -113 -6 29 21 107 -10 31 134 -120 51 -62 36 64 -5 -109 -43
7842 -43 26 55 -134 -164 -33 -31 138 -25 -114 52 -5 11 -121 -70 -40 139 29 -43 -45 -230 -7 -105 26 -18 -72 -24
7868 -24 136 -77 -278 -225 -79 79 -11 -18 78 91 61 198 49 -34 84 126 -26 1 210 51 -88 48 -54 177
7892 177 -114 116 -44 -115 91 14 90 80 25 95 11 221 233 -227 51 220 -109 100 116 -68 -66 -26 8 155
7916 155 -83 46 89 93 -8 -96 -59 -46 -169 56 -119 -33 63 -60 -166 -20 3 49 1 -8 2 -99 -67 -100 4
7941 4 151 42 -18 -45 -51 61 -20 135 45 -13 76 -4 13 75 -105 -71 3 16 -61 -5 51 -31 47 -14 -91 -76 -17 53 -227
$$ packed form
7769a64J96m6J33j14j25m4J43Q5pN5k0j92J02l8o2j3J66M6Q8k48k3J07r4J57j60
7794g2K26m3j41j3J68r4j79J37n3jJ56j91J47q0j20O6J20j42J51l8j52J80j00
7817f8J09L8J14j56J87j87l9k0q2rJ07L5qQ6j17M1J03k54J71j13R8K8o9j04O6
7842d3O9K9j89l0J31KJ69j63q9J66n7J6j32N1L0J79j10p2kj85K23r8J31m4n4M8
7868b4J60k13k01N3J46J58r0pR6J3l0J37j49q3J18M2j52K7K09j59j39J36j02K31
7892A77k91K30j60p1K06p7P6j0n5P0q4K10J2m60K78J69l29K09J6j84KM0L4J47
7916A55k38J29M3Mj01q8L7J3j23K25j75Q6R6j23j06J46K3M6m8rJ0j01L2l3J04
7941DJ47j09o0k7oJ12q1J55r0n8Q9q0J7O2j80L4P4J3p7N6N6q2P8o1p7J5N9P0k80
$$ plain form
7970 -227 5 79 178 40 -3 -149 -45 25 -16 143 102 -53 77 61 -29 139 -9 -67 2 -14 30 -53 76 -69
7994 -69 135 2 116 5 -3 -69 73 -18 85 18 16 148 -34 108 -98 93 163 38 51 -3 -12 -86 -21 -57 -167
8019 -167 27 -189 -50 -174 -7 96 179 18 75 41 7 175 119 279 33 -117 -97 -16 49 -79 162 -19 -107
8042 -107 103 -102 8 -138 29 112 129 -152 -62 -92 -47 -76 -13 156 4 -150 -141 -145 -160 49 39 74 -117 -24 -25 144
8068 144 198 5 159 -24 -137 -38 60 -90 -68 -153 -69 182 69 -19 -68 151 68 -49 39 -20 -256 2 -7 -118
8092 -118 85 26 -2 58 -7 0 -25 -118 -61 -88 90 1 -87 68 49 124 -69 -79 150 112 -96 87 37 -143 58 -66
8118 -66 113 -80 37 160 -54 -44 172 -87 -56 -48 -42 73 -105 -234 129 -25 43 -7 -32 56 30 192 -2 16
8142 16 52 -110 98 8 52 56 -144 21 46 22 -97 68 -42 191 -2 -27 -88 -83 -71 -24 -206 48 -13 5 29 83
$$ packed form
7970b27K32P4R9j38m3j46J04P0m1J59m1j55J30j6r0J68j48n8O9j6M4q3J29j45
7994f9K04j33J14j11qo6J42r1J03o7kJ32j82J42k06J91P0j25J3n4rp4O5l6j10
8019a67J94k16J39j24J67J03Q3j61N7l4l4J68n6J60k46j50K0Q1O5j28K41j81q8
8042a07K10k05J10j46J67Q3J7k81R0l0M5k9O3J69j52j54Rmj5K09j0L5j91R3jJ69
8068A44N4j93J54j83j13R9R8j50K2q5Q4K51j13q8m9K19q3j17Q8n9k36K58rj11
8092a18K03n9k8O0o5Pk5r3N7k7J78q9q8J55j9P5j93j0K29l8k08J83n0j80K01j24
8118f6J79j93J17J23k14J0K16k59L1QOJ15j78j29L63j54O8n0k5Q8k6J62j94J8
8142A6L6j62K08r0M4Mk00J65K5k4j19J65j10K33j93k5o1NJ2M7j82K54o1J8K4N4
$$ plain form
8168 83 0 10 -180 45 20 9 -2 77 19 -105 -48 -55 53 -20 -128 -120 50 -48 74 28 92 -117 103
$$ packed form
8168H3q3J0j90K25k5j1j1P9n8j24N7pJ08p3j08QJ70r8J22m6O4k09K20
8191A03
$$ Imaginary data points
##PAGE= N=2
##DATA TABLE= (X++(I..I)), XYDATA
$$ plain form
0 0 0 0 0 0 0 0 0 -8 8 -8 8 -16 24 -24 32 -40 49 -64 77 -93 113 -137 161 -187 220 -259 300 -348 402 -464
30 -464 531 -603 686 -779 881 -993 1116 -1251 1399 -1561 1740 -1933 2145 -2377 2629 -2905
46 -2905 3206 -3535 3898 -4292 4727 -5205 5736 -6326 6985 -7725 8562 -9523 10633 -11932
60 -11932 13480 -15357 17695 -20692 24687 -30318 38893 -53684 86342 -307144 261403 342211
72 342211 -362431 191761 60512 -55414 -292374 118758 313270 -191025 -56726 88064
82 88064 -14955 -136284 -13671 358365 -228376 -171526 248672 -60620 -67508 -5364 122753
93 122753 -9733 -254975 241343 124703 -278925 10829 186889 -96200 -120274 235832
103 235832 11066 -248841 39997 120984 18223 -103811 85914 94606 -274731 21257
$$ packed form
0@%%%%%%%qJ6j6J6k4M0m8N6p2Q9j13J41j70K06k50K98l48M07m79N59o48P50q66
30d64R95j134J289j465J660j874K109k367K650k960L301l673M078m522N006n534
46b905O111o741P433q190R019r932J0941j2062J3311j4710J6287j8085K0156k2565
60a1932K5412k8837L3052l8387M5379n5005O9211r2577J40026l93486N68547Q0808
72C42211p04642N54192j31249j15926k36960M11132J94512n04295J34299J44790
82H8064j03019j21329J22613L72036n86741N6850M20198l09292o888O2144J28117
93A22753j32486k45242M96318j16640m03628K89754J76060k83089k4074L56106
103B35832k24766k59907K88838Q0987j02761j22034J89725Q692l69337K95988
$$ plain form
113 21257 246371 -80048 -102896 99425 19073 -173014 48485 161080 -47241 -99260 16838
124 16838 122745 -137036 -75626 249615 -81157 -159288 140477 65237 -151757 -45206 198084
135 198084 -52440 -127485 124340 27949 -108383 -75306 176708 54699 -217373 116018
145 116018 73536 -170021 163 147496 58125 -211963 39572 168504 -200919 5682
155 5682 183629 -39888 -146843 22377 163051 -133471 -56492 180372 -57429 -110399 35124
166 35124 123980 -66314 -134082 171069 9644 -152331 78290 90086 -85755 -99527 133368
177 133368 52847 -146905 49095 82168 -87740 -64512 112188 62197 -137594 10638 91463
188 91463 -69528 -49078 91096 57137 -128531 -14377 118748 -61489 -57585 88820 35391
$$ packed form
113B1257K25114l26419k2848K02321q0352j92087K21499J12595k08321n2019J16098
124A6838J05907k59781O1410L25241l30772p8131K99765p5240k16994J06551K43290
135A98084k50524p5045K51825r6391j36332L3077K52014j22009k72072L33391
145A16018m2482k43557J70184J47333q9371k70088K51535J28932l69423K06601
155E682J77947k23517j06955J69220J40674k96522P6979K36864k37801n2970J45523
166C5124Q8856j90294o7768L05151j61425j61975K30621J1796j75841j3772K32895
177A33368q0521j99752J96000L3073j69908K3228J76700m9991j99791J48232Q0825
188I1463j60991K0450J40174l3959j85668J14154J33125j80237L904J46405n3429
$$ plain form
199 35391 -109016 -11466 116919 -53583 -65550 79511 32368 -84151 -26349 116163 -38508
210 -38508 -95799 99865 33180 -92300 -15410 101603 -26447 -104911 110789 28292 -110320
221 -110320 18909 67485 -6956 -84587 58409 63157 -114493 11353 80886 -13673 -73843
232 -73843 15999 100647 -103265 -29510 132066 -52790 -78203 42534 73549 -60733 -58767
243 -58767 121703 -33977 -102233 77229 58362 -59764 -53235 86692 -1772 -97865 74571
254 74571 50501 -66442 -39005 55149 36486 -85691 29337 72718 -76079 -38183 69644
265 69644 33226 -79527 4568 74554 -62797 -30796 68404 22603 -71331 -19449 91906
276 91906 -44755 -52699 90112 -7846 -73156 14182 64251 -25006 -48705 60365 -2094 -58280
$$ packed form
199C5391j44407R7550J28385j70502j1967J45061m7143j16519N7802J42512j54671
210c8508n7291J95664o6685j25480P6890J17013j28050p8464K15700q2497j38612
221a10320J29229M8576p4441p7631J42996M748j77650J25846O9533r4559o0170
232g3843Q9842Q4648k03912P3755J61576j84856k5413J20737L1015j34282J966
243e8767J80470j55680o8256J79462j8867j18126O529J39927q8464r6093J72436
254G4571k4070j16943K7437R4154j8663j22177J15028M3381j48797L7896J07827
265F9644l6418j12753Q4095O9986j37351L2001R9200m5801r3934N1882J11355
276I1906j36661p944J42811r7958o5310Q7338N0069q9257k3699J09070o2459n6186
$$ plain form
288 -58280 19416 49120 -9336 -61146 40070 32616 -69097 18718 55931 -29366 -50493 38335
300 38335 41812 -66026 3972 61659 -37118 -44089 46736 37488 -68943 -2137 67926 -40523
312 -40523 -32418 45000 20795 -51989 -14805 69869 -23027 -47483 46264 16173 -45587 -13120
324 -13120 63548 -8266 -63806 44297 24712 -46466 -6041 48033 2498 -65973 31206 47282
336 47282 -55407 -9148 48572 -2572 -53853 21564 53180 -54241 -18344 53461 -6250 -41208
348 -41208 14152 44319 -40436 -28226 55499 -788 -40681 8717 37265 -25301 -35248 54807
360 54807 6068 -52149 15991 32546 -21273 -27115 41473 10044 -51957 16421 33068 -20313
372 -20313 -22135 26967 16866 -46284 9582 41013 -28251 -21407 27748 14619 -37100 2509
$$ packed form
288e8280P7696K9704n8456n1810J01216p454j01713Q7815L7213q5297k1127Q8828
300C8335L477j07838O9998N7687r8777o971R0825r248j06431O6806P0063j08449
312d0523Q105P7418k4205p2784L7184Q4674r2896k4456R3747l0091o1760L2467
324a3120P6668p1814n5540J08103j9585p1178M0425N4074m5535o8471R7179J6076
336D7282j02689M6259N7720n1144n1281P5417L1616j07421L5897P1805n9711l4958
348d1208N5360L0167q4755J2210Q3725n6287l9893M9398K8548o2566r947R0055
360E4807m8739n8217O8140J6555n3819n842O8588l1429o2001O8378J6647n3381
372b0313j822M9102j0101o3150N5866L1431o9264O844M9155j3129n1719L9609
$$ plain form
384 2509 41789 -29573 -23524 34985 10125 -33335 -698 37495 -24460 -23982 39273 5243 -33221
397 -33221 -1061 32976 -12969 -28616 35437 8460 -37154 1595 33345 -7512 -33991 30785
409 30785 15220 -42384 7465 32182 -10274 -30455 20192 25092 -39302 1221 35692 -15065
421 -15065 -26151 16655 28881 -33923 -11275 41694 -17239 -23867 20796 18519 -22633 -20344 37743
434 37743 -3262 -31807 23194 14910 -21386 -16933 30530 8604 -38385 19198 19324 -26714 -5990
447 -5990 22233 9382 -32359 6566 29915 -28322 -6702 25222 -1534 -21368 2732 26874
459 26874 -18994 -15723 27032 -1987 -18999 5512 20284 -13134 -21367 27795 4019 -24967
471 -24967 11936 13952 -15500 -13026 21189 9157 -24744 4859 18208 -16136 -11296 22483 6644
$$ packed form
384B509L9280p1362O049N8509k4860m3460L2637L8193o1955M78O3255l4030l8464
397c3221L2160L4037m5945j5647O4053k6977m5614L8749L1750m0857k6479O4776
409C0785j5565n7604M9849K4717m2456k0181N0647M900o4394M0523L4471n0757
421a5065j1086M2806J2226o2804K2648N2969n8933o628M4663k277m1152K289N8087
434C7743m1005k8545N5001q284l6296M453M7463k1926m6989N7583J26m6038K0724
447e990K8223j2851m1741L8925K3349n8237K1620L1924k6756j9834K4100K4142
459B6874m5868L271M2755k9019j7012K4511J4772l3418q233M9162k3776k8986
471b4967L6903K016k9452K474L4215j2032l3901K9603J3349l4344M840L3779j5839
$$ plain form
484 6644 -25652 3347 20503 -14461 -11269 20985 4420 -23931 2627 22236 -11380 -15773 19532
497 19532 7258 -24286 4295 22979 -13840 -15415 16743 9382 -19617 -1560 23283 -11454
509 -11454 -19877 20081 11080 -20354 -2944 20166 -8948 -18434 19269 11410 -19375 -5190 16993
522 16993 -1356 -18978 14590 15380 -23070 -4721 19127 -3055 -14758 9590 13359 -17953 -7379
535 -7379 19643 -1441 -15663 7940 13479 -14890 -8430 19141 -1625 -16086 9132 10745 -12196
548 -12196 -7272 14744 1252 -15361 6993 12728 -12640 -7843 15117 136 -14054 7276 10647
561 10647 -11484 -7146 13462 1864 -14243 6292 11584 -11251 -7294 13423 2287 -14942 6348
574 6348 12441 -12770 -6265 12475 2024 -12524 3376 14095 -11749 -9108 14552 1705 -12186
$$ packed form
484F644l2296K8999J7156l4964L192L2254j6565k8351K6558J9609l3616m393L5305
497A9532j2274l1544K8581J8684l6819j575L2158p361k8999J8057K4843l4737
509a1454q423L9958r001l1434J7410K3110k9114r486L7703p859l0785J4185K2183
522A6993j8349j7622L3568P90l8450J8349K3848k2182j1703K4348L769l1312J0574
535g379K7022k1084j4222K3603N539k8369O460K7571k0766j4461K5218J613k2941
548a2196M924K2016j3492j6613K2354N735k5368M797K2960j4981j4190K1330L371
561A0647k2131M338K0608j1598j6107K0535N292k2835L957K0717j1136j7229K1290
574F348O093k5211O505J8740j0451j4548J5900J0719k5844K641K3660j2847j3891
$$ plain form
587 -12186 3162 12684 -9492 -11279 15310 3436 -13631 3091 11104 -6784 -11507 13098 6998
600 6998 -15804 2387 11935 -6878 -9899 9993 8464 -14896 -629 14079 -6786 -9278 8855
613 8855 7421 -11693 -3029 14325 -5263 -10862 8908 6529 -9445 -3859 12324 -2270 -11920
626 -11920 8115 7056 -9373 -3064 9968 -542 -11356 6782 7857 -9807 -2340 9151 -948
639 -948 -9497 5001 8104 -9083 -2721 9200 -1449 -8440 3970 7830 -8106 -3863 9823 -1746
653 -1746 -8529 4695 6571 -7004 -3999 9374 -1217 -8533 5035 6397 -6338 -4584 8767
666 8767 611 -9556 4915 7287 -7489 -4455 8893 922 -9653 4156 7867 -7355 -4110
679 -4110 8480 1501 -9185 2171 8359 -6342 -5205 8465 2081 -9254 1281 9113 -5508
$$ packed form
587a2186J5348R522k2176j787K6589j1874j7067J6722Q013j7888m723K4605o100
600F998k2802J8191R548j8813l021J9892j529k3360J4267J4708k0865k492J8133
613H855j434j9114Q664J7354j9588n599J9770k379j5974N586J6183j4594r650
626a1920K0035j059j6429O309J3032j0510j0814J8138J075j7664P467J1491j0099
639i48q549J4498L103j7187O362J1921j0649o991J2410L860j5936M243J3686j1569
653a746o783J3224J876j3575L005J3373j0591p316J3568J362j2735J754J3351
666H767q156j0167J4471K372j4776L034J3348p971j0575J3809L711j5222L245
679d110J2590o979j0686J1356O188j4701J137J3670o384j1335J0535P832j4621
$$ plain form
692 -5508 -6129 8312 2429 -8642 606 8834 -3978 -7048 7704 3051 -8405 430 7638 -2605
706 -2605 -7033 5860 4493 -7991 -547 7773 -2021 -6880 5107 5019 -7634 -951 7266 -2384 -5724
721 -5724 4116 3934 -5879 -1996 6876 -1180 -5926 3858 4297 -5767 -1985 6649 -1378 -5466 3957
736 3957 3541 -5204 -1664 6014 -1023 -5488 3574 3604 -4973 -1759 5697 -608 -5787 3457 4182 -5349
752 -5349 -1841 5894 -559 -5912 3271 4519 -5721 -1803 6243 -532 -5519 2682 4729 -5029 -2557
767 -2557 5982 168 -5983 2140 5343 -4276 -3397 6121 765 -6282 1760 5347 -3698 -3796 5713 1346
783 1346 -6471 1603 5338 -3310 -3846 4866 1730 -5869 714 5377 -2718 -3615 3808 2544 -5098 -461
799 -461 5552 -2061 -4233 3663 2653 -4606 -695 5247 -1619 -4357 3811 2133 -4258 -329 4145
$$ packed form
692e508o21J4441n883j1071R248Q228j2812l070J4752m653j1456Q835P208j0243
706b605m428J2893j367j2484P444Q320r794m859J1987q8j2653O683Q217r650l340
721e724R840j82r813L883Q872q056m746R784M39j0064L782Q634q027m088R423
736C957m16q745L540P678p037m465R062L0q577L214P456o305n179R244P25r531
752e349L508P735o453n353R183J248j0240L918Q046o775m987Q201K047r758K472
767b557Q539n814o151Q123L203r619Q79R518n356p047Q042L587r045r8R509m367
783A346p817Q074L735q648n36Q712l136p599O583M663q095q97P423j264p642M637
799d61O013p613k172P896j010p259L911N942o866k738Q168j678o391L929M474
$$ plain form
814 4145 -1136 -3601 2823 1892 -3653 -395 3663 -420 -3652 2075 2742 -3827 -846 4231 -905 -3496
830 -3496 2100 2803 -3526 -793 4412 -1441 -3526 2406 2096 -3255 -632 3881 -809 -3560 2462 2149
846 2149 -3199 -1021 3803 -328 -3922 1820 2844 -3378 -1505 4059 -6 -4131 1632 3321 -3449
861 -3449 -1697 4496 64 -4370 1513 3465 -2962 -1828 3939 237 -3835 983 3317 -2115 -2081 3293
877 3293 1048 -3973 205 3572 -1560 -2834 3103 1555 -4098 239 3725 -1855 -2574 2923 1186
892 1186 -3446 -36 3078 -1397 -1967 2334 1181 -2681 -395 2539 -643 -2426 1840 1538 -2806 -398
908 -398 2730 -579 -2084 1744 1420 -2846 -334 2776 -903 -1842 1654 926 -2281 -363 2736 -676
924 -676 -2054 1591 1242 -2420 -536 2520 -554 -2437 1573 1584 -2459 -619 2801 -486 -2337 1649
$$ packed form
814D145n281k465O424r31n545L258M058m083l232N727O67o569K981N077n136k591
830c496N596P03o329K733N205n853k085N932l10n351K623M513m690k751O022l13
846B149n348K178M824m131l594N742J024o222J873N564m065m125N763J689o770
861c449J752O193m432m434N883J952o427J134N767l702m072M818K334n432L4N374
877C293k245n021M178L367n132j274N937j548n653M337L486n580p19N497j737
892A186m632L410L114m475n70M301j153l862K286K934l182j783M266l02m344K408
908c98L128l309j505L828l24m266K512L110l679r39L496p28l207J918L099l412
924f76j378L645l49l662J884L056l074j883M010J1m043J840L420l287j851L986
$$ plain form
940 1649 1749 -2547 -538 2826 -182 -2344 1190 1769 -2256 -1030 2705 155 -2624 1077 1936 -2116
956 -2116 -1506 2770 326 -2839 872 2157 -1856 -1487 2501 392 -2498 719 2175 -1421 -1501 2057
972 2057 959 -2481 314 2151 -1422 -1665 1767 1030 -2255 -94 1959 -1107 -1571 1961 1000 -1865
988 -1865 -143 1734 -773 -1443 1467 879 -1814 -338 1376 -597 -1478 1323 966 -1669 -217 1630
1004 1630 -469 -1354 1272 856 -1509 -196 1434 -495 -1219 1106 718 -1780 -185 1502 -536 -1259
1020 -1259 1064 883 -1548 -545 1539 -408 -1425 1292 1175 -1599 -584 1753 -340 -1522 1203
1035 1203 1171 -1741 -640 1844 25 -1599 863 1341 -1548 -763 1547 125 -1624 494 1467 -1349
1051 -1349 -1034 1579 330 -1384 462 1508 -1065 -1307 1573 299 -1465 421 1401 -932 -1039 1360
$$ packed form
940A649J00m296K009L364l008k162L534N79m025J226L735k550k779L701Q59m052
956b116O10M276k444l165L711J285m013L69L988k109k890L217J456l596q0L558
972B057j098l440K795J837l573k43L432p37l285K161K053l066m64L532r61k865
988a865J722J877k507o70K910n88k693J476J714j973q81K801l57k635J452J847
1004A630k099q85K626m16k365J313J630j929p24K325l88k498J595J687k038p23
1020a259K323j81k431J003K084j947j017K717j17k774J015K337k093j182K725
1035A203l2k912J101K484j819j624K462M78k889P85K310j422j749K118R73k816
1051a349L15K613j249j714J846J046k573k42K880j274j764J886R80k333j07K399
$$ plain form
1067 1360 602 -1207 -40 1159 -696 -983 1065 589 -1233 -77 1293 -441 -1053 1155 719 -1006
1083 -1006 -37 1006 -554 -869 927 702 -897 -51 1039 -408 -883 869 690 -963 -2 776 -346
1100 -346 -901 761 580 -1001 -103 841 -524 -976 704 703 -1189 -202 1104 -500 -742 851 692 -796
1118 -796 -311 1034 -402 -951 820 825 -790 -225 1140 -286 -1092 797 681 -911 -155 958 -51
1135 -51 -1358 456 994 -874 -698 1039 -122 -994 466 1069 -686 -733 970 227 -835 273 970
1152 970 -748 -693 554 199 -982 33 929 -421 -726 514 205 -551 161 811 -312 -759 754 274
1170 274 -758 -31 695 -308 -676 355 302 -773 42 846 -368 -707 381 279 -410 177 449 -358
1188 -358 -689 383 136 -625 150 617 -388 -395 517 316 -688 -21 659 -254 -414 586 319 -818 -2
$$ packed form
1067A360p58j809J167J199j855k87K048m76j822J156J370j734o12K208m36j725
1083a006R69J043j560l15J796k25j599Q46J090j447m75J752j79j653R61P78j122
1100c46n55J662j81j581Q98R44j365m52J680jj892R87J306j604k42J593j59j488
1118g96M85J345j436n49J771Nj615N65J365j426q06J889j16j592P56J113j009
1135e1j307J814N38j868J76J737j161q72J460O03j755m7J703p43j062J108O97
1152I70j718N5J247l55j181J015Q96j350l05J240l09p56P12O50j123m47J513m80
1170B74j032P27P26j003l68J031n3j075Q15Q04j214l39J088j02o89N87K72q07
1188c58l31J072k47p61P75M67j005pR12k01j004O67O80r13j60J000k67j137Q16
$$ plain form
1207 -2 637 -324 -677 572 250 -688 -64 845 -218 -601 599 455 -615 -261 780 -183 -797 300 709
1226 709 -559 -132 745 -237 -881 263 668 -544 -557 499 25 -551 176 587 -347 -461 387 46 -641
1245 -641 71 545 -414 -560 498 -22 -582 22 484 -122 -376 426 126 -560 25 726 -354 -446 401 86
1265 86 -438 3 529 -229 -461 398 128 -449 1 361 -307 -420 297 124 -471 2 373 -117 -274 471
1285 471 262 -410 -58 365 -89 -167 530 284 -291 -49 337 -268 -325 353 150 -577 -57 465 42 -376 454
1306 454 315 -386 -82 523 -158 -424 199 343 -516 -268 631 -179 -487 181 341 -345 -132 383 38 -454
1326 -454 164 445 -392 -397 303 33 -434 221 323 -244 -462 287 249 -435 66 380 -319 -279 355 243 -267
1347 -267 65 118 -89 -241 370 123 -320 15 166 -255 -412 231 181 -176 308 170 -163 -131 95 18 -234
$$ packed form
1207bO39r61l53J249l22r38O24R09j063l83J200j44j070L54J041r63o14J097M09
1226G09j268M27Q77r82o44J144M05j212j3J056m74n76P27M11r34j14Q48l41o87
1245f41P12M74r59j46J058n20n60O04M62o06k54Q02l00o86N85P01j080r2Q47l15
1265H6n24M41N26p58k32Q59k70n77M50L60o68j13P17j73n95M73L71m90j57P45
1285D71k09o72L52M23m54p8O97k46n75K42L86o05n7O78k03p27N20N22m23m18Q30
1306D54j39p01L04O05o81k66O23J44q59K48Q99q10l08O68J60o86K13N15l45m92
1326d54O18K81q37nP00k70m67O55J02n67k18P49l8o84N01L14o99M0O34j12n10
1347b67L32N3k07j52O11k47m43L35J51m21j57O43n0l57M84j38l33L2K26p7k52
$$ plain form
1368 -234 66 190 -292 -327 260 29 -310 77 363 -179 -292 254 181 -210 71 362 -45 -448 261 145 -345
1389 -345 93 149 -210 -172 218 214 -308 -48 487 -66 -521 224 150 -372 -102 353 -130 -252 279 342 -210 -137
1411 -137 324 -184 -430 -21 252 -242 21 381 75 -401 59 252 -65 -256 363 117 -410 -27 188 -124
1431 -124 -100 287 172 -186 54 281 -177 -75 136 -40 -286 -153 300 -150 -161 273 42 -93 51 181 -207
1452 -207 -108 76 71 -246 53 195 -95 -155 272 -56 -214 -68 147 -151 -64 58 122 -250 -178 326 -91 -198
1474 -198 -26 177 -109 139 264 -253 -231 124 -5 -159 14 195 68 -223 111 211 -209 -92 259 -116
1494 -116 -226 343 46 -218 -39 370 -116 -315 79 231 -228 -179 325 33 -266 287 186 -249 28 162
1514 162 93 -66 -7 234 -290 -155 132 54 -58 238 142 -55 -162 159 15 -15 165 -38 -39 -2 279 40 -216
$$ packed form
1368b34L00J24m82l5N87k31l39L87K86n42j13N46p3l91K81K91m07m03P09j16m90
1389c45M38N6l59L8L90mn22K60N35n53m55P45p4n22K70M55m83j22N31O3n52P3
1411a37M61n08k46M09K73m94K63L60l06m76M60J93l17j91O19k46n27L83K15l12
1431a24K4L87j15l58K40K27m58J02K11j76k46J33M53m50j1M34k31j35J44J30l88
1452b07R9J84nl17K99J42k90o0M27l28j58J46K15k98Q7J22O4l72P2N04m17j07
1474a98J72K03k86K48J25n17K2L55j29j54J73J81j27k91L34J00m20J17L51l75
1494a16j10N69k97k64J79M09m86j99L94J52m59M9N04k92k99N53j01m35K77J34
1514A62o9j59N9K41n24J35K87p8j12K96r6j97j07L21j44l0J80k03jL7K81k39k56
$$ plain form
1537 -216 229 164 -140 -6 178 32 -107 -11 18 -111 32 227 -117 -289 -70 223 -136 -199 66 32 -162 70
1559 70 200 32 48 25 -12 -347 37 178 -97 -129 -1 53 -317 34 125 -112 -18 83 -16 -203 124 452 -103
1582 -103 -178 267 106 -178 -87 74 37 -347 83 277 -286 -187 287 -74 -262 155 258 -119 -75 179 117 -205
1604 -205 119 108 -71 -18 138 48 -23 -14 101 -168 -139 125 191 -160 61 210 -33 83 108 185 -89 78 119 5
1628 5 53 101 -26 -38 79 -62 55 -38 44 64 -95 -81 58 -55 -32 244 -75 -220 39 168 -121 -124 -112 136
1652 136 -146 22 124 -184 -98 256 156 -122 66 168 -73 -125 212 57 -247 -88 143 -49 -93 86 100
1673 100 -242 -19 160 -150 -49 47 170 -8 -2 63 72 -10 32 70 51 -153 158 -43 -181 292 132 -65 -191
1696 -191 90 171 -40 7 -18 46 -85 32 87 -197 107 238 -70 -74 117 -7 -115 58 116 158 -107 127 -30
$$ packed form
1537b16M45o5l04J34J84j46j39R6K9j29J43J95l44j72K19K93l59o3K65l4j94K32
1559G0J30j68J6k3l7l35L84J41k75l2J28N4l70L51R1k37R4J01r9j87L27L28n55
1582a03p5M45j61k84R1J61l7l84M30J94n63R9M74l61j88M17J03l77M4K54o2l22
1604b05L24j1j79N3J56r0p1RJ15k69K9K64O6l51K21J49k43J16K5P7k74J67M1j14
1628EM8M8j27j2J17j41J17r3Q2K0j59J4J39j13K3K76l19j45K59J29k89lJ2K48
1652A36k82J68J02l08Q6L54j00k78J88J02k41n2L37j55l04J59K31j92m4J79J4
1673A00l42K23J79l10J01R6J23j78OO5Rq2M2L8j9k04L11k01j38M73j60j97j26
1696a91K81Q1k11M7k5O4j31J17N5k84L04J31l08mJ91j24j08J73N8M2k65K34j57
$$ plain form
1719 -30 69 92 140 -62 -212 148 206 -19 265 -112 -203 -201 1 -53 -143 10 114 1 -75 -20 -13 -212 45 36 -134
1744 -134 -66 44 79 1 12 14 -100 17 -10 -54 -105 -29 108 -54 -180 48 -56 -166 221 71 -93 -203 185
1767 185 192 -7 -151 59 126 -147 68 26 -121 -140 85 147 -104 134 37 -119 -42 225 -164 -213 50 102 10 181
1791 181 246 85 101 -23 301 138 -93 182 44 -166 -9 -67 -25 71 122 116 -66 16 135 -42 -34 167 172 6
1815 6 5 -24 -70 -123 -141 -64 -98 77 127 -239 -107 25 -32 47 -32 190 39 -35 -3 -90 -166 -40 162 -31 -364 126
1841 126 12 92 -72 113 69 -99 221 197 -165 -44 30 -195 -144 81 7 -186 25 108 -95 -198 87 11 -30
1864 -30 -64 33 -14 -26 21 46 -121 -81 8 -75 -307 118 7 31 -49 44 -115 -56 -90 -53 -4 53 -129 10 -60 -77 91
1891 91 37 -3 75 176 -110 -16 -79 -119 5 -93 -73 78 -49 -36 -128 105 -73 43 -133 130 158 -65 8 142
$$ packed form
1719c0R9K3M8k02j50L60N8k25K84l77r1KK02n4r0J53J04j13p6N5Pj99K57rj70
1744a34O8J10L5p8J1Kj14J17k7m4n1P6J37j62j26K28j04j10L87j50j64j10L88
1767A85Pj99j44K10O7k73K15m2j47j9K25O2k51K38r7j56P7K67l89m9K63N2r2J71
1791A81O5j61J6j24L24j63k31K75j38k10J57n8M2R6N1oj82Q2J19j77QK01Nj66
1815Fjk9m6n3j8P7l4J75N0l66J32J32n7P9p9K22j51p4L2q7p6J26K02j93l33M90
1841A26j14Q0j64J85m4j68L20k4l62J21P4k25N1K25p4j93K11Q3k03j03K85p6m1
1864c0l4R7m7j2M7K5j67M0Q9q3k32M25j11K4q0R3j59N9l4L7M9N7j82J39p0j7J68
1891I1n4m0P8J01k86R4o3m0J24r8K0J51j27J3r2K33j78J16j76K63K8k23P3J34
$$ plain form
1915 142 -32 -38 17 43 -34 36 93 121 -28 70 82 -65 131 -1 242 71 -50 120 -23 -118 -40 184 -155 41
1939 41 154 -60 -120 -12 80 -19 -117 70 17 77 0 154 57 -90 33 65 -166 12 -207 61 -157 -76 76 -26
1963 -26 2 -1 -24 67 41 -3 125 -141 36 45 1 123 29 77 33 -112 96 28 109 40 -129 -4 -50 10 -88 -53 -1
1990 -1 52 39 134 -73 -125 -114 127 -32 -133 118 76 -84 156 79 -29 -125 233 96 -116 -79 16 28 93 103 -231
2015 -231 4 90 -91 18 -210 -53 -24 -123 81 -53 159 19 -80 55 -73 13 -83 -178 -134 2 -13 -74 79
2038 79 121 41 -154 -58 -37 -127 63 42 76 -104 39 226 -109 25 13 -9 52 2 -126 -199 -73 22 -66 -85 91
2063 91 209 97 84 42 74 -61 111 0 -68 -77 85 40 53 179 120 98 107 -98 -54 -51 25 33 -125 -107 90 26 -92
2090 -92 -69 152 49 -96 120 -21 -107 0 14 -113 66 139 -153 -18 -88 -78 -114 50 71 57 -105 -66 -75 -71 88
$$ packed form
1915A42j74oN5K6p7P0N7K8j49R8J2j47J96j32K43j71j21J70j43r5P8K24l39J96
1939D1J13k14o0J08R2r9r8J87n3O0p7J54r7j47J23L2k31J78k19K68k18Q1J52j02
1963b6K8lk3R1k6m4J28k66J77Rm4J22r4M8m4j45K08o8Q1o9j69J25m6O0r8L5N2
1990aN3j3R5k07n2J1K41j59j01K51m2j60K40p7j08r6L58j37k12L7R5J2O5J0l34
2015b31K35Q6j81J09k28J57K9r9K04j34K12j40r9J35j28Q6r6r5M4J36j5o1J53
2038G9M2q0j95R6K1r0J90k1L4j80J43J87l35J34j2k2O1n0j28p3J26R5q8j9J76
2063I1J18j12j3m2L2j35J72j11o8rJ62m5J3J26n9k2Rk05M4LP6Qj58J8J97o4j18
2090i2K3K21j03j45K16j41q6J07J4j27J79P3k92J35p0J0l6J64K1j4j62L9rMJ59
$$ plain form
2115 88 13 -25 -125 -54 42 -102 -123 -2 42 -22 -47 -58 98 38 -34 -105 -68 69 68 109 -227 -76 96 -64 52 34
2141 34 -152 -172 199 -8 -44 198 -229 -66 -149 66 92 67 -17 18 -128 -14 -85 -14 40 -164 -35 -64 -155 -118 84
2166 84 71 34 90 -22 20 -71 17 74 -34 -95 157 -94 77 48 22 37 -15 75 -195 92 -216 -13 264 30 -56
2191 -56 -21 89 -22 11 -130 -111 65 -25 -70 -30 1 -210 -136 -55 9 163 -1 62 -28 -14 17 14 -30 198 227 -29
2217 -29 120 -58 -170 -137 21 -11 -40 30 -108 52 -47 63 31 -116 -11 96 51 27 38 -165 -6 24 21 -33 26
2242 26 -48 -153 -71 -17 96 86 57 51 31 149 -4 12 -139 99 40 -159 5 -67 -42 -121 6 75 77 -139 -120 80
2268 80 -5 -56 -93 -93 -40 132 -62 -76 -55 58 -152 78 -24 198 -215 180 -162 23 -44 33 3 35 107 -90 34
2293 34 18 -1 106 -195 -2 13 -32 -96 72 43 122 111 -74 -31 -105 66 -1 42 12 -145 39 105 159 -44 82
$$ packed form
2115H8p5l8j00P1R6j44k1J21M4o4k5j1J56o0p2p1L7J37jM1l36J51J72j60J16j8
2141C4j86k0L71k07l6K42m27J63q3K15K6k5q4L5j46J14p1P1N4k04J29k9r1L7K02
2166H4j3l7N6j12M2r1Q8N7j08o1K52k51J71k9k6J5n2R0k70K87l08K03K77k34q6
2191e6L5J10j11L3j41J9J76r0m5M0L1k11P4Q1O4J54j64O3r0J4L1lm4K28K9k56
2217b9J49j78j12L3J58l2k9P0j38J60r9J10l2j47J05J07m5k4J1k03J59L0ln4N9
2242B6p4j05Q2N4J13j0k9ok0J18j53J6j51K38n9j99J64p2K5p9J27O9Kk16J9K00
2268H0q5n1l7%N3J72j94j4K1J13k10K30j02K22m13L95l42J85o7P7l0L2P2j97J24
2293C4j6j9J07l01J93J5m5o4J68k9P9j1j85M3p4J71o7M3l0j57J84O6N4k03J26
$$ plain form
2318 82 25 -26 -14 2 123 90 -64 -7 12 38 -253 -70 67 48 -61 -12 42 34 92 196 -15 22 104 -96 62 144
2344 144 -32 -155 -45 -34 74 -92 79 7 -220 -233 22 -42 -80 162 -60 -170 -80 33 -78 -47 -106 46 162
2367 162 73 110 81 -38 -212 28 -204 -68 188 -170 45 53 61 100 42 59 219 10 65 -91 189 -14 -150 35
2391 35 108 -16 -74 210 88 -14 65 91 -35 -30 -182 -91 -131 52 -32 -85 -40 234 -215 -25 -24 192 102 32 16 -156
2417 -156 -107 -175 -31 -52 79 134 93 6 52 32 -26 56 -182 -118 -6 -84 62 -83 22 -13 -35 -205 48 52 17 -64
2443 -64 43 95 61 180 -23 144 -3 27 -5 -104 -2 0 -49 61 -4 -57 -58 -108 38 -121 98 -93 -84 57 -142
2468 -142 7 -58 -46 34 113 57 6 -92 27 -140 -65 -135 167 -36 -12 -12 -77 167 115 4 58 -52 116 45 108 69
2494 69 -23 -57 200 -134 198 124 11 -49 63 -13 0 58 -118 27 177 -81 -7 122 123 -97 0 -11 79 11 -27
$$ packed form
2318H2n7n1J2J6J21l3j54N7J9K6k91J83J37j9j09M9N4qN8J04k11L7Q2k00J58Q2
2344A44j76j23J10J1J08j66J71p2k27j3K55o4l8K42k22j10R0J13j11L1n9J52J16
2367A62q9L7k9j19j74K40k32J36K56l58K15QQL9n8J7J60k09N5j56K80k03j36J85
2391C5P3j24n8K84j22j02P9K6j26Nj52R1m0J83q4n3M5K74m49J90JK16r0p0j6j72
2417a56M9o8J44k1J31N5m1q7M6k0n8Q2k38O4J12p8J46j45J05l5k2j70K53Ml5q1
2443f4J07N2l4J19k03J67j47L0l2r9J02Km9J10o5n3jn0J46j59K19j91RJ41j99
2468a42J49o5J2Q0P9n6n1r8J19j67P5p0L02k03K4%o5K44n2j11N4j10J68p1O3l9
2494F9r2l4K57l34L32p4j13o0J12p6J3N8j76J45J50k58P4J29Jk20R7j1R0o8l8
$$ plain form
2519 -27 5 105 -15 103 -13 113 -35 12 101 -229 -40 143 152 -119 28 -1 19 -100 1 -87 -162 -145 -48 25
2543 25 -40 -49 46 68 47 26 148 108 24 10 149 20 -198 -3 -55 8 -35 -14 21 52 15 -37 -49 116 113 -111 -43 -91
2571 -91 10 102 -63 136 -82 -8 138 -234 -39 28 -98 -7 42 -242 88 -5 58 72 155 97 3 66 -52 -86 66
2596 66 8 49 -5 132 -32 -48 80 -43 30 -67 -58 0 4 -79 -74 172 95 -63 -19 -105 46 -43 -22 26 184 -126 37
2623 37 -76 77 86 56 137 12 -59 16 28 -17 -65 1 -54 -1 41 -229 -4 -11 26 133 27 229 12 2 -49 -70 -52
2650 -52 91 95 18 -146 -81 -15 109 -51 -13 -105 82 5 -85 143 82 -58 59 144 -217 -191 -60 49 -19 -42 -221
2675 -221 12 69 33 -70 -96 134 -64 20 78 -217 -117 -104 59 -92 92 -85 -89 32 -3 202 -137 79 18
2698 18 38 183 24 88 -143 95 -35 -24 -193 -46 69 -79 -37 -73 -64 27 120 34 59 -73 164 56 -46 -8
$$ packed form
2519b7L2J00j20J18j16J26j48M7Q9l30J89J83Rk71J47k9K0j19J01q8p5J7R7P3
2543B5o5rR5K2k1k1J22m0q4j4J39j29k18J95n2O3m3K1L5L1l7n2j2J65lk24O8m8
2571i1J01R2j65J99k18P4J46l72J95O7j26R1M9k84L30r3O3J4Q3n8r4O3j18l4J52
2596F6n8M1n4J37j64j6J28j23P3r7RN8Mq3NK46p7j58M4q6J51q9K1M8J58l10J63
2623C7j13J53Rl0Q1j25p1P5J2m5m8O6n5N3M2k70K25pL7J07j06K02k17j0n1k1J8
2650e2J43Mp7j64O5O6J24j60L8r2J87p7r0K28o1j40J17Q5l61K6J31J09o8k3j79
2675b21K33N7l6j03k6K30j98Q4N8k95J00J3J63j51J84j77mJ21l5K05l39K16o1
2698A8K0J45j59O4k31K38j30J1j69J47J15j48M2l6RR1R3q6K5j32K37j08j02L8
$$ plain form
2722 -8 12 -7 21 -55 149 -122 26 85 -42 -112 43 -64 -15 146 75 75 110 -110 -87 12 39 -91 1 47 -232 -202
2748 -202 -78 -87 -48 -49 -41 56 73 69 18 78 58 22 77 46 50 43 -11 -71 -30 -12 113 24 35 175 6 111 -57 -69 158
2777 158 12 66 -203 78 -51 -98 -30 -20 -84 9 -83 141 117 17 -27 -199 -22 -57 -45 53 -113 64 -20 -38 -77
2802 -77 -3 1 -23 57 37 -13 24 -70 149 93 9 107 -50 137 -105 -57 23 -134 -48 44 -93 -55 6 34 72 -24 -35 -25
2830 -25 -92 -30 -49 -156 133 -19 153 -45 -56 52 -1 -59 -116 71 -45 129 13 28 -102 106 91 -94 59
2853 59 43 265 -18 -56 18 -25 88 -88 17 -80 -114 -135 22 -71 -53 59 -71 46 156 -113 16 -44 -121 110
2877 110 64 74 126 -50 -39 79 -252 -99 -20 25 -26 -83 21 43 -90 -63 87 -106 -28 134 -35 -21 -55 -126 -71
2902 -71 -123 91 -39 -99 -85 84 -60 59 -61 -10 -163 -65 43 -115 27 -117 91 -51 47 -37 2 -28 -92 87
$$ packed form
2722hK0j9K8p6K04k71J48N9j27p0J55j07M9J61p1%L5k20K3R9K7j30R2M6k79L0
2748b02J24rL9jQR7J7mn1O0k0l6N5l1Mpn4o0M1J8J25q9J1J40j69J05j68j2K27
2777A58j46N4k69K81j29m7O8J0o4R3r2K24k4j00m4j72J77l5J2R8j66J77q4j8l9
2802g7P4Mk4Q0k0n0L7r4K19n6q4R8j57J87k42M8Q0j57Q6R2j37L8O1K8L8r6j1J0
2830b5o7O2j9j07K89j52J72j98j1J08n3n8n7J87j16J74j16J5j30K08j5j85J53
2853E9j6K22k83l8P4m3J13j76J05r7l4k1J57r3J8J12j30J17J10k69J29o0p7K31
2877A10m6J0N2j76J1J18l31J53P9M5n1n7J04K2j33K7J50j93P8J62j69J4l4p1N5
2902g1n2K14j30o0J4J69j44J19j20N1j53R8J08j58J42j44K08j42R8q4L9l0o4J79
$$ plain form
2926 87 93 172 0 2 -59 116 -27 43 -103 -49 -114 23 -70 -43 -101 -33 42 -105 -93 -329 -104 60 22 -79 -136 65
2952 65 -64 -115 59 17 39 -2 -94 40 9 -65 -64 41 -81 -214 -200 -4 3 86 62 -102 49 -54 56 32 258
2977 258 -3 -47 313 20 80 89 -134 -36 -51 138 4 -59 205 21 -224 97 -150 75 -111 94 -145 215
2999 215 90 -111 125 -130 -1 157 -67 46 -23 47 -82 51 32 29 136 -22 -126 17 -32 -1 61 -68 12
3022 12 97 49 59 9 -33 -146 35 -60 -68 -9 20 0 24 -43 23 -39 -41 110 34 68 -111 -48 -51 -50 -60 81 72 99 86 -137
3052 -137 -88 192 -83 -191 -34 42 -57 -42 -52 -154 -28 147 82 -60 -38 74 11 -135 -45 80 160 -64 27 108
3076 108 35 -24 162 -60 -90 46 -31 106 -70 -19 -1 -26 28 -19 -19 -31 -81 -46 0 -122 17 -131 49 156 2
3101 2 153 40 39 -66 25 -4 -83 5 50 -15 -101 27 86 0 -88 -49 -20 -71 41 -80 138 -50 49 176 -28 88
$$ packed form
2926H7OP9j72Ko1J75j43P0j46N4o5J37r3K7n8O8P5j47J2k36K25J64l8j01n7K01
2952F5j29n1J74m2K2m1r2J34l1p4JJ05j22j33J4J96PQ3k4j64J51j03J10k4K26
2977B58k61m4L60k93O0Rk23R8j5J89j34o3K64j84k45L21k47K25j86K05k39L60
2999B15j25k01K36k55J29J58k24J13o9P0j29J33j9lJ07j58j04J43m9L1O2j29Q0
3022A2Q5m8J0n0m2j13J81r5qN9K9k0K4o7O6o2kJ51p6L4j79O3lJj0J41rK7j3k23
3052a37M9K80k75j08J57P6r9J5j0j02J26J75o5j42K2J12o3j46R0J25Q0k24R1Q1
3076A08p3n9J86k22l0J36p7J37j76N1J8k5N4m7%j2n0L5M6j22J39j48J80J07j54
3101BJ51j13jj05R1k9p9Q8M5o5q6J28N9q6q8L9K9n1J12j21K18j88R9J27k04J16
$$ plain form
3127 88 100 -77 12 -83 94 -13 -75 -154 77 -46 -18 105 21 -47 87 -49 -16 -120 -55 -12 -92 47 111 148 -9
3152 -9 105 -26 -87 -159 -77 63 -98 -123 23 89 23 32 -90 -144 -9 -117 -41 56 91 -87 94 -23 134 -178 165
3177 165 -140 -118 9 27 -44 0 121 -39 34 -155 23 -28 20 -7 -102 128 -186 -92 80 84 176 110 -41 -13 14
3202 14 -78 7 89 -5 -105 -48 45 -57 -19 6 101 -131 -60 -53 99 -84 -37 6 77 -22 -132 -124 -20 -181 -7 -28 -81
3229 -81 -36 25 9 37 -41 28 -99 -32 37 -20 -36 23 -59 -61 116 164 -5 34 -117 -8 7 -65 119 -94 -174 81 -61
3256 -61 -26 -73 -173 96 62 -90 152 34 -7 23 -20 64 -151 25 -23 -6 -172 132 -59 76 -54 94 -6
3279 -6 -95 75 85 6 27 -22 -55 -16 -114 156 -143 -39 14 10 -11 83 69 -32 40 -75 -12 79 -74 -40 -19 -71 -57 125
3307 125 -315 87 -77 -17 132 66 -99 58 20 128 61 -10 -123 33 79 -50 85 -82 65 73 67 126 93 -84
$$ packed form
3127H8J2j77Q9r5J77j07o2p9K31j23K8J23q4o8J34j36L3j04O5M3q0J39O4L7j57
3152iJ14j31o1p2Q2J40j61k5J46O6o6Rj22n4J35j08P6R7L5j78J81j17J57l12L43
3177A65l05K2J27J8p1M4J21j60P3j89J78n1M8k7r5K30l14R4J72MR2o6j51K8K7
3202A4r2Q5Q2r4j00N7R3j02L8K5R5k32P1PJ52j83M7M3P1r9j10QJ04j61J74k1n3
3229h1M5O1j6K8p8O9j27O7O9n7j6N9q2kJ77M8j69L9j51J09J5p2J84k13q0K55j42
3256f1L5m7j00K69l4j52K42j18m1L0m3Q4k15J76m8J7j66L04j91J35j30J48j00
3279fq9J70J0p9K1m9l3L9r8K70k99J04N3mk1R4j4j01P2j15O3R1j53L4K1n2J4J82
3307A25m40M02j64O0J49o6j65J57l8J08o7p1j13J56M6j29J35j67J47QoN9l3j77
$$ plain form
3331 -84 -175 174 141 90 43 45 41 46 67 0 94 63 -6 -9 12 88 -63 -51 -14 -34 164 -14 86 17 -30 6 -24 65 39 10
3361 10 -206 -100 -72 -25 -35 36 -88 -74 88 118 158 -83 10 -71 -18 -10 -77 8 -3 44 47 127 129 -39 61 39 -39 -60
3389 -60 148 -97 72 -27 109 -9 -78 60 8 149 95 112 17 -11 89 62 -2 130 45 39 -190 12 36 -7 -99
3414 -99 -213 124 46 -8 57 92 -73 -36 -63 -54 4 152 77 157 -80 15 -73 -75 23 71 -15 -7 -30 -86 108 -171 -16 44
3442 44 -5 85 -2 53 144 59 164 8 61 -14 -59 -48 36 5 -35 38 48 -57 2 -91 -94 82 48 2 -30 -14 -54 -15 -63
3471 -63 -86 -97 14 79 11 107 -35 -42 67 -77 65 -36 65 136 -74 125 49 77 28 -30 273 -39 -19 -168 -83
3496 -83 7 34 104 14 153 -56 -77 77 -70 58 -104 7 -72 -89 -97 42 -92 -111 134 63 42 67 -74 132 67
3521 67 61 -21 -29 -148 48 31 118 5 43 45 101 6 -92 55 -40 -51 -132 -83 87 131 -6 98 -27 101 -71 -31 -74
$$ packed form
3331h4r1L49l3n1m7KmNK1o7R4l1o9lK1P6j51J2L7k0J98j78J00o9m7L6l0Q9k6k9
3361A0k16J06K8M7j0P1j24J4J62L0M0k41R3q1N3Qo7Q5j1M7LQ0Kj68J00k2p8k1
3389f0K08k45J69r9J36j18o9J38n2J41n4J7r5k8J00k7o4J32q5ok29K02K4m3r2
3414i9j14L37p8n4O5L5j65L7k7RN8J48p5Q0k37R5q8kR8M8q6Qk3n6J94k79J55O0
3442D4m9R0q7N5R1q5J05j56N3p5m5J1Q4l1m0P3J0j05N9r3lJ76l4m6l2J6m0L9m8
3471f3k3j1J11O5o8R6j42pJ09j44J42j01J01P1k10J99p6K8m9n8L03l12K0j49Q5
3496h3R0K7P0r0J39k09k1J54j47J28j62J11p9j7qJ39j34j9K45p1k1K5j41K06o5
3521F7oq2qj19J96j7Q7j13L8KN6r5r8J47r5j1q1M9J70M4j37J04j25J28j72M0m3
$$ plain form
3548 -74 97 91 103 28 43 -87 -59 251 56 147 68 59 -20 27 59 -71 10 -90 -48 -35 50 108 218 57 8 71 -17
3575 -17 -16 96 -37 180 7 18 56 -86 -159 169 3 -53 -148 -39 176 -96 9 -56 143 -10 69 86 -93 79
3599 79 8 -54 -178 -71 -5 -18 -6 12 196 143 183 -101 143 56 232 3 -34 102 -58 -32 -55 -34 -159 -24 -75
3624 -75 94 -46 163 -120 50 -63 123 88 -164 8 138 -57 29 -2 170 -4 177 4 48 229 1 24
3646 24 -13 91 -101 126 -28 51 -61 0 0 -78 139 1 -157 138 65 -32 133 -75 78 -47 88 -192 26
3669 26 23 13 33 -39 7 -8 -49 -255 92 188 -122 -57 -58 -22 233 3 180 -103 20 43 88 56 -4 21 119 67 -107
3696 -107 71 41 8 12 -20 11 -89 65 -69 164 50 -115 83 101 100 -203 -10 6 -2 -203 -138 -10 135 -52
3720 -52 55 -23 -49 64 137 -88 -117 -113 -81 -78 81 -5 -51 22 177 29 88 47 -17 95 119 32 -22 -43 122 -8 -109
$$ packed form
3548g4J71oJ2p5J5j30K8L10j95R1p9rp9M7L2j30Q1j00M2J3Q5N8J10j61m9O3q8
3575a7JJ12j33K17j73J1L8j42p3L28j66n6r5J09K15k72J05o5J99j53P9J7j79J72
3599G9p1o2j24J07O6j3J2J8J84n3M0k84K44q7J76k29l7J36j60K6k3K1j25J35n1
3624g5J69j40K09k83J70j13J86l5k52J72J30j95Q6l1J72j74J81j73M4J81k28K3
3646B4l7J04j92K27j54P9j12O1%p8K17j38j58K95p3r7J65k08J53j25J35k80K18
3669B6lj0K0p2M6j5m1k06L47R6l10O5jL6K55k30J77k83J23K3M5l2o0K5R8n2j74
3696a07J78l0l3Ml2L1j00J54j34K33j14j65J98J8jl03J93J6qk01O5J28J45j87
3720e2J07p8k6J13P3k25k9ML2LJ59q6m6P3J55j48N9m1o4J12K4q7n4k1J65j30j01
$$ plain form
3747 -109 75 -227 74 2 -96 65 -41 24 -51 -120 68 -40 5 -131 -193 64 42 -49 121 -44 -164 101 -47
3770 -47 -100 55 -38 1 181 6 -27 -150 7 -34 -43 32 60 -60 37 45 57 -178 -79 -110 -148 -97 106 8 -95 31
3796 31 -28 46 -203 255 -71 26 6 -85 -171 -48 -55 -11 141 -11 101 -76 -91 14 -79 -124 59 -168 -41 -26 -21
3821 -21 77 -85 -12 73 37 -191 -67 45 146 -25 -140 -133 69 -139 -98 130 -134 187 74 -120 50 -166 -3
3844 -3 13 -7 56 -39 -63 -105 8 -170 89 -73 22 -181 2 126 -132 -72 62 34 23 -25 4 57 137 78 83 121 -15
3871 -15 -37 39 83 -221 -17 -59 -161 -155 156 24 -102 13 -113 131 49 144 -82 37 -12 -119 34 88 -43 -112
3895 -112 131 -6 -53 55 58 24 -32 -33 142 -12 -1 -39 -97 60 -111 -110 -17 120 102 7 -62 129 16 -160 29
3920 29 140 119 -7 101 118 -40 -82 153 85 -14 27 54 -86 84 -34 -73 -3 -235 -62 117 211 -85 72 59
$$ packed form
3747a09J84l02L01p2r8J61j06O5p5o9J88j08M5j36o2K57k2r1J70j65j20K65j48
3770d7n3J55r3L9J80j75l3j23J57m1rP5K8j20R7QJ2k35R9l1l8N1K03r8j03J26
3796C1n9P4k49M58l26R7k0r1q6J23pM4J52j52J12j77j5J05r3m5J83k27J27J5N
3821b1R8j62P3Q5l6k28J24J12J01j71j15PK02k08M1K28k64L21j13j94J70k16J63
3844cJ6k0O3r5k4m2J13j78K59j62R5k03J83J24k58O0J34k8j1m8K9N3Q0n9NL8j36
3871a5k2P6M4l04K04m2j02OL11j32j26J15j26K44q2R5k26J19m9j07J53N4j31o9
3895a12K43j37m7J08Ll4n6jJ75j54J1l8n8J57j71JR3J37j8r5o9J91j13j76J89
3920B9J11k1j26J08J7j58m2K35o8r9M1K7j40J70j18l9P0k32J73J79R4k96J57j3
$$ plain form
3944 59 -35 118 -141 68 -49 16 144 -138 0 -83 151 -59 23 107 -107 157 9 -88 -262 35 38 95 3 -25
3968 -25 124 65 23 -77 1 -124 7 -82 0 -148 33 103 -202 150 -51 -59 -136 -58 66 -58 38 67 -82 -20 -113
3993 -113 -57 120 11 40 8 -4 -53 14 159 80 -95 62 17 20 -89 -73 66 -3 49 -59 20 -25 92 -71 -105
4018 -105 3 65 130 -80 50 -56 12 59 36 17 21 -22 40 -170 -166 33 77 111 -58 18 53 -167 14 94 27 137
4044 137 -65 -48 5 -20 139 -238 -1 30 -114 -59 -61 13 103 62 16 -25 -109 -42 -16 -21 3 28 162 -125 -119 -12 -31
4071 -31 169 6 30 1 -24 -21 78 82 -70 112 104 -108 25 2 -21 -32 -42 163 107 -89 127 -47 47 41 40 192 -41
4098 -41 -125 61 10 -25 48 -55 -36 2 -17 97 51 -95 -97 12 -3 29 -168 -7 -111 -37 161 -14 -111 -29 -15 -165
4124 -165 -35 -62 -61 -187 94 50 -95 12 129 167 -36 -101 -32 -87 -34 -51 -16 -128 -92 129 -79 -34 45 25 69
$$ packed form
3944E9r4J53k59K09j17O5J28k82J38q3K34k10Q2Q4k14K64j48r7j74K97LN7r2k8
3968b5J49n9m2j00P8j25J31q9Q2j48J81P0l05L52k01qp7P8J24j24R6K9j49O2r3
3993a13N6J77j09K9l2j2m9O7J45p9j75J57m5Lj09J6J39o9N2j08P9m5J17j63l4
4018a05J08O2O5k10J30j06O8M7k3j9Mm3O2k10MJ99M4L4j69P6L5k20J81Q0o7J10
4044A37k02J7N3k5J59l77K37L1j44N5kP4R0m1m6m1q4O7K6nK4K5J34k87OJ07j9
4071c1K00j63K4k9k5LR9Mj52J82qk12J33k3k3j1j0K05n6j96K16j74R4ojJ52k33
4098d1q4J86n1l5P3j03J9L8j9J14m6j46kJ09j5L2j97J61j04P4J98j75r7Q2J4j50
4124a65J30k7Jj26K81m4j45J07J17L8k03o5O9n5N3j7L5j12L6K21k08M5P9k0M4
$$ plain form
4149 69 68 33 -38 117 -17 -99 70 -28 82 21 70 59 51 59 -13 32 189 94 -49 78 166 -69 -74 116 32 -118 -54
4176 -54 73 -56 3 65 -31 164 -109 85 -62 88 17 13 53 8 164 -44 -14 169 49 12 -161 -2 51 116
4200 116 55 -33 -27 109 -37 1 109 3 -74 -177 -103 92 104 -14 -165 -108 -19 -207 -61 51 64 31 151 35
4224 35 100 11 66 199 97 -32 -78 -12 46 164 -29 177 84 -92 9 98 53 48 -107 120 129 95 -29 109 -7
4249 -7 -57 -75 -53 -38 10 -75 -21 47 43 32 -27 59 -12 -92 -87 -50 12 7 -104 70 67 23 19 -96 27 -8 81 22 -4 -7 54 56
4281 56 -53 -138 0 -75 -140 -30 97 95 31 16 12 128 -103 6 -6 -8 71 -76 34 44 -82 135 119 -56 -37 -182
4307 -182 36 -214 7 69 157 58 -25 -40 -23 -82 -73 57 -194 -38 11 94 92 -26 157 28 22 -45 -41 -27 7 5 2 -6 146
4336 146 51 18 -11 -129 148 114 -19 -64 -117 -188 39 -122 -57 -35 -29 -53 135 -18 -61 -103 -39 115 -58 72 -32
$$ packed form
4149F9jl5p1J55j34q2J69r8J10o1M9j1qQp2M5J57r5j43J27Q8k35nJ90q4j50O4
4176e4J27j29N9O2r6J95k73J94j47J50p1mM0m5J56k08L0J83j20l7j73J59N3O5
4200A16o1q8OJ36j46L8J08j06p7j03P4J95J2j18j51N7Q9j88J46J12J3l3J20j16
4224C5O5q9N5J33j02j29m6O6N8J18j93K06r3j76J01Q9m5nj55K27Rl4j24J38j16
4249gn0j8K2J5M8q5N4O8mj1n9Q6p1q0NL7O2nj11J74lm4mj15J23l5Q9n9k6lO1K
4281E6j09q5J38p5o5J10J27ko4j5mJ16k31J09j2kP9j47J10J0j26K17j6j75J9j45
4307a82K18k50K21O2Q8r9q3j5J7n9RJ30k51J56M9Q3kj18J83j29oo7MJ4L4klqJ52
4336A46r5l3k9j18K77l4j33m5n3p1K27j61O5K2Ok4J88j53m3m2O4J54j73J30j04
$$ plain form
4361 -32 52 7 3 9 40 -163 43 -7 -114 53 103 -67 30 156 64 77 -94 143 124 166 8 31 27 -70 -112 -62 75
4388 75 -117 -70 176 85 -96 -109 67 254 -138 -74 42 -106 84 19 -32 -88 -29 18 -82 -19 -14 38 -148 91 -45
4413 -45 -76 -64 52 132 51 -15 260 92 38 -103 -26 -89 -72 117 -29 -4 -38 -27 83 304 -78 -31 119 -55 133
4438 133 -160 -47 -119 82 4 113 -46 6 -57 68 -42 3 44 -61 45 96 18 -30 -27 56 -26 26 -139 -127 -20
4463 -20 -5 66 -39 160 166 4 -95 31 -131 -187 -177 -83 -140 -115 -46 269 -38 159 -2 198 32 20 50 -6 -30
4488 -30 14 35 -62 -60 -5 -65 102 68 -70 -80 -78 -75 -31 -63 -31 -122 2 -52 -87 -49 -186 -111 -73 -14 -116 129 139 -80
4516 -80 79 120 81 -58 10 83 -86 23 53 26 89 -54 98 87 -42 -125 38 83 41 -8 -69 -70 94 -85 89
4541 89 -30 -230 -2 -137 -77 215 158 -74 -110 176 -129 -87 54 -109 -97 -33 48 26 -69 -55 148 49 120 -164
$$ packed form
4361c2Q4m5mOL1k03K06n0j07J67N0j70R7J26r2J3j71K37j9M2j58K3mr7m2N0J37
4388G5j92M7K46r1j81j3J76J87l92O4J16j48J90o5n1n6N9M7j00O3NN2j86K39j36
4413d5l1J2J16Q0q1o6K75j68n4j41P7o3J7J89j46K5l4J1J10K21l82M7J50j74J88
4438A33k93J13p2K01p8J09j59N2o3J25j10M5M1j05J06N1p8m8LQ3q2N2j65J2J07
4463b0J5P1j05J99Oj62r9J26j62n6J0R4n7K5O9L15l07J97j61K00j66j2L0n6k4
4488c0M4K1r7KN5o0J67l4j38j0KLM4l2L2r1J24n4l5L8j37P5L8N9j02K45J0k19
4516h0J59M1l9j39O8P3j69J09L0k7O3j43J52j1j29q3J63M5m2m9o1jJ64j79J74
4541H9j19k00K28j35O0K92n7k32l6K86l05M2J41j63J2O4Q1k2r5J4K03r9P1k84
$$ plain form
4565 -164 -5 -44 56 -44 -112 184 -164 -81 -56 54 33 60 -170 -165 74 -23 -35 39 63 -189 -24 28 -111 39
4589 39 -48 -19 -97 -147 17 -199 -99 -7 -90 -36 -68 15 111 151 -105 -35 2 -97 129 274 -31 -93 6 48 32 -47 -35
4616 -35 -10 39 -77 -59 -136 115 111 -24 36 135 -2 24 -21 -107 87 54 97 -141 -91 -5 -121 -41 -146 100 113 34
4642 34 -2 79 64 -11 -28 15 -154 48 -23 -81 140 -86 -41 42 14 -84 -17 -11 -22 155 97 24 84 -117 6 131 85
4669 85 75 147 -93 -30 164 55 113 -146 67 -29 -114 -5 125 187 -73 -56 2 -183 -96 -58 -10 100 15 114 -131
4694 -131 41 -51 2 192 51 -108 14 15 -46 -19 54 -8 39 45 5 -21 -83 112 -6 -45 -153 11 15 97 -181 76
4720 76 148 57 -108 54 96 127 34 -121 -157 -70 -91 -123 69 -29 -58 101 42 93 -11 8 -30 -14 48 -40 185 101 33
4747 33 -54 -4 54 -29 -6 -29 -16 97 76 -38 20 -166 131 89 -157 54 -118 15 19 -1 -3 36 -92 171 93 66
$$ packed form
4565a64J59l9J00j00o8K96l48Q3K5J10k1K7k30NK39r7j2P4K4k52J65N2j39J50
4589C9q7K9p8n0J64k16J00R2q3N4l2Q3R6M0k56P0L7r9K26J45l05o2R9M2j6p9J2
4616c5K5M9j16J8p7K51mj35O0R9j37K6m5q6J94l3M3k38N0Q6j16Q0j05K46J3p9
4642C4l6Q1j5p5j7M3j69K02p1n8K21k26M5Q3k8r8O7Oj1J77n8p3O0k01J23J25m6
4669H5j0P2k40O3J94j09N8k59K13r6q5J09J30O2k60J7N8j85Q7L8M8J10q5R9k45
4694a31J72r2N3J90j41j59J22Jo1K7P3o2M7Om0k6o2J95j18l9j08J64MQ2k78K57
4720G6P2r1j65J62M2L1r3j55l6Q7k1l2J92r8k9J59n9N1j04J9l8J6O2q8K25q4o8
4747C3q7N0N8q3K3k3J3J13k1j14N8j86K97m2k46K11j72J33Mk0kL9j28K63p8k7
$$ plain form
4773 66 99 -82 -52 147 -97 178 -149 -159 107 -96 129 218 180 -13 69 -32 -9 57 -128 3 56 133 -46 -64
4797 -64 9 85 90 -57 -39 -18 -4 164 72 -35 -54 -130 24 2 52 -4 -102 -79 -76 -132 16 -138 -55 139 118 45 -37 36
4825 36 -106 28 -123 -50 40 112 44 -83 -32 -18 52 -19 -220 81 -2 -77 -41 -55 -27 65 28 -46 31 -88 -78 -219
4851 -219 -38 -68 -83 -92 49 -146 137 104 -49 62 -26 -38 -25 -37 -2 -11 -25 52 19 -63 -105 13 -46 -57 2 -178 -36
4878 -36 94 45 153 -69 58 8 56 2 -83 -7 24 -3 80 44 33 -23 -74 29 192 -160 -66 106 227 -120 -67
4903 -67 71 49 52 61 73 -146 46 -92 -57 -11 12 57 14 -54 91 -51 -36 70 151 -87 -121 -6 -99 103 142 -41
4929 -41 -120 -176 -65 -73 54 84 -5 17 94 15 -29 105 31 65 67 -139 88 -25 47 167 -1 -61 10 48 40 -73 -43
4956 -43 -38 -72 25 43 42 76 115 -92 0 130 -23 -78 -13 -12 -59 136 103 -69 -55 -75 -22 -5 173 104 59 -140 21 -65
$$ packed form
4773F6L3j81L0J99k44K75l27j0K66k03K25Q9l8j93Q2j01K3O6j85J31N3P7j79j8
4797f4P3P6Nj47J8K1J4J68r2j07j9p6J54k2N0n6r8K3Ln6J48j54Q3J94k1p3q2P3
4825C6j42J34j51P3R0P2o8j27N1J4P0p1k01L01q3p5L6j4K8R2l7p4P7j19J0j41
4851b19J81l0j5rJ41j95K83l3j53J11q8j2J3j2L5rj4P7l3q2m2J18n9j1N9j80J42
4878c6J30m9J08k22J27n0M8n4q5P6L1k7Q3l6j1n6n1J03J63l52R4J72J21l47N3
4903f7J38k2LRJ2k19J92j38L5M6K3M5m3o8J45j42J5J06Q1k38l4J15r3K02L9j83
4929d1p9n6J11qJ27L0q9K2P7p9m4J34p4L4Kk06K27j13P2J20j68o0P1L8qj13L0
4956d3Nl4R7J8jL4L9k07R2J30j53n5O5Jm7J95l3j72J4k0N3J7J78o9m5j99J61q6
$$ plain form
4984 -65 169 145 -75 57 22 67 26 87 83 33 160 49 99 72 29 -23 -123 179 -53 96 -23 -7 -27 165 -45
5009 -45 15 30 124 -91 -25 -41 -48 -42 91 -40 -225 -47 -82 73 25 96 146 -62 -72 74 17 32 -2 -53 -175 128
5035 128 125 -2 -103 75 49 97 126 121 182 126 78 165 -108 22 85 -178 -47 8 200 -120 32 -102 97 16 -19
5060 -19 -52 -172 -104 -118 129 39 -68 -4 18 83 36 11 53 136 2 -5 -22 262 35 -104 -33 30 -50 34 -59 98 -117
5087 -117 -79 -101 -170 -142 -89 78 16 17 20 -83 161 -60 57 -129 -22 119 -39 -56 91 -33 85 132 89 183 -45
5112 -45 23 75 -43 59 3 -6 -37 110 62 -33 34 -175 58 6 -28 45 -58 14 13 18 -3 -69 69 -31 -61 -38 -2 -4
5140 -4 17 40 2 3 -30 -193 -126 -32 -44 -14 66 -2 117 110 86 -68 113 54 61 53 -13 -44 46 -12 45 -228 20 61 -182
5169 -182 -71 -72 13 31 -35 24 -164 -49 -88 -75 82 11 -134 -78 66 39 73 45 17 -37 -15 -11 -103 -66 -211 -2 -17
$$ packed form
4984f5K34k4k20J32l5M5m1O1mn0J27j11N0k7m3n2j00L02k32J49j19J6k0J92k10
5009d5O0J5R4k15O6j6pOJ33j31j85J78l5J55m8P1N0k08j0J46n7J5l4n1j22L03
5035A28lj27j01J78k6M8K9nO1n6m8Q7k73J30O3k63J31N5J92l20J52j34J99q1l5
5060a9l3j20O8j4K47r0j07O4K2O5m7k5M2Q3j34pj7K84k27j39P1O3q0Q4r3J57k15
5087a17L8k2o9K8N3J67o2JLj03K44k21J17j86J07J41j58j7J47j24J18M7m3R4k28
5112d5O8N2j18J02n6rl1J47m8r5O7k09K33n2l4P3j03P2jNk1o6J38j00l0K3L6k
5140dK1K3l8Jl3j63O7R4j2L0Q0o8J19pk4j54J81n9Pqo6l1R0n8N7k73K48M1k43
5169a82J11jQ5J8o6N9j88J15l9J3J57p1j45N6J44k7L4k8k8n4K2Mr2L7j45K09j5
$$ plain form
5196 -17 -208 -35 9 58 23 113 -8 50 0 -11 163 54 7 145 50 14 -109 -38 -11 -92 28 -54 27 114 6 -19
5222 -19 57 19 -18 24 72 -112 -37 101 -59 165 -1 41 39 -42 1 111 21 5 -105 38 39 1 -27 9 39 -19 -94
5249 -94 -20 -2 -42 -100 188 -149 101 -76 152 27 -114 124 -39 28 39 47 -73 -115 -13 40 -14 120 67 -19 30
5274 30 -53 28 34 45 156 60 25 6 -44 -85 41 -94 3 101 228 15 19 -2 -137 -77 171 3 120 46 -26 10 48
5301 48 -29 -80 -182 -1 46 23 52 64 -82 -55 -15 -84 1 10 -89 -5 -124 1 -5 -60 28 -6 35 -17 -101 66 42 -208
5329 -208 43 90 64 -127 18 -4 57 -169 169 80 80 36 -41 -93 92 72 1 210 2 -64 -15 118 -68 19 -156
5354 -156 27 100 -40 92 -77 -143 -150 -8 -22 69 140 -81 49 117 34 -98 77 91 27 -53 -66 31 -18 9 99 3
5380 3 -166 48 64 -50 53 44 -43 40 158 -80 79 46 135 84 -6 21 -31 2 56 114 -54 -6 0 -79 -62 20 -108
$$ packed form
5196a7j91J73M4M9l5R0j21N8n0j1J74j09m7J38r5l6j23P1K7q1J20q2Q1Q7j08k5
5222a9P6l8l7M2M8j84P5J38j60K24j66M2kq1M3J10r0j6j10J43Jl8k8L6L0n8p5
5249i4P4J8m0n8K88l37K50j77K28j25j41K38j63O7J1Qj20m2J02N3n4J34n3q6M9
5274C0q3Q1OJ1J11r6l5j9n0m1J26j35R7R8J27k13Mk1j35O0K48j68J17p4p2L6L8
5301D8p7n1j02J81M7k3K9J2j46K7M0o9Q5Rr9Q4j19J25on5Q8l4M1n2q4J67k4k50
5329b08K51M7k6j91J45k2O1k26L38q9%m4p7n2J85k0p1K09k08o6M9J33j86Q7j75
5354a56J83P3j40J32j69o6pJ42j4R1P1k21J30O8q3j32J75J4o4q0j3R7m9K7R0r6
5380Cj69K14J6j14J03rq7Q3J18k38J59l3Q9n1r0K7n2L3N4N8j68M8Op9J7Q2j28
$$ plain form
5407 -108 35 141 -117 39 18 44 -5 22 -124 -111 12 -226 -66 -64 -96 140 11 183 138 42 57 -4 2 -41 -73
5432 -73 -108 -16 127 -81 -126 -46 -213 -22 -134 76 37 -34 -72 66 -43 5 1 -1 52 76 -3 -67 -21 -163 44 26
5458 26 90 33 -62 96 -39 -159 92 10 140 -128 175 15 -46 33 26 -200 29 -51 -31 109 -108 135 -58 78
5482 78 53 55 18 -221 148 -77 6 163 -40 -29 -205 -113 49 -104 8 6 150 41 -3 252 -175 -96 -56 78
5506 78 61 -19 35 59 147 -73 -57 9 -158 -75 -97 -112 36 -87 116 55 -175 131 127 33 -48 -19 36 126 -62 -24 -188
5533 -188 -78 -1 78 15 -6 165 -47 -10 62 -255 114 19 -22 137 47 -1 81 -48 -10 -29 40 -22 -47 58 95 51
5559 51 -1 74 43 -8 157 21 72 -189 -31 -84 3 203 47 -9 60 -41 18 -94 16 145 180 4 -91 83
5583 83 33 40 79 145 63 25 52 140 -74 -29 145 -138 19 95 -81 78 0 -21 -86 47 25 50 167 -151 95 12
$$ packed form
5407a08J43J06k58J56k1K6m9K7j46J3J23k38J60Kl2K36j29J72m5r6J5o1Om3l2
5432g3l5R2J43k08m5Q0j67J91j12K10l9p1l8J38j09M8mkN3K4p9o4M6j42K07j8
5458B6O4n7r5J58j35j20K51q2J30k68L03j60o1P9pk26K29q0K0J40k17K43j93J36
5482G8k5Kl7k39L69k25Q3J57k03J1j76R2J62j53J12kJ44j09m4K55m27P9M0J34
5506G8j7q0N4K4Q8k20J6O6j67Q3k2j5J48j23K03o1k30L06mr4q1K9N5R0j88L8j64
5533a88J10P7P9o3k1J71k12L7P2l17L69r5m1J59r0m8Q2j29L8j9O9o2k5J05L7m4
5559E1n2P5l1n1J65j36N1k61J58n3Q7K00j56n6O9j01N9j12J10J29L5j76r5J74
5583H3n0PL9O6q2l8K7Q8k14M5J74k83J57P6j76J59p8k1o5J33k2K5J17l18K46q3
$$ plain form
5609 12 139 -17 -99 -84 -18 99 -195 -45 36 103 44 197 139 -65 -14 30 -120 -133 96 -174 13 35 1 114
5633 114 23 48 29 164 18 135 22 61 10 0 85 196 139 14 -90 -41 71 -129 104 -81 -37 5 -71 -54
5657 -54 -69 -20 -12 -80 -47 111 107 54 254 38 -191 155 114 44 125 -76 158 79 -100 -79 -68 -5 174 45 105 61
5683 61 154 133 80 -45 -40 -22 -63 27 30 86 -16 -6 107 -109 2 88 -26 -21 -75 -34 194 -9 71 -7 30 -89 31
5710 31 65 80 123 -141 103 10 -38 -102 -99 42 38 176 60 102 2 -166 5 97 -45 5 5 -58 134 -3 -9 96
5736 96 -78 34 6 133 0 -60 -68 -274 49 32 86 -135 48 37 37 -62 29 134 173 -13 95 -51 -21 15 40
5761 40 222 46 26 41 -88 116 33 56 19 77 30 42 59 131 -229 -86 64 -16 57 16 -89 -6 -100 -50 71 -115
5787 -115 76 135 -19 -38 -102 57 -76 118 11 8 100 -188 25 134 -110 -45 -9 109 127 -31 -76 38 -83
$$ packed form
5609A2J27j56q2J5O6J17k94J50Q1O7n9J53n8k04N1M4j50j3K29k70J87K2l4J13
5633A14r1K5j9J35j46J17j13L9n1j0Q5J11n7j25j04M9J12k00K33j85M4M2p6J7
5657e4j5M9Qo8L3J58mn3K00k16k29L46m1p0Q1k01K34p9j79K1J1O3J79j29O0m4
5683F1R3k1n3j25NJ8m1R0LN6j02J0J13k16J11Q6j14Nn4M1K28k03Q0p8L7j19J20
5710C1L4J5M3k64K44r3m8o4LJ41mJ38j16M2j00j68J71R2j42N0%o3J92j37oJ05
5736I6j74J12k8J27j33o0qk06L23j7N4k21J83j1%r9R1J05L9j86J08j46L0L6K5
5761D0J82j76k0J5j29K04q3K3l7N8m7J2J7P2l60J43J50q0P3m1j05Q3r4N0J21j86
5787a15J91N9j54j9o4J59j33J94j07lR2k88K13J09k44O5L6J18J8j58m5J14j21
$$ plain form
5810 -83 -14 42 70 -3 149 44 -16 -2 34 182 70 -114 62 67 28 89 -72 38 -57 97 59 -21 -25 -177 60 48
5836 48 -38 -132 35 -17 -6 -8 -200 211 -13 56 -193 -56 66 77 36 -104 64 -71 -45 -82 -193 -138 55 -21 -62
5861 -62 83 -15 174 -23 69 112 -30 -21 -86 16 -42 8 145 25 -59 -99 176 46 -88 -93 54 98 -53 -94 79
5886 79 33 -50 65 -133 110 -84 -122 82 -59 66 -26 -3 -24 -6 55 128 -73 -196 25 -71 20 161 89 -51
5910 -51 -157 63 -40 -111 -66 -24 -52 137 142 156 5 50 -60 7 -113 -28 -117 65 -81 -200 -67 -106 -100 -79 -191
5935 -191 -56 -39 186 -12 4 132 70 108 -59 31 7 71 51 28 126 -118 103 -30 -46 90 -97 129 95 1
5959 1 -110 136 187 185 -70 79 16 72 105 -50 2 88 -32 129 -55 44 262 11 -36 106 -51 -134 -65 -170 -145
5984 -145 -64 -90 -129 -116 -7 13 -121 -36 26 -126 -83 -6 123 -146 -45 -126 142 49 -22 108 -61 -47 -58 4 70
$$ packed form
5810h3O9N6K8p3J52j05o0J4L6J48j12j84J76Nl9O1j61J10r5J54l8q0mj52K37j2
5836D8q6r4J67n2J1kj92M11k24O9k49J37J22J1m1j40J68j35K6l7j11N5J93p6m1
5861f2J45r8J89j97R2M3j42Ro5J02n8N0J37j20q4m0K75j30j34nJ47M4j51m1J73
5886G9m6q3J15j98K43j94l8K04j41J25r2K3k1J8O1P3k01j23K21r6R1J41p2j40
5910e1j06K20j03p1M5M2k8J89NJ4j51M5j10O7j20Q5q9J82j46j19J33l9OK1j12
5935a91J35J7K25j98J6J28o2L8j67R0k4O4k0k3R8k44K21j33j6J36j87K26l4r4
5959Aj11K46N1kk55J49o3N6L3j55N2Q6j20J61j84R9K18k51m7J42j57q3O9j05K5
5984a45Q1k6l9J3J09K0j34Q5O2j52M3P7J29k69J01q1K68r3p1J30j69J4j1O2O6
$$ plain form
6009 70 17 120 123 15 71 -140 -8 65 5 112 -38 6 7 -16 -16 -42 -133 -8 -98 -28 -95 -1 -43 -5 -49 -70 -45 -22
6037 -22 33 -50 -16 35 19 59 125 107 -71 -45 -68 -151 -131 127 28 89 128 -144 22 -92 14 -48 -29 63 75 -53 -205
6064 -205 254 186 -37 108 -73 -24 131 -37 92 -112 -6 24 -105 -36 -89 155 -208 -52 -7 60 71 84 -17
6087 -17 -2 -116 -96 -68 5 6 -155 -98 -174 219 -4 -152 -49 21 93 281 -90 31 -106 -57 160 250 -66 53
6111 53 -131 -141 -18 114 6 56 67 113 73 89 -88 145 -100 12 -106 24 -59 103 -2 -128 -69 84 109
6134 109 47 138 131 104 -2 -64 11 -13 62 67 -23 56 250 11 -87 -11 -78 74 39 -24 1 -57 -41 9 62 19 32 -12 55
6163 55 -1 -24 -166 93 39 39 -28 -54 25 90 -91 -15 13 -144 -19 53 -2 50 -91 -24 94 30 -14 78 162 7 140
$$ packed form
6009G0n3J03Lj08N6k11J32P3o0J07j50M4Jk3%k6r1J25r0P0o7R4m2L8m4k1K5K3
6037b2N5q3L4N1j6M0O6j8j78K6k3q3K0K58r9O1L9k72J66j14J06o2J9R2J2j28j52
6064b05M59o8k23J45j81M9J55j68J29k04J06L0j29O9n3K44l63J56M5O7J1J3j01
6087a7J5j14K0K8P3Jj61N7p6L93k23j48J03P0P2J88l71J21j37M9K17R0l16J19
6111E3j84j0J23J32j08N0J1M6m0J6j77K33k45J12j18J30q3J62j05j26N9J53K5
6134A09o2R1pk7j06o2P5k4P5Nr0P9J94k39r8P6o7J52l5o3K5n8J6N0N3m3J3m4O7
6163E5n6k3j42K59n4%o7k6P9O5j81P6K8j57J25P2n5N2j41O7J18o4m4R2Q4j55J33
$$ [...]
8191a25
##END NTUPLES=NMR FID
##END=
