##TITLE=1H_AM_NV 183
 200.13MHz, ,
 8 sc
 
 4.4.2025
##JCAMPDX= 6.0         $$ Bruker NMR JCAMP-DX V2.0
##DATA TYPE= NMR FID
##DATA CLASS= NTUPLES
##ORIGIN= UXNMR, Bruker Analytische Messtechnik GmbH
##OWNER= pz
$$ XWIN-NMR		Version 3.5
$$ Fri Apr  4 13:51:50 2025 Russian Standard Time (UT+4h)  she@DPX200
##.OBSERVE FREQUENCY= 200.1313
##.OBSERVE NUCLEUS= ^1H
##.DELAY= (6, 6)
##.ACQUISITION MODE= SIMULTANEOUS
##.ACQUISITION SCHEME= undefined
##.AVERAGES= 8
##.DIGITISER RES= 18
##SPECTROMETER/DATA SYSTEM= spect
##.PULSE SEQUENCE= zg30
##.SOLVENT NAME= CDCl3
##.SHIFT REFERENCE= (INTERNAL, CDCl3, 0, 14.3821)
##AUDIT TRAIL= $$ (NUMBER, WHEN, WHO, WHERE, WHAT)
$$ ##TITLE= Audit trail, XWIN-NMR		Version 3.5
$$ ##JCAMPDX= 5.01
$$ ##ORIGIN= Bruker BioSpin GmbH
$$ ##OWNER= she
$$ F:/spectra/data/she/nmr/H-C/1/audita.txt
$$ ##AUDIT TRAIL=  $$ (NUMBER, WHEN, WHO, WHERE, WHAT)
(   1,<2025-04-04 13:50:13.82 +0400>,<she>,<DPX200>,
      <created by zg, POWCHK disabled, PULCHK disabled
       configuration hash MD5:
       00 E9 B6 7A A2 85 ED C7 34 08 36 98 17 FE 4E 26
       data hash MD5: 16K
       07 48 8F 7B 30 D5 87 6A AB EB 5F 5E D9 12 87 58>)
$$ ##END=
$$ 
$$ hash MD5
$$ D1 1C 7A 24 74 FD B7 2E A1 9C 4A 94 21 2A 07 73
##$RELAX= 
##$RELAX= 
##$RELAX= 
##$RELAX= 
##$RELAX= 
##$RELAX= 
$$ Bruker specific parameters
$$ --------------------------
##$DU= <F:/spectra>
##$EXPNO= 1
##$NAME= <H-C>
##$PROCNO= 1
##$TYPE= <nmr>
##$USER= <she>
##$AMP= (0..31)
100 100 100 100 100 100 100 100 100 100 100 100 100 100 100 100 100 100 
100 100 100 100 100 100 100 100 100 100 100 100 100 100 
##$AQSEQ= 0
##$AQ_mod= 1
##$AUNM= <au_zg>
##$AUTOPOS= <>
##$BF1= 200.13
##$BF2= 200.13
##$BF3= 200.13
##$BF4= 200.13
##$BF5= 200.13
##$BF6= 200.13
##$BF7= 200.13
##$BF8= 200.13
##$BYTORDA= 1
##$CFDGTYP= 0
##$CFRGTYP= 5
##$CHEMSTR= <none>
##$CNST= (0..31)
1 1 145 1 1 1 1 1 1 1 1 1 1 1 1 1 1 1 1 1 1 1 1 1 1 1 1 1 1 1 1 1 
##$CPDPRG= <>
##$CPDPRG1= <>
##$CPDPRG2= <>
##$CPDPRG3= <>
##$CPDPRG4= <mlev>
##$CPDPRG5= <mlev>
##$CPDPRG6= <mlev>
##$CPDPRG7= <mlev>
##$CPDPRG8= <mlev>
##$CPDPRGB= <>
##$CPDPRGT= <>
##$D= (0..31)
0 0.7 0 0 0 0 0 0 0 0 0 0.03 0 0 0 0 0 0 0 0 0 0 0 0 0 0 0 0 0 0 0 0 
##$DATE= 1743760213
##$DBL= (0..7)
120 120 120 120 120 120 120 120 
##$DBP= (0..7)
150 150 150 150 150 150 150 150 
##$DBP07= 0
##$DBPNAM0= <>
##$DBPNAM1= <>
##$DBPNAM2= <>
##$DBPNAM3= <>
##$DBPNAM4= <>
##$DBPNAM5= <>
##$DBPNAM6= <>
##$DBPNAM7= <>
##$DBPOAL= (0..7)
0.5 0.5 0.5 0.5 0.5 0.5 0.5 0.5 
##$DBPOFFS= (0..7)
0 0 0 0 0 0 0 0 
##$DE= 6
##$DECBNUC= <off>
##$DECIM= 32
##$DECNUC= <off>
##$DECSTAT= 4
##$DIGMOD= 1
##$DIGTYP= 9
##$DL= (0..7)
0 120 120 120 120 120 120 120 
##$DP= (0..7)
150 150 150 150 150 150 150 150 
##$DP07= 0
##$DPNAME0= <>
##$DPNAME1= <>
##$DPNAME2= <>
##$DPNAME3= <>
##$DPNAME4= <>
##$DPNAME5= <>
##$DPNAME6= <>
##$DPNAME7= <>
##$DPOAL= (0..7)
0.5 0.5 0.5 0.5 0.5 0.5 0.5 0.5 
##$DPOFFS= (0..7)
0 0 0 0 0 0 0 0 
##$DQDMODE= 0
##$DR= 18
##$DS= 0
##$DSLIST= <SSSSSSSSSSSSSSS>
##$DSPFIRM= 0
$$ [...]
##$SUBNAM0= <"">
##$SUBNAM1= <"">
##$SUBNAM2= <"">
##$SUBNAM3= <"">
##$SUBNAM4= <"">
##$SUBNAM5= <"">
##$SUBNAM6= <"">
##$SUBNAM7= <"">
##$SUBNAM8= <"">
##$SUBNAM9= <"">
##$SW= 18.0517328524113
##$SWIBOX= (0..15)
0 0 2 0 0 0 0 0 0 0 0 0 0 0 0 0 
##$SW_h= 3612.71676300578
##$TD= 16384
##$TD0= 1
##$TE= 0
##$TE2= 300
##$TE3= 300
##$TEG= 300
##$TL= (0..7)
0 120 120 120 120 120 120 120 
##$TP= (0..7)
150 150 150 150 150 150 150 150 
##$TP07= 0
##$TPNAME0= <>
##$TPNAME1= <>
##$TPNAME2= <>
##$TPNAME3= <>
##$TPNAME4= <>
##$TPNAME5= <>
##$TPNAME6= <>
##$TPNAME7= <>
##$TPOAL= (0..7)
0.5 0.5 0.5 0.5 0.5 0.5 0.5 0.5 
##$TPOFFS= (0..7)
0 0 0 0 0 0 0 0 
##$TUNHIN= 0
##$TUNHOUT= 0
##$TUNXOUT= 0
##$USERA1= <user>
##$USERA2= <user>
##$USERA3= <user>
##$USERA4= <user>
##$USERA5= <user>
##$V9= 5
##$VALIST= <valist>
##$VCLIST= <CCCCCCCCCCCCCCC>
##$VD= 0
##$VDLIST= <DDDDDDDDDDDDDDD>
##$VPLIST= <PPPPPPPPPPPPPPP>
##$VTLIST= <TTTTTTTTTTTTTTT>
##$WBST= 1024
##$WBSW= 4
##$XGAIN= (0..3)
0 0 0 0 
##$XL= 0
##$YL= 0
##$YMAX_a= 351970
##$YMIN_a= -442106
##$ZGOPTNS= <>
##$ZL1= 120
##$ZL2= 120
##$ZL3= 120
##$ZL4= 120
##$ABSF1= 10
##$ABSF2= 0
##$ABSG= 5
##$ABSL= 3
##$ALPHA= 0
##$AQORDER= 0
##$ASSFAC= 0
##$ASSFACI= 0
##$ASSFACX= 0
##$ASSWID= 0
##$AUNMP= <proc_1d>
##$AZFE= 0.1
##$AZFW= 0.1
##$BCFW= 1
##$BC_mod= 2
##$BYTORDP= 1
##$COROFFS= 0
##$CY= -3
##$DATMOD= 1
##$DC= 2
##$DFILT= <>
##$DTYPP= 0
##$F1P= 0
##$F2P= 0
##$FCOR= 0.5
##$FTSIZE= 0
##$FT_mod= 4
##$GAMMA= 1
##$GB= 0.15
##$INTBC= 1
##$INTSCL= 1
##$ISEN= 128
##$LB= 0.25
##$LEV0= 0
##$LPBIN= 0
##$MAXI= 10000
##$MC2= 0
##$MEAN= 0
##$ME_mod= 0
##$MI= 1.114404
##$NCOEF= 0
##$NC_proc= 0
##$NLEV= 6
##$NOISF1= 3.799351
##$NOISF2= 2.8
##$NSP= 1
##$NTH_PI= 0
##$NZP= 0
##$OFFSET= 14.38212
##$PC= 1
##$PHC0= -738.7439
##$PHC1= 5.992207
##$PH_mod= 1
##$PKNL= yes
##$PPARMOD= 0
##$PSCAL= 0
##$PSIGN= 0
##$REVERSE= no
##$SF= 200.129724274929
##$SI= 16384
##$SIGF1= 3
##$SIGF2= 2
##$SINO= 400
##$SIOLD= 16384
##$SREGLST= <1H.CDCl3>
##$SSB= 0
##$STSI= 0
##$STSR= 0
##$SW_p= 3205.1282051282
##$SYMM= 0
##$S_DEV= 0
##$TDeff= 0
##$TDoff= 0
##$TI= <>
##$TILT= no
##$TM1= 0
##$TM2= 0
##$TOPLEV= 0
##$USERP1= <user>
##$USERP2= <user>
##$USERP3= <user>
##$USERP4= <user>
##$USERP5= <user>
##$WDW= 1
##$XDIM= 8192
##$YMAX_p= 0
##$YMIN_p= 0
$$ End of Bruker specific parameters
$$ ---------------------------------
##NTUPLES= NMR FID
##VAR_NAME=  TIME,          FID/REAL,        FID/IMAG
##SYMBOL=    X,             R,               I
##VAR_TYPE=  INDEPENDENT,   DEPENDENT,       DEPENDENT
##VAR_FORM=  AFFN,          ASDF,            ASDF
##VAR_DIM=   8192,          8192,            8192
##UNITS=     SECONDS,       ARBITRARY UNITS, ARBITRARY UNITS
##FACTOR=    0.0002768,     1,               1
##FIRST=     0,             0,               0
##LAST=      2.2672688,     0,               0
##MIN=       0,             -442106,         0
##MAX=       2.2672688,     351970,          0
$$ Real data points
##PAGE= N=1
##DATA TABLE= (X++(R..R)), XYDATA
0@%%%%%%%%qJ6j6J7k5M0m8N6p2Q9j13J42j68K01k40K83l37L97m63N36o18P13q20
31d38R36j066J211j369J546j742J955k189K447k728L035l371L736m134M572n052
47b651N574o144O765p448Q204r040R968j0997J2148j3451J4934j6635J8616k0958
61a1115K3770k7226L1595l7318M5190n6805P5957j15193L28523l59367k1799M75758
73C51970n23680K2488K23327j9327l52690M30304j62835k92574N20484j71739
83B5728k63302L80321m3352l66280L05634J01537l79674L21573Q7592k87742J19158
94A193K87625l76979m0960M39954m14461l8516L13905j82703r1774J62197j4370
105D5111j87683K91874j28567j66810L08663j70505j81328J94430R7520l02842
$$ plain form
0 0 0 0 0 0 0 0 0 0 -8 8 -8 9 -16 24 -24 32 -40 49 -64 78 -90 111 -129 154 -183 214 -249 287 -331 382 -438
31 -438 498 -568 643 -726 820 -922 1033 -1156 1291 -1437 1598 -1773 1963 -2171 2401 -2651
47 -2651 2923 -3221 3544 -3904 4300 -4740 5228 -5769 6379 -7072 7862 -8773 9843 -11115
61 -11115 12655 -14571 17024 -20294 24896 -31909 44048 -71145 257378 -101989 -123788 351970
73 351970 -171710 -149222 74105 54778 -297912 132392 -30443 -323017 197467 25728
83 25728 -237574 142747 99395 -266885 38749 140286 -239388 82185 169777 -117965 1193
94 1193 288818 -88161 -129121 310833 -103628 -142144 171761 -10942 -102716 59481 45111
105 45111 -142572 149302 20735 -146075 162588 -7917 -189245 5185 102705 -200137
115b00137J77377J70026l47397K07511N8344j53491P5866R7478q4668q8338K35630
126A48201j15591m0455J49534r7145k629R736m9711k1179O9223j16751m0415R7296
138i886n7491j9451K5100J29698j05615k4176J06773p9846M9010n5996Q7372p085
150C8407r7628J33217o5178J6143L6553N246l9031l2333Q4534j29050P298P6035
162C4213q1163q400O4809k9608k0193J09420j11260n92J32435j37915m6294J60821
174F6273m1263j88581J99730L9309k17159J92806N5118j71883R3703Q3198j74977
185f3726O6645J43641k12435O0125J38966k01893J5260J73237j66456n1060K25797
196A28101j91775r8813K64598j37317j44296K59741k0864k27779K16565O3188
$$ plain form
115 -200137 -22760 147266 -200131 7380 65724 -87767 -11901 85577 909 -87429 148201
126 148201 32610 -7845 141689 44544 41915 51651 1940 -19239 49984 -66767 -107182 -9886
138 -9886 -67377 -86828 -61728 67970 -37645 -61821 44952 -34894 14116 -41880 45492 38407
150 38407 -59221 73996 8818 24961 61514 66760 27729 -4604 79930 -49120 -41822 34213
162 34213 -46950 -55350 9459 -20149 -40342 69078 -42182 -42774 89661 -48254 -94548 66273
174 66273 25010 -163571 36159 75468 -141691 51115 106233 -65650 28053 111251 -63726
185 -63726 2919 146560 -65875 -5750 133216 -68677 -53417 119820 -46636 -97696 128101
196 128101 -63674 -162487 102111 -35206 -179502 80239 59375 -168404 48161 111349
206A11349k42002J68296Q9894k15844J20548J07767k30732J00113J47871k53332
216i6072O7054J97186k37633k5853K44221k06141j04215K89790j52689j37833
226a62185K72560q1502j92325K22883J4143k24063J96575N6541k22866J50420
236C0181N9043j97624J18573J12299k07649Q3906J62756k39354L0151J94875j92821
247d5664l9572K06967j20221j13436J95820p4027j33796J75184l5614j23994J39379
258C1026J92j29688J12517L1360j38076J10145N7691j43860R2494P7013j52361
269e1547M1627J10864j27088j0680J34534r2085o0002J08418n7082n7175Q3614
280B3398j8763m4346N2745j8700n4037N8911l898m4615P0724j492n5666M0359
$$ plain form
206 111349 -130653 37643 127537 -88307 32241 140008 -90724 9389 157260 -96072
216 -96072 -29018 168168 -69465 -95318 148903 -57238 -161453 128337 -24352 -162185
226 -162185 110375 28873 -163452 59431 73574 -150489 46086 102627 -120239 30181
236 30181 89224 -108400 10173 122472 -85177 -1271 161485 -77869 -47718 147157 -45664
247 -45664 -85236 121731 1510 -111926 83894 9867 -123929 51255 15641 -108353 31026
258 31026 31218 -98470 14047 45407 -92669 17476 75167 -68693 23801 100814 -51547
269 -51547 -9920 100944 -26144 -36824 97710 5625 -54377 54041 -3041 -60216 23398
280 23398 4635 -39711 13034 -5666 -59703 -792 -4690 -49305 21419 19927 -35739 4620
292D620J8394m6075K2333M9068m0045p105L2110k1128j5143P835J7317j0394j9551
305g764J8916K115l0514l226K7877k4930j5615M1366k0799j5704L0488k0186p397
318b5373L7431j4314j2493N4293k8617m2180P6241k0899o3880Q4227L836r6570
330d8298O1946M3907j07128L9721P3224j05414J1216Q0817q5662k135Q5704p7880
342b9982k0996R5979p3438l0046J22605o9275o3647J30156m7139r4364J37548
353E7401J300j31311J09400L6114j47506Q6584P4122j34824M7213Q0856j30514
364e1165J6933J03604j20335M710J17348j24748j8357J38227r8582n2332J62307
375G7610o9154j03102J67147l0490j28338J39505J2678j41322J00636N6431j43727
$$ plain form
292 4620 23014 -23061 -728 48340 8295 1190 33300 12172 -2971 4864 22181 11787 -7764
305 -7764 11152 13267 -17247 -20473 7404 -17526 -33141 8225 -12574 -28278 2210 -17976 -25373
318 -25373 12058 -2256 -14749 39544 10927 -31253 44988 24089 -39791 44436 48272 -48298
330 -48298 13648 57555 -49573 -9852 63372 -42042 -30826 49991 -35671 -37806 47898 -29982
342 -29982 -50978 45001 -28437 -58483 64122 -5153 -68800 61356 14217 -80147 57401
353 57401 58701 -72610 36790 72904 -74602 11982 86104 -48720 -1507 79349 -51165
364 -51165 -34232 69372 -50963 -46253 71095 -53653 -72010 66217 -32365 -84697 77610
375 77610 8456 -94646 72501 42011 -86327 53178 65856 -75466 25170 81601 -62126
386f2126P6759O5619j43581N4588P6913j23080K6431J03214j29152p518J33819
397G1886j15555j8263J42673q2641p1081J27728l4208j07198J32085k874j12322
408f9770R4318R231q8865O5296M4675r0382N2632M7323j13240N2799N3473r8124
420d0634K4251P5304q4271j8317R9552p4805l4273Q9841m6306m2802O9707p523
432I724o0753N6642N961m6880N3381J0941l1280K7433M280m9643L2496K2326n1853
445a7225L0299J9392m7290j2101L8504j4872k3567M0652j8130j7481M278N30J0277
458f734j588J7463o34k499n850R671o74j7393K4697j4706j2443R649O008q680
472c713P680J4473l1247M0486j7541l4991N5718k6416l9838K6583L3783o1870
$$ plain form
386 -62126 14633 80252 -63329 -8741 68172 -54908 -28477 74737 -54415 -61933 71886
397 71886 -43669 -61932 80741 -1900 -72981 54747 20539 -86659 45426 42552 -69770
408 -69770 24548 33779 -55086 10210 54885 -35497 17135 64458 -48782 4017 57490 -40634
420 -40634 -16383 58921 -25350 -43667 55885 -18920 -53193 36648 -9658 -52460 17247 9724
432 9724 -51029 5613 11574 -35306 18075 29016 -2264 25169 29449 -20194 12302 34628 -17225
445 -17225 13074 32466 -14824 -26925 11579 -3293 -26860 13792 -4338 -21819 -17541 -17011 -6734
458 -6734 -8322 9141 8507 6008 158 9829 9155 -8238 16459 1753 -10690 -1041 4967 -3713
472 -3713 3967 18440 -12807 27679 10138 -24853 30865 4449 -35389 -8806 24977 -36893
484c6893J3649P3049q0261J3802N1047n6370p09M5205l6478k5742P1884l6550
496d367k8138P8251k8314l9033O7185j0888o5729P3759j1377r2676P0937J8024
508B7634r4375N1322P2363j04482J5502Q0661q5476M215P4849n4032k3614Q7278
520E1845o9442l4517J25815p6357l3530J04676m7455p3923Q1117R159j11288J01866
532B7966J9083j22123R3827K8893j06274N0877P0015j02023J5184P7417q5692
543c2850K623O8467n9700j8037J00059p4468l8429J25166q5012m6226R4760j5435
555B0918p1888O3754M7443j11331P3783L3759r9707O8200J8642p5806J5375N4342
567C7484p9101N29P7307p3193J3641N5985n0216q738P0947m9392m2700J00715
$$ plain form
484 -36893 -23244 49805 -30456 -16654 34393 -21977 -22686 22519 -13959 -39701 32183 -4367
496 -4367 -32505 45746 17432 -21601 45584 34696 -31033 42726 31349 -61327 9610 27634
508 27634 -66741 -15419 56944 -47538 -32036 48625 -36851 -32636 42213 -11819 -35433 51845
520 51845 -17597 -52114 73701 -2656 -36186 68490 21035 -52888 28229 37388 -73900 27966
532 27966 47049 -75074 18753 47646 -58628 -7751 62264 -39759 -24575 52842 -32850
543 -32850 -30227 38240 -21460 -39497 60562 -13906 -52335 72831 -12181 -58407 36353 20918
555 20918 -50970 12784 60227 -51104 22679 56438 -43269 24931 43573 -32233 -16858 37484
567 37484 -41617 -41088 36219 -36974 -23333 32652 -17564 -26302 44645 -4747 -47447 53268
579E3268n2609m4859P1938m403m4172K7955L3841n6432L1366O148m5202L3602
591A0441o552l0233P984L8507m4920N489M7160m4167J6620R663o458j3000J8218
604H752R20m5338N3267j5852k1696K4967K680M410k4237K1953j452n075n640m56
618b797K2672k4589L870K307P115r341n117P785p848J4314l9282K8457R974l7445
632b9925L4537l093l847m185K7449k6412j1370O1440o1220M411M6845k9166k2646
645a7182L0043J0235m9283M4320j1865k9462M2692k9485k3160L5477J6604o1803
657d2869M4034M2976q2567L5970L3758m7712M364M5249m0988k1584P0239n5719
669a4849j7209P2639l4580l2392N3253q669n3566O0230j2117n2415O7612j3976
$$ plain form
579 53268 659 -44200 27738 23335 -20837 7118 40959 -15473 15893 22041 -23161 10441
591 10441 3889 -26344 -18360 20147 -24773 -19284 27876 -16291 329 9992 3534 -9466 8752
604 8752 9672 -35666 17601 1749 -19947 5020 7700 12110 -12127 9826 8374 3299 -2341 -2797
618 -2797 19875 -4714 -844 1463 8578 -763 -5880 1905 -5943 8371 -30911 -2454 7520 -29925
632 -29925 4612 1519 -2328 -6513 20936 -5476 -16846 44594 -16626 -12215 34630 5464 -17182
645 -17182 12861 23096 -26187 18133 6268 -23194 19498 -9987 -33147 2330 18934 -42869
657 -42869 1165 44141 -38426 -2456 31302 -16410 -12046 33203 -7785 -29369 40870 -14849
669 -14849 -32058 40581 6001 -26391 26862 18193 -35373 24857 12740 -39675 27937 13961
681A3961o2107N9547K7007q8687M5147N5906r0649K2535N3999n8074l340N9212
693C4457m9714j3754P5261n8964j2980P1277m1425l3446O1033j2710n9494O8788
705B8329j0097o3690O9188l262o4360M4962L4136p4873K2936N9546o9274R218
717a7241M4522m3495p88M1784l0840j0335N5538m7242k0059O2354l4584k5523
729b5909N3243q901m7154M0594M767m9729M3490J2417m6400K4440J8631m2454
741b2965R851L1687l0300M699K1379k5797L518J9777k2208J286L2282k6245j3175
754a6211L6680j5793k0878K7192K755k1368J0175Q305j6104K533O754q756K519
767b197M598o026R68n59k069M271k444J899N173l687k767J339J918J051o8r04
$$ plain form
681 13961 -48146 11401 38408 -50279 -5132 50774 -39875 -17340 36659 -21415 -24755 34457
693 34457 -15257 -29011 46250 -12714 -25694 45583 4158 -29288 31745 19035 -40459 28329
705 28329 18232 -45458 23730 20468 -43892 1070 35206 -39667 -16731 42815 -26459 -17241
717 -17241 27281 -16214 -17002 24782 -6058 -16393 39145 -8097 -28156 34198 -386 -25909
729 -25909 27334 18433 -28721 11873 16640 -33089 10401 22818 -23582 858 19489 -22965
741 -22965 -13114 18573 -11727 -7028 14351 -11446 -7928 11849 -10359 -9073 23209 -3036 -16211
754 -16211 20469 4676 -16202 10990 13745 -7623 2552 10857 -5247 -2714 4040 -4716 -2197
767 -2197 2401 -3625 -2657 -3216 -5285 -1014 -3458 -1559 3614 -73 -2840 -1501 417 1468 1400 496
783D96O106p01j4022R326J3238k0639Q35K4033k1642j1795K7414j0986j6453K2708
797G918k792k2268K0217L140k5164K3768M181k7611K3153O832k9060K0600J6618
810A9532l6380J5596K9722m3203N453M0315l9263j1185M6056k5462k5202M4042
822B0021j5887l0693L9421q344k9199L7457k738l6926L6281O344m5850L7615J9033
835B6535n4243K7638L0423n4832J3384M5777m7448n875N2296l9550j9681N3918
847B8342k7597k4213M7751k0060l0389M4234j0087l8361M8261k389n0359M5878
859A1011P895n3653L4516K7662n2972J5835M2988n1757L920M6224l9771m558L9161
872B6501k5981j8236L8530j9711k3218M4972k0616k4391L9744j3336l1495L4479
$$ plain form
783 496 6602 5901 -8121 1205 14443 -6196 -5361 18672 -2970 -14765 12649 1663 -14790 7918
797 7918 5126 -17142 3075 6215 -18949 4819 9000 -18611 4542 11374 -17686 2914 19532
810 19532 -16848 -1252 28470 -14733 -9280 31035 -8228 -19413 26643 1181 -24021 20021
822 20021 4134 -26559 12862 4518 -24681 12776 10038 -26888 9393 15737 -30113 7502 26535
835 26535 -27708 -70 30353 -24479 -11095 34682 -12766 -18641 33655 -5895 -25576 28342
847 28342 745 -23468 24283 4223 -26166 18068 7981 -30380 17881 15492 -34867 11011
859 11011 18906 -34747 -231 27431 -25541 -9706 33282 -18475 -14555 31669 -8102 -12660 26501
872 26501 520 -17716 20814 1103 -22115 22857 2241 -22150 17594 4258 -27237 7242
884G242P654m2806L0716J7637m5186K0864K3015l0521N891K7537k5246n921K5967
897A6843k3633k153K2857j7630m870K1661j4592j2706K8995j1493j7077K5608
909A1810m806k2520J5733R651k2975J0530J2787j5939K068P507m210m086P156
922B706m129m72L673p471P691k73p03J615L037K41p818P119m450p0m020J236P130
939E042j6583J0281N119r496q35J1677j966j8919K4663n274j6060J8385k53r551
953c770K968J3487j8169P424J0702k4322J5643L063j8513O647J8787k2398m416
966a2867L5882l1086n891L1630j8234j7040K7639r19l4094L6339j179l0399L0544
979A0325k48k2184J2782J5186l3616J6828K1179m4781K6938J7949l5837R636L2655
$$ plain form
884 7242 14896 -27910 2806 20443 -24743 -3879 19136 -11385 -5494 22043 -3203 -9124 16843
897 16843 -6790 -8943 13914 -3716 -8586 13075 -1517 -14223 14772 3279 -13798 11810
909 11810 7004 -15516 217 9868 -13107 -2577 10210 -5729 -3661 3846 -364 -4450 2706
922 2706 -1423 -1895 1778 -5693 1998 1725 1022 2637 5674 5915 -1903 5216 766 696 -3324 -2088 5042
939 5042 -11541 -1260 3859 -5637 -6472 5205 3239 -15680 8983 3709 -12351 6034 5781 -3770
953 -3770 -802 12685 -5484 1940 12642 -11680 3963 7026 -11487 -4840 13947 -8451 -12867
966 -12867 23015 -8071 -13962 17668 -566 -17606 10033 9114 -24980 11359 10180 -20219 10325
979 10325 10077 -12107 675 15861 -17755 -927 20252 -24529 2409 20358 -15479 -5843 26812
992B6812k9739j6514M8779l2722k0341M1272j9635j9696L0526j474l1210L5729
1004A1787j28l4487L4557K012l2050J9908J9154m2331J8496L0308m9149K0009
1016a914K9427l7419l674L8595k5291k6696M9078k3023k2201L6728j4194j5427
1028a6011K5447j255k7420L3331k418l5562L4191J317k9399J7024J9929l3084
1040a3910P611K8279l6466R567K1688k1623n250K2036q324k0670K8717r276j1500
1053i121J9086r631n845R755j139k0277K2665L467k8581K4927M419j8640L616
1066e299J6447j0890p845K0897j6973r13J0915j1652M395N866j302m763M122j822
1080A183m229M620l770Q5L759n168m506Q114O59k213J310L724M461j4376L688
$$ plain form
992 26812 -2927 -19441 29338 -3384 -23725 17547 -2088 -21784 8742 7268 -23942 11787
1004 11787 11659 -22828 11729 13741 -18309 1599 20753 -21578 -3082 27226 -21923 -1914
1016 -1914 27513 -9906 -13580 25015 -276 -26972 22106 -917 -23118 13610 -584 -16011
1028 -16011 9436 8181 -19239 14092 11674 -23888 10303 11620 -17779 -755 19174 -13910
1040 -13910 -6299 21980 -14486 -4919 16769 -4854 -10104 11932 3608 -17062 11655 2379 -9121
1053 -9121 9965 334 -5511 4244 3105 -17172 5493 8960 -19621 5306 9725 -8915 -5299
1066 -5299 11148 258 -7587 13310 -3663 -4576 6339 -5313 -918 4948 3646 -1117 3005 1183
1080 1183 -3046 1574 -2196 -2111 1648 -3520 -8026 88 747 -1466 -156 3568 8029 -6347 -2659
1095b659J1261r410n780R958L096j6088R901N742r981P227J320o952O74P924j3478
1110g245L222J3299j6093M565O917q045j341J1348p072r214K4492j5597j5610
1123a6374K7348n551k1190J9304J2334k7261R885J2949k1318R715J0793j7686
1135g052O912J5242k8686N373K6200k7866J680K5022k0315j2356K6783j2347j6650
1148a8060L5558j2180k2978K8375j536k7360K0685J5059k9718J3801R978k4839
1160a3215J3835R220k1272J0434K1071l2544J187L3464l0561q182L3161j4738
1172A860j9619K9301o958k2727K9282n773k0616K3199M031k6154J4545J4362k9915
1185a5182J5977J1286k3932J4579P650k1161N530K3278k5032m999L1818k2511
$$ plain form
1095 -2659 8602 -808 -6588 3370 6466 -9622 279 6021 -3960 3267 4587 -2365 -1691 6233 -7245
1110 -7245 -4023 9276 -6817 -2252 4665 -3380 -4721 6627 -445 -9659 14833 -764 -16374
1123 -16374 10974 5423 -15767 3537 15871 -11390 -1505 11444 -9874 -159 10634 -7052
1135 -7052 -140 15102 -13584 -8211 17989 -9877 -8197 16825 -3490 -15846 10937 -1410 -18060
1148 -18060 17498 5318 -17660 10715 9179 -18181 2504 17563 -12155 1646 11624 -13215
1160 -13215 620 9840 -11432 -998 20073 -12471 -11284 22180 -8381 -16563 16598 1860
1172 1860 -17759 11542 4584 -18143 11139 5366 -15250 7949 11980 -14174 371 14733 -15182
1185 -15182 795 12081 -11851 2728 10378 -10783 -5253 18025 -7007 -12006 19812 -2699
1197b699j2197K2968m136j4493J4299J327j5459J5969m519j0625J6427j099j3739
1210g976Q168R920j9085P613J1320j7748P990P257j2570R58J4409j1095q917J8236
1224H480o598r199Q525K396n764K0K501l376O864m813l736R906m462m871K990
1239a137O195n076l949P660l320k082K412R29o86j839L039k594l385P231p01q601
1255e904O615L792r121M84Q312k868o277O926j984k275O195o844K720P455r729
1270b503l821J3392m037j2512J5397j05j4995J0408M321j3178O956J0509j7130
1283g298M969J2617j7348K656J1708r562k315J1386q206n742J6377j3157n718
1296i633K2499j2337j2108K0650k560k0535J6286Q497k1185J1520R906j9361P109
$$ plain form
1197 -2699 -14896 8072 3936 -10557 3742 5069 -10390 5579 1060 -9565 6862 5763 -7976
1210 -7976 192 10112 -8973 -1360 9960 -7788 202 7459 -5111 -4153 10256 -839 -9756 8480
1224 8480 1882 -7317 1208 3604 -2160 -2140 361 -3015 3849 -964 -4700 5206 744 -4127 -1137
1239 -1137 5058 -18 -3967 3693 373 -1709 703 1632 946 -893 2146 -448 -3833 3398 2697 -5904
1255 -5904 711 4503 -4618 -4134 4178 1310 -4967 1959 -25 -2300 3895 -2949 -229 7226 -2503
1270 -2503 -6324 7068 3031 -9481 5916 5811 -9184 1224 5545 -7633 -677 9832 -7298
1283 -7298 -2329 10288 -7060 -4404 7304 -2258 -4573 6813 -1393 -7135 9242 -3915 -9633
1296 -9633 12866 529 -11579 9071 6511 -14024 2262 10759 -10426 1094 11000 -8361 -1252
1309a252J0426j7256N457J4196j8076J051J5997j7468j834J9293j4153n506K1896
1322A2771j2209j3401K3931n726k0087K2247K263k1969J4247O956j7921P441R806
1335H349j5506N831J1618j8508N862J2850j8893K372J6127j3450m946J9620j0229
1348A097j1802J9564o517j2778J6294N62j4891R523M814j4737Q384O188r936O572
1362B337L298j0574L633P605j2382L860J2317j4365p72J1731q167n497J1958j602
1376C380r827Q935m98p760N768K068m147K877K563m642L033M10m717L717O68m082
1392b254J238M654n539j878O720k932k387L417K434n049j927N038k518j980L728
1407G65K690m364k41M739l814n80L418j919l182K297j136j474N165k894q12M968
$$ plain form
1309 -1252 9174 -8082 -2625 11571 -6505 -5454 10543 -6925 -8759 10534 -3619 -9125 12771
1322 12771 562 -12839 11092 5366 -14721 7526 9789 -12180 2067 9023 -8898 -1457 8349
1335 8349 -7157 -1326 10292 -8216 -2354 10496 -8397 -6025 10102 -3348 -8294 11326 1097
1348 1097 -10705 8859 2342 -10436 5858 6420 -8471 1052 5866 -8871 -487 5701 -4235 2337
1362 2337 5635 -4939 -1306 6299 -6083 -2223 10094 -4271 -5043 6688 -1479 -6976 4982 3380
1376 3380 -6447 2488 1990 -5770 -2 2066 -2081 796 3359 -1283 1750 2160 -2557 1160 1828 -2254
1392 -2254 -1016 3638 -1901 -3779 2941 9 -2378 1039 3473 -1576 -3503 1535 -983 -2963 765
1407 765 3455 -909 -1150 3589 -225 -805 2613 694 -2488 -191 -1327 -2801 2364 -530 -1342 3626
1423C626l320m153P993k56j0694R384J160j1512O764O923q968n35J1449j0599
1437b738j472J0975r249k55N830m840l455R932l432p070J4902q703p641J3724
1451F508l526j0327R466N304j8450R537R905j6058O686Q611j0612k368J2171q934
1465b087l212J4039j2526j216J1930q178m026J4455n776j4233J7960m656j4596
1478a2122J7267J517j5915Q703Q972j7478P943J1776j5254L483P703j1491p68
1491e664J2530j0696k47J3626j3222r19J1694o554q862J4675j568j6217J6809
1504E385j502j1949Q122M876p336M29J2185j3537J624O511j2403O321M210l481
1518e45k252Q343p903o137J6601r831n30R999o018q134N228N510j1950J0663L238
$$ plain form
1423 3626 306 -3847 4146 3890 -6804 2580 3740 -7772 -1008 5915 -3053 -3588 7861 -2738
1437 -2738 -4210 6765 -2484 -2739 3091 -1749 -5204 4728 1296 -5774 9128 425 -7216 6508
1451 6508 2982 -7345 2121 7425 -11025 -1488 8417 -7641 -955 7656 -2956 -5324 6847 -2087
1465 -2087 -5299 8740 -3786 -5002 6928 -1250 -5276 9179 3403 -10830 7130 2474 -12122
1478 -12122 5145 6662 -9253 -550 8422 -9056 -1113 10663 -4591 -1108 6595 -4896 -5664
1491 -5664 6866 -3830 -4077 9549 -3673 -4592 7102 548 -8314 6361 4793 -11424 5385
1504 5385 3883 -8066 56 4932 -2404 -1975 10210 -3327 -1703 4808 -7595 -1274 2936 -545
1518 -545 -2797 5546 -2357 -8494 8107 -1724 -2254 7745 1727 -6407 -1179 4331 -7619 3044 6282
1533F282r198L662j294N6j342M604l714O62L015q317O188O77j663r91L614K47
1549B488p067P827k789k309J082J550k3m322Q477n013k239L317q70l24k513O584
1565C856m333j146J920q15K037k783K939k210K224k776k132P165n106j650K264
1580e46M221o812J599R313j1811K908M464n877j87O831j920q067J0569n130n018
1595e463R295k569k156L143j067p494R338j304r509J3462j790j0174M703Q344
1609F759j0403p25J3466j2056L23P000o404o39N761j912p309J1588m178p925J1785
1624E131m233n796P349J493j0289R002L890j6491J0724O181j3472L536J1591j0169
1638a553n045J3552q865j811R700p830l03O796o187n174J2564l966r434J3414
$$ plain form
1533 6282 -2916 746 -548 -492 -1834 2770 -944 -282 2733 -5584 604 1281 -382 -1373 2241 2488
1549 2488 -4579 3248 459 -1850 -768 782 759 -3563 4914 -99 -2338 979 109 -215 -2728 3856
1565 3856 -477 -1623 297 -518 1519 -1264 1675 -535 1689 -1087 -3219 3946 -1160 -2810 -546
1580 -546 3675 -3137 -1538 7775 -4036 -1128 3336 -2541 -2728 4103 2183 -5884 4685 -445 -5463
1595 -5463 3832 1263 -893 2250 1183 -6311 3027 1723 -7786 5676 3886 -6288 -1585 6759
1609 6759 -3644 -4369 9097 -2959 -2636 4364 -2040 -2679 3082 1170 -6139 5449 1271 -6654 5131
1624 5131 898 -4898 2451 3944 -6345 2657 6547 -9944 780 6961 -6511 -2975 8616 -1553
1638 -1553 -6598 6954 -1911 -3722 5978 -1852 -2155 4641 -1546 -6720 5844 1878 -7556 5858
1652E858k680r584Q366K142r366N486N772j1843L920P842r697J76Q915m878l847
1667c418O711k969k828N204m007j663P940n346n324J0414k648q316P493L610q253
1682c400K232O039p997J942M017n808L126K572l073j428L543k006l164N212k488
1697f81M81L070m298L94K853j415l659M641K771o831Q21M308k568l054L391K521
1713B745l017k24J489q56j153M9P2P15J225j097k94J518j261j132J985M48o17
1730E95R12j211l415K344J692m905M419N058o783j905N897j743n132O401J477
1745C701n682K587j388j948L870o79k478M482M74p498M736L245p211L372L981
1760C564o195Q82O520o799j155Q809o394l526Q142j392o187M579Q80n822N055
$$ plain form
1652 5858 3178 -6406 1960 4102 -5264 222 5994 -5849 -1929 5913 -3784 -3608 5307 429 -3418
1667 -3418 3293 324 -2504 2700 -1307 -2970 4970 -376 -5700 4714 2066 -6250 1243 4853 -3400
1682 -3400 -1168 4871 -3126 -1184 2833 -2975 151 2723 -350 -1778 1765 -241 -3405 1807 -681
1697 -681 -200 2870 -1428 -1034 1819 404 -3255 1386 4157 -2674 -1853 2455 -113 -3167 224 2745
1713 2745 -272 -496 993 137 -1016 -967 -895 -180 1045 -52 -346 1172 -89 -1221 764 1212 595
1730 595 1507 296 -3119 -775 917 -3988 431 5489 -1294 -3199 2698 955 -4177 2224 3701
1745 3701 -1981 606 -782 -2730 1140 461 -2017 2465 2939 -4559 177 3422 -3789 -417 3564
1760 3564 -2631 -1749 4771 -2028 -3183 5626 -768 -4294 3848 2456 -3731 848 1728 -4094 961
1775I61k84l840O650j901o933O716L307r883M669P346j0085M85P877o299k041
1790c255P733n352l657Q681m184m201P365k135n605N725J039m888O396r53p514
1805d805O693L20q068O757N769j0173K5P967o837j772Q500k815l467M240l475
1820a141k458N679j819k649N428j463n139N359N31n160M766K57n951L482L088
1835B810o471J322O173n776o73N946j612k564J682P9k458K400j059p05L559m191
1851a538j303L738K81k465K317K339o133J064K613k574J431K232q21l223K477
1866D35P22k602K442R22j282k224P71Q49j226R13O0J051l99j297J014J135j170
1883A14k230L002Q01l475K163K266l883p25L900j792j762L673j315m378K982J186
$$ plain form
1775 961 677 -3163 3487 1586 -5347 1369 4676 -5207 -538 6808 -3277 -2792 5085 -1214 -3255
1790 -3255 4478 -874 -4531 4150 -34 -4235 3130 995 -4610 1115 2154 -2734 3662 2709 -4805
1805 -4805 1888 2208 -5860 897 6666 -3507 -3482 4485 -2352 -4124 4376 1561 -1906 2334 -1141
1820 -1141 -3599 2080 261 -2388 3040 1577 -3562 1797 2328 -2832 1934 2191 -3760 -278 2810
1835 2810 -3661 -2339 3834 -1942 -2615 3331 1719 -845 837 916 -1542 858 -201 -906 2653 -1538
1851 -1538 -2841 897 1178 -1287 1030 3369 -2764 -1700 913 -1661 -230 2002 1181 -2042 435
1866 435 1157 -1445 997 1919 637 -1587 -816 33 -1193 -280 -220 831 432 -865 149 1284 114
1883 114 -2116 886 1687 -1788 375 2641 -1242 -1967 1933 141 -1621 2052 737 -3641 -659 527
1899E27k733L725J059k677M15J6j708J792K066m594K388J787o440K936M778l645
1915c08j766N932l114n166O847j727l734L881M0l221K593K849m792L466P32n798
1931c286M166P13m411K299L617o731L55P872o684n4P596m444m198N415p21n861
1947d357N755J94m655M583k67l629L253R25n079M015K468o630L618L093o800J023
1963b490O580m762j481P384m567m595N177q14l739M771J016m665K959n58l272
1978c056M144Q11l569K995J186o386K968L771n059J725M573m171k415M894k552
1993a41k982M207p35j929J569R09j749J219N61j776K627r17j931J841ql221R18
2010a538L683l678N05L828k341k149K345Q79l689K446J142k552P46J40M20r01
$$ plain form
1899 527 -2206 1519 2578 -99 316 332 -1376 416 2482 -2112 276 2063 -4377 -1441 3337 -308
1915 -308 -2074 3858 744 -4422 2425 698 -3036 845 885 -2336 257 3106 -1686 1780 2512 -3286
1931 -3286 880 1593 -2818 -519 3098 -3633 -3278 4594 -2090 -2144 5452 1008 -3190 2225 1504 -4357
1947 -4357 1398 1592 -3063 1520 1253 -2376 877 1802 -3277 738 3206 -3424 194 3287 -3513 -2490
1963 -2490 4090 -672 -2153 5231 664 -3931 1246 432 -3307 1464 2480 -2185 774 216 -3056
1978 -3056 1088 1899 -1670 1325 2511 -3875 -907 2864 -2195 -470 4103 -68 -2483 2411 -141
1993 -141 -3123 1084 349 -1580 -11 898 -851 368 929 -847 1780 863 -1068 773 765 -2456 -1538
2010 -1538 2145 -1533 -1028 2800 459 -1690 655 1534 -2155 291 1433 -1119 -373 -233 187 -714
2026g14J365J04l79O20k058J442o45q27O49P36L37k331K506L83k519J028K318
2043B015j566k512M134j238l466L045P35k671J039K205k755Q20Q91j909J519N83
2059H69j475R13J925m023J023L125m187Q69K960j703l270M114L89n032N235L33
2075B065l330Q22J669j830j230M200l478J202J775m167K556J400k396j098N477
2090C637m119l598P762m530k291M673P8l906K739L392p121M093J240m694L398
2105G53L34j297o04K223l558N24M560n335K356L384m382j934N003m90m972O033
2121B598p5m947K151J552k665O09L111m128J421J786l568K254J772k482n86L479
2137B282l600k66M906m301n20L414j336l454M290J622n662K930K80j984K28Q82
$$ plain form
2026 -714 651 755 376 996 -1062 380 -265 -1092 -443 293 630 -1701 805 1188 -1331 -303 2015
2043 2015 449 -2063 2071 833 -2633 412 1147 -1524 -485 1720 -1035 -215 676 -1233 286 869
2059 869 -606 307 2232 -1791 -768 2357 -1830 -961 1999 296 -2974 1140 1529 -3503 1732 2065
2075 2065 -1265 -443 1226 -604 -1834 2366 -1112 90 1865 -2302 254 1654 -742 -1840 3637
2090 3637 -482 -4080 3682 -848 -3139 1534 1612 -2294 445 3837 -3284 809 2049 -2645 753
2105 753 1087 -210 -814 1409 -2149 -1625 2935 -2400 -44 3340 -1042 -2976 2027 1537 -3435 2598
2121 2598 2523 -2424 -273 1279 -1386 -777 2334 -1794 -373 1413 -2155 99 1871 -611 -1197 2282
2137 2282 -1318 -1584 3322 -979 -1499 1915 579 -2875 1415 3037 -2625 305 585 -1399 -1171 -289
2153b89J118j186J272k176J626J346l183K386Q82j604j734K442p11k788L415p78
2169C8j094J518J278k738l45L062l312R07K021k3q44j509J398j152J171l25P45
2186G96J729m129m05J290Q10j355J288K867l420q75J440N56j163J552J136l323
2202a206J412o2j513J080J532p17j936K249j084p29J085j264J615J29j607Q10
2218b06K671k194k448M151l98l457K034J841l243n72K325j522N45J515j381L0
2234c09J150j253m89K454j050j273J767j351p60K850j352k076L496j031l963L043
2250a47K453l931j15L773k763p00K671r58N11K87j620R2J973j927j261L795k351
2267b18k159L175m00j918K126P97l628K201J835l719J661K457k279j251K569k32
$$ plain form
2153 -289 829 -357 915 -1261 365 1711 -1472 914 1796 192 -1542 900 189 -2599 816 38
2169 38 -1056 462 1740 -998 -1343 1719 -1593 -686 1335 1312 468 -1041 357 -795 376 51 796
2186 796 2525 -1604 -2009 -719 91 -1264 24 2891 -529 -1404 36 592 -571 981 2117 -1206
2202 -1206 206 144 -1369 -289 1243 526 -1410 839 -245 -974 111 -1153 462 591 -1016 -206
2218 -206 2465 271 -2177 1974 1576 -1881 153 1994 -1249 -1821 504 -1018 -473 1042 -339 -309
2234 -309 841 -412 -901 1553 503 -770 997 -354 -1114 1736 384 -1692 1804 773 -3190 -147
2250 -147 2306 -1625 -1740 2033 -730 -1430 1241 283 794 1081 -539 -447 1526 -401 -1662 2133 -218
2267 -218 -2377 798 398 -1520 606 1403 -2225 -24 1811 -1908 -247 2210 -69 -1320 1249 1017
2283A017j746J560j051j66R11k152P65K294j857j814L215L61l237K628J639l163
2299g96M50J289j575J49J656j158r14J676j098q51J759l45l10K2p05J40J008n84
2317a87p44K896q33k695K204R83k222n04K572j185j896J614l89k13J98L28M56
2334C83J10R2j097R76l78q64J464k92l04K75M0j411M19J894j925j33K001j125
2352A25k131J401J724j772K83J740n74j072K24L96j12j4o34M84L62j347J38J328
2370E49o41p88J642l82j286J394J29j661R88J404j915J47J875j136j105Q24L55
2387C93j033L27J21P3N39j442M97J543r16q81J952J91k723J307R23j895N74J527
2405A077j020q12J702j202p74J554m52m39L01J64o58O77k07l35K046j343r17J709
$$ plain form
2283 1017 -729 831 -220 -386 525 -1627 -862 1432 -425 -2239 976 1337 -1900 728 2367 -796
2299 -796 -346 943 -632 -483 1173 15 -899 777 -321 -1172 587 242 -68 -46 -751 -611 397 -187
2317 -187 -931 1965 1132 -1563 641 1624 -598 -1102 1470 285 -1611 3 -386 -599 -401 -73 383
2334 383 493 585 -512 464 86 -778 686 394 90 365 405 -1006 -587 1307 -618 -751 1250 125
2352 125 -2006 -605 1119 -653 -370 1370 796 -276 -52 344 232 218 -416 68 430 -917 -779 549
2370 549 -92 -880 762 380 -906 488 617 -1044 -56 1348 -567 -420 1455 319 -786 38 393
2387 393 -640 -313 -192 -119 420 -1022 -525 1018 102 -779 1173 1364 -1359 -52 871 -1024 -450 1077
2405 1077 57 -755 947 -255 -1029 525 73 -366 -65 99 -559 118 -89 -424 1622 279 -638 1071
2423A071k38k362Q96K129k915L88K093j303m73J036N08j365J169q5j084J136j160
2440e59J42N70k86j06O75K13j721J700J62k061J317Q22j556n81K195o06j336J756
2458G40N5j042J79N38m77L0j09m53P13n20l57J190J60j383R17P41j911P75J283
2477A069j148o97J575l96j577J695n3p79J9K45J44o95P25l27O50k37q46J613o62
2496C18o24J72Q35j104r11K442j345o56J371K3j017J67J830j935M5R47j197L79
2514b60q2P44j05r2k31j30R62j556P86R85j556l67P78K17j253J447R81j442K58
2533H4O45n54q24R92L9q85M47j39j01l7M1M06M70n81k79J116r88j002J693K21
2553G64j510J026Q71j828p5J252m12n15Q37q3r47J46M9M10L53j18K65j36o76l27
$$ plain form
2423 1071 833 -1529 -633 1496 -1419 -1031 1062 -241 -714 322 830 -535 634 549 -535 601 -559
2440 -559 -417 153 -133 -239 436 649 -1072 628 790 -1271 46 868 -688 -1269 926 320 -1016 740
2458 740 795 -247 -68 470 -7 23 -86 -539 174 -346 -703 487 647 -736 181 922 -989 -214 1069
2477 1069 -79 -776 799 403 -1174 521 468 -311 -292 -47 97 -598 127 -200 450 213 -633 980 318
2496 318 -306 -134 701 -403 -1314 1128 -217 -873 498 521 -496 -329 1501 -434 -389 558 -639 -260
2514 -260 -342 402 297 205 -26 -156 806 -750 36 1021 -535 -902 -124 93 -1160 287 1268 -174 84
2533 84 729 175 -649 343 382 -503 -56 -195 -296 -333 -292 114 584 3 -276 840 -148 -1150 543 764
2553 764 -746 280 1151 -677 -752 500 88 -427 410 327 -620 -474 -425 -15 338 220 485 349 -327 -654
2573f54J076J6q57J036R2j594J33J535r86o68J729o39j394R78O24p79M64O46n73
2592A85R3k34j61O48m80o19Q14j18j282R02Q66j127J67J236p44r70J151J18j029
2611e84O33P81q21l78P52k71l38L79J2j03k54o02M16O29j033O83J339j384n27
2630f71J517k71j416J542L29j738N08K91m83m3O55j24k30J97o70O71j45k50P72
2649D41j3m60l49J387j083o30J865r07r26L90J009j509l15K059j388K9N67j17
2667E0N0l13M56k18P19r04M0J211j583K30P27l50q83P73L42j680J265L77q19L96
2687a14O54P6j054Q07K45o65j4J2M36n46m70O19N18r29j27J185m67j007O36Q14
2707F09j231K35J062p21Q6L56J05m80K83J59p70J77k21J92m17%P09r1j75k65J275
$$ plain form
2573 -654 422 438 -419 617 709 -885 -752 783 -203 -871 858 219 -1175 -197 427 -352 112 758 185
2592 185 278 44 -117 531 51 -568 246 128 -1154 -252 614 -513 -346 890 146 -824 327 445 -584
2611 -584 49 830 9 -369 383 112 -226 153 165 62 -192 -794 -378 251 -782 -99 1240 -144 -671
2630 -671 846 575 -841 701 1030 -708 -200 91 -392 -435 220 96 -134 63 -607 64 -81 -331 441
2649 441 428 -32 -381 1006 -77 -707 1158 251 -675 -285 724 -785 -1100 959 -429 -400 167 50
2667 50 100 -213 243 25 744 -160 -120 1091 -492 -262 465 115 -768 5 347 -1333 -68 309 -510 -114
2687 -114 540 616 -438 369 614 -51 -65 -53 383 -163 -633 -14 504 -425 -552 633 166 -841 -205 609
2707 609 -622 -387 675 -46 40 396 501 21 304 463 -307 -130 -351 -159 -576 -576 133 42 -133 -398 877
2728H77n87q53J142N8n21r58J464j38j537J265N3k64n23M82K71q50P50l60K05
2747b4J81k89L97j92K23j25J58m94R4O52j064M0Q29l9j301O10J304j624j7J126
2767D45r2p80J75Q90m83o5P9J23K05p67o6O31m63o13Q53j92n82R20J11o34N37
2788B32P77j325j70J363r31n86Q38K04n32k42K86L41l5o34L85P73j076p88J459
2807C39K6j250J157O03j057J39N72n36j54Q09p57m34O77m51k85M91L03n9P9m57
2827b45K53O37j041O5J195m86j323Q58R86j608L69J058n89l74nL76l33O5J05Q
2847b9M23o70L24K70n31L93J61m56j67P21n80o86J226pq99L18P35m90o56P06K79
2868C85l02l50J74N90o92k83Q90N9o35j20O12m54m29Q06j59j86J67Pj33j55O45
$$ plain form
2728 877 290 -563 579 637 116 -842 622 484 -1053 212 265 1 -522 -40 231 -619 131 -229 -24
2747 -24 157 -132 265 73 296 171 329 -165 -71 581 -483 -443 386 347 -954 -344 960 -664 -681 445
2767 445 353 -427 -252 638 155 90 169 292 497 -270 -336 295 -168 -781 72 -120 -702 218 329 -305 232
2788 232 1009 -316 -486 877 -54 -640 198 402 -130 -372 -86 255 220 -414 -29 744 -332 -1120 339
2807 339 365 -885 272 875 -182 -43 529 -7 -161 648 -109 -543 134 -317 -602 -111 192 133 212 -245
2827 -245 8 645 -396 -331 864 378 -945 -87 899 -709 -340 718 129 -245 -250 126 -207 -142 -37 -29
2847 -29 394 -276 48 318 -213 180 341 -115 -282 439 -141 -827 399 392 -507 -189 546 56 -600 106 385
2868 385 83 -267 -93 497 -195 -478 412 471 -164 -284 328 -126 -555 251 92 -94 73 80 -53 -208 437
2889D37k58m14L36J6k67m73Q67K32r56L81N41k20p15N41M76p35q7K51L68m39k90
2910d08P51q9m43R8O42o03m97Q26n13k39O99J18n39J91N98p55N6O33l35k12l98
2931d19J39K72m00Q2P76J00j065L84R59j076o5J051n57o93L39K69m96M08M11m12
2951GK88k83k56K72l39O6M27q5o11Q50J09j260J121O60j103rR02p75j046J096
2971C1l3l27N31j94N7j70k33J87P06l46m57R21p44o01R52K59q04L97N58j438J61
2992e87P90m32j13M49K83p32L24J94J0K82p15N24O2p78J02Q01l22q61J156j31
3012C06r15O65K66o46j16N86m38J21L54j05M27l68O7K84l01n61L65L24j136M86
3032c35N82o82j60P08L16n92M52K83m23l69L7M36l91J30L29m4n27p3O58n28n7
$$ plain form
2889 437 179 -235 101 117 -150 -623 244 476 -480 -99 442 222 -493 48 524 -211 -298 -47 321 -118 -408
2910 -408 343 254 -189 -91 551 -52 -549 277 -236 -475 224 342 -197 -6 592 -163 -107 526 191 -21 -419
2931 -419 -280 -8 -408 -326 450 550 -515 -131 828 -248 -313 738 181 -512 -173 96 -400 8 419 7
2951 7 295 12 -244 28 -311 -245 182 97 -514 336 445 -815 306 966 -137 -146 756 -19 -1065 31
2971 31 -2 -329 202 8 65 -105 -338 -151 555 209 -248 673 -71 -672 280 539 -265 132 690 -748 -587
2992 -587 203 -229 -342 107 390 -342 -18 176 186 468 -247 277 339 -439 -337 464 142 -719 437 306
3012 306 -609 56 322 -324 -440 146 -292 -171 183 78 505 137 204 488 187 -374 -9 315 -821 -335
3032 -335 247 -435 -595 113 429 -163 289 572 149 -220 -183 253 -138 -8 321 277 -250 -323 335 -193 -250
3053b50M36q6o77J15P01n33L29L91P6l61k30M74l23j0l53O31k35j084J256k29
3073C8n64L28O31m38o28J309q35n2N59l87M75m28K69p3o4l83j28R12j282L70Q42
3094D71q46j37N83M48j017O47N95r40K26P9O3k11M8J43q0K3n50M89J26q42N39
3115a43N51r11lJ177p11m34J232k08r12O67J96r07L76Q0l29L26k80j2N05l18n40
3136e98R44j1j042R31L98j011J01R20n78l42R49l73m34J05n9j54j01K81n1J97
3156G2l45o4P80n70K7Q28k78q06M72M25j151M05P39p00p4K71n5k66R6M9K84J14
3178B53n82O55O3r82N30N77n63p1P78n20q21P44m3l40N24P0k31l59o3K56Q1o8
3200a12K96L64o36k74P98r3o41O52K22j051R0M72k68j35K28J96k65J71N1K04K05
$$ plain form
3053 -250 186 100 -577 -462 239 -294 35 426 502 141 -89 385 62 52 -301 330 95 -989 267 38
3073 38 -526 -198 433 -5 -633 676 -159 -211 348 -39 436 8 277 204 140 -243 -371 541 -741 -371 471
3094 471 -375 -512 71 519 -498 149 744 -196 30 109 172 -39 9 152 72 95 -455 34 160 -682 -143
3115 -143 408 -503 -506 671 -40 -474 758 550 -362 305 501 -406 -30 50 -279 47 -233 -245 260 -58 -598
3136 -598 346 335 -707 224 622 -389 -288 632 54 -288 661 288 -146 -41 -100 -254 -355 -74 -125 72
3156 72 -273 -337 443 -127 -100 728 450 -356 116 541 -610 -205 534 -166 -240 31 -24 -290 -194 -145 139 253
3178 253 -329 326 389 -593 -63 514 -49 -120 658 138 -683 61 18 -322 202 272 41 -318 -381 -125 -44 -112
3200 -112 184 548 -88 -362 436 343 -298 354 576 -475 -385 87 -181 -316 -88 108 -157 14 65 269 474
3221D74p91M61J50q13M95M88o17l06Q67m28n91J116j58o49K93J96m23J7K54j32
3241i7M16m73j5Q01o25m28O19K79r49L72Q81j200k3N92m73J47M61Q9l75J9j40
3262a22j88M89n7J56K31q88j06O80n19p3J156l38j067O16M07p95L16O93m56k79
3282a44Q3j71K30N3l94O08N1p70N85K76n65n3O08m27m28J046o29n23P92k56j78
3303b06K14M33k92l81J40q2M35m40JP84p20n67P70M45q02L45N91r40j4K54l1L1
3325c2R4q7k42L98l60K44M13o44M54O9o24K93N08o11n11J098k70q57Q95J67o94
3346b99L4K98L8Qq2n3K97l30l95Q25J67p47L72K37q35K00N66n64M3N54n85j81
3368d32O38m8k41K40k1j31J34l09K39M97r22r6R32m27o27Q36K70j141K96N56n45
$$ plain form
3221 474 -317 144 294 -519 -24 464 -153 -459 408 -20 -611 505 347 -302 -9 187 -236 -219 35 -97
3241 -97 319 -154 -169 632 7 -421 198 477 -472 -100 781 -419 -442 150 -323 -176 285 374 -1 18 -122
3262 -122 -310 179 122 278 509 -379 -485 195 -324 -397 759 421 -646 -30 377 -418 -102 591 135 -144
3282 -144 -61 -232 -2 51 -343 265 316 -454 131 407 -158 -211 397 -30 -458 588 -41 -564 228 -28 -206
3303 -206 8 441 149 -232 -92 -174 261 -179 -178 606 -114 -681 89 534 -268 77 668 -272 -286 -32 -63 -32
3325 -32 62 -25 -267 131 -229 15 428 -216 238 307 -317 -24 484 -127 -638 460 190 -667 228 395 -299
3346 -299 -265 33 71 79 -3 -56 241 -89 -484 341 508 -239 133 370 -465 -265 301 -263 -220 334 -251 -432
3368 -432 206 158 -83 157 136 5 139 -170 69 566 -356 -452 480 53 -574 262 532 -609 -313 243 -302
3389c02K83K83k29M9J3k63K16L46m29J82R5o38K33L20o02J75Q45p23l82Q98k80
3410I0n92M77M73m04L8J68j78R4m14J01N94m29l47M08q2p57N57M87m82M49J97
3431D48n21p8L65k30j41N29k78j36j5k52L96n8k60K90L62p09k97R65m99m83Q51
3452B49R5m17K00K93l08o8R2k31J84j38l07L86k31k98N69N1m01N73K48q35K39
3473e5N38p13J9O57k70l27J82n1j20J90l08L10K67q43K38N45m49j74Q66r7q02
3494c97P72m6p24N54R0l86N3K98l72p6L56m23L21O3m72N79K7n92K71O99o78j62
3516b45J109p12n63O81k79l64K89J44l40J91k1k51O84k80j27O04m70m10N42J17
3536B99p21O13L86j057L67N00n30q1M29j70m16L79j52P5K19l53L46K41l79k6N83
$$ plain form
3389 -302 -19 264 35 84 97 -166 50 396 -33 149 244 -394 -161 159 -443 -268 577 -146 -528 370 90
3410 90 -502 -25 448 44 82 250 72 166 -248 -147 447 18 -329 79 -3 -760 -203 284 -198 251 448
3431 448 -73 -151 214 -16 -157 372 94 -42 -57 -309 87 29 -231 59 421 -288 -585 380 -119 -602 249
3452 249 344 -73 127 420 112 44 136 -95 89 -49 -356 30 -201 -499 70 121 -280 293 541 -294 -55
3473 -55 483 -230 -211 446 176 -151 31 -20 -140 50 -258 52 319 -524 -286 259 -190 -364 502 405 -397
3494 -397 375 329 -395 159 249 -137 -84 214 -158 -234 122 -301 20 83 -389 190 217 -375 -104 595 -83 -245
3516 -245 864 152 -411 270 -9 -373 -84 60 -280 -89 -110 -361 323 43 -84 520 50 -360 182 299
3536 299 -422 191 577 -480 -113 387 -143 -224 205 35 -381 -2 -154 -79 140 -213 133 374 -5 -31 552
3557E52m40o31Q28k48n33N96R9o29J20M67m09K20K86k74L5j35m1L11P3l83L99
3578B63J12q77M48M62o34l5M94l93k90N74o0q9J06j52N9J16p9J23K88o57m7N28
3600B60m68L9N66j30p52L45K70o42M88L86k77j26L1Pm7K01j74L49n6o48M76P4
3622A72n86J66O75n79j26P93o53k69M78o6j36M10P3m30K33m97P7O79m43Q5L94
3643D50m80q15Q45K33p64R36P3p96K0L91j33r5P30n59n1J48n55M92P4k56O6L75
3665C29m98k79J055p09l91R15l46m98N56L01p57K48L40n14L84P6k80K87k19m44
3685d44N38J58o99N27L55r25K78P32o47j13O77m58l44N90p3l22L00j64j91L83
3705A58j98L6L92m14l50N20Jo21P67J85r70L74L92m36LN80k78l73L10k39J13K07
$$ plain form
3557 552 112 -519 309 61 -472 124 223 -406 -286 181 -228 -8 278 4 39 -96 -137 174 247 -136 263
3578 263 375 -502 -54 408 -226 -261 233 -160 -450 124 64 -25 81 -71 -12 104 25 148 436 -221 -268 260
3600 260 -208 -169 397 267 -485 -140 130 -512 -24 362 85 -41 -10 -3 -50 151 -23 326 270 -378 98 172
3622 172 -414 -248 427 -152 -278 515 -138 -407 71 5 -131 279 352 -78 155 -342 -265 414 -29 56 450
3643 450 -30 -845 0 233 -531 405 478 -318 -298 93 -40 -135 595 36 -15 133 -422 70 144 -112 -46 329
3665 329 -169 -448 607 -102 -493 422 76 -422 134 435 -322 -74 266 -248 136 212 -68 219 0 -444
3685 -444 94 252 -447 80 435 -490 -212 520 -127 -240 437 -21 -365 225 152 -170 130 -34 -225 158
3705 158 -40 -4 388 -26 -376 144 145 -476 291 476 -494 -120 272 -164 -161 419 141 -232 78 -161 -48 159
3727A59k75K64j9m01O7N30m56j53P55n98k19O14j58l03K05K69m51J67J74k36J90
3748A25l23P9L37l21nL77r9o54N02L35o84L69L30m98r9L30n6m7K82k07n4Ol23
3771b98K60J57l16J55L46n55p6P36m24k77O86j66n27L40J05l42J87J24j08K02
3791B09k30k07M49k73m41P41M4p27M98L13p51K31O17n04o4N49m76l05M78k71o6
3812a86L79k54KK55m29o1O27l75l97R51k43q25P79J36p10L29M86n66J3L22m80
3833b47J21J77l35L23K36m42J38L80o58Q7O85o01k3P01m74n34O92l7o25O24J57
3854C45n74J53m8j69L00J8j52N05o5p21N35K88p62L66M43o50j23N12l03k44O41
3875B95k37k75M13k08j01J38r3L4J47j24p6N35l88l87O99k50m90L86K67n23r0
$$ plain form
3727 159 -116 148 129 -272 -205 325 -131 -284 471 -127 -346 268 110 -193 12 281 -170 -3 171 -65 125
3748 125 -198 -119 218 -103 -108 269 170 -484 18 353 -331 38 368 -130 -229 101 45 -2 280 73 19 25 -298
3771 -298 -38 119 -197 -42 304 -251 -327 409 -15 -292 394 228 -299 41 146 -196 -9 115 7 209
3791 209 -21 -228 221 -52 -493 248 292 -435 63 376 -375 -144 473 -31 -95 454 -22 -327 151 -120 -186
3812 -186 193 -61 -59 196 -233 -294 333 -42 -439 512 269 -556 223 359 -351 -22 464 -102 -89 233 -247
3833 -247 -126 51 -284 39 275 -167 -29 351 -307 -220 465 -136 -159 542 68 -466 226 189 -436 188 345
3854 345 -229 -76 -124 -293 7 25 -127 378 313 -408 127 415 -347 19 462 -188 -311 201 -102 -346 295
3875 295 58 -217 196 -12 -113 25 -68 -34 113 -11 -87 448 60 -327 372 122 -368 18 285 -238 -328
3896c28M37k72J04J31m7J97k15q5J68O4k90J77K52n53K53K95n03R3L06k82k54
3917c52N02k3l10K31m1%P8j05K38J62n26j10M96l56k72O79m5n57L11Q1k96K17
3939BJ71k68P6N7k73L12R6k23L55j43l49L06J32o08J93N82q61L8Q12m55k09M26
3961A69M8l67L11N2l16L65m56j30O03k44k40N29p1p70N61J92o97N85K58p38Q3
3982b73N79m97L1O92m20j19J25k78Q1K30l10K0N67o96j64Q32m03m30O85O4o63
4003c47M25K18n94L07J95k89J93K09m34K1J75m74L80K62m99K77K67o51L0Q59m58
4024G2l38P59l85n92M88J34k70K59nk37J73j48p7L67j18l91L93J7n00N28J86m86
4046a71J86K77l78m6M36k57k14J58p8KM3%J36O1l74J52L47m68N2M48k59k74L04
$$ plain form
3896 -328 109 -163 -59 72 25 222 7 -78 90 154 -136 41 293 -260 -7 288 -215 -122 184 -98 -352
3917 -352 150 127 -183 48 7 7 85 -20 218 380 -146 -256 240 -116 -388 291 246 -311 0 81 -215 2
3939 2 173 -95 -19 38 -235 77 173 -50 305 162 -187 119 251 -357 -164 418 -443 -405 407 -48 -257 169
3961 169 217 -150 161 213 -103 262 -194 -324 279 35 -205 324 253 -517 44 236 -461 124 382 -356 -273
3982 -273 306 -191 -160 532 112 -7 118 -160 -79 151 -159 -139 428 -268 -432 400 -3 -433 252 316 -347
4003 -347 78 296 -298 9 204 -85 108 317 -117 -96 79 -395 -15 247 -252 25 292 -359 -329 530 72
4024 72 -266 493 108 -484 4 138 -132 127 122 -115 58 -90 -167 200 82 -309 84 101 -399 129 315 -171
4046 -171 15 292 -86 -132 304 47 -167 -9 -87 -85 -42 -42 94 155 -219 -67 280 -188 -136 312 53 -221 83
4069H3J22m75L20J08k85K50j04p2M8j62M9K05J4k47M46j77n76N84P7m20K93K86
4091C67m78j70L90k27Q8J94k12J91j79k64K85J99l28P5N14o69n4O79m73j27M47
4112B48p3m60L09J88n31L66P9l14L24j19j96L23k3m74M46K77p53L77M78p90O4
4133b54O84n16k23O72l62k99M84k18j58L81k12j63M22k99k29O30k63m53P11r1
4153B44p14O03K16o87K30M44m62p8M75l38n6L18l40J22K04l34N2M20m02k00P16
4174D33m43l43O95k17n32M87K13o72L71L17n46K19J27k20J35P0j94J39J71n24
4194c14L19L12n60K10L77m04j77M46j82l20M00k7j99J35J9p0L3Qj6K03k09j02
4216a18L48k86j91L41Q0m01K38K71m82N7K34j25k1J08lm1k5j10K28O2l22L04O3
$$ plain form
4069 83 205 -270 50 158 -127 123 19 -53 -5 -167 -118 87 101 -146 300 123 -453 131 208 -212 81 367
4091 367 -111 -281 109 -118 -30 164 -48 143 -36 -300 -15 184 -144 -69 445 -224 -278 401 -72 -199 248
4112 248 175 -285 24 212 -319 47 126 -188 136 17 -179 144 121 -353 93 370 -383 -6 472 -318 -254
4133 -254 430 -86 -309 363 1 -298 186 -32 -190 191 -21 -184 238 -61 -290 340 77 -376 335 244
4153 244 -470 133 349 -338 -108 336 -126 -204 271 -67 -123 195 -145 -23 181 -153 -101 319 -83 -283 433
4174 433 -10 -353 342 125 -407 80 293 -379 -8 309 -237 -18 109 -111 24 94 -100 39 210 -314
4194 -314 5 317 -243 -33 344 -60 -237 209 27 -293 107 80 -119 16 35 -35 -2 6 -10 193 -16 -118
4216 -118 230 -56 -247 94 174 -227 11 282 -200 -143 91 -34 -55 53 50 9 -16 -126 102 164 -158 146 209
4239B09m42J21K93k79q4M32k57k13L38j17m5J14o0OL1j33M9L17l50q6M75l71k51
4262c03N25p8m45L00J94m72K15K71l12J80P6k84J73P0k89K20K29m88J59L93n89
4283b55M8N87m72k11O04k29m78N23N4m22M15L9k76J89r3k30K94O1m31M67N9p30
4305d87M85K84n32J92M58m68k70O06l60j58N58k28j30J95j44j57K69p3k55M61
4325B46k89l38N61r8l92M33K76o59K08M31n72O7L38k66l4K10j30o3K18k51K5L07
4347B28l70k0L49k80j51M50r2k86L59L9m26J91K05l15N2J20j10j4K5QJ53n6j70
4370a11K40k2l24K08J74k31n7L08j47j42K48r2n9%m3Ml2kN4R2j52R9K32l18L1
4395d2K15j82j96L02pk65J68O5q7L6j5O7M8j98q5K76j40j81M03j0l32K55J16l59
$$ plain form
4239 209 -233 -112 181 -98 -182 250 -7 -220 118 1 -44 70 10 16 47 -86 -37 280 -70 -156 319 -52 -303
4262 -303 222 144 -301 -1 193 -279 -64 207 -105 75 151 -133 40 110 -179 41 270 -218 -59 334 -255
4283 -255 -207 380 -92 -303 301 72 -406 117 171 -251 164 203 -73 116 23 -207 87 148 -283 184 243 -487
4305 -487 -2 282 -250 -58 400 -68 -338 268 -92 -250 308 80 -50 145 1 -156 113 40 -215 246
4325 246 -43 -381 180 82 -310 123 399 -260 -52 379 -193 -126 212 -54 -88 122 -8 -71 147 -104 -79 228
4347 228 -142 -162 187 -93 -244 206 114 -172 187 226 -200 -9 196 -119 -67 53 -57 -71 -46 -38 115 59 -111
4370 -111 129 107 -217 -9 165 -66 -123 185 38 -104 144 52 -7 -7 -50 -46 -78 -80 -26 66 -86 13 245 -73 -42
4395 -42 173 -9 -205 97 90 -175 -7 58 -29 7 -8 59 107 -91 -176 100 -40 -221 182 172 -160 95 211 -148
4419a48J78J93l66K9J85k15L0K24j16L0J36k50Q2K16l81O5M23m15j73N24j76l70
4441b95M63J15n03K68R5m00K27P7j72J87J00k89J64K05m17K23K35m84J06L20m01
4462a76q8N88l00k86N56k14l24K89M6k06J49N2k70L31r7k64M60q2l96K87J48m87
4484b84J55L99m51O0L85l19q2L66j76j75K62r7j45J38p0m0K37j75j11L47j95k58
4506b29L40O3m22K02K63l58O3K10r6o3R3kj32J45j75O3J30k62K17jj31P7J27r9
4530B3j91L70j89j91K50k7l5o5J27j2n9l9M0J60k97N3K14j81n3J81M9k52J81N5
4554A12k24J59m2%j9oJ9K4k2r1K20r1k28K96Ql34J85K91l69J3K89j73j19J87k3
4579F2j29J64j41k2K27k75LL21k42j33L71j49l40M55l3m14L50J71m71J57K97l79
$$ plain form
4419 -148 30 223 -143 -114 71 -144 -114 110 -6 24 160 -90 -8 208 -173 -108 315 -100 -273 251 75 -295
4441 -295 168 283 -220 48 143 -257 -30 47 -125 62 162 -127 37 242 -175 48 283 -201 -95 225 -176
4462 -176 -264 324 24 -262 294 80 -244 45 91 -115 34 86 -184 147 50 -214 246 164 -232 55 203 -284
4484 -284 -129 270 -181 -121 264 -55 -137 229 53 -122 140 43 -102 36 -34 -74 163 -12 -123 224 29 -229
4506 -229 111 174 -248 -46 217 -141 -78 132 36 -27 66 64 -68 77 -98 -35 95 -167 50 49 -82 -5 122 23
4530 23 -168 202 13 -178 72 45 10 -55 72 60 1 -38 2 162 -135 -82 132 -49 -102 79 128 -124 57 112
4554 112 -112 47 5 5 -14 -20 -1 23 1 -90 130 39 -189 107 115 -219 -34 257 -112 -99 190 17 -102 85 62
4579 62 -67 97 -44 -66 161 -114 -111 210 -32 -165 206 57 -283 172 139 -275 75 246 -225 -68 229 -150
4601a50Q9K16k52J01O4j92Q4K19l09K3M39m52q8M73k77k40M36l1m07L33Q2l63
4623b02K54J19k93J17J24k82J73J16l27L01J16l99J54L11m80l3N60l74j96M80
4643B39j99k82L29J6k18J94ok22K25r8j27K87o5k03K07P5m00K73K43m37J37K16
4665A84k52r3K66%k07K10p7j04J08r4J07M0j26l3J42p4j79L44p4k38K07j0j85
4688a38Q3J66j01l4P5p3L7m9mJ56j24o1J85q6k10J76J34k13O6J82j92o6R1k5M3
4713A8qK0Pm0j41J40J36k26J54J53l45J3K23r8j56L25p7k93K39n6p7J42j8l8N7
4738E4m6j91L16n5k96L90k3l89K22K64m10O7L79l87l2L27k61n0K17j21o7K55j62
4761Aj13L22k68j27M11k12k59L94qm66L37K57m72J81K55l68M2K12j86K2J82k12
$$ plain form
4601 -150 -61 155 -97 4 68 -124 -40 179 -130 -107 332 -120 -208 265 -12 -252 184 153 -254 79 161 -202
4623 -202 52 171 -122 -5 119 -163 10 126 -201 100 216 -183 -29 282 -198 -231 329 -45 -241 239
4643 239 40 -242 87 103 -115 79 73 -149 76 -22 -149 138 73 -130 77 152 -248 25 268 -169 -32 184
4665 184 -68 -161 105 105 -102 108 31 -73 35 -59 48 88 -38 -71 71 -3 -182 162 88 -150 57 47 -138
4688 -138 -55 111 10 -24 51 -22 15 -34 -38 118 -6 -67 118 32 -178 -2 132 -81 -15 167 -25 -91 0 -25 18
4713 18 10 30 37 -3 -144 -4 132 -94 60 213 -132 -119 104 6 -150 175 98 -195 44 -12 -89 53 35 -3 54
4738 54 8 -183 133 78 -218 172 149 -240 -18 246 -164 -97 282 -105 -137 190 -71 -121 96 -25 -92 163 1
4761 1 -112 210 -58 -185 226 14 -245 149 141 -325 12 269 -203 -22 233 -135 -93 119 -67 -45 137 -75
4783g5K8K35k98M9L43l81n2L66k52k57M73n4m08L98O5l50K12J49k99P0J46k14
4805a06J22Q2k38J77R4l01J61K57l80j8L60l05j33L73n9k49K72K9k33J60K6j16
4827b5M2n2m5R4k2r5J97Jk43K23Q4k61P2J93k11j03K06l7o2J26Km5m1n9P4j0j09
4854a06Q4P9j75J7K20j14n0K00p7j20L6J1q9J4Q2J0N4j24N8J29k47P0J69j18j80
4879a67K30J9k94K57R2j48J05K0r3m7K7j31J16N9k22K37M4k66J79J64k64j6L50
4902B51l08j50L80j86j63K74Pj84J64K4k14J69r1j68L04p3k48L45M7l82K29K48
4924B75l93O3L47m05o3K83j99m8K81p2j74K23j35j47K82j79n2K84j67k08L28L4
4946A58l88L57J62m74J48J90k94lK69j75m4K44j93M6J51k17J7J92j89j06L35j85
$$ plain form
4783 -75 -47 188 -110 -61 282 -99 -151 215 -37 -294 179 125 -283 115 180 -170 42 191 -108 -38 108 -106
4805 -106 16 98 -140 37 131 -170 -9 248 -132 -150 210 -95 -228 145 86 -163 109 138 -95 65 91 -25
4827 -25 17 -35 -80 14 -8 -103 94 95 -148 75 159 -102 -30 163 -48 -151 55 18 -44 82 84 39 -2 -61 13 3 -106
4854 -106 -22 57 -118 -101 119 5 -45 155 78 -42 -6 5 -84 -70 12 22 76 -48 10 139 -108 -38 131 13 -167
4879 -167 63 82 -212 45 137 -11 94 114 21 -26 1 -130 -14 45 -177 60 104 -162 17 181 -83 -99 251
4902 251 -57 -207 173 -13 -176 98 105 -79 85 109 -105 64 -27 -195 109 36 -212 133 180 -202 27 275
4924 275 -118 -55 292 -113 -176 107 -92 -140 141 69 -105 118 -17 -164 118 -61 -113 171 4 -204 124 158
4946 158 -230 127 289 -185 -37 153 -141 -144 125 -50 -94 150 -43 3 154 -63 -46 146 -43 -149 186 1
4968Ak09L76j01k70L22L0l22J06J83k39M3J78j21J1O2j16J57Jj83J29O7k47K7
4991a15K54j84o6K26q5j30J45L2j29P3Mp4K4QO6K2r2L3O6p7j05K20p3k09J49P7
5017F0j28J5J22l8o1J0M1N0p3k4J03o8j32J69O8k24J42P4k41J15J14r5o3J31p7
5042a0n4J42r0P8K0k14J18J33k00L7K82k69k05L43p4k13K71Q1l23J06R1j99J78
5065B9Q7j40P4J9k15J38J17k44J69J76l40PL52l27j23M63k07j88K80j5k73J49
5087a2J13k28K86o2k18K49j63j79K65J31l26J48K38n22J53L12k66K0K79j94k60
5108b36L33p8j26K78j51m6P6q9p9K31n2k80L64o9l35L43J18l39O3K57k71k4L01
5131A89k07p3J72j42MJ37p6j5J24j88k3J99j63o8K63j10k17K75N1k45J14J28j45
$$ plain form
4968 1 -208 168 67 -203 119 149 -173 -67 116 -123 -80 98 -23 -12 50 -66 91 92 -91 38 105 -142 -115
4991 -115 139 -45 -111 115 30 -100 45 77 -52 21 25 -49 -25 -17 49 71 -21 12 78 1 -104 116 43 -166 -17 60
5017 60 -68 -53 69 31 -30 -20 21 71 -2 -26 77 9 -123 46 114 -110 32 106 -135 -20 94 -1 -64 67 -10
5042 -10 -64 78 -12 66 86 -128 -10 123 -77 -40 242 -27 -232 111 37 -176 95 176 -147 -41 50 -149 29
5065 29 116 -24 50 69 -146 -8 109 -135 34 210 -130 -123 229 -98 -221 242 35 -153 127 112 -161 -12
5087 -12 101 -127 159 97 -121 128 -35 -214 51 182 -144 4 242 -280 -127 185 -81 -61 218 24 -236
5108 -236 97 19 -107 171 20 -26 50 -39 -118 113 61 -219 145 76 -259 84 202 -137 -74 183 -88 -112 189
5131 189 -18 -91 81 -61 -57 80 4 -11 113 -75 -98 101 -62 -130 133 23 -194 81 132 -113 1 129 -16
5154a6oR6o1k6n2%R3k5k8P4J9k11J11J28j55Q1J09j35q0Q1L6o7R3J2m6l1j01J32
5182B5Rj49J22R7j76o8K82j43j04K12m8r2N6L7q0L2j5n0J43j52j3J79j51r7K25
5207H1Mk52K52J01l40J52J75j99k1K05j52j07J70j54N1J43j98L4J76k10p8L47
5229A80j50k00L68j07k91K73R2l36J73K10l50J15J26k05P0R2j41O9J39k76J06
5250d3K78l78N7L60k60j63L62j33l37L34J9l00K40O4k20J19O0j81J53N3j87J78
5272G5M6l05J69K06l28J12K95k97j22K77j36k38L37m2j72J85o3p6J03Mn4J63j5
5295A24k19K32r2k38J98R1j87O1K27k65o9K27j47j2J17K0q8l3L5%J07r0O8J07
5319A74k47m0J47o8p5J47J7j78R8Q6p5L8rL9m0n5O7M8r3m8J64r6j13K06j9j82
$$ plain form
5154 -16 -22 74 13 -13 -65 -65 28 3 -25 49 68 -143 -32 96 -59 22 131 -4 -84 -3 33 -34 59 71 25 -6 -107 25
5182 25 34 -115 7 104 -72 -140 142 -1 -105 107 59 -33 23 60 -20 12 -3 -53 90 -62 -75 104 -47 -144 81
5207 81 85 -167 85 186 -154 -2 173 -26 -47 158 6 -101 69 -85 -34 109 -89 -55 121 -89 -167 180
5229 180 30 -170 198 91 -200 73 165 -171 2 212 -138 -23 103 -102 -32 60 -81 -12 127 -149 -43
5250 -43 235 -143 -86 274 14 -149 213 80 -257 77 96 -204 36 100 -120 -1 59 -122 31 84 -103 75
5272 75 121 -184 -15 191 -137 -25 270 -27 -149 128 -8 -246 91 49 -123 62 -1 -77 26 30 -24 139 124
5295 124 -95 137 45 -193 5 96 -91 -30 197 -68 -137 90 -57 -69 48 68 -20 -53 -18 -18 89 -1 67 174
5319 174 -73 -113 34 -34 -109 38 55 -123 -25 61 -14 24 15 54 14 -41 26 74 -19 -67 97 1 -112 94 75 -107
5345a07Q7M6j16QJ36m8LK5o6J05n6o3J49j5k09P6J52k52N1K72k28n5K21p9j54
5370a17J51j3j38J75kn9J29j11j04J85n9j69K45ml60K00J43k83J55K81k80m5K13
5393A33j64n9J89p9q2J32j36l9K29j46l5K25j51k10L05m6l03K83Q6l08J84J96
5415B04k45qK14k08J0J17j11kP9j71K7K39k09MK84k59j50L02m9k22K62M5l15J35
5439b7Q2j25R3R9j44j8N5j28J22O8j62J38L5j65K9J99j71j12K64r9j41J51K5j41
5463g3K4R5n7L6j4l4M2r1pJ18Jp3Q9Nj84J06R0j07J9O3p0n0L1P3j1k6J4L4m4p0
5493g1J57Lk21J43K9j09J7J27l0j07Q7m1J7M9o1N8m5j07P9P4r9K9J89k00o0J79
5519H6r5j01J56O4k24J03O1j33R4J2m6J20p5p4Q3L0k35J53J96k98R2K07k70l5
$$ plain form
5345 -107 -20 26 -90 -82 54 6 9 34 -32 73 17 -46 103 88 -121 -45 107 -145 -94 178 -50 -105 116 37 -117
5370 -117 34 21 -117 58 56 -3 126 15 -89 96 37 -132 113 109 -251 -51 92 -191 -36 245 -35 -80 133
5393 133 -31 -90 99 20 -62 70 -66 -105 124 -22 -57 168 17 -193 112 66 -237 46 132 -176 8 204
5415 204 -41 -49 165 -43 -33 84 -27 -29 50 -121 -94 145 -64 -60 224 -35 -185 117 68 -154 108 153 -162 -27
5439 -27 55 -70 23 122 -22 -40 15 -113 9 77 -85 53 88 -77 -48 151 -20 -132 132 33 -108 43 68 -73
5463 -73 -49 46 -11 25 11 -23 19 -72 -79 39 40 -33 56 61 -123 -17 73 -34 -15 48 -22 -72 -41 32 21 -5 9 43 -1 -71
5493 -71 86 89 -132 11 40 -69 -52 75 45 -62 25 -16 1 50 -11 47 2 -105 -26 48 -51 -22 167 -33 -93 86
5519 86 -9 -110 46 110 -114 -11 50 -83 11 23 -23 97 22 -52 31 61 -174 -21 175 -123 -31 176 -94 -129
5543a29K52r7j06K38q4k12J67m2q0J61l0q3J25j10j49K37Lk38K54N3k92J08K12
5566A58k29qK62j90o8J58j27l2J23q7l2J50q1r8K21j33j42K83o7k13K57L4k95
5589a56J45J63k46M7J74j66l2R1p1kJ03j14O6J07j77J4J84j56m3K02r7j49J67
5612E4Mj69J12Q7j49L2O0m0l2L9lN1k8m5J08l2j10Q2Q6j73QJ34p6j05J03kl1K5
5640a0M7rn0j7O0K5r5R1N5j63RJ05q2l6J44m9j05P3j3j3J8j7P5Oj07L1J43j47
5668c1l5K29j33j23J57%j72O1J30j83Q2P4j06K9L7o2O3P1q8K8J12k74P8K05k42
5693i3kK44j56k34L10Qk44K33L7k12J33Rq9J10L9j86J44P1k61K00Q6l08R0J96
5717A25k78J7L26k03j39K68j02j42K18pj10J01m6j44J48j1j55K51n8k58K24N2
$$ plain form
5543 -129 123 26 -80 158 74 -138 29 -13 -93 68 38 -45 80 -30 -179 58 61 -177 77 130 -162 -54 158
5566 158 -71 -79 183 -7 -75 83 -44 -76 47 -40 -72 78 -3 -101 120 -13 -155 128 61 -152 105 139 -156
5589 -156 -11 152 -94 -47 127 -39 -71 20 -51 -53 50 -64 2 109 -68 -54 130 -26 -69 133 36 -113 54
5612 54 58 -111 1 88 -61 -29 31 -9 -41 -2 -5 46 18 -27 81 49 -61 21 107 -66 -58 76 0 -105 -2 -4 -35 -10
5640 -10 37 28 -22 -39 21 46 -49 42 97 -66 -57 48 -34 -70 74 25 -80 -7 -20 -33 -15 -32 43 49 -58 -27 116 -31
5668 -31 -66 163 30 -93 64 64 -108 -47 83 -100 -18 56 -50 -21 16 -46 17 88 0 28 140 -134 -56 149 -93
5693 -93 -95 149 -7 -241 69 77 -167 66 103 -109 24 33 -56 54 93 -93 51 122 -139 61 147 -161 -71 125
5717 125 -153 -136 190 -13 -152 116 14 -128 90 83 -27 74 28 -116 32 21 -134 117 59 -199 25 77
5739G7k65J25K32k49JK86k53m0K19j25m7J24l5p6O0r5p9K17j14k6J94j39j80K01
5763A3Q0k31J94J32k84L1J08n2l3J18k1r8M0r9O3M9p5R7K9j14J8J56q1j01J85
5788A24p6j30R6M9o9k0M4mk1k2O1K5j35K6J12o5o9J41mj30J03M0p8L7Jm4m3lJ3
5817d1O9q1j8J48q0q4K00K7k50J06J21j99K7J72j14o1J22q3jP8p3J4O5j49j0K04
5843A09j55o0K85j46j80K51J7k72J90J01l04J05J61j86M6J01j29L5J17j66Q5J41
5865A46k53N6K31k36l9L01j69k30L17o9k43K58K5k22J15O5j35J02J02j68R9Qk18
5888a57J73Q4k24J18J91k94j5L24k09j35K97j10j93J67J4j57J20O7j13J43l8j12
5910e9J57q0j07J40N1k39J01J80k75O9K08j48l6J49n0j50Q4L0p3R0q2M5J7q4K5
$$ plain form
5739 77 -188 -63 169 -80 -79 207 -46 -86 133 8 -39 85 50 -26 34 -61 -140 77 -37 -63 131 -8 -188 13
5763 13 93 -138 56 188 -96 -65 43 -9 -42 76 55 -43 -3 -102 -39 10 -65 32 61 -53 -35 121 40 -61 124
5788 124 48 -82 14 63 -6 -26 18 14 -7 -29 32 57 -78 -52 60 -5 -74 67 63 -67 36 76 -2 35 36 -8 -51 -54 -41
5817 -41 28 -53 -71 77 -3 -87 113 140 -110 -4 117 -82 -55 117 3 -58 64 -19 -20 58 -15 -1 64 -85 -95 109
5843 109 -46 -106 179 33 -147 104 121 -151 39 140 -164 -59 102 -84 -38 63 -66 -31 86 -80 5 146
5865 146 -107 -51 180 -56 -95 206 37 -193 124 55 -188 70 95 -127 -12 53 -82 20 122 -46 53 61 -157
5888 -157 16 100 -124 -6 185 -109 -124 200 -9 -144 153 43 -150 17 31 -126 -6 61 -52 91 53 -59
5910 -59 98 18 -89 51 102 -137 -36 144 -131 -62 146 -2 -38 111 61 -89 -5 25 -48 42 -40 5 22 -62 -37
5935c7J21n8r4J65n1j51J18M5j14K4Q6n3m9O4J6l6j2J8O6p4l0J28n2j03Q5L4r0
5962c4J2J27j18l8P0k4Pk0L9L6o4o2P6O7j91J50J17k20M5J08p5q7J59k8j34J05
5988B3l9m3P0k6J3M3k1q8K05q1j70K34l8k24J64J35k90O0K21k17%J64j12m1J20
6013F2q8k8J51j49LJ82j67m0K20j18j78K62k7k87K40O4k57J14J65k08NJ89j40
6036c0L7R1j35N4Q0j62M1K00k51m5K79j99j31K98n2k54K33L2k36J65R2j63O5P0
6060G9j21Q0K5j36J15K6j85R3J35k12lK56k02q3K61n0j61J29O3j66Q8M7q5O4p4
6085a7j2O0k9m6Q8K6k01J26P0j69J38O6r1p6J20nj11J20rj7p3j6P9q8%Q8M9j33
6113f3J2J34j19jJ18j8k6k6L5k8m4J3N1Oj21R0K8j53O5J51r8o3J49l6j73J37N9
$$ plain form
5935 -37 84 26 -68 97 46 -105 13 58 -56 -32 54 1 -48 16 32 -4 -16 2 68 -6 -36 92 40 -63 22 56 -34
5962 -34 -22 105 -13 -51 19 -5 2 -18 21 57 -7 -69 7 74 -117 33 150 -70 -25 83 8 -79 80 52 -82 23
5988 23 -16 -59 11 -15 -2 41 20 -68 137 56 -114 120 82 -142 22 157 -133 -73 148 -69 -69 95 -17 -58 62
6013 62 -26 -54 97 -52 -49 133 -34 -74 146 28 -150 112 85 -202 38 102 -155 -41 124 -84 -79 110 -30
6036 -30 7 98 -37 17 97 -65 -24 176 -75 -120 159 -40 -171 127 75 -179 54 86 -150 15 107 -56 9 79
6060 79 -42 38 63 -73 42 68 -117 -24 111 -101 -104 152 -50 -133 128 78 -83 46 109 -57 31 78 -7 57 -17
6085 -17 -29 31 2 -44 44 70 -131 -5 65 -104 34 100 9 -67 53 48 -63 57 48 31 -42 -58 21 -67 -67 21 70 -63
6113 -63 -51 83 -36 -37 81 63 37 11 46 18 -26 -13 38 44 -77 13 41 -112 -47 104 6 -57 92 56 -117 20 79
6140G9j14P6Qn1kl3nR6j2j59J38K6k45K13J29k53Q2K01k16p3K80j16j32K24j05
6165C6j08R3j0p4J15m9j29K18j00j40K85j7k56K04J20l23P7K43k57mJ90j55o6
6188a07J63p3p1J81j03n6J73j65n0K42j22j35K86l7l05K56R0k99J23J62k41l3
6210a21J88j48K1J43j00K8Q8j60L8J43j57k9K26j74j55K69o1j96J98O0k10O6J23
6233H0j51J3J23o0PMk2M2K8j24J04N3j85K6J54j39o1J61rj38J30L9j08L8J7J4
6259C6l8j0N5l4k8J8O9r1m6J42p1q4N9N9p3j7Q9j3l4qN8K8j05N1P8j14n4J38j4
6288D6j48J40N0j51O0N7o8k3O8k3j7J4l2O8K1j28J18N0k30P4J57j58j01K85r2
6313C7j97K36Nj72J14L8j21N0N3j51J36K2j52J93j6j71J34J06k39J5K74k89o0
$$ plain form
6140 79 -35 41 49 -2 -4 -37 -42 54 42 -117 21 47 -198 15 144 -109 -27 174 -42 -115 165 49 -83 141 36
6165 36 -72 21 11 -63 52 3 -126 92 -8 -148 137 120 -136 68 188 -135 -58 185 -72 -76 114 -41 -107
6188 -107 56 -17 -88 93 -10 -66 107 -58 -108 134 12 -123 163 126 -179 77 167 -132 -9 153 -88 -121
6210 -121 67 -81 -60 83 -17 11 99 -61 -23 120 -37 -66 160 -14 -169 100 39 -157 41 101 -109 -43 80
6233 80 -71 -58 65 5 12 16 -6 36 64 -60 44 97 -88 -62 92 -47 -108 53 44 -94 36 75 -33 5 22 36
6259 36 -2 -12 43 9 -19 -1 68 -23 -69 73 2 -82 -23 36 -37 -54 35 22 -12 -20 38 66 -39 12 90 -24 -78 60 46
6288 46 -102 38 88 -63 -3 54 -14 -37 31 8 -9 5 -27 41 62 -66 52 102 -128 -54 103 -55 -156 129 37
6313 37 -160 76 81 -91 23 61 -60 -10 43 -108 28 50 -102 91 75 -96 38 144 -95 -80 194 -95 -155
6336a55K98j58r2J79K2j81J16M5j56J43p5j00J93q5j10J83L6k48J68J50l27R2
6358f2K17k33m4K25j01j23J89l1j21J47l6o2J09j02k4J57q7j28K14m3k33J99R4
6381A21k55R3J74j62n3J75q9o5J34m2n5L7n4K7L5o0OJ06j00o6J77o7r0J08N4j75
6407h6L5J27p7k5P9Rn0k2K2K5k7l9O3l4j00J01L6p5J7Q7m8m8N6K2l6m4O4J2q6
6436d2MP3m0r9J26M8j38L0J23j22j9R9%n3L6Nj4Pl7M2N6j37K4J07j43k0J79n9
6464C6j69J73L2j91J35Q6j25QJ07j01k9Q5r3M1M6j38J00N3j31MJ95j61r8K96j50
6489A1j29K03j5j53J09J02j80O5M1j16Q9lp7Q1%j42R1J33j97Q3J80k30m0K17j01
6514B2j35J92Kj92J18Lj00Q3J7n1O6k7q6J07M7j45J32R8k38Q6J36j74k8J73o9
$$ plain form
6336 -155 143 -15 -107 72 94 -87 29 74 -82 61 -14 -114 79 -6 -116 67 103 -145 23 173 -154 -62
6358 -62 155 -78 -122 103 2 -121 68 37 -84 63 27 -35 74 -28 -52 105 18 -110 104 61 -172 27 121
6381 121 -134 -41 133 -29 -82 93 4 -61 73 31 -24 13 -41 -14 21 -39 -33 73 -27 -93 84 17 -73 35 89 -86
6407 -86 -51 76 -1 -26 53 62 12 -10 12 37 10 -29 34 0 -100 1 37 -38 -21 66 18 -30 26 48 12 -32 32 44 -42
6436 -42 -38 35 -5 -104 22 70 -68 -38 85 -37 -56 43 43 -10 26 31 17 24 -13 29 85 -52 -28 79 -64 -84 95 36
6464 36 -133 40 72 -119 16 102 -23 -15 92 -9 -38 47 -46 -5 41 -97 3 56 -75 -71 124 -37 -135 161 11
6489 11 -118 85 70 -83 26 128 -52 13 54 -62 27 24 -53 28 28 -114 -23 110 -87 -4 176 -54 -94 123 22
6514 22 -113 79 81 -111 7 10 -90 -7 10 -41 25 -2 -88 19 66 -79 53 151 -87 -1 135 -39 -67 106 37
6539C7j53J73l7j17J11k0%L0nj3K2m3m4J54n3j07J22j1j24J3J45j14m7J37p9m8
6565g1M0P0k5j7O2k7k0k4M4L6j13M7J5m5l3R5K6r9K4L8l7l4M5N9p5k2P6Pp7M1
6595FQ9j25k3J08p0p3P5K1m7K4J5K0k2j0L8M7q2qJ19j17r1J70j4j39J12R4j90
6622g3RJ30r8K2N3j7m5K8l6K4R1j30N9Q6j48k4J49p7j43K18k4k09J64P2j72O1
6648c0J27j26RP9q1M3K4q2O3L6j11K3J55k10j4K16j30j04J85j3j62J39O0j70J05
6673C1L7r1J4K0l0RN6j02Q4M5j81J21Q5j59k8K10j07j50K28o0j04J06K9p3JO7
6699E8o4PJ4o7Q1j8q8J19rq9P6Q2j33jJ43r9j11J12J6q0L6P5k7q2N4J5k4l2L4
6728bO7r8k0Q2j0n7N4P6j12k7Q4n0k3K3R5q8l5R2l1n6LJ15n1r0J24m7o0J2O1J1
$$ plain form
6539 37 -116 57 20 -97 14 -6 -6 24 19 6 28 -15 -59 95 42 -65 57 46 -78 -65 80 -34 -81 56 -23 -71
6565 -71 -31 39 14 -3 59 32 12 -12 32 68 -45 2 17 -28 -61 34 60 -39 -15 23 -14 -48 -3 56 -19 -41 35 42 -35 6
6595 6 95 -30 -53 55 -15 -88 -13 8 -39 -15 0 20 -2 -12 26 73 -9 -17 102 -15 -106 64 50 -89 23 117 -73
6622 -73 -64 66 -32 -10 43 26 -19 9 -27 -3 88 -42 17 103 -45 -69 80 3 -140 78 54 -155 9 81 -91 -30
6648 -30 97 -29 -20 59 -22 21 45 -37 26 62 -49 -26 129 -81 -95 121 -9 -113 72 59 -103 36 96 -74 31
6673 31 68 -23 -9 11 -19 -10 46 -56 28 73 -108 13 98 -61 -89 121 14 -136 92 32 -72 34 63 -10 -9 58
6699 58 -6 1 15 -52 29 11 -77 42 33 -56 20 102 -31 -32 111 12 -99 13 29 -51 -15 60 33 -49 5 20 -4 -36 -2
6728 -2 65 -33 -53 29 19 -38 16 92 -20 -47 37 -13 -36 -13 82 -6 -41 51 20 -36 -33 82 31 -59 65 18 -42 -30 31 42
6758D2o2N1j1op2K3R4r5kR4l2j39J05R5j60P7J12j55m3R1qn0P7Qo8O9n4L4P5j43
6788e3KJ40j02r8J95J0k20J46Q6k07Q7J30j22o4J37j00m3J35m3k1Q0j16OP7j09
6813f7j7J95j23j18K23m9j76J78P4j93O1J24j39j0Q0p9RQ0o3M9K5j46N6J03j13
6838c6nJ79j49j23J93k0j34J69N6j83JJ01j03lJ06l8kl0m4Q3K0p8N1Q6j58QJ36
6865H3p5j04J57nj24Q5O1r6l4R3m5l8M4J7J2p0J1P8n3oL5L1j34J0J30o5j6M4J2
6894C8r8k3J34m5l3L1L9o1p2J57l4n4N8Ql5o6R3k6l9J1J8M3q5K7J00j01n5R9N3
6923H2j49M5J27j62j9J37m2q0R5Qj10K5L3j0M0k5k4P3m2m1J15j9j54J15J11k21
6949i2P9J42j75l0J32l2j17J62pj25O6n9L4R1o5J6N0m6j38J56J7j83J85K6j76
$$ plain form
6758 42 -20 31 20 14 -58 -35 59 -36 -38 56 24 -115 -10 85 -75 2 114 -41 -84 7 -1 -51 26 34 -34 35 -19 15 90 -53
6788 -53 -51 89 -13 -111 84 94 -126 20 106 -101 -14 116 -6 -70 67 -33 -76 59 16 -5 75 -41 -35 42 -67
6813 -67 -84 111 -12 -130 93 44 -132 46 120 -73 -12 112 -27 -37 43 -36 -27 53 -10 39 64 -82 -26 77 -36
6838 -36 -41 138 -11 -134 59 39 -95 74 130 -53 -52 49 -54 -57 49 11 9 -21 -65 18 38 -40 11 97 -61 -53 83
6865 83 8 -96 61 56 -68 17 78 -18 -52 41 -4 -42 2 19 31 -39 -28 50 -3 -9 26 57 -77 -67 63 -2 -18 26 38
6894 38 -60 -83 51 6 -27 4 43 -18 -90 67 33 -21 37 45 10 -56 37 11 -28 -17 1 44 -41 -14 86 -15 -70 29 82
6923 82 -67 -22 105 -57 -76 61 19 -61 34 42 -68 -43 -10 -20 20 -5 -29 44 2 -39 76 57 -97 18 129 -92
6949 -92 -13 129 -46 -76 56 24 -93 69 62 -63 3 -56 -22 69 4 20 70 24 -114 42 59 -124 61 87 -89
6974h9K1J56j40l2K03r8p6J07o2l3M3kJ8O5q4l3J09r0r5J89j1j71J42O7k07O1
7000d2J45j17lJ14n8r4O1j5MK7k8J2J3p0nJ24r0o1J48k0j41R2Q0j35J1J34o5n1
7028c0O2jn1k7K9K5j2j2M2No3K6O6l9o8J12k3r8M4N4p1j3J05j5q5rP8n0n3R1K5
7059D4q0mN4No0O0M0m9l0J2O0j01OQ3qq9N8Q1j29J1J27j04n1R5J5r6L5R3p9QK5
7090C2k2J9o0j1O4k2o9J09M6j83O3J35j30j0J33o2j32J16K3j25J27jo5L1k6%M2
7117B2j5l2O8Kj56J52O3j85Q2R5j14p0J94o5j50J54j8p8M9N1m4j6J7n8J03l4p1
7144e4J23m6j23J11R1j60L3J82k16l0J76q0p0Q3K4r0M1L4k3L5m9j9P3m9k2J21
7170I6l7j54P6O8j05L8J41j09q6P9j8n9O9Q2p0l8OJ7j0j5O9K4p2m8P1lj17J18
$$ plain form
6974 -89 -68 88 -52 -84 119 21 -55 52 -10 -43 0 -2 16 81 -3 -36 73 -17 -112 77 66 -105 37 104 -103 -42
7000 -42 103 -14 -17 97 39 -55 6 -9 -5 22 -6 6 19 -51 -56 68 -22 -83 65 45 -96 -4 76 -59 -48 86 21 -30
7028 -30 32 31 -20 -47 -18 7 -5 -17 25 30 -33 -7 59 20 -48 64 41 -57 -13 41 -30 -43 62 47 -38 -47 31 -19 -72 19 44
7059 44 -36 -40 14 19 -41 19 59 10 -20 -8 52 -49 -43 40 32 -57 1 82 -47 -36 91 -13 -64 31 46 -50 -15 78 -1 7 32
7090 32 10 29 -31 -42 22 0 -69 40 86 -97 -34 101 -29 -39 94 32 -100 16 39 -86 41 40 -25 6 -20 -20 22
7117 22 7 -25 43 45 -111 41 104 -81 1 96 -18 -88 106 41 -109 45 27 -51 -2 49 5 -11 6 -52 51 17 -54
7144 -54 69 23 -100 11 102 -58 -25 157 -59 -89 87 7 -63 20 44 -46 -5 29 6 41 -8 -27 46 -3 -25 96
7170 96 59 -95 -19 49 -56 -18 123 14 -72 7 -11 -70 -1 81 11 -27 -21 -4 -14 -29 40 64 -8 -56 15 12 -105 13
7198A3N5r4J2N4j0r4P1M6o8K5M3lj28M0O7l1K7M8kj16j1N8j7K9NM9q9p1J07K8
7228D3m6RQ0j00q8J47qp5M2N9r3j4R0l0%k2Npmk0M9N6j42O7Q5j19J3J29q0j27
7258a01J31J9j62J26O1j16PP0l9pJ2j8L0np0Q8M6j48L2J39j24l2J81q5j39J34
7284C0J1j45J25Q2j09j1M6k5mK6j7M4k1j12R2L2j07N9J36j61p6K09j07r8J54K
7310E5j17L6R6q1J2M5o5L9k7rN7l5p7Q2Q1j47N9J20j64k7J26kj15P8P6j33J7M7
7338B7Nj5kK7l5m8oN6On1P0K4j27O0P9o8m6R8rj07N0M1m8k2O8N3j02%P6n6k1J7
7370fO1m0k6N0pn3j4P8%r3P9J7n9m7R7mq3Q8L3r4k0R2m0n1O1K0m7J4j9K8j9m2
7402d6P4L5r7j2J14q0p1J49Oj35J00O1j23k0J01n7k3P7l8j7Nk2J7L1l2K0P1j23
$$ plain form
7198 13 68 -26 -14 40 30 -64 7 53 -15 10 53 50 -78 -38 29 -2 25 73 71 -45 -56 2 -15 14 19 68 -21 -92 15 43
7228 43 -3 6 86 -14 -102 45 37 -38 4 63 -30 -44 46 16 16 -6 -1 -8 -12 -32 17 73 -69 -2 83 -36 -23 106 26 -101
7258 -101 30 49 -113 13 74 -42 -35 35 -4 -11 1 -17 13 8 -62 26 72 -76 -44 95 -29 -61 120 35 -104 30
7284 30 41 -104 21 103 -6 -17 29 4 0 26 9 53 32 -80 12 44 -63 -4 132 -29 -105 104 -3 -101 53 55
7310 55 -62 -26 70 -11 1 46 -19 20 -7 -16 41 6 -71 11 92 -55 4 124 -40 -67 59 57 -58 20 96 -37 -20 27
7338 27 32 17 15 42 7 -41 -47 9 15 -36 34 58 -69 -9 70 2 -44 54 45 -62 -12 29 -19 -41 27 80 -22 -22 54 -2 -23 -6
7370 -6 55 15 -11 39 32 -21 -35 43 43 -50 29 46 -13 -60 37 33 -50 38 71 -23 -43 49 9 -42 19 39 -8 6 -13 15 -4 -46
7402 -46 28 63 -34 -46 68 -12 -83 66 72 -63 37 98 -25 -45 56 -1 -24 53 15 -2 3 -19 -2 29 -3 17 88 -35
7430c5l5J36o8o9J36K9j67L8R9j07oJ20n2l5K1J3k8L9l2K2L1j02O1O9j03l6J48
7457H7o4j08J60Nj49N8Q0j11k4J43n8k1J2k7M1k7nJ7L4r9QJ28j27lJ32o4q1P2
7485IQ2j62N8Q3q6k2O6km2K5J8qmm0O5Nr5L1N1n9oJ11k6j05N1N3r4NR8qj00K3
7517b5N3o3K9L0On7oN5j8l6L1K2rn3P3J2r5N2K3lq8J22Rj23O2K5j9k5O4K0j18
7548e0L5LLj2K5M6o7k1PP2m6l2J21p7j05R0L1o0K4J21j15m7P5k4k5L1K6k3j5Q
7578aj8M6m6J4Q2n6o2J02l7j10Q1Q4j15PJ08r7m7Q2J5m3RK8l1k0j1L0O3q9J6Q5
7608F9q7l6J03K7j32O4N2j27L5J11n4n5N2j6m5L9K1K3k8m6L0K3n1J0R5p1r2R5
7636IKq5O0Q6r3k5R7n1l3M5L9n4j2L9k0pm9N3M9o4K1N7o5o3Q1L3q3M7N9p0o0N9
$$ plain form
7430 -35 -70 66 -2 -71 65 94 -73 -35 64 -43 -49 71 19 -16 5 18 -10 29 -3 19 50 -52 9 78 -25 -61 87
7457 87 23 -85 75 80 -69 -11 69 -42 -66 77 19 -2 10 -17 24 -3 -8 9 43 -56 -48 80 -47 -50 82 18 -63 9
7485 9 91 -71 -13 70 -16 -38 28 26 -16 9 27 19 15 -25 40 45 -50 -19 32 -27 -33 78 52 -53 -2 51 -43 -38 60 52 -48 -25
7517 -25 28 -35 -6 24 30 -27 -33 22 4 -32 -1 21 12 -41 32 44 -51 1 24 21 -67 55 64 -59 3 28 9 -16 48 68 -50
7548 -50 -15 -12 -9 -21 4 50 -17 -38 -31 41 -5 -37 84 7 -98 -8 23 -37 -13 108 -7 -54 21 -3 -28 3 29 6 -9 -1
7578 -1 -19 27 -19 -5 77 21 -41 61 24 -86 -5 79 -36 -29 79 -18 -65 17 32 -11 -2 26 -5 -25 -36 -6 57 -32 -16 69
7608 69 -18 -54 49 76 -56 8 60 -67 -32 79 25 -30 22 6 -39 0 21 44 16 -30 0 23 -28 -18 77 6 -86 9
7636 9 11 -74 -14 72 -21 -46 51 0 -33 12 51 -3 -15 24 4 -3 -52 1 50 -14 7 64 -1 -64 17 50 -33 14 73 3 -57 2
7668BL1o9M9N6n3o7K3M5m3J0N7j5n8jO5%o5N6L6q9k4R8k6q8P3M1o9NN5k0n4N9
7700B0J1l9K4LJ9n4j6P8m3j2lN5n7o3J25m3n7N8N6r0l3J30n8m3M6J6l6k1N5j5
7730A3k4RJM8q5OQ3o8n2Q4L1q6M9Q4j04j7R1l4o5M1M9q1jK7JJ6l4K0N2p7KN1q
7763B2q0O8O2j53O6Q7r6k1P3K3j18O1L6n5J5oO3k5k8K8L1o0m7J24k7j05Q6J3p8
7792d1lQ8l3o9J06j8o1K3N0j6n1L1kml1J8M7n0k7O7j0r0N4P5p5MP6k8p1N8N9q5
7824ioM6j7m5L5L8j5l3%K9n1nP4oo0QP8q4j3J03kr6J0P8j00l6P7J6o4J9M4k1k6
7857c4K7M4j0n1M9J1o2j4Q8j7p3Q7J3r9nQ9m0p2J20j3o8J2K7J1k4L2J1k6m7OP1
7888D3o0qO9l2q8M0R6j03RJ03p0n2O8M2p3L4M1n7j4J5J3k2l5L5M9n2l4P5K8j06
$$ plain form
7668 2 33 -36 13 69 16 -51 -28 17 -26 -16 41 26 -32 -33 32 32 -33 23 59 -30 -54 44 18 -70 3 44 -25 -20 35 15 -39 20
7700 20 31 -8 16 19 38 -16 -32 46 3 -9 -12 43 -14 -77 48 5 -52 6 62 -28 -61 69 11 -32 14 30 -6 -27 28 13
7730 13 -11 -2 -1 47 -38 -32 51 -17 -69 15 46 -40 9 93 -11 -28 63 29 -36 5 54 -27 -28 -1 0 16 -18 2 54 -23 -21 30 22
7763 22 -58 10 72 -81 -15 72 -24 -45 28 51 -67 -6 30 -25 -10 -16 47 22 -6 22 53 -7 -54 70 43 -62 24 37 -41
7792 -41 -44 44 11 -58 48 30 -31 -8 42 26 -25 6 4 0 -31 -13 34 -16 -43 24 14 -76 -22 53 -22 -18 58 30 -41 17 76 -9
7824 -9 -15 31 14 -31 4 42 27 -6 -6 23 -28 -33 41 35 -25 -17 61 -23 -36 67 65 -31 -21 57 -43 -79 -2 14 -50 -31 13 -8 -34
7857 -34 -7 37 27 -24 25 36 -26 -40 48 31 -42 45 58 -41 -46 43 3 -69 51 38 -30 -18 9 20 -4 28 39 13 -34 -28 43
7888 43 -17 -25 44 12 -76 -36 60 -43 -34 69 -1 -53 15 57 -16 18 59 2 -12 3 16 -6 -41 -6 43 -9 -43 32 60 -46
7918d6N0Q7j16rQ4k7p4N5N3r3L0M9m3j8j4L6nk1MM9k0o5J12pr8N5N1o1q1J34j2
7949C9r2P3J5m6k5M5L0n6M1k0J8l6jP1l8m6M9L7r4pJ02o6m7R7kr0J6Q1n6l9P3
7980B6K2n7lJ1J8k7MM2j4l3j3O0o7jR8m8n9K8N4o5K3P1n4l3J9L1n5jO7l7k5%L5
8013A7pn7N3M7o0l2O0Or3P7O1q2k4O2j3r0R2K8n5oL8mn4M5K4ok9rN6n8l3O5K8
8046D7p4JR2q1m0Q6Qq1L7N5q2mM5Qk7j7L6j2rNK2Op2Q9qo9L4N6l0n9P1Pr0N6N3
8081E9n8k5M5Ll5j4M2J3n3J5K6K1p9M6M2q3J0M3J1r8Q5J8q9N2M0k6m5N8Ro1L6
8112HmL3m7j0P6m0l9K2M8l5n4J05n5n3M7N4n7m6J12o3l4L9K6k6l4O3j3l9JOL4
8143B5p6L2M5m3k4O9Qq8N2O6n9k6P4k6o0J8L8j8l3M3nKm6M1L0n5J6N3l3n4M5M1
$$ plain form
7918 -46 4 91 -25 -34 50 23 -51 4 57 -36 -6 43 0 -18 -32 4 -1 -22 -18 31 11 -54 58 51 -47 8 59 -2 -83 51 39
7949 39 -53 20 35 -11 -36 9 39 -17 24 4 22 -14 -15 56 18 -28 21 58 -36 -43 59 -7 -54 43 41 -49 -33 48 -8 -47 26
7980 26 48 -9 -12 -1 17 -10 -6 36 22 -11 -24 36 -31 -32 66 18 -41 -13 41 -24 -1 70 16 -17 2 33 -22 -23 44 7 -18 -18 17
8013 17 10 -47 6 53 -7 -39 21 27 -66 11 72 -10 -34 28 15 -75 17 45 -10 -16 22 18 -36 9 33 27 -2 -11 45 -13 -46 19 47
8046 47 -27 -26 66 -15 -55 31 39 -42 -5 50 -32 -36 9 17 -10 -27 9 -3 -12 -7 15 21 -51 38 30 -39 -5 51 21 -38 33 40 -50 6 59
8081 59 1 -24 21 24 -11 -25 17 30 -23 -8 18 39 -40 6 48 -35 -25 18 29 -69 16 34 -55 -3 37 11 -34 24 33 -28 8
8112 8 4 37 -10 -20 56 16 -23 -1 47 12 -42 63 8 -45 2 56 -1 -47 65 2 -32 7 33 7 -27 36 23 -16 -15 -9 25
8143 25 -51 -19 26 -17 -41 28 36 -52 0 66 7 -19 55 29 -31 -13 25 7 -26 17 12 14 -32 9 39 -16 0 53 20 -34 11 52
8175E2r6M8P7r4k4L1L5r8N6K6m3k0K0O8m8k
$$ plain form
8175 52 -44 4 81 -13 -37 -6 29 -69 -13 13 -30 -50 -30 38 -10 -12
8191a2
$$ Imaginary data points
##PAGE= N=2
##DATA TABLE= (X++(I..I)), XYDATA
0@%%%%%%%%%%Qj6J6j6J6k2L0l7M5n0N8p0Q3r8J14j30J46j69J94k19K50k82L16
33A67l55M00m48M97n51O12o81P57q37R21j014J117j228J351j486J632j794J975
51A035k177K402k652K935l261L639m084M611n243O024p013Q297j0026J2468j6142
66i187K2177l3537O1144k27465k55238O91682m12813j27178L42207J5720l00386
77b32874K25627J73514m52803M36240N3693m34217L22930R2296l82527J69037
87b9084K91702m01497J50961K45180l40498K7156K72047k37259k31796M70149
97B17061k22288k70482M35750j33373j69303J61400N9109j98060J57647O4811
107A02272l04702K77579l3073k49893K02090J42375k31547J0003L06079l22215
$$ plain form
0 0 0 0 0 0 0 0 0 0 0 0 8 -8 8 -8 8 -14 16 -21 24 -26 32 -38 45 -53 61 -69 77 -92 102 -117 133 -149 167
33 167 -188 212 -236 261 -290 322 -359 398 -439 482 -532 585 -643 708 -778 854 -940 1035
51 1035 -1142 1260 -1392 1543 -1718 1921 -2163 2448 -2795 3229 -3784 4513 -5513 6955 -9187
66 -9187 12990 -20547 40597 -186868 -442106 249576 -163237 -290415 51792 67512 -232874
77 -232874 -7247 166267 -286536 149704 203397 -230820 92110 184406 -198121 -29084
87 -29084 262618 -138879 12082 257262 -83236 -56080 215967 -21292 -253088 217061
97 217061 -5227 -275709 160041 26668 -142635 18765 77874 -120186 37461 102272
107 102272 -202430 75149 42076 -207817 -5727 136648 -94899 -84896 221183 -101032
117a01032M7744K32098k27065N8789R4033n4573j18843J74676p365j82946J71186
128H6702p9288p6889M5156l8983j9571N5318l4731p2914J46622j8396k8858M8988
140A3156P6077m2568j11631J47508o3070r552J8989q697O6775j39829J03198K635
152E2991p1594O8697m2815j9520n5128P3452n5005n2668J30528o0016k5300P6033
164A9655J619n2022Q0740m1646q0086J47498q5305q8098J53959J0601j78499J19744
176H160J48017k39441R7510J45418k09796K8078J24994j42509k3988J81308j61211
187d3460n5312J98950j56888o2713J99414r3786j29648K16293o7944j85932K65401
198H4375j9248k12306K22281P0241k57939J26399J65285k58313O1955J80437k20362
$$ plain form
117 -101032 -53288 178810 -48255 10534 104567 49994 -68849 105827 98462 -84484 86702
128 86702 7414 -69475 -24319 -63302 -82873 -27555 -62286 -135200 11422 -6974 -35832 13156
140 13156 89233 46665 -64966 82542 19472 9920 28909 20212 86987 -52842 50356 52991
152 52991 -18603 50094 7279 -12241 -67369 6083 -48922 -101590 28938 -31078 -56378 19655
164 19655 21274 -30748 49992 8346 -71740 75758 -9547 -97645 56314 66915 -111584 8160
176 8160 156177 -83264 14246 159664 -50132 -22054 102940 -39569 -63557 117751 -43460
187 -43460 -98772 100178 -56710 -119423 79991 -13795 -143443 72850 4906 -181026 84375
198 84375 65127 -147179 75102 145343 -112596 13803 179088 -79225 -17270 163167 -57195
209e7195J6371J74424j98431j3637K12104k01198m8549K46385j70906j22896K59789
220I6261r1437j94321K80935k1867k34705K44160K5356k47863J67294J15012k43510
231a04685J00097J59665k41620N8882J53513j95782L7041J68673j76876k4855
241f5947K05501j83160p8347K39708j29737j23410K14887m5686j74869J72801
251C1741K3331j83773J46464N3108j63287J04489O7061j44906O4314R2970j37377
262d5865M4685J12494j44042J8434J19152j39724k0590J39452r4508o7597J39457
273F1348m8335j09198J11270l070q9313Q3941J7450o7722M1916J4563n7199M5962
285A613L4335n6994M5818K4376p0918K5861L7079m4385K153N0000l5843l3715
$$ plain form
209 -57195 -40824 133600 -64831 -78468 133636 -67562 -116111 130274 -40632 -163528 96261
220 96261 4824 -189497 91438 69571 -165134 79026 104382 -143481 23813 138825 -104685
231 -104685 -4588 155077 -86543 -27661 125852 -69930 -32889 135784 -41092 -65947
241 -65947 139554 -43606 -121953 117755 -11982 -135392 79495 33809 -141060 31741
251 31741 55072 -128701 17763 70871 -92416 12073 79134 -65772 -1458 91512 -45865
262 -45865 -1180 111314 -32728 -14294 104858 -34866 -55456 83996 -10512 -78109 61348
273 61348 13013 -96185 15085 12015 -77298 6643 24093 -43629 -1713 12850 -44349 1613
285 1613 35948 -21046 24772 49148 -21770 4091 41170 -3215 -1062 48938 13095 -20620
297b0620L7811j5129k3656J4615J2399p255k2596J3978R444k5589k636L0814o447
310d867k3769L9759o15l1132L3126j834j8395L4301j051k8416L5303o078n8009
323c1677N4947J3176q0299N5149L5242r9979K8258P5883r1967m489J00151q0799
335b6404l3742J04549n4352m4072R6537m0732n8789R8831k5030p0680J10744j8884
347C7976j04561J10422J0340j23126J00330N2318j48561N5807R1388j43757K7161
358c4263J21358j25998j5030J16036j00304l6393J30703p4525n6386J36304p0624
369i122p3565J49206m0875j01566J43697m888j47367J30082L9969j65332R5084
380A5323P2850j54537M6847J07054j37177Q215J16957j28264l971J21301r9340
$$ plain form
297 -20620 17191 2062 -21594 -6979 5420 -1835 -24431 -10453 -1009 -26598 -29234 1580 -4867
310 -4867 -28636 11123 10508 -20624 12502 10668 -7727 26574 25523 -2893 32410 26332 -31677
323 -31677 23270 36446 -43853 11296 46538 -53441 -25183 50700 -41267 -45756 54395 -26404
335 -26404 -60146 44403 -9949 -54021 42516 1784 -57005 41826 16796 -53884 56860 37976
347 37976 -66585 43837 54177 -68949 31381 83699 -64862 -9055 82333 -61424 -34263
358 -34263 87095 -38903 -53933 62103 -38201 -74594 56109 -18416 -74802 61502 -9122
369 -9122 -82687 66519 25644 -75922 67775 62887 -84480 45602 85571 -79761 15323
380 15323 88173 -66364 -19517 87537 -49640 -41425 75532 -52732 -56703 64598 -34742
391c4742k6263J23743q1329o3799J51104n7967q2790J46230l9776j13259J11246
402C2398K1937j28800R1175O0054j40071O0727O2376j00019L4454P1085q4192
413a8876k041P9400r8402J751R3258q7667j1841R0526n6322n3529J01514k9825
425G946p5272R6532j0868o7102O4873J9517o8063L6511M0947n9206L2084K8943
437D6842m9476P725J5121m3525J0304M2215n1024M744L6158m5365j3038M2346
449C027L975l5070L3996J745l2468K0265N392J1625p20N591N76j3870j191l65
463B508P184k0296J4898J104k2392J7646N836l701m440J7884k5130R433J4653
476A5187n3225M5787n32m9352L0469L6202l6228j9303Q1910n4225l4027P7187
$$ plain form
391 -34742 -61005 62738 -18591 -82390 68714 10747 -72043 74187 34411 -78848 32398
402 32398 54335 -74465 16710 76764 -63307 -2580 59796 -40223 -5769 65316 -18876
413 -18876 -20917 58483 -39919 -38168 55090 -32577 -44418 46108 -10214 -63743 37771 7946
425 7946 -67326 29206 18338 -48764 16109 35626 -32437 4074 45021 -14185 17899 46842
437 46842 -2634 5091 20212 -23313 -13009 29206 -21818 -17074 19084 -26281 -39319 3027
449 3027 7002 -28068 5928 7673 -24795 -4530 862 12487 11767 17358 17934 4064 2873 2508
463 2508 9692 -10604 4294 5398 -16994 652 6488 2787 -1653 16231 -8899 534 15187
476 15187 -38038 7749 7217 -42135 -11666 24536 -11692 -30995 50915 -3310 -37337 39850
488C9850m6535k1362N2035j5259l8707O0602m58n8982O7705l939o5003M8286J3254
501C1487p7149M0104L1698r6901M7474O0835q5719J9908R2309q1049l3499J06937
513E6435n9609l6879Q8661l2668n2629P4583j7382p6159J14470k4523r2680J03282
525D4902j8922r1804O2066M9132j04661M6521Q1253j31937M8221Q0363j10099
536d4965J5504R2774q1050l3196J02473o0529l6894Q5356l3413m6019Q5045k2797
548B2289q6961J16735k9420r4689J05431O853p7453L4367P0204r7200P830Q8327
560F6313j11080K6967N7344q1327R37O5507m3189l4573R6664m3155l1260P5946
572D5094l9295l0372O0067j5200o9562Q5296n350q3081P6367J1523n4917J2684
$$ plain form
488 39850 -6685 -28047 23988 8729 -29978 30624 30166 -28816 38889 34950 -30053 18233 31487
501 31487 -45662 -5558 26140 -70761 -23287 37548 -48171 -28263 64046 -17003 -50502 56435
513 56435 -3174 -40053 48608 15940 -36689 37894 20512 -55647 58823 34300 -58380 44902
525 44902 25980 -65824 -3758 45374 -59287 -12766 68487 -63450 -15229 65134 -44965
536 -44965 -29461 63313 -17737 -50933 51540 -8989 -45883 39473 6060 -39959 45086 22289
548 22289 -64672 52063 22643 -72046 33385 40238 -37215 -2848 67356 -29844 -22014 66313
560 66313 -44767 -17800 39544 -41783 -40846 24661 -18528 -53101 43563 408 -30852 45094
572 45094 5799 -24573 35494 20294 -49268 36028 30678 -52403 23964 35487 -19430 -6746
584f746M2178m8378o405L9658n3965K2801J6177l1366J0273L5834j9671k4813
596b4423O0627l5111j2115K9817j9822l865J761J7737m1450L1155K0219m7390
608b2860L4468J481l800j7062P160J4494k0948N993o684K0578j6416r781J5987
621B610m083J85j3718J5955q889Q623j4687J359L9254m4820K3984J4512j9723
634E62L397Q448p99l4200N5578k9842l4940O4592k8565k8689K3355K1740m5946
647b5309J6649K6157n0995L9295n114l1433L5455K2307m5044O743O6029p5563
659b0823q02O3512n0534j0040M3720j8919m2384O3595j6686n1881P6373j5246
671A9885n3710M4529J3080n9806L5667K7303o8271M8047J9956o9992L9903M8516
$$ plain form
584 -6746 35432 -12946 -19351 20307 -33658 -10857 5320 -26046 -15773 20061 390 -24423
596 -24423 36204 1093 -11022 18795 -1027 -4892 -3131 14606 -26844 4311 24530 -22860
608 -22860 11608 13089 9289 -7773 -613 13881 -7067 -1074 -7758 12820 -3596 -13377 2610
621 2610 -1473 -1288 -15006 949 -7940 683 -14004 -12645 26609 -18211 5773 20285 562
634 562 3959 12407 11608 -22592 32986 3144 -31796 32796 4231 -24458 -1103 20637 -25309
647 -25309 -8660 17497 -33498 5797 683 -30750 4705 27012 -18032 -11289 54740 -20823
659 -20823 -21625 41887 -8647 -18687 25033 6114 -36270 27325 10639 -41242 35131 19885
671 19885 -33825 10704 23784 -36022 -355 26948 -41323 6724 26680 -43312 -3409 45107
683D5107p7181N660Q3304p8071j5190P9498m6686k7028O2106k1438m4070P2666
695C8677k5214n1586P5191k1355n4285N1930J2064o7171M2228L1340p8542M7985
707A262L1006p2296K8068N1607o0777r009P7260n3087k5890O4853l3134k0242
719b0379M5214j4571l1212M7507j8836m5993O3694j0739m6577M7701O719n3676
731c1148K4511L0458n1361K2894L4589n1286Q516L3714l5796m020M1817k2312
743E76j4189L0031j8965q573K5503j3367j0369K9673j4051k6507L4838k663l1038
756a9101K3997J0662k6024L803J4812j5109k583J2576o753j428P721n225j287
769c939L806k158M157M50j473M799l631l927K726K416R6p19j176J843M79j0830
$$ plain form
683 45107 -32074 -26414 56890 -21181 -36371 43127 -3559 -30587 31519 10081 -33989 38677
695 38677 13463 -38123 37068 15713 -38572 13358 25422 -41749 479 31819 -46723 1262
707 1262 32268 -40028 -11960 39647 -21130 -30139 47121 -5966 -31856 32997 -137 -20379
719 -20379 24835 10264 -20948 26559 7723 -38270 25424 14685 -31892 15809 22528 -31148
731 -31148 -6637 23821 -27540 -4646 29943 -21343 -12827 20887 -14909 -18929 22888 576
743 576 -13613 16418 -2547 -11120 14383 1016 -9353 20320 6269 -20238 14600 11937 -19101
756 -19101 4896 15558 -10466 -6663 8149 -6960 -9543 3033 -3720 -5148 2573 -2652 -3939
769 -3939 -133 -2291 1866 2316 843 5642 2011 -1916 810 3226 3322 2603 1427 3270 3749 -7081
785g081L913J4930j5506q101K3717j1902k0310K7067J48k3518J8686P278k4063
798a4742J2311J5446k5256J1634J7836k9406J1312J9413k8774P437K5232l0642
810h199k367L6703l2436j4732M5731k5129k8226M6077p926l9285L8155N221m1744
823b8157L1998J2525l7899K6227J4980m0934K1011K5210m5299J6548L6892n1262
835a8160M316M6617m5514r097N4822l3170k8688N4344j8558m0329N2383n090m3614
848b9738M2625J035m3140L5504J1708m5659L1487K1492n5701K7074L2665n4856
860b5504J6216M3923m6418o857N2935l6922k2258N5530k6675k6805M2872j3725
872F312l1002L4066N49l6146L7016J621m0101L5210M303l7345K5741K2224m1004
$$ plain form
785 -7081 -3168 11762 -3744 -11845 11872 -30 -20340 6727 6875 -16643 2043 9321 -14742
798 -14742 -2431 13015 -12241 -607 17229 -12177 -865 18548 -10226 -2789 22443 -8199
810 -8199 -10566 26137 -6299 -21031 24700 -429 -28655 17422 9496 -29789 8366 13587 -28157
823 -28157 3841 16366 -21533 4694 19674 -21260 -249 24961 -20338 -3790 33102 -18160
835 -18160 -13844 32773 -12741 -21838 32984 -186 -28874 25470 6912 -33417 18966 13876 -29738
848 -29738 12887 13922 -29218 6286 17994 -27665 3822 25314 -30387 -3313 29352 -25504
860 -25504 -9288 34635 -11783 -18640 34295 -2627 -24885 30645 3970 -22835 20037 6312
872 6312 -24690 9376 9925 -26221 10795 12416 -27685 7525 11828 -25517 224 22448 -18556
885a8556J1587L5276m3246L992L7086k8900p693K9923j6967k0057K9005j0973
897D77j5879K7369j0067j4210K0948m540j9493K3960J327k6575K1243N046k5430
910a5824J1055J7516k0339O22K0554j6215l741J1720l785n420N658Q32n649O749
924C733n347L218M610n818K868j065P70q251L713J369n611L194l071R564j0657
939f781J909J3548j2380L01P890K909j7996J4043R864k5276J6790N179j3172Q91
953b281J1490j0057p341J9585k1403L891J5317j9656M115J7798j1505j6167L3778
966A7564j4492k4597L6775j0043k3188K2199J1102l4122J9525K1310m0794K1731
978B970J3273k7982P099J8936k2611l650L5404l6983M163L6076l6960j197L2796
$$ plain form
885 -18556 -6969 28307 -14939 -10947 26139 -2761 -10454 19469 2502 -17555 11450 477
897 477 -15402 11967 1900 -12310 8638 4098 -15395 8565 9892 -16683 4560 9606 -15824
910 -15824 -4769 12747 -7592 -6970 13584 -2631 -6372 5348 1563 -3857 1801 2633 -3016 3733
924 3733 -1614 1604 6214 396 3264 2199 2969 -5282 -1569 -200 -5811 -2617 -5688 3876 -6781
939 -6781 -4872 8676 -3704 -3403 4487 7396 -10600 3443 13307 -11969 4821 10000 -3172 -2281
953 -2281 9209 -848 -8189 11396 -10007 -6116 9201 -10455 -6340 11458 -47 -16214 17564
966 17564 3072 -21525 15250 5207 -17981 4218 15320 -18802 723 22033 -18761 2970
978 2970 16243 -11739 -4640 14296 -8315 -11965 23439 -13544 -9381 26695 -10265 -11462 21334
991B1334j8246l0098M2685q111m0885M4724l067l0109K7285J0846l2805J9050
1003B603K0245m2126K1659J8176l6298R831K6845l1548m018M3946l9735n002M3593
1016B8171l4286j5229L7085q873l7966M1677L067m1604L8000P51k5906K1499Q060
1029A4446k8491J6470J6990m1742K2634J8749l4591J0089K4652k4497r906L6523
1041B1326k6404r749L3209k0308j1011K0286O34k4539K0720P433k5138J9583k813
1054C229j2084R545K749j4811J0233J7451l0891J4281J7149k4498K462J5449m979
1067E285j5811J8625n783j3675J8582r130r57Q834l752n203J349K298o008M669
1081f77k39k445M474k502l806P584L643n737K010P88K221r631k049J4731q335
$$ plain form
991 21334 3088 -27010 15675 7564 -33321 11403 8336 -21773 5512 16358 -16447 2603
1003 2603 22848 -19278 2381 20557 -15741 -5910 20935 -10613 -14631 29315 -10420 -15422 28171
1016 28171 -6115 -21344 15741 6868 -31098 10579 13646 -27958 10042 10793 -15113 6386 14446
1029 14446 -14045 2425 19415 -22327 307 19056 -15535 -5446 19206 -5291 -15197 21326
1041 21326 -5078 -14827 18382 -1926 -12937 7349 7983 -16556 4164 11597 -13541 6042 3229
1054 3229 -8855 690 3439 -11372 -1139 16312 -14579 -298 16851 -7647 -5185 10264 5285
1067 5285 -10526 8099 2316 -11359 7223 -1907 -2864 5970 2218 -2985 -1636 662 -5346 -677
1081 -677 -916 -3361 1113 -1389 -5195 2389 6032 295 2305 3093 5314 -4317 -6366 8365 30
1096C0p350Q728N501j3596L009J3429j2808K585M624p648p25P485o046m733J7207
1111I692j2084l966J3161q134k555Q519n25j3265J7057j908k3975K5105M256k4688
1125a3310J2895J7939k4966k331K3199j8989m03J7501j5396k848J7929j8478p491
1138a4749L2202j9104j2974K9131j3111j9198K4691K146k4818K7205K864l3431
1150a9146K3325R985k8915J1375K3545k8051j328K3059k3806L932J8521j8872
1162f376K82K2624k1995j3292L7394j8010k2121L5207m462k7548K3279Q063k9863
1175a6818K1329R205k8139J7135J1797k5683M145K3330k5054N20K4788k4850L944
1188d351J6280j9255r56K2984j4479j7782L2329j0852k3615K5932K467j8371R254
$$ plain form
1096 30 -7320 1408 6909 -6687 -3678 9751 -3057 -472 4152 -3496 -4221 3264 -2782 -7515 9692
1111 9692 -2392 -6358 6803 -1331 -3886 4633 4108 -9157 7900 5992 -17983 7122 11378 -13310
1125 -13310 -415 17524 -7442 -9773 13426 -5563 -5966 11535 -3861 -6709 11220 -7258 -14749
1138 -14749 17453 -1651 -14625 14506 1395 -17803 6888 9034 -15784 11421 14285 -19146
1150 -19146 4179 14164 -14751 -3376 20169 -7882 -9210 13849 -9957 -6025 12496 -6376
1162 -6376 -6094 16530 -5465 -18757 18637 627 -21494 13713 9251 -18297 4982 13045 -16818
1175 -16818 4511 13716 -14423 2712 14509 -11174 -7029 16301 -8753 -8233 16555 -8295 -4351
1188 -4351 11929 -7326 -8282 14702 223 -17559 14770 3918 -19697 6235 8702 -9669 -415
1201d15R608j7519Q831O938j6223J3334L689j5366M110J2761j4154k668J8593
1214A1519j5862o64J3541j1890k435J3156n159j3795J6560P33j4993R582M443
1227D736o534j620N189k493K432O13p421R249j402p394M385M754k989o477P417
1242B445k08n235L819M71r05k003J713J9l762N126J820q614L770O806q535j040
1258d313Q791j379p751N222K819o070N863k913k588Q224p108n818J1556Q14j4378
1273i029J0200P148j7251O501R989j2242J218J3097j2814m136J7336j3275m815
1286h073J6176p397o747J0657k393j0435J3892k984j3535K0650l970j8850J7798
1299D789M659k1631R730J6324k0705J722J7233j7894j179J6400j3571k816J7519
$$ plain form
1201 -415 9193 -8326 505 7443 -8780 4554 8243 -7123 -3013 9748 -4406 -7074 11519
1214 11519 -4343 -5007 8534 -3356 -5791 7365 2206 -11589 4971 5704 -9289 293 4736
1227 4736 -1798 -3418 1771 -722 1710 2323 -5098 4151 2749 -4645 -260 4494 1505 -4972 2445
1242 2445 2237 -2998 821 1292 387 -1616 97 116 -3646 1480 3300 -5314 -1544 5262 -3273 -4313
1258 -4313 4478 3099 -4652 570 3389 -2681 3182 269 -2319 5905 -1203 -7021 4535 5349 -9029
1273 -9029 1171 8319 -8932 -2431 7558 -4684 -3466 9631 -3183 -7319 10017 -3258 -8073
1286 -8073 8103 706 -6041 4616 2223 -8212 5680 2696 -10839 9811 5841 -13009 4789
1299 4789 9448 -12183 -2453 13871 -6834 -5112 12121 -5773 -6952 9448 -4123 -6939 10580
1312A0580j3017p663J9149j0200r725K0792o464j3677J9796l500j9633J9449M434
1325A0321k4312J5304J2113k4688P184J5275j7849R28J5036j2456k623J5609j3794
1338c952l755J8094j4220n163J9199q452j1164J7523k410j7943J6684K673j7919
1351a0805J3092O484j6688M707J0952j3416K420J2147j0972Q79O754r646n5R969
1365E822q155k879J4261j0492p117J4387m568q443J0474K391j2097N913N075r485
1379d913M538M916n059N65L591m465j36L104n069K181K664m069L88M362l047l973
1395d422P197r37m510L524J751l843k918N787l06l264L623K022l744k274N050
1410B736k330k971L863j212l331K094J773k374M134n33l656M512j629m722N182
$$ plain form
1312 10580 -2437 -10100 9049 -1151 -10876 9916 3452 -10225 9571 6071 -13562 5887 10321
1325 10321 -13991 1313 13426 -11262 -4078 11197 -6652 -5724 9312 -3144 -5767 9842 -3952
1338 -3952 -7707 10387 -3833 -8996 10203 1751 -9413 8110 5700 -12243 4441 7114 -10805
1351 -10805 2287 8771 -7917 -3210 7742 -5674 -3254 8893 -2079 -1200 5554 -4092 -4147 5822
1365 5822 -2333 -5212 9049 -1443 -8560 5827 1259 -7184 3290 5681 -6416 -503 4572 -4913
1379 -4913 -375 4541 -518 47 3638 -827 -963 2141 -2928 -747 1917 -2152 -1764 2598 -449 -4422
1395 -4422 2775 1838 -2672 852 2603 -1240 -4158 1629 1323 -1941 1682 3704 -40 -2314 2736
1410 2736 406 -2565 1298 86 -3245 -1151 622 -1752 2382 1849 -1807 2705 1076 -3646 1536
1425A536K747j0582M838P064j1843M061R388p758m366J0885m993q251J3119n601
1439B44n588Q568l004m040P149J625j0720J0376o32j3688J3358Q38j1934O059
1453a389Q780j4544J393J7131j5244m06J2811r737n392J1585k463r862J3981n672
1467I72q701J4390m694p848J1035n8j6652J2663O166j8756J3359P903j7347L721
1481c847J3627j3863j119J7044j4250l871J2004q467m242J3120m422q152J4740
1494H302q119p816J3705l761j0034R890N579j8115J0678Q264j6715P544P100o604
1508a02l555J0644p546p782J3354j0092J972Q778n449k438M542o87j0171J5280
1522F748k331j0162J2103n624p801M316Q725r160K448R644j3391K486K343j361
$$ plain form
1425 1536 4283 -6299 -1461 5603 -6240 -2179 7209 -549 -4915 5970 977 -7274 5845 244
1439 244 -5344 3224 220 -3820 3329 4954 -5766 4610 3978 -9710 3648 4486 -7448 -1389
1453 -1389 7391 -7153 -5760 11371 -3873 -4279 8532 -1205 -6597 4988 2525 -7337 6644 972
1467 972 -7729 6661 1967 -5881 5154 5096 -11556 1107 7273 -11483 1876 9779 -7568 -3847
1481 -3847 9780 -4083 -5202 11842 -2408 -6279 5725 -2742 -6984 6136 1714 -6438 8302
1494 8302 183 -7633 6072 2311 -7723 2167 7746 -10369 309 8573 -8142 -598 6502 -102
1508 -102 -3657 6987 -559 -8341 5013 -5079 -3107 5671 222 -2216 2326 1639 -8532 6748
1522 6748 4417 -5745 6358 734 -7067 -2751 5974 -3186 -738 8906 -4485 -1999 344 -1017
1536a017M02J792P3m211N757o433K636N135n024Q41O61K472p297M662K356o441
1552c636M003l7J510m461M949n4p046O251j353m0j823L861m73n293N061j721J668
1569A366j942P58L92j541J477m280O840k377m166M237K214k949l557J0315q408
1584a621l586R646o119p31N290L63q967O767K426r866R800j71n545K615M85n494
1600d708M615N444j1789R126L673j2895M243Q612o377o442J4098o959p540J1592
1614D693n481k492N499K40p417O795L062j2378J0247J067r267O465L501q769K554
1629a681R216j4895M003J2774j3708k87J2399o555r758J3390k174r136J1665m736
1643E17m959P795l159o251R648J785j2860J0025L313j2825O595N663r122J397
$$ plain form
1536 -1017 -615 1177 1250 -2961 2796 -3637 -1001 4134 -890 -49 612 3084 -4213 449 2805 -3636
1552 -3636 367 330 1840 -2621 2328 2274 -4772 1479 126 86 -1737 2124 1651 -3642 1419 -302 1366
1569 1366 -576 182 574 -967 510 -3770 3070 693 -3473 764 2978 29 -3528 6787 -1621
1584 -1621 -5207 4439 -1680 -2411 2879 3242 -5725 1042 3468 -6398 3402 3231 -2314 301 786 -4708
1600 -4708 -93 5351 -6438 2688 6361 -6534 -2291 6321 -56 -6498 7600 641 -6899 4693
1614 4693 -788 -3280 2219 2459 -4958 1837 4899 -7479 2768 3835 -5432 1033 4534 -4235 -1681
1629 -1681 7535 -7360 -3357 9417 -4291 -4578 7821 1266 -8492 4898 2724 -6412 5253 517
1643 517 -4442 3353 194 -6057 3591 5376 -7484 2541 5854 -6971 -376 5287 -3835 -2438
1657b438Q529r486j165J1155p789l540R937k908o870O296K54n535M903o55l999
1672c311O565j601p583Q627J507j0135N815N945q089j031P841n802k433P411n145
1687a419K61M355l725j689K801M07m112M517M82l153L860l405j161L590r85k990
1703b366K639L794o403r39N788j942l301L008K999l483j441K189o48j191N65Q30
1719I8M26P77q73j003J365n48j442J828P78j569j0m29k266J642L444l561J323
1736b0N591o339l623O381J94n644M141L759p238R83K256k799L534O94l191K331
1752A010J814o588J905O283o806M44O011n172j662O779l801m698Q823l032o704
1767e394P996O68p458K942M052n917K615L576n459M147J031p400M480N633q656
$$ plain form
1657 -2438 6091 -3395 -4560 6595 -1194 -4734 5203 2295 -4575 1721 1975 -3560 1343 688 -3311
1672 -3311 3254 1653 -5930 2697 4204 -5931 -116 5829 -2260 -3291 4550 -1252 -3685 3726 -1419
1687 -1419 -1158 3197 -528 -2217 584 991 -3121 1396 1878 -1275 2585 -820 -1981 1609 624 -2366
1703 -2366 273 4067 -2336 -3275 2513 571 -2730 278 3277 -206 -1647 542 -106 -1297 -732 98
1719 98 524 1301 428 -575 790 242 -1200 628 1406 -163 -173 -602 -2868 -1226 2218 -1343 -20
1736 -20 5571 -768 -4391 1990 2184 -3460 681 4440 -2798 -1815 441 -2358 1176 1870 -1321 1010
1752 1010 2824 -3764 -1859 4424 -2382 -1938 4073 -1099 -2761 4018 217 -4481 4342 1310 -5394
1767 -5394 2602 3270 -4188 -1246 2806 -3111 -496 3080 -2379 1768 2799 -4601 -121 5512 -3144
1782c144L32R566q305l666R716l936n262P558j626o509Q013l30p163O656Q29o778
1798d049M351L829n987K746K389q283M228M447p935L593P312q993l299R835l680
1813E04m987Q598r50o658L929k38l757N435M60m508L943N84n867L569L236o079
1829b786K365K895n996J854M843n002j010P162l785l583O584j175m306J454J261
1844G75k358J231J238k415L057k017k640M655N55k699M39K680m750q57N302k391
1860a95J20K237j246k813J313K576l130J323J440k217j439O81K087j196N31O82
1876G54r5K6j548R23R23r12j763J965J930l608P45K906l215j620M145m82l128
1893b054K890J71m269K414L421l098J702J954l952k10J065j015P04K288l437l96
$$ plain form
1782 -3144 -2812 6754 -1551 -5217 4499 563 -4699 2859 1233 -5276 2737 2407 -4756 1900 2729 -4049
1798 -4049 302 4131 -1856 890 3279 -5004 -776 3671 -4264 -671 6641 -2352 -5651 4184 504
1813 504 -4483 4115 3165 -3493 436 198 -3559 1876 2336 -2172 1771 2355 -3512 57 3293 -2786
1829 -2786 -421 2474 -3522 -1668 3175 -1827 -2837 4325 540 -3043 3541 2366 -1940 -486 775
1844 775 -1583 -352 886 -1529 1528 -489 -3129 1526 2081 -618 -179 2501 -2249 -3106 2196 -195
1860 -195 -75 2162 916 -1897 -584 1992 -1138 185 1625 -592 -2031 -1350 737 -459 72 754
1876 754 659 685 -863 60 983 71 -1692 273 2203 -1405 -660 2246 -969 -2589 1556 1074 -2054
1893 -2054 836 1007 -3262 -848 2573 -525 1177 3131 -821 -1031 34 -981 -277 2011 -1426 -1822
1909a822M081n096J059O094l476l315M473k95o581N697J840n939L758J559l310
1924a273J120L567m174k25L541n975K292L409m650J065M085m147k267Q574l795
1939A147m442Q027l162o094M823J952o131L603L683o170K990K122m535K009K443
1954B265m394J327M572o123O26N336n694p99P107k796m651O544k028o657N474
1969A09J863m438L076K719n448J146K389l685K992K176m135Q64K621n115Q10N942
1985C886m496q33M949l330l899M688K0m423M200R48l088J483J345j568o7J604
2001A419k082J190M46k862J617P18k271K94M073k256j839M306k076k847K107J727
2017A664l215P04K941l238M29J101l2l00K17R34j622P15j386L91J048j522J354
$$ plain form
1909 -1822 2259 -2837 -1778 4316 840 -2475 1998 1703 -4878 819 2659 -3280 478 2037 -1273
1924 -1273 -153 3414 -760 -985 2556 -3419 -1127 2282 -2368 -1303 2782 -1365 -3632 4942 1147
1939 1147 -3295 4732 1570 -4524 299 2251 -3880 -277 3406 -2764 226 2348 -2187 -178 2265
1954 2265 -2129 -802 3770 -2353 -1727 3609 -2085 -2884 4223 1427 -3224 3320 1292 -5365 109
1969 109 1972 -2466 610 3329 -2119 -973 1416 -2269 723 2899 -1236 -372 2249 -2866 -2056 3886
1985 3886 -610 -1443 3506 176 -3723 965 985 -3438 762 1710 -1378 105 1450 -118 -185 1419
2001 1419 -663 527 973 -1889 -272 446 -1825 -1531 2542 286 -1553 2753 677 -2170 -63 1664
2017 1664 -1551 -847 2094 -1144 -715 386 354 54 271 1205 -417 298 -1088 -697 351 -1171 183
2034A83L25L63j766J024J710l025P09K089j036k836K873R06m424K700K004k822
2050a023J61K682k071q78K348j884O74J252j544j1J785k498j047M425l215q80
2066a724L730j530k877K493K750n436K955K875n126R15J853p46k015L624j125
2081F16k294L843l878J007K696k511j230L547o40n975P236p88n439N668M50l653
2097a345N22M516n742O9N311n947K319K006k391l85J497q20j808N462l562j232
2113a530M974m198k252M354J424n657L545K659o497J786K911k137p25L383k562
2128e22j257L915l351P79K665k491j292K977j154k673N231k605k824M244p69l141
2144b268K360L296n938R50L214l151J011R30J074j404K44l27n19K712l273Q82
$$ plain form
2034 183 508 871 -895 129 1839 -1186 -477 1612 576 -2260 613 1519 -2905 -205 1799 -1023
2050 -1023 -862 1820 -251 -1129 1219 -665 9 1261 -283 -294 1491 -1007 -2054 2371 -844 -1724
2066 -1724 2006 476 -2401 92 2842 -2594 361 3236 -1890 -975 878 132 -1883 1741 616
2081 616 -1678 2165 -1713 -706 1990 -521 -1751 1796 1156 -4819 2417 1629 -3810 1858 2308 -1345
2097 -1345 -823 3693 -2049 -1980 3331 -2616 -297 1709 -682 -1067 430 -390 -2198 3264 -298 -1530
2113 -1530 3444 -754 -3006 1348 2772 -2885 660 3319 -3178 -1392 1519 -618 -1343 2040 -522
2128 -522 -1779 2136 -1215 -436 2229 -262 -1554 1423 269 -2404 2827 222 -2602 1642 873 -2268
2144 -2268 92 3388 -2550 -1600 1614 -1537 -526 404 1478 74 318 -9 -528 2184 -1089 -207
2160b07J848k336j140J542J189l241K769J024k413J545P14j739j503L608j751
2175i1j084L291j306r04j445J463J26j90J016j111J595l136r97L081N77n37k76
2192G2K581k853j976K653N27q90RJ541l088J27J907j871J188J202n77k078J529
2209CO19j972J838o32M78R03j768M67J909j299l052L353J033m151J371K512k650
2226a038j295L228n09q05J886j276o82J251o23r52J972k34k278J633r2j447K322
2243A061k44k809K489O08m010K309L355l469j408M224j408k437L353n79j097O38
2259E76j400j03J712p47k062L190m95l376L326P42k471J281J486l003N27L267
$$ plain form
2160 -207 1641 -695 -1835 -293 896 -2345 424 1448 -965 580 1294 -445 -1948 1660 -91
2175 -91 -1175 2116 810 -94 -1539 -76 50 -140 876 -235 1360 -1776 -2773 308 885 348 72
2192 72 2653 -200 -2176 477 1004 114 123 1664 -1424 -1297 610 -1261 -73 1129 552 -1526 3
2209 3 622 -1350 488 -144 334 1237 -531 -64 1845 546 -2506 847 1880 -2271 -900 1612 -1038
2226 -1038 -2333 895 386 -419 1467 191 -491 760 137 -815 1157 923 -1355 278 186 -1261 1061
2243 1061 817 -1992 497 1105 -2905 -596 2759 -710 -2118 2106 698 -1739 1614 1035 -62 576
2259 576 -824 -927 785 38 -2024 1166 671 -2705 621 1363 -1108 173 1659 -1344 -817 2450
$$ [...]
8191C0
##END NTUPLES=NMR FID
##END=
