##TITLE=1H_AM_NV 154
 CDCl3
 8 sc, 
 5.6.2024
##JCAMPDX= 6.0         $$ Bruker NMR JCAMP-DX V2.0
##DATA TYPE= NMR FID
##DATA CLASS= NTUPLES
##ORIGIN= UXNMR, Bruker Analytische Messtechnik GmbH
##OWNER= root
$$ XWIN-NMR		Version 3.5
$$ Wed Jun  5 13:36:50 2024 Russian Standard Time (UT+4h)  she@DPX200
##.OBSERVE FREQUENCY= 200.1309
##.OBSERVE NUCLEUS= ^1H
##.DELAY= (6, 6)
##.ACQUISITION MODE= SIMULTANEOUS
##.ACQUISITION SCHEME= undefined
##.AVERAGES= 8
##.DIGITISER RES= 18
##SPECTROMETER/DATA SYSTEM= spect
##.PULSE SEQUENCE= zg30
##.SOLVENT NAME= CDCl3
##.SHIFT REFERENCE= (INTERNAL, CDCl3, 0, 15.7039)
##AUDIT TRAIL= $$ (NUMBER, WHEN, WHO, WHERE, WHAT)
$$ ##TITLE= Audit trail, XWIN-NMR		Version 3.5
$$ ##JCAMPDX= 5.01
$$ ##ORIGIN= Bruker BioSpin GmbH
$$ ##OWNER= she
$$ F:/spectra/data/she/nmr/H-F/1/audita.txt
$$ ##AUDIT TRAIL=  $$ (NUMBER, WHEN, WHO, WHERE, WHAT)
(   1,<2024-06-05 13:35:33.34 +0400>,<she>,<DPX200>,
      <created by zg, POWCHK disabled, PULCHK disabled
       configuration hash MD5:
       00 E9 B6 7A A2 85 ED C7 34 08 36 98 17 FE 4E 26
       data hash MD5: 16K
       7F F1 52 F7 F6 43 20 5A 1A A0 42 FA C3 70 A3 D4>)
$$ ##END=
$$ 
$$ hash MD5
$$ 1A 42 E2 A1 07 4A 66 B1 C0 EE 82 C4 69 EF 3E 05
##$RELAX= 
##$RELAX= 
##$RELAX= 
##$RELAX= 
##$RELAX= 
##$RELAX= 
$$ Bruker specific parameters
$$ --------------------------
##$DU= <F:/spectra>
##$EXPNO= 1
##$NAME= <H-F>
##$PROCNO= 1
##$TYPE= <nmr>
##$USER= <she>
##$AMP= (0..31)
100 100 100 100 100 100 100 100 100 100 100 100 100 100 100 100 100 100 
100 100 100 100 100 100 100 100 100 100 100 100 100 100 
##$AQSEQ= 0
##$AQ_mod= 1
##$AUNM= <au_zg>
##$AUTOPOS= <>
##$BF1= 200.13
##$BF2= 200.13
##$BF3= 200.13
##$BF4= 200.13
##$BF5= 200.13
##$BF6= 200.13
##$BF7= 200.13
##$BF8= 200.13
##$BYTORDA= 1
##$CFDGTYP= 0
##$CFRGTYP= 5
##$CHEMSTR= <none>
##$CNST= (0..31)
1 1 145 1 1 1 1 1 1 1 1 1 1 1 1 1 1 1 1 1 1 1 1 1 1 1 1 1 1 1 1 1 
##$CPDPRG= <>
##$CPDPRG1= <>
##$CPDPRG2= <>
##$CPDPRG3= <>
##$CPDPRG4= <mlev>
##$CPDPRG5= <mlev>
##$CPDPRG6= <mlev>
##$CPDPRG7= <mlev>
##$CPDPRG8= <mlev>
##$CPDPRGB= <>
##$CPDPRGT= <>
##$D= (0..31)
0 1.2 0 0 0 0 0 0 0 0.06 0 0.03 0 0 0 0 0.0002 0 0 0 0 0 0 0 0 0 0 0 0 
0 0 0 
##$DATE= 1717580133
##$DBL= (0..7)
120 120 120 120 120 120 120 120 
##$DBP= (0..7)
150 150 150 150 150 150 150 150 
##$DBP07= 0
##$DBPNAM0= <>
##$DBPNAM1= <>
##$DBPNAM2= <>
##$DBPNAM3= <>
##$DBPNAM4= <>
##$DBPNAM5= <>
##$DBPNAM6= <>
##$DBPNAM7= <>
##$DBPOAL= (0..7)
0.5 0.5 0.5 0.5 0.5 0.5 0.5 0.5 
##$DBPOFFS= (0..7)
0 0 0 0 0 0 0 0 
##$DE= 6
##$DECBNUC= <off>
##$DECIM= 32
##$DECNUC= <off>
##$DECSTAT= 4
##$DIGMOD= 1
##$DIGTYP= 9
##$DL= (0..7)
0 120 120 120 120 120 120 120 
##$DP= (0..7)
150 150 150 150 150 150 150 150 
##$DP07= 0
##$DPNAME0= <>
##$DPNAME1= <>
##$DPNAME2= <>
##$DPNAME3= <>
##$DPNAME4= <>
##$DPNAME5= <>
##$DPNAME6= <>
##$DPNAME7= <>
##$DPOAL= (0..7)
0.5 0.5 0.5 0.5 0.5 0.5 0.5 0.5 
##$DPOFFS= (0..7)
0 0 0 0 0 0 0 0 
##$DQDMODE= 0
##$DR= 18
##$DS= 0
##$DSLIST= <SSSSSSSSSSSSSSS>
$$ [...]
##$SUBNAM2= <"">
##$SUBNAM3= <"">
##$SUBNAM4= <"">
##$SUBNAM5= <"">
##$SUBNAM6= <"">
##$SUBNAM7= <"">
##$SUBNAM8= <"">
##$SUBNAM9= <"">
##$SW= 18.0517689322627
##$SWIBOX= (0..15)
0 0 2 0 0 0 0 0 0 0 0 0 0 0 0 0 
##$SW_h= 3612.71676300578
##$TD= 16384
##$TD0= 1
##$TE= 0
##$TE2= 300
##$TE3= 300
##$TEG= 300
##$TL= (0..7)
0 120 120 120 120 120 120 120 
##$TP= (0..7)
150 150 150 150 150 150 150 150 
##$TP07= 0
##$TPNAME0= <>
##$TPNAME1= <>
##$TPNAME2= <>
##$TPNAME3= <>
##$TPNAME4= <>
##$TPNAME5= <>
##$TPNAME6= <>
##$TPNAME7= <>
##$TPOAL= (0..7)
0.5 0.5 0.5 0.5 0.5 0.5 0.5 0.5 
##$TPOFFS= (0..7)
0 0 0 0 0 0 0 0 
##$TUNHIN= 0
##$TUNHOUT= 0
##$TUNXOUT= 0
##$USERA1= <user>
##$USERA2= <user>
##$USERA3= <user>
##$USERA4= <user>
##$USERA5= <user>
##$V9= 5
##$VALIST= <valist>
##$VCLIST= <CCCCCCCCCCCCCCC>
##$VD= 0
##$VDLIST= <DDDDDDDDDDDDDDD>
##$VPLIST= <PPPPPPPPPPPPPPP>
##$VTLIST= <TTTTTTTTTTTTTTT>
##$WBST= 1024
##$WBSW= 4
##$XGAIN= (0..3)
0 0 0 0 
##$XL= 0
##$YL= 0
##$YMAX_a= 416119
##$YMIN_a= -375105
##$ZGOPTNS= <>
##$ZL1= 120
##$ZL2= 120
##$ZL3= 120
##$ZL4= 120
##$ABSF1= 10
##$ABSF2= 0
##$ABSG= 5
##$ABSL= 3
##$ALPHA= 0
##$AQORDER= 0
##$ASSFAC= 0
##$ASSFACI= 0
##$ASSFACX= 0
##$ASSWID= 0
##$AUNMP= <proc_1d>
##$AZFE= 0.1
##$AZFW= 0.1
##$BCFW= 1
##$BC_mod= 2
##$BYTORDP= 1
##$COROFFS= 0
##$CY= 11.3945322036743
##$DATMOD= 1
##$DC= 2
##$DFILT= <>
##$DTYPP= 0
##$F1P= 15.6554695791079
##$F2P= 12.8336369535428
##$FCOR= 0.5
##$FTSIZE= 0
##$FT_mod= 4
##$GAMMA= 1
##$GB= 0.15
##$INTBC= 1
##$INTSCL= 1
##$ISEN= 128
##$LB= 0.24
##$LEV0= 0
##$LPBIN= 0
##$MAXI= 10000
##$MC2= 0
##$MEAN= 0
##$ME_mod= 0
##$MI= 1.114404
##$NCOEF= 0
##$NC_proc= 0
##$NLEV= 6
##$NOISF1= 3.799351
##$NOISF2= 2.8
##$NSP= 1
##$NTH_PI= 0
##$NZP= 0
##$OFFSET= 15.70392
##$PC= 1
##$PHC0= -25471.28
##$PHC1= 11.38748
##$PH_mod= 1
##$PKNL= yes
##$PPARMOD= 0
##$PSCAL= 0
##$PSIGN= 0
##$REVERSE= no
##$SF= 200.130013532006
##$SI= 16384
##$SIGF1= 3
##$SIGF2= 2
##$SINO= 400
##$SIOLD= 16384
##$SREGLST= <1H.CDCl3>
##$SSB= 0
##$STSI= 0
##$STSR= 0
##$SW_p= 3612.71676300578
##$SYMM= 0
##$S_DEV= 0
##$TDeff= 0
##$TDoff= 0
##$TI= <>
##$TILT= no
##$TM1= 0
##$TM2= 0
##$TOPLEV= 0
##$USERP1= <user>
##$USERP2= <user>
##$USERP3= <user>
##$USERP4= <user>
##$USERP5= <user>
##$WDW= 1
##$XDIM= 8192
##$YMAX_p= 0
##$YMIN_p= 0
$$ End of Bruker specific parameters
$$ ---------------------------------
##NTUPLES= NMR FID
##VAR_NAME=  TIME,          FID/REAL,        FID/IMAG
##SYMBOL=    X,             R,               I
##VAR_TYPE=  INDEPENDENT,   DEPENDENT,       DEPENDENT
##VAR_FORM=  AFFN,          ASDF,            ASDF
##VAR_DIM=   8192,          8192,            8192
##UNITS=     SECONDS,       ARBITRARY UNITS, ARBITRARY UNITS
##FACTOR=    0.0002768,     1,               1
##FIRST=     0,             0,               0
##LAST=      2.2672688,     0,               0
##MIN=       0,             -375105,         0
##MAX=       2.2672688,     416119,          0
$$ Real data points
##PAGE= N=1
##DATA TABLE= (X++(R..R)), XYDATA
0 0 0 0 0 0 0 0 0 0 0 0 0 0 0 0 0 0 0 0 4 -8 8 -8 8 -12 16 -16 20 -24 28 -34 38 -44 52 -59 67 -76 85 -99 111
39 111 -125 139 -157 174 -195 216 -239 265 -294 326 -356 395 -434 476 -521 575 -630 693 -760
58 -760 835 -916 1004 -1099 1200 -1296 1366 -1359 1111 -40 -4707 50058 416119 -66819
72 -66819 -142473 408415 42320 -258239 104686 9571 -199655 71856 52049 -60682 110169
83 110169 7467 -159045 7099 -9035 -141140 1646 135588 81371 15973 50406 123740
94 123740 -51317 -206507 53677 80762 -217787 25990 255064 -127988 -112059 183172
104 183172 -108126 -180912 140986 -8540 -58081 227973 28527 -94141 184772 -49241
114 -49241 -269595 107874 47882 -248897 84999 203848 -134794 -32004 147881 -61339
124 -61339 -96129 49350 32393 6112 16133 27433 44461 -39312 -69296 9049 -36869 -46514
136 -46514 51634 -210 3090 93424 -49316 -68208 112462 -47979 -136709 149926 64760
147 64760 -157795 93295 118505 -166752 -23331 106371 -101831 -36675 102429 -31156
157 -31156 -7086 73171 -50023 -20129 61189 -55933 -30628 81200 -13756 -46366 42098
168 42098 4080 -43776 -11752 8386 23472 -4549 -15236 57500 9902 -77781 20429 30360
180 30360 -81022 8888 68922 -39590 10399 59568 -53124 -10875 45170 -69022 -12163
191 -12163 85801 -43099 -30566 94164 -25885 -80011 52524 6072 -66126 35310 45049
202 45049 -18184 13706 15021 -18895 -9967 -20197 -13266 19854 2430 5905 32539 -1944 -15116
215 -15116 -1603 -30929 -14848 15163 -17119 14850 55353 -15699 -15302 40858 -33780 -55687
227 -55687 32110 -823 -35499 44136 28038 -26851 18826 4832 -43076 3913 7748 -25838
239 -25838 24915 33371 -16966 7830 18180 -32013 -21893 8450 -6570 -1225 20633 19661 10402
252 10402 -4482 -8048 -4998 -25183 -18741 15494 4756 1529 33280 10767 -17060 6083 -11880
265 -11880 -36284 4298 8736 -13609 25067 29604 -14843 493 8859 -32935 -19800 11714 -6430
278 -6430 2315 29331 10184 -2527 4378 -12710 -20474 -6245 -3301 3248 17032 15589 8940 1919
292 1919 -9171 -14465 -16713 -11548 5755 11380 12476 23023 11433 -10855 -8143 -13118 -26344 -5806
306 -5806 11599 4884 17450 24171 -1215 -9098 -5875 -22487 -18915 4320 5882 9219 22317 11878
320 11878 -4777 -7079 -14321 -19211 -8135 3360 10515 16309 14285 6403 -4404 -14618 -15296 -11253
334 -11253 -5173 8704 16985 13713 11683 3257 -12493 -14982 -11866 -11375 2078 15148 12544 12927
348 12927 10174 -7285 -13856 -10175 -13861 -5695 10849 10815 9719 12486 -372 -11850 -9662 -11184
362 -11184 -8610 4071 9321 9853 10262 1671 -5790 -8058 -12546 -7631 3314 4452 8473 13186 2083
377 2083 -5260 -3379 -11070 -10481 3519 4551 4741 13580 5737 -5568 -2528 -6984 -11317 180 5249
392 5249 4259 10041 6021 -2417 -2338 -8086 -9539 1616 1702 1532 12117 4824 -6826 -621 -5476 -13092
408 -13092 1257 6014 985 11554 8540 -6318 -1904 -5286 -16561 -1977 6184 -2223 9495
421 9495 13567 -4771 -4151 -963 -12759 -4867 7149 3256 11068 14239 -1956 -3164 -3499 -18405
435 -18405 -10973 3642 -697 6828 16599 4834 54 -1267 -11871 -5709 1444 -2666 11983 17610
449 17610 -2726 -874 1656 -22972 -18634 1390 -7035 2245 22985 9173 4738 11318 -11216
462 -11216 -14383 3633 -9144 -5738 21291 6505 -7852 7883 -6916 -25241 -7548 -2466 -3558
475 -3558 14511 16735 12735 15839 -1969 -11503 -1258 -12723 -14481 9878 6299 -2719 9578 -959
489 -959 -13862 -4224 -10074 -7364 16305 9231 5648 27266 6780 -18106 1753 -6934 -28865 -2373
503 -2373 7817 -7350 8208 10449 -7138 1614 -2374 -14666 8431 11119 -5385 17029 19430
516 19430 -12363 -4931 2441 -21014 -13646 2014 -4235 6048 10572 -996 9612 5420 -15282
529 -15282 3147 11344 -10964 4439 18683 -5688 -4547 3945 -13815 -8564 -844 -11516 6633
542 6633 14872 -7984 7492 19447 -14255 -8501 15387 -9194 -11228 13407 -183 -6259 5858
555 5858 -6505 -5050 4615 -11587 -1905 16678 -6116 -4484 19574 -2729 -12927 10052 -1088
568 -1088 -10540 6226 -755 -2993 8975 -6103 -5218 13498 -7095 -11558 16536 1114 -13657
581 -13657 11791 5779 -11236 4223 1782 -6431 5569 -3243 -6130 12413 -3172 -12593 14237
594 14237 3025 -16778 8578 8452 -13481 1886 6440 -7336 2395 1275 -5868 8411 185
607 185 -11321 10277 4297 -15838 5930 9446 -12420 1835 9519 -7022 1844 4866 -7605
620 -7605 5012 4041 -11972 6150 9030 -14348 1123 12629 -11032 -4103 11498 -4070 -2591
633 -2591 7593 -2304 1641 4587 -8156 1457 5956 -12730 -2256 10028 -9311 -5006 10864
646 10864 -3058 -3774 7937 -1193 -10 6256 -4798 951 7561 -9291 -3803 8601 -9484 -8664
660 -8664 8257 -4377 -6473 9383 1163 -933 10573 208 -1490 9661 -4141 -7505 8149
673 8149 -3679 -11521 5532 -146 -10879 2225 2550 -4753 4151 4777 1982 8320 3004 -897 5802
688 5802 -3106 -9274 1007 -4193 -10103 1601 -88 -5497 4098 1780 -2974 7113 3547 -2044
702 -2044 9605 5254 -5495 4327 1545 -11901 -3373 -489 -9811 -1447 4296 -2129 3686 6362
716 6362 -953 3606 5170 -2574 2752 5660 -3006 -295 2302 -6410 -5490 -1965 -6120 -2420 2245
731 2245 125 4462 6351 714 3484 3818 -3694 -395 2415 -4474 -1489 2128 -5183 -3444 784
746 784 -5395 -2448 4506 -500 1652 8355 1581 -688 4422 -1816 -5114 938 -1224 -3511 1892
761 1892 870 -1791 794 -577 -1817 919 155 903 3887 1358 962 2842 -1711 -2823 622 -2815
777 -2815 -2956 2520 -318 -1863 3241 5 -3329 2063 507 -2969 2555 2577 -2142 1320 1477 -3522
793 -3522 -1151 321 -2616 -50 2075 -125 1253 1706 -1029 -236 -29 -1934 69 776 -566 1359
809 1359 1332 -780 853 356 -1686 910 806 -1540 1609 1399 -2219 696 1226 -3094 228 2216 -2217
826 -2217 305 3065 -1910 -993 2444 -2008 -2034 2292 -586 -1668 2243 456 -1867 602 135 -1728
842 -1728 -332 396 50 42 254 1367 132 -1224 1233 510 -2425 1020 1800 -2755 525 3018 -2664
859 -2664 -619 3650 -1874 -1528 3951 -862 -2624 3198 -229 -3147 2302 674 -2807 1673 1472 -2049
875 -2049 641 1247 -1615 -421 617 -773 -699 7 473 -89 -766 1106 604 -2165 876 1637 -3160
892 -3160 148 3126 -3153 -812 4663 -2516 -2288 5375 -1402 -4120 5037 193 -5236 3884 2115
907 2115 -5202 2274 3430 -4119 417 3714 -2415 -1024 2770 -821 -1561 984 519 -977 -893 1112
923 1112 799 -2435 673 2706 -3421 -1006 4434 -3244 -3061 5873 -1688 -4852 6242 352 -6538
938 -6538 5081 2119 -7541 3412 4026 -7007 1963 5593 -5700 110 5996 -4139 -1738 5225
952 5225 -2152 -2528 3602 -256 -2166 1411 551 -473 -503 347 1861 -1498 -1315 3671 -1705 -3938 4803
969 4803 -494 -6077 5563 2161 -7813 4886 4889 -9229 2251 7086 -9057 -698 8876 -6754
983 -6754 -3379 8922 -3927 -5138 7242 -1417 -5151 5262 516 -3928 3279 900 -2530 1400
997 1400 305 -580 525 -938 1436 684 -3283 2538 1952 -5662 2717 4802 -6760 1465 7408 -7321
1013 -7321 -1503 8484 -6701 -4116 9307 -4476 -5592 9604 -2145 -7170 8463 -243 -8321
1026 -8321 6227 1805 -7784 3911 3110 -5993 1697 2975 -3246 1258 1928 -815 1949 -456 -770
1041 -770 2302 -3321 -1928 3819 -3952 -2299 6531 -3186 -3218 8559 -2325 -5419 9578 -378 -7669
1056 -7669 8891 1507 -10235 5601 2388 -11442 2715 4328 -8848 2398 6640 -5442 2335
1069 2335 6784 -3869 985 5026 -3689 -510 2198 -4382 -1813 -768 -4748 -118 -473 -2791 4884
1084 4884 2578 -1687 7657 3624 -4754 5678 2630 -8779 2512 2487 -10791 425 3775 -10246
1098 -10246 158 7255 -6563 1806 11397 -2791 1133 10587 -3136 -3518 5474 -5036 -6667 1951
1112 1951 -4654 -5336 1720 -2630 -1495 4003 -60 2728 6677 705 3287 5396 -3484 -942 1538
1127 1538 -8423 -3947 1609 -8206 -2733 5980 -4506 -637 9931 -1159 -397 10878 118 -2806
1141 -2806 7930 -2007 -7381 3010 -4048 -9231 2109 -1585 -5818 4776 2691 -2161 6072 3988
1155 3988 -1149 4724 2127 -2323 2132 -1621 -4794 -24 -4138 -5537 1590 -2194 -2993 5869 1358
1170 1358 -1295 7474 1902 -3281 5586 614 -6015 3233 -116 -7738 1681 556 -7156 1880 3167
1185 3167 -4306 3378 5366 -2315 2941 4338 -3292 661 2163 -4303 -275 1452 -4162 77 1594
1200 1594 -3643 797 2390 -2583 1943 3248 -2329 1776 2663 -3658 439 1914 -4551 184 2618
1215 2618 -4058 400 3499 -3596 75 3791 -3302 -278 4064 -2918 -869 3998 -2831 -1662 3529
1230 3529 -2348 -1665 3834 -1311 -1203 3651 -1072 -1573 2651 -1530 -1829 2229 -1473 -1320 2461 -1260
1246 -1260 -1007 2844 -1298 -902 3223 -1208 -1165 3189 -1593 -2171 2635 -1907 -2798 2770 -1262 -2519
1262 -2519 3370 -258 -2342 3456 192 -2630 3027 355 -2964 2386 523 -3332 1613 538 -3057
1277 -3057 1305 989 -2241 1621 1372 -1361 1634 1003 -1476 1371 378 -1700 1320 -60 -2051 1548
1293 1548 -167 -2259 2041 294 -2439 2421 995 -2867 2101 1315 -3432 1355 1623 -3469 720
1308 720 2147 -2858 334 2424 -2237 -101 2104 -1842 -334 1723 -1514 -179 1529 -1296 -10
1323 -10 1356 -1286 258 1184 -1370 529 1249 -1577 638 1346 -1996 491 1570 -2251 343 1933
1339 1933 -2162 42 2288 -2078 -353 2425 -1737 -528 2449 -1403 -838 2109 -1483 -1245 1627
1354 1627 -1396 -1053 1795 -800 -584 1912 -705 -476 1644 -1171 -693 1556 -1324 -678 1913 -1345
1370 -1345 -822 2174 -1204 -1103 2388 -777 -1264 2413 -466 -1505 1964 -439 -1604 1735 -128 -1193
1386 -1193 1593 -37 -1062 1360 -628 -1160 1250 -782 -899 1805 -618 -753 2120 -994 -1412 2092
1402 2092 -1168 -1928 2372 -597 -2032 2553 25 -2327 2299 388 -2482 1843 703 -2329 1400
1417 1400 814 -2099 1107 872 -1773 1074 939 -1336 1077 602 -1391 938 52 -1456 1191 -1
1433 -1 -1316 1842 145 -1640 1891 -24 -2327 1883 223 -2768 1885 834 -2881 1821 1446 -3004
1449 -3004 1420 1831 -3105 735 1871 -2915 260 2073 -2235 173 2289 -1679 2 1859 -1644
1464 -1644 -92 1206 -1598 190 1250 -1422 794 1225 -1604 942 1342 -2013 1026 1557 -2613 702
1480 702 1659 -3044 377 2240 -2835 376 3115 -2394 -31 3280 -2512 -1016 2874 -2337 -1450 3003
1496 3003 -1494 -1501 2813 -1293 -1941 2115 -1168 -1746 2232 -270 -649 2548 -121 -661 1738 -1182 -1170
1513 -1170 1222 -1779 -860 1830 -1789 -694 2554 -1753 -777 3533 -1098 -664 4261 -884 -1948 3310
1529 3310 -1743 -3879 2373 -1106 -3695 2987 716 -2759 3006 1383 -2897 1988 1446 -2519 1716
1544 1716 1628 -2005 934 507 -2661 -262 -556 -2392 666 265 -792 2598 1055 -623 2673 212
1560 212 -1974 2360 -59 -2905 2222 -41 -3999 1580 375 -4343 1847 2313 -2901 2753 3885
1575 3885 -2452 1358 3083 -3607 -833 2100 -3265 -1059 2564 -2022 -990 2104 -1600 -897 1770
1590 1770 -785 249 2197 -242 723 1484 -1656 -226 386 -2777 -207 1058 -2318 638 2283 -2295
1606 -2295 542 2848 -2327 60 3494 -1998 -579 3502 -2117 -1975 2736 -2108 -2578 2845 -768
1621 -768 -1878 3286 240 -1748 2481 -37 -2207 1646 -68 -1917 1522 222 -1448 1261 -107
1636 -107 -1334 1149 -506 -1167 1537 -504 -1105 1956 -545 -1487 2147 -472 -1962 2164 -130 -2241
1652 -2241 2108 281 -2254 2085 716 -2389 1730 965 -2610 1272 1327 -2329 985 1561 -2032 625
1668 625 1408 -1891 349 1381 -1611 558 1480 -1354 436 1084 -1850 4 878 -1615 445 1401
1684 1401 -1031 671 1148 -1854 0 529 -2285 269 1580 -1401 884 2367 -1369 -21 1694
1699 1694 -2078 -860 1716 -1386 -484 2159 -1087 -934 1479 -1352 -1198 1767 -104 21 2589 324
1715 324 -465 1217 -1177 -1871 315 -1202 -1063 1407 -193 -386 1595 -669 -1158 1311 -413 -431 2325
1732 2325 580 -271 1684 -774 -2298 -190 -1874 -2466 955 227 -442 2574 1163 -723 1629 349
1748 349 -1515 1105 696 -955 1068 299 -1997 -504 -1076 -2513 -7 513 -120 2376 2196 416 1696
1765 1696 575 -1651 -79 -367 -1831 427 549 -1512 200 -2 -2264 -350 579 -923 1389 2649
1781 2649 601 1506 1541 -1271 -1042 -643 -2321 -974 268 -750 513 1038 -712 128 601 -949 507
1798 507 1601 186 1247 1689 -827 -545 -265 -2438 -1335 263 -1127 408 2141 -3 334 1497
1814 1497 -926 -774 1062 -478 -217 1550 -13 -662 472 -1121 -1674 -164 -610 -462 1225 732 468
1831 468 1139 -89 -506 -27 -886 -355 609 -347 181 1033 -796 -542 714 -1077 -670 1423 -176 -234
1849 -234 1814 -56 -994 929 -440 -1446 868 164 -866 1076 542 -876 600 211 -1050 347
1865 347 273 -697 337 221 -506 193 -24 -368 407 -61 -187 619 -262 -465 766 -378 -631 1064 -203
1884 -203 -878 912 -369 -1337 892 165 -1002 1409 932 -936 895 525 -1676 11 519 -1158 358
1901 358 1239 -323 218 521 -950 -557 -28 -547 504 776 279 907 182 -925 -199 -799 -1379 573
1919 573 492 -271 1586 813 -1319 274 -287 -2166 244 1142 -725 1337 1948 -1114 -400 432 -2107
1936 -2107 -1031 1021 -306 631 2197 122 -322 306 -1446 -1277 -7 -272 677 1510 523 719 85
1953 85 -1671 -705 -403 -1463 883 1856 -250 1198 1396 -2077 -1170 420 -2119 -475 2479 -71 225
1970 225 2407 -929 -1914 506 -1516 -1636 1688 745 54 2085 353 -1288 -18 -1105 -1515 483
1986 483 414 486 1656 345 -184 201 -1582 -1162 546 -765 293 2485 -40 -420 1522 -1490 -2145
2003 -2145 1111 -733 -1269 2551 778 -1102 1872 -145 -2702 598 86 -2120 1378 1735 -1003 965
2019 965 1035 -1750 -464 87 -1280 439 795 -160 1207 452 -1062 400 -276 -1593 774 383 -765
2036 -765 1608 617 -1316 1183 -18 -2287 1057 688 -2049 1442 1794 -2003 601 1573 -2250 -296
2052 -296 1453 -1567 64 1757 -1105 124 1551 -1472 -513 1352 -1320 -695 1465 -644 -286 1175
2068 1175 -420 -55 581 -1181 143 735 -1542 458 1621 -1529 40 1850 -1492 -583 1716 -1335
2084 -1335 -528 1863 -1074 -355 2062 -1419 -1028 2068 -1366 -1694 2255 -193 -1554 1991 436 -1254
2100 -1254 1058 -184 -1191 715 -593 -750 1532 -371 -907 1560 -420 -1558 968 -224 -851 1438
2116 1438 3 -153 1893 -743 -1234 1662 -1366 -2406 1947 -75 -2184 2125 1070 -1936 1315
2131 1315 946 -1713 1071 875 -1287 1492 875 -1965 655 392 -2768 -289 770 -1469 512 1590
2147 1590 58 1105 683 -741 877 -234 -1723 1203 504 -2021 1012 732 -2622 -122 542 -2087
2163 -2087 687 1677 -684 2049 2312 -1470 772 1405 -3107 -1038 1555 -2105 -980 2046 -847 -976
2179 -976 1183 -752 -444 1372 -28 997 2282 -252 187 1022 -1991 -1767 -75 -1751 -772 1153
2195 1153 -386 788 1728 -1148 180 1747 -1580 -85 2816 -705 -742 2282 -1251 -2546 392 -1538
2211 -1538 -2125 1324 168 -174 2675 589 -782 1662 -262 -1831 1124 413 -1209 902 209 -1250
2227 -1250 -135 -935 -1261 594 -262 95 2472 611 -308 1867 -444 -1991 738 -515 -1739 1294
2243 1294 331 -1359 1270 -16 -2037 1002 466 -1755 1567 1742 -1216 946 1234 -1801 -467 414
2259 414 -1484 -17 773 -583 728 643 -1045 345 339 -1277 527 955 -786 721 804 -1109 283
2276 283 269 -1526 532 781 -1271 841 1343 -1443 234 1239 -1630 -309 1331 -1199 -271 1403
2292 1403 -862 -260 1259 -793 -312 1277 -712 -412 1159 -679 -690 803 -619 -532 796 -517 -196
2309 -196 822 -600 -37 1062 -636 -60 1323 -724 -485 1125 -881 -972 980 -607 -649 1301 -174
2326 -174 -554 1288 -263 -914 1119 -206 -809 1187 106 -789 744 -251 -1143 410 -269 -831 917
2343 917 266 -369 1181 82 -919 576 -194 -1017 777 230 -681 896 67 -1008 465 -132 -1122
2360 -1122 742 549 -697 996 689 -983 281 218 -1207 139 530 -551 589 672 -622 235 144
2377 144 -1007 184 345 -568 600 617 -623 393 186 -1067 162 298 -903 544 866 -747 279
2394 279 701 -1171 -236 625 -832 -16 961 -402 5 718 -718 -350 543 -648 -119 924 -267 -34
2412 -34 817 -462 -470 290 -525 -242 544 -246 56 698 -453 -180 522 -627 -240 651 -366 -103 723 -477
2432 -477 -262 634 -650 -415 846 -420 -377 1035 -246 -603 798 -118 -787 580 25 -531 529 -21
2450 -21 -451 486 -111 -550 537 -22 -464 539 98 -445 481 14 -470 483 -74 -460 580 -32 -568
2469 -568 616 2 -588 628 183 -607 498 63 -650 466 109 -605 627 251 -781 510 257 -904
2487 -904 349 333 -779 309 548 -582 167 451 -583 54 307 -542 170 473 -449 299 362 -630 134
2506 134 242 -626 314 408 -568 317 480 -703 69 522 -822 76 674 -571 185 727 -695 -165 611
2525 611 -735 -213 749 -440 -21 778 -433 -333 447 -582 -320 614 -350 -65 849 -299 -323 608 -550
2544 -550 -498 480 -258 -101 784 -135 -164 550 -620 -318 627 -526 -288 1117 -247 -444 827 -391 -878
2563 -878 475 -145 -521 878 187 -283 796 -130 -886 553 -129 -761 683 375 -461 469 60 -658
2581 -658 205 -266 -495 743 181 -248 1012 147 -906 395 3 -977 391 365 -448 602 204 -677
2599 -677 346 -93 -1062 617 536 -711 832 811 -833 40 268 -1024 -231 261 -446 525 571 -529 360
2618 360 338 -942 118 571 -585 351 853 -371 18 163 -841 -168 137 -833 529 836 -625 328
2636 328 937 -899 -389 765 -600 -213 873 -154 -67 481 -720 -355 296 -817 -123 994 -230
2653 -230 -71 1021 -301 -564 399 -418 -275 445 -347 122 713 -662 -265 721 -699 -512 1007 -176
2671 -176 -336 925 -54 -454 496 -441 -404 726 -369 -346 1030 -242 -714 781 -85 -832 548 279
2689 279 -437 532 91 -369 376 -335 -501 673 -261 -584 821 64 -739 668 65 -666 484 13 -506
2708 -506 642 25 -736 654 35 -869 717 321 -863 522 561 -781 135 288 -570 241 268 -430 411
2727 411 204 -676 348 225 -806 320 481 -615 230 352 -586 157 155 -655 380 344 -652 532 573
2746 573 -802 177 513 -909 -67 638 -577 91 671 -421 41 430 -687 -22 500 -608 41 796
2764 796 -367 -167 553 -481 -339 363 -380 2 584 -311 174 641 -553 -170 659 -620 -289 748
2782 748 -324 -282 660 -411 -389 424 -491 -324 703 -242 -83 959 -186 -342 625 -378 -680 404
2800 404 -258 -472 559 -125 -282 590 -282 -493 587 -188 -412 797 149 -408 558 -26 -753 165 -255
2819 -255 -638 400 111 -209 723 211 -378 396 -23 -617 424 172 -307 590 142 -597 152 -264 -897
2838 -897 225 118 -398 802 642 -360 416 262 -824 -26 133 -543 302 519 -428 164 214 -837 -202
2857 -202 215 -393 362 707 88 368 281 -604 -217 -139 -719 142 484 -235 399 517 -541 -197 60 -678
2877 -678 78 653 -136 470 789 -524 -282 181 -947 -413 641 -125 93 907 -60 -386 223 -502 -437
2896 -437 286 -3 214 730 -10 -158 133 -542 -483 148 -180 157 667 -52 -9 298 -721 -462 456 -347
2916 -347 -81 1024 48 -327 521 -297 -816 271 -58 -284 741 366 -302 328 -107 -751 55 72 -363
2935 -363 420 511 -192 178 38 -368 -63 -118 -146 433 118 -97 401 -257 -604 221 -204 -433 647 312 -235
2956 -235 618 28 -837 259 28 -767 518 572 -546 247 481 -709 -274 364 -366 17 703 43 7
2975 7 274 -361 -338 -39 -247 124 348 155 209 0 -380 -85 -222 -461 417 364 -214 538 370 -789 -52
2996 -52 159 -883 97 781 -253 209 784 -534 -463 378 -544 -398 776 153 -114 715 -5 -636 16
3015 16 -136 -469 138 320 252 269 140 -37 -241 -523 -84 170 -168 482 644 -316 -29 242 -872 -368 542
3036 542 -412 -82 1015 -86 -431 610 -374 -924 406 67 -510 738 601 -468 174 151 -741 -134
3054 -134 240 -210 235 496 62 -22 -69 -179 -220 -262 16 349 -75 60 552 -284 -377 400 -348 -568 700
3075 700 26 -468 761 142 -876 374 206 -967 221 657 -624 89 755 -446 -214 507 -360 -310
3093 -310 374 -92 -76 324 39 -79 -15 -79 20 -83 -46 194 58 -176 412 21 -428 406 130 -621 321 302
3115 302 -633 290 599 -630 32 639 -668 -213 581 -489 -305 800 -172 -458 629 -129 -627 387
3133 387 91 -424 237 289 -104 46 61 -88 -106 -217 121 142 -138 233 256 -382 32 208 -604 18 549 -376
3155 -376 -12 777 -361 -396 607 -365 -649 652 82 -460 559 231 -587 190 37 -612 98 265 -280
3174 -280 232 307 -257 -35 -6 -304 -64 192 103 165 126 9 40 -333 -243 232 -196 -162 655 45 -300 494 -97
3197 -97 -595 385 171 -472 517 376 -520 188 208 -794 -63 434 -316 138 636 -134 -162 287 -259 -253 212
3218 212 -73 161 243 -55 -12 -61 -392 -79 28 -185 252 349 -12 175 63 -443 -45 21 -355 273 425 -276
3240 -276 61 205 -573 -242 255 -338 82 671 -66 64 501 -340 -434 117 -267 -254 490 108 -136 245 -158
3261 -158 -399 -1 -19 -94 314 301 193 254 -175 -263 -89 -395 -114 293 63 126 365 -188 -253 89 -325 -183
3283 -183 461 90 52 508 -120 -361 90 -323 -487 258 135 -41 569 173 -323 38 -69 -478 229 284 -166
3304 -166 333 318 -329 -156 -75 -399 -82 106 56 257 264 -51 21 -201 -387 13 -17 -25 373 203 -167 145 -163
3327 -163 -536 56 38 -186 395 413 -201 117 156 -585 -154 239 -292 64 534 -126 -53 245 -288 -275 176 -46
3349 -46 -14 429 61 -71 73 -177 -203 -35 -102 122 238 -55 234 136 -368 -56 66 -362 18 381 -163 42
3371 42 354 -376 -246 242 -325 -187 442 -3 -146 351 -27 -377 121 -37 -261 175 201 -123 277 104 -237
3392 -237 44 -47 -71 190 92 -11 188 -12 -112 75 -202 -134 207 -27 -89 350 -67 -220 331 -29 -349 354
3414 354 60 -284 295 129 -378 98 133 -406 63 228 -227 115 322 -179 -108 218 -127 -50 145 -24 9
3435 9 92 -37 91 14 -179 159 73 -213 146 106 -224 172 63 -232 157 143 -349 130 230 -347 35 296
3457 296 -266 16 284 -258 -80 325 -166 -165 282 -138 -159 242 -80 -117 209 18 -91 182 -80 -12 138 -85
3479 -85 -82 122 -170 69 205 -147 28 263 -266 -38 270 -259 -150 347 -177 -145 378 -91 -205 204 -105
3500 -105 -270 252 -33 -239 262 30 -232 155 -1 -195 98 23 -186 216 90 -180 139 -123 -226 193
3520 193 -41 -94 239 7 -129 229 -100 -282 165 -1 -229 270 133 -193 169 43 -337 184 97 -256 153
3541 153 223 -165 120 109 -324 -18 88 -192 102 227 -114 95 128 -197 -3 30 -229 98 191 -164 126 76
3563 76 -323 16 13 -278 98 230 -128 145 265 -288 22 138 -233 -6 311 -118 5 323 -159 -95 153
3584 153 -201 -113 235 14 -16 199 -77 -160 73 -196 -76 189 -87 18 257 -68 -53 66 -258 -90 190
3605 190 -142 22 283 -63 -115 166 -203 -162 202 -88 -6 315 -72 -121 192 -168 -228 147 -38 -116 343 88
3627 88 -163 140 -56 -212 119 64 -90 175 71 -51 104 -89 -136 77 6 -91 136 -4 -142 142 -41 -243
3649 -243 117 -61 -237 263 92 -158 139 21 -343 87 42 -216 182 197 -147 104 59 -166 55 33 -163
3670 -163 116 133 -100 169 82 -139 -5 32 -260 53 127 -130 72 145 -73 7 99 -156 58 119 -79 89 136
3693 136 -214 -15 158 -264 9 200 -186 57 226 -171 -8 105 -153 -57 153 -39 -32 139 -64 -84 72
3714 72 -71 -95 117 -96 12 166 -62 29 115 -123 -83 167 -58 -8 216 -94 -54 114 -102 -94 122 -81 -39
3737 -39 187 -26 -79 67 -132 -107 100 -70 -91 122 -25 -96 112 -71 -130 103 -45 -153 147 11 -61 82
3759 82 12 -142 142 27 -147 120 11 -34 135 37 -117 80 -39 -101 133 40 -116 77 59 -104 -10 9 -74
3782 -74 38 93 -58 92 65 -87 76 49 -101 23 -17 -88 62 87 -124 45 139 -164 58 113 -170 -26 107
3805 107 -132 6 105 -64 -61 168 -44 -40 62 -53 -9 60 -48 33 61 -76 19 139 -131 30 61 -93 14 181
3829 181 -100 -11 69 -154 -10 155 -114 -102 120 -54 -56 145 -39 -111 118 61 -103 130 27 -55 93 -15 -84
3852 -84 -8 -51 -86 72 44 -41 68 55 -37 70 11 -89 137 -98 -102 124 -46 -147 129 -70 -100 157 55 -93
3876 -93 130 136 -206 106 129 -238 22 138 -176 -45 75 -158 -58 103 -37 -1 -1 -57 18 96 -41 65 4 -65
3900 -65 50 -33 -79 81 19 -118 83 141 -169 85 155 -147 15 175 -100 35 163 -196 -43 151 -103 -68
3922 -68 205 -57 -65 208 1 -52 167 -6 -129 120 -95 -74 81 -60 -74 31 -83 34 30 -120 64 74 -114
3945 -114 -18 144 -108 26 175 -103 -44 181 -148 -87 277 -85 -137 250 -12 -89 226 33 -183 123 74 -130
3967 -130 123 21 -89 60 -82 -114 116 -49 -75 86 -18 -61 70 -54 -133 135 -43 -80 153 -6 -94 88
3989 88 -15 -184 167 32 -202 176 103 -221 178 31 -179 125 123 -184 97 183 -128 83 146 -134 21 73
4011 73 -156 -7 82 -97 -21 29 -120 34 57 -97 113 59 -70 109 55 -104 89 37 -159 50 111 -212 110
4034 110 114 -172 23 158 -184 39 234 -114 -32 271 -132 -32 160 -81 -53 108 -20 -50 162 -38 9 75
4056 75 -2 -23 96 -105 38 80 -108 -6 50 -140 80 61 -130 9 107 -142 -7 208 -159 -14 152 -157
4078 -157 -122 203 -62 -139 246 -56 -107 151 -11 -163 113 -37 -118 120 -5 -134 153 -63 -19 42 -47 6 71
4101 71 -13 -9 112 -72 14 133 -81 -109 226 -74 -90 180 -85 -137 179 -42 -161 169 -24 -212 145 22 -174
4124 -174 82 39 -134 57 25 -156 72 46 -109 9 45 -111 62 25 -32 65 -8 -64 41 -25 -144 52 -30 -117
4148 -117 121 -12 -118 109 32 -163 62 66 -146 124 69 -130 105 122 -129 43 86 -114 -29 109 -127 16
4170 16 72 -99 -20 88 -80 22 124 -74 -13 75 -86 47 50 -54 30 68 -103 22 25 -120 4 84 -98 -31
4194 -31 98 -82 -2 126 -110 33 128 -136 -60 58 -36 -42 117 -25 -58 119 -59 -94 109 -77 -80 120 -65 -76
4218 -76 72 -8 -88 50 -30 -34 40 -26 -18 57 -73 -1 97 -36 -8 138 -30 -119 17 -33 -18 110 29 -122 92 -34
4244 -34 -152 153 84 -112 87 36 -71 72 -43 -110 49 74 -55 8 61 -59 -21 -12 -111 -21 -58 -6 40 -8 -26 8
4270 8 -40 -95 16 -3 -117 32 28 -110 72 153 -108 45 117 -83 15 89 -40 -56 146 -122 -123 150 -68 -33 105
4295 105 11 13 91 45 6 -10 -32 -89 -32 -21 -47 9 -10 -3 -27 -71 -71 43 11 16 150 57 -15 88 -85 -105 59 -89 -113
4324 -113 58 -30 -107 98 64 -83 31 145 -81 96 145 -32 39 76 -68 -62 9 -73 -7 45 -1 -30 46 48 19 -77
4350 -77 -22 40 -29 -51 27 -47 -96 77 -65 -214 78 65 -184 85 116 -100 67 115 -130 -33 114 -161 -64 122
4374 122 -95 -63 137 -14 -60 76 21 -54 101 13 -45 48 48 79 35 -45 27 88 -94 20 92 -71 -45 54 -130 15
4400 15 109 -102 -91 77 -73 -75 153 -35 -77 181 -88 -94 127 10 -87 86 37 -113 37 -2 -83 29 17 -25 154
4425 154 10 30 210 35 -58 43 -27 -95 162 -67 -105 136 -16 -136 88 15 -201 74 14 -29 161 28 -193
4448 -193 68 -35 -168 -89 2 -96 40 58 -56 14 47 -112 13 -16 -79 57 88 -20 110 -23 -209 4 -15
4471 -15 -89 75 154 -83 86 109 -118 52 32 -187 36 156 -53 32 130 -144 -36 -3 -116 -52 102 64 62 157
4495 157 4 -32 -19 -152 -20 29 -105 5 166 -48 50 87 -147 -64 46 -164 47 171 -48 86 110 -113
4517 -113 -121 33 -114 -5 155 27 7 149 -75 -94 75 -149 -65 85 -12 -10 79 -42 -25 7 -135 -35 62 12
4541 12 26 102 -57 -30 60 -178 -110 58 -89 10 196 -8 -18 151 -103 -140 64 -99 -38 158 66 -134 134 -47
4565 -47 -173 59 59 -96 84 88 24 78 2 -56 92 12 -53 74 -56 -35 109 16 -84 105 -36 -100 74 12 -144
4590 -144 92 41 -153 124 17 -157 102 45 -97 42 82 -114 49 21 -130 -1 17 -51 43 30 -37 15 25 15
4614 15 30 55 -40 -5 2 -34 90 54 -37 117 117 -58 95 33 -188 40 26 -55 86 162 -103 34 55 -165 -123 51
4640 51 -75 -44 125 -21 -4 60 -78 -85 -16 -43 -33 49 27 49 28 -80 -65 13 -112 15 94 54 61 140 -94 -63 52
4667 52 -177 -51 127 -26 42 235 -4 -77 19 -52 -190 68 13 -33 172 48 -29 24 -83 -212 -32 -6 6 93
4691 93 105 47 65 -61 -100 -34 -124 -90 89 103 25 82 4 -127 -74 -150 -106 136 73 -16 141 76 -134 -4 -116 -170
4717 -170 42 165 1 122 135 -25 -29 56 -164 -78 62 -2 39 243 -21 -32 -4 -138 -60 -21 -26 99 172 32 2
4742 2 -53 -132 -81 -74 -134 7 120 76 61 84 -125 -37 -11 -96 -31 116 -17 10 140 -34 -66 44 -113 -104 129 81 25
4769 25 133 8 -122 1 22 -136 10 31 -42 20 41 -30 -2 -40 -99 -57 17 -39 112 10 -55 77 -28 -101 68
4794 68 -24 -116 15 75 -99 93 30 -95 47 36 -140 -24 42 -56 84 91 -29 46 70 -87 -4 97 -54 -2 98
4819 98 -70 52 124 -70 -54 78 -45 -9 100 -25 43 79 19 15 34 -82 -92 81 -65 28 89 -51 -8 88 -79
4844 -79 -11 97 -105 -48 147 -23 55 123 -40 -18 26 -38 -41 25 59 41 86 68 -69 52 -131 -66 88 14 39 146
4870 146 61 -22 64 -76 -102 -2 -16 11 94 81 -52 28 -121 -178 -1 -41 -57 150 121 26 95 17 -153 -7 -50 -86
4896 -86 103 90 54 82 22 -107 -40 -97 -131 4 108 13 120 91 -94 -27 -61 -167 7 96 39 117 82 -63 -4 -54
4922 -54 -184 -8 56 -65 103 160 28 64 19 -126 -166 14 -35 50 172 37 68 60 -116 -30 -34 -44 44 78 74 67 67 -96
4950 -96 -65 -5 -132 -1 141 73 67 186 -60 10 25 -70 -94 50 -15 -15 61 8 -15 -13 -41 -21 26 9 111 99 34 -6
4978 -6 33 -98 -55 36 -112 -24 41 -43 20 68 -68 -97 57 -18 -70 99 14 7 96 67 4 6 -38 -43 48 -35 -44 80 -15 52
5008 52 6 -10 -16 -29 25 3 97 -38 -28 137 -59 -76 79 -19 -81 95 38 -62 115 14 -55 84 -71 -155 15
5033 15 14 -34 143 50 -16 34 27 -42 13 -65 -88 -4 43 -6 64 45 -89 33 -43 -54 82 -14 -31 140 25 -65 42 -85
5061 -85 -144 28 67 -45 89 119 -37 41 44 -93 -44 36 -23 34 105 6 -9 -16 -97 -40 -109 -64 14 77 41 42 -1 -105 44
5090 44 -5 -77 46 61 -38 113 29 -76 30 81 -167 24 69 10 74 137 -30 -23 71 -79 -55 54 -3 -4 97 -23
5116 -23 22 89 -10 -72 37 -47 37 9 14 50 114 -64 -90 3 -153 -25 68 -52 -5 100 -42 -4 25 -86 -52 88
5142 88 8 -31 154 -25 -26 -13 -12 -57 -23 -30 -25 50 102 -30 61 -44 -153 -47 4 -13 22 94 -1 6 -23 -71 -6 -29 -54 34
5172 34 66 -7 115 35 -73 36 -80 -62 24 53 -50 119 -2 -71 -16 -5 -74 6 -25 -76 76 128 -10 -11 10 -45
5198 -45 -72 23 -47 4 48 -53 -48 5 -41 -73 -12 -18 44 37 16 45 48 -97 -2 -45 -67 20 7 0 28 2 -81 -26 41 -119 -1
5229 -1 47 -43 -54 107 -45 -80 29 4 -28 68 10 -42 66 -7 -18 96 15 -29 17 87 -70 32 52 -55 7 43 -63
5256 -63 59 -1 -23 -12 -44 7 87 -4 -3 12 34 -98 -52 -20 -43 77 21 63 56 25 -57 -55 -48 -119 22 90 29 42 99 -73
5286 -73 -38 -12 -77 -33 50 41 39 101 20 -34 -40 -70 -65 25 42 63 105 53 8 20 -144 -59 -24 -30 7 86 -7 9 109 -82 -94
5317 -94 -10 -25 26 84 2 -16 82 -58 -113 -4 -23 -49 48 91 -29 77 25 -23 -39 -67 -52 -5 -9 49 70 -39 -35 3 -97
5346 -97 -70 82 -51 46 130 -43 -54 32 -51 -91 7 25 -101 67 45 -126 58 37 -84 -3 95 -9 40 68 -56
5371 -56 -6 6 -100 29 22 68 23 46 -41 3 3 -54 24 -22 -22 67 -21 -59 -14 -5 -74 67 49 -48 5 8 -102 -28 49 -91
5401 -91 4 -7 -81 3 59 -41 -62 44 -48 -47 69 27 33 78 16 -67 -48 -8 4 -14 29 -1 58 -10 -13 -5 -47 -18 31 -37 50
5432 50 -7 -45 -33 43 -119 -6 75 8 -33 71 -80 -20 7 -79 -22 20 48 -13 94 -25 -11 19 -59 -52 5 -23 12 43
5460 43 -7 59 41 -32 -79 -19 -85 -11 88 -54 67 43 -23 -54 73 -50 -74 55 46 33 17 12 -72 4 2 -10 -14 15 30 75
5490 75 -4 11 8 17 -39 14 21 17 86 -55 -52 14 -19 -58 69 24 13 112 -31 -24 48 -12 -64 15 24 -18 15 55 25 52 91 -63
5522 -63 61 9 -37 -12 54 -10 -40 -36 -35 28 -19 21 -37 10 -35 83 -15 -41 21 14 -37 96 15 -1 27 51 -119 0 14
5551 14 -17 31 61 -10 -37 33 -59 2 53 -9 1 3 -41 -2 -71 -15 25 3 -25 -25 -32 -2 -17 114 -26 14 56 -14 18 79 -114
5582 -114 40 47 -35 35 63 -70 -50 10 -65 -39 50 2 -18 59 -55 -73 16 -2 -42 -2 7 2 -13 26 -11 28 14 28 35 -4
5612 -4 11 41 -37 -44 1 -72 -51 -15 -55 50 42 58 -3 77 -36 -34 -20 7 -4 33 42 7 41 17 -52 -28 -41 22 -21 -10 -52 -25
5644 -25 -27 -25 -21 -8 -50 61 29 2 43 0 -46 -20 -31 -77 82 27 -43 35 -1 -114 -23 38 -11 69 37 -55 20 -5 2 -41 58
5675 58 -18 -7 51 -9 67 39 13 11 48 -13 3 29 -31 -38 23 -37 -33 44 -7 14 21 13 44 26 -14 -26 10 -22 -16 11 -61 -17 54
5708 54 -62 -48 107 23 -26 45 -25 1 39 49 -50 -15 28 34 20 -6 -30 64 -6 -34 -21 -15 -28 53 -12 -70 52 12 -75 12
5738 12 78 -3 -36 15 -8 30 -1 -14 -15 56 -92 -13 -8 -2 9 -24 -41 22 45 -99 -61 54 -47 16 54 -61 31 44 -17
5767 -17 7 -5 -71 -62 34 -8 12 61 -53 -2 20 -43 -27 56 30 0 24 -41 -4 32 -48 40 65 -54 11 111 -13 -3 26
5796 26 -40 -21 47 9 1 -15 -13 -30 39 -23 -31 28 5 -12 17 3 -33 69 37 -16 27 10 -38 18 -8 -12 41 32 -55 -5 -26 -80
5828 -80 15 66 11 61 -25 -90 21 1 -73 63 47 -35 34 -22 10 -33 -20 -38 40 40 -69 92 -29 20 3 35 11 -36
5856 -36 26 -13 9 0 -26 -25 63 -31 -1 5 11 63 65 -63 -48 53 -63 -41 5 -31 -7 75 -1 18 21 21 -24 13 20 42 15 -53 44
5889 44 10 -47 22 67 11 12 32 33 -6 94 -88 56 20 -19 -25 24 -18 22 47 -45 -9 83 -34 42 102 -12 -34 42 28
5918 28 -45 2 -7 32 15 4 -54 56 17 2 0 -25 14 -6 -8 7 35 -38 42 -8 -32 -20 6 -11 -26 25 -21 16 30 -28 41
5949 41 52 15 -40 35 11 -12 2 46 -24 -3 0 -3 -68 -1 -16 16 26 51 35 -82 -30 23 -57 -85 45 -35 32 0 -31 -72
5979 -72 1 28 -43 -29 -33 -11 -39 43 -10 -45 27 -104 13 25 20 11 50 -62 -85 8 -14 65 -40 -45 11 23 26 -36 -3 -10 49
6010 49 -22 -42 51 31 9 -36 32 -73 -51 31 -62 6 62 -50 23 11 -54 -71 45 -1 -6 10 -19 15 3 -54 -34 -15 -38
6039 -38 63 -10 41 34 13 -34 -33 -53 -6 24 35 -4 -1 -52 -23 -35 21 -45 65 58 -33 -25 49 -46 3 7 9 5 108 36 -31 66 -2
6072 -2 -45 -22 -33 12 35 -9 28 -45 6 -8 -54 -35 27 27 -31 30 -45 -54 -45 -2 0 -5 107 64 19 66 35 -53 1 -66 -65 -24 -5
6105 -5 -38 20 2 -70 -55 -32 -32 -35 48 91 35 6 -16 19 -60 -49 -47 -29 42 53 -29 -36 -9 -49 -39 -8 13 26 99 65 -33 9 -41
6138 -41 -117 -19 -12 -32 40 15 -45 -7 51 -50 -51 31 -17 9 120 1 -51 -2 -39 -77 -28 -11 10 23 30 13 -35 -41 -17 -29 -29
6169 -29 -17 49 0 7 3 -28 -47 -23 -107 13 85 19 18 40 -39 -25 65 -19 -42 78 63 1 62 -22 -53 3 85 -56 13 70
6199 70 23 18 14 -47 -4 -24 -20 -1 5 33 57 -37 -102 11 -58 -28 -10 -1 -74 19 -45 -67 -40 -6 -19 -3 80 -69 -25 61 -40
6230 -40 2 61 -63 -7 65 -26 7 56 -55 -27 -11 3 12 88 53 -13 -13 32 -6 -36 3 49 -1 -24 73 -19 -53 -49 -50 -77 -6
6261 -6 103 -39 -5 67 12 -53 92 -39 -17 92 -8 -41 50 -66 -86 18 14 -66 -20 14 -33 34 47 66 43 -32 -26 -17
6289 -17 -1 4 45 -3 -12 45 -14 -10 50 -6 5 36 -21 -43 39 46 4 10 15 -21 5 27 -64 21 0 0 -47 1 -25 -34 60 17 -11 38
6323 38 25 10 0 27 -5 0 -33 -16 43 41 -6 28 -34 13 -19 -22 -30 28 -18 2 37 22 -22 -31 -34 -29 -28 -11 14 34 9 44 14 -40
6357 -40 -79 -3 -32 31 67 57 22 -32 -5 -66 23 -13 -47 -3 -18 8 4 6 -81 -29 -38 29 18 43 40 54 -9 -44 -19 -72 -24 -1
6389 -1 75 43 35 43 -79 -22 -44 -74 16 61 38 27 62 -19 -53 -23 -65 -57 33 76 29 1 25 -15 -48 -52 -27 -66 -21 66 17 21 8
6422 8 -23 -65 -45 -29 -10 28 96 -53 -27 -40 -9 14 -47 8 44 29 -5 11 35 61 -25 11 0 7 -2 12 39 17 -33 42 21
6453 21 -21 39 43 -7 1 32 -43 31 58 -40 1 23 12 20 12 -44 -58 3 -59 14 70 110 -17 -16 -10 -31 19 22 -9 7 53 -20 -12 1
6487 1 -27 15 -16 6 57 31 41 37 -51 -12 3 9 30 28 -12 -41 57 -74 -23 -29 -72 19 94 30 30 45 12 17 -44 -42 -7 41 63 59
6521 59 -50 -36 -33 -73 -44 -52 -10 -11 87 96 60 -26 -15 -26 -47 10 38 64 98 6 -30 -2 -38 -75 -56 69 -13 34 42 7 -33 -51
6553 -51 0 -43 -35 23 40 20 20 -28 -26 -56 -75 11 12 -5 55 16 96 -36 -11 17 -101 28 25 3 67 24 54 -15 -6 -50 -46 -7
6585 -7 31 -30 101 -7 15 13 -23 -41 -36 -1 9 -1 62 37 42 23 -38 -40 -20 -23 -3 17 19 23 40 -8 -34 -24 -86 -2 -26 12 17 36
6619 36 -30 -40 -65 -42 -19 22 -9 46 87 -3 -41 -24 -70 -90 -29 30 -38 12 25 -30 3 -44 -56 -25 7 42 25 92 41 59
6649 59 -2 -26 -20 -28 0 68 46 23 52 -50 -64 -21 -67 -4 30 7 53 37 1 1 -39 -86 -37 19 2 6 63 -37 -3 -5 37 -44
6681 -44 -37 11 -28 39 36 -1 -16 24 -58 31 13 13 25 27 -4 12 31 -68 14 45 -60 40 -1 -68 4 24 20 12 22 -47 -3 19
6713 19 -24 -79 -36 -35 -50 6 10 54 -9 -44 -21 -39 54 -10 45 19 30 17 -58 -17 17 25 -22 43 2 -7 83 -28 -38 -37 -3 -25
6745 -25 27 22 14 45 -6 -83 -58 0 -25 38 37 56 54 -8 18 -43 -80 -98 -76 58 27 58 72 -21 -87 -34 -72 -14 1 -38 84
6776 84 38 36 45 -38 -57 -13 -11 -43 55 58 -4 28 -50 -15 20 27 -45 41 84 70 0 -6 -112 -69 -67 -77 -1 20 31 59 72 -1 -51
6809 -51 -77 -47 -11 37 18 53 56 33 -29 4 -58 -50 -18 38 67 57 13 -30 -14 -39 -41 11 -23 4 40 41 -8 23 -41 -39 -86 0 -2
6842 -2 67 68 -18 -12 11 -22 -24 -52 -50 84 73 21 67 47 -17 -74 -41 -37 27 60 41 66 0 -45 -36 -53 -27 -62 -46 30 34 -19 -29 -53
6876 -53 -86 -56 -77 12 67 10 110 36 -17 -45 -13 14 -20 6 -12 25 -12 4 7 -37 14 26 -39 -17 34 -73 22 40 4 -25
6906 -25 -20 43 48 -66 -40 43 31 15 57 24 11 -12 28 -1 0 -10 -46 -8 34 48 -13 -48 -35 -30 30 -8 4 15 -58 -38 2 -57
6938 -57 -28 25 -5 54 28 29 10 49 4 -39 -19 57 -87 -5 29 8 -6 65 -8 4 -43 -60 27 47 13 45 21 -9 52 -30
6968 -30 -50 0 19 -19 11 1 24 13 -47 -35 -43 35 -68 6 59 7 -38 9 -54 -55 2 -46 -38 12 104 25 20 22 -24 -35 -9 -51
7000 -51 47 59 44 46 -24 -23 -56 -2 -83 63 22 64 53 33 18 44 -12 28 73 22 35 48 42 4 44 -26 -32 -57 28 13 41 41
7032 41 -46 -12 -10 -90 -21 -35 -54 22 54 55 38 -2 -71 -36 -37 -14 74 49 21 -11 31 -42 -57 -60 -17 3 -23 20 32 6 25 7
7064 7 11 -55 -54 31 -4 31 -27 12 -48 -68 -64 -46 2 7 -33 60 17 65 -113 1 0 -37 -14 4 19 -23 -26 45 7 -8 -50 -29 28
7097 28 -24 42 8 -16 8 -34 -9 -53 5 86 -34 -9 3 1 -16 -33 -11 -39 -10 -22 -6 -20 -34 7 -40 68 5 -18 -33 -44
7127 -44 8 -54 33 -63 -6 43 44 -37 24 -48 -32 -7 9 12 -39 -4 -4 -7 39 9 -32 30 -5 30 32 22 35 45 -12 -50 -9 -9 21
7160 21 27 -23 1 -36 -19 -8 -10 -70 35 -7 -37 93 33 30 -48 -6 -94 -48 0 6 0 26 69 -47 -53 2 -33 -48 -58 19 4 25
7192 25 14 3 8 -20 10 7 -11 58 3 -32 -8 -5 -43 -26 0 0 70 6 -7 7 -6 -31 -110 -79 -46 48 13 43 11 42 -23 -32 -9
7225 -9 -25 66 -23 -1 6 29 24 -65 1 13 -72 10 6 13 -20 -39 -25 4 41 -2 -17 33 42 22 -1 38 -31 -44 68 16 21 59 -3
7258 -3 -9 42 -45 -36 -21 -54 30 -3 -32 -30 -66 -3 -19 -49 39 37 49 26 43 28 -9 -68 -23 51 -26 10 26 24 -3 -1 4 28 -21 -43
7292 -43 -8 49 16 -1 -5 -7 -69 -20 35 -43 -16 -4 -7 64 31 -18 -15 6 -16 70 -1 24 -38 5 -56 -11 12 11 22 -42 -6 48 -2
7325 -2 4 5 -28 10 17 7 12 29 8 47 39 11 -34 5 16 31 23 -40 20 15 23 -11 -25 -18 -40 70 -28 -19 -31 -44 -68 -17 -53 -65 -5
7360 -5 -40 -17 0 -27 -10 -20 33 -50 34 39 -5 22 10 -6 32 55 -17 6 71 48 44 65 15 5 18 -35 -10 16 4 -46 30 -34
7392 -34 -20 -14 5 8 31 24 7 -39 -54 -25 47 27 15 -3 -34 -12 53 -97 -28 58 -26 1 60 -5 -7 -22 32 35 -19 28 9 35
7424 35 40 26 28 22 14 35 15 -3 -29 31 39 -4 42 -101 22 -27 -11 19 -12 -10 -14 28 -16 -15 -39 4 -33 -19 30 59 -63 -10 11
7457 11 -32 5 23 11 -43 -22 5 -42 11 -44 -48 26 23 16 -25 75 8 5 -48 -64 -16 22 14 10 55 17 -5 -51 -12 0 18 37 -21
7490 -21 20 15 17 4 -14 15 30 28 -44 -1 -69 37 21 -29 -4 8 1 40 21 26 -3 52 -19 -18 11 16 66 64 31 62 1 -11 -6 -22
7524 -22 50 -3 -27 6 13 48 -36 0 -33 4 -1 53 -26 34 15 -20 48 -4 45 -2 22 -39 -33 4 -57 6 37 -35 19 6 -25 58
7556 58 42 7 19 10 49 28 10 27 10 -34 -59 10 25 -44 -17 -16 24 -12 -13 28 -35 10 22 39 20 57 -5 -33 -40 -28 -20 -24 53
7589 53 1 18 -3 -25 34 -31 -43 -39 -3 2 84 -11 -33 -8 27 -22 -25 -15 -4 51 26 17 -3 18 -5 24 3 -39 -13 8 5 21 -51
7622 -51 -49 43 19 -47 -15 -35 -48 14 -15 30 1 15 -13 -3 -35 -48 22 22 -4 -39 0 -56 -11 11 -33 31 4 10 31 -30 -39 23
7654 23 -13 28 14 -11 73 54 53 19 5 -2 14 10 11 -7 -7 28 28 23 31 -50 -50 -5 -8 62 9 -49 -26 -7 14 -71 -18 -22 64 -19 18 -23
7690 -23 -15 12 13 21 42 40 -36 11 36 55 7 -13 20 34 -41 49 -13 7 -39 -26 -26 20 -6 18 -17 16 43 20 -42 -12 33 -26 -14
7723 -14 29 7 46 44 -63 1 -13 16 -1 32 -1 -3 -22 -28 -23 20 -15 -25 -62 -33 -48 35 11 -11 29 -46 -22 33 -28 -15 -2 -19
7755 -19 -44 -21 -22 -13 4 -8 32 7 13 -5 6 29 -46 -5 -53 8 -17 -28 -12 24 1 -74 -16 9 -15 0 4 -34 12 -52 -30 60
7787 60 6 -67 -42 90 19 60 -44 -8 14 23 21 30 0 -8 40 39 60 -45 -21 50 50 -40 -28 -21 5 -78 2 43 -26 49 26 -12
7819 -12 -12 -1 -51 -39 -22 48 -9 43 5 -38 32 7 2 1 -14 21 4 -36 -20 7 -19 -41 40 -66 -26 -9 -5 39 20 -9 -81 4
7851 4 30 8 11 -2 33 46 -107 -29 -16 24 -23 45 17 -46 26 -12 30 -44 -45 2 -21 27 45 13 9 -80 15 -21 -30 -39 -14 40 32
7884 32 -12 39 -42 -26 6 -8 5 33 18 -7 21 2 42 -30 23 -27 60 -10 -8 17 -1 -18 -5 -19 20 -3 -8 65 -29 -31 -3 -8
7916 -8 -39 40 -81 -2 6 -53 -30 -17 51 26 -20 32 62 0 38 -4 5 -17 27 -15 8 5 -14 24 -23 -27 1 23 11 9 -38 -22 -23
7949 -23 -29 -5 35 36 -9 34 -40 -12 17 -31 31 -16 -11 -3 11 -16 6 -34 49 40 -26 -31 11 3 19 26 -25 -21 59 -7 -58 25 -36 58 22
7984 22 24 64 -8 -7 4 -13 -37 -33 -8 12 62 15 57 22 -12 -34 -27 -17 21 -30 -4 -40 -35 -10 4 78 -15 14 44 48 29 -16 15
8017 15 -39 -15 -39 -32 15 36 34 -7 -11 -17 2 14 -33 -42 -62 -62 9 -41 -65 10 41 -49 32 0 -20 -5 1 -31 102 -10 33 43 -16
8050 -16 25 -1 76 -12 24 -20 38 2 -31 47 -13 0 53 -4 -15 12 -6 -13 9 29 -37 -45 13 47 16 13 -27 -80 -34 4 17 -25
8082 -25 5 -19 0 -32 -24 -4 -1 21 1 -6 -19 -30 17 -45 -29 -1 7 46 21 8 -7 21 -8 19 2 -53 -1 28 16 -19 32 -55
8114 -55 -7 53 -9 -15 21 0 13 -18 5 -22 19 42 -24 15 -60 22 51 -10 46 30 -55 5 58 -54 5 -31 15 -72 -33 -31 3
8145 3 -15 16 -30 -6 27 7 -42 -15 15 39 29 9 29 27 72 33 -62 -23 -26 14 -23 43 6 12 7 -7 37 -9 27 53 11 58 29
8178 29 -9 -30 -15 -98 19 11 39 -24 -13 -7 -13 44 5
8191E
$$ Imaginary data points
##PAGE= N=2
##DATA TABLE= (X++(I..I)), XYDATA
0 0 0 0 0 0 0 0 0 0 -8 8 -8 8 -16 16 -17 24 -32 40 -48 56 -65 80 -91 109 -129 148 -172 203 -234 267 -302
31 -302 347 -394 447 -504 567 -636 714 -798 887 -990 1097 -1219 1349 -1493 1649 -1821 2005
48 2005 -2210 2435 -2680 2954 -3255 3593 -3971 4395 -4881 5436 -6084 6849 -7766 8891
62 8891 -10311 12162 -14687 18351 -24155 34769 -60336 247797 114682 -306189 296676 56220
74 56220 -375105 73 121486 -195373 52227 133542 -72804 27570 32990 -168908 -1974
85 -1974 79884 -59335 41371 182553 62605 -38982 -27691 23499 -80813 -202092 23130
96 23130 150784 -135623 -23421 260730 -78070 -203664 163784 -3651 -192272 158579
106 158579 117946 -90228 151393 53166 -196216 58194 -1715 -275841 68927 172267
116 172267 -180596 41771 260554 -109397 -114255 152261 -26670 -124923 69225 66176 -15972
127 -15972 427 214 1184 -46973 -78605 16654 18365 -26613 61758 39816 -24089 54120 -25532
140 -25532 -98558 79987 14799 -134382 107651 114889 -164980 11219 141229 -151184 -81110
151 -81110 145363 -45296 -68249 123133 5040 -55358 62879 -27896 -55978 61408 -20772
162 -20772 -49848 77394 8075 -69044 30813 21186 -47494 -2277 28436 21241 2560 -20080
174 -20080 28031 12129 -78154 -1572 57554 -53179 -7676 87907 -23828 -31281 54252 -40736
186 -40736 -45520 52395 -32639 -32175 88075 -13705 -63647 72622 -1752 -97859 41831 45580
198 45580 -60697 24426 63212 -28863 -14607 13641 -26080 -15386 -628 -1547 27668 14992
210 14992 -4801 17745 -7211 -32249 -3321 -11105 -7819 31626 6845 4332 43488 -15961 -44396
223 -44396 23464 -15890 -56643 35876 33022 -32111 30056 36328 -41058 -7804 12548 -39260
235 -39260 -1373 30038 -13628 13505 35134 -23836 -16823 14136 -27105 -23111 23183 10969
247 10969 1241 20607 12075 -6436 -16003 -16768 -5158 -9862 -5917 27030 20152 -2206 18165 4390
261 4390 -32039 -8273 -1382 -25355 10390 29501 -4413 13196 25266 -24026 -20652 7375 -22827
274 -22827 -16574 26667 11182 63 23258 3826 -20348 -7815 -11452 -17168 3647 11722 9553
287 9553 15741 8377 -5937 -11226 -15559 -13463 -4927 3841 17311 19251 8520 7509 -2721 -23813
301 -23813 -17006 -5334 -10557 7166 26971 12503 7730 11544 -13250 -23691 -7944 -10620 -6766
314 -6766 18640 19144 7885 11654 11 -19272 -16033 -10364 -8804 5224 16430 15056 10807 2350
328 2350 -8667 -15465 -17005 -9442 1979 8848 15834 16862 4972 -4203 -9791 -18678 -14496 -952
342 -952 3975 12288 20275 9845 -236 -3384 -15371 -17788 -4188 340 5646 18532 13624 1859
356 1859 523 -8593 -17415 -8116 -746 2007 11998 13545 5441 780 -6738 -12774 -8704 -5479 332
371 332 10979 9733 4916 5175 -5130 -13440 -6370 -5210 -4099 9780 11048 2928 5978 -397 -12939
386 -12939 -7232 -2742 -5182 5740 11797 4697 4320 893 -8688 -6678 -4428 -4414 6628 8821 2179
401 2179 6981 1914 -11750 -4820 -340 -6887 5271 13093 1879 4029 3527 -12446 -9034 -1859
415 -1859 -9314 2377 14717 2325 3478 8943 -9477 -11995 140 -5882 -1372 13449 6685 3335
429 3335 5766 -10009 -13945 -4606 -10786 -4089 14895 9708 5995 12570 -760 -10437 -5004 -8487
443 -8487 -3111 9119 4119 7383 11879 -9543 -14206 -1935 -15411 -12150 15774 11245 6544 22205
457 22205 6621 -10509 -1192 -12688 -18349 6121 2772 -4461 17529 6419 -18098 -2562 -3425
470 -3425 -20534 682 15847 7439 16272 16208 -36 -2034 -12204 -21475 -4891 -3396 -8096 13593
484 13593 13343 -5778 2281 261 -14247 -1101 4895 1994 20036 14950 -3268 9302 -2682
497 -2682 -30847 -9403 932 -19371 3075 22625 279 3797 12152 -8611 -4878 3570 -8397
510 -8397 7555 17105 -5955 2888 11321 -20648 -18822 2769 -13017 -9549 14686 7831 6262 12687
524 12687 -2048 -349 3810 -14307 -2208 14787 -7298 -3676 15664 -7806 -15308 2976 -7884
537 -7884 -7848 9212 982 7175 18952 -4726 -3212 15055 -12910 -17055 14702 -1729 -14834 12653
551 12653 5177 -11674 3394 -1319 -7415 6842 -2406 -2930 17242 -629 -11199 13698 -141
564 -141 -19223 5837 4885 -12462 4454 5286 -5697 6046 -1282 -8653 10726 -299 -13517 13382
578 13382 7603 -16054 6342 10338 -13188 -360 7010 -6762 2782 2793 -6742 8913 2739 -13641
592 -13641 9456 8919 -16967 3204 13532 -12405 -3095 10910 -5835 -1761 5443 -5311 3725
605 3725 3848 -11523 4675 8425 -14675 621 13731 -10320 -3829 12182 -5647 -4306 6842
618 6842 -6113 -549 6785 -9608 621 11826 -11068 -4296 15053 -6362 -8297 13231 157
631 157 -6904 7521 -284 -3888 4028 -6197 -3040 7475 -7843 -4705 12936 -3136 -7188 12331
645 12331 1746 -7156 7111 1262 -4801 4134 -3568 -4721 5649 -6895 -8118 8622 -3844
658 -3844 -9649 10465 3373 -6600 9731 5765 -4733 6163 451 -8044 3839 -3084 -11616 4919
672 4919 841 -11602 4924 6441 -8082 3276 9382 -1774 3864 7587 -99 2773 292 -6929
686 -6929 -824 -3785 -11029 198 1723 -6333 4099 7027 -2171 4661 6240 -2391 4504 4797 -4920
701 -4920 2663 2714 -10680 -3462 803 -11803 -4579 5454 -3297 1128 10234 1952 2063 6716 -1619
716 -1619 -1059 3574 -3965 -2219 3390 -4791 -5065 1044 -5188 -5306 2476 420 1653 7434 4165 3748
732 3748 5397 -1340 -1853 1033 -5238 -3884 1952 -3598 -3319 2782 -2827 -3495 3576 -371 -588 7162
748 7162 2801 -199 5577 -188 -5927 159 -2430 -6924 369 1383 -2755 1880 2559 -1901 458
763 458 1027 -1076 1650 2031 792 2876 672 -1900 261 -2283 -4026 716 -173 -1838 3445 2081
779 2081 -1926 2462 1435 -3434 1416 2343 -2578 1309 3066 -2820 -1065 1353 -3446 -1911 1862
794 1862 -866 128 2924 99 -368 929 -1798 -1650 177 -1370 -25 1665 -221 497 1259 -1314
810 -1314 -436 510 -1563 322 1619 -1235 599 1745 -2040 -424 1967 -1936 -341 3224 -996 -742
826 -742 3211 -1086 -2275 2335 -660 -2390 2486 839 -2156 1608 969 -2498 -49 799 -1546 -265
842 -265 1034 281 42 110 483 -169 -1661 167 716 -2257 -56 2210 -2022 -773 3173 -1571 -1922
859 -1922 3504 -499 -2783 3300 396 -3527 2341 1317 -3367 1596 2359 -2588 832 2497 -1890
874 -1890 -248 1830 -1346 -906 1169 -298 -521 530 498 101 -723 413 724 -1882 -267 1854 -2259
891 -2259 -1114 3376 -1803 -2306 4252 -906 -4001 4118 381 -5347 3303 2250 -5678 2015 4053
906 4053 -4881 227 4816 -3412 -1437 4421 -1646 -2325 2979 57 -2048 1131 1034 -830 -475 1028
922 1028 1133 -1604 -210 2785 -2065 -2158 4235 -1001 -4190 4942 928 -5939 4157 2761 -7266
937 -7266 2289 4494 -7208 546 6211 -5803 -1038 6959 -4299 -3045 6368 -2596 -4223 5135
951 5135 -469 -4252 3287 1001 -3024 1186 1346 -887 -232 395 1340 -549 -1847 2682 135 -4250
967 -4250 3448 2313 -5805 3341 4933 -7136 1325 6972 -7808 -1639 8940 -6288 -4441 9827
981 9827 -3377 -6753 8584 -534 -7826 6169 1813 -6795 3869 2875 -5254 1721 2297 -3478 424
996 424 1295 -1357 457 -262 199 1229 -2621 800 3293 -4253 332 6097 -4845 -1951 7908 -4717
1012 -4717 -5053 8690 -2727 -6937 9068 11 -8130 8078 1999 -9361 5801 3601 -9449
1025 -9449 3601 5403 -7871 1396 5860 -5639 -363 4997 -2996 -576 2881 -1652 -43 -97 -2390
1040 -2390 1130 -1606 -2904 3911 -760 -3256 6254 240 -5100 6799 1065 -7653 6481 2885
1054 2885 -9878 4673 4557 -11224 1775 6599 -9566 523 9227 -5672 224 9756 -3594
1067 -3594 -1618 7131 -3764 -3517 4227 -3878 -4086 2269 -3512 -2988 1876 -1859 1006 3823 -299
1082 -299 4389 4644 -2882 2968 2864 -7820 -436 2662 -9668 -1674 5143 -8172 -1460 8498 -5077
1097 -5077 -622 11633 -1845 -1146 11471 -1755 -5517 6859 -3814 -9509 3025 -2903 -8143
1110 -8143 3211 706 -3556 4952 2996 98 6007 2627 661 4859 -1046 -2863 1252 -5966 -6174
1125 -6174 472 -6135 -4548 5221 -1753 -1308 9731 1088 -1774 9804 1105 -5069 6778 -490
1139 -490 -9065 2573 -1717 -10748 1138 533 -7310 3939 5404 -2765 5856 6872 -2168 3495 4211
1154 4211 -4054 114 855 -5587 -1524 -1176 -5551 -114 -1 -3160 4063 3396 -959 6245 4108 -2993
1170 -2993 3921 1802 -6691 940 862 -8026 38 2161 -6996 579 4598 -4516 1625 6940 -2346
1185 -2346 1341 6273 -2858 -1297 3437 -4251 -2802 2258 -3663 -1865 2976 -2303 -613 3751 -1601
1200 -1601 186 4207 -1253 289 3731 -2277 -964 2608 -3588 -1718 2853 -3156 -1152 4097 -2264
1215 -2264 -1065 4473 -2131 -1817 4280 -1873 -2368 4110 -1623 -3065 3641 -1406 -3255 3529 -433
1230 -433 -2799 3623 257 -2799 2784 -142 -3121 2010 -131 -2615 2217 252 -1861 2551 349
1245 349 -1735 2639 125 -1998 2711 -111 -2568 2334 -433 -3239 2160 40 -3154 2779 1084
1260 1084 -2650 2849 1529 -3073 2189 1374 -3519 1410 1450 -3676 812 1615 -3508 390 2024 -2692
1276 -2692 596 2456 -1831 614 2220 -1582 278 1454 -1942 133 965 -1987 467 958 -1920
1291 -1920 924 1307 -2047 1391 1836 -2248 1297 2092 -2845 602 2249 -3219 -111 2786 -2689 -550
1307 -550 3162 -1992 -983 2938 -1485 -1436 2417 -1133 -1439 2025 -882 -1159 1770 -696 -928 1490
1323 1490 -826 -668 1508 -968 -507 1516 -1246 -486 1677 -1514 -514 2100 -1462 -646 2404 -1308
1339 -1308 -1021 2618 -1051 -1383 2614 -662 -1580 2409 -481 -1876 1888 -524 -1925 1741 -116 -1482
1355 -1482 1929 254 -1282 1668 -108 -1518 1193 -519 -1545 1440 -552 -1383 1799 -417 -1531
1370 -1531 2059 -259 -1828 2093 152 -2037 1827 406 -2221 1351 540 -1983 1285 861 -1539
1385 -1539 1203 674 -1519 888 250 -1427 1053 340 -1065 1526 280 -1392 1525 -112 -2131 1645
1401 1645 64 -2342 1955 750 -2494 1799 1234 -2808 1220 1445 -2716 822 1684 -2433 392 1717
1417 1717 -2158 223 1677 -1641 196 1529 -1386 123 1060 -1516 161 823 -1326 812 1028 -1315
1433 -1315 1246 999 -1885 972 996 -2475 998 1480 -2555 993 2134 -2582 574 2530 -2689 -72
1449 -72 2653 -2719 -701 2732 -2110 -988 2854 -1490 -1061 2547 -1120 -1294 1842 -1137 -1213 1619
1465 1619 -901 -591 1666 -898 -210 1655 -1277 -236 1742 -1728 -294 1975 -2074 -543 2366
1480 2366 -2013 -728 3179 -1520 -849 3563 -1372 -1695 3117 -1516 -2533 2904 -813 -2383 3067
1495 3067 -51 -2453 2475 -21 -2746 1878 424 -2062 2126 1002 -1489 1684 186 -2078 695
1510 695 -772 -2020 1208 -531 -1290 2113 -323 -1321 2711 -209 -1640 3292 64 -2332 2891 -297
1526 -297 -3856 1913 -232 -4292 2134 1641 -3069 2792 2969 -2735 1754 2568 -3198 490 2350 -2684
1542 -2684 129 2018 -2435 -713 1012 -2532 -719 1121 -1199 1059 2078 -289 1762 1365 -1746
1557 -1746 764 297 -3103 657 730 -3464 781 1339 -3696 838 2645 -2936 1397 4431 -1936 752
1573 752 4074 -2903 -1740 2599 -3354 -2572 2845 -1608 -1772 3379 -509 -1612 2646 -182 -1380 2296
1589 2296 252 -577 1949 -355 -1043 674 -1881 -1508 685 -1760 -487 2293 -1014 -78 2929 -1289
1605 -1289 -856 2969 -1481 -1526 3227 -1268 -2455 2793 -1228 -3347 2473 -201 -2852 3042 1337 -2237
1621 -2237 2532 1336 -2716 1225 888 -2779 860 1113 -2001 966 1205 -1645 699 787 -1571 792
1637 792 520 -1294 1178 422 -1473 1378 352 -2036 1414 519 -2434 1372 960 -2527 1209 1409
1653 1409 -2515 975 1707 -2546 539 1844 -2418 236 2208 -2060 -37 2241 -1757 -470 2003
1668 2003 -1437 -563 1980 -1058 -324 1879 -1114 -601 1298 -1287 -671 1528 -779 -138 1857 -868
1684 -868 -469 1168 -1599 -822 1258 -1265 -97 2419 -653 -278 2146 -1444 -1573 1431 -1429 -1564
1700 -1564 2045 -345 -1263 2044 -378 -1745 1500 -98 -1287 2134 846 -771 1685 59 -2044
1715 -2044 62 -846 -2141 722 442 -504 1895 809 -763 1297 50 -1402 1195 622 -861 1607
1731 1607 518 -1834 69 -958 -2919 -110 121 -1127 2066 2147 -81 1877 1302 -1787 91 334
1747 334 -2120 154 905 -1582 -208 350 -2123 -740 503 -949 1160 2538 808 1781 1802 -1039
1763 -1039 -569 -343 -2517 -1006 370 -1274 275 1408 -1092 -121 909 -1214 221 2126 379 1118
1779 1118 2484 -324 -892 -38 -2353 -2286 -337 -1184 -321 1639 470 565 1395 -443 -368 945 -395 109
1797 109 1673 -108 -393 525 -1726 -1891 -275 -1428 -600 1809 635 703 2342 157 -825 828 -765
1814 -765 -1414 1034 146 -708 1054 -9 -1523 -42 -493 -1310 650 866 205 1528 985 -326 240
1831 240 -565 -1195 -206 -418 -379 880 81 -236 753 -564 -979 778 -277 -662 1486 456 -845 1061
1849 1061 68 -1669 425 252 -1338 714 996 -901 604 833 -1085 -9 541 -945 10 725 -556
1866 -556 132 573 -475 18 368 -340 277 117 -413 382 -48 -629 563 87 -769 745 142 -1207 515
1885 515 255 -1319 783 988 -914 684 1075 -1303 -149 560 -1623 -346 1224 -508 87 1501
1901 1501 -418 -563 454 -784 -610 595 115 463 1037 -81 -11 -258 -1289 -438 23 -546 1002 1354
1919 1354 -229 691 538 -1809 -507 435 -1364 418 2085 -353 199 1502 -1533 -1630 474 -1242
1935 -1242 -745 2000 687 74 1549 -305 -1623 -260 -936 -978 1024 844 720 1307 -67 -695 -497
1952 -497 -1585 -713 787 -126 1061 2142 -377 -471 700 -2067 -1725 1268 -454 -189 2923 495 -1182
1969 -1182 1230 -967 -2758 505 175 -980 2119 1688 -737 722 -135 -2301 -524 -131 -875 1132
1985 1132 1415 238 906 -132 -1416 -420 -1023 -948 1420 537 90 2039 -51 -1816 615 -889 -2263
2002 -2263 1449 981 -982 2120 1321 -2005 421 250 -2763 298 1669 -1296 1029 2305 -1296 -487
2018 -487 950 -1863 -967 933 -475 329 1453 -216 215 276 -1530 -292 326 -1172 695 1272 -772
2035 -772 660 779 -1659 109 619 -1967 642 1809 -1527 525 2256 -1873 -752 1864 -1705 -1079
2051 -1079 2101 -643 -641 2050 -559 -921 1511 -1031 -1252 1470 -554 -1066 1681 42 -896 1091 -189
2068 -189 -815 563 -701 -327 1135 -942 -225 1849 -1020 -979 1854 -928 -1512 1722 -416 -1211 1904
2085 1904 -302 -1288 1816 -640 -1811 1936 -180 -2046 2144 989 -1887 1442 1065 -1925 295
2100 295 465 -1430 543 381 -792 1274 329 -1395 1097 302 -1720 877 747 -1006 1137 660 -1047
2117 -1047 946 -454 -2082 986 -245 -2409 1814 1481 -2058 1429 2011 -2183 211 1607 -1693
2132 -1693 114 1470 -1416 212 1089 -2199 -406 1100 -2001 -247 2236 -306 378 2172 -62
2147 -62 -144 372 -1298 -228 65 -1733 606 1143 -1923 131 1420 -2072 -424 1958 -832 541 2676
2164 2676 -415 343 1728 -2284 -1395 1038 -2631 -1746 2302 -662 -1225 2597 191 -1446 1400 314
2180 314 -654 1552 516 -111 1329 -919 -1715 141 -1812 -2026 836 34 -57 2285 719 162 1601
2197 1601 -855 -867 1611 -970 -1121 2372 -532 -2321 1211 -783 -3143 753 510 -1218 2113 1829
2213 1829 -259 1793 604 -2011 357 -28 -2275 622 950 -1460 265 568 -1493 -264 214 -514
2229 -514 1274 1138 127 1950 467 -1712 417 -419 -2578 402 717 -1416 1081 1259 -1401 601
2245 601 771 -1872 715 1643 -1322 870 2026 -1588 -565 1096 -1856 -1234 1086 -707 -78 1456
2261 1456 -187 93 823 -936 -222 855 -921 99 1316 -692 -140 850 -1177 -366 744 -1019
2277 -1019 122 1445 -844 120 1494 -1308 -702 1394 -1108 -888 1693 -475 -791 1566 -320 -878
2293 -878 1283 -389 -943 1196 -270 -1008 930 -272 -1096 821 -44 -773 899 79 -553 841 -196
2310 -196 -487 976 -305 -653 1071 -439 -1114 904 -306 -1163 1109 270 -848 1212 428 -1016 840
2327 840 109 -1228 765 398 -1063 795 428 -1224 325 163 -1187 388 584 -512 906 799 -703
2344 -703 504 217 -1301 260 263 -1010 506 702 -797 374 425 -1190 166 576 -855 639 1137
2361 1137 -718 261 687 -1254 -344 577 -893 -41 981 -370 91 780 -703 -260 341 -748 21
2378 21 831 -358 182 734 -692 -223 357 -938 -76 873 -572 286 1083 -719 -285 765 -890 -557
2396 -557 1001 -347 -275 1043 -241 -505 628 -521 -621 662 -201 -357 932 -92 -613 525 -331
2413 -331 -792 373 -108 -286 743 98 -207 619 -312 -568 444 -229 -461 747 -5 -402 631 -241
2431 -241 -550 624 -232 -575 948 -42 -651 872 107 -966 560 229 -898 411 435 -631 324 315
2449 315 -623 275 242 -582 383 279 -614 367 276 -611 232 258 -513 213 242 -529 357 243 -675 356 356 -704
2471 -704 306 443 -668 272 402 -627 279 459 -613 290 478 -753 165 569 -836 -7 727 -597
2489 -597 -46 843 -527 -258 565 -535 -181 463 -350 -62 589 -321 -110 435 -551 -157 470 -461 14
2508 14 683 -437 -56 609 -636 -313 667 -483 -252 931 -300 -283 742 -423 -561 663 -348 -403
2526 -403 870 -74 -451 736 -221 -704 513 -205 -520 704 71 -302 684 -176 -762 427 -169 -594
2544 -594 639 197 -360 637 -45 -550 387 -337 -510 698 34 -435 959 80 -892 469 -19 -965 580
2563 580 433 -464 713 443 -732 310 23 -925 316 363 -622 558 627 -634 58 237 -729 58 240
2582 240 -384 634 505 -502 444 241 -1180 -35 385 -813 268 798 -466 146 415 -756 14
2599 14 327 -735 487 972 -649 167 743 -1073 -587 444 -728 -202 882 -77 244 698 -576 -152
2617 -152 460 -773 -149 952 -292 -92 799 -492 -586 146 -683 -202 611 -323 309 1081 -551 -294 854
2636 854 -745 -775 901 -128 -477 829 -48 -623 321 -537 -583 641 -181 -181 1139 70 -536 753 -189
2655 -189 -908 344 -48 -343 586 -73 -203 618 -480 -614 744 -230 -618 1126 249 -648 563 89
2673 89 -883 252 -10 -631 544 138 -611 775 91 -946 536 325 -886 424 604 -486 228 293
2691 293 -515 140 -36 -525 527 153 -670 612 339 -877 355 426 -752 236 446 -624 308 283 -818
2710 -818 339 437 -869 346 749 -836 22 710 -796 -198 618 -478 -54 545 -356 99 443 -639
2728 -639 75 574 -692 53 711 -459 -103 561 -545 -173 419 -525 86 643 -578 83 690 -795
2746 -795 -325 737 -560 -324 949 -237 -251 714 -310 -392 454 -484 -305 689 -251 -279 802 -350 -562
2765 -562 504 -289 -545 509 -31 -172 641 -112 -262 516 -400 -468 688 -198 -489 772 -55 -527 593
2784 593 -104 -610 510 23 -345 774 131 -385 691 -110 -809 342 -66 -828 422 283 -446 549
2802 549 199 -443 412 83 -533 514 154 -529 511 253 -745 145 94 -870 -22 183 -423 466 550 -220
2822 -220 457 280 -660 113 180 -586 270 433 -412 193 189 -774 -94 139 -640 395 706 -180 576 707 -661
2843 -661 -136 229 -851 -257 595 -331 70 662 -402 -278 300 -571 -249 653 -74 281 786 -151 -266
2862 -266 74 -705 -423 217 -278 151 814 -85 -88 390 -645 -428 409 -200 114 909 -57 -119 432 -639
2882 -639 -811 291 -337 -277 997 261 -264 641 -178 -812 11 -74 -393 473 373 -117 411 -194 -601 28
2902 28 -309 -332 421 307 110 532 -116 -418 136 -471 -517 623 122 -191 834 152 -789 145 -26 -791
2922 -791 366 517 -285 481 443 -584 -117 40 -642 87 494 -181 316 547 -307 -213 3 -384 -44 151
2942 151 -56 424 143 -320 66 -131 -609 258 261 -266 590 401 -497 111 98 -834 83 506 -445 271 783
2963 783 -576 -263 436 -655 -456 644 -9 -108 628 -34 -397 49 -343 -349 210 109 154 404 54 -72
2983 -72 -45 -419 -74 134 -184 433 548 -285 72 243 -797 -343 482 -447 21 990 -92 -342 567 -421
3003 -421 -829 430 -24 -340 805 378 -481 288 -42 -890 -111 185 -199 307 515 52 27 -151 -315 -244
3023 -244 -315 111 460 4 185 470 -412 -389 315 -479 -434 816 88 -281 892 61 -897 288 -14 -900
3043 -900 389 682 -470 442 564 -701 -208 252 -567 -128 595 -8 72 403 -153 -348 -111 -236 -110
3062 -110 0 149 391 -33 -85 266 -268 -631 310 8 -446 707 393 -603 381 327 -954 79 578 -736
3082 -736 66 889 -418 -261 724 -353 -494 519 -92 -438 434 90 -274 168 -23 -223 20 -29 -82 81
3102 81 -32 176 43 -233 235 21 -397 200 289 -587 125 598 -533 -44 629 -456 -271 669 -367 -439
3122 -439 780 -143 -465 716 71 -646 469 130 -708 238 347 -389 154 406 -269 -128 37 -183 -113
3141 -113 -47 101 175 -104 39 166 -393 -190 326 -330 -168 658 -145 -295 666 -193 -646 418 -32 -649
3161 -649 592 420 -570 386 369 -693 -7 336 -445 35 584 -179 28 337 -330 -264 203 -144 4 279
3181 279 20 -12 17 -188 -115 -179 -190 282 74 -91 507 17 -534 270 64 -635 299 450 -413 273 457 -649
3203 -649 -193 366 -549 -69 736 -95 -61 604 -162 -378 180 -171 -287 286 167 -64 206 -103 -176 -120 -140
3224 -140 -11 293 135 333 349 -144 -108 2 -417 -113 210 -151 132 422 -333 -200 269 -424 -225 546 54
3245 54 12 634 26 -370 137 -317 -556 270 10 -176 476 276 -303 81 -74 -392 115 270 87 313 253
3266 253 -148 -12 -319 -369 -12 -150 -36 418 192 -56 202 -143 -376 73 -13 -104 476 210 -202 137 -204
3287 -204 -647 -30 -74 -283 441 418 -108 191 183 -530 -159 107 -321 195 513 -115 38 159 -444 -313 55
3308 55 -196 40 436 103 197 105 -247 -186 -168 -186 131 257 44 257 112 -317 -79 -30 -420 107 343 -142
3330 -142 177 387 -395 -136 198 -422 -181 425 -51 -42 508 -82 -342 145 -201 -291 268 95 -72 291 92
3351 92 -184 7 -103 -110 69 90 137 304 -61 -82 67 -311 -141 164 -167 -22 411 -87 -162 259 -245 -344 356
3374 356 -27 -308 452 104 -341 195 -27 -407 107 196 -221 194 262 -205 33 100 -209 -2 71 -92 125
3395 125 168 -71 1 -21 -234 55 -34 -98 222 53 -199 240 -20 -405 181 86 -360 234 260 -349 69 241
3417 241 -416 -25 257 -347 41 331 -253 -78 311 -243 -208 234 -66 -67 187 39 -34 82 -54 -55 7 -107
3439 -107 38 145 -185 67 186 -246 32 175 -289 42 267 -286 -94 261 -216 -119 314 -227 -147 371 -101
3460 -101 -239 323 -50 -212 292 22 -258 239 61 -221 164 38 -119 173 34 -147 93 -6 -114 115
3480 115 -57 -18 211 -43 -48 257 -152 -216 266 -104 -205 319 1 -245 306 15 -355 186 93 -271 215 150
3502 150 -236 173 96 -291 65 201 -217 43 129 -138 119 96 -198 39 34 -166 48 179 -123 219 107 -252
3524 -252 105 14 -275 144 168 -158 232 221 -275 54 110 -376 -9 211 -156 103 328 -205 -15 162 -248
3545 -248 -121 230 -147 46 298 -77 -53 141 -196 -42 154 -99 64 235 -97 3 92 -314 -70 164 -235
3566 -235 26 264 -159 -15 181 -271 -208 159 -165 -97 357 -56 -51 212 -74 -216 169 -95 -149 275 46 -134
3588 -134 183 -112 -166 123 -97 -28 225 40 -42 234 -133 -198 157 -72 -147 258 10 -78 218 -27 -218 107
3610 107 -98 -182 247 34 -156 246 -19 -217 170 -32 -273 114 141 -124 212 76 -291 -33 50 -194 114
3631 114 204 -69 167 120 -115 8 -27 -193 27 114 -89 139 181 -173 100 10 -249 98 160 -157 175 191 -228
3654 -228 16 68 -307 -42 71 -151 9 224 -169 -60 58 -177 -41 154 -63 8 214 -103 7 98 -191
3675 -191 -70 115 -119 39 232 -2 37 126 -145 -26 161 -93 8 158 -81 19 93 -151 -77 180 -118
3696 -118 5 242 -101 -73 129 -126 -178 118 -107 -51 228 19 -126 90 -55 -237 131 -63 -84 128 48 57
3718 57 137 -77 -74 77 -35 -162 179 13 -88 195 -1 -159 145 -24 -77 91 67 -81 100 -6 -159 49
3740 49 -23 -153 91 25 -54 129 21 -118 59 -20 -189 76 33 -116 101 25 -177 5 39 -91 13 81 -95
3763 -95 76 77 -101 56 1 -120 58 35 -92 -18 127 -100 34 120 -89 31 132 -51 7 106 -122 35 63
3786 63 -129 47 81 -120 2 77 -119 46 86 -124 32 153 -110 -81 140 -117 -110 140 -85 -63 174 34 -95
3809 -95 128 4 -46 57 -34 -68 81 -31 -48 56 -18 4 85 -51 -8 78 -57 -33 159 -102 -136 137 44 -108
3833 -108 157 23 -132 122 -50 -137 134 61 -111 94 26 -151 78 30 -139 22 14 -139 41 24 -36 -2 80
3856 80 -59 61 70 -78 -4 -66 -67 115 -22 -186 30 -26 -118 127 35 -96 166 109 -150 21 142 -230 -7 148
3880 148 -209 -95 162 -104 -106 123 -118 -56 89 -5 -51 152 48 -23 44 -41 -45 -36 -85 -64 76 -108 -15 103 -134
3905 -134 118 169 -91 53 205 -169 -69 252 -131 -134 168 -24 -144 189 -44 -108 129 16 -106 139 40 -127
3927 -127 154 41 -202 7 -32 -109 25 37 -58 12 -79 -39 114 -118 -13 46 -55 -72 125 -74 -119 172 -78
3950 -78 -209 177 20 -191 185 50 -241 168 64 -195 127 87 -172 59 83 -169 -19 142 -180 77 66
3971 66 -76 96 58 -84 -30 -37 -81 55 20 -14 65 -25 -26 140 28 -199 106 -3 -195 80 75 -179 102 136 -212
3996 -212 4 132 -203 -11 91 -114 -22 155 -186 -21 140 -151 -15 156 -20 -68 123 -52 0 97 -36
4017 -36 38 73 -93 -7 85 -113 47 136 -87 112 39 -161 21 165 -156 2 207 -151 -15 230 -110 -36 164
4040 164 -103 -163 191 -87 -167 178 -54 -148 155 -7 -54 141 11 -103 102 -30 -67 76 -58 -3 36 -61 -28
4063 -28 96 -103 -41 143 -84 -13 189 -114 -49 233 -71 -154 224 -11 -166 195 -10 -214 128 9 -146 120
4085 120 81 -166 -6 68 -113 58 66 -85 -30 39 -59 76 64 -58 82 20 -75 81 -25 -80 102 -32 -15 133
4109 133 33 -137 203 -19 -147 185 48 -203 133 101 -181 77 95 -163 114 151 -129 41 68 -139 -67 119
4131 119 -86 -10 121 -27 -9 52 -34 8 55 -129 1 41 -114 68 48 -58 44 84 -87 61 44 -112 58
4154 58 139 -164 25 114 -140 21 148 -120 42 171 -78 -79 139 -75 -52 172 -62 -58 126 -34 -93 30 -26
4177 -26 -53 97 -56 -50 41 -76 -1 99 -49 -60 57 -68 -85 87 -127 -31 56 -112 -25 158 -31 -68 136 -13
4201 -13 -81 139 -12 -81 87 10 -88 111 34 -111 84 12 -88 83 32 -96 25 26 -104 49 1 -124 15 0
4225 0 -44 43 41 -105 5 -5 -94 -9 -15 -70 52 43 -77 92 18 -118 36 146 -74 44 91 -91 84 139 -126 -43
4251 -43 75 -92 -24 69 -47 -16 125 7 -1 2 -33 -48 31 51 57 23 10 -2 -8 -69 -31 80 -30 77 141 -88 -23 117
4279 117 -110 -13 153 -50 -39 157 -48 -106 70 -3 -132 42 13 -32 154 57 -29 63 40 -147 -11 22 -41 44
4303 44 45 -37 17 -6 -3 46 -48 1 43 51 54 65 -47 -58 33 -58 -160 97 15 -113 103 25 -159 131 119 -124 99 175
4331 175 -81 30 150 -35 -49 54 -49 -93 42 58 -62 197 74 12 36 -21 -19 7 -73 -10 7 -44 -5 1 -126
4356 -126 34 54 -161 18 182 -82 -17 81 -98 -86 112 -90 -49 111 -9 -92 141 10 -105 129 -29 -148
4378 -148 131 107 -115 20 42 -87 66 -23 -137 33 43 -54 95 -48 3 85 -80 -32 99 -96 -49 124 -97
4401 -97 -148 141 -17 -68 137 10 -100 107 9 -171 43 -9 -102 -3 65 -111 32 43 -66 -32 86 50 41 65 -79
4426 -79 68 -60 -116 -35 -59 -88 55 25 -103 129 111 -121 72 76 -55 115 111 -65 68 117 -168 -43 16 -140
4450 -140 0 186 -32 65 98 -23 -27 32 -112 -34 116 -66 28 87 -53 -31 6 -194 26 87 -110 57 143 -16
4474 -16 -11 82 -215 -41 57 -198 5 176 -57 10 133 -179 -84 102 -39 -44 151 73 16 83 -62 -132 -39 -62 -50
4499 -50 81 63 49 93 -66 -3 54 -112 -120 107 0 73 208 -89 -104 50 -143 -141 74 -46 -27 233 3 -78 107
4524 107 -74 -210 34 -74 22 126 66 -7 80 -28 -70 -13 -45 -29 147 108 30 145 -94 -129 6 -80 -143 104
4548 104 78 -28 137 -55 -60 9 -57 -148 69 -33 -71 149 101 -96 55 -13 -183 -57 66 -20 57 113 -23 26
4572 26 -2 -85 19 37 -89 88 4 -54 109 10 -156 56 18 -187 86 48 -68 -2 146 -137 -5 156 -130
4595 -130 14 76 -75 -16 97 -124 2 107 -130 -78 88 -130 -14 80 46 -2 36 8 41 47 -46 -41 32 -94 12
4620 12 88 -54 79 77 -118 -22 41 -136 48 157 -26 25 155 -54 -112 69 -96 -59 120 30 -34 102 9 -119
4644 -119 44 -67 -74 11 21 -3 64 51 -15 12 -88 -78 -4 -60 55 105 33 -38 100 -98 -170 25 -46 -63 203 58
4670 58 -7 110 -35 -100 -17 -58 -114 145 92 -22 142 97 -166 -47 -34 -165 20 114 -6 164 99 -94 -56 -34
4694 -34 -192 -18 45 50 123 31 -4 -14 -111 -171 -20 -14 -14 194 107 6 46 25 -154 -37 56 -65 93 218 -29 39
4720 39 111 -137 -90 -44 9 -14 174 42 -27 161 -51 -112 -27 -100 -100 79 54 72 141 42 -128 -25 -120 -89 55 4
4746 4 69 98 -32 21 19 -97 -101 30 27 18 185 40 -80 100 -50 -142 35 118 -37 147 142 -32 92 63 -147 -42
4772 -42 15 -59 29 151 -42 74 36 -126 -25 -3 -55 -19 95 71 66 44 -78 5 9 -144 40 77 -35 82 93 -91
4798 -91 22 51 -95 -47 76 -83 40 75 -45 -68 89 -104 -69 132 13 -8 24 -34 -24 79 -35 -62 32 -15
4822 -15 -75 40 -51 8 109 -6 11 54 -41 32 50 -61 -44 68 -14 5 82 41 -9 16 -51 -88 81 -22 -9 114
4848 114 50 -22 67 -81 -208 -13 4 -11 110 108 -3 61 18 -158 -15 -11 -56 98 75 -30 46 -63 -112 -36 -46 -73
4874 -73 69 70 43 176 59 -91 -35 -18 -132 3 115 -24 120 122 -9 -77 -35 -142 -59 31 -9 56 138 16 6
4899 6 -30 -167 -118 -7 -19 144 120 8 68 21 -192 -95 -43 -81 41 145 68 29 66 -105 -119 -17 -126 18 117
4924 117 14 99 118 -93 -90 -89 -109 -46 101 47 55 173 34 -18 -41 -147 -92 47 -26 80 116 -13 -8 -82 -59 -109 88
4951 88 -78 31 165 9 -9 14 -77 -100 -39 -37 -42 129 25 11 70 -5 -116 -4 -54 -91 143 66 50 94 14 -79 -26
4978 -26 -116 -75 41 -20 -24 148 3 -86 60 -25 -173 69 10 -65 46 10 -52 57 17 -91 15 1 -70 -7 53 -50
5004 -50 89 91 -32 46 3 -20 77 21 -36 112 -7 -26 67 21 -106 10 19 -38 15 40 -3 14 55 -81 32 7 -80
5031 -80 16 55 -17 92 76 -62 -80 -77 -69 24 6 -24 23 134 4 29 -35 -90 42 -26 -64 81 59 5 93 8 -108 -59
5059 -59 40 -78 27 119 -53 60 90 -10 -87 37 -102 45 81 -1 21 51 -28 -79 -34 -32 -35 35 2 100 47 -1 -5 -25
5087 -25 -111 -3 71 -18 77 128 14 10 51 -102 6 37 -88 18 152 -18 -1 81 -68 -92 -7 -49 -104 131 47 -21
5113 -21 112 37 -62 31 -11 -79 60 -10 -26 16 -6 -27 -44 -21 -93 18 2 26 72 50 3 65 -74 -82 63 -19 -60 92
5141 92 76 -26 58 66 -57 38 -47 -68 69 102 25 99 42 -62 -61 -17 -79 -3 47 -1 56 37 -3 7 -45 -53 -100 33 11
5170 11 125 52 -52 55 -2 -109 -15 13 -17 59 101 -32 -26 45 -88 -39 -14 -72 -13 108 44 -5 83 -37 -92 9
5196 9 -37 -22 57 2 12 56 -30 -7 -7 -38 -72 22 27 0 36 36 -19 5 -16 -118 34 -81 4 52 23 -6 31 -4 -45 41 -11
5227 -11 -43 0 -19 6 50 -47 -46 17 -8 -57 -21 15 -54 37 -9 1 -32 15 -87 -13 60 -77 59 49 19 5 24 -27 17
5256 17 36 -13 -32 12 1 29 66 -37 45 14 -49 68 61 -52 97 77 -31 -38 17 -67 -67 29 -91 8 131 42 -28 24
5284 24 -45 -71 -5 -23 -5 92 29 -18 41 -57 -126 -32 -10 48 64 -2 19 11 -18 -51 -60 -27 -63 36 40 39 66 -5 -51 22 -40 -97
5316 -97 33 61 36 117 -46 -29 14 -40 -159 28 80 -50 101 28 -29 30 13 -108 -44 38 -16 102 38 -24 -2 -50
5342 -50 -90 28 -8 -46 93 50 21 56 4 -93 42 -6 -31 40 138 -76 47 85 -111 -55 69 -103 -78 42 -68
5367 -68 -41 63 -64 -2 -40 24 -21 49 29 13 -33 -80 -43 -17 -6 -15 -36 -7 24 5 -38 17 128 -4 72 41 -61 69
5395 69 103 -90 -87 69 -25 -12 86 -55 -58 90 4 -61 -11 12 -64 122 71 -58 -9 -50 -13 -44 -18 4 88 -62 8 6
5423 6 -39 18 23 -66 2 92 -72 21 35 -55 -49 27 -4 -5 73 47 36 69 12 18 38 -7 -23 72 59 -25 -13 20 -45 -22 -23 12 14
5456 14 15 35 12 46 37 -2 -56 -65 44 -22 51 112 -18 -70 -13 -11 -117 68 -5 -2 138 17 -48 50 -49 -114 -13 18 -9
5485 -9 81 33 52 15 -12 -24 -10 20 7 87 43 -8 118 -26 -16 6 -14 0 98 -12 7 6 -57 -62 -18 36 -105 -26 -28 -9
5515 -9 28 18 -49 -5 -11 8 26 34 19 -26 14 -93 -25 12 -3 26 47 31 65 11 0 69 6 -59 70 -5 -56 26 8 -40 24
5546 24 25 -77 20 22 -41 -1 95 -48 32 52 -42 1 61 -44 -39 46 6 -40 1 -46 -43 14 3 -15 -50 41 62 3 1 22 35
5577 35 -3 31 41 -38 19 -46 -65 3 44 -48 17 62 -25 -14 72 -23 -78 55 -30 1 -23 -17 -62 -32 96 -22 27 72 -20
5606 -20 -14 -33 18 28 55 -9 75 13 39 46 -10 -15 12 28 -78 16 45 -44 14 13 -78 -24 47 -58 23 14 21 46 58 -51 12 10
5638 10 -44 -32 30 -108 -58 59 -23 -65 14 21 -30 4 -63 -45 6 4 -28 46 -43 -14 16 -30 47 2 -49 -31 60 -7 -59 74
5668 74 39 47 12 8 -36 -43 -27 43 39 -34 32 6 -29 -23 32 -13 -61 54 88 4 61 -34 -33 28 -29 -41 18 66 -4 84 2 17 31
5701 31 -35 -40 42 -55 35 72 23 -38 40 -29 -38 45 10 -59 0 19 -15 36 24 -69 84 43 18 44 -17 -28 10 -51 -17 2 22
5732 22 -11 -16 69 -20 -2 7 -57 11 60 -44 48 45 -17 98 78 -66 36 20 -62 -62 51 -30 -29 63 -79 -17 -25 4 -15 40
5762 40 -22 -39 8 -18 -1 5 -74 -70 29 2 -10 90 28 -67 44 -28 -36 99 -6 14 59 -58 -37 18 -28 -42 39 -35 16
5791 16 23 -15 -55 53 39 -68 18 64 -25 -4 -27 -12 -32 -47 -95 6 33 1 65 56 -40 19 -52 -106 -37 -27 -20 24 39 -58
5821 -58 58 7 -35 50 42 -15 64 83 -64 90 69 -63 -18 51 -72 -23 55 2 -6 -9 -28 6 -19 -2 21 47 -16 54 52 -38
5851 -38 8 -7 -31 -22 14 -17 -22 -26 11 -22 11 -19 11 14 -25 -27 41 -28 15 97 -22 3 46 -52 17 63 -9 -27 51 -3 -54 -21
5883 -21 3 -10 -10 -14 -50 -19 -17 -15 34 19 15 -17 -17 -29 -16 -38 14 29 22 -65 -9 -28 -63 27 27 -19 92 48 -49 48 59 13 29 -30
5917 -30 -33 -15 82 22 37 68 -33 -38 27 29 12 22 -45 -18 -19 22 44 12 -29 30 -6 2 77 -7 -76 -55 -23 -28 -49 8 -39 -5 20
5950 20 -10 63 57 -4 15 56 40 -27 -3 22 3 61 26 -23 -31 -3 31 -20 -21 47 8 -12 -7 17 -32 -2 21 -66 -11 22 -11 -40
5982 -40 35 -6 19 55 -9 10 -9 -42 -60 58 42 -36 41 38 -30 4 -22 -44 38 57 9 28 -20 -32 5 14 22 8 -42 13 -16
6013 -16 27 4 22 -26 -18 17 5 -51 -15 -7 -4 -20 -28 -1 6 51 -19 27 33 -108 -1 -8 -21 0 79 17 -13 60 -15 8 7 -5 14
6046 14 -15 11 17 -36 -6 -1 -27 -46 -33 11 6 -17 -16 -44 61 -34 -100 -43 39 -44 73 21 -41 17 -85 -35 -28 22 54 78 63
6077 63 27 -28 -9 -10 -36 -12 15 0 -11 -5 30 -64 -90 28 -3 34 112 52 -59 12 35 -90 3 -16 -15 90 36 -1 47 37
6107 37 -70 -20 -11 6 45 33 39 36 -6 -65 -50 6 25 -14 2 139 60 -23 -5 -21 -8 7 -23 89 42 61 -13 -40 -2 -6 -44
6138 -44 7 48 6 57 59 -28 -8 13 20 -84 23 20 -35 49 -47 -53 -6 -35 30 -19 4 71 6 -30 -4 -17 -42 -8 -41 -21 5
6169 5 8 43 -27 8 -100 -34 65 90 31 26 19 2 44 34 -71 25 0 21 35 36 49 -44 -9 18 49 39 10 43 1 15 7 -51
6201 -51 -72 1 -51 -18 8 -12 29 18 -35 -24 -43 22 -36 29 26 -40 5 47 -52 -21 -9 37 10 34 -23 -1 -20 -52 -8 26 44
6232 44 -5 27 8 -15 -59 -18 -70 14 14 -51 5 -8 -26 -16 -39 13 -21 -37 -10 38 60 -12 16 -48 43 56 4 16 69 61 -48
6263 -48 45 -5 -3 18 15 33 29 -17 -36 65 25 -11 13 -18 -33 -20 24 35 19 -16 -32 -28 -18 24 -55 -1 31 50 8 -34 22 45
6295 45 24 7 8 -28 -20 1 -86 21 13 -38 8 41 -15 11 100 -47 11 70 -32 -60 -18 -28 -56 44 -52 -13 -34 -56 -11 -39
6325 -39 -96 -27 0 27 31 11 -49 19 10 -15 -26 -16 -23 3 29 3 22 54 -35 -79 -51 -12 -19 47 3 0 70 12 4 -23 -42 -31 20
6358 20 40 39 58 11 -51 -45 1 -78 -51 24 5 27 25 -26 -5 -74 -127 -17 -31 17 59 40 22 4 -40 -63 -30 -7 -68 48 70
6389 70 -22 -42 11 -51 -60 -21 -46 40 54 12 -7 1 -17 -72 -7 6 61 14 79 79 -26 -29 -93 -51 -52 -4 52 30 3 11 -12 -40 -44
6422 -44 -2 -50 16 14 11 61 -27 24 0 -5 -43 9 -13 16 23 -3 -49 -48 15 -21 -62 75 2 29 -29 6 -47 -72 17 2 64 16
6454 16 51 31 -54 4 16 -23 39 2 -39 88 -35 -47 21 -2 8 21 47 35 68 3 -44 -44 14 -42 -28 34 24 10 -40 -24
6484 -24 -16 -42 -9 3 22 30 -21 -1 -3 -76 -51 19 14 33 46 -2 -42 -41 -23 -63 -9 28 49 50 67 72 1 -46 35 -68 -44 63 61
6517 61 52 66 84 -45 -58 -57 -47 30 44 2 50 62 -17 -86 -22 39 -38 -16 -3 7 14 62 3 -34 -77 -58 -19 56 1 43 21
6548 21 33 -54 -58 -58 -24 -55 34 16 63 2 -7 8 -96 -28 -6 4 27 47 61 20 -24 -25 -54 -14 -37 10 48 -12 35 -12 -13 -48
6580 -48 -34 -20 2 -17 38 33 -31 20 -69 -61 -30 -24 -30 24 22 -25 -5 16 -14 4 26 -34 41 -22 3 59 -35 -34 -59 -44 -24 -28 43 38
6614 38 73 28 28 -22 -36 -30 -31 30 -19 25 37 42 82 -41 -57 -33 -102 -46 -16 4 -56 31 42 -33 -47 -16 -23 31 -66 16 1 20
6646 20 8 -12 7 3 27 -20 19 46 26 -69 -26 -74 -53 -4 7 -7 32 -10 -31 14 -55 -75 -7 -23 -63 5 -1 -29 -3 35 -1
6677 -1 -16 -57 -2 18 115 45 54 -1 -27 6 38 -9 -27 5 24 18 23 -77 11 -36 -3 15 -62 47 35 33 -74 -12 19 13 -48 -38
6709 -38 -6 -4 19 33 2 0 -29 -39 59 -36 15 -51 -28 24 -40 18 1 91 95 9 32 21 9 -15 71 10 67 17 67 -15 -31 5
6741 5 -5 12 -29 103 7 -34 42 -97 -53 13 2 -13 76 35 -12 1 30 -70 -7 -33 -55 36 54 31 52 21 -47 -11 -64
6770 -64 29 12 49 70 52 77 -6 -12 -59 -49 8 21 107 81 66 9 2 -40 -101 -53 52 -25 77 44 37 1 -7 -83 -22 22 -19
6801 -19 32 48 39 40 8 -67 -128 -17 -42 62 133 110 41 71 -48 -54 -45 -1 6 -3 67 61 10 -21 -86 -32 -48 -22 11 4 28 87 -42
6834 -42 -98 -17 -45 -25 34 40 15 29 12 10 -38 -73 -68 -4 9 -30 28 63 -2 6 -36 -42 -72 71 3 20 42 13 -27 4 -71 10
6866 10 -7 0 30 70 11 -35 -21 -77 -1 -5 -7 43 75 4 -4 -30 -46 -35 -6 -19 -13 38 -9 30 36 -8 -7 -8 -34 -30 -5 -28 -28 28 -16
6901 -16 -1 17 24 -19 -33 60 39 -17 47 -22 -36 6 -2 -3 34 -16 -18 29 -39 -39 0 -33 -42 -55 -17 -14 -43 -17 16 24 -6 -10 6 -13 38
6936 38 -89 -46 23 28 -29 14 34 -17 -9 33 -17 -47 10 16 33 44 18 -11 -5 -18 -19 -23 8 15 32 12 34 27 -72 -33 47 -78 9
6969 9 39 -15 -46 32 -15 18 -25 -45 -72 74 2 68 72 32 -24 8 -47 -51 -35 51 -65 54 6 -93 13 -62 -59 12 22 22 -20
7000 -20 25 -20 10 -29 -53 -38 -62 14 66 18 41 -29 -91 6 -32 -11 -46 48 -30 -34 73 -16 -108 -67 -19 -46 -67 30 8 9 30
7031 30 -16 -63 -13 -27 -26 14 42 23 31 5 -18 -42 19 -51 27 -32 46 118 -49 31 -77 -10 -10 -48 20 31 15 85 1 -15 6
7062 6 -20 26 29 27 40 54 85 -37 18 -6 -12 32 -11 60 14 9 -5 -5 -24 -75 -53 -50 -13 -39 -5 -42 19 -25 -18 -33 16 -27 -18 18
7096 18 -31 26 32 -1 70 36 1 -43 -18 -5 50 44 -4 -8 -39 32 33 40 -13 -21 49 -102 17 -16 13 15 7 -36 42 -18 -17 -17 18 3
7130 3 -29 34 -32 -28 -20 48 -27 2 -45 8 -17 12 -30 5 36 -9 -20 34 -8 -33 -11 31 3 13 4 -29 46 7 81 42 23 27 17
7163 17 -17 31 -5 49 7 -24 -10 33 -18 -30 -64 -8 83 23 39 -35 -26 34 -32 -12 -59 20 45 9 36 -6 -26 -12 26 -14 -11
7194 -11 40 42 47 18 1 7 -13 10 -15 -22 -19 40 45 -6 -29 -25 -70 11 -27 16 12 -35 12 18 34 15 -53 -87 13 -18 -16 -9 11 -38 -35 -6
7230 -6 -11 29 -4 -15 19 -87 35 3 -45 -36 -58 -69 21 -1 -1 -28 56 -20 -16 14 27 -80 5 20 49 47 -30 84 3 -17 -29
7261 -29 -23 -7 -29 -4 19 4 50 2 -9 -69 -65 -41 -13 23 11 4 41 -21 31 -31 7 20 -11 35 19 -10 -26 -19 -36 31 24 -35 -76
7294 -76 -24 -14 -17 28 0 -11 -56 39 -11 5 -1 -76 -11 73 9 -46 -66 14 -38 -78 43 -20 4 -55 -19 -26 -23 -10 6 18 67 -15
7326 -15 -50 -49 -32 -6 -22 -1 35 27 6 22 -43 17 27 8 -34 12 17 10 31 10 -47 32 -62 -3 40 -45 -24 -17 -19 -27 13 -30 -42 12
7360 12 11 -26 -42 0 -5 -4 30 44 -46 -46 38 46 49 8 36 -2 40 -4 -39 -66 62 -57 -66 107 -14 -7 10 7 -29 42 10 9 11 47
7394 47 26 -20 -19 -32 -6 -32 -12 -20 -7 -33 -4 2 25 -26 9 7 12 29 -13 51 22 22 -16 38 -27 43 42 -17 35 49 -3 31 -59 19
7428 19 -70 22 -16 -56 12 -30 -51 -24 -26 19 61 35 14 41 8 16 -48 15 -8 10 3 -32 -35 4 46 20 10 -31 68 43 49 -1 -21
7461 -21 25 -11 -26 -12 41 -33 0 -24 24 -3 13 -13 -44 -32 -14 -37 12 58 -9 8 27 -8 21 -8 26 -7 27 -12 30 23 0
7492 0 67 -14 23 2 -6 7 9 -18 14 36 -14 -53 58 -36 -27 86 27 3 -33 18 -17 27 14 -34 23 1 -37 29 -28 -52 -23
7523 -23 -17 30 -54 18 25 -24 -45 7 12 -27 60 21 -49 23 -1 16 -11 -29 5 -2 62 6 -17 -1 -18 11 -6 25 -20 28 40 1
7555 1 -22 -17 -34 46 -7 39 3 -4 -25 -27 -23 -2 18 -3 19 -50 -6 -1 12 16 43 -13 17 8 -30 19 -26 3 86 -47 0 1 37 20
7589 20 12 -16 -14 9 -14 -19 -4 11 -52 -34 -11 19 -21 16 -42 -30 -2 -5 -14 -12 -17 -37 59 -8 -39 -49 -20 -20 -28 5 2 34 -44 35 19
7624 19 6 -43 -25 -29 9 -20 -36 -47 7 76 46 -40 16 51 -43 15 -1 -12 -19 -14 -24 -33 -7 -33 -12 -41 -50 -51 2 -2 0 -7 41 18 -14
7659 -14 -32 -27 -19 9 48 72 7 -2 39 -23 -48 2 -17 8 17 -41 21 22 -12 -9 -5 -41 -33 -40 36 -60 19 -2 -20 36 -7 -46 1 -19 -27
7694 -27 66 15 -36 7 -28 -74 2 -20 34 37 -15 11 9 -18 -9 -44 39 -4 37 23 -66 21 -11 -56 1 30 -23 15 -18 20 -5 -18
7726 -18 34 19 -24 -33 -43 -6 -23 2 -19 -10 -41 -37 -25 12 53 1 16 21 -39 32 -17 -40 -48 12 -61 31 65 -40 -6 -1 8 -30 -51
7759 -51 -3 30 -2 7 52 -33 18 4 -42 -17 7 33 -40 -10 -14 -28 11 4 11 -44 -15 -85 -1 39 83 21 -10 -36 26 4 -20 -28 -34
7792 -34 14 -13 -14 31 1 6 7 5 61 52 -24 19 5 7 34 11 22 -38 31 -19 34 33 -72 -14 -30 -8 32 -36 -22 -15 -37 -68 -57 -17
7826 -17 22 14 -2 11 -39 -41 17 -23 52 -30 29 -44 -14 -48 4 15 -4 -29 -54 -10 7 11 -3 17 -18 50 39 11 -54 37 6 29
7858 29 6 10 -39 7 -60 29 -47 -55 -33 5 2 -85 -39 -16 -39 -48 -43 -3 -5 -26 15 10 21 -12 53 -10 3 21 0 -1 43 -8 32 14
7892 14 -1 18 -31 -56 3 23 4 -9 -31 -34 18 4 0 7 -5 6 -13 -25 38 23 1 -3 -23 13 -4 -31 -50 -16 -30 11 73 43
7924 43 44 53 19 55 0 -11 11 3 16 25 23 3 -15 -44 -31 11 9 -53 15 32 -57 17 -28 -27 -34 -18 17 1 -48 9 17 -14 -26 34 13
7959 13 -7 -22 -19 -6 2 -4 -8 19 23 -21 -16 24 -3 39 15 9 22 12 18 3 -50 -16 -18 -6 -8 0 56 53 -49 17 10 53 12 79 2 -25
7995 -25 -32 38 9 26 -2 -15 8 14 8 -10 50 -62 5 -9 8 -38 -24 -1 -81 -33 75 18 68 23 53 -16 -8 19 12 -48 4 1
8027 1 40 -27 -44 24 0 -23 -41 -75 -54 -3 -37 19 37 88 -6 -6 -21 -15 21 -22 -5 -18 -2 -8 -20 45 -57 4 11 -11 31 -2
8059 -2 30 65 -26 -24 -40 -40 -3 -3 28 5 -43 2 19 4 23 28 20 -50 60 48 8 -17 3 -56 27 37 42 -4 -27 61 -7 20 -20
8092 -20 6 45 19 45 -20 77 34 -15 -42 -34 18 -21 -22 21 -12 -39 1 -15 -40 11 18 31 -40 -21 50 -32 37 -4 -5 -11 -43 -64 -17
8125 -17 -33 -59 -32 -24 -52 38 34 -38 -12 -15 26 -61 -11 -63 3 -19 -11 106 55 26 39 38 7 9 19 25 39 -17 -27 26 6 -62 -16
8158 -16 -73 10 22 11 0 44 16 -23 -14 18 43 -48 20 2 -9 -8 -49 -10 -68 0 -25 -27 32 12 6 7 72 6 19 33 -6 -26 -24
8191b4
##END NTUPLES=NMR FID
##END=
