##TITLE=1H_AM_NV 153
 CDCl3
 8 sc, 
 5.6.2024
##JCAMPDX= 6.0         $$ Bruker NMR JCAMP-DX V2.0
##DATA TYPE= NMR FID
##DATA CLASS= NTUPLES
##ORIGIN= UXNMR, Bruker Analytische Messtechnik GmbH
##OWNER= root
$$ XWIN-NMR		Version 3.5
$$ Wed Jun  5 13:41:47 2024 Russian Standard Time (UT+4h)  she@DPX200
##.OBSERVE FREQUENCY= 200.1309
##.OBSERVE NUCLEUS= ^1H
##.DELAY= (6, 6)
##.ACQUISITION MODE= SIMULTANEOUS
##.ACQUISITION SCHEME= undefined
##.AVERAGES= 8
##.DIGITISER RES= 18
##SPECTROMETER/DATA SYSTEM= spect
##.PULSE SEQUENCE= zg30
##.SOLVENT NAME= CDCl3
##.SHIFT REFERENCE= (INTERNAL, CDCl3, 0, 15.7039)
##AUDIT TRAIL= $$ (NUMBER, WHEN, WHO, WHERE, WHAT)
$$ ##TITLE= Audit trail, XWIN-NMR		Version 3.5
$$ ##JCAMPDX= 5.01
$$ ##ORIGIN= Bruker BioSpin GmbH
$$ ##OWNER= she
$$ F:/spectra/data/she/nmr/H-F/1/audita.txt
$$ ##AUDIT TRAIL=  $$ (NUMBER, WHEN, WHO, WHERE, WHAT)
(   1,<2024-06-05 13:40:37.18 +0400>,<she>,<DPX200>,
      <created by zg, POWCHK disabled, PULCHK disabled
       configuration hash MD5:
       00 E9 B6 7A A2 85 ED C7 34 08 36 98 17 FE 4E 26
       data hash MD5: 16K
       FD E5 FC AF 4F 61 03 1D 27 68 A2 05 61 69 EC 32>)
$$ ##END=
$$ 
$$ hash MD5
$$ C2 19 4D EE 0A 75 FC 43 8D 95 67 EF 4F 71 5E FE
##$RELAX= 
##$RELAX= 
##$RELAX= 
##$RELAX= 
##$RELAX= 
##$RELAX= 
$$ Bruker specific parameters
$$ --------------------------
##$DU= <F:/spectra>
##$EXPNO= 1
##$NAME= <H-F>
##$PROCNO= 1
##$TYPE= <nmr>
##$USER= <she>
##$AMP= (0..31)
100 100 100 100 100 100 100 100 100 100 100 100 100 100 100 100 100 100 
100 100 100 100 100 100 100 100 100 100 100 100 100 100 
##$AQSEQ= 0
##$AQ_mod= 1
##$AUNM= <au_zg>
##$AUTOPOS= <>
##$BF1= 200.13
##$BF2= 200.13
##$BF3= 200.13
##$BF4= 200.13
##$BF5= 200.13
##$BF6= 200.13
##$BF7= 200.13
##$BF8= 200.13
##$BYTORDA= 1
##$CFDGTYP= 0
##$CFRGTYP= 5
##$CHEMSTR= <none>
##$CNST= (0..31)
1 1 145 1 1 1 1 1 1 1 1 1 1 1 1 1 1 1 1 1 1 1 1 1 1 1 1 1 1 1 1 1 
##$CPDPRG= <>
##$CPDPRG1= <>
##$CPDPRG2= <>
##$CPDPRG3= <>
##$CPDPRG4= <mlev>
##$CPDPRG5= <mlev>
##$CPDPRG6= <mlev>
##$CPDPRG7= <mlev>
##$CPDPRG8= <mlev>
##$CPDPRGB= <>
##$CPDPRGT= <>
##$D= (0..31)
0 1.2 0 0 0 0 0 0 0 0.06 0 0.03 0 0 0 0 0.0002 0 0 0 0 0 0 0 0 0 0 0 0 
0 0 0 
##$DATE= 1717580436
##$DBL= (0..7)
120 120 120 120 120 120 120 120 
##$DBP= (0..7)
150 150 150 150 150 150 150 150 
##$DBP07= 0
##$DBPNAM0= <>
##$DBPNAM1= <>
##$DBPNAM2= <>
##$DBPNAM3= <>
##$DBPNAM4= <>
##$DBPNAM5= <>
##$DBPNAM6= <>
##$DBPNAM7= <>
##$DBPOAL= (0..7)
0.5 0.5 0.5 0.5 0.5 0.5 0.5 0.5 
##$DBPOFFS= (0..7)
0 0 0 0 0 0 0 0 
##$DE= 6
##$DECBNUC= <off>
##$DECIM= 32
##$DECNUC= <off>
##$DECSTAT= 4
##$DIGMOD= 1
##$DIGTYP= 9
##$DL= (0..7)
0 120 120 120 120 120 120 120 
##$DP= (0..7)
150 150 150 150 150 150 150 150 
##$DP07= 0
##$DPNAME0= <>
##$DPNAME1= <>
##$DPNAME2= <>
##$DPNAME3= <>
##$DPNAME4= <>
##$DPNAME5= <>
##$DPNAME6= <>
##$DPNAME7= <>
##$DPOAL= (0..7)
0.5 0.5 0.5 0.5 0.5 0.5 0.5 0.5 
##$DPOFFS= (0..7)
0 0 0 0 0 0 0 0 
##$DQDMODE= 0
##$DR= 18
##$DS= 0
##$DSLIST= <SSSSSSSSSSSSSSS>
$$ [...]
##$SUBNAM2= <"">
##$SUBNAM3= <"">
##$SUBNAM4= <"">
##$SUBNAM5= <"">
##$SUBNAM6= <"">
##$SUBNAM7= <"">
##$SUBNAM8= <"">
##$SUBNAM9= <"">
##$SW= 18.0517689322627
##$SWIBOX= (0..15)
0 0 2 0 0 0 0 0 0 0 0 0 0 0 0 0 
##$SW_h= 3612.71676300578
##$TD= 16384
##$TD0= 1
##$TE= 0
##$TE2= 300
##$TE3= 300
##$TEG= 300
##$TL= (0..7)
0 120 120 120 120 120 120 120 
##$TP= (0..7)
150 150 150 150 150 150 150 150 
##$TP07= 0
##$TPNAME0= <>
##$TPNAME1= <>
##$TPNAME2= <>
##$TPNAME3= <>
##$TPNAME4= <>
##$TPNAME5= <>
##$TPNAME6= <>
##$TPNAME7= <>
##$TPOAL= (0..7)
0.5 0.5 0.5 0.5 0.5 0.5 0.5 0.5 
##$TPOFFS= (0..7)
0 0 0 0 0 0 0 0 
##$TUNHIN= 0
##$TUNHOUT= 0
##$TUNXOUT= 0
##$USERA1= <user>
##$USERA2= <user>
##$USERA3= <user>
##$USERA4= <user>
##$USERA5= <user>
##$V9= 5
##$VALIST= <valist>
##$VCLIST= <CCCCCCCCCCCCCCC>
##$VD= 0
##$VDLIST= <DDDDDDDDDDDDDDD>
##$VPLIST= <PPPPPPPPPPPPPPP>
##$VTLIST= <TTTTTTTTTTTTTTT>
##$WBST= 1024
##$WBSW= 4
##$XGAIN= (0..3)
0 0 0 0 
##$XL= 0
##$YL= 0
##$YMAX_a= 96963
##$YMIN_a= -151559
##$ZGOPTNS= <>
##$ZL1= 120
##$ZL2= 120
##$ZL3= 120
##$ZL4= 120
##$ABSF1= 10
##$ABSF2= 0
##$ABSG= 5
##$ABSL= 3
##$ALPHA= 0
##$AQORDER= 0
##$ASSFAC= 0
##$ASSFACI= 0
##$ASSFACX= 0
##$ASSWID= 0
##$AUNMP= <proc_1d>
##$AZFE= 0.1
##$AZFW= 0.1
##$BCFW= 1
##$BC_mod= 2
##$BYTORDP= 1
##$COROFFS= 0
##$CY= 11.3945322036743
##$DATMOD= 1
##$DC= 2
##$DFILT= <>
##$DTYPP= 0
##$F1P= 15.6554695791079
##$F2P= 12.8336369535428
##$FCOR= 0.5
##$FTSIZE= 0
##$FT_mod= 4
##$GAMMA= 1
##$GB= 0.15
##$INTBC= 1
##$INTSCL= 1
##$ISEN= 128
##$LB= 0.24
##$LEV0= 0
##$LPBIN= 0
##$MAXI= 10000
##$MC2= 0
##$MEAN= 0
##$ME_mod= 0
##$MI= 1.114404
##$NCOEF= 0
##$NC_proc= 0
##$NLEV= 6
##$NOISF1= 3.799351
##$NOISF2= 2.8
##$NSP= 1
##$NTH_PI= 0
##$NZP= 0
##$OFFSET= 15.70392
##$PC= 1
##$PHC0= -25318.26
##$PHC1= 17.78748
##$PH_mod= 1
##$PKNL= yes
##$PPARMOD= 0
##$PSCAL= 0
##$PSIGN= 0
##$REVERSE= no
##$SF= 200.130013532006
##$SI= 16384
##$SIGF1= 3
##$SIGF2= 2
##$SINO= 400
##$SIOLD= 16384
##$SREGLST= <1H.CDCl3>
##$SSB= 0
##$STSI= 0
##$STSR= 0
##$SW_p= 3612.71676300578
##$SYMM= 0
##$S_DEV= 0
##$TDeff= 0
##$TDoff= 0
##$TI= <>
##$TILT= no
##$TM1= 0
##$TM2= 0
##$TOPLEV= 0
##$USERP1= <user>
##$USERP2= <user>
##$USERP3= <user>
##$USERP4= <user>
##$USERP5= <user>
##$WDW= 1
##$XDIM= 8192
##$YMAX_p= 0
##$YMIN_p= 0
$$ End of Bruker specific parameters
$$ ---------------------------------
##NTUPLES= NMR FID
##VAR_NAME=  TIME,          FID/REAL,        FID/IMAG
##SYMBOL=    X,             R,               I
##VAR_TYPE=  INDEPENDENT,   DEPENDENT,       DEPENDENT
##VAR_FORM=  AFFN,          ASDF,            ASDF
##VAR_DIM=   8192,          8192,            8192
##UNITS=     SECONDS,       ARBITRARY UNITS, ARBITRARY UNITS
##FACTOR=    0.0002768,     1,               1
##FIRST=     0,             0,               0
##LAST=      2.2672688,     0,               0
##MIN=       0,             -151559,         0
##MAX=       2.2672688,     96963,           0
$$ Real data points
##PAGE= N=1
##DATA TABLE= (X++(R..R)), XYDATA
0 0 0 0 0 0 0 0 0 0 0 0 0 0 0 0 0 0 8 -8 8 -8 8 -8 15 -16 16 -21 24 -24 32 -33 40 -45 50 -56 63 -71 80 -89
38 -89 100 -110 121 -137 151 -166 182 -201 222 -245 270 -295 327 -360 396 -438 486 -541 603 -675
58 -675 761 -865 993 -1155 1367 -1656 2068 -2708 3805 -6018 12086 -60008 -151559 96895
72 96895 17354 -114084 71166 48245 -86330 46048 52821 -57457 19115 30736 -46378
83 -46378 19581 38722 -24973 2364 22182 -12867 -3410 13492 6290 -4542 3168 25961 -218
96 -218 -19959 23513 3072 -30930 31338 19311 -37065 21512 19499 -42654 11004 12140 -43920
109 -43920 20992 24195 -38906 27943 26225 -57191 12281 31712 -59467 -2817 40201 -42269
121 -42269 -9008 39164 -27294 -16321 24805 -17290 -9926 17559 -12682 -7895 9170 -10003
133 -10003 -4142 4338 -5096 2889 2241 149 7883 -7201 -5285 12360 -7402 -3366 20383 -4489
147 -4489 -4927 22716 -4509 -10240 16503 -5405 -7676 18709 -2037 -3217 18252 -6266 -3297
160 -3297 19882 -9729 -7734 20179 -8421 -10392 18573 -6743 -11456 16186 -3154 -8318 12961
173 12961 -5713 -10328 9582 -7286 -10639 8233 -4793 -7436 8907 -2939 -7631 2874 -6408
186 -6408 -6192 2175 -5391 -3915 3307 -4606 -2314 3200 -4629 -2917 2208 -2264 -866 882 -1154
201 -1154 267 -1746 -272 5169 -1956 -301 9415 -1197 -3413 8052 -1855 -5721 9467 2537
215 2537 -3264 10202 2969 -4408 8107 1093 -7122 6743 2269 -5360 8178 4982 -5472 4576
229 4576 3551 -6268 2221 2658 -4512 1823 2722 -4197 423 1068 -4461 -561 1734 -3470 -1758 778
245 778 -2591 -3850 -809 -1520 -4360 -1698 2257 -1933 -2838 2055 -2641 -5990 1327 -779 -5180 2667
261 2667 2373 -3718 2522 2756 -5101 269 2663 -4694 830 5240 -2178 997 5516 -1754 -849 4511
277 4511 -1024 -861 5291 912 -415 4352 438 -1665 3266 1213 -1217 3120 2682 -1725 1242 2430
293 2430 -2815 -758 2719 -794 -862 3407 153 -2592 1187 -911 -4514 190 715 -3114 737 2009
309 2009 -3640 -1289 983 -4219 -2517 1582 -2474 -1606 2460 -1821 -2607 1325 -1957 -2714 1577 -229
325 -229 -1676 1980 166 -2417 1071 367 -2250 1382 1896 -898 1302 2255 -1358 200 1843 -834
341 -834 241 3343 1141 245 2208 625 -1255 1463 1357 -808 1593 2339 -304 323 1971 -986
357 -986 -693 1662 -696 -505 1898 -152 -1018 683 -684 -1975 402 -139 -1388 786 -261 -2206
373 -2206 -286 -43 -2343 -524 207 -1785 -423 348 -1587 -1049 453 -1333 -1249 750 -296 -995 796
390 796 122 -1548 142 625 -968 133 1120 -338 -139 1295 -250 -415 1317 615 -502 1498 1085
407 1085 -490 1146 786 -724 1167 1350 -542 871 1406 -1023 240 1443 -561 207 1425 -427
423 -427 -278 867 -597 -795 891 -810 -706 687 21 -915 343 -325 -1425 7 -200 -1007 177
440 177 329 -859 -719 93 -720 -964 286 -313 -682 424 59 -1131 -37 256 -922 441 614 -549
458 -549 640 529 -702 -9 919 -265 -77 951 -35 -138 831 -263 -483 585 237 -50 1200 836
476 836 -202 936 -15 -15 180 177 -210 448 790 -218 50 31 -277 -332 243 -56 141 153 41 -462 -546 -261
498 -261 -521 -192 106 -532 -602 215 -491 -584 65 -302 -544 434 -147 -345 486 -387 -530 -111 29 -431 253
519 253 67 -199 405 238 -265 299 350 -199 16 214 67 7 438 -91 -391 353 327 -263 174 350 -67
540 -67 189 252 50 165 116 -38 78 149 152 -102 -74 -150 -370 -11 104 -72 47 390 -358 -201 369 -601 -94
563 -94 77 -105 -213 -225 -20 -242 81 -303 -234 7 -468 -261 242 -121 -38 232 281 -63 47 54 321 131 170
586 170 -58 -85 413 211 -27 282 54 -13 -43 132 -122 270 68 -137 197 134 -30 -228 359 73 111 45
608 45 -166 11 -138 180 -22 157 53 98 98 -72 51 -237 28 -66 50 9 -234 -206 -32 29 -179 -23 -195
631 -195 -110 -249 70 -378 -131 195 -344 54 266 74 198 185 -104 320 178 63 114 371 -67 -215 269
652 269 98 -139 122 191 -148 -153 97 18 266 45 66 -36 318 -15 -5 -60 118 58 -205 126 -9 -8 -99 -72
676 -72 -2 20 54 -448 95 -24 -2 104 208 -48 -226 -82 29 120 33 -161 127 -143 -259 53 92 -385 -185
699 -185 304 -52 52 93 247 122 198 99 169 113 38 328 116 220 119 104 183 -44 149 73 310 69 104 -77
723 -77 -122 150 -42 -68 56 52 32 30 180 -24 -186 -17 -135 -231 -12 -247 -39 -8 -571 -144 -192 -130 -130 251 -191
748 -191 -325 122 80 -222 209 142 -240 -100 184 -39 419 257 -130 -134 -75 254 237 490 79 -122 333 5
770 5 -122 145 -28 283 62 146 170 -46 13 12 -36 293 110 -159 359 -180 -210 209 -53 98 -69 -24 -139 -21
794 -21 122 -203 -260 11 -271 -218 188 27 -350 177 -160 -167 141 88 -275 -45 -243 -153 53 -144 -187 -69 -30
817 -30 -329 58 -55 40 281 83 67 -324 125 -98 71 228 146 -356 102 18 -143 289 135 227 101 -100
839 -100 -87 318 409 -211 328 333 4 206 299 38 -258 101 42 -210 -24 -153 -55 16 -232 -235 52 -192 -130 74
863 74 206 -287 -76 229 -185 -92 3 -50 -356 -85 139 -403 -72 -200 -135 -74 153 44 96 282 305 15 -164
886 -164 -154 36 240 151 322 332 94 138 272 -151 -24 -311 58 -269 86 207 223 65 179 -104 -207 187
908 187 48 122 -74 129 146 222 -29 89 255 17 -208 -82 -209 30 -188 9 -74 56 -208 -163 -62 16
930 16 152 -147 180 174 -186 124 -94 -170 -221 -299 -41 320 341 -33 -81 -109 -212 179 174 -30 -211 -259 -111 -375
954 -375 230 87 -132 59 -151 330 390 -84 24 20 105 131 -78 -34 144 42 79 147 74 256 -235 -165 -307 216
978 216 -105 37 -53 -464 -157 267 53 101 418 -25 -96 307 -23 -183 94 -258 -81 -25 -28 -180 -25 -420
1000 -420 -179 36 88 68 -124 17 -56 136 -54 -95 209 16 -119 165 36 -38 260 7 176 -25 11 -82
1022 -82 -3 146 245 -80 131 195 -39 -7 -56 167 69 186 152 -30 111 -24 -241 -97 -42 6 231 -208 -155 -9
1046 -9 -12 -129 240 182 -117 -176 205 -446 -27 127 -383 -110 -19 15 -104 -38 -194 39 182 -37 -233 -126 -140
1069 -140 10 -43 175 -8 -226 240 25 -187 -184 91 -40 -59 19 127 -284 6 -68 -32 246 52 -22 3 -13
1092 -13 -90 317 -39 -5 3 -62 110 -125 132 254 135 61 -224 303 169 -138 127 -18 -114 16 -24 -95 -53 -113
1116 -113 5 -54 -112 -236 -193 65 -122 -69 -320 91 -209 142 -85 -156 -129 -76 -58 -213 86 -340 -311 161 67
1139 67 -77 178 58 156 207 196 -83 277 -69 -15 -39 -2 -282 16 -52 -242 82 151 -338 69 188 -239 212
1162 212 99 4 -53 -140 286 -64 95 -43 -157 -143 -90 -33 -108 -123 1 -3 35 -11 0 -17 -69 93 73 116 -42 133
1188 133 -198 -26 -147 126 -48 -254 170 94 143 356 -270 -151 10 -263 362 79 -4 233 94 7 -233
1209 -233 253 10 -19 70 103 -8 199 -74 -13 130 96 -129 168 -252 16 213 128 -155 96 -4 19 -25 6
1232 6 303 6 -2 58 -186 3 -20 -99 -108 -121 -164 67 33 -15 102 95 -132 34 -2 45 -1 -71 -182 -43 169 29
1258 29 -241 130 -22 -281 -164 -183 -28 44 14 4 -124 83 43 89 -128 136 269 40 20 159 -78 101 35
1281 35 -221 -38 -197 255 0 -81 74 -171 16 -3 36 -205 101 -141 -114 30 -65 146 216 -305 -58 20 -221
1304 -221 -35 54 -96 160 -19 -13 143 -13 -86 95 141 178 74 31 85 -191 -86 152 294 279 -149 44 101
1327 101 152 126 -164 214 -203 41 52 -146 -117 -97 104 -232 14 120 326 0 -324 -195 -185 20 -174 280
1349 280 95 12 80 65 -67 -136 278 59 150 188 -77 166 -242 -148 -106 -275 -287 39 -68 -230 40 142 155
1372 155 -22 123 5 -9 -61 217 51 252 26 -272 -127 32 20 -97 105 295 144 -28 107 139 90 61
1394 61 -339 -65 94 -188 84 84 22 -86 -68 -219 -64 -35 54 123 -57 24 -22 87 -98 -60 167 44 73 -51
1418 -51 154 -92 92 309 102 -332 142 -378 104 -279 -87 5 -309 443 -107 -50 417 -41 6 122 -378
1439 -378 -15 -46 -321 148 88 -243 -147 70 -297 50 -27 -107 -29 250 45 -50 -152 8 -85 102 154 -69 94
1462 94 -91 0 -199 -122 -108 -6 135 105 -150 99 -105 -61 136 83 40 -97 217 396 66 395 36 120 57
1485 57 -147 -151 372 85 -93 98 -92 -305 330 -17 -177 170 57 167 -44 141 -90 30 159 -274 -219
1506 -219 -8 -185 131 141 -122 97 -169 -328 -311 45 -1 9 -72 -76 -51 -185 23 79 -86 174 -72 36 -83
1529 -83 153 220 -112 356 93 -73 139 -67 -48 -108 -107 164 -94 -16 158 -230 158 188 -187 -138 12 -16 65 110
1553 110 247 -119 -89 81 163 37 38 154 117 56 108 -3 -115 12 -67 -97 -67 -49 122 -311 -94 21 -82 156
1577 156 68 28 32 117 77 210 -257 -128 -130 -50 63 119 -61 -94 -11 56 158 72 89 -130 138 -136 106 -206 -251
1602 -251 77 -78 144 134 -111 230 84 -258 -107 61 -114 -128 -247 200 -114 -146 -10 -43 2 -47 -120 2
1624 2 -15 19 40 -213 -60 42 -133 184 213 70 -286 -63 -12 212 132 -178 -42 -50 -108 -115 -85 -55 -116 17 307
1649 307 143 -61 -198 -135 -63 -133 117 56 60 -29 -5 227 25 272 0 -105 -41 -58 164 -45 -84 116 134 -17
1673 -17 120 -144 -11 138 82 74 174 -48 -20 -36 135 -87 57 176 27 -189 213 139 88 197 -25 309 17
1696 17 -13 92 -124 59 1 286 33 -87 -195 9 -75 33 -76 98 166 31 134 -165 -26 -244 133 74
1718 74 -226 16 209 -149 -212 -88 4 -90 -106 69 61 95 -51 29 -25 82 -28 -35 -352 -55 -174 183 181 -147 -178
1743 -178 140 -54 -33 -66 160 -339 -193 -188 24 -15 -238 -124 23 -221 -48 184 -295 -58 127 -77 -103 120
1765 120 -8 9 -81 30 153 165 129 157 148 -229 -74 -211 65 34 -39 -90 -204 -58 69 277 -113 117 122 106
1789 106 -147 82 -175 -62 67 -185 -216 -1 -93 243 -108 -183 -201 -188 -163 -109 -144 -43 -91 -230 49 75 92 25
1813 25 33 -163 114 -55 -30 -68 -182 44 -242 240 245 -32 -134 56 -139 -222 52 154 -194 -104 54 93 75 -164
1837 -164 -102 -159 -69 -122 147 102 -10 27 169 189 46 -131 38 49 -166 76 -175 76 -302 61 29 -24 55 -220
1861 -220 -89 155 81 -203 301 -145 -41 35 -69 -16 244 219 -223 -6 69 -151 -281 -46 481 -119 -160 63
1883 63 -120 -159 -98 -103 -38 40 90 -152 -178 56 32 -1 302 146 -61 25 15 183 38 -83 -131 7 -123 -41 -324
1908 -324 -243 -190 55 114 23 -100 -117 64 66 -41 97 76 30 48 -25 59 247 76 -160 53 -184 -62 -114 -57 -80
1933 -80 -90 119 151 -176 12 21 -50 44 -84 -185 -133 -138 79 105 10 188 -84 -91 149 -15 -165 69 107 -104 -186
1958 -186 -139 -61 115 113 -58 -79 -75 -124 7 -62 21 93 211 -67 83 -93 -217 313 181 61 -16 310 -254 -134
1982 -134 -9 -97 -40 -315 -70 146 -48 152 -135 -32 -189 -250 -175 185 -225 354 -28 30 -150 -7 -112 20
2004 20 -83 -6 377 -113 -9 -138 138 313 27 -18 47 -88 -85 102 121 100 51 -8 21 -64 22 75 104 220 -61
2029 -61 -155 247 107 102 307 102 16 -78 -102 210 19 61 124 125 0 -151 -94 66 -62 -157 61 -120 -2 -32 212
2054 212 -16 313 -112 218 -13 242 -146 139 336 313 -60 -274 47 241 -74 17 -52 -97 262 -254 22
2075 22 103 73 -99 158 215 88 -278 -95 -39 99 -103 -30 22 149 156 54 -5 90 72 -245 -5 -271 -50 65
2099 65 195 84 1 -72 -39 -202 -50 -33 -1 -226 1 -360 222 258 170 138 -188 -23 31 -59 -55 76 192 156 70
2124 70 -289 -103 97 -130 177 -270 68 23 -123 -14 264 -47 -23 -200 -57 -63 -14 -13 148 -272 -41 34 183
2147 183 120 -24 80 -46 -30 143 207 123 -16 -288 -55 43 -126 -51 135 158 -73 -213 -155 192 -82 59 194
2170 194 -96 -97 -47 184 -79 26 -75 -9 -48 -90 25 232 50 -136 28 180 85 -19 -287 -47 -243 -46
2192 -46 -142 4 -24 -5 -70 180 -313 200 38 103 275 -235 98 103 -49 -135 -54 -117 27 -16 90 -189 246 14
2216 14 210 372 22 61 60 72 -68 54 -213 59 -103 -167 6 -36 -95 -118 213 49 94 -178 -249 -77 -80 -90 -5
2241 -5 -94 65 -90 12 -112 -161 95 -4 -132 22 -159 -127 74 -74 221 6 48 108 25 155 -54 -178 30
2264 30 -98 29 149 68 220 -182 103 390 -100 -163 71 240 -127 -167 108 160 120 45 32 102 -148 -86 247
2287 247 -31 66 182 -370 -159 237 176 -10 154 1 -85 -130 44 -82 -86 -107 3 -47 -91 293 109 -114 259
2310 259 80 115 80 -117 -282 -145 -99 7 42 -223 -298 -95 -68 -193 134 81 130 -248 -102 -44 102 -254 46
2333 46 217 -131 67 56 259 84 -76 -24 -124 -4 115 -99 -117 -22 -47 5 -285 -91 -17 -230 -59 -67 -216
2356 -216 162 146 34 -76 339 -219 29 -62 -132 24 -213 166 -42 43 -78 152 85 -64 -77 100 144 -50
2378 -50 -250 -237 -3 150 -79 -209 -146 38 -108 -34 97 4 32 249 19 42 193 99 -158 85 -36 -50 -142
2401 -142 -136 2 30 280 -426 -121 -89 -67 23 -138 -159 10 -9 -3 135 57 -27 87 -258 179 -218 -16 81 95 56
2426 56 -41 34 -28 25 149 85 -14 -91 -21 8 -190 215 165 -81 272 -33 90 -28 -30 200 -62 -111 -71 182 113
2451 113 42 -179 105 -416 112 296 95 -240 73 43 -184 132 -260 92 -26 -45 21 -196 64 155 110 17
2473 17 150 128 -46 110 9 85 210 -11 -206 74 -84 136 -136 113 232 181 22 -132 -134 -14 59 -99
2495 -99 -117 -235 -130 -104 -73 -356 -46 295 -59 -122 -40 -205 107 -82 50 -347 -3 103 -78 -269 19 64
2517 64 133 244 102 -123 -116 70 -33 43 86 6 260 55 149 -96 11 128 -157 -128 -4 -11 -225 125 253 -125
2541 -125 74 70 28 -361 92 184 91 -154 1 -141 135 215 -122 29 28 85 -116 13 60 -4 -54 -97 -146 211 176
2566 176 119 -184 -132 51 -6 -116 -116 -167 -360 -83 172 41 -29 41 17 54 164 -7 -66 187 -21 -80 -19 -146
2590 -146 47 219 273 288 -331 326 90 -52 -138 97 50 -218 -44 197 -323 -10 112 -154 -85 -199 -241 140
2612 140 -303 14 -130 -220 -60 186 104 -60 -75 -19 -238 -123 32 64 -38 -11 43 3 -89 -23 293 73 133 129
2636 129 -29 43 -265 33 -5 -18 56 80 -46 -219 -68 140 6 94 -97 -46 121 -67 168 183 85 -181 56
2659 56 -13 -55 -463 279 -112 52 -153 10 139 -94 -89 -24 107 -52 -43 -58 -36 163 -91 123 -29 74 -168
2682 -168 -78 217 -203 39 173 310 -77 159 -40 165 -5 129 154 -273 -58 -3 -88 75 -161 128 7
2703 7 21 -53 51 106 -160 -116 84 -161 331 -185 -12 -62 -166 -110 -28 -15 -104 -365 -3 55 174 -49 30 221
2727 221 -242 -109 -165 160 -137 21 131 326 -259 -102 6 -117 -97 71 19 41 71 -153 -139 128 6 221
2749 221 -76 -12 -534 -5 -9 -217 1 76 189 -190 165 -344 -60 -208 0 -177 -57 -276 -56 -190 -103 32
2771 32 -158 166 -132 -100 96 60 -251 6 -17 -189 -8 139 -290 -99 -62 -276 50 331 -169 -152 -18 181
2793 181 217 77 122 190 -120 -111 -121 189 -75 -73 46 61 -23 134 -44 195 44 88 -84 -29 206 -79 -111 40
2817 40 329 36 34 -141 28 -42 -39 10 -15 67 -109 116 53 76 -167 12 -3 -158 253 100 -1 36 -236 259
2841 259 -108 -23 -113 109 43 -59 -48 172 -33 -92 -50 -51 -90 -165 261 65 -85 -58 -100 -280 -24 -126 72 60
2865 60 109 14 -14 60 -87 -53 -83 20 -21 185 126 -46 -18 188 49 80 -84 -161 20 186 -362 -68 295 -113
2889 -113 215 -110 147 275 -134 8 176 -4 -7 279 159 -65 49 -152 -193 -397 18 59 166 -272 17
2910 17 58 -113 166 224 -19 78 -126 -54 -150 -146 14 89 -29 38 -90 213 -114 -130 -53 -170 -169 94 77 222 152
2935 152 -57 -333 -117 -126 -175 -336 -90 65 -241 52 222 -286 28 -70 46 62 99 -122 277 -61 129 185
2957 185 61 209 86 -299 -120 -162 381 64 -2 -242 68 -215 -28 93 237 235 -76 104 -113 274 -120
2978 -120 -104 -143 -129 -334 -21 124 56 93 -47 -77 -64 58 -70 -89 162 -148 -96 -174 120 153 -193 113 -139 63
3002 63 90 223 143 -9 26 -53 -152 -142 -105 -54 -88 -94 10 11 77 -186 -79 -152 73 21 -1 -48 55 -48 108 -71
3028 -71 139 -117 -40 -346 -138 90 -49 -64 -97 -120 -192 -70 143 -57 123 212 59 -148 53 -140 -148 -65 60
3051 60 -209 68 -4 -179 -403 83 1 119 0 -55 24 -121 289 93 -1 -185 90 81 -99 67 125 92 146 -375
3075 -375 36 -10 -108 -9 -72 67 152 -56 16 -8 -14 -131 -402 165 9 -79 -240 -42 -373 -40 104 -145 -25
3098 -25 -12 -268 -9 -7 -143 -159 -247 -8 -20 -187 -101 -24 39 98 -179 202 61 54 171 -14 105 -201 -21 -122
3122 -122 35 103 -47 14 -162 70 200 -254 -216 -3 85 -7 -47 -326 35 -29 -60 116 42 -186 -163 71 -66
3145 -66 -116 -48 105 15 57 -27 33 58 -321 -133 -37 77 216 -287 -129 95 -254 -34 -1 -447 -120 -18 -14 -496
3169 -496 -62 -115 -44 -100 -1 4 -231 -7 -184 -114 -71 35 83 -115 -185 40 -160 -24 -146 110 -50 -151 -147 93
3193 93 1 34 -161 202 493 -46 25 -62 -101 -11 59 -187 -65 95 -39 101 -19 -7 170 -32 -7 57 -5 113
3217 113 -9 157 119 -16 181 -180 221 69 -47 -12 195 269 68 163 64 -362 -73 279 -4 -217 58 163
3239 163 -24 218 73 266 -69 106 -44 -75 102 210 76 110 120 154 -118 34 42 -102 -220 -134 89 281
3261 281 -136 90 -85 53 -145 -12 79 -12 -146 -86 111 60 -4 61 92 -291 114 -91 182 -95 206 127 -152
3284 -152 -91 -32 -120 -192 259 103 349 -58 4 219 254 119 -111 -212 -65 186 -165 -39 -106 -58 112 62 -71
3307 -71 -89 64 143 167 208 122 68 -108 81 -83 184 66 -102 -269 8 -261 57 176 226 33 -118 323 230
3330 230 -43 48 -133 -64 170 -16 1 -71 -190 -195 269 43 -92 -208 100 44 -16 -3 -21 27 -39 64 -74 59
3354 59 -157 -93 -33 98 -11 -113 252 -40 -94 -274 -45 -204 95 131 -57 184 185 338 -92 283 169 -160
3376 -160 73 -254 136 279 -168 -217 -70 142 -14 -245 -249 103 -24 -54 154 158 418 127 65 293 165 -16
3398 -16 54 -97 -75 102 -114 -62 -2 125 65 -29 -50 -142 72 -146 -39 -19 201 -49 -200 -1 79 54 -94 159
3422 159 -132 -32 96 164 110 -120 -91 -197 132 218 -7 -67 -119 82 -62 -170 -253 170 156 -401 -100 70 140
3445 140 40 -95 81 -13 162 -38 -21 165 -252 -94 165 -3 -57 -128 126 -177 21 93 -24 -31 16 -12 115
3468 115 -81 229 -6 9 -190 36 -196 -141 48 304 227 -171 -72 63 194 180 95 -122 -166 85 12 223 -178
3491 -178 -68 -126 -21 161 68 -126 -380 -225 -38 93 144 133 -110 -138 20 -191 -226 -24 12 83 137 97 -66
3514 -66 83 -53 73 42 128 -40 -35 -132 132 118 -51 -76 -32 101 -26 230 36 -1 -27 -161 -18 -198 125 -2
3538 -2 112 -171 151 -57 70 152 154 -265 10 -149 -88 80 143 -166 -162 -35 -98 390 136 -114 174 79 170 125
3562 125 -103 -23 40 -18 -278 -178 74 165 -152 -140 -329 -118 -342 -177 -109 28 -232 96 -28 -19 63 198 140
3585 140 139 398 55 -87 -355 227 83 41 -9 -72 -142 -64 -284 -92 155 67 88 379 -43 -47 29 177 16 -100
3609 -100 -97 86 103 -23 133 -15 40 -183 328 24 -88 173 -186 -60 52 41 70 41 -49 -235 -188 213 95
3632 95 -80 462 -56 -7 147 113 -20 -194 21 -52 40 -119 -173 65 212 -265 -145 112 160 54 79 8 -43
3655 -43 -11 -93 -158 -62 355 -210 -91 163 92 132 -194 -90 -42 -199 -383 89 17 -193 20 30 -145 94 154 -81
3679 -81 38 10 -260 37 58 29 -74 218 266 33 -117 -59 -158 -228 274 -11 57 142 77 -19 67 113 356 251 265
3704 265 185 -5 -346 82 163 29 103 -70 -61 -281 -48 96 -61 58 217 -104 -32 -180 77 -140 212 -2
3726 -2 72 -121 -14 -6 281 -104 -62 -105 -145 -163 -133 -199 -8 285 -77 -30 50 -69 149 37 -165 -219 57 27 74
3751 74 -327 -171 -269 3 100 10 -44 -9 -69 -144 153 158 -51 -129 -42 -77 26 265 -145 22 18 -83 -96 115 188 240
3777 240 127 -271 150 30 110 31 134 328 89 -15 -11 400 93 269 -112 64 -23 -53 246 30 -26 -240
3799 -240 -14 118 -297 -100 -73 69 -178 9 -112 19 -16 -100 -91 139 -54 -49 74 77 -21 59 -93 -91 16 -54 -92
3824 -92 -279 195 -121 -10 85 35 -77 191 -33 219 -91 16 -44 -152 -277 -144 114 -50 -9 -258 89 -34
3846 -34 -57 -187 -209 45 131 64 53 135 193 -192 -60 89 256 161 147 -36 87 23 -123 -34 184 173 -104 52
3870 52 -205 208 -175 -164 58 -50 20 -389 -89 -114 82 110 143 -57 -317 75 129 -149 -132 22 1 4 154 95
3894 95 215 166 -10 31 108 110 213 -29 -167 71 -89 157 112 6 56 -239 -262 41 -127 -150 124 -133 -41 192
3918 192 -22 -152 -59 -6 166 -58 -109 -45 224 6 -158 -360 -117 150 128 -30 -60 184 57 200 183 -100
3940 -100 200 -158 55 269 81 -59 187 -155 47 219 -11 -140 100 313 63 -55 -102 36 -102 67
3960 67 -154 101 -17 156 -35 -185 277 60 28 -141 -64 307 -14 46 -58 316 231 48 -283 85 88 -349
3982 -349 -135 156 18 128 114 -36 -70 -1 -104 181 270 158 -178 80 22 -197 83 29 62 -57 -6 -35 70
4005 70 139 -183 -11 116 60 150 35 99 -204 91 113 -90 92 157 82 85 -73 -157 272 -307 47 129 175 -199
4029 -199 115 -125 178 414 -88 100 -73 81 -80 -222 -159 -72 -69 84 -60 3 140 143 -216 -119 258 -144 133
4052 133 -261 -44 76 213 103 260 107 -70 -170 68 -96 56 102 74 -165 389 -21 58 -124 -17 -64
4073 -64 -137 -29 -119 -230 -67 -68 79 183 143 62 -245 -103 -45 132 44 -225 214 -92 72 -113 -39 -463 103
4096 103 9 -64 -163 -103 -98 11 85 5 -42 -153 125 105 -47 -67 -513 150 -108 -103 106 -159 31 62 -88 -81 -78 52
4122 52 -22 -185 -225 63 -160 -36 170 -117 264 -23 -62 52 4 -47 91 -102 58 71 35 112 -192 33 35 -141
4146 -141 295 -13 -20 21 56 -110 283 8 114 -66 150 96 -18 -349 49 118 35 82 140 19 -129 10 -168
4169 -168 -405 -135 137 226 -41 -145 93 -238 -110 -342 -154 26 60 -81 20 303 34 -304 0 221 174
4190 174 -263 -259 73 -210 183 27 5 19 -151 2 -44 134 86 -380 184 163 -51 -375 -95 48 309 133
4212 133 -264 97 -172 316 17 52 -174 196 156 -151 -222 -236 67 352 -181 2 -102 -65 -272 -279 -2 -54 -111
4235 -111 -154 -34 40 142 -164 77 -63 69 26 -33 38 -68 215 167 105 -47 179 -80 -245 100 7 -73 -38
4258 -38 -215 -119 176 96 -27 3 135 -72 99 -108 -105 121 59 76 82 -112 425 104 175 -104 37 -52 -231 93
4282 93 -111 249 -85 281 -112 6 16 59 12 -39 214 -141 -129 -150 -55 -115 127 -130 -177 27 121 17 -19 -115
4306 -115 76 -179 -59 -10 145 -119 230 -99 10 105 17 -8 -88 30 -113 156 77 -66 7 135 27 160
4328 160 -284 -19 -111 -225 130 77 -206 -80 106 132 -72 -31 9 188 81 112 88 127 89 95 -64 0 -116 9
4352 9 -285 -23 -155 51 225 -121 -161 -111 -41 -58 102 20 100 52 196 -226 -96 -238 76 170 12 64 193 175
4376 175 117 191 -160 -29 120 150 -39 -286 -171 -75 -15 -111 -53 12 41 -177 -77 211 -154 -206 25 150 66 -171
4400 -171 -111 -8 -61 -61 41 22 165 -47 212 -63 -112 -36 198 9 -199 24 64 57 -217 228 335 -204 178
4423 178 119 93 84 -202 264 -56 -180 160 -199 115 27 -142 -44 -9 61 122 -130 -36 -73 450 -279 7 16 28 145
4448 145 -68 105 54 125 80 -39 -139 -31 84 -266 13 -200 217 11 -150 110 -132 -89 242 75 -83
4469 -83 35 2 101 -50 -103 -199 213 4 31 36 -17 72 -173 189 105 100 114 -93 30 3 35 372 -26 -104 -222 -47
4495 -47 -246 92 56 -154 88 182 -40 231 118 113 74 69 -192 115 1 -99 193 -164 104 39 -4 -278 154
4518 154 122 -56 4 250 -216 -52 -199 98 -21 119 -128 -193 158 37 106 -220 -412 -35 -9 84 45 61 -126
4541 -126 65 -230 65 83 222 -79 102 14 -56 -48 13 278 -146 28 133 178 -103 247 -135 -127 124 122 -61 -203
4565 -203 -226 -133 -102 73 -166 15 -125 94 -260 34 -13 -123 111 89 -254 -148 46 129 -2 213 216 -243 -176
4588 -176 125 70 -17 -54 -82 148 192 -160 161 217 -109 125 -96 29 42 -165 -169 -193 -121 -101 -46 -32 -228 -102 -71
4613 -71 -4 -131 -16 197 26 308 -163 13 144 -137 2 39 -92 -131 127 135 -21 -162 78 116 53 -5 -158
4636 -158 188 111 -183 -154 -308 234 205 -163 -13 39 -77 -122 -1 78 16 -346 57 -66 -56 -11 -101 -36 272 89
4660 89 -218 -178 49 -31 -3 113 -42 -204 -91 4 33 321 -62 -24 25 327 119 -21 336 -335 156 -47 -212
4683 -212 -42 41 3 -108 249 -130 188 -11 -9 74 -17 -318 45 -175 -27 264 130 -78 -234 98 -41 -143
4705 -143 220 -83 8 122 57 -124 -170 -197 29 -233 -58 -2 -167 -145 194 9 96 -114 -18 -108 -82 -338 233
4728 233 -131 -24 -53 2 7 -90 260 -38 -46 -173 167 73 234 86 -4 -127 152 45 -125 290 123 208 -90
4751 -90 -38 192 -32 11 -37 165 -29 -119 68 -65 70 66 -59 -19 -68 178 -91 -119 9 59 212 22 52 -198
4775 -198 -6 178 -53 -134 -229 99 71 297 0 13 56 -149 114 -18 -33 -59 -54 132 -136 -124 18 249 12
4798 12 9 -11 -115 -10 33 11 156 90 -109 -182 116 65 -193 -141 266 153 153 287 189 258 22 52 -128 -19 108
4823 108 -195 47 -42 120 127 227 79 -84 -81 266 -212 -35 284 -355 74 -187 -3 141 -56 151 11 -170
4845 -170 5 99 -160 -83 76 105 78 36 290 318 200 -85 -135 -53 -201 0 -121 42 -9 253 -137 123 -36
4868 -36 72 40 -158 7 196 -67 160 0 -156 234 -75 -95 98 47 -48 -359 -102 -161 170 -170 46 45 -314
4891 -314 -43 -54 48 48 -64 81 -73 -169 69 -31 -94 88 -6 350 -63 -64 280 -215 -199 -84 -145 52 -80
4914 -80 90 -307 126 -135 -78 116 35 388 -233 258 30 141 111 4 65 -84 1 173 -60 -25 345 236
4936 236 -143 44 6 -175 -13 35 -38 62 -133 12 83 -123 242 -73 85 41 101 -89 -62 115 18 -72 163
4959 163 -20 175 -242 -143 102 -62 5 -125 130 -59 72 -73 -62 -275 139 -273 65 -270 7 49 186
4980 186 46 -89 -104 33 -114 -228 -5 -126 -132 -163 -85 245 177 96 10 17 -25 67 207 101 -151 -39 133 71
5004 71 112 146 -204 43 -294 145 75 24 35 12 -18 -126 -45 25 6 152 22 164 356 95 -10 -134 200 -62
5028 -62 -125 -87 247 112 -93 60 114 -278 261 91 15 32 -6 -197 -304 -40 181 162 109 -252 76 57 -256
5051 -256 -32 60 -181 -18 -37 52 -137 -39 -56 300 -8 246 -149 98 -27 19 184 -53 -148 -23 -58 67 -40
5074 -40 -144 -63 182 170 148 172 -134 -78 -92 196 -75 154 -49 102 74 9 -207 -45 -32 -37 233 -12 237 393
5098 393 -21 -3 -165 -103 -70 -52 -328 -139 -25 102 212 114 -63 -80 111 140 -428 -56 34 5 64 142 -297 6
5122 6 -157 -122 -211 302 78 -31 92 -227 128 69 257 19 74 -192 194 -209 37 143 225 -181 -56 158
5144 158 -270 153 32 52 -90 70 22 76 96 -221 33 -232 -69 -47 -93 -40 -175 -75 -350 46 235 -25
5166 -25 100 154 -229 -64 -137 49 -49 -94 97 64 246 146 -62 -9 57 173 -52 249 8 30 174 -146 32
5189 32 162 13 -146 9 -201 58 64 -135 -241 89 -33 -27 -3 91 28 9 1 -164 -4 -265 124 52 -47 -117 45
5214 45 -18 -153 -125 112 16 -325 -64 35 32 -21 8 24 119 -51 -60 124 -63 -58 -63 -134 -100 31 -129 142 96 296 360
5241 360 -107 -83 -34 126 -223 -4 21 74 288 -8 122 -84 -1 -111 -325 59 11 -125 -169 -54 -20 152 10
5264 10 -171 -237 9 -128 196 54 90 -19 164 171 53 -165 348 184 165 -48 -50 -55 -44 -278 -83 -101 234 -91
5288 -91 -34 128 -78 85 54 -19 80 13 -138 240 -156 -11 -189 -31 116 169 157 -122 -105 99 138 -47 277
5311 277 -26 -395 -139 -148 -120 293 115 173 -108 39 247 -271 17 103 -277 -89 99 -137 -184 -8 160 -166
5333 -166 111 58 140 -90 277 -53 111 164 174 -9 53 263 226 -107 49 -34 52 -54 120 81 -145 94 -325
5356 -325 34 164 49 -50 -126 -39 -52 212 -19 118 144 -135 -26 62 229 -215 -24 197 -49 -6 -65 318 -24
5379 -24 -208 120 -36 -93 122 -15 -60 129 -42 -117 152 54 195 -162 -200 -425 -53 66 17 -159 71 13 172
5402 172 121 75 -15 27 93 30 64 21 -71 4 61 153 -256 100 63 181 154 114 -62 22 -130 -138 4 102 -69 -57 -85
5429 -85 -58 207 31 119 72 -130 -147 200 -296 78 -61 -21 82 -61 -200 150 -33 -176 189 -43 159 -158
5451 -158 34 208 74 -401 185 -229 -37 121 -17 -43 168 -60 -191 194 102 60 45 -31 140 65 -300 16
5473 16 -6 177 61 191 175 -30 -96 -120 199 -228 -133 368 -155 168 -9 -85 -1 46 23 -8 75 159 146 -44 35
5498 35 56 -135 91 -40 16 133 92 -215 341 411 -119 -246 69 274 -3 25 134 -17 70 -141 -152 -291 201
5521 201 -79 -90 109 30 218 24 65 -351 -80 1 -37 70 164 -196 -84 33 -46 21 243 -144 -103 -171 -139 50
5545 50 128 101 80 -74 298 104 159 70 -115 -103 -232 285 60 96 -97 36 -40 101 -17 -57 54 122 -140 -142
5569 -142 227 190 -163 -142 -219 -293 19 129 -4 -63 161 -227 -156 7 -87 5 -110 -124 -91 -243 -99 -40 90 192
5593 192 -2 -21 148 47 20 -256 -22 52 393 -44 261 133 -118 -304 -155 -88 -133 29 87 -359 60 -135
5615 -135 102 -136 63 -87 -151 150 -142 141 28 -14 -55 -120 19 48 150 13 -93 111 79 98 -174 -146 59
5638 59 -231 92 -80 -244 -78 -36 233 -14 76 -39 59 116 -47 -15 105 -208 -276 93 280 -65 -135 60 172
5661 172 -109 147 128 -400 209 201 98 65 -51 45 -77 23 97 -196 -226 57 161 -64 88 68 23 328 29
5684 29 -29 -309 -206 -24 153 28 174 -335 -41 101 128 -196 271 -29 23 -96 69 -209 62 54 198 -23
5706 -23 -217 51 -242 -50 -131 279 -189 227 41 66 -209 18 -92 2 40 -26 -25 3 124 12 -217 36 -158
5729 -158 177 169 -160 61 285 -120 -94 83 96 182 -66 335 -179 217 -63 -36 85 -254 53 -71 -88 152
5751 152 1 182 58 0 3 -5 -40 -1 -47 269 -109 119 123 -37 -118 -1 164 -36 80 -153 -46 -51 -149 37 -301
5776 -301 -191 -61 170 -7 -253 -133 -269 319 9 40 3 203 24 56 57 52 104 -63 -37 253 158 -11 142
5799 142 3 129 107 110 202 -286 -50 131 -51 -93 -39 -20 75 -313 130 238 37 -145 254 16 -155 55 51
5822 51 -18 140 62 -37 72 -108 237 -2 -133 -97 146 -188 -50 -96 -80 -109 -8 -75 140 200 -109 307 18
5845 18 48 -224 9 -88 230 98 321 -207 173 -65 216 -111 85 158 54 128 30 -181 50 -22 -22 -108 -74 9
5869 9 174 -73 85 117 -194 58 -188 -235 -32 64 -185 -284 -301 28 24 -220 184 -5 20 -17 -11 -185 -4 8 -53
5894 -53 85 -38 -23 119 -257 121 129 -90 200 71 255 232 46 -186 85 -129 168 -138 -285 -137 149 -287
5916 -287 -100 -103 -251 -7 164 201 -207 176 -319 98 16 35 239 -7 -63 116 26 119 224 47 239 -267 -43
5939 -43 233 99 96 -262 204 89 206 -115 115 26 59 157 94 103 153 -126 -186 183 -89 -34 59 -218 30 -46 -188
5964 -188 -257 -2 -72 -401 -67 227 29 70 99 -117 129 60 -127 27 209 36 124 127 -152 -485 -25 63 40
5987 40 45 143 127 205 -125 -49 -58 -233 -11 197 15 56 -428 -137 -199 -125 -178 60 -20 91 77 75 -46 -105 -39 56 -173
6014 -173 4 -58 -33 158 21 277 8 6 -379 17 174 184 -69 49 -50 -111 -305 -170 -128 -55 22 240 -34
6037 -34 -50 235 -22 158 29 215 165 -21 203 77 30 -65 69 -33 173 61 101 126 85 -51 83 32 118
6060 118 49 87 -51 144 64 -89 222 166 21 74 70 -103 35 -85 230 60 167 111 -329 -40 -9 47 356
6083 356 -155 -131 -14 110 202 18 -150 176 110 -88 222 94 -139 -44 227 155 -6 -73 -71 14 7 253 -279 -161
6107 -161 -136 178 158 129 335 -348 34 -136 194 -169 69 132 64 -38 -153 192 -234 -39 -41 157 -36 -196
6129 -196 -10 28 151 -78 -22 95 6 -166 200 117 -128 -241 -92 25 -12 -96 53 97 91 71 -7 66 -73 20
6153 20 -115 15 -3 49 109 20 -96 -117 -140 329 11 -69 175 -183 310 -105 170 69 62 -175 -17 58 57 -13 111
6178 111 199 -15 -74 119 197 -126 -126 110 -106 -23 41 -179 -58 -311 -138 -57 -169 381 90 -63 140 130 540
6201 540 -172 37 -203 -54 372 -161 179 -206 100 305 146 95 -374 -210 118 -52 32 8 -51 -74 231 -46
6223 -46 -167 -32 -81 -275 114 -161 138 93 -265 -311 -181 -63 -28 134 70 -32 192 -109 -266 214 85 73
6245 73 -62 -48 132 128 32 -145 24 73 -26 -119 252 -111 165 -59 -129 -7 -170 -19 -4 299 143 44 24 -44
6269 -44 -37 158 404 -112 -40 322 -309 -17 210 -164 154 -299 180 162 -8 175 -46 98 -100 -41 -144 -167
6291 -167 -155 -201 -103 -63 -84 -105 -86 41 209 197 -52 290 -177 -24 -85 -42 -40 176 88 -99 84 256 23 -133
6315 -133 56 225 -42 38 97 229 134 -110 -19 66 -231 298 300 -124 185 -182 -11 136 59 -17 43 71 -32 -124
6339 -124 -27 -51 226 157 61 199 44 4 17 -87 76 232 38 -43 -130 70 61 32 -151 4 -252 -289 80 -43
6363 -43 116 -135 162 38 1 207 -227 269 -308 -25 -133 407 41 161 27 -149 192 -203 72 -6 72
6384 72 243 -223 29 94 149 -65 -85 196 -13 -154 45 96 139 -6 -184 151 -44 -96 206 -64 101 -63
6406 -63 -5 -33 -144 -222 71 64 92 -4 -190 147 176 106 -35 -35 -179 54 62 119 50 -99 70 -106 -30 399 -108 -19
6432 -19 -239 -84 -187 139 -8 -195 26 -4 -75 531 128 130 -49 138 -20 219 32 111 -60 63 174 -4
6454 -4 100 -172 -382 -214 -176 40 157 -106 30 1 -109 -114 158 51 10 154 -144 -31 90 292 -19 279
6476 279 61 139 116 105 -37 98 17 -75 -34 -128 -33 -346 189 45 122 69 134 -10 -232 -21 -5 -402 -221 126
6500 126 -116 -35 61 163 44 -200 107 32 -298 -135 -419 536 118 -91 -68 80 207 -133 163 85 -168 217
6522 217 238 1 -162 -268 171 199 -54 49 -187 -95 -51 3 -3 13 13 17 66 -223 -134 163 -190 2 -131 62 -133
6547 -133 -65 -140 157 -8 -59 -137 19 -80 42 -177 -192 102 118 -206 127 57 -1 37 -73 -50 9 -24 136 -34
6571 -34 -95 -16 -38 181 -6 11 43 43 -32 7 -25 -111 -108 -58 -29 44 78 -70 -120 -40 -141 264 -179 18 5 -99 44
6598 44 -39 281 68 -54 -155 17 -129 301 -188 -221 40 33 187 -14 158 104 105 49 -7 -106 -140 -25 -240 173
6622 173 88 171 81 -47 153 8 -134 40 93 67 -97 -148 126 268 -100 140 28 -159 -43 -206 -1 -126
6644 -126 4 149 172 -141 -157 131 -23 161 -233 187 155 26 -70 -390 168 56 -418 -53 10 -34 -29 -12 18
6667 18 59 148 107 158 142 -130 -143 -97 -94 100 -20 -126 -245 -95 -29 121 -130 -180 -87 -165 -248 50 -36 -190 88
6692 88 -51 48 254 -61 -61 196 68 -109 -178 -18 162 -32 299 -142 71 24 87 39 -98 -106 198 156 -224 17
6716 17 42 -42 129 255 -89 47 356 117 -2 107 -37 283 263 -95 -211 35 -197 3 72 -145 287 -2
6738 -2 115 130 194 -199 -15 97 -190 387 -108 107 22 -95 -145 -119 124 -95 -156 -51 136 -88 -117 -86 -161 154
6762 154 -69 43 -182 11 31 14 165 34 -118 -3 -97 166 13 80 234 49 -139 -15 -22 67 -89 -246
6784 -246 126 -161 -28 -11 42 -45 91 -288 -45 115 138 208 101 -3 -20 -305 181 320 -53 -155 -3 78
6806 78 6 -191 -214 -107 97 28 197 97 80 -58 99 28 40 -237 -118 116 -120 -58 -30 -13 -60 200 -13 -287
6830 -287 -8 -76 -146 -48 70 -168 139 51 -224 -61 72 10 -180 -150 -66 34 135 -110 335 22 -112 201
6852 201 40 -121 -174 -14 135 -199 124 269 26 -157 -100 141 106 -81 52 -43 -178 11 -89 222 -127
6873 -127 -243 -78 58 301 -218 25 -23 -35 65 -304 74 -35 2 63 122 131 -77 158 39 -105 -75 178 13
6896 13 162 -27 70 63 -399 -149 -153 -66 15 -78 -167 -100 -175 -176 57 313 -67 151 53 55 81 19 -127 -195 -162 -108 -125 37
6924 37 199 171 140 -118 -271 94 174 -148 -148 -40 -3 -39 -176 -123 -221 88 3 -130 -207 116 65 -34 256 9 -159
6949 -159 -100 190 -322 -54 153 -59 24 -84 -282 236 -141 164 -123 272 -63 123 3 164 -140 -100 219
6970 219 244 -191 19 191 32 99 17 208 -26 52 111 -170 -34 37 -89 -16 -253 -34 -2 -15 -79 140 102 -39
6994 -39 -45 154 -51 253 62 -177 -32 -1 -256 173 14 269 -21 -136 106 266 29 198 92 17 -66 22
7016 22 27 -200 164 75 374 -48 -109 -160 2 -136 -13 -69 -227 -245 105 79 -93 -39 47 63 43 285 -39 -91 -48
7041 -48 -170 111 127 177 -6 -1 -53 271 30 204 129 -194 -159 -186 -94 124 64 -62 98 -142 -174 288 157 47
7065 47 -83 130 -57 97 78 -84 -27 77 152 -21 -171 -141 -23 -101 54 -224 -215 31 87 -228 -221 150 58 197
7089 197 161 28 8 -73 -18 -36 -43 15 136 -63 -189 133 76 -9 -95 -178 74 110 217 -104 -109 -50 -100 161 -159 -153
7115 -153 -51 61 50 373 79 -140 -53 137 278 18 178 -108 -64 33 69 -80 -217 142 158 195 -128 -91 152
7138 152 -199 65 -76 -117 45 7 66 41 -242 81 -26 64 63 32 -85 53 24 26 -81 173 196 -198 243 47
7162 47 -21 -154 74 -283 -100 104 -124 -77 -169 -69 166 172 2 125 17 -164 -208 -41 -274 -82 -34 42 95
7185 95 19 106 132 17 135 -33 -68 -41 147 15 75 -66 -34 39 281 -227 -255 -125 -197 54 -371 298 -55 -18
7209 -18 73 235 -317 124 -293 29 127 -42 228 168 64 190 103 -48 94 -91 -70 -28 -152 305 -152 -186 -24
7232 -24 -74 0 143 -42 182 154 33 203 -54 130 151 117 215 151 -157 169 126 -72 43 -21 107 325 116
7255 116 -231 -37 -233 281 -63 -117 263 -65 88 3 30 -96 -168 -2 -27 69 -160 -53 116 54 78 -40 -20
7278 -20 -116 -85 -263 240 -199 279 151 14 229 40 180 136 -122 -16 13 -85 161 294 127 -91 224 -128
7300 -128 -155 -282 122 -14 -31 31 -148 113 -141 -36 -12 88 -123 -237 278 -219 87 -178 -107 -28 247 -44
7322 -44 -294 -243 -105 -89 44 259 -64 -99 -57 -46 25 316 -48 -32 36 -125 -2 0 -150 -281 -121 13 -76 40
7346 40 -8 7 177 -46 -50 -77 -136 -27 -105 -178 125 -10 54 55 -128 -19 -33 -184 -57 -156 -229 146 58 -37 -346 -317
7372 -317 -106 113 -9 111 -15 214 -18 -91 -62 196 3 -119 107 -23 -108 46 -140 -220 2 256 161 126
7394 126 122 5 134 -200 199 118 -211 183 291 300 -33 18 98 41 59 -108 293 95 -96 -55 -159 -181 -232 189
7418 189 -57 -257 231 -55 -11 -131 -16 -62 50 41 2 -71 -19 154 -54 315 104 -114 -355 -407 -79 -42 -157
7441 -157 -158 51 -86 138 59 -84 2 -18 33 -34 -115 -234 -138 204 165 -347 175 95 -187 -134 120 182 47 -31 -35
7466 -35 256 190 -88 -39 -193 109 -20 -146 -256 -115 -54 42 -55 3 115 -14 -158 24 269 -80 10 -61 -23
7489 -23 90 204 153 -71 -177 -238 -3 112 277 91 17 255 -19 -49 76 121 -91 -117 98 321 -220 -86
7511 -86 38 169 197 -142 64 -169 -32 65 -12 -49 -198 -80 21 -62 -91 97 -186 -150 -235 -208 -237 -182 12 -55
7535 -55 -69 37 188 -93 95 -155 48 18 -65 0 -190 -266 -55 -33 30 280 13 -119 165 71 68 21 -12 227
7559 227 -276 -41 -57 169 18 5 102 -111 -61 -260 35 -150 43 99 103 -23 353 -74 -64 -32 18 -226 -80
7582 -80 28 -44 -137 262 35 134 109 171 3 209 -287 -179 -38 178 86 73 460 -154 -174 -106 41 147 -375
7605 -375 71 -84 119 120 -241 -105 -186 -71 132 -16 224 474 -170 151 -200 9 -240 -320 -190 -4 -31 291
7627 291 -232 230 174 -253 67 -104 -87 9 86 -200 -72 -140 26 -319 384 216 -30 241 -175 -338 200 45
7649 45 -109 -132 -57 -33 34 -199 -109 -174 6 30 108 20 -1 0 -17 431 232 -190 -95 -15 -145 -81 -85 -77 124 -139 -218
7676 -218 -158 177 -62 130 153 -105 -9 -327 92 16 -145 -107 209 190 212 184 -198 128 -41 -53 218 124 188 277
7700 277 -86 -137 -49 57 225 179 54 -149 -96 -50 104 73 20 -111 -15 58 -121 80 181 -7 -70 335 96
7723 96 -232 -36 386 78 60 -58 -60 -27 -40 -220 115 -41 -171 190 -36 -177 -184 47 147 59 40 116 62 211
7747 211 226 210 119 87 166 73 -32 -205 -73 66 99 148 -276 -139 -82 131 48 -105 68 -64 84 -97 25
7770 25 96 302 -41 16 6 33 -33 61 153 61 102 -182 10 -70 -148 -99 -248 64 86 -22 159 118 111 110 -7 188
7796 188 -172 -43 -64 86 255 282 -149 -60 91 283 14 57 219 152 64 140 153 -26 -167 124 -131 184 84
7819 84 -60 209 59 -55 -217 -139 -65 -146 40 -47 197 -109 204 28 130 -142 -209 119 -165 148 180 -25
7841 -25 -124 127 -6 -127 141 -132 48 130 -203 133 -97 247 90 16 32 -57 32 67 117 -228 430 -8 -297
7864 -297 327 -160 -193 16 201 34 -105 -29 174 105 206 37 183 -230 38 -57 24 -32 79 208 -112 108
7886 108 147 -48 -210 20 121 267 -226 -108 139 66 -152 -91 43 -76 -104 -206 -190 81 148 168 84 154 -81
7909 -81 245 -69 -218 -110 -94 -157 127 158 -164 -140 -257 58 -56 -54 -29 76 169 181 -79 -77 50 -145 -159 76
7933 76 63 81 -7 -50 -93 151 56 -19 -13 -55 15 -115 -34 42 77 57 42 -148 51 -124 -281 -48 -356 11 122 -16
7959 -16 -330 -157 -56 -67 -79 46 -5 -102 -22 -24 133 -331 456 -45 -190 -34 134 -140 222 -67 -6 -97 161
7982 161 97 -324 -163 -25 116 105 72 -209 337 126 255 69 -96 -188 -29 -107 -74 5 74 47 122 -36 -4 300
8006 300 -8 73 -118 -153 -97 37 48 -184 286 48 -87 15 -165 -42 -115 -30 -49 83 55 54 68 -97 122 183
8030 183 8 93 -22 -65 210 12 50 63 -10 21 23 -122 147 -62 -201 120 16 5 190 -97 83 78 -143 -244
8054 -244 207 -245 200 -193 -123 230 -38 171 -219 156 243 77 387 21 -39 124 279 157 -116 -43 -63 -83
8076 -83 218 107 -308 -82 -24 -94 -151 -70 43 -87 -241 -128 222 158 116 20 105 65 -8 -30 269 257 108 400
8100 400 -41 218 -236 147 -3 140 117 149 63 -75 -207 148 -156 -254 -113 -175 171 -81 14 361 170 2
8122 2 194 -11 -156 -147 -135 -6 165 -42 108 -79 -104 70 175 32 -115 -32 -48 131 -52 -266 -114 206 -111
8145 -111 100 250 189 81 230 147 -56 121 195 -275 -105 -117 19 82 128 -149 33 -104 -63 223 54 -50
8167 -50 -66 131 -119 -10 -107 -88 -114 -281 -153 -98 62 117 -4 24 -118 71 -232 0 58 48 113 94 -181 331
8191C31
$$ Imaginary data points
##PAGE= N=2
##DATA TABLE= (X++(I..I)), XYDATA
0 0 0 0 0 0 0 0 0 0 0 0 0 0 8 -8 8 -8 15 -16 16 -24 24 -32 40 -48 56 -64 72 -84 96 -112 128 -145 165 -186
34 -186 212 -237 268 -300 334 -374 416 -462 513 -567 630 -695 767 -845 931 -1026 1131 -1246
52 -1246 1374 -1515 1672 -1851 2054 -2286 2557 -2871 3251 -3712 4287 -5034 6042 -7483 9724
67 9724 -13717 23026 -97916 33129 96963 -130716 40268 79853 -86433 -5209 74949
78 74949 -68410 -16706 41967 -40685 -9013 46012 -30566 -17804 22869 -9997 -13138 15928
90 15928 4262 -3556 670 18435 1956 -22961 13135 17965 -25858 19838 33145 -33758 3494
103 3494 34867 -34020 -330 36805 -25839 10773 45965 -28766 5254 39784 -47057 -9087
115 -9087 49322 -39599 -17150 57410 -20922 -24782 46036 -12367 -30478 28946 -4109 -20921
127 -20921 17802 -6368 -17521 9641 -5724 -10374 5463 -4820 -3488 1842 -6166 -206 -6948
140 -6948 -12108 7359 -3022 -10927 14208 -2084 -16554 12963 -2315 -20626 10841 2445 -13933
153 -13933 15135 4080 -11411 13601 39 -11206 16114 -2128 -14155 19166 2530 -14291
165 -14291 18581 5173 -13558 16378 7765 -10806 12032 3212 -11934 10690 3751 -9116 11902
178 11902 5295 -6925 9453 2736 -8922 3849 13 -5975 4478 -190 -3814 4332 -1706 -4578
192 -4578 2620 -3676 -5355 1826 -1734 -3878 -1162 -3215 -2389 -2827 -3096 2036 -2604 -5511 3771 -2152
208 -2152 -9474 2881 -168 -9004 5561 4403 -7342 4621 2955 -8794 2748 2841 -8176 4467
222 4467 7063 -4959 4807 7410 -6176 1719 6359 -4354 1182 6881 -1899 2051 6352 -1571
236 -1571 735 4621 -1171 906 4959 -214 -529 2985 0 -2208 1232 1882 -1004 311 3379 -462
252 -462 -3257 1151 -900 -5663 799 1524 -4565 490 3386 -4746 -1671 1560 -6558 -3448 2697 -4304
268 -4304 -2212 4019 -2954 -3522 2739 -2864 -4702 2580 -970 -3147 3254 670 -3154 2051 570
283 570 -3243 2141 2366 -2072 1859 3086 -1616 316 3097 -797 -193 4363 1424 -353 3874 1591
299 1591 -2337 1736 1964 -2304 1798 4149 -637 1276 3773 -1906 -1633 2281 -1360 -1601 3321 -81
315 -81 -2065 2165 -426 -3676 1067 -305 -3212 1074 457 -3070 444 -39 -4095 -801 211 -3206
331 -3206 -205 1497 -2413 -1128 635 -2700 -2113 1115 -617 -1090 1944 467 -2053 626 63 -2066
347 -2066 298 1831 -745 567 2094 -335 -532 1872 -261 -724 2265 924 7 2182 1261 -1074
363 -1074 1297 1164 -467 1689 1664 -592 1381 1564 -1050 433 1136 -981 153 1682 -420 -477 997
380 997 -1314 -1465 868 -733 -1202 914 -173 -1474 105 -425 -1833 -525 16 -1251 -722 400 -875
397 -875 -1357 -140 -664 -1468 422 170 -1205 398 306 -1255 76 620 -1007 504 1438 -594 -242 1167
415 1167 -676 -393 1527 29 73 1910 335 -326 1320 283 -705 1279 677 -294 1422 1099 -658
432 -658 464 741 -900 362 1200 10 -42 1018 -213 -756 478 -39 -640 545 437 -716 101 99
450 99 -1274 -395 337 -867 -218 548 -338 -431 238 -1123 -1042 318 -188 -857 162 -49 -845 -43 -176 -820
470 -820 343 314 -274 353 725 -313 352 144 -777 200 753 77 312 515 439 -151 619 210 -221 427
490 427 281 485 317 296 -123 47 532 -336 274 806 109 -2 588 -50 -191 329 -175 -321 192 196 -756
511 -756 -101 295 -752 -17 -176 -548 -245 379 -318 -45 142 -343 -441 -183 -372 -177 221 -466 -394 32 -13
532 -13 -212 63 302 143 153 101 -140 262 -147 221 -60 -166 81 59 183 314 105 213 71 -232 234 389
554 389 65 350 465 -175 20 376 37 -54 445 205 -206 161 -89 -101 -131 66 9 92 -10 -233 -186 50
576 50 -346 -116 11 -240 -408 -77 -195 -121 -66 -414 -281 301 -130 53 236 372 -110 127 -228 111 -26
597 -26 228 -53 187 216 -381 92 191 81 55 -80 -28 169 294 219 85 -26 -84 3 130 6 -271 379 -3
620 -3 -144 129 154 -31 65 21 29 -91 -168 -39 -101 -39 -15 -226 153 -116 -310 -221 149 -135 85 107 -261 -265 230
645 230 48 -105 -126 -45 9 72 -69 -168 219 12 -78 174 40 -135 -121 303 201 118 90 236 -67 -163 -25 270
669 270 112 -86 -8 -235 45 -154 -120 223 -57 -134 248 198 -239 -234 113 -318 -313 -79 -277 -42 59 -74 -298
692 -298 72 -57 -65 67 -362 -298 -9 -414 -186 77 60 -35 -123 82 -20 145 -116 -126 30 99 160 365 106
715 106 12 -122 340 -200 208 322 92 -34 243 -82 -102 71 427 -208 -15 104 101 -85 216 138 280 442
737 442 61 50 -71 -58 -441 16 -71 -337 187 -167 91 84 -133 -403 -4 -64 -151 1 -61 -235 -100 -184 -161 -367
761 -367 -74 -55 -112 -245 -111 -254 -252 40 -144 -110 138 13 102 339 281 -181 171 68 -216 69 112 -122 60
784 60 292 -49 -119 100 -105 -44 -30 131 108 338 -240 54 -28 80 151 355 182 125 -23 -234 -407 115 -191
807 -191 -242 50 -34 -362 73 -190 -447 1 -230 109 -233 65 -200 -94 -78 -174 -188 -188 -111 -539 -267 -32 25
830 25 218 13 -99 -119 21 -163 -33 159 27 -14 44 86 -56 228 211 -163 252 -5 -192 84 45 -127 40
853 40 146 -114 9 148 -26 57 133 12 274 85 203 191 -35 272 62 177 -250 -11 -43 -115 -56 -314 17
876 17 -196 -245 -61 -272 -166 -20 -190 -182 -52 133 -92 -60 109 -244 244 -63 -399 81 -22 -105 -123 -282 -192
899 -192 -17 214 -59 121 70 -20 -22 118 -366 100 226 62 96 135 172 -55 219 10 109 77 4 -13 -167 -210
923 -210 -10 -14 325 -137 107 5 288 24 33 95 -52 -225 -21 -381 347 33 -355 73 -187 -94 -212 -4
945 -4 -212 -67 180 -30 -164 -194 -271 -63 118 4 -240 139 -78 55 194 130 98 -113 185 -73 17 308 -191
968 -191 214 38 -83 -366 93 -25 53 57 -110 -32 -164 -184 87 78 185 14 -80 63 40 -303 -9 -131 -245
991 -245 198 -91 -94 17 -11 -54 40 43 -163 228 117 -402 13 -176 -90 -27 -48 -105 -59 -367 -95 -48 -143 -140 -232 -192
1017 -192 74 176 35 206 -25 80 43 11 -115 163 57 -146 -27 116 197 121 202 -31 176 1 15 -66
1039 -66 136 -133 199 1 27 -55 131 108 233 52 -42 33 194 146 -9 -76 6 156 145 60 -1 40 -345 -1
1063 -1 68 180 -2 251 -31 -15 -314 79 -68 96 -50 65 -195 -33 -290 -208 24 -248 -67 12 184 -481
1085 -481 35 -9 157 -150 116 78 10 27 39 -316 218 -31 -202 288 -61 -51 -93 8 45 297 33 -76 -159
1108 -159 179 235 93 -12 -23 211 27 -29 243 104 -142 79 -38 -253 101 95 239 -114 12 127 -92 -302
1130 -302 58 -87 -225 1 72 -49 -28 -143 -89 100 -221 22 136 47 -157 -84 -157 -175 -148 1 23 -155 -13
1153 -13 97 -94 -3 -31 66 69 55 199 108 119 72 102 42 119 138 160 100 -66 281 179 -156 -56 -238 -20 81
1178 81 111 218 235 19 -14 63 -79 71 -49 69 -15 29 -125 -179 -42 66 -118 -65 -32 38 42 14 321 -78 -7
1203 -7 -295 -260 27 -30 -87 49 -99 -164 -339 34 -323 89 281 -28 -30 -120 151 -203 -112 -18 -211 15 137 145
1227 145 232 -400 8 -45 378 -322 -36 80 23 -143 -50 -52 129 208 51 -43 249 -119 -130 -159 56 -29 71 5
1251 5 -92 83 -8 -306 59 114 2 -130 -75 -67 -158 168 -18 21 -268 -198 -94 -199 171 -206 -122 -321 -187 -11
1275 -11 -42 -153 32 -48 -102 105 140 -458 -40 163 176 137 52 170 -13 -30 -83 -148 -70 -106 38 103 -140 44 59
1300 59 -61 75 -84 -25 122 -83 56 380 149 -171 -146 382 -57 -235 -238 95 39 -260 -123 31 89 -50
1322 -50 -310 -162 -26 -15 -177 133 200 -84 -7 41 162 245 307 -224 -42 74 224 -101 80 117 165 -173 -182 70
1346 70 -27 113 -38 -254 241 -4 -125 48 109 118 -151 -41 -209 153 -38 33 7 -178 185 100 219 -180 44
1369 44 132 -186 108 -277 179 -100 -62 -122 -113 187 89 206 -289 -68 -174 -198 93 190 -140 -12 -54 127 237
1392 237 93 68 84 162 160 -271 -74 -38 1 111 -199 -155 -65 105 -203 -102 -138 17 -33 67 -33 290 245 53
1416 53 78 -81 -163 -47 135 -18 239 149 255 -25 -12 64 65 89 27 -4 113 -108 1 -31 -136 113 -282 -316
1440 -316 108 -13 -53 -19 -56 -122 -96 -423 -21 -207 87 -143 -199 -45 -103 49 44 -231 173 -22 259 217 -213
1463 -213 364 -93 135 -202 -4 337 218 127 6 -88 -193 -124 -37 -38 12 162 -65 -123 4 97 -194 1 234
1486 234 146 -122 37 270 -30 16 -7 -111 45 -236 97 -16 88 93 -121 -114 126 265 152 315 -256 -36
1508 -36 190 -214 167 -251 9 225 -74 214 -122 -171 -91 2 -24 116 -43 45 190 56 39 10 -136 23 -59
1531 -59 -122 -275 29 135 -37 188 -161 138 47 -89 255 120 100 39 -28 -72 -25 -40 20 -28 -181 23 163 -72
1555 -72 -217 79 73 80 18 150 -31 -121 -159 -45 -180 107 -5 82 -96 10 -1 298 1 -77 -128 -99 38 -265
1579 -265 24 -11 175 266 224 17 25 288 61 -80 335 -9 23 -11 9 30 83 27 120 164 110 152 216 71 184
1604 184 147 282 59 36 317 345 31 57 124 82 160 -171 94 -14 -83 -127 322 -59 -8 -100 -120 155 -264 -213
1628 -213 132 73 -94 -6 69 2 136 -75 -127 -13 178 96 179 -46 1 174 -40 -140 0 -82 268 2 -31
1651 -31 84 -184 3 -149 -35 130 -39 -38 -101 -111 91 -157 99 -89 -186 95 252 48 -3 80 -31 -39 128
1674 128 37 -257 101 55 91 -90 117 -8 27 8 14 34 100 146 251 74 -4 -192 -33 135 -142 -21 -50 -116
1698 -116 137 16 33 89 91 -14 -235 -191 -162 -98 327 -151 279 -43 -151 120 69 -3 112 5 13 -125 42 -51
1722 -51 -113 -216 -129 -108 117 345 190 225 -82 -5 304 139 -70 267 -75 -148 -131 -227 20 275 93 -34 19
1745 19 138 -142 191 -52 -109 -185 -36 104 382 31 97 -130 55 -102 -51 -18 -174 51 225 -47 -58 -107 -42
1768 -42 -100 66 206 -45 71 -167 33 266 -72 -155 132 -134 -75 102 143 42 19 -83 -152 -51 121 101 105
1791 105 -3 130 -225 189 -23 -134 -107 2 -93 -177 219 -4 25 50 -2 -72 4 261 -55 146 -50 180 184
1814 184 27 -9 34 98 -359 -89 -92 -12 -46 247 -69 247 -47 -43 -408 -10 -143 100 141 -45 -150 169 -50
1837 -50 112 -129 -37 -3 -59 18 153 73 93 -158 -34 134 191 63 113 261 70 41 -140 74 -136 76 122 191
1861 191 21 -62 -14 62 -146 -37 32 211 56 -299 36 31 -43 201 -36 -164 17 45 -3 -214 138 -175 -98
1884 -98 -73 158 74 2 -54 -63 1 293 -203 -32 -119 -101 99 48 77 41 46 177 79 393 16 -80 -11 200 33 -15
1910 -15 52 -62 61 29 102 79 -3 -55 124 -46 464 0 -47 155 -305 184 10 197 284 -68 -94 30 -174
1933 -174 -79 -208 -103 64 -152 -164 -85 -25 -81 40 46 -227 -233 130 -63 194 167 -154 -100 58 -50 23 139 132 17
1958 17 -2 30 -37 134 -5 -71 116 -45 -25 -134 118 131 -76 126 69 23 145 62 -155 -140 -60 -5 -116 110
1982 110 -180 207 -203 -48 116 248 220 -102 109 -164 -34 54 -93 -193 267 -411 -42 475 -28 -161 138
2003 138 183 -189 -22 134 207 -63 32 156 -34 -51 -153 92 -9 111 73 -113 56 -409 -19 -29 -113 76
2025 76 -97 -53 -41 160 159 31 121 -60 173 65 -229 -59 189 98 121 -141 28 -301 -151 22 19 -73 -53 57
2049 57 113 67 97 -22 -90 388 163 21 -15 56 57 -105 -77 323 -134 -25 99 218 43 -30 77 -111 295 170
2073 170 -13 168 -24 -143 -151 -69 -45 -157 -176 102 321 72 230 -58 -260 -3 235 5 7 284 82 -176
2095 -176 -184 -44 310 44 57 -79 113 133 -115 -48 113 197 21 -42 152 -68 -19 72 38 -166 -174 -169 103 41 -39
2120 -39 -7 25 -73 171 -27 22 -37 76 70 -18 72 -186 -195 -58 -97 -133 299 -30 -238 -421 -57 -63 -80 110 -36 -227
2146 -227 71 166 -56 271 135 -62 28 -331 -197 103 -7 -45 -215 -45 -17 -214 -114 228 -78 0 56 -1
2168 -1 14 -71 -45 -65 34 55 160 -95 -126 356 93 27 -100 -83 -264 -213 86 -136 221 -66 -206 234 69 -99
2192 -99 -135 -160 400 -95 -94 -138 -40 -154 65 204 19 25 210 -28 -10 -222 217 -196 76 205 100 -269 195
2215 195 -180 61 -121 -107 76 -65 -85 12 -32 -64 35 58 176 106 35 -65 -105 340 167 -144 305 118 241
2238 241 -166 -143 158 -206 -80 172 -29 -53 114 -124 -77 183 -33 189 104 -102 36 -226 54 -124 0
2259 0 37 32 211 -142 45 323 239 174 74 92 -100 -28 -24 -347 92 -175 2 15 28 113 12 41 -197 282 -37
2284 -37 -97 -35 -79 -104 -5 123 -122 157 198 91 6 137 125 103 285 61 117 220 169 116 -41 -141 -192 11 108
2309 108 -91 -107 41 66 126 -8 -116 163 -27 24 192 25 -103 -223 -18 -144 -33 -179 181 -2 -60 202
2331 202 27 -115 -66 -34 48 13 -66 -5 -197 -256 -81 -161 -109 51 -117 -132 -184 94 -105 -14 108 -121 247 65
2355 65 177 6 361 74 245 -2 201 229 -61 151 137 55 -136 -186 6 15 103 -203 -76 149 -33 123 41
2378 41 157 106 -174 61 -179 -263 21 -256 32 150 19 -58 47 -155 -113 19 -33 130 171 197 129 -36 -79
2401 -79 -51 44 -178 39 227 -175 -118 61 -83 -49 251 82 178 -91 0 309 -28 155 322 154 60 9 244
2424 244 67 -233 210 -269 -98 -309 12 114 288 397 160 -79 169 -267 129 194 -202 -176 187 105 88
2445 88 -25 94 143 143 -120 -5 -158 -14 81 -58 -3 -100 -267 90 84 -55 17 -29 101 -57 1 40 66 28 -158
2470 -158 43 -245 -133 90 20 147 88 3 -237 -161 79 108 -79 -35 110 193 -94 -172 288 210 -172 94 -29
2493 -29 52 107 -127 22 29 -177 42 -2 243 331 115 -28 -3 -250 -174 -40 145 291 36 -200 17 93 53 -148
2517 -148 -94 297 -64 148 117 75 -350 -62 -102 130 -112 -43 72 -32 5 -196 -279 -137 103 87 -16 -299 -67
2540 -67 157 10 -91 178 -91 -102 2 -232 75 -226 -79 393 112 14 205 169 -9 38 -116 -69 -135 249
2562 249 -69 126 -123 -319 94 -37 292 157 -30 103 -60 85 -222 184 335 238 154 80 25 71 -105 -242
2584 -242 114 34 27 193 -75 230 -58 -170 220 89 -232 160 -86 -65 5 58 242 -105 -71 -43 40 258 -66
2607 -66 -28 -33 217 -84 -63 79 25 -125 149 0 314 -96 -93 27 -118 -153 -22 207 43 -53 0 -57 210 223
2631 223 -162 -119 -270 181 -187 -198 -147 40 127 -64 42 -150 20 129 94 -143 117 119 -141 23 -190 -230 -152
2654 -152 316 119 -10 -94 -164 81 54 -30 143 -146 32 -78 -90 7 -35 -42 -57 101 101 143 -177 -53 -318 11
2678 11 153 -278 -74 267 -115 101 127 226 18 39 7 -3 -214 41 -16 -155 -284 -244 58 51 -130 -30 -104 172
2702 172 -99 48 -62 53 -22 -14 -261 -135 -286 -88 -174 -230 20 -167 193 345 201 -34 86 45 71 -51
2724 -51 -96 167 100 -157 -168 115 -177 -22 37 -291 -69 10 -15 292 -43 63 -55 -79 -227 -31 -15 84 -97
2747 -97 44 -76 86 -218 -214 -61 -12 -42 215 283 180 20 83 -21 119 -263 -1 -108 -185 11 200 62 -362
2770 -362 35 29 86 -32 20 -64 -235 -89 -116 10 356 90 -134 -68 186 261 -40 -105 -124 -73 162 103 -66 -239
2794 -239 -25 91 -7 207 -64 67 -59 -53 -183 199 74 38 -158 3 -333 26 41 144 36 -23 93 -208
2816 -208 -80 -86 -327 -173 283 -97 -217 -330 89 -101 -30 168 -93 157 -90 36 -178 1 15 -50 -65 -50
2838 -50 99 -54 -67 -44 107 -119 -210 211 118 -166 35 -95 -154 -107 183 -13 96 318 -97 364 -201 -69
2860 -69 39 -100 66 234 35 89 50 -380 -100 -200 122 193 92 -22 98 49 141 220 179 -22 35 -189 -256
2883 -256 395 -134 -86 38 -8 -57 50 -186 -137 360 8 21 5 51 112 18 -178 -143 50 78 -111 63 -12 -21 301
2908 301 -57 -69 -76 16 16 96 -140 42 170 -69 115 -163 106 -10 -112 153 177 129 163 -94 -254 -73 76
2931 76 34 -228 100 -80 -53 20 -176 129 31 -20 -72 127 45 -80 232 231 78 41 -8 -74 334 33 40 -172 -42
2956 -42 194 80 16 -35 -106 -152 18 5 -55 -115 -192 334 297 408 -12 147 -60 138 -211 -2 -215 21 114 -221
2980 -221 -13 -212 26 -271 159 26 -17 -8 -67 83 40 -33 138 306 -283 155 -37 -303 37 374 123 -98
3002 -98 53 -348 -67 223 -291 99 -68 -250 -46 10 88 142 229 168 -97 -21 271 -13 -163 -79 184 217 -117
3025 -117 -228 67 -35 47 -72 141 53 278 9 344 222 184 -321 84 68 -352 -187 -247 -136 29 174 -183
3047 -183 4 152 -27 49 -128 -29 2 -150 61 -118 -60 -70 37 -109 -31 180 -23 -213 359 -220 42 -70
3069 -70 142 29 289 373 173 289 350 171 -188 65 165 117 37 -60 155 -68 -16 -6 34 76 328 -37 -110 -90
3093 -90 1 211 -64 316 -190 187 58 -38 -436 36 35 -59 -56 -32 56 164 -31 -90 -46 -77 48 -205 -79 -243
3117 -243 -21 -23 -121 163 74 -71 9 -102 -101 51 -114 307 208 90 -57 -98 211 198 44 -41 -146 128 16 -222
3141 -222 48 -61 -157 -13 -100 63 -15 -73 108 14 345 -32 13 90 -39 -252 -91 41 -7 275 -198 14 63
3164 63 -110 -88 120 -51 -2 -6 219 146 212 -33 -9 -191 -6 -128 95 175 53 -29 -112 -144 -51 54 49 88 41 96
3190 96 -78 -188 -104 279 114 157 -97 -259 12 -24 80 -69 -165 -18 -31 257 -26 80 3 -59 296 -38 320
3213 320 85 130 -29 -29 -123 66 94 -177 155 -8 -9 293 211 104 -185 34 -173 -112 -96 -12 -62 166 95 -2 173
3238 173 -65 2 -141 -384 -84 212 -166 234 -137 30 -33 135 -42 -137 113 -255 -276 -141 -42 12 -77 268
3260 268 -68 -38 -252 83 -129 -160 -155 -143 -164 111 73 -240 -192 141 -31 197 8 20 104 -18 -279 34 -28 -231
3284 -231 223 -1 373 60 155 -236 8 115 -158 -105 189 208 276 -47 5 -41 106 11 4 -300 197 81 184
3307 184 -147 -9 -22 205 -115 -5 -131 118 -172 -36 233 -7 191 201 151 0 135 -100 -183 39 -125
3328 -125 -117 -260 -165 145 37 40 -22 9 -138 269 15 75 -34 -65 175 140 -57 103 51 148 332 302 176 60
3352 60 117 84 -89 216 -84 33 -118 94 -51 -311 359 -112 184 2 -54 -4 136 -151 65 49 -31 -34 206
3375 206 -182 -171 -219 234 10 103 199 -36 229 170 237 -14 -5 168 -36 136 79 -68 197 3 96 249 4
3398 4 14 -78 -7 122 -69 -150 -60 34 -123 1 151 83 131 68 -162 -242 -154 77 -62 131 -118 -49 282 -2 -121
3423 -121 -159 -47 -111 -178 129 49 -77 3 36 -55 -45 -228 -1 -38 72 -82 56 -103 29 -229 -201 -89 82
3446 82 -126 -79 -58 17 -332 26 -12 -34 -116 -70 68 -120 103 4 -97 29 -149 177 60 24 -3 138 102 36
3470 36 -105 -153 5 -41 -35 399 84 -318 -54 86 5 90 95 135 6 -121 278 27 229 205 -48 -129 175 148
3494 148 12 -30 142 73 -129 -188 186 -199 122 -143 97 -92 138 215 136 372 15 189 -5 161 -231 -98
3516 -98 -193 52 1 -91 -193 -66 57 -51 180 125 -26 188 8 -71 206 137 39 -93 -172 101 -110 -86 53
3539 53 -206 -57 -209 -255 400 104 202 110 73 -176 -69 -176 -21 -129 -311 -73 -3 99 143 96 -17 60 120
3562 120 131 70 -97 26 64 -91 -58 -18 -112 51 192 -87 -223 117 -125 7 -191 34 131 134 25 -68 -117 -196
3586 -196 -109 -92 -121 16 129 29 139 244 -80 299 215 -106 -129 -1 -175 -256 82 236 -6 203 86 -154
3608 -154 -90 -116 -80 55 -7 120 153 54 124 -25 -21 -26 -28 14 -100 84 -35 -135 183 78 104 174 -229 40 -202
3633 -202 130 -44 -222 112 -129 119 258 42 -48 291 138 -32 288 -85 56 -376 -33 143 109 -189 55
3654 55 36 188 -203 8 -64 -153 -30 -80 -11 74 -322 -260 57 71 -103 24 -98 70 -67 142 -11 -223 4
3677 4 -58 273 236 134 -139 32 200 -92 40 65 -123 176 -203 35 28 64 -291 60 20 8 -165 93 17 107
3701 107 70 -103 -66 -23 -98 103 -16 -187 -105 -131 101 138 -94 370 215 -182 64 -76 -60 -119 136 9 -55
3724 -55 -157 92 33 -27 -42 -59 -139 43 -62 2 113 -128 332 103 -55 252 -295 26 127 -122 80 132 -56
3747 -56 4 80 -134 -127 -218 -1 64 -4 165 -27 64 -147 -1 -162 238 -83 -44 -26 -89 -233 51 -248 330 -116
3771 -116 -21 -102 -50 158 -9 127 -196 -221 42 -133 -160 -70 -40 -137 35 50 -67 112 58 -47 109 -133 -95 237
3795 237 -98 -94 -39 -336 -28 -1 -240 -148 -13 -72 -83 -199 -85 85 -53 -40 -127 177 150 -58 194 26 142
3818 142 6 9 38 102 134 -13 67 97 216 145 -83 103 -17 -233 49 317 64 306 181 -214 -10 85 -139
3841 -139 -230 -156 70 74 87 -190 -58 -44 -38 -131 -125 107 -74 -45 257 -190 96 150 114 188 -21 -30 81 -25 78 -277
3867 -277 -296 86 236 43 -58 -33 40 106 -52 35 289 73 -315 21 119 207 -32 -180 81 -94 201 -88
3889 -88 -132 -7 177 -154 -139 70 184 -66 -156 -179 -8 22 215 -278 118 -47 -204 163 -109 -96 127 -219
3911 -219 69 325 53 -187 -57 -86 -179 232 172 -30 -38 -54 1 6 36 -149 62 189 -158 23 -30 -14 -319 -31
3935 -31 37 -133 -78 16 -36 -124 60 -52 -228 -199 -13 240 -35 -84 -26 7 -80 235 -79 0 229 -53 -365 -41
3959 -41 141 38 17 3 290 59 163 98 159 -118 -19 -59 44 -40 26 240 131 167 141 -176 -26 91 9 174
3983 174 -22 -59 -62 -106 291 7 -237 266 -219 201 -4 -183 -147 -171 200 165 -191 -126 -108 218 -109 71 -229
4006 -229 -62 -211 214 -42 -117 339 -135 41 76 -100 -319 -1 -10 326 -3 -98 128 -64 79 83 177 -46 63
4029 63 128 234 164 -120 -157 16 140 -126 -79 -84 -115 -32 -159 -241 -124 -255 230 352 103 9 -13 -27 5 -67 -264
4054 -264 -111 -145 37 -41 -80 -153 362 -7 18 -10 -242 15 67 -37 202 -37 -48 -189 -46 103 42 110 104 78
4078 78 -109 158 28 29 -86 190 -32 135 5 -26 -117 129 -59 128 144 164 63 -45 6 5 36 -12 -211 45
4102 45 51 -61 -36 8 -140 292 -113 -163 2 114 140 -38 86 -54 469 236 203 24 135 -50 -105 -13 -109 25
4126 25 39 -20 140 -268 219 -103 94 32 -67 -128 87 56 -253 107 -123 204 -52 181 -98 197 113 -232 5
4149 5 -162 136 189 -258 -153 9 -134 13 -142 178 -212 29 -55 -41 -75 -2 -227 -190 28 -22 -21 44 -61 169
4173 169 -144 153 -12 68 -28 207 45 -341 84 -20 -204 -248 151 -67 93 35 49 -113 -34 -97 297 -98
4195 -98 74 -42 -160 124 -37 163 -16 -130 360 234 -80 -206 107 92 -19 108 252 83 -206 75 -104
4216 -104 195 -47 -181 -13 -136 62 53 -410 154 -129 124 -120 58 146 -7 90 43 -51 72 -194 -351 -49
4238 -49 139 169 39 8 -38 109 -10 148 125 -66 -32 10 -43 -19 -127 80 -30 -21 91 333 356 52 122 102 100
4263 100 -212 65 -149 -271 -138 263 9 52 -31 38 88 39 -7 218 -219 113 -289 225 89 -222 -45 -82
4285 -82 -11 213 113 32 -76 28 102 141 369 73 266 41 -159 -98 102 372 165 61 207 -49 113 31
4307 31 204 -56 -312 -5 11 -103 -160 -160 105 -46 26 -197 36 0 75 127 -132 120 -238 166 103 16 -83 -10
4331 -10 96 -60 -40 -334 -1 -359 224 -250 42 319 70 -161 116 122 -28 -301 111 216 -298 -41 -63 -4
4353 -4 198 -154 -263 -31 -3 -31 353 -224 -33 149 -213 -160 151 -224 -149 143 16 -72 142 253 -88 -117 -110
4376 -110 -67 -43 96 -124 -141 -245 -121 58 -37 35 -75 -61 153 58 -64 42 -295 94 98 156 -210 73 -102
4399 -102 -51 -123 -23 157 -1 83 360 -10 -93 -111 181 110 -83 -19 -83 -37 -208 -312 -298 111 110 -59 -67 200 85
4424 85 129 -109 -325 -197 137 -219 -90 131 -85 83 115 38 -222 -51 82 -168 360 -190 6 -22 -58 227
4446 227 -92 -16 27 28 -133 157 136 -292 25 218 132 -33 150 4 -134 -164 -3 -60 9 -54 -52 -48 -112 75 -21
4471 -21 34 60 -116 -97 -169 59 64 -62 144 -133 61 -172 3 -114 80 -203 -140 -19 11 -323 -23 -60 -239
4494 -239 15 -162 -40 178 181 271 -128 43 82 117 -98 -132 187 -86 -116 -26 87 -248 290 166 -84 134 -116
4517 -116 122 58 -38 -194 33 -165 -34 9 -121 -102 -270 7 185 244 163 -108 18 -19 192 25 -155 259
4539 259 20 -121 -92 175 -185 -125 -7 -6 66 11 -191 -158 -299 27 12 -164 23 3 9 -351 45 38 -101 -184 -79
4564 -79 -181 65 145 -163 33 -24 17 -120 -319 0 168 -177 341 151 123 -1 57 157 -103 -64 -17 57 25
4587 25 -128 -132 104 -56 -155 106 21 146 183 139 1 -43 87 132 -143 -188 86 146 14 -165 34 204 103 -134
4611 -134 -274 -6 -76 4 21 -65 -225 -118 -50 -130 -128 28 79 200 96 -121 21 222 38 -195 51 27 -358
4634 -358 35 -400 -81 -69 97 89 -155 -29 -109 -82 -152 -71 264 -65 13 103 -209 77 291 -42 -306 -27 133
4657 133 -34 -11 21 -123 365 198 27 -146 -143 -333 91 68 38 -93 69 -52 98 249 5 -45 -98 -89 -1 191
4681 191 -162 206 -198 125 -36 399 79 140 -122 -233 -97 11 25 -267 -18 40 106 -34 107 -66 4 -40
4703 -40 -79 -184 103 303 169 -80 -322 84 59 -137 -304 -243 -80 -23 6 112 53 230 125 333 329 -108 -139
4726 -139 295 4 146 -5 205 -78 36 183 -116 -77 -164 -24 -7 32 -276 110 156 158 -156 -4 -153 142
4748 142 332 13 139 242 290 -105 199 297 -40 236 117 51 -20 65 -91 -181 -44 -280 -117 143 -253 148
4770 148 -100 -226 14 -192 -61 22 -66 -71 192 102 112 32 -107 -67 65 99 1 119 134 -111 42 -15 170 -63
4794 -63 -208 1 -211 229 190 288 -189 268 -212 123 306 194 -91 -76 117 0 318 292 168 -13 -4 91 16
4817 16 59 -243 -2 30 85 -29 111 -92 -3 171 0 58 167 -271 24 11 -91 -92 -67 17 60 -69 -181 -98
4841 -98 -183 -10 129 111 -209 -85 -21 -56 -48 -62 42 -160 -39 -49 -26 90 9 -83 -92 115 7 79 -160 -130 20
4866 20 -74 129 123 32 55 -364 48 89 159 -134 -69 -82 -127 166 -260 -238 131 48 21 -63 -85 -172 140 49 49 -155 48
4893 48 -45 -41 -104 361 -36 -46 -81 77 242 -113 -181 109 -356 35 27 -27 -107 151 126 44 -92 -75 199 -210 55
4918 55 -41 -194 -32 379 93 222 212 -66 206 86 111 -272 32 229 54 99 45 317 -5 -72 -134 8 -219
4941 -219 244 -17 -107 -14 -69 2 101 -30 -150 95 100 93 -66 -47 -171 -87 -56 196 154 214 146 -14 -245 25 274
4966 274 155 49 89 54 -52 126 398 15 -58 211 117 -33 20 -43 -144 28 222 2 -265 44 225 -63
4988 -63 8 -60 -83 -99 5 123 102 -59 -108 -61 -336 -60 71 -102 -106 -58 12 -73 164 -31 -252 -68 129 -65
5012 -65 171 222 110 73 -2 -134 -98 89 -119 145 117 237 -174 177 -176 -214 113 -211 197 99 -162 -40 -199
5035 -199 -96 176 -77 41 16 20 192 -32 -58 22 51 -135 -384 37 140 33 -11 58 -35 -163 -39 147 -9
5058 -9 47 -59 -256 -60 -60 18 29 180 -49 55 -188 -31 124 -117 29 -124 85 104 -37 -28 132 -81 -170 144
5082 144 65 109 -279 -164 209 -234 171 68 -169 148 309 59 239 -15 -66 -39 82 138 -122 57 -58 83
5104 83 219 -222 -72 243 72 -243 13 -329 101 191 196 -222 -54 15 175 -24 -5 162 49 94 82 -3 -124
5127 -124 212 87 -80 -196 -69 -21 -16 -17 -212 34 -27 -141 239 302 34 -239 -105 -135 70 83 212 131 171 3
5151 3 -13 197 12 -97 -121 -30 43 67 62 19 177 128 44 93 -227 -48 11 -116 42 -98 260 33 79 -148 63
5176 63 -138 -150 -151 -181 -9 28 -20 115 -71 -28 -28 -212 48 58 -167 143 87 -284 -71 31 22 -34 -168 224 92
5201 92 108 242 -208 -134 97 163 -212 76 -234 43 -107 -7 77 -154 68 353 -111 92 -36 130 45 90
5223 90 -153 30 -95 -147 11 -121 -200 50 26 -84 -200 166 8 -196 -6 79 272 22 225 -104 -161 29
5245 29 6 9 -18 -139 149 -167 49 -22 25 81 -84 -68 -57 172 197 125 -112 79 -40 -7 84 -78 -96 45 -71
5270 -71 10 -130 131 -228 -103 26 -55 18 -13 29 229 269 23 176 192 138 -109 -16 19 -38 261 -123 64 -284
5294 -284 89 -55 -247 -92 -122 -130 60 85 2 -267 77 127 101 62 -51 -7 -180 57 32 -128 -17 42 78 0
5318 0 -15 51 70 -24 183 -28 -1 -23 -54 -51 9 -277 -105 -86 310 51 208 -107 -79 -181 275 136 -16 -133 138
5343 138 188 128 53 197 -173 -44 -96 -213 251 -20 93 -14 88 303 251 81 -6 -55 183 -45 2 9 220
5366 220 13 98 113 71 -193 -15 120 -37 -97 -100 -393 35 111 117 -174 -154 307 45 -336 -181 31 -14 -218 74
5390 74 235 148 -186 -194 66 73 93 -151 -207 -109 13 -212 366 -215 -66 207 201 166 157 67 123 169 75 26 119 -236 -114
5417 -114 191 19 6 252 70 61 -183 -136 -199 -186 311 43 -52 28 199 168 55 -12 126 -328 116 -13 -231
5440 -231 46 -143 54 235 173 16 230 84 -97 -172 -45 -61 4 -138 116 -100 82 170 218 -4 -85 -176 141
5463 141 96 198 97 -257 194 -106 -149 129 192 203 -168 -110 131 -113 235 115 -172 199 126 32 128 325 -89
5486 -89 -137 -53 71 -219 -16 -19 68 72 65 107 65 14 155 58 64 -6 75 -41 16 57 -87 215 -82 -7 -110 16 48
5513 48 117 -190 -103 274 -20 -115 -109 26 47 -43 -140 190 -200 285 -161 -236 -78 151 -113 234 -15 57 -430 126
5537 126 12 -161 58 -59 -103 -23 -21 -93 132 -9 201 131 200 206 100 -92 42 -101 295 63 -79 61 -55
5560 -55 -17 -69 129 258 -105 -102 13 -29 0 390 -223 75 -126 -74 117 137 219 -124 208 162 -105 -231 -99 -18
5584 -18 117 96 14 -69 109 -156 81 -211 118 159 -189 -154 218 143 54 64 -108 157 -37 -179 -66 134 -13
5607 -13 -47 108 74 69 74 -60 65 103 -5 16 237 -106 -25 7 -87 70 216 -111 -18 63 37 -265 3 -58 105
5632 105 180 -15 -268 331 -160 -7 178 86 -167 145 -126 88 85 147 134 128 148 -45 199 -12 139 -114 92
5655 92 272 -8 31 -172 -286 19 144 179 93 228 42 11 -84 -71 74 106 305 105 -81 -57 228 -251 28
5678 28 -139 85 148 -30 345 74 -59 -201 26 -113 19 213 -127 -51 25 13 68 -10 -40 155 -248 56 308
5701 308 85 -69 27 160 -98 -397 316 176 6 -21 -3 -33 -188 -45 163 -112 76 -76 131 -40 -335
5722 -335 -120 1 -33 -27 77 -425 11 -68 15 154 185 -190 -20 62 -86 17 -416 -193 126 -47 161 6
5744 6 53 -219 177 -24 -376 193 -31 200 -109 -74 7 113 82 -17 -116 -107 -79 193 1 188 -45 301 179 201
5768 201 -133 205 271 245 189 34 103 -26 130 33 -16 -98 3 -46 116 117 273 51 -45 36 48 333 -41 89
5792 89 -169 45 86 100 -19 -229 -251 127 141 59 78 89 21 -116 68 2 -31 123 -109 -5 21 167 51 -155
5816 -155 72 -128 -118 -105 -103 -343 5 176 76 -238 240 13 -174 104 -130 -99 -3 210 112 269 45 -73
5838 -73 -82 60 -198 216 143 115 65 -34 78 -8 -38 -44 -130 -49 -170 -25 -58 -244 -221 22 13 9 -18 -202 38 389 -33
5865 -33 -227 -61 -18 231 -146 255 240 65 -233 -138 -106 -117 -60 -195 -45 24 196 -31 271 15 149 380 155
5888 155 -63 -43 -61 127 -30 148 -58 127 -401 -286 71 -43 99 63 -72 -199 163 -93 -27 -95 -34 5
5910 5 -109 -122 100 -42 -238 -64 -73 396 -247 -6 256 -277 55 -357 77 -247 -13 -206 -3 -116 25 122
5932 122 21 37 -83 41 -82 28 -102 98 -113 -321 -86 70 -26 65 -71 9 -112 176 73 -131 115
5953 115 -115 -83 -27 -77 95 86 73 -175 -140 -18 121 -3 18 -42 173 200 329 106 27 -80 -149 27 -94 13
5977 13 -134 242 31 207 -77 127 243 33 11 -168 -109 -187 -2 18 -206 151 26 -168 -68 8 120 222
5999 222 177 -75 138 36 -189 226 -155 16 241 87 -10 -126 -117 -129 -81 -14 203 103 101 -155 75 -12 10 -12
6023 -12 -154 39 141 80 71 -86 -90 -5 172 -37 -299 -191 -37 91 -74 138 36 207 -56 34 144 148 15
6046 15 77 264 -28 -112 -253 -128 -8 331 -310 -22 -98 -80 31 -307 -63 -189 292 -67 -61 -380 -190 -143 -297
6069 -297 -3 38 103 23 -139 -147 -67 40 -77 -117 57 -104 -188 84 152 237 -38 -235 -27 -32 -112 -62 1 -305 -131
6094 -131 165 -266 -166 86 -323 -15 33 152 47 -30 59 3 90 27 6 240 137 58 52 -47 32 -33 -102 129 -19
6119 -19 38 102 -253 -27 28 81 -143 -59 19 81 90 101 4 -28 -33 199 35 18 -87 -26 -241 -32 -130 30 -117 -133
6145 -133 -247 -44 99 172 -146 70 107 90 -108 -108 -91 -129 -192 -82 47 59 -9 -167 1 -8 179 -19 -73 -53 -74
6170 -74 240 -4 464 197 60 76 -53 -131 -62 269 -137 -29 233 -79 33 -210 161 51 -106 -186 31 168
6192 168 -118 262 -175 178 120 245 104 -285 75 -57 -77 -36 -26 -3 10 270 259 -62 -25 97 -182 136 270
6215 270 137 16 -25 58 33 248 6 178 -68 -21 111 -3 121 -42 184 -8 -258 -170 61 -200 147 11
6237 11 112 -117 25 187 -198 -85 -90 0 -136 -316 84 -117 -167 -163 5 -245 -185 52 -50 120 -125 -153 -66
6260 -66 -91 38 -188 162 -148 -56 169 -46 284 -31 151 15 -105 -154 -195 -32 -187 -195 -202 -176 48 -121 -111 -159
6284 -159 0 169 177 73 120 -161 -98 -10 -175 45 -142 4 37 105 190 105 92 -16 13 -45 -183 -135 165 -44
6308 -44 122 127 -142 42 49 -133 124 -207 -166 -272 41 -235 -35 -142 -95 59 -18 -144 -23 -6 69 -146 -273
6331 -273 89 -59 121 -236 151 -90 -54 -8 64 -113 15 -190 -132 -97 -175 -50 -5 32 54 249 -23 10 70 -98
6355 -98 101 -56 130 113 -191 99 121 153 127 -98 -165 -33 149 -236 -52 14 -11 -65 181 -210 138 -147 44
6378 44 -303 -244 -217 194 110 -63 200 -120 -326 44 -138 126 107 -107 208 83 -189 -296 -221 -137 27 0 261
6401 261 -95 -198 30 243 24 -56 -37 -98 132 39 -33 491 42 -17 62 -234 107 -247 122 321 14 11 -66
6424 -66 49 1 -90 -80 45 -212 141 195 145 80 192 -256 128 -117 67 51 133 -226 -44 -68 -217 -4 36 163
6448 163 6 -15 178 -45 -60 -95 29 -105 -238 45 -162 151 -42 -171 150 -25 -11 67 -259 202 172 -12
6470 -12 22 39 117 -9 87 79 88 -76 -193 -38 -90 -228 304 -106 -208 -38 20 129 -243 98 138 -85 -212 -255
6494 -255 164 -94 -104 -278 -207 -5 56 -115 166 162 62 115 -164 175 -36 -127 8 159 -192 15 197 62
6516 62 130 8 -6 178 283 -100 40 185 40 -40 49 -164 -234 133 258 -227 166 -116 19 -24 191 -128
6538 -128 -8 29 -214 6 -37 104 54 -94 -133 35 -7 -50 20 72 46 267 -138 116 -24 -185 268 27 -87
6561 -87 -96 -51 -83 8 -109 -177 118 34 44 144 309 126 87 91 64 -60 197 -273 -126 36 -3 -77 -53 120 145 -111
6587 -111 118 -250 199 -29 35 292 -197 -85 194 -40 172 162 -4 44 -338 -22 -176 142 -9 -90 217
6608 217 179 -163 135 61 71 -245 -79 68 -108 -47 -138 286 21 -290 42 17 -99 127 -283 -30 -19 84
6630 84 20 8 -78 176 179 -103 214 59 138 10 9 79 20 -83 0 -112 -26 -441 2 -80 -32 -237 -284 -86 265
6655 265 143 140 -6 122 -187 -142 -174 0 -27 242 28 -29 166 -3 -44 53 184 -195 -147 46 114 0 37 10
6679 10 113 272 52 74 -153 -85 -294 -244 127 199 -78 125 94 -466 53 -159 309 -218 -22 -61 -109 230 30
6702 30 94 -55 -165 76 -127 76 -180 8 25 2 228 127 -235 -6 260 292 12 -95 64 -136 26 112
6724 112 167 155 69 95 80 56 44 -329 152 -51 153 19 75 -141 -53 -124 55 -186 -72 -76 28 -42 104 227
6748 227 -20 -102 -40 217 -18 -100 -84 6 -61 329 -159 211 91 93 6 33 -78 -50 -4 -24 -89 5 -107 79 54
6773 54 15 -12 100 35 5 -23 -101 -6 106 111 -1 -60 120 -123 101 97 189 1 41 -218 212 0 -306 186 152
6798 152 -38 114 -201 -78 70 -147 -118 -76 -37 -203 10 171 -198 276 -144 102 328 52 -75 -230 104
6819 104 22 65 25 -212 -52 147 -19 102 -29 -113 -46 -138 -126 69 109 -58 52 173 57 92 -167 369 183
6842 183 -78 -225 61 168 6 -77 53 120 26 122 -74 -256 27 -156 -101 151 4 253 -31 110 -52 -13
6864 -13 48 102 180 -83 -206 59 24 -114 108 55 -308 -23 -70 -24 280 229 63 66 -29 -22 -49 165 -43 -348 -136
6889 -136 168 29 -23 -90 171 -87 253 90 -76 66 -37 46 84 -155 -144 137 -132 234 77 -58 -383 -70
6911 -70 -74 66 61 -89 -14 -20 225 68 -61 23 -12 89 -112 111 -184 -93 -156 -41 -10 184 119 -73 98 35 241
6936 241 -98 325 -83 153 -59 26 107 2 -3 17 -81 -65 79 54 144 -138 102 171 234 -54 -153 -272 -84 -56
6960 -56 -211 -220 20 -60 -66 17 192 -17 -104 69 -125 -137 131 -96 147 -160 43 103 -117 8 -290 89 91 184
6984 184 6 230 138 -135 154 -161 144 274 -21 1 -46 32 -33 -43 211 -250 309 -285 -6 38 -282 54
7006 54 -116 41 149 -33 -217 198 75 279 70 183 122 -108 58 126 157 -1 -51 -9 16 234 253 -80 -70
7029 -70 -72 -105 -201 60 217 73 57 -37 151 -45 -187 58 59 64 -225 150 -68 13 131 66 153 207 -44 -77 26
7054 26 296 16 -389 -79 152 126 372 -158 -16 157 -228 161 166 -24 121 105 -38 164 75 5 110 239
7076 239 -174 45 -109 -99 -126 215 179 -23 19 -182 173 -174 124 -19 -17 -160 -203 225 -186 -142 -128 50 -197
7099 -197 -197 -91 93 -30 -72 22 93 121 -49 132 179 -200 -138 -30 47 -130 -106 -69 62 -26 23 78 -53 -124 293
7124 293 141 4 -397 -78 81 -3 -175 -205 13 -31 -49 17 35 175 -84 13 223 -111 60 378 61 -139
7146 -139 -210 110 -99 -247 -109 143 11 46 -327 -85 161 57 150 40 123 117 94 73 235 158 217 106 69 -137
7170 -137 129 -324 72 -110 94 139 7 -169 155 188 181 -226 -33 82 -175 45 -156 12 -158 15 19 -14
7192 -14 -30 -95 301 -79 -109 170 -25 28 -183 123 238 -103 -94 -98 99 -2 47 284 313 78 52 -384 -151 -45
7216 -45 175 204 14 -152 34 37 -122 120 53 -120 -163 35 -150 -121 216 56 -70 -117 50 -238 -17 189 -68
7239 -68 -86 -146 27 146 -38 -33 153 -55 -137 76 222 -259 -28 -57 -126 -219 -128 -32 -9 126 -14 -184 -81 33
7263 33 61 -114 137 76 22 128 -189 -134 46 -346 -79 -60 11 8 -158 -189 117 -48 -13 -66 -267 200 44 -414
7287 -414 164 -40 -186 107 53 40 -112 66 144 12 -173 85 6 82 127 -152 -137 -255 -173 124 -35 -62 274
7310 274 -151 22 85 250 139 -212 22 -103 -16 -25 220 -60 241 23 45 -388 259 47 -193 -46 -171 -48
7332 -48 91 49 272 153 -150 12 203 105 112 241 18 -61 304 49 148 58 -27 44 -134 108 61 246 -154 -275
7356 -275 -292 145 69 282 185 -75 -29 -69 167 195 -223 -191 -128 -127 4 -7 49 -199 20 20 -91 53 -81 113 324
7381 324 -153 -97 -45 62 -193 -102 -118 -175 -18 180 -60 -40 122 97 124 -92 -98 -46 -49 -150 -213 -227 74 195 -25
7406 -25 63 -151 174 -3 -114 127 150 158 -145 -162 96 108 44 255 -139 192 -75 -167 28 -44 318 -68 85
7429 85 5 -57 251 92 -190 -232 299 38 -239 -111 10 177 90 77 -151 363 -61 259 -351 104 -293 48
7451 48 51 34 127 -37 -78 -115 -205 223 -128 -67 135 127 -65 -152 55 60 146 61 72 -64 34 -224 -38 187 150 -178
7477 -178 14 293 21 -188 -89 -159 64 8 29 161 -98 2 -254 115 54 190 -103 -1 14 -51 105 -58
7499 -58 252 -112 159 -17 141 273 -60 -80 -203 20 -65 81 58 -42 -12 -7 87 166 108 118 -112 213 240 -7
7523 -7 -146 -85 101 72 276 67 183 -134 78 -71 178 7 -6 -83 4 149 -95 117 171 -170 267 -424 192
7546 192 267 -84 186 -97 95 -184 202 -158 -103 369 163 76 147 182 -7 -224 -41 108 4 24 121 86 71
7569 71 -35 205 -1 -164 249 279 34 205 -188 -1 -171 -84 153 -220 192 188 -57 111 -142 -18 393 310
7591 310 53 -14 18 -134 178 130 112 274 -33 -32 -57 41 -333 50 -29 -13 52 165 109 -9 -134 3 110 -8
7615 -8 -251 101 24 -96 -126 41 -60 -100 -80 -10 20 127 -228 -79 249 -191 30 88 -114 -93 -20 -172 -249 -370
7639 -370 -56 -255 47 -57 125 -54 -62 -83 121 -199 -4 172 -147 61 -53 -8 76 -26 52 -46 -251 77
7661 77 -63 77 2 37 -118 -199 -61 239 210 37 80 332 -187 -205 84 -44 -111 139 23 -140 242 124 214
7684 214 -83 -164 314 -93 98 132 -203 63 13 -150 74 379 -119 -134 -34 -51 -76 50 -123 76 17 -72 44
7707 44 57 -136 -97 262 -192 208 -109 -81 -188 5 -97 112 -61 148 128 58 294 93 -78 0 41 -115 -65
7730 -65 -95 92 -62 52 -147 -205 -200 -24 -50 -35 -257 -1 -163 -229 50 -247 153 -223 105 88 96 178 -105 -6
7754 -6 -73 291 -20 115 0 -253 3 -60 -8 -50 159 170 62 -265 -123 -18 33 -10 143 -9 -8 71 -285 11
7778 11 8 51 -168 116 32 -51 112 -232 25 118 98 329 -4 -152 -41 115 -86 -72 275 12 48 68 -112 205
7802 205 117 95 78 -27 146 131 -172 -81 28 75 -268 210 68 -233 97 -151 -28 14 -193 83 258 16
7824 16 -33 -89 -30 144 145 164 -118 14 -59 156 -137 72 56 -26 89 110 -209 -223 21 117 -89 -138 -214 12 -4
7849 -4 -290 174 93 55 161 -47 -256 -38 -75 109 -130 142 83 -166 -69 -81 -184 -2 62 -102 -40 93 -219
7872 -219 -270 -79 280 -113 -46 -76 -198 -216 41 116 190 -2 -120 76 122 -43 78 301 217 -301 -178 15 31
7895 31 -33 -279 103 17 145 -79 -138 51 -113 -143 304 -147 -494 231 -223 46 -178 278 55 -195 81 -211
7917 -211 -111 -43 4 -56 -149 -113 163 -59 -28 165 38 43 55 88 -130 48 -31 -174 -3 -81 162 -104 -135 161
7941 161 -6 245 -131 -71 -143 53 -156 -74 110 -191 67 301 20 125 -257 93 232 -87 -174 -167 72 -127
7963 -127 135 -21 -113 99 66 -74 -83 -76 115 -106 -105 -204 -347 1 85 58 292 -163 -269 -8 -262 308 -4 40
7987 40 170 146 15 -29 253 37 -132 221 -195 55 207 233 -70 111 -150 -108 56 -31 -60 163 62 -15 20
8010 20 262 -41 -56 34 8 223 -196 -18 -65 138 151 53 405 -138 -108 -104 -279 -99 -225 118 -60 1 -13 -305
8034 -305 -25 241 191 -142 84 -118 15 -70 5 59 -296 -167 -136 -62 58 87 21 -95 -104 165 -45 211 -18
8057 -18 44 -82 -198 134 64 -125 67 230 -59 105 64 -419 63 -135 -310 41 21 -136 34 190 -118 -41
8079 -41 -73 -144 2 170 -157 -22 -76 241 243 155 -8 15 -72 43 -159 -121 126 -53 2 251 34 88 -151 212
8103 212 -95 36 103 111 -427 -177 47 -150 86 44 319 38 57 131 127 272 223 -46 38 153 29 18 14 166
8127 166 274 -8 -6 46 -57 203 -280 292 -123 -51 169 7 -17 -141 46 51 -31 73 -62 86 -246 -104 98
8150 98 -148 -52 -187 261 149 -82 -161 -65 34 -109 236 0 -201 107 215 -105 -86 36 2 26 185 5 -76
8173 -76 -106 -59 -114 0 193 11 -118 -103 -182 303 -167 -113 -78 -64 119 -223 -68 -197
8191a97
##END NTUPLES=NMR FID
##END=
