##TITLE=1H_AM_DMAA.Per.2.29
 CDCl3
 8 sc, 
 6.04.2022
##JCAMPDX= 6.0         $$ Bruker NMR JCAMP-DX V2.0
##DATA TYPE= NMR FID
##DATA CLASS= NTUPLES
##ORIGIN= UXNMR, Bruker Analytische Messtechnik GmbH
##OWNER= root
$$ XWIN-NMR		Version 3.5
$$ Wed Apr  6 14:41:25 2022 Russian Standard Time (UT+4h)  she@DPX200
##.OBSERVE FREQUENCY= 200.131346
##.OBSERVE NUCLEUS= ^1H
##.DELAY= (6, 6)
##.ACQUISITION MODE= SIMULTANEOUS
##.ACQUISITION SCHEME= undefined
##.AVERAGES= 8
##.DIGITISER RES= 18
##SPECTROMETER/DATA SYSTEM= spect
##.PULSE SEQUENCE= zg30
##.SOLVENT NAME= DMSO
##.SHIFT REFERENCE= (INTERNAL, DMSO, 0, 15.7039)
##AUDIT TRAIL= $$ (NUMBER, WHEN, WHO, WHERE, WHAT)
$$ ##TITLE= Audit trail, XWIN-NMR		Version 3.5
$$ ##JCAMPDX= 5.01
$$ ##ORIGIN= Bruker BioSpin GmbH
$$ ##OWNER= she
$$ F:/spectra/data/she/nmr/H-F/1/audita.txt
$$ ##AUDIT TRAIL=  $$ (NUMBER, WHEN, WHO, WHERE, WHAT)
(   1,<2022-04-06 14:40:25.40 +0400>,<she>,<DPX200>,
      <created by zg, POWCHK disabled, PULCHK disabled
       configuration hash MD5:
       00 E9 B6 7A A2 85 ED C7 34 08 36 98 17 FE 4E 26
       data hash MD5: 16K
       17 EA 62 37 85 C9 D5 44 45 4C CE 3F C8 C7 F6 B8>)
$$ ##END=
$$ 
$$ hash MD5
$$ 27 60 AA C9 E3 6E 35 77 45 2F FB 3E 90 43 9C 34
##$RELAX= 
##$RELAX= 
##$RELAX= 
##$RELAX= 
##$RELAX= 
##$RELAX= 
$$ Bruker specific parameters
$$ --------------------------
##$DU= <F:/spectra>
##$EXPNO= 1
##$NAME= <H-F>
##$PROCNO= 1
##$TYPE= <nmr>
##$USER= <she>
##$AMP= (0..31)
100 100 100 100 100 100 100 100 100 100 100 100 100 100 100 100 100 100 
100 100 100 100 100 100 100 100 100 100 100 100 100 100 
##$AQSEQ= 0
##$AQ_mod= 1
##$AUNM= <au_zg>
##$AUTOPOS= <>
##$BF1= 200.13
##$BF2= 200.13
##$BF3= 200.13
##$BF4= 200.13
##$BF5= 200.13
##$BF6= 200.13
##$BF7= 200.13
##$BF8= 200.13
##$BYTORDA= 1
##$CFDGTYP= 0
##$CFRGTYP= 5
##$CHEMSTR= <none>
##$CNST= (0..31)
1 1 145 1 1 1 1 1 1 1 1 1 1 1 1 1 1 1 1 1 1 1 1 1 1 1 1 1 1 1 1 1 
##$CPDPRG= <>
##$CPDPRG1= <>
##$CPDPRG2= <>
##$CPDPRG3= <>
##$CPDPRG4= <mlev>
##$CPDPRG5= <mlev>
##$CPDPRG6= <mlev>
##$CPDPRG7= <mlev>
##$CPDPRG8= <mlev>
##$CPDPRGB= <>
##$CPDPRGT= <>
##$D= (0..31)
0 1.2 0 0 0 0 0 0 0 0.06 0 0.03 0 0 0 0 0.0002 0 0 0 0 0 0 0 0 0 0 0 0 
0 0 0 
##$DATE= 1649241624
##$DBL= (0..7)
120 120 120 120 120 120 120 120 
##$DBP= (0..7)
150 150 150 150 150 150 150 150 
##$DBP07= 0
##$DBPNAM0= <>
##$DBPNAM1= <>
##$DBPNAM2= <>
##$DBPNAM3= <>
##$DBPNAM4= <>
##$DBPNAM5= <>
##$DBPNAM6= <>
##$DBPNAM7= <>
##$DBPOAL= (0..7)
0.5 0.5 0.5 0.5 0.5 0.5 0.5 0.5 
##$DBPOFFS= (0..7)
0 0 0 0 0 0 0 0 
##$DE= 6
##$DECBNUC= <off>
##$DECIM= 32
##$DECNUC= <off>
##$DECSTAT= 4
##$DIGMOD= 1
##$DIGTYP= 9
##$DL= (0..7)
0 120 120 120 120 120 120 120 
##$DP= (0..7)
150 150 150 150 150 150 150 150 
##$DP07= 0
##$DPNAME0= <>
##$DPNAME1= <>
##$DPNAME2= <>
##$DPNAME3= <>
##$DPNAME4= <>
##$DPNAME5= <>
##$DPNAME6= <>
##$DPNAME7= <>
##$DPOAL= (0..7)
0.5 0.5 0.5 0.5 0.5 0.5 0.5 0.5 
##$DPOFFS= (0..7)
0 0 0 0 0 0 0 0 
##$DQDMODE= 0
##$DR= 18
##$DS= 0
##$DSLIST= <SSSSSSSSSSSSSSS>
$$ [...]
##$SUBNAM2= <"">
##$SUBNAM3= <"">
##$SUBNAM4= <"">
##$SUBNAM5= <"">
##$SUBNAM6= <"">
##$SUBNAM7= <"">
##$SUBNAM8= <"">
##$SUBNAM9= <"">
##$SW= 18.0517287032376
##$SWIBOX= (0..15)
0 0 2 0 0 0 0 0 0 0 0 0 0 0 0 0 
##$SW_h= 3612.71676300578
##$TD= 16384
##$TD0= 1
##$TE= 0
##$TE2= 300
##$TE3= 300
##$TEG= 300
##$TL= (0..7)
0 120 120 120 120 120 120 120 
##$TP= (0..7)
150 150 150 150 150 150 150 150 
##$TP07= 0
##$TPNAME0= <>
##$TPNAME1= <>
##$TPNAME2= <>
##$TPNAME3= <>
##$TPNAME4= <>
##$TPNAME5= <>
##$TPNAME6= <>
##$TPNAME7= <>
##$TPOAL= (0..7)
0.5 0.5 0.5 0.5 0.5 0.5 0.5 0.5 
##$TPOFFS= (0..7)
0 0 0 0 0 0 0 0 
##$TUNHIN= 0
##$TUNHOUT= 0
##$TUNXOUT= 0
##$USERA1= <user>
##$USERA2= <user>
##$USERA3= <user>
##$USERA4= <user>
##$USERA5= <user>
##$V9= 5
##$VALIST= <valist>
##$VCLIST= <CCCCCCCCCCCCCCC>
##$VD= 0
##$VDLIST= <DDDDDDDDDDDDDDD>
##$VPLIST= <PPPPPPPPPPPPPPP>
##$VTLIST= <TTTTTTTTTTTTTTT>
##$WBST= 1024
##$WBSW= 4
##$XGAIN= (0..3)
0 0 0 0 
##$XL= 0
##$YL= 0
##$YMAX_a= 222831
##$YMIN_a= -228684
##$ZGOPTNS= <>
##$ZL1= 120
##$ZL2= 120
##$ZL3= 120
##$ZL4= 120
##$ABSF1= 10
##$ABSF2= 0
##$ABSG= 5
##$ABSL= 3
##$ALPHA= 0
##$AQORDER= 0
##$ASSFAC= 0
##$ASSFACI= 0
##$ASSFACX= 0
##$ASSWID= 0
##$AUNMP= <proc_1d>
##$AZFE= 0.1
##$AZFW= 0.1
##$BCFW= 1
##$BC_mod= 2
##$BYTORDP= 1
##$COROFFS= 0
##$CY= 11.3945322036743
##$DATMOD= 1
##$DC= 2
##$DFILT= <>
##$DTYPP= 0
##$F1P= 2.36226072786647
##$F2P= -0.459571619588291
##$FCOR= 0.5
##$FTSIZE= 0
##$FT_mod= 4
##$GAMMA= 1
##$GB= 0.15
##$INTBC= 1
##$INTSCL= 1
##$ISEN= 128
##$LB= 0.24
##$LEV0= 0
##$LPBIN= 0
##$MAXI= 10000
##$MC2= 0
##$MEAN= 0
##$ME_mod= 0
##$MI= 1.114404
##$NCOEF= 0
##$NC_proc= 0
##$NLEV= 6
##$NOISF1= 3.799351
##$NOISF2= 2.8
##$NSP= 1
##$NTH_PI= 0
##$NZP= 0
##$OFFSET= 15.70392
##$PC= 1
##$PHC0= -17944.32
##$PHC1= 17.60078
##$PH_mod= 1
##$PKNL= yes
##$PPARMOD= 0
##$PSCAL= 0
##$PSIGN= 0
##$REVERSE= no
##$SF= 200.130013532006
##$SI= 16384
##$SIGF1= 3
##$SIGF2= 2
##$SINO= 400
##$SIOLD= 16384
##$SREGLST= <1H.CDCl3>
##$SSB= 0
##$STSI= 0
##$STSR= 0
##$SW_p= 3612.71676300578
##$SYMM= 0
##$S_DEV= 0
##$TDeff= 0
##$TDoff= 0
##$TI= <>
##$TILT= no
##$TM1= 0
##$TM2= 0
##$TOPLEV= 0
##$USERP1= <user>
##$USERP2= <user>
##$USERP3= <user>
##$USERP4= <user>
##$USERP5= <user>
##$WDW= 1
##$XDIM= 8192
##$YMAX_p= 0
##$YMIN_p= 0
$$ End of Bruker specific parameters
$$ ---------------------------------
##NTUPLES= NMR FID
##VAR_NAME=  TIME,          FID/REAL,        FID/IMAG
##SYMBOL=    X,             R,               I
##VAR_TYPE=  INDEPENDENT,   DEPENDENT,       DEPENDENT
##VAR_FORM=  AFFN,          ASDF,            ASDF
##VAR_DIM=   8192,          8192,            8192
##UNITS=     SECONDS,       ARBITRARY UNITS, ARBITRARY UNITS
##FACTOR=    0.0002768,     1,               1
##FIRST=     0,             0,               0
##LAST=      2.2672688,     0,               0
##MIN=       0,             -228684,         0
##MAX=       2.2672688,     222831,          0
$$ Real data points
##PAGE= N=1
##DATA TABLE= (X++(R..R)), XYDATA
0 0 0 0 0 0 0 0 0 0 0 0 0 0 0 0 0 0 -8 8 -8 8 -8 13 -16 16 -16 24 -24 30 -32 40 -43 48 -56 64 -70 80 -88 100
38 100 -110 125 -137 152 -170 186 -204 226 -249 275 -303 335 -367 405 -449 495 -547 607 -677 756
58 756 -853 965 -1106 1281 -1507 1813 -2252 2924 -4075 6418 -12988 68320 222831 -52849
72 -52849 -202305 25261 169988 112 -118627 -33283 62770 62711 -2566 -93458 -51524 116457
84 116457 98001 -134143 -130070 140446 148641 -136534 -150635 119905 140027 -92368 -116559
95 -116559 55568 86205 -12755 -50626 -31851 15620 73973 16426 -109509 -41494 134641
106 134641 57883 -147802 -64976 146723 62705 -132949 -53547 106849 39231 -72219 -23459
117 -23459 31857 8573 9565 3123 -47907 -9828 79695 11582 -101106 -7670 111227 206
129 206 -108331 10268 94304 -21089 -70900 30565 41671 -36919 -10801 38404 -18256 -35106
141 -35106 41208 26087 -56407 -12953 61589 -3634 -57331 21277 44384 -38130 -24984 52372
153 52372 2359 -61760 20798 65954 -40398 -63754 54428 56274 -59797 -43749 56054 28073
165 28073 -42864 -10694 21551 -6835 5188 22602 -34676 -35969 62365 45180 -85359 -50630
177 -50630 99709 51636 -103511 -49099 95604 43866 -76270 -36579 47763 29024 -12171
188 -12171 -21262 -25738 14837 62953 -9117 -94793 4554 118311 -391 -130799 -4058 130778
200 130778 9070 -118542 -15665 94651 23294 -62099 -32389 23428 41624 16959 -50396
211 -50396 -55493 57294 88368 -60880 -112303 60376 125658 -54423 -126883 43477 116970
222 116970 -26921 -96704 6346 69043 17181 -36780 -41493 3321 64208 27845 -83297
233 -83297 -54377 95942 73413 -101125 -84478 97189 86622 -84577 -81051 63752 68895
244 68895 -36618 -52139 5855 33387 26015 -14285 -55303 -2531 79897 16278 -96705 -25503
256 -25503 104707 30501 -102829 -31525 91443 29239 -72026 -25097 46186 19782 -17157
267 -17157 -14961 -12582 10890 39566 -8624 -61483 8129 75946 -9227 -81794 11544 78941
279 78941 -13945 -67689 16227 50387 -16809 -28778 15764 6166 -12161 15165 6448 -32506
291 -32506 1188 43802 -10191 -48421 19143 45625 -27404 -36706 33447 22749 -36987 -6301
303 -6301 37213 -10511 -34147 25282 28272 -35641 -19924 40539 10527 -38558 -478 30505
315 30505 -8530 -16681 16191 -684 -21636 19734 24756 -37866 -25572 52596 24146 -62226
327 -62226 -21486 64756 17730 -60089 -14022 47858 10650 -29604 -8336 6911 7240 17869
339 17869 -7158 -41817 8052 62792 -8781 -77793 9320 85791 -8268 -85221 5589 76510
351 76510 -606 -60292 -6578 38208 15342 -12820 -25340 -13781 34838 38430 -43225 -59358
363 -59358 48593 74202 -50186 -82073 46983 82489 -38713 -75609 25817 62801 -8659
374 -8659 -45066 -10767 24921 31290 -3775 -50319 -15894 66228 32761 -76841 -45379 80831
386 80831 52949 -77627 -55540 66947 53074 -49965 -46935 27754 37621 -2793 -26952 -22728
398 -22728 15997 46319 -5776 -65571 -2619 78726 9210 -84193 -13321 81948 15826 -71863
410 -71863 -16683 55487 16825 -34279 -16586 10653 16394 12789 -16723 -34097 17165 50714
422 50714 -17955 -61526 18307 65363 -18223 -62487 17043 53423 -14468 -39550 10578 22832
434 22832 -5080 -5042 -1233 -11285 8388 24933 -15299 -33925 21713 37831 -26646 -36338 29592
447 29592 29913 -30258 -19994 28171 7673 -23945 4651 17500 -15773 -9845 23732 1490 -27649
460 -27649 6509 26958 -13288 -21570 18355 12549 -20911 -667 21278 -11985 -19162 24220 15523
473 15523 -33980 -10674 40123 5636 -41725 -1309 38185 -1914 -30101 3202 17760 -2844
485 -2844 -3006 589 -13066 2746 28459 -6695 -41621 10371 51075 -12870 -55595 13698 54926
498 54926 -12001 -48664 8022 37901 -1439 -23332 -6760 6794 16127 10270 -25527 -26101 33632
511 33632 39049 -39481 -48358 41786 52808 -40194 -52659 33970 47898 -23703 -39508 9939
523 9939 28404 6148 -15719 -22780 2976 38582 9107 -51397 -19208 60179 27094 -63380
535 -63380 -32021 60810 34197 -52336 -33823 38612 31151 -21141 -27064 1239 21755 18695 -16275
548 -16275 -37130 10527 51877 -5280 -61721 601 65671 3469 -63289 -6757 55208 9791
560 9791 -41896 -12192 25332 14644 -6796 -16763 -11377 18799 27643 -20459 -40421 21354 48384
573 48384 -21412 -51290 19971 48682 -17233 -41679 12704 30811 -6910 -17872 -54 4269
585 4269 7559 8338 -14828 -18628 21328 25852 -26010 -28907 28785 28346 -28902 -24077 26675 17252
599 17252 -21977 -8755 15462 -86 -7790 7848 -399 -13879 7979 16964 -14531 -17170 19081
612 19081 14155 -21489 -8677 21408 1305 -19000 6852 14847 -14425 -9195 20723 3297 -24402
625 -24402 2516 25266 -6992 -22706 9843 17272 -10512 -9295 8937 -291 -5523 10261 636
638 636 -19856 4660 27593 -9803 -32956 13644 35087 -15573 -33898 15021 29520 -11811
650 -11811 -22242 6234 13191 1365 -2849 -9869 -7343 18603 16844 -26084 -24508 31531 29753
663 29753 -34041 -32401 32890 32037 -28254 -29276 19997 24154 -9209 -17712 -3567 10330 16679
676 16679 -2886 -28972 -4043 39207 10063 -45919 -14602 48625 17881 -46491 -19567 40001
688 40001 20162 -29320 -19569 15804 18313 -513 -16538 -14985 14297 28963 -11949 -40313 9113
701 9113 47567 -6282 -50448 2957 48367 527 -41922 -4331 31740 8373 -18966 -12266
713 -12266 5097 16054 8693 -19046 -20749 21375 30349 -22273 -36195 21874 38305 -19713 -36504
726 -36504 15937 31281 -10680 -23526 4105 13978 2998 -4220 -10375 -5059 17076 12656 -22590
739 -22590 -18031 26278 20734 -27610 -20550 26542 18128 -22908 -13612 17396 8181 -10109 -2302
752 -2302 2280 -2917 5562 6897 -12519 -9257 17799 9564 -21063 -8180 21751 5007 -20235
765 -20235 -982 16496 -3572 -11333 7768 5267 -11037 896 12972 -6216 -13011 10362 11411
778 11411 -12502 -7955 12702 3333 -10746 2118 7143 -7716 -2339 12788 -3030 -16825 7975
791 7975 19178 -12048 -19845 14223 18486 -14444 -15494 12168 10989 -7849 -5577 1800 -119 5344
805 5344 5794 -12515 -10629 19069 14516 -23766 -16845 26266 17929 -25742 -17452 22383 15833 -16308
819 -16308 -13244 8015 9952 1516 -6565 -11541 2927 20727 310 -28352 -3286 33327 5709
832 5709 -35261 -7708 33744 9290 -28881 -10386 21259 11352 -11321 -11860 392 12360 10821
845 10821 -12297 -20905 11947 29061 -10972 -34396 9237 36365 -6860 -34998 3517 30283
857 30283 339 -23025 -4802 13783 9327 -3745 -13672 -6174 17348 15006 -19861 -21770 21041
870 21041 26176 -20372 -27649 18126 26546 -14083 -22927 8757 17524 -2454 -10966 -4245 4051 10691
884 10691 2378 -16507 -7898 20788 11740 -23405 -13996 23839 14366 -22135 -13120 18398 10677
897 10677 -12942 -7313 6458 3853 694 -553 -7354 -1979 13276 3683 -17490 -4186 19795
910 19795 3701 -19919 -2351 17851 350 -14066 1687 8896 -3707 -3203 4993 -2547 -5597
923 -5597 7383 5281 -10948 -4041 12834 2098 -12746 533 10956 -3217 -7569 5949 3354
936 3354 -8024 1403 9601 -5769 -10206 9324 9840 -11485 -8569 11908 6502 -10578 -3995 7373
950 7373 1047 -3007 1747 -2380 -4364 7843 6390 -12886 -7872 16731 8646 -18769 -8660 18866
964 18866 8284 -16573 -7290 12391 6167 -6390 -4841 -502 3588 7736 -2420 -14580 1254
977 1254 20032 -248 -23733 -843 24999 1865 -23903 -3175 20358 4491 -14846 -5938
989 -5938 7896 7405 -67 -8735 -7600 9878 14652 -10380 -20136 10357 23799 -9395 -25145 7551
1003 7551 24141 -4849 -21076 1307 16053 2700 -9931 -7043 3028 11095 3650 -14694 -9709
1016 -9709 17237 14455 -18403 -17569 18065 18856 -15977 -18263 12440 16158 -7541 -12653 1930 8503
1030 8503 4085 -3996 -9786 -242 14671 3870 -18285 -6656 20127 8269 -20146 -8991 18165
1043 18165 8592 -14676 -7625 9754 6031 -4085 -4291 -1816 2661 7369 -1146 -11919 216 15227
1057 15227 471 -16749 -504 16570 426 -14603 14 11291 -491 -6937 817 2128
1069 2128 -954 2572 745 -6677 -286 9643 -622 -11241 1565 11230 -2704 -9767 3691 7060
1083 7060 -4422 -3520 4892 -237 -4792 3973 4408 -6898 -3482 8821 2319 -9348 -946 8578
1097 8578 -374 -6417 1604 3229 -2650 514 3221 -4493 -3553 8029 3541 -10917 -3255 12531
1111 12531 2881 -12684 -2403 11418 2034 -8673 -1759 4824 1778 -158 -1895 -4592 2168 9214
1125 9214 -2382 -12959 2507 15486 -2399 -16520 1830 15856 -938 -13658 -477 10007
1137 10007 2175 -5465 -4178 381 6145 4682 -7879 -9218 9218 12883 -9670 -15162 9422 16129
1151 16129 -8011 -15504 5852 13624 -2718 -10580 -817 6795 4676 -2653 -8417 -1512 11590 5192
1165 5192 -13960 -8288 15014 10342 -14858 -11495 13192 11524 -10304 -10605 6347 8971 -1655
1178 -1655 -6676 -3166 4286 7888 -1734 -11782 -482 14667 2436 -16065 -3784 15949 4698
1191 4698 -14301 -5078 11288 4999 -7305 -4687 2676 4118 1992 -3630 -6317 3048 9810 -2592
1205 -2592 -12204 2164 13312 -1734 -12924 1350 11369 -771 -8620 265 5245 477 -1564
1218 -1564 -1237 -2030 2036 5105 -2830 -7389 3426 8600 -3937 -8708 4061 7664 -3942 -5806
1232 -5806 3473 3251 -2719 -472 1704 -2240 -546 4496 -610 -5952 1734 6567 -2513 -6111 3046
1247 3046 4795 -3153 -2725 2892 247 -2277 2410 1381 -4841 -483 6677 -441 -7867 1111 8002
1262 8002 -1538 -7272 1468 5601 -1058 -3271 298 452 745 2546 -1820 -5240 2892 7650 -3559
1277 -3559 -9160 3972 9940 -3721 -9626 2993 8434 -1671 -6417 -119 3724 2101 -867 -4220
1291 -4220 -2172 6004 4869 -7539 -7125 8273 8641 -8269 -9318 7420 9216 -5650 -8193 3226
1305 3226 6658 -207 -4549 -2917 2353 5997 -38 -8633 -2103 10632 3872 -11623 -5217 11532
1319 11532 5994 -10400 -6414 8141 6265 -5157 -5793 1599 5035 2095 -4038 -5640 2963 8662
1333 8662 -1766 -10813 688 11910 446 -11846 -1376 10720 2228 -8522 -2919 5610 3505
1346 3505 -2266 -3884 -1192 4106 4354 -4203 -6968 4008 8751 -3693 -9570 3111 9352 -2270
1360 -2270 -8206 1349 6339 -227 -3937 -961 1351 2221 1226 -3215 -3311 4109 4989 -4593 -5913 4750
1376 4750 6086 -4476 -5559 3788 4356 -2820 -2821 1497 1016 -191 738 -1248 -2286 2395 3360 -3254
1392 -3254 -3914 3741 3902 -3760 -3231 3420 2230 -2587 -779 1621 -704 -365 2208 -788 -3367 1801
1408 1801 4068 -2550 -4344 2807 3990 -2719 -3263 2115 2013 -1200 -531 -45 -1099 1314 2643 -2530
1424 -2530 -3861 3497 4780 -3992 -5191 4096 5209 -3528 -4606 2531 3688 -1016 -2387 -720 959
1439 959 2566 573 -4268 -1983 5576 3172 -6458 -4115 6617 4626 -6115 -4817 4872 4578 -3082
1454 -3082 -4033 881 3256 1531 -2227 -3855 1178 5922 -54 -7416 -907 8314 1847 -8335 -2498
1469 -2498 7584 3062 -6101 -3435 3978 3619 -1526 -3686 -1156 3526 3634 -3268 -5813 2807 7420
1484 7420 -2195 -8279 1449 8373 -516 -7628 -408 6275 1475 -4229 -2423 2054 3308 315 -3929
1499 -3929 -2542 4321 4377 -4410 -5748 4132 6357 -3598 -6464 2634 5808 -1570 -4732 224 3214
1514 3214 1108 -1544 -2384 -161 3457 1701 -4222 -2814 4685 3613 -4610 -3850 4254 3739 -3373 -3134
1530 -3134 2312 2321 -969 -1336 -486 270 1811 623 -2900 -1422 3615 1822 -4011 -2025 3864 1855
1546 1855 -3324 -1482 2419 893 -1294 -197 22 -498 1195 1157 -2115 -1568 2849 1832 -3097 -1803
1562 -1803 2948 1588 -2420 -1109 1521 513 -435 151 -764 -858 1889 1423 -2861 -1909 3372 2147 -3550
1579 -3550 -2224 3276 2126 -2519 -1846 1433 1426 -67 -881 -1355 339 2799 267 -3886 -783 4650
1595 4650 1268 -4940 -1683 4658 1917 -3968 -2153 2731 2188 -1236 -2157 -512 1961 2211 -1660 -3712
1611 -3712 1266 4905 -783 -5551 274 5747 433 -5307 -1015 4426 1605 -3107 -2174 1481 2635
1626 2635 267 -3003 -1997 3078 3421 -3030 -4615 2680 5261 -2184 -5496 1399 5149 -484 -4353
1641 -4353 -512 3266 1579 -1804 -2515 350 3348 1155 -3818 -2373 4092 3346 -3939 -3943 3460 4140
1657 4140 -2700 -3954 1632 3406 -423 -2633 -892 1597 2046 -594 -3084 -424 3706 1256 -4084
1672 -4084 -1893 4019 2253 -3583 -2357 2874 2290 -1836 -1935 682 1522 555 -935 -1660 419 2592
1688 2592 97 -3210 -484 3455 758 -3377 -936 2871 910 -2131 -846 1137 639 -79 -428 -960
1704 -960 188 1862 75 -2464 -213 2793 368 -2670 -439 2311 463 -1605 -405 734 243
1719 243 233 -138 -1210 -57 1957 185 -2532 -406 2699 542 -2626 -657 2184 724 -1476 -781
1735 -781 559 751 495 -651 -1460 606 2415 -375 -2997 182 3351 116 -3300 -420 2940 758
1751 758 -2253 -1059 1239 1342 -183 -1589 -1020 1668 2058 -1653 -2953 1462 3501 -1167 -3740 734
1767 734 3637 -140 -3130 -486 2401 1183 -1357 -1770 315 2296 865 -2616 -1800 2772 2645 -2631
1783 -2631 -3198 2271 3414 -1740 -3443 927 3063 -79 -2494 -907 1694 1758 -839 -2591 -113 3131
1799 3131 951 -3421 -1665 3414 2185 -3068 -2495 2472 2623 -1615 -2473 608 2114 491 -1680 -1530
1815 -1530 1080 2401 -498 -3054 -130 3374 648 -3367 -1092 3060 1347 -2431 -1526 1625 1575 -617
1831 -617 -1472 -340 1317 1301 -1033 -2010 737 2583 -373 -2805 62 2754 263 -2427 -491 1858
1847 1858 652 -1119 -835 258 853 552 -874 -1258 792 1789 -663 -2103 465 2180 -271 -1959
1863 -1959 50 1560 220 -885 -397 226 583 481 -660 -1104 714 1587 -636 -1915 470 1892
1879 1892 -329 -1753 17 1307 217 -772 -516 84 685 577 -878 -1177 957 1682 -852 -1999 748
1896 748 2136 -442 -1955 138 1652 296 -1158 -673 558 1076 146 -1364 -794 1557 1370 -1591
1912 -1591 -1862 1459 2138 -1206 -2215 739 2058 -201 -1732 -383 1274 994 -616 -1553 15 1985
1928 1985 638 -2176 -1172 2244 1667 -2028 -1926 1643 2044 -1103 -1975 380 1755 350 -1404 -1087
1944 -1087 919 1691 -422 -2233 -100 2509 593 -2545 -1016 2392 1380 -1934 -1572 1397 1658 -646
1960 -646 -1598 -122 1457 915 -1191 -1586 852 2070 -481 -2405 41 2436 308 -2323 -670 1884
1976 1884 926 -1311 -1179 644 1274 76 -1239 -776 1214 1348 -1011 -1763 770 2020 -429 -1972
1992 -1972 139 1822 218 -1456 -485 972 756 -356 -939 -150 1041 675 -1067 -1166 944 1390 -811
2009 -811 -1559 532 1458 -270 -1288 -41 959 329 -503 -574 42 822 433 -911 -784 947 1077 -820
2027 -820 -1215 658 1237 -369 -1096 73 827 221 -493 -564 63 741 340 -952 -695 973 993 -930 -1147
2046 -1147 774 1216 -458 -1109 140 953 260 -588 -593 301 916 112 -1142 -456 1254 763 -1265 -1048
2064 -1048 1079 1189 -844 -1239 435 1166 -38 -982 -434 739 864 -393 -1198 49 1476 355 -1542
2081 -1542 -630 1517 966 -1270 -1106 947 1194 -470 -1152 -54 1053 504 -859 -1004 562 1353 -268
2098 -268 -1626 -50 1679 359 -1663 -653 1397 859 -1026 -1024 591 1115 -80 -1075 -421 1026 928
2115 928 -828 -1212 640 1509 -294 -1615 24 1561 288 -1372 -574 994 771 -609 -968 114
2131 114 1011 324 -1032 -769 891 1066 -731 -1301 475 1380 -210 -1282 -49 1127 366 -782 -601
2148 -601 438 815 -86 -904 -278 943 617 -890 -871 742 990 -567 -1052 285 962 -21 -807 -231
2166 -231 565 498 -264 -685 6 830 309 -831 -519 814 728 -676 -824 456 831 -187 -731 -70 584
2185 584 331 -357 -569 105 700 132 -808 -406 795 564 -736 -653 496 716 -277 -665 30 615 263
2204 263 -431 -491 253 697 -15 -807 -200 882 413 -804 -552 657 657 -439 -732 166 665 55 -583 -416
2224 -416 413 610 -273 -810 51 905 180 -930 -376 862 517 -650 -664 433 721 -115 -687 -159 679
2243 679 479 -517 -676 335 881 -84 -970 -101 946 312 -859 -518 642 615 -449 -739 112 719 135
2262 135 -697 -461 582 692 -406 -846 238 946 -25 -922 -156 826 356 -674 -509 416 635 -154 -718
2281 -718 -105 687 392 -626 -609 498 763 -329 -831 103 832 103 -732 -283 604 452 -384 -591 128
2300 128 669 105 -644 -331 584 533 -484 -657 342 709 -118 -711 -47 624 216 -504 -387 270 507 -99
2320 -99 -587 -130 574 314 -551 -465 440 549 -304 -578 164 612 36 -517 -220 392 367 -224 -439 31 510
2341 510 101 -524 -295 460 392 -382 -508 210 521 -87 -510 -118 406 232 -306 -362 170 462 5 -473 -132
2362 -132 488 312 -403 -398 343 465 -141 -456 41 437 117 -336 -281 252 362 -102 -465 -38 490 170 -457
2383 -457 -276 387 372 -257 -414 129 416 64 -398 -176 283 309 -180 -371 77 488 63 -464 -192 445 305
2404 305 -378 -396 234 404 -87 -409 -57 370 245 -264 -321 169 443 -36 -498 -69 480 206 -421 -291 336
2425 336 420 -220 -390 76 408 60 -370 -221 268 332 -191 -445 48 471 56 -501 -192 423 270 -345 -339
2446 -339 196 365 -66 -368 -88 332 246 -264 -342 207 475 -53 -472 -18 480 143 -413 -212 336 320 -224
2467 -224 -340 45 320 82 -349 -246 242 337 -201 -407 99 465 -26 -437 -74 389 161 -285 -225 198 289
2488 289 -26 -265 -59 281 212 -229 -258 202 361 -144 -384 53 376 41 -288 -101 185 175 -105 -217 -4
2509 -4 207 106 -243 -213 202 303 -180 -311 105 316 -37 -246 -21 204 106 -140 -129 27 169 87 -206 -161
2531 -161 175 211 -174 -246 122 266 -65 -241 -6 189 50 -106 -125 16 162 66 -173 -155 222 205 -138 -240
2553 -240 155 248 -78 -249 8 198 61 -109 -169 20 174 36 -255 -158 244 210 -259 -281 191 311 -133 -289
2575 -289 76 268 79 -159 -131 127 209 12 -258 -48 349 157 -301 -224 287 265 -253 -307 145 269 -52 -277
2597 -277 -58 191 155 -152 -259 61 368 11 -373 -109 390 181 -350 -210 297 270 -144 -277 97 273 43
2618 43 -201 -167 173 283 -60 -343 18 390 25 -372 -92 334 132 -271 -189 181 193 -74 -196 -51 181
2639 181 159 -140 -263 92 314 -59 -323 45 344 41 -270 -71 208 111 -119 -117 -5 148 96 -141 -200 115
2661 115 265 -114 -273 57 264 -21 -243 20 178 60 -91 -84 2 112 87 -91 -158 94 237 -81 -243 46
2683 46 259 5 -229 -42 149 35 -76 -90 -24 121 114 -142 -179 103 246 -99 -284 78 326 1 -232 13
2705 13 205 90 -98 -112 13 172 86 -204 -171 215 308 -208 -322 158 357 -105 -372 -3 285 71 -222 -153
2727 -153 111 202 5 -274 -105 313 238 -304 -280 296 343 -223 -361 129 331 -39 -304 -72 245 183 -141 -297
2749 -297 20 355 54 -371 -170 393 229 -363 -307 259 309 -195 -346 63 289 38 -228 -180 157 274 -77
2770 -77 -373 -17 424 102 -393 -183 359 236 -278 -248 184 239 -93 -252 -85 188 172 -144 -279 105 358
2791 358 -7 -383 -37 384 122 -312 -109 254 185 -145 -189 47 176 114 -193 -209 111 309 -74 -321 38
2812 38 328 1 -339 -94 241 78 -156 -172 33 152 56 -144 -171 132 250 -106 -325 69 327 17 -270
2833 -270 -34 250 109 -170 -134 81 190 47 -175 -168 186 255 -182 -352 111 342 -71 -366 -43 298 77
2854 77 -238 -193 124 241 -1 -264 -116 288 223 -269 -301 223 387 -143 -412 92 359 16 -318 -122 247
2875 247 226 -130 -304 -33 344 111 -385 -241 358 325 -284 -384 225 428 -121 -417 -9 331 129 -248 -272
2896 -272 152 353 -49 -428 -75 464 194 -439 -284 353 330 -285 -397 169 347 -17 -310 -134 253 248 -175
2917 -175 -337 88 449 4 -464 -87 450 204 -384 -262 291 299 -143 -315 44 307 108 -284 -269 193 353
2938 353 -122 -439 31 443 32 -436 -147 344 216 -246 -272 138 294 15 -258 -141 264 264 -198 -335 127
2959 127 424 -35 -388 -1 354 108 -272 -184 202 228 -56 -244 -78 269 166 -253 -301 184 324 -137 -394
2980 -394 22 396 36 -325 -149 234 219 -109 -252 -10 291 164 -273 -266 244 348 -201 -428 98 377 -1
3001 -1 -353 -118 310 194 -189 -265 76 321 58 -324 -182 343 277 -291 -373 208 429 -130 -398 -27 401 112
3023 112 -320 -247 169 314 -46 -411 -50 432 167 -432 -297 347 358 -281 -406 160 422 -6 -400 -145 334
3044 334 276 -217 -360 118 455 35 -478 -115 467 268 -407 -329 297 400 -169 -404 21 387 96 -323 -270
3065 -270 241 377 -168 -474 23 506 86 -490 -157 423 288 -308 -318 187 380 -13 -355 -94 338 271 -275
3086 -275 -363 199 445 -63 -463 -28 478 144 -399 -224 299 293 -162 -351 12 359 124 -341 -259 288 373 -200
3108 -200 -408 114 445 10 -414 -118 346 201 -271 -278 90 329 1 -362 -144 314 271 -310 -356 196 394
3129 394 -105 -406 4 375 133 -287 -224 188 303 -81 -356 -54 360 171 -350 -274 282 380 -197 -413 83
3150 83 407 44 -373 -186 277 279 -163 -357 27 396 97 -402 -168 370 308 -287 -369 191 421 -55 -396 -49
3172 -49 367 208 -264 -293 207 379 -47 -430 -61 450 197 -410 -290 313 349 -205 -426 84 400 51 -380
3193 -380 -247 291 333 -193 -440 79 465 49 -470 -159 446 298 -340 -324 243 430 -97 -405 -54 387 227
3214 227 -320 -352 216 442 -118 -493 -11 483 136 -461 -217 358 323 -218 -407 110 398 51 -403 -196 325
3235 325 326 -265 -415 150 457 -21 -459 -89 431 214 -343 -307 228 355 -102 -418 -55 375 203 -372 -318
3256 -318 289 396 -187 -437 67 428 72 -410 -154 339 300 -210 -329 84 379 39 -376 -160 345 288 -291
3277 -291 -359 173 408 -54 -387 -51 378 169 -328 -281 160 371 -64 -384 -44 398 190 -338 -281 286 382
3298 382 -145 -387 52 406 108 -364 -228 274 342 -166 -403 37 424 61 -394 -197 337 275 -284 -352 157
3319 157 384 -18 -388 -121 354 251 -265 -318 163 409 -44 -434 -85 457 207 -373 -301 284 367 -175 -397
3340 -397 0 420 131 -372 -262 296 350 -199 -415 82 463 68 -453 -195 390 278 -309 -328 156 411 -45
3361 -45 -414 -116 360 263 -298 -350 213 427 -68 -457 -27 455 147 -384 -246 278 346 -155 -416 46 428
3382 428 129 -388 -201 380 323 -226 -396 114 455 14 -428 -117 395 250 -277 -315 176 402 -54 -418 -109
3403 -109 378 214 -367 -334 252 381 -135 -457 20 412 123 -356 -255 290 359 -160 -375 29 429 111 -380
3424 -380 -200 332 339 -225 -368 142 405 15 -372 -110 357 247 -282 -308 176 360 -46 -428 -93 394 211
3445 211 -346 -287 247 359 -132 -405 11 399 135 -335 -232 275 339 -166 -388 75 419 81 -382 -178 351
3466 351 297 -238 -344 136 400 8 -387 -107 337 239 -246 -340 166 360 -60 -423 -69 402 182 -323 -273
3487 -273 238 329 -136 -382 23 374 107 -311 -247 275 327 -189 -377 98 417 45 -422 -178 346 294 -229
3508 -229 -351 117 406 12 -371 -116 363 250 -282 -328 182 410 -63 -416 -34 393 153 -346 -267 271 358
3529 358 -138 -374 -18 389 124 -374 -250 300 341 -208 -372 91 413 34 -384 -147 333 280 -236 -323 139
3550 139 374 -2 -365 -102 376 260 -292 -299 226 367 -104 -390 -19 387 132 -356 -247 250 338 -148 -408
3571 -408 15 410 96 -372 -214 318 305 -222 -362 112 407 12 -354 -134 343 244 -230 -345 174 388 -53
3592 -53 -398 -54 385 184 -301 -284 261 359 -119 -390 -2 363 134 -316 -241 251 329 -165 -375 33 408 84
3614 84 -377 -184 299 279 -233 -353 119 390 13 -395 -139 356 229 -257 -327 173 383 -51 -390 -53 370
3635 370 157 -307 -254 239 325 -108 -342 16 376 122 -315 -217 256 304 -168 -353 37 387 54 -370 -160
3656 -160 321 232 -209 -362 105 392 13 -357 -113 340 236 -271 -282 192 368 -57 -386 -47 370 182 -281
3677 -281 -257 240 334 -115 -369 -2 344 108 -350 -209 271 327 -186 -332 67 361 22 -368 -162 314 242
3698 242 -210 -342 94 360 -17 -342 -97 360 211 -253 -306 184 327 -58 -393 -24 351 179 -296 -262 225
3719 225 336 -108 -362 8 383 92 -348 -201 302 307 -173 -349 91 398 33 -357 -147 323 259 -218 -337
3740 -337 116 329 -29 -378 -87 349 184 -279 -269 168 328 -84 -376 -9 357 123 -316 -201 276 332 -129
3761 -129 -336 51 375 81 -323 -179 291 266 -212 -344 118 345 7 -346 -126 305 256 -260 -309 137 343
3782 343 -62 -388 -93 336 165 -291 -256 230 304 -94 -329 -16 349 113 -290 -196 272 317 -137 -305 63
3803 63 346 78 -309 -141 275 245 -186 -282 103 332 4 -329 -111 281 208 -229 -257 141 311 -54 -354 -47
3825 -47 335 168 -268 -223 186 292 -97 -332 -30 353 121 -294 -216 208 275 -149 -345 55 352 67 -327
3846 -327 -155 276 237 -192 -271 115 351 13 -315 -110 300 205 -210 -272 138 332 -55 -338 -48 320 149
3867 149 -275 -231 193 295 -120 -337 -2 303 101 -314 -207 228 281 -141 -330 74 367 29 -308 -125 324
3888 324 257 -186 -274 113 359 11 -326 -69 333 203 -250 -262 167 320 -82 -354 -37 325 128 -295 -247
3909 -247 199 275 -119 -338 2 365 84 -276 -168 292 249 -137 -320 109 333 22 -288 -84 307 237 -189
3930 -189 -292 163 316 -27 -317 -83 316 183 -274 -261 189 325 -83 -327 -12 301 89 -289 -205 219 283
3951 283 -135 -316 66 320 35 -323 -141 227 244 -171 -290 83 282 5 -311 -99 285 203 -210 -256 161
3972 161 343 -38 -331 -41 314 157 -235 -195 180 281 -98 -301 15 318 107 -255 -200 220 252 -127 -302
3993 -302 4 309 62 -323 -159 253 188 -202 -276 82 314 15 -309 -100 270 189 -213 -243 163 313 -17
4014 -17 -280 -28 283 187 -241 -234 172 304 -49 -277 3 291 119 -285 -183 217 261 -155 -292 63 301 31
4036 31 -286 -122 240 210 -205 -282 101 313 18 -320 -103 311 208 -248 -252 163 304 -59 -290 -34 300 136
4058 136 -238 -190 185 276 -98 -286 8 332 71 -275 -167 266 233 -161 -302 68 313 14 -304 -89 257
4079 257 219 -194 -275 103 286 -48 -332 -81 306 160 -254 -240 141 289 -72 -288 -5 302 133 -250 -188
4100 -188 232 256 -119 -287 46 324 69 -285 -142 250 220 -148 -252 88 303 20 -290 -115 262 170 -221
4121 -221 -251 117 266 -80 -311 -55 263 126 -226 -198 152 256 -63 -293 -4 273 141 -247 -157 188 239
4142 239 -107 -283 46 307 44 -266 -125 224 218 -154 -274 64 253 -2 -315 -105 247 187 -208 -245 147
4163 147 275 -33 -290 -33 229 120 -195 -201 153 259 -52 -249 11 278 106 -235 -174 204 265 -111 -291
4184 -291 61 282 55 -252 -136 227 196 -164 -268 59 286 15 -276 -87 238 187 -207 -232 120 278 -33
4205 -33 -296 -46 278 105 -228 -208 140 265 -75 -294 -17 296 109 -263 -183 229 238 -132 -276 52 294 64
4227 64 -270 -116 232 193 -155 -267 138 308 14 -304 -58 260 152 -218 -193 150 249 -63 -268 -32 236
4248 236 116 -263 -200 171 267 -115 -328 14 280 52 -262 -123 231 222 -137 -248 87 281 -9 -249 -82
4269 -82 253 185 -178 -232 122 296 -67 -285 -50 237 118 -223 -203 139 259 -63 -247 -12 270 107 -240
4290 -240 -170 188 205 -135 -284 35 244 39 -258 -122 205 196 -141 -261 75 310 28 -241 -102 239 140 -185
4312 -185 -205 134 278 -28 -251 -77 250 142 -201 -189 160 266 -49 -259 8 260 86 -244 -177 211 217 -111
4334 -111 -245 22 254 44 -241 -127 198 208 -152 -262 47 276 10 -265 -80 262 178 -162 -202 134 287
4355 287 -10 -248 -42 261 134 -207 -195 149 275 -74 -272 -1 282 87 -271 -139 216 207 -158 -251 9
4376 9 270 55 -272 -133 233 172 -174 -249 118 299 -13 -256 -51 280 135 -201 -232 153 268 -22 -247 -9
4398 -9 250 107 -223 -199 195 244 -112 -256 41 278 40 -236 -135 186 183 -134 -246 51 260 10 -254 -109
4420 -109 221 188 -182 -208 102 255 -23 -265 -10 224 130 -171 -180 184 232 -63 -261 5 252 99 -252 -147
4442 -147 200 234 -112 -195 50 242 48 -233 -104 178 184 -144 -214 56 236 10 -279 -86 210 167 -178 -208
4464 -208 88 205 -53 -243 -32 222 102 -185 -187 114 236 -42 -215 -13 263 95 -222 -152 180 188 -95 -205
4486 -205 37 222 43 -216 -158 154 163 -154 -222 74 255 -23 -248 -76 199 167 -149 -186 98 244 -29 -237
4508 -237 -44 255 134 -159 -181 160 252 -74 -282 34 262 75 -206 -124 180 181 -129 -259 29 268 24 -247
4530 -247 -94 190 181 -178 -209 120 255 -32 -238 -78 212 106 -192 -216 111 224 -59 -271 -19 233 72
4551 72 -210 -173 185 210 -112 -226 37 268 38 -209 -103 163 193 -118 -207 50 236 11 -243 -73 243 165
4573 165 -177 -196 123 206 -58 -219 -32 220 76 -180 -175 115 193 -88 -251 -27 224 49 -223 -125 166 154
4595 154 -108 -193 43 232 27 -182 -81 190 160 -129 -194 67 229 -3 -243 -58 222 130 -166 -164 118 204
4617 204 -37 -225 -30 216 79 -162 -156 115 176 -77 -206 17 206 37 -195 -124 154 142 -62 -179 8 188
4639 188 69 -182 -96 168 171 -112 -183 59 226 10 -204 -56 196 115 -138 -168 90 188 -23 -210 -38 210
4661 210 98 -157 -160 123 197 -102 -197 17 212 54 -190 -130 159 184 -113 -227 18 250 36 -234 -71 211
4683 211 145 -154 -221 94 210 -35 -222 -32 185 135 -137 -179 98 231 -12 -238 -43 259 104 -189 -164 151
4705 151 182 -114 -219 27 188 17 -207 -129 137 140 -109 -219 52 228 7 -223 -49 195 129 -144 -159 116
4727 116 213 -35 -201 -33 197 115 -156 -141 141 176 -51 -203 12 205 68 -175 -118 149 126 -76 -201 28
4749 28 163 16 -170 -83 133 141 -116 -160 55 185 -8 -200 -37 176 110 -92 -137 73 178 -19 -162 -53
4771 -53 168 106 -145 -172 115 163 -54 -163 -3 186 44 -168 -91 120 160 -61 -175 12 141 87 -195 -99 153
4794 153 127 -117 -190 53 180 6 -211 -64 142 90 -110 -143 71 183 22 -175 -22 200 89 -153 -147 85
4816 85 168 -49 -175 3 172 93 -132 -112 109 170 -40 -204 11 203 72 -212 -104 150 146 -126 -194 42 194
4839 194 10 -201 -91 148 120 -125 -167 92 169 -18 -215 -26 212 106 -164 -118 124 157 -72 -184 2 208
4861 208 62 -170 -128 119 160 -86 -179 34 192 11 -197 -67 163 109 -133 -164 70 178 -18 -182 -60 173
4883 173 109 -147 -147 87 178 -36 -206 9 195 54 -169 -101 146 151 -69 -143 3 157 60 -124 -88 146 159 -100
4907 -100 -145 65 162 -12 -150 -29 137 84 -102 -135 68 146 -16 -120 -64 144 72 -133 -125 86 149 -52 -144 -10
4931 -10 164 59 -110 -93 80 124 -38 -125 -15 174 63 -150 -88 123 160 -81 -138 33 137 17 -140 -61 82
4954 82 90 -53 -137 23 168 15 -187 -48 157 100 -120 -142 72 140 -29 -163 -22 143 72 -113 -118 77 168 -28
4978 -28 -174 -13 171 66 -160 -88 139 111 -94 -163 63 165 1 -128 -84 115 117 -93 -164 55 191 -31 -194
5001 -194 -62 164 81 -131 -121 114 150 -35 -154 -21 156 75 -124 -131 96 148 -70 -169 18 170 17 -168 -70
5024 -70 148 106 -93 -118 51 175 23 -153 -51 174 111 -93 -112 101 174 -49 -167 -14 144 57 -148 -103 92
5047 92 111 -78 -159 -8 149 50 -134 -109 124 114 -82 -116 56 165 4 -121 -27 111 66 -42 -72 40 145
5070 145 21 -142 -47 140 116 -119 -110 97 126 -27 -105 24 93 23 -95 -69 70 88 -47 -135 -8 148 42 -132
5094 -132 -95 98 90 -41 -112 39 105 32 -97 -65 84 95 -41 -134 24 142 49 -128 -54 135 101 -105 -68 62
5118 62 75 -13 -107 -76 98 87 -83 -134 41 148 -6 -159 -27 137 55 -135 -94 91 107 -68 -119 4 141 33
5142 33 -122 -86 114 156 -73 -134 31 168 21 -176 -19 155 73 -117 -84 75 144 22 -136 -24 149 71 -135
5165 -135 -116 101 145 -52 -153 3 162 12 -136 -87 84 77 -80 -121 24 136 26 -127 -79 144 106 -124 -111
5188 -111 109 171 -47 -131 10 139 56 -92 -71 79 108 -11 -110 -9 138 44 -107 -75 123 66 -85 -94 57 96
5212 96 -10 -106 -29 73 53 -54 -90 28 95 13 -123 -25 147 44 -108 -66 76 98 -64 -63 -13 73 33 -72 -94
5237 -94 46 100 -22 -97 3 115 35 -87 -62 80 92 -29 -100 7 68 24 -64 -75 30 101 -42 -136 7 120
5261 120 12 -127 -58 84 62 -67 -68 18 81 5 -35 -47 98 129 -58 -93 40 133 3 -126 -6 112 51 -77
5285 -77 -59 59 96 7 -83 -28 97 57 -117 -78 87 130 -66 -155 31 125 -22 -130 -48 99 71 -67 -123 36 118
5310 118 22 -120 -52 144 72 -117 -135 82 135 -43 -123 36 112 44 -99 -37 95 116 -6 -87 27 146 24 -139
5334 -139 -61 120 90 -89 -112 95 113 -42 -103 -25 100 16 -91 -99 41 137 -17 -138 10 137 36 -106 -73 86
5358 86 137 -67 -88 34 119 27 -42 -36 71 75 -32 -93 31 145 12 -90 10 82 36 -87 -23 51 61 -2 -55 -34
5384 -34 48 38 -42 -86 40 87 -21 -87 1 75 0 -69 -11 53 52 -15 -39 -10 61 37 -48 -30 75 81 -20 -81 30 89 11
5413 11 -31 -26 84 32 -5 -30 -5 84 20 -58 -59 65 70 -63 -90 23 90 -18 -99 -34 66 35 -66 -71 24 81 2 -86 -31
5442 -31 104 61 -58 -81 75 99 -35 -104 45 114 5 -92 -50 49 54 -41 -92 -5 112 26 -116 -64 118 58 -89 -116
5468 -116 46 94 -65 -76 -2 86 36 -100 -66 47 117 -14 -116 10 121 36 -132 -39 125 85 -95 -60 79 101
5492 101 -2 -86 10 108 52 -66 -89 41 119 -34 -101 31 108 6 -110 -20 62 52 -60 -58 16 73 16 -99 -63 66
5518 66 62 -64 -97 27 83 -11 -124 10 70 14 -41 -30 39 53 -4 -49 -10 62 36 -34 -42 52 72 -42 -54 13 76 -2 -56
5547 -56 -14 45 26 -21 -41 7 37 12 -65 -61 33 51 -40 -57 43 58 11 -52 -6 35 19 -3 -30 3 53 57 -32 -36 59 67 -41
5578 -41 -48 43 61 16 -49 -8 52 28 -57 -42 19 62 16 -91 -45 56 31 -78 -81 24 57 -32 -81 -18 66 15 -46 -51 32 78
5608 78 -22 -75 -14 121 24 -116 -31 102 52 -54 -62 62 79 -24 -94 -7 74 56 -24 -76 27 119 -29 -126 21 103
5634 103 31 -86 -31 79 56 -57 -58 50 79 -10 -92 -58 78 47 -75 -93 2 86 -33 -91 29 130 18 -68 4
5659 4 94 56 -61 -78 12 76 30 -54 -33 88 71 -61 -67 58 89 -30 -116 10 68 0 -60 -42 26 45 -6 -64 -16 54
5687 54 39 -69 -56 47 82 -57 -48 10 43 -12 -40 -27 25 20 15 -18 4 39 21 -34 -47 62 53 -51 -39 40 29 -8 -30 -26
5717 -26 1 17 6 -45 -42 41 53 -59 -47 67 24 -48 -42 36 37 -19 -37 -22 12 26 5 -17 3 76 38 -82 -42 57 55 -40 -52
5748 -52 51 59 -31 -51 2 45 21 -35 -56 19 62 -37 -103 -27 104 21 -89 -55 74 43 -51 -77 39 63 20 -66 -20 65
5776 65 65 -42 -79 62 108 -19 -102 7 107 34 -66 -12 39 44 -32 -51 7 90 17 -80 -45 83 68 -63 -81 56 88
5803 88 -43 -102 8 71 -18 -55 -46 46 39 -20 -77 -4 62 -2 -110 -69 98 47 -73 -82 58 71 -26 -53 7 38 43 -34 -13
5832 -13 32 51 -4 -70 -31 80 8 -60 -33 59 53 -55 -17 25 9 -33 -43 -16 9 11 -10 -46 26 51 -20 -65 -24 36 11 -38
5862 -38 6 4 11 -4 -10 -12 -26 14 11 -8 -12 24 2 -8 5 34 58 -43 -7 16 6 -11 -3 -26 -19 32 -7 -48 -17 35 33 -67 -33 14
5896 14 24 -33 -32 24 8 12 -27 -32 29 52 -13 -48 13 77 14 -96 -24 86 29 -75 -6 71 46 -32 -21 3 49 28 -48 -40 44
5927 44 85 -37 -81 29 94 3 -105 -16 84 -6 -60 -56 39 60 -29 -36 1 69 21 -76 -49 80 89 -41 -77 58 99 -38
5955 -38 -66 29 68 37 -36 -58 50 95 11 -65 -8 54 28 -82 -20 82 56 -47 -65 46 50 -3 -50 -29 44 13 -32 -48
5983 -48 35 67 -4 -77 10 72 4 -51 -11 77 37 -22 2 21 21 -13 -25 -6 32 37 7 -29 24 56 -28 -49 14 24 -4 -38 -10
6014 -10 33 -17 10 6 -30 14 9 -2 -30 -2 36 -4 -39 5 34 -13 -17 17 -23 -10 37 15 -37 33 34 18 -32 9 45 36 -40 -2 51
6047 51 25 -6 -20 2 -1 58 -35 -34 39 32 -35 -46 15 41 -1 -83 16 37 15 -39 -4 7 22 4 -40 -41 58 70 -69 -63 56 67
6079 67 -33 -77 58 78 -22 -57 20 55 8 -21 -37 9 61 10 -77 -15 70 53 -65 -35 80 58 -75 -81 36 44 -30 -82
6107 -82 -9 49 37 -48 -34 13 70 -7 -85 -15 107 32 -64 -25 95 43 -25 -47 51 51 11 -19 -51 50 52 -11 -55 45 77
6136 77 -18 -71 21 85 -21 -83 7 47 8 -40 -24 5 -9 -3 -30 -21 20 40 -38 -56 26 15 -41 -46 25 65 -11 -6 21 24 -19 14
6168 14 2 0 20 31 -37 1 31 10 8 -2 42 33 3 10 14 -6 -1 12 10 -45 -3 27 27 -15 14 23 -30 -6 -1 32 -11 19 4 -47 7
6203 7 27 -18 -49 29 69 0 -41 46 74 -4 -40 -15 20 30 -1 -2 7 24 15 -35 -34 45 45 -65 -66 41 74 -32 -77 3 46 -16
6235 -16 -29 -9 8 13 -14 -38 2 84 14 -69 -17 84 47 -62 -38 73 47 -40 -6 19 72 6 -27 -23 24 18 -9 -74 6 92
6265 92 -5 -80 25 80 1 -74 -39 59 32 -68 -56 25 39 20 -55 -38 36 75 -40 -35 37 82 -40 -35 53 64 3 -16 6
6294 6 23 25 -21 -8 23 52 0 -41 -28 56 29 -42 -35 56 40 -42 -25 10 29 -6 5 16 1 15 -15 -1 0 27 24 -30 -8 52 10
6327 10 -32 17 43 20 -17 19 34 9 -10 46 -6 -5 37 13 -11 -8 17 9 14 7 22 -8 3 13 -5 -26 6 42 -5 -32 4 41 -18
6360 -18 -41 5 32 2 -26 -2 -8 13 -11 -31 -8 44 16 -44 -27 61 55 -51 -19 25 36 -16 -17 22 35 31 -39 -25 35 38 -14 -57
6392 -57 2 47 19 -76 -8 70 15 -55 -17 27 46 -19 -25 16 39 1 -43 -41 14 71 -34 -62 1 100 2 -74 20 105 -3 -50
6422 -50 -15 44 52 -12 -24 19 61 18 -36 -31 53 64 -57 -68 28 66 -17 -64 18 55 -22 -52 -5 29 13 27 -15 -6 59 22 -30
6453 -30 -15 78 45 -33 -2 85 44 -17 -7 32 28 12 -30 -21 30 38 -5 -28 15 38 11 -55 -9 45 -8 -50 16 28 -27 -12 22 22
6485 22 -21 -8 -5 -14 -6 -3 6 -24 -21 27 6 -20 8 16 20 10 32 15 -6 28 42 -30 -15 17 35 -7 3 18 5 -3 -9 -5 -9 6 25 -30
6521 -30 2 12 5 -31 -42 55 29 -28 -50 22 4 -3 -33 -17 1 13 10 -20 27 41 -6 -75 3 58 -2 -70 -2 61 23 -44 -11 36
6553 36 58 -17 -18 -2 26 21 -38 -81 43 47 -37 -74 5 68 9 -71 9 59 11 -16 -38 8 34 6 -60 5 35 39 -64 -36 45
6584 45 49 -37 -45 51 41 -35 -32 37 26 28 -28 -9 23 45 2 -35 11 75 34 -68 -18 51 17 -46 -32 -5 27 -23 -24 17 -16 -10 -26
6617 -26 -55 10 35 -16 -43 21 57 13 -38 14 62 8 -25 5 30 13 14 -11 -4 8 15 -9 -7 8 9 -14 -24 35 31 -45 -1 21 -8
6650 -8 -48 -16 8 -17 -19 11 19 -2 -24 -12 0 9 13 25 -16 2 24 -23 -18 29 46 -20 -12 61 36 -31 -6 31 34 33 -22 15 18 0 1 -23
6686 -23 12 17 -18 -28 8 64 -7 -49 -39 67 13 -44 0 15 18 -21 -18 -10 21 3 -30 -43 13 55 -32 -63 3 64 11 -44 35 44
6718 44 35 -18 15 33 17 -1 -34 -9 37 24 -55 -49 37 23 -43 -51 28 46 -41 -50 3 30 -17 -44 -25 42 25 -27 -40 -3 70 3
6750 3 -47 2 80 8 -39 -13 46 54 -24 -25 38 26 12 -9 11 27 44 -18 -32 27 33 -3 -57 32 53 -13 -46 -24 27 -25 -30 0 26
6783 26 -5 12 2 2 -6 15 -20 10 42 46 -14 -31 23 37 -8 -10 29 30 -5 9 19 -9 -4 -5 -10 -9 29 -2 -10 1 0 27 -1 -9 23 -25
6819 -25 -27 17 27 -25 -16 12 -47 -8 -4 9 2 -19 -8 -27 -3 22 -2 -26 18 63 9 -36 -2 55 -14 -39 39 38 4 -29 -6 30 21
6852 21 12 -27 -13 17 44 -16 -51 -5 32 -23 -49 -1 34 -16 -38 -16 42 -1 -32 -25 4 23 -8 -20 -18 39 2 -28 -25 55 68 -28
6884 -28 -21 18 36 6 -25 18 51 20 7 -8 -13 27 4 -27 28 39 14 -40 4 56 13 -53 -17 3 38 15 -46 -4 30 0 -10
6915 -10 -17 30 56 -7 -39 19 52 -5 -48 10 48 -5 -18 -9 10 -3 11 -10 13 19 30 -2 4 13 26 -28 -18 26 10 -1 -18 16 24
6948 24 -11 -40 -19 -1 -11 -18 -1 -3 3 -1 -7 -10 34 7 -25 16 3 7 -8 35 1 -10 -3 11 6 -8 14 9 -15 11 -7 -8 4 9 0 -18 -20
6985 -20 20 -3 -34 -1 42 -9 -21 -35 2 -4 -22 -12 10 53 -17 -11 -5 9 53 -28 -29 50 34 18 -4 31 43 -2 -20 19 34 12
7017 12 -28 -9 45 8 17 -30 12 54 -2 -47 -10 32 21 -36 -36 12 25 -26 -11 27 -5 9 -38 3 26 -1 -24 -31 19 19 -1 -33
7049 -33 18 37 5 -15 -9 34 5 2 -2 17 4 41 -16 5 -1 4 8 -50 4 34 -25 -24 19 15 -11 -26 2 4 20 -22 -20 -5 7 -11 -9 -10
7085 -10 16 30 -13 -28 9 13 -19 -24 22 31 -38 -15 38 31 -5 17 -5 9 38 -7 -8 -17 19 18 -43 0 10 1 0 4 16 0 -20 5 3 -19
7121 -19 -5 5 3 6 14 19 25 16 40 -8 21 26 15 7 24 26 10 -9 36 31 47 -21 12 20 26 5 -13 -17 0 -1 -14 -27 26 31 -32 -28 -10 19
7159 19 -18 -30 10 2 -5 -27 -4 10 28 -8 36 0 24 10 -9 20 14 25 -2 11 35 44 -26 13 23 32 -13 -26 12 17 14 -23 -17 1
7193 1 1 14 -31 -17 41 6 -29 12 31 26 -36 0 43 21 -7 -18 3 15 9 -20 -20 5 24 -21 -11 15 46 3 -31 53 40 2 -13
7226 -13 11 0 26 4 6 -1 -15 14 -19 -23 39 15 -54 -18 13 1 -10 -29 -1 9 -24 -23 0 -1 12 -15 4 -2 7 1 5 9 -5 40 11
7261 11 6 7 17 -2 15 -6 12 6 18 -7 11 26 26 2 21 -1 1 14 8 11 -19 -33 10 -2 -36 7 15 13 -2 -14 4 -10 -16 9 6 0
7297 0 20 23 -12 9 4 -4 1 8 25 4 -1 23 13 -10 -28 17 24 -10 0 -16 -14 12 10 -19 0 6 -20 -31 -19 7 15 -34 -23 18 -4 -20
7333 -20 -28 6 3 17 -17 20 -1 17 -10 8 11 4 20 -17 1 30 13 2 20 13 9 -26 39 -9 10 -25 -10 -8 6 12 -32 -10 15 24 8
7368 8 7 -2 26 9 -23 -5 3 20 5 -19 0 23 6 -9 6 -2 9 -8 -8 34 13 -13 13 21 23 34 -5 16 1 11 0 4 20 7 2
7403 2 -14 -26 9 -5 -19 -8 -7 6 -21 -15 -16 1 -1 -20 -3 -8 10 3 -13 1 8 11 -8 3 -6 24 3 7 1 -7 -16 -3 -5 -5 20 24 3 -9 20
7442 20 1 13 6 19 -4 0 -16 6 -27 15 -9 -4 15 -9 0 0 28 10 -9 21 16 -5 -15 20 -2 5 2 21 10 9 30 -19 7 -13 7
7477 7 12 21 14 -21 8 -2 -13 8 29 16 4 -17 -20 -10 9 9 -39 -8 20 -12 2 -2 4 5 -10 -42 7 -9 -8 0 1 11 18 -13 -1 17 24
7514 24 -8 14 28 23 26 30 14 24 0 12 -6 3 -4 -13 2 -3 11 -5 4 -5 8 -8 -5 -18 -13 9 -11 -10 -16 -1 18 -11 -7 13 27 12 -24
7551 -24 16 20 -5 4 9 21 21 20 4 -3 6 6 19 26 16 18 -12 1 -11 0 11 -18 -12 -15 1 1 -12 -13 -11 -10 -21 -10 2 -7 -8 -23 -7 36 8
7590 8 -3 15 -4 -17 -12 36 26 11 15 -8 4 -1 9 34 18 0 9 33 23 -6 9 -9 0 22 -13 7 -10 -11 3 -21 0 12 -4 -15
7624 -15 -9 -12 -5 -5 -10 14 -2 -10 7 -6 1 5 30 1 1 5 19 8 -7 -3 -13 8 5 -15 -1 -16 14 5 -10 10 -17 -19 -10 -25 -8 -3 8 -10
7662 -10 -24 31 4 22 -7 -21 -11 -8 -28 -12 -10 0 6 0 6 16 -3 6 8 27 14 15 18 15 21 46 -2 -6 30 24 -4 20 14 -22 -1 -14 -6 6
7700 6 17 -1 -10 18 22 -1 -8 -23 7 3 -10 -10 1 -21 -20 4 -50 2 -10 -11 -1 13 17 21 -3 4 -3 13 20 11 16 21 -8 -10 -3 -17 -17 -4 -22 8
7740 8 18 -15 3 18 -37 -1 -4 10 0 -44 7 -6 25 -24 -18 18 -3 -17 -13 8 -10 29 0 8 4 -6 6 -10 29 12 25 11 -3
7773 -3 3 29 -17 20 -5 4 2 37 10 -9 23 -20 6 -10 -21 2 -35 13 9 -25 -14 8 -9 5 30 15 11 20 -6 -18 18 10 26 -18
7807 -18 14 2 14 1 4 9 20 21 21 28 -7 32 14 1 -5 10 1 1 -9 14 -5 -11 6 29 -15 -43 0 9 0 -11 -2 -15 -15 -13 -3 10 -15
7844 -15 21 -4 6 -1 13 -3 0 38 24 10 3 13 22 11 -12 9 17 5 12 1 3 5 -4 3 14 -15 -1 5 1 17 -11 -12 -5 -10 3 -25 -3 -26
7882 -26 -16 -15 -14 -6 16 24 -28 -2 -16 17 -1 17 10 17 -22 5 35 24 -10 9 32 13 23 -10 -2 -4 4 -29 -10 11 -13 -17 -8 16 14 6 -17
7919 -17 -2 0 -11 -3 -12 8 -5 4 7 0 27 -28 -14 21 25 6 -35 -6 19 8 2 -3 34 0 1 6 -2 19 7 12 36 4 12 9 -16 0 11 5
7957 5 -17 -2 -3 -11 -11 -20 27 -21 -20 13 3 7 -21 8 5 26 15 -6 -14 -2 -1 14 -13 24 12 4 17 5 16 3 4 16 0 -16 -9 -7 -18
7994 -18 33 -37 -2 -2 4 2 -41 -24 16 -20 -16 -19 -8 -17 -17 -5 -16 13 -5 -2 2 10 18 -26 4 35 26 3 -36 38 36 -1 -13 9 13 16 -17 15
8032 15 13 -2 -25 -11 7 18 -1 -16 -21 23 1 -12 -21 17 26 -18 -19 28 -9 -11 -9 18 17 18 -4 -16 -2 -2 28 -11 -1 30 1 7 1 27
8068 27 46 27 9 28 7 -9 6 -5 -11 34 7 -19 -4 -13 4 -4 16 16 -33 -14 1 -9 11 -1 -5 25 10 -11 -1 2 17 16 4 7
8102 7 9 7 -15 9 46 24 -7 1 25 33 14 5 22 13 3 18 -1 -1 -10 -13 -1 22 14 0 -18 21 6 -20 -23 26 40 -1 -11 13 -6 24
8138 24 8 16 6 10 5 -35 20 20 10 -5 -14 40 13 14 -11 26 5 27 -17 24 16 24 16 -9 16 1 -9 -15 12 7 -2 -1 7 1 -27 -36 10 0
8176 0 15 -15 5 25 13 10 -21 28 33 -14 -20 30 42 22 -8
8191h
$$ Imaginary data points
##PAGE= N=2
##DATA TABLE= (X++(I..I)), XYDATA
0 0 0 0 0 0 0 0 0 0 0 0 0 0 -8 8 -8 8 -8 16 -16 18 -24 32 -33 40 -48 56 -64 73 -88 98 -113 129 -146 167
34 167 -187 211 -238 267 -297 331 -369 410 -457 505 -559 617 -680 751 -826 911 -1003 1107
52 1107 -1219 1344 -1486 1644 -1825 2032 -2272 2554 -2892 3305 -3825 4498 -5413 6728 -8791
67 -8791 12514 -21288 85442 -36056 -228684 49067 181477 -7410 -150129 -12527 88074
78 88074 51042 -35078 -76321 -27451 107389 74360 -125075 -117309 139691 139998 -139136 -152555
90 -152555 130387 146078 -106857 -130197 75520 101701 -34139 -69016 -9113 32685 53977
101 53977 972 -92388 -29996 123910 50858 -142637 -62681 149129 64835 -141326 -58968
112 -58968 121255 46642 -90519 -31592 52309 15527 -11128 -2352 -29499 -7233 64769 11262
124 11262 -91852 -10253 107742 4409 -111212 4962 102808 -15610 -83408 26258 56928
135 56928 -34093 -26104 38383 -4150 -37376 30635 31211 -50007 -20105 60136 4846 -60736 12302
148 12302 51664 -30098 -35423 45616 13786 -57743 9371 64567 -31214 -65562 48325 60743
160 60743 -58131 -50393 59254 36403 -50445 -19376 33191 1903 -8604 15088 -19760 -29663
172 -29663 48942 41057 -74817 -48532 93649 51494 -103160 -50875 100890 46658 -87413
183 -87413 -40492 62966 32750 -30584 -25023 -6586 17981 44839 -11776 -79662 6898 107913
195 107913 -2324 -125928 -1673 132487 6510 -126137 -12159 107897 19270 -79327
205 -79327 -27785 43165 36901 -3358 -46308 -36843 54033 72756 -59641 -101660 61177 120367
217 120367 -58122 -127783 49624 123347 -35719 -107845 17234 83751 5288 -53180 -29234
228 -29234 20105 53306 12822 -74290 -41815 90532 64897 -99637 -80074 100222 86501
239 86501 -92064 -84845 74984 75535 -50955 -61054 21437 42802 10138 -23738 -41164 5541
251 5541 68427 9921 -89296 -21342 101982 28639 -104883 -31366 98357 30780 -82570
262 -82570 -27300 59783 22528 -31926 -17309 2123 12666 26510 -9638 -51426 8110 69657
274 69657 -8584 -80075 10180 81346 -12789 -74267 15198 59736 -16694 -39872 16613 17519
286 17519 -14171 4972 9668 -24345 -2741 39066 -5545 -46979 14732 47907 -23436 -41924
298 -41924 30686 30156 -35676 -14809 37385 -2360 -36177 18209 31470 -31182 -24397 38854 15305
311 15305 -40360 -5457 35323 -4132 -24105 12704 8409 -19122 10269 23595 -28948 -25317
323 -25317 45881 25154 -58153 -22938 64395 19588 -63401 -15891 54801 12190 -39538 -9483
335 -9483 18563 7510 5254 -7148 -30181 7483 52823 -8469 -71108 9197 82827 -8931
347 -8931 -86461 7306 81991 -3251 -69132 -2617 49946 10880 -25734 -20213 -478 30196
359 30196 26464 -39335 -49565 46277 67500 -49986 -79126 49121 83140 -43581 -79963 32777
371 32777 69845 -17715 -54426 -846 35229 21070 -14274 -41072 -6227 58884 24857 -72173
383 -72173 -39562 79768 49854 -80134 -54832 73203 54889 -59203 -50450 39325 42481 -15588
395 -15588 -32506 -10127 21342 34862 -10806 -56680 1263 72956 6147 -82442 -11496 84079
407 84079 14851 -77734 -16298 64443 16853 -45257 -16602 22733 16506 1282 -16475 -23860
419 -23860 16912 43024 -17593 -56961 18153 64229 -18460 -64840 17695 58565 -16032 -47075
431 -47075 12637 31392 -8008 -13942 2020 -3371 4800 18612 -11846 -29986 18770 36650 -24343
444 -24343 -37650 28486 33757 -30142 -25250 29587 14043 -26378 -1442 20909 -10553 -13841 20153
457 20153 5600 -26340 2540 27835 -10180 -24904 16042 17429 -19954 -6868 21380 -5620
469 -5620 -20473 18332 17569 -29407 -13083 37664 8234 -41445 -3273 40656 -472 -34646 2841
482 2841 24405 -3275 -10656 1875 -5028 929 20895 -4817 -35515 8578 46821 -11856 -54041
495 -54041 13506 55898 -13199 -52452 10373 43860 -4992 -30950 -2413 15256 11454 1864
507 1864 -20840 -18349 29862 33057 -36913 -44224 41139 51160 -41534 -53341 37587 50733 -29393
520 -29393 -44189 17126 34115 -2167 -22221 -14500 9283 30889 3234 -45441 -14407 56430
532 56430 23521 -62436 -29834 62917 33525 -57197 -34236 46113 32748 -30227 -29256 11358
544 11358 24494 8808 -19081 -28300 13316 44980 -7908 -57587 2776 64379 1417 -65339
556 -65339 -5251 59897 8297 -49109 -11004 33970 13460 -16122 -15691 -2369 17921 19968 -19600
569 -19600 -34477 21092 45064 -21470 -50440 20897 50632 -18809 -45730 15123 36536 -10046
581 -10046 -24592 3445 10996 3681 2160 -11334 -13908 18179 22670 -23912 -27887 27684 29152
594 29152 -29128 -26573 28184 20991 -24541 -13045 18968 4369 -11647 4221 3699 -11135 4300
607 4300 15795 -11473 -17484 17020 15935 -20625 -11718 21677 5067 -20554 2696 17092 -10798
620 -10798 -12177 17789 6249 -22882 -278 25262 -4900 -24345 8723 20373 -10423 -13477
632 -13477 10050 4666 -7400 5289 3208 -15194 1993 23971 -7355 -30699 11880 34407
644 34407 -14928 -34967 15590 32036 -13791 -26248 9250 17880 -2629 -8050 -5540 -2274 14340
657 14340 12312 -22512 -20872 29195 27551 -33123 -31357 33975 32607 -31001 -30921 24547 26943 -14904
671 -14904 -21128 2901 13999 10064 -6641 -23092 -748 34375 7132 -43098 -12561 47825
683 47825 16422 -48164 -18880 43840 20046 -35075 -19921 22923 19087 -8155 -17403 -7244
695 -7244 15501 22275 -13119 -35031 10558 44482 -7764 -49648 4638 49947 -1285 -45709
707 -45709 -2463 37170 6272 -25647 -10362 12017 14160 1891 -17659 -15010 20387 25967 -21971
720 -21971 -33696 22354 37792 -20962 -37819 18081 34322 -13439 -27597 7574 18893 -611
732 -611 -9114 -6717 -588 13805 9040 -20101 -15724 24661 19687 -27277 -21017 27349 19617 -25051
746 -25051 -16079 20373 11006 -13857 -5202 6286 -358 1745 5138 -9166 -8285 15444 9704 -19691
760 -19691 -9054 21713 6768 -21294 -3124 18596 -1346 -14114 5714 8285 -9615 -2192
772 -2192 12150 -3734 -13251 8478 12426 -11660 -9854 12892 5802 -11910 -592 9212 -4892
785 -4892 -4792 10416 -251 -14909 5619 18236 -10174 -19736 13361 19405 -14640 -17227 13556
798 13556 13346 -10341 -8441 4940 2664 1651 2986 -9026 -8358 15945 12691 -21687 -15839 25389
812 25389 17582 -26321 -17804 24492 16815 -19628 -14598 12435 11741 -3282 -8212 -6525 4718 16300
826 16300 -1283 -24867 -1886 31185 4517 -34762 -6852 34860 8489 -31731 -9919 25357
838 25357 10903 -16475 -11644 5936 12183 5321 -12320 -15990 12258 25339 -11490 -32049 10262
851 10262 35865 -8127 -36040 5329 33002 -1650 -26954 -2565 18554 7046 -8855 -11612
863 -11612 -1322 15580 10739 -18812 -18717 20652 24314 -20957 -27279 19489 27487 -16262 -24980 11628
877 11628 20453 -5653 -14298 -824 7525 7532 -709 -13710 -5286 18839 10039 -22378 -13161 23848
891 23848 14348 -23302 -13950 20477 11968 -15907 -9117 9754 5584 -2923 -2181 -4088 -791 10483
905 10483 2990 -15547 -4036 18978 4111 -20076 -3053 19176 1431 -16130 698 11619
917 11619 -2740 -6108 4397 254 -5441 5030 5523 -9438 -4838 12058 3095 -13051 -868
930 -868 12047 -1886 -9446 4603 5543 -7035 -935 8994 -3638 -9976 7718 10189 -10551 -9282
944 -9282 11988 7683 -11401 -5273 9184 2529 -5326 356 346 -3153 5108 5426 -10504 -7257 14957
959 14957 8313 -18025 -8762 19055 8540 -18012 -7820 14726 6769 -9548 -5463 3077 4204
972 4204 4203 -2941 -11249 1846 17538 -734 -22162 -272 24664 1329 -24783 -2531 22395
985 22395 3777 -17854 -5239 11452 6660 -4047 -8115 -3848 9355 11260 -10218 -17588 10487
998 10487 22246 -9954 -24716 8647 24971 -6253 -22810 3189 18809 676 -13105 -4872
1010 -4872 6516 9103 342 -13030 -6844 16072 12204 -18068 -16265 18405 18408 -17280 -18806 14404
1024 14404 17379 -10142 -14540 4836 10699 1105 -6214 -6982 1898 12431 2212 -16655 -5351
1037 -5351 19475 7643 -20355 -8761 19405 8916 -16623 -8249 12328 6832 -7019 -5241 1107
1050 1107 3420 4612 -1879 -9852 594 13740 195 -16201 -553 16897 532 -15751 -167
1063 -167 13163 -217 -9162 710 4597 -912 303 925 -4739 -537 8312 -126 -10645 1040
1077 1040 11399 -2169 -10718 3172 8541 -4144 -5438 4692 1614 -4923 2172 4640 -5530
1090 -5530 -3966 8034 2962 -9250 -1641 9174 314 -7596 1058 4957 -2146 -1446 2994 -2507
1104 -2507 -3440 6320 3550 -9651 -3454 11842 3068 -12834 -2669 12237 2174 -10234 -1912
1117 -1912 6856 1763 -2583 -1816 -2207 2061 6996 -2248 -11163 2503 14439 -2464 -16198 2205
1131 2205 16431 -1445 -14933 269 11958 1266 -7860 -3187 2924 5128 2177 -7129 -7089 8610
1145 8610 11193 -9569 -14222 9635 15852 -8831 -15995 7059 14731 -4347 -12158 1041 8789
1158 8789 2791 -4709 -6535 589 10139 3463 -12869 -6852 14636 9451 -15139 -11095 14165 11607
1172 11607 -11940 -11223 8397 9839 -4084 -7890 -786 5482 5569 -3012 -9954 605 13418 1519
1186 1519 -15520 -3149 16223 4345 -15274 -4902 13016 5109 -9386 -4841 5046 4474 -356
1199 -356 -3892 -4199 3309 8165 -2852 -11223 2334 12904 -1955 -13302 1527 12297 -1077
1212 -1077 -10096 549 7034 108 -3414 -826 -255 1668 3697 -2415 -6355 3179 8156 -3716 -8777
1227 -8777 4056 8306 -4070 -6858 3695 4561 -3153 -1903 2209 -939 -1153 3442 -65 -5335 1174
1242 1174 6395 -2137 -6482 2850 5612 -3123 -3810 3067 1550 -2551 1139 1909 -3630 -892 5851
1257 5851 -5 -7375 825 8018 -1388 -7777 1537 6503 -1352 -4571 689 1900 182 1008 -1303
1272 -1303 -3918 2344 6515 -3269 -8513 3844 9695 -3882 -9866 3446 9191 -2343 -7481 880
1286 880 5157 1108 -2332 -3168 -671 5164 3560 -6846 -6112 7976 7958 -8412 -9135 7870 9333
1301 9333 -6655 -8810 4457 7483 -1787 -5670 -1329 3480 4511 -1120 -7357 -1053 9770 3058
1315 3058 -11235 -4568 11740 5713 -11096 -6266 9388 6382 -6755 -6114 3420 5417 201 -4594
1329 -4594 -3920 3453 7189 -2376 -9889 1213 11509 -128 -12059 -902 11443 1811 -9738
1342 -9738 -2573 7169 3255 -3946 -3696 543 4048 2816 -4161 -5738 4133 7943 -3900 -9308 3384
1357 3384 9560 -2758 -8940 1824 7354 -803 -5205 -401 2691 1612 -52 -2743 -2354 3721 4310
1372 4310 -4367 -5526 4758 6117 -4623 -5868 4225 5026 -3312 -3622 2186 1934 -860 -135 -577
1387 -577 -1601 1813 2883 -2897 -3754 3476 3964 -3836 -3635 3604 2799 -3054 -1548 2162 30 -963
1403 -963 1486 -176 -2802 1338 3790 -2171 -4246 2764 4272 -2781 -3642 2501 2675 -1732 -1305 604
1419 604 -313 664 1857 -1959 -3286 3042 4346 -3852 -5066 4101 5226 -3899 -4930 3075 4193 -1823
1435 -1823 -3059 200 1724 1667 -124 -3437 -1271 5023 2640 -6112 -3664 6597 4418 -6458 -4812
1450 -4812 5549 4704 -4064 -4346 1995 3625 289 -2782 -2715 1707 4908 -617 -6752 -430 7957 1377
1466 1377 -8395 -2173 8078 2836 -6908 -3237 5114 3579 -2814 -3683 180 3613 2400 -3448 -4816
1481 -4816 3009 6692 -2555 -7988 1823 8398 -1032 -8108 52 6984 936 -5311 -1948 3213 2898
1496 2898 -827 -3613 -1411 4187 3566 -4398 -5080 4382 6142 -3909 -6490 3176 6198 -2144 -5330
1511 -5330 878 3984 402 -2424 -1784 614 2921 918 -3912 -2304 4446 3275 -4679 -3808 4467
1526 4467 3845 -3832 -3452 2884 2796 -1624 -1810 255 823 1202 198 -2386 -1051 3367 1664 -3876 -1982
1543 -1982 3952 1944 -3674 -1726 2891 1164 -1904 -562 653 -205 566 829 -1695 -1374 2531 1763
1559 1763 -3017 -1831 3123 1737 -2732 -1363 2037 832 -993 -176 -169 -480 1342 1117 -2394 -1699 3117
1576 3117 2030 -3536 -2233 3434 2197 -2955 -1992 2026 1651 -761 -1140 -646 602 2120 -12 -3361
1592 -3361 -517 4331 1072 -4825 -1484 4895 1838 -4376 -2058 3399 2161 -2001 -2206 369 2047
1607 2047 1341 -1860 -3025 1465 4327 -1061 -5287 479 5711 75 -5568 -689 4936 1332 -3802
1622 -3802 -1882 2368 2449 -589 -2803 -1118 3061 2774 -3067 -4058 2899 5023 -2484 -5439 1800 5345
1638 5345 -1010 -4862 -2 3824 1001 -2586 -2068 1076 2977 415 -3641 -1805 4032 2914 -4053
1653 -4053 -3691 3775 4104 -3119 -4052 2223 3701 -987 -3039 -249 2121 1501 -1087 -2613 31 3445
1669 3445 885 -3967 -1635 4045 2066 -3886 -2347 3258 2353 -2366 -2145 1268 1759 -27 -1235 -1132
1685 -1132 690 2176 -129 -2936 -291 3393 654 -3443 -840 3153 940 -2535 -907 1651 753
1700 753 -597 -543 -494 311 1430 -55 -2211 -142 2681 308 -2802 -400 2536 474 -1960 -368
1716 -368 1201 338 -233 -182 -704 76 1611 157 -2282 -310 2674 453 -2726 -619 2421 681 -1878
1733 -1878 -772 1013 756 -42 -738 -1028 621 1942 -471 -2701 292 3260 -13 -3349 -227 3205
1749 3205 605 -2579 -881 1804 1248 -716 -1472 -431 1613 1562 -1704 -2534 1584 3246 -1395 -3707
1765 -3707 943 3686 -452 -3441 -181 2780 813 -1906 -1478 853 2048 302 -2475 -1326 2752
1780 2752 2298 -2713 -2946 2524 3379 -2036 -3474 1365 3288 -510 -2818 -410 2089 1344 -1263 -2209
1796 -2209 337 2875 552 -3345 -1351 3441 1945 -3293 -2399 2813 2609 -2069 -2542 1156 2335 -56
1812 -56 -1904 -1005 1375 1970 -764 -2740 150 3233 400 -3412 -864 3254 1238 -2816 -1489 2039
1828 2039 1557 -1151 -1545 153 1370 827 -1150 -1674 887 2346 -526 -2688 257 2840 105 -2587
1844 -2587 -349 2152 611 -1477 -758 685 857 141 -901 -916 839 1527 -773 -2005 571 2151
1860 2151 -413 -2128 145 1756 64 -1246 -300 600 503 149 -606 -806 732 1418 -657 -1749 596
1877 596 1961 -381 -1863 196 1589 107 -1059 -372 437 591 196 -826 -876 888 1422 -941 -1893
1894 -1893 801 2042 -641 -2085 301 1854 65 -1445 -476 887 913 -185 -1226 -464 1489 1114
1910 1114 -1589 -1654 1547 2005 -1362 -2202 954 2159 -522 -1944 -109 1501 708 -981 -1284 340
1926 340 1779 330 -2118 -918 2251 1430 -2160 -1769 1870 1969 -1370 -1999 745 1908 -5 -1604
1942 -1604 -724 1179 1434 -710 -2021 137 2369 338 -2584 -863 2462 1199 -2212 -1489 1683 1622
1958 1622 -1043 -1639 272 1555 542 -1311 -1231 1048 1848 -644 -2281 288 2482 155 -2374 -510
1974 -510 2103 826 -1661 -1087 975 1218 -305 -1315 -433 1198 1067 -1105 -1591 859 1917 -611
1990 -611 -2035 273 1947 44 -1635 -321 1242 656 -688 -819 153 996 454 -1047 -906 1017 1291
2007 1291 -896 -1496 676 1516 -442 -1432 98 1104 168 -741 -498 271 726 156 -875 -624 936
2024 936 943 -905 -1168 761 1261 -520 -1159 237 1003 99 -648 -412 269 677 122 -875 -554 969 861
2043 861 -962 -1113 835 1200 -632 -1180 334 1028 22 -780 -423 466 775 -114 -1049 -298 1233 647
2061 647 -1270 -908 1189 1110 -966 -1196 641 1224 -236 -1100 -241 835 662 -589 -1048 179 1322
2078 1322 146 -1531 -517 1523 780 -1390 -1022 1137 1185 -692 -1160 264 1136 294 -928 -746 749
2095 749 1206 -436 -1484 118 1673 205 -1711 -518 1482 753 -1278 -985 809 1036 -348 -1123
2111 -1123 -216 1027 667 -921 -1096 724 1411 -450 -1574 186 1607 134 -1463 -395 1201 694
2127 694 -838 -851 389 1012 113 -1046 -535 975 905 -842 -1198 613 1328 -376 -1331 56 1201 207
2145 207 -997 -495 648 691 -298 -862 -117 922 448 -935 -733 828 947 -647 -1034 415 1005 -177
2163 -177 -901 -94 694 413 -438 -603 116 761 138 -856 -425 837 621 -733 -774 558 831 -331 -776
2182 -776 117 684 223 -455 -449 233 646 16 -776 -266 797 449 -766 -636 587 709 -439 -730 129
2201 129 647 90 -532 -408 341 607 -127 -769 -90 875 322 -817 -483 754 619 -562 -701 340 724
2220 724 -28 -649 -223 526 514 -348 -720 157 873 41 -973 -277 857 429 -794 -631 535 664 -307
2239 -307 -725 -27 687 324 -576 -591 424 803 -219 -924 0 998 232 -926 -397 800 575 -536 -674
2258 -674 263 727 43 -709 -341 642 593 -514 -775 338 888 -150 -940 -85 879 288 -757 -459 545
2277 545 572 -272 -694 -10 695 249 -664 -516 582 713 -433 -854 208 828 -29 -804 -205 664 385
2296 385 -482 -537 265 618 -34 -642 -228 645 453 -523 -558 410 724 -208 -719 58 686 165 -567 -322 407
2317 407 459 -192 -548 -76 569 177 -575 -384 455 499 -384 -591 210 585 -69 -569 -115 469 294 -300 -393
2338 -393 135 508 59 -507 -180 515 334 -427 -465 317 510 -169 -543 19 418 147 -368 -321 193 410 -100
2359 -100 -496 -95 477 238 -467 -366 335 433 -255 -471 89 448 48 -401 -207 305 322 -185 -416 54 494
2380 494 124 -479 -239 428 350 -331 -409 196 420 -77 -394 -112 347 225 -253 -391 151 430 -6 -480 -141
2401 -141 481 262 -375 -324 298 402 -157 -436 23 373 142 -356 -291 215 391 -118 -482 -9 484 163 -479
2422 -479 -255 409 343 -293 -399 154 397 3 -370 -134 315 317 -205 -412 135 479 7 -523 -125 463 218
2443 218 -413 -333 261 367 -161 -414 -35 342 168 -342 -339 240 389 -150 -483 27 500 120 -452 -185 412
2464 412 282 -263 -332 134 367 44 -328 -152 305 301 -219 -390 151 439 -59 -497 -68 399 92 -365 -197
2485 -197 219 220 -124 -282 -9 295 131 -277 -264 233 357 -150 -371 106 374 -8 -320 -72 292 137 -168
2506 -168 -195 50 217 65 -264 -159 236 236 -209 -282 115 326 -91 -310 18 249 60 -185 -135 84 147 42
2528 42 -191 -100 213 194 -181 -254 145 238 -116 -267 29 189 37 -163 -98 54 133 21 -162 -123 198 201 -178
2551 -178 -213 159 267 -79 -254 40 235 52 -170 -120 74 169 34 -215 -106 223 161 -258 -240 210 273 -193
2573 -193 -314 101 247 -26 -255 -104 163 161 -63 -251 -45 285 133 -330 -164 328 264 -268 -263 218 301 -91
2595 -91 -259 9 234 126 -167 -217 93 277 -15 -374 -75 366 120 -409 -223 321 217 -246 -266 114 258
2616 258 -4 -210 -123 168 247 -117 -313 59 377 -7 -381 -73 411 142 -307 -163 215 186 -132 -197 6
2637 6 179 107 -145 -209 153 295 -73 -337 34 355 -9 -305 -57 238 77 -158 -103 65 137 39 -136 -138 129
2660 129 215 -101 -270 50 272 -48 -268 6 210 30 -134 -83 38 90 40 -114 -149 106 207 -68 -215 60
2682 60 284 6 -229 13 206 23 -123 -77 47 111 74 -130 -125 92 217 -98 -289 79 296 -50 -291 18
2704 18 221 70 -173 -117 68 160 73 -180 -134 244 234 -190 -278 187 354 -116 -324 54 294 29 -273 -109
2726 -109 169 189 -44 -257 -89 320 147 -347 -254 296 313 -254 -351 176 356 -83 -327 1 287 126 -178
2747 -178 -203 85 297 1 -393 -105 400 188 -378 -292 312 312 -238 -328 131 296 13 -282 -125 217 229 -121
2769 -121 -335 45 398 45 -428 -122 417 201 -349 -225 227 251 -146 -244 1 212 115 -208 -266 110 328
2790 328 -81 -386 -46 362 61 -356 -98 266 147 -199 -156 87 206 52 -162 -164 155 256 -98 -271 70
2811 70 364 -23 -312 -2 279 94 -215 -148 87 95 14 -205 -168 128 196 -156 -289 90 323 -39 -321 -18
2833 -18 309 91 -202 -133 98 179 25 -176 -104 199 220 -184 -296 157 347 -103 -391 1 340 55 -289 -117
2855 -117 169 190 -41 -264 -64 256 148 -283 -295 249 373 -188 -361 130 381 -11 -326 -119 291 201 -191
2876 -191 -270 47 339 48 -367 -175 396 284 -356 -379 276 407 -186 -418 64 375 74 -323 -189 197 312
2897 312 -85 -401 -9 433 171 -429 -230 411 305 -335 -370 195 360 -117 -369 -64 310 183 -262 -321 120
2918 120 393 -82 -463 -64 446 154 -431 -232 362 336 -210 -346 98 336 82 -271 -176 240 321 -160 -394
2939 -394 92 452 10 -446 -101 401 167 -304 -245 191 252 -64 -299 -99 231 195 -230 -325 179 351 -91
2960 -91 -421 24 404 89 -328 -133 267 202 -131 -235 -10 248 92 -248 -240 223 314 -169 -378 76 388 12
2982 12 -360 -117 261 176 -210 -252 63 302 106 -299 -208 275 301 -219 -373 158 365 -60 -387 -35 345 128
3004 128 -239 -238 151 306 -18 -329 -112 357 259 -330 -334 270 391 -164 -376 96 392 48 -319 -156 253 288
3026 288 -126 -365 -1 408 100 -449 -236 420 321 -345 -387 209 416 -84 -427 -66 350 175 -274 -332 183
3047 183 445 -21 -464 -83 480 200 -418 -258 374 375 -237 -380 125 400 58 -333 -186 313 328 -214 -418
3068 -418 110 479 20 -508 -142 422 200 -375 -318 236 373 -100 -396 -57 341 190 -326 -324 225 426 -134
3089 -134 -477 19 482 88 -431 -185 333 246 -204 -356 90 345 81 -353 -202 320 318 -226 -404 157 423
3110 423 -68 -434 -58 364 145 -292 -254 178 307 -49 -355 -77 347 217 -309 -307 243 368 -168 -403 43
3131 43 383 75 -369 -171 233 253 -116 -349 28 374 112 -346 -251 323 331 -221 -402 184 391 14 -372 -105
3153 -105 330 222 -232 -329 120 368 22 -420 -148 356 229 -358 -361 240 379 -131 -411 6 383 134 -333
3174 -333 -237 245 363 -109 -428 25 460 129 -423 -201 375 337 -268 -412 133 413 -12 -404 -141 326 287
3195 287 -260 -405 128 445 -30 -524 -130 449 233 -419 -327 297 381 -169 -434 8 398 142 -320 -282 267
3216 267 386 -184 -473 64 489 75 -473 -170 384 266 -282 -350 157 415 -29 -413 -141 342 264 -316 -399
3237 -399 219 444 -90 -477 -25 460 144 -394 -272 283 326 -159 -400 16 396 105 -405 -242 326 347 -243
3258 -243 -444 96 425 -13 -440 -140 368 239 -242 -319 134 361 2 -416 -148 399 257 -314 -319 231 399
3279 399 -111 -425 -4 373 120 -326 -245 235 326 -120 -401 -45 381 115 -389 -250 316 336 -225 -404 89
3300 89 397 24 -366 -145 307 263 -198 -354 78 415 41 -416 -131 377 240 -304 -339 217 394 -103 -415
3321 -415 -40 356 159 -321 -296 213 374 -134 -437 -6 402 108 -399 -227 328 314 -238 -402 109 370 38
3342 38 -362 -192 327 314 -239 -389 142 448 -7 -440 -114 400 214 -341 -326 248 372 -88 -399 -36 416
3363 416 170 -342 -313 281 375 -173 -448 38 450 70 -432 -239 319 300 -270 -371 100 383 32 -421 -163
3384 -163 345 263 -300 -395 182 445 -61 -442 -84 410 176 -326 -303 252 369 -110 -411 -22 397 148 -365
3405 -365 -271 302 360 -188 -415 57 437 33 -401 -199 294 264 -245 -347 82 394 33 -409 -191 371 247
3426 247 -327 -331 212 418 -79 -401 -32 353 194 -329 -277 235 358 -106 -406 -19 425 140 -386 -257 286
3447 286 315 -223 -397 46 388 22 -361 -182 305 269 -230 -383 98 417 7 -429 -121 365 272 -284 -347
3468 -347 174 392 -71 -420 -92 373 202 -334 -288 221 388 -111 -415 -1 414 138 -378 -226 319 312 -215
3489 -215 -348 64 403 54 -364 -201 315 282 -244 -378 90 398 -41 -417 -128 391 222 -310 -339 170 394
3510 394 -71 -406 -90 372 221 -326 -309 234 363 -132 -395 21 406 128 -364 -205 310 325 -218 -355 68
3531 68 400 63 -413 -214 345 279 -228 -346 150 367 -48 -410 -105 356 198 -305 -289 206 350 -53 -400
3552 -400 -49 410 157 -335 -253 269 362 -174 -382 45 388 58 -380 -212 299 297 -211 -363 72 393 46
3573 46 -400 -176 357 241 -281 -318 163 381 -52 -406 -90 352 180 -301 -298 202 359 -114 -409 -38 363
3594 363 141 -351 -263 266 332 -157 -376 60 354 49 -348 -176 306 304 -216 -342 97 372 12 -365 -125
3615 -125 362 224 -283 -327 172 369 -68 -372 -93 362 163 -294 -268 208 356 -121 -385 -4 382 95 -344
3636 -344 -239 289 293 -174 -345 69 374 52 -357 -168 304 252 -211 -321 142 354 3 -377 -101 329 236
3657 236 -246 -303 177 360 -61 -375 -65 344 172 -337 -276 223 324 -148 -398 -24 365 98 -389 -242 271
3678 271 293 -196 -342 60 379 68 -352 -170 315 251 -204 -330 136 367 -14 -386 -102 326 214 -259 -299
3699 -299 173 346 -73 -373 -66 331 154 -312 -240 223 310 -161 -360 5 355 89 -342 -224 242 287 -183
3720 -183 -351 67 331 46 -368 -154 329 268 -233 -309 122 370 -30 -378 -83 355 175 -259 -289 179 335
3741 335 -83 -369 -10 322 143 -306 -256 212 302 -164 -367 9 352 76 -356 -197 277 253 -195 -321 113
3762 113 343 -6 -354 -131 322 227 -270 -304 161 371 -25 -340 -56 361 219 -283 -230 224 335 -97 -340
3783 -340 -19 350 142 -341 -254 256 302 -171 -358 29 320 34 -338 -167 262 237 -195 -295 83 342 -13
3804 -13 -344 -132 269 199 -248 -255 160 313 -56 -358 -45 317 166 -266 -222 195 308 -102 -321 -38 344 79
3826 79 -312 -206 236 276 -156 -323 31 334 59 -327 -178 256 255 -190 -325 75 327 15 -342 -111 293
3847 293 170 -270 -274 170 319 -37 -326 -76 311 157 -275 -214 190 317 -122 -324 2 351 112 -294 -193
3868 -193 225 243 -165 -307 60 343 44 -313 -189 266 241 -198 -314 111 333 -34 -348 -104 323 170 -262
3889 -262 -273 154 339 -76 -330 -6 342 144 -280 -224 236 301 -135 -311 45 319 71 -318 -181 230 249
3910 249 -172 -312 75 326 41 -331 -119 262 227 -222 -283 104 312 -25 -323 -54 311 177 -258 -266 178
3931 178 309 -81 -346 -53 319 124 -268 -210 231 275 -108 -299 22 304 61 -293 -171 266 224 -181 -272
3952 -272 110 310 6 -330 -121 305 185 -213 -261 144 304 -55 -316 -55 294 141 -252 -248 172 286 -93
3973 -93 -305 -36 326 95 -268 -189 225 264 -144 -305 58 319 74 -278 -136 248 253 -176 -263 89 327 23
3995 23 -302 -63 277 189 -217 -263 138 293 -42 -326 -62 280 139 -259 -227 192 266 -96 -299 -4 292 63
4017 63 -287 -167 207 252 -116 -304 45 310 57 -307 -140 249 215 -189 -291 98 287 -1 -321 -105 282
4038 282 172 -221 -241 140 285 -23 -321 -66 307 151 -257 -224 215 272 -118 -323 1 305 83 -254 -192
4059 -192 243 243 -120 -277 47 307 57 -335 -132 302 217 -207 -261 146 289 -24 -293 -53 285 187 -206 -243
4081 -243 155 303 -67 -318 -9 304 88 -277 -196 210 241 -158 -306 7 312 61 -292 -158 212 228 -183
4102 -183 -272 91 320 18 -324 -83 276 189 -205 -245 148 285 -40 -275 -59 269 171 -197 -224 141 252 -102
4124 -102 -297 -24 286 70 -270 -176 178 227 -104 -284 20 279 71 -275 -146 218 222 -171 -257 103 279 13
4146 13 -295 -84 266 136 -185 -217 132 258 -11 -296 -53 275 163 -237 -208 175 278 -99 -276 -22 243
4167 243 98 -275 -210 177 236 -130 -272 18 284 75 -279 -140 236 198 -182 -265 93 278 -2 -303 -98
4188 -98 255 173 -184 -236 76 253 -37 -296 -54 285 131 -257 -183 203 268 -61 -272 17 276 90 -257 -172
4210 -172 216 221 -154 -293 45 311 63 -285 -189 224 175 -198 -246 59 266 -13 -258 -85 246 142 -199 -238
4232 -238 140 293 -79 -283 -9 297 123 -254 -162 189 237 -103 -259 24 274 68 -225 -154 219 209 -163
4253 -163 -277 55 330 11 -300 -102 240 167 -207 -248 118 248 -35 -277 -74 250 136 -199 -210 144 271
4274 271 -70 -251 8 269 90 -216 -135 170 219 -96 -234 56 267 62 -256 -154 221 191 -170 -254 80
4295 80 265 -12 -267 -89 213 153 -176 -201 127 251 -20 -293 -43 273 122 -240 -191 190 237 -99 -259 -14
4317 -14 258 92 -236 -138 162 226 -108 -253 11 300 97 -269 -152 222 197 -131 -241 91 252 5 -238
4338 -238 -124 210 164 -204 -257 116 239 -34 -310 -40 273 118 -232 -192 140 218 -98 -282 22 262 94
4359 94 -250 -153 221 228 -118 -265 56 294 41 -264 -99 213 166 -167 -228 109 276 -1 -267 -91 259 173
4381 173 -221 -218 127 247 -67 -289 -23 263 88 -256 -183 175 247 -105 -242 3 269 63 -232 -153 220 193
4403 193 -146 -249 70 267 14 -271 -96 254 154 -170 -222 95 232 -29 -261 -77 261 133 -211 -187 147
4424 147 256 -86 -253 -10 239 75 -201 -158 172 182 -127 -249 9 259 49 -232 -119 209 182 -155 -209
4445 -209 91 253 -9 -233 -19 225 147 -140 -174 130 236 -24 -233 -28 222 112 -200 -166 146 205 -59
4466 -59 -235 -37 246 59 -233 -154 128 191 -110 -241 27 266 57 -237 -118 181 179 -128 -219 101 253 30
4488 30 -201 -70 224 153 -159 -200 83 242 -14 -262 -54 227 128 -171 -176 141 202 -74 -244 -32 224 62
4510 62 -260 -170 158 217 -128 -253 48 260 18 -236 -103 192 168 -114 -214 80 243 23 -226 -88 254
4531 254 139 -169 -194 138 275 -51 -241 -3 220 88 -197 -154 160 206 -84 -222 5 226 68 -234 -124
4552 -124 193 178 -160 -211 82 238 -7 -245 -81 181 148 -167 -199 98 244 -12 -232 -44 231 102 -204
4573 -204 -155 163 243 -47 -229 12 231 77 -215 -126 171 206 -85 -227 53 247 12 -233 -93 195 133 -153
4595 -153 -176 39 190 -17 -226 -65 177 120 -152 -214 101 188 -31 -219 -29 207 95 -177 -132 134 184 -33
4617 -33 -201 -3 231 96 -199 -127 138 185 -77 -222 21 209 0 -237 -87 165 129 -119 -197 41 215 16
4639 16 -209 -85 174 167 -135 -186 89 232 -2 -243 -39 211 80 -181 -147 139 180 -70 -212 -31 197 108
4661 108 -187 -140 183 190 -95 -196 49 226 47 -210 -90 175 141 -133 -203 56 223 -3 -210 -86 187 125
4683 125 -187 -164 101 223 -67 -233 -6 208 80 -190 -152 149 204 -72 -229 -9 206 72 -217 -99 198
4704 198 165 -128 -192 75 215 15 -190 -59 188 129 -115 -195 82 217 -35 -247 -61 210 97 -173 -157 125
4726 125 154 -92 -210 4 205 81 -192 -136 143 176 -99 -203 58 232 45 -195 -53 194 127 -111 -184 78
4748 78 153 -6 -187 -71 138 142 -138 -172 59 182 -50 -209 -22 182 73 -169 -107 101 147 -60 -177 -4
4770 -4 193 90 -170 -123 119 156 -97 -203 15 174 26 -165 -97 154 122 -97 -154 47 191 17 -195 -69
4792 -69 165 148 -117 -164 94 182 -38 -228 -25 160 119 -136 -150 73 160 -38 -188 -37 189 65 -182 -139 138
4815 138 175 -106 -197 23 169 33 -153 -93 162 111 -103 -186 13 191 34 -186 -73 183 151 -133 -153 134
4837 134 169 -37 -169 -33 197 90 -145 -135 82 167 -40 -225 -26 222 62 -196 -140 166 163 -104 -172 55
4859 55 162 30 -191 -101 160 158 -91 -179 74 207 -2 -203 -28 212 89 -167 -147 103 147 -52 -195 2
4881 2 179 86 -153 -119 130 177 -77 -185 21 182 33 -187 -71 134 102 -123 -148 52 141 -3 -164 -58 146
4904 146 121 -128 -147 62 178 -13 -177 23 151 88 -123 -93 89 145 -35 -143 -25 158 80 -115 -103 113
4926 113 128 -81 -164 22 143 11 -134 -44 79 87 -64 -134 24 163 27 -159 -47 143 120 -76 -147 83 144
4949 144 29 -146 -34 132 75 -116 -103 64 149 17 -155 -37 175 74 -121 -115 91 113 -71 -155 15 158
4971 158 35 -114 -123 85 114 -65 -183 8 165 18 -175 -91 165 107 -109 -145 67 148 -17 -167 -53 161
4993 161 102 -80 -145 65 186 -32 -176 -11 191 80 -149 -81 137 130 -42 -149 4 184 49 -157 -129 92
5015 92 140 -137 -175 37 179 -27 -178 -24 142 66 -103 -107 57 154 -7 -157 -33 147 67 -115 -122 107 142 -73
5039 -73 -154 -5 172 22 -138 -40 115 99 -59 -119 43 158 24 -150 -63 126 100 -138 -139 59 109 -50 -163
5062 -163 -51 102 35 -88 -104 64 121 -51 -130 -16 154 64 -133 -61 80 111 -58 -88 25 115 30 -71 -58 106
5086 106 106 -58 -116 -4 132 54 -136 -63 117 75 -95 -91 42 115 -12 -122 -36 92 68 -76 -113 37 127 -1
5110 -1 -150 -54 130 59 -121 -94 80 121 -23 -98 -8 114 77 -104 -103 77 137 -22 -146 -10 148 32 -133 -70
5134 -70 139 86 -87 -95 18 117 11 -131 -80 108 121 -96 -134 58 158 -5 -162 -41 136 58 -115 -103 85
5157 85 116 -24 -133 -7 147 71 -129 -84 122 165 -56 -157 35 194 -1 -146 -27 136 60 -83 -103 36
5179 36 129 17 -154 -69 128 83 -124 -141 74 143 -76 -130 11 138 34 -98 -77 90 103 -71 -119 -4 135
5202 135 40 -98 -20 120 129 -81 -123 85 111 -29 -92 -6 108 82 -75 -79 57 117 -25 -110 3 108 20 -81 -69
5227 -69 93 87 -43 -75 20 53 9 -70 -59 84 91 -62 -68 9 96 29 -97 -25 98 54 -43 -49 16 101 11 -64 -40 66 70
5256 70 -41 -73 29 104 -26 -97 14 102 61 -94 -62 17 81 -15 -91 -48 77 60 -77 -87 59 114 -15 -142 -11
5281 -11 113 0 -115 -67 94 92 -9 -76 3 112 52 -85 -59 83 116 -80 -117 49 143 3 -114 -39 111 75
5305 75 -102 -106 39 111 -41 -115 -63 129 67 -116 -139 78 123 -81 -126 18 128 -26 -150 -23 90 95 -66 -111
5329 -111 10 145 25 -122 -21 128 74 -124 -87 75 126 -54 -125 20 93 45 -90 -62 66 85 -40 -137 1
5352 1 128 -5 -131 -45 99 83 -83 -98 39 68 -23 -94 -9 75 29 -72 -109 61 119 -23 -102 -20 86 29 -84
5377 -84 -44 70 60 -54 -68 -38 81 58 -58 -55 68 66 -53 -64 20 66 -5 -94 -27 71 32 -46 -69 -2 42 3 -43 -56
5405 -56 23 70 -43 -83 27 106 -20 -99 -14 78 53 -37 -35 34 89 29 -55 -25 82 74 -71 -88 36 107 -36 -100 9
5432 9 80 -2 -71 -74 43 63 -35 -123 -23 75 38 -87 -81 61 82 -79 -111 45 103 -3 -84 -25 97 83 -43 -67 41
5459 41 114 1 -109 -32 141 83 -104 -91 100 128 -56 -101 27 100 18 -119 -56 77 78 -71 -125 0 120 24 -131
5484 -131 -59 111 36 -71 -61 61 72 -51 -109 -7 72 37 -82 -103 73 114 -26 -122 13 103 2 -82 -30 98
5508 98 43 -68 -38 33 95 -21 -77 -30 84 76 -50 -99 53 91 -48 -112 7 92 -4 -96 -64 61 27 -60 -52 4 57
5535 57 23 -68 -33 43 48 -16 -63 24 75 -7 -53 -17 46 51 -9 -24 9 46 8 -38 -31 65 48 -46 -51 1 51 -34 -51 -14 35 8
5567 8 -30 -40 -25 27 12 -63 -61 51 55 -78 -57 32 56 -6 -63 12 34 6 -47 -41 30 83 3 -84 -37 102 56 -53 -70 46
5597 46 81 -37 -101 12 88 -13 -51 -33 53 57 -24 -95 -18 99 6 -112 -74 87 36 -86 -40 100 81 -36 -74 -8
5623 -8 85 42 -70 -65 70 112 -27 -112 19 142 25 -110 -24 151 70 -87 -65 68 76 -35 -79 -17 72 31 -56 -104
5649 -104 56 98 -65 -149 3 122 -18 -120 -10 66 70 -42 -71 4 63 -6 -64 -46 61 62 -26 -73 56 70 -29 -98
5675 -98 30 92 -7 -57 -7 45 19 -16 -82 -28 57 -21 -91 -81 56 43 -46 -74 25 56 -25 -45 -19 20 -19 -33 -20 -14 39 7
5705 7 -44 -12 69 52 -45 -46 41 45 -16 -23 11 9 33 -7 -11 -39 32 27 -46 -54 47 61 -62 -50 52 31 -27 -39 -29 12 -3 -41 -42
5738 -42 4 54 -3 -67 -23 52 36 -52 -41 38 72 -49 -73 22 53 23 -22 -48 45 87 -21 -79 -17 115 28 -94 -26 96
5766 96 45 -85 -39 41 41 -34 -62 -2 49 34 -44 -86 31 97 -51 -96 12 94 4 -79 -24 62 33 -52 -43 36 81 23 -67
5795 -67 -7 84 64 -52 -68 57 82 -42 -80 38 110 -15 -71 -14 54 33 -7 -38 -11 49 8 -94 -26 88 39 -96
5821 -96 -75 65 43 -37 -68 17 26 -17 -25 -41 20 57 -8 -54 -13 70 13 -62 -20 79 28 -60 -6 78 49 -29 4 20 43 0 -14
5852 -14 -32 -12 48 -14 -61 -7 36 -8 -77 -11 10 2 -21 -21 -4 -24 -5 -5 -23 -16 22 11 -30 -31 48 22 -44 -41 32 15 0 -9 18 -3
5886 -3 33 36 -41 -9 62 10 -88 -9 67 18 -62 -37 13 -1 -26 -41 -8 -9 16 -11 -82 -12 43 9 -82 -11 88 -13 -71 -1 63
5917 63 48 -24 -33 20 96 18 -52 -41 72 80 -41 -74 55 86 -29 -94 -11 105 5 -74 -34 57 34 -22 -85 -4 70 26
5945 26 -97 -72 30 69 -89 -63 36 58 -25 -97 29 75 -8 -59 -38 48 55 1 -36 -5 82 5 -85 -51 110 23 -76 -58
5973 -58 65 61 -48 -57 2 48 7 -58 -51 26 19 -39 -75 4 72 -3 -97 -23 65 25 -64 -19 50 -9 -30 -29 -16 24 26 -2 -52 18
6005 18 48 15 -34 -7 48 4 -24 25 51 5 2 4 6 -25 28 6 -3 29 35 -20 -29 3 30 -9 -38 1 2 -10 -12 2 -35 -5 30 13
6039 13 -41 -21 22 5 -55 -4 32 14 -9 8 48 28 13 19 -20 22 46 -24 -55 37 66 -12 -59 -1 56 0 -63 -40 39 32 0
6070 0 -19 -16 51 44 -63 -55 38 54 -72 -86 23 74 -30 -80 17 59 12 -22 -37 11 37 3 -29 -3 73 49 -73 -28 70 61
6100 61 -37 -46 45 98 -29 -63 23 45 -1 -33 -28 25 69 -3 -53 11 89 -5 -104 -30 64 18 -69 -16 58 34 -18 -27 -15 11 18 -12
6132 -12 -30 39 84 -8 -54 7 84 18 -53 14 62 28 -26 -30 41 -5 -24 -27 -28 17 20 -24 -36 32 49 -11 -48 34 58 -33 -35 28 4
6165 4 -7 -25 1 10 7 0 -12 -3 36 52 -14 13 51 14 -1 11 9 10 -4 32 13 -11 15 30 -16 -27 27 30 -23 -15 -15 -15 -11 16 11 -24 -2
6202 -2 33 -28 -30 -9 45 -15 -94 1 44 -6 -43 23 46 31 -27 -9 -6 23 23 -33 -33 35 37 -37 -54 63 62 -29 -32 24 65 -2 -60 5
6236 5 26 44 -32 -44 -3 25 -17 -84 -46 63 19 -90 -57 67 29 -79 -60 24 43 -27 -28 15 51 25 -20 -57 18 119 8
6265 8 -93 3 79 16 -69 -12 60 48 -39 -27 31 36 2 -68 -15 2 33 -52 -63 34 60 -24 -78 13 64 -19 -55 0 46 11 -23
6296 -23 -18 32 52 10 -41 -20 71 22 -62 -24 24 32 -28 -49 14 37 -32 -43 -10 18 -13 -5 -28 31 25 -1 -50 7 25 -25 -43 -19
6328 -19 33 5 -30 -23 34 -24 -26 7 -5 11 17 13 -5 -7 26 23 6 21 17 -7 -27 37 33 -24 16 15 -1 -52 32 18 -28 -24 6 13 -26 -33
6364 -33 -17 -3 -4 -22 -39 -18 23 9 -47 -49 38 44 -38 -62 58 22 -24 -39 27 34 -12 -32 -19 11 39 -6 -46 12 71 27 -80
6395 -80 -47 84 38 -64 -45 43 28 -48 -37 23 26 20 -30 -41 14 60 -45 -75 12 59 -14 -84 -7 81 1 -46 -37 55 24 -24
6425 -24 -21 10 54 58 -42 -62 79 62 -34 -71 51 55 -46 -73 27 93 14 -31 -14 18 23 -4 -21 -13 37 8 -55 -18 30 1
6455 1 -88 -47 29 28 -59 -50 14 21 -16 -13 0 16 -5 -9 -23 1 67 -15 -50 11 52 -1 -29 -4 51 8 -23 -7 11 -17 -5 11 -33
6488 -33 -30 17 -5 -42 -8 32 -8 -40 9 -15 -37 -29 8 -29 -34 24 20 10 -27 13 16 -3 -9 22 2 -4 27 3 6 -3 27 -1 -26 19 19
6523 19 -50 -33 42 32 -36 -34 11 27 -21 -13 -14 3 9 -16 -34 8 32 4 -60 -8 76 2 -86 -33 61 12 -45 -28 12 43 2 -50
6555 -50 2 43 15 -8 -25 26 43 -38 -80 19 85 -2 -67 13 67 1 -36 -48 21 21 -4 -46 -48 22 9 -67 -51 22 51 -62 -50
6586 -50 32 69 -39 -44 3 38 6 -39 1 32 35 13 -35 21 61 15 -61 -20 72 20 -44 -27 47 17 -16 -30 13 33 -1 -25 -6
6617 -6 -3 10 10 -58 -7 31 -5 -46 -22 38 -25 -38 11 57 -10 5 7 -15 19 22 9 25 22 43 -23 -13 36 22 -14 -10 20 8 -11 7
6651 7 36 -2 -22 6 17 31 -10 -15 14 -8 3 12 -7 -3 1 -3 -30 -2 2 -32 -14 28 26 -21 -4 43 38 -34 12 24 19 -6 4 0 32 54
6687 54 26 -53 4 53 9 -14 -14 33 26 -58 -1 29 42 -25 -13 12 -4 6 -52 -37 -9 34 -47 -66 3 43 -19 -73 -3 36 11
6718 11 -69 -27 26 16 -25 -27 10 29 11 -53 -26 66 53 -52 -31 41 39 -15 -33 28 20 -35 -20 -5 34 19 -11 0 7 60 32 -65
6750 -65 -2 49 -4 -85 -20 37 25 -23 -47 0 19 -5 -15 -16 7 -2 -18 -44 6 45 -26 -48 14 63 -13 -26 20 36 -1 -17 -1
6781 -1 -20 27 -21 0 -15 7 12 -28 -31 9 17 -51 -44 -1 5 -38 -19 22 5 -24 0 6 14 8 43 14 -19 29 1 2 7 19 11 2 17 22 -31
6818 -31 -9 8 -4 -19 -8 17 3 -7 -12 8 8 -12 -22 -31 -3 20 -5 -26 -20 37 1 -28 -14 45 -5 -42 -30 44 6 -23 6 26
6850 26 23 33 -21 -9 39 32 -4 -27 33 60 -17 -40 36 8 -6 -56 7 19 6 -38 -27 5 -5 -3 -43 -42 31 27 -58 -34 39 27 -27
6883 -27 -52 37 36 -16 -40 14 33 -15 -21 -29 4 30 25 -23 5 43 10 -45 -20 31 -17 -49 -13 15 7 -9 -36 6 3 -7 -48 -13 20
6916 20 -6 -37 -34 11 37 -26 -71 24 24 2 -42 -14 -8 -16 -5 -6 0 15 38 -16 2 14 -3 1 -7 24 19 -16 -17 24 28 3 -12 8 -2 -14
6952 -14 -17 -14 -27 -10 1 -44 -4 -10 -13 -30 -17 -8 -34 -18 -10 7 -22 -38 1 20 -13 9 19 19 4 7 -6 1 1 23 -18 8 30 -3 -27
6987 -27 15 26 8 -47 -17 16 -2 -27 -38 -2 -20 -26 -18 -13 -10 -10 -32 -42 17 -5 -10 -64 16 12 -31 -47 -15 24 -6 -7 -18 18 -1 -16
7021 -16 2 24 27 12 -34 -18 29 27 -38 -3 32 41 -43 -37 15 25 -7 -25 -32 9 -17 -21 -26 14 34 -1 -41 -11 45 1 -49 -28 22 1
7055 1 -38 -22 6 10 12 -2 -5 42 20 7 -6 16 45 -2 -21 -6 33 -20 -35 21 13 12 -8 8 -3 20 -30 -47 7 1 21 -57 -39 18
7089 18 -3 -35 -26 27 10 -9 -9 -21 10 4 4 7 -17 32 -6 -10 19 19 11 -29 8 41 21 6 -3 27 -26 -19 0 -12 -36 -22 -10 8 -11
7124 -11 -1 23 -11 2 15 -27 -12 14 -21 -29 16 -13 3 -7 4 7 11 4 11 45 14 -5 15 28 32 14 -9 -13 4 5 -16 3 0 24 -4
7159 -4 -33 -19 2 -22 -22 11 24 -16 -3 -12 -31 15 -22 -19 -14 13 -6 -36 -24 39 13 -28 -6 15 5 -4 8 -15 4 2 -24 -38 -6 37
7193 37 16 -22 19 40 6 -23 -29 18 22 -21 -26 18 -11 -26 -30 -6 1 -5 -15 -21 -20 37 5 -26 5 13 -16 -49 -16 38 -26 -17 3 35 6
7228 6 11 -9 -25 43 10 -17 11 35 4 -23 -12 23 15 10 -14 5 -12 -9 -17 -12 -3 3 -9 -6 -4 -19 -10 -35 -23 11 23 -14 -14 0 14 8 -9
7265 -9 3 6 -4 15 -10 6 -15 4 -6 4 32 -15 9 -11 45 12 -3 17 -4 -7 18 17 11 1 -11 12 -30 11 17 8 -21 -10 -16 -10 -28
7300 -28 -2 -32 -42 -20 -21 -58 4 -13 15 -21 11 20 -17 10 -4 4 24 -5 5 -4 12 30 0 -25 3 37 3 -15 -37 12 13 1 -12
7333 -12 18 -12 -22 -14 -3 -20 10 0 -49 -25 2 3 -32 7 -9 4 -28 7 11 -6 -36 -2 17 12 -8 -34 1 28 26 0 -13 13 24
7366 24 -5 -40 5 24 -13 -14 5 14 -20 -25 -32 16 -12 -11 -49 -28 20 20 -20 -12 -10 23 0 -34 0 23 -4 -5 -21 28 -12 -25 18 17 17 0
7402 0 -27 13 16 0 -11 11 2 -11 11 -1 -7 27 -40 -28 -23 -2 4 -31 2 -6 17 -31 -3 -14 -17 2 -18 -5 -20 7 -18 -4 -5 -12 -9 4
7438 4 7 -7 16 5 0 17 -1 -3 16 -8 18 -16 -10 -15 -26 -4 31 1 24 -7 -32 10 -24 -27 12 -17 -3 -26 7 -13 -19 -3 1 -5 -2 -7
7474 -7 -47 -23 28 29 -12 15 -10 25 16 7 20 13 -1 4 -1 -10 17 -2 -8 -5 24 2 -51 4 21 -9 -19 0 -5 -21 -23 -18 -16 1 -14 -19 4 -12
7512 -12 5 -42 -12 -4 30 -9 -19 -27 8 22 -20 -8 25 6 -31 -3 6 25 6 -3 27 -6 11 -28 7 0 -15 12 -8 -10 -11 2 15 2
7546 2 -15 -23 -20 -19 -9 -9 4 12 -25 -12 0 -18 -2 -12 3 12 -8 7 -2 5 4 21 14 21 -10 -18 -9 8 6 11 9 -16 13 10 -15 3 6 4 -3 -21 -43
7587 -43 -24 -49 -13 -4 -16 -9 -17 -10 -17 -17 -20 -11 -2 18 -2 9 -10 4 5 -4 -2 -3 6 5 1 4 15 7 33 11 14 19 6 -8 0 0 11 3 4 11 -13 -16 -10 6
7631 6 -17 -11 -10 -42 16 8 2 8 -11 -4 -14 -7 4 0 -2 -2 -6 12 15 -6 6 -12 -20 13 -3 7 6 8 10 8 -21 -23 27 0 -7 -20 -3 23 -9 -6 -10
7672 -10 -5 -17 -16 -18 4 -5 -28 -31 4 -3 -27 -17 -17 -7 -1 -6 -13 0 22 0 -6 15 3 10 12 -13 8 17 0 -2 0 7 -4 22 7 3 9 -25 -11 -12
7712 -12 3 2 -16 14 -18 -19 -3 -12 -14 -12 -34 -17 8 6 -30 1 31 6 9 5 -17 17 21 13 -7 1 13 12 10 19 5 5 -15 2 9 18 -15 7 1
7751 1 8 -1 3 10 6 -7 -17 -9 18 -3 -36 -39 -11 -11 -2 -35 -18 19 -6 -26 -11 17 16 -15 7 -4 -7 2 -19 17 8 -4 -1 -3 -1 -1 -2 -29 -11 18
7791 18 -11 13 11 8 -7 0 18 20 11 -11 8 1 -6 -4 -5 -5 -5 -19 1 -17 -2 -2 -16 7 7 26 -13 2 -9 34 -6 -12 34 43 -5 2 4 -5 11
7830 11 -3 -5 -13 20 -20 -21 -9 34 2 4 36 -16 -2 -6 16 -3 -18 -15 -18 10 6 -5 -24 -18 -19 -20 1 -6 2 7 7 2 11 -5 -6 24 1 10 9 -10
7870 -10 -15 17 28 -17 -17 -16 6 -22 -43 0 -9 -3 15 -11 4 -19 -8 -27 7 14 -44 1 -7 27 -6 -17 -19 41 12 -9 -27 42 35 -6 8
7905 8 -2 14 13 13 -1 18 28 2 -13 -8 10 9 -3 -1 7 7 -9 2 6 -7 -6 -7 -21 3 -11 -4 -14 4 10 -18 -2 8 13 -7 -26 22 9
7942 9 8 3 -20 14 -9 -32 34 26 15 -24 8 6 36 -10 -20 2 22 -3 -23 4 0 -17 -30 0 6 -18 -21 -4 -8 -1 2 -34 6 7 6 -18 -11
7979 -11 10 12 0 -15 4 32 -13 -18 24 21 -12 -1 -12 20 8 -20 -12 -24 1 -14 -14 -19 -18 12 -19 6 1 23 -22 -14 -17 3 -30 -7 -31
8014 -31 2 -5 -32 -15 9 -3 -4 -1 8 21 -20 1 -9 30 -2 -12 14 -14 11 -6 -3 10 27 15 -11 -6 10 7 -22 -23 36 2 -14 -38
8048 -38 -8 1 -40 -25 -20 -9 -9 -18 -28 -1 -20 -23 -22 -11 8 -7 5 -9 3 -31 -19 8 22 -2 1 22 26 -6 -9 1 15 24 3 -14 3
8083 3 25 -4 -22 4 27 -6 -14 -6 -5 -3 -17 -8 -27 4 -2 -29 -8 -8 1 4 -15 4 -7 10 -11 -8 30 -24 3 3 17 -18 7 5 24 -3 7
8120 7 -14 2 10 18 -8 -12 -3 -14 -20 -16 9 28 24 -20 -21 -22 -1 -9 18 -16 -34 -18 6 -5 4 -26 -56 -24 2 2 -23 -12 30 28 -4 22 15 13
8158 13 -4 -4 5 8 11 13 -13 18 14 -17 9 5 19 2 -11 12 7 5 -20 -6 0 9 -17 -49 -31 -24 -22 -6 -26 2 -26 7 -20
8191b0
##END NTUPLES=NMR FID
##END=
