##TITLE=1H_AM_A489
 CDCl3, 8 sc, 
 27.6.2019
##JCAMPDX= 6.0         $$ Bruker NMR JCAMP-DX V2.0
##DATA TYPE= NMR FID
##DATA CLASS= NTUPLES
##ORIGIN= UXNMR, Bruker Analytische Messtechnik GmbH
##OWNER= root
$$ XWIN-NMR		Version 3.5
$$ Thu Jun 27 14:32:11 2019 Russian Standard Time (UT+4h)  she@DPX200
##.OBSERVE FREQUENCY= 200.13155
##.OBSERVE NUCLEUS= ^1H
##.DELAY= (6, 6)
##.ACQUISITION MODE= SIMULTANEOUS
##.ACQUISITION SCHEME= undefined
##.AVERAGES= 8
##.DIGITISER RES= 18
##SPECTROMETER/DATA SYSTEM= spect
##.PULSE SEQUENCE= zg30
##.SOLVENT NAME= CDCl3
##.SHIFT REFERENCE= (INTERNAL, CDCl3, 0, 15.7039)
##AUDIT TRAIL= $$ (NUMBER, WHEN, WHO, WHERE, WHAT)
$$ ##TITLE= Audit trail, XWIN-NMR		Version 3.5
$$ ##JCAMPDX= 5.01
$$ ##ORIGIN= Bruker BioSpin GmbH
$$ ##OWNER= she
$$ F:/spectra/data/she/nmr/H-F/1/audita.txt
$$ ##AUDIT TRAIL=  $$ (NUMBER, WHEN, WHO, WHERE, WHAT)
(   1,<2019-06-27 14:31:09.18 +0400>,<she>,<DPX200>,
      <created by zg, POWCHK disabled, PULCHK disabled
       configuration hash MD5:
       00 E9 B6 7A A2 85 ED C7 34 08 36 98 17 FE 4E 26
       data hash MD5: 16K
       24 04 A9 52 A3 1E F7 F9 3F AA F1 08 1B BE 74 9B>)
$$ ##END=
$$ 
$$ hash MD5
$$ 31 C3 7C 4D 25 A4 58 54 54 BC 48 BE 75 4C 52 31
##$RELAX= 
##$RELAX= 
##$RELAX= 
##$RELAX= 
##$RELAX= 
##$RELAX= 
$$ Bruker specific parameters
$$ --------------------------
##$DU= <F:/spectra>
##$EXPNO= 1
##$NAME= <H-F>
##$PROCNO= 1
##$TYPE= <nmr>
##$USER= <she>
##$AMP= (0..31)
100 100 100 100 100 100 100 100 100 100 100 100 100 100 100 100 100 100 
100 100 100 100 100 100 100 100 100 100 100 100 100 100 
##$AQSEQ= 0
##$AQ_mod= 1
##$AUNM= <au_zg>
##$AUTOPOS= <>
##$BF1= 200.13
##$BF2= 200.13
##$BF3= 200.13
##$BF4= 200.13
##$BF5= 200.13
##$BF6= 200.13
##$BF7= 200.13
##$BF8= 200.13
##$BYTORDA= 1
##$CFDGTYP= 0
##$CFRGTYP= 5
##$CHEMSTR= <none>
##$CNST= (0..31)
1 1 145 1 1 1 1 1 1 1 1 1 1 1 1 1 1 1 1 1 1 1 1 1 1 1 1 1 1 1 1 1 
##$CPDPRG= <>
##$CPDPRG1= <>
##$CPDPRG2= <>
##$CPDPRG3= <>
##$CPDPRG4= <mlev>
##$CPDPRG5= <mlev>
##$CPDPRG6= <mlev>
##$CPDPRG7= <mlev>
##$CPDPRG8= <mlev>
##$CPDPRGB= <>
##$CPDPRGT= <>
##$D= (0..31)
0 1.2 0 0 0 0 0 0 0 0 0 0.03 0 0 0 0 0 0 0 0 0 0 0 0 0 0 0 0 0 0 0 0 
##$DATE= 1561631468
##$DBL= (0..7)
120 120 120 120 120 120 120 120 
##$DBP= (0..7)
150 150 150 150 150 150 150 150 
##$DBP07= 0
##$DBPNAM0= <>
##$DBPNAM1= <>
##$DBPNAM2= <>
##$DBPNAM3= <>
##$DBPNAM4= <>
##$DBPNAM5= <>
##$DBPNAM6= <>
##$DBPNAM7= <>
##$DBPOAL= (0..7)
0.5 0.5 0.5 0.5 0.5 0.5 0.5 0.5 
##$DBPOFFS= (0..7)
0 0 0 0 0 0 0 0 
##$DE= 6
##$DECBNUC= <off>
##$DECIM= 24
##$DECNUC= <off>
##$DECSTAT= 4
##$DIGMOD= 1
##$DIGTYP= 9
##$DL= (0..7)
0 120 120 120 120 120 120 120 
##$DP= (0..7)
150 150 150 150 150 150 150 150 
##$DP07= 0
##$DPNAME0= <>
##$DPNAME1= <>
##$DPNAME2= <>
##$DPNAME3= <>
##$DPNAME4= <>
##$DPNAME5= <>
##$DPNAME6= <>
##$DPNAME7= <>
##$DPOAL= (0..7)
0.5 0.5 0.5 0.5 0.5 0.5 0.5 0.5 
##$DPOFFS= (0..7)
0 0 0 0 0 0 0 0 
##$DQDMODE= 0
##$DR= 18
##$DS= 0
##$DSLIST= <SSSSSSSSSSSSSSS>
##$DSPFIRM= 0
$$ [...]
##$SUBNAM2= <"">
##$SUBNAM3= <"">
##$SUBNAM4= <"">
##$SUBNAM5= <"">
##$SUBNAM6= <"">
##$SUBNAM7= <"">
##$SUBNAM8= <"">
##$SUBNAM9= <"">
##$SW= 24.9336996594482
##$SWIBOX= (0..15)
0 0 2 0 0 0 0 0 0 0 0 0 0 0 0 0 
##$SW_h= 4990.01996007984
##$TD= 16384
##$TD0= 1
##$TE= 0
##$TE2= 300
##$TE3= 300
##$TEG= 300
##$TL= (0..7)
0 120 120 120 120 120 120 120 
##$TP= (0..7)
150 150 150 150 150 150 150 150 
##$TP07= 0
##$TPNAME0= <>
##$TPNAME1= <>
##$TPNAME2= <>
##$TPNAME3= <>
##$TPNAME4= <>
##$TPNAME5= <>
##$TPNAME6= <>
##$TPNAME7= <>
##$TPOAL= (0..7)
0.5 0.5 0.5 0.5 0.5 0.5 0.5 0.5 
##$TPOFFS= (0..7)
0 0 0 0 0 0 0 0 
##$TUNHIN= 0
##$TUNHOUT= 0
##$TUNXOUT= 0
##$USERA1= <user>
##$USERA2= <user>
##$USERA3= <user>
##$USERA4= <user>
##$USERA5= <user>
##$V9= 5
##$VALIST= <valist>
##$VCLIST= <CCCCCCCCCCCCCCC>
##$VD= 0
##$VDLIST= <DDDDDDDDDDDDDDD>
##$VPLIST= <PPPPPPPPPPPPPPP>
##$VTLIST= <TTTTTTTTTTTTTTT>
##$WBST= 1024
##$WBSW= 4
##$XGAIN= (0..3)
0 0 0 0 
##$XL= 0
##$YL= 0
##$YMAX_a= 121835
##$YMIN_a= -190214
##$ZGOPTNS= <>
##$ZL1= 120
##$ZL2= 120
##$ZL3= 120
##$ZL4= 120
##$ABSF1= 10
##$ABSF2= 0
##$ABSG= 5
##$ABSL= 3
##$ALPHA= 0
##$AQORDER= 0
##$ASSFAC= 0
##$ASSFACI= 0
##$ASSFACX= 0
##$ASSWID= 0
##$AUNMP= <proc_1d>
##$AZFE= 0.1
##$AZFW= 0.1
##$BCFW= 1
##$BC_mod= 2
##$BYTORDP= 1
##$COROFFS= 0
##$CY= 11.3945322036743
##$DATMOD= 1
##$DC= 2
##$DFILT= <>
##$DTYPP= 0
##$F1P= 18.9103706918063
##$F2P= -1.10871071338519
##$FCOR= 0.5
##$FTSIZE= 0
##$FT_mod= 4
##$GAMMA= 1
##$GB= 0.15
##$INTBC= 1
##$INTSCL= 1
##$ISEN= 128
##$LB= 0.24
##$LEV0= 0
##$LPBIN= 0
##$MAXI= 10000
##$MC2= 0
##$MEAN= 0
##$ME_mod= 0
##$MI= 1.114404
##$NCOEF= 0
##$NC_proc= 0
##$NLEV= 6
##$NOISF1= 3.799351
##$NOISF2= 2.8
##$NSP= 1
##$NTH_PI= 0
##$NZP= 0
##$OFFSET= 15.70392
##$PC= 1
##$PHC0= -8506.474
##$PHC1= 25.40098
##$PH_mod= 1
##$PKNL= yes
##$PPARMOD= 0
##$PSCAL= 0
##$PSIGN= 0
##$REVERSE= no
##$SF= 200.130013532006
##$SI= 16384
##$SIGF1= 3
##$SIGF2= 2
##$SINO= 400
##$SIOLD= 16384
##$SREGLST= <1H.CDCl3>
##$SSB= 0
##$STSI= 0
##$STSR= 0
##$SW_p= 3612.71676300578
##$SYMM= 0
##$S_DEV= 0
##$TDeff= 0
##$TDoff= 0
##$TI= <>
##$TILT= no
##$TM1= 0
##$TM2= 0
##$TOPLEV= 0
##$USERP1= <user>
##$USERP2= <user>
##$USERP3= <user>
##$USERP4= <user>
##$USERP5= <user>
##$WDW= 1
##$XDIM= 8192
##$YMAX_p= 0
##$YMIN_p= 0
$$ End of Bruker specific parameters
$$ ---------------------------------
##NTUPLES= NMR FID
##VAR_NAME=  TIME,          FID/REAL,        FID/IMAG
##SYMBOL=    X,             R,               I
##VAR_TYPE=  INDEPENDENT,   DEPENDENT,       DEPENDENT
##VAR_FORM=  AFFN,          ASDF,            ASDF
##VAR_DIM=   8192,          8192,            8192
##UNITS=     SECONDS,       ARBITRARY UNITS, ARBITRARY UNITS
##FACTOR=    0.0002004,     1,               1
##FIRST=     0,             0,               0
##LAST=      1.6414764,     0,               0
##MIN=       0,             -190214,         0
##MAX=       1.6414764,     121835,          0
$$ Real data points
##PAGE= N=1
##DATA TABLE= (X++(R..R)), XYDATA
0@%%%%%%%qJ6j6J6j6K4l2M0m8N6p1Q1r2J10j32J53j76K03k33K67l04L46l90M40
$$ 0 0 0 0 0 0 0 0 -8 8 -8 8 -8 16 -16 24 -24 32 -39 42 -50 60 -72 81 -95 108 -125 142 -162 184 -206 234
31B34m98N57o23O98p76Q63r61J068j185J312j452J607j778J968k183K424k696
$$ 234 -264 293 -330 368 -408 455 -506 562 -623 689 -763 844 -934 1034 -1149 1275 -1421
48a421L009l370L792m292M896n647O614p903R722j2512J7379k8316R9663l0435
$$ -1421 1588 -1782 2010 -2282 2614 -3033 3581 -4322 5400 -7112 10267 -18049 81614 51179
62E1179j58026O9475Q2106K9831j4112M928o7966p9388J7445J12694L5857o6768
$$ 51179 -106847 -37372 44734 74565 60453 65381 -2585 -81973 -64528 48166 84023 17255
74A7255p4431j4626O670L9130O3537J3851r1013r0167J9302R3434N1886j4804
$$ 17255 -57176 -71802 -65132 -26002 37535 51386 -39627 -129794 -110492 -17058 34828 20024
86B0024m9432n7719k6465N6421R5187K0262q1290p0973J5794N7936L8850K2592
$$ 20024 -29408 -87127 -113592 -57171 38016 58278 -23012 -93985 -78191 -20255 18595 41187
98D1187p46n2908o7794J1040R6208P2290k5380p6115m9166J0874O0454O5059L641
$$ 41187 40441 -12467 -80261 -69221 26987 99277 73897 -2218 -51384 -40510 19944 85003 88644
111H8644o7913o0897J2241N6875M1512M181l4888o3079l3539M8722Q0152J3352
$$ 88644 20731 -40166 -27925 28950 70462 74643 39755 -23324 -56863 -8141 72011 85363
123H5363n6238n3040j9895L017M3310P0507M939r5962q0632L8434R1349K8374
$$ 85363 29125 -23915 -43810 -40793 2517 73024 77963 -17999 -98631 -60197 31152 59526
135E9526l3980m2003l7724j7126M6764P9244R490p3430n9175J1163L7708L3076
$$ 59526 25546 -16457 -54181 -71307 -24543 54701 64191 -9239 -68414 -57251 -19543 13533
147A3533L3450q77o9269o4623L7178R5324K9288n4439n3044j1816J1167L7810
$$ 13533 46983 46106 -23163 -87786 -50608 44716 74004 19565 -33479 -45295 -34128 3682
159C682N9358P980q0503p4004K9607Q4194L1058k7450k9420k8377l1482J5472
$$ 3682 63040 71020 -9483 -83487 -53880 30314 61372 33922 4502 -23875 -55357 -39885
171c9885P5457M3256n4325q1658j1238N0653M8200J7925j7352n7099n1677K3099
$$ -39885 35572 78828 24503 -57155 -68393 -17740 30460 48385 31033 -26066 -77743 -54644
183e4644Q2098M2209l7475o1191k6762J0982L9354N1257J2831n2138o2999p7N6474
$$ -54644 27454 69663 32188 -29003 -55765 -44783 -5429 45828 58659 6521 -56478 -56555 -81
196h1M9387N536l3982n2331k8009L5089P2882L2369m3962o8452k5134L1471N7088
$$ -81 49306 54842 20860 -31471 -59480 -24391 48491 80860 36898 -31554 -56688 -25217 31871
209C1871L6329j7234n9233m2260J6298N1080L6363m378l9106m9874j4629M6498
$$ 31871 68200 50966 -8267 -50527 -34229 16851 53214 48836 9730 -40144 -54773 -8275
221h275O4032P170n7648n5758l004L7005M3598K4633k1052o2670m1740L3339P0049
$$ -8275 55757 62927 5279 -50479 -53483 -16478 27120 51753 30701 -31969 -73709 -40370 29679
234B9679K3650l7140m5732j9465P280L5866M8305O077n7904n7887J0611N8873
$$ 29679 53329 16189 -29543 -49008 -41728 -5862 42443 48520 -9384 -67271 -56660 2213
246B213L9870l204l2035m2860k5129L1256O7140K4970m8391n7260m453L4239L4898
$$ 2213 42083 38879 6844 -36016 -61145 -29889 37251 62221 13830 -43430 -47883 -13644 21254
259B1254K0536p379m6032m5210J5658O6488L8484k7701n1442k6421P705L3871
$$ 21254 41790 34411 -11621 -56831 -41173 25315 63799 36098 -15344 -41765 -34060 -189
271a89M4579J4737m4344o0818o338N2448M8691R34l5116l9545j7864K2059N0545
$$ -189 44390 59127 14783 -46035 -52373 75 48766 49700 14584 -24961 -42825 -20766 29779
284B9779K9460k6623n5112k5829K4360M5693K7344j1488m3522l8654N963M7650
$$ 29779 59239 32616 -22496 -48325 -23965 21728 49072 37584 -5938 -44592 -38629 9021
296I021M0208p931m5294l8352J497L7676M1858O518l7330m8192j2353L4619M7989
$$ 9021 49229 41298 -3996 -42348 -40851 -3175 38683 45201 7871 -40321 -52674 -18055 29934
309B9934J7552k8932m9366k5278K3295M9580K7173j8869m4133l1443Q743M3138
$$ 29934 47486 18554 -30812 -56090 -32795 16785 43958 25089 -19044 -50487 -41744 1394
321A394L9137m783m6289m0027O912M2729L6075J383l1999m0107j3937L2140N1519
$$ 1394 40531 35748 -10541 -50568 -43656 -927 35148 36531 4532 -35575 -49512 -17372 34147
334C4147J6838l5860m7828j2303K8533M1084K2502j4703m4929l4232J5551N2001
$$ 34147 50985 15125 -32703 -45006 -16473 24611 47113 32410 -12519 -46751 -31200 20801
346B0801L3922j6681m3925l0243M606L4198L9759Q018l7834m8013o341L9429M1004
$$ 20801 54723 38042 -5883 -36126 -31520 2678 42437 50455 12621 -35392 -41733 -2304 38700
359C8700N404k8678l7498j8401J9982M5135K5638k4797m9680k2370K2403L9937
$$ 38700 44104 15426 -22072 -40473 -20491 24644 50282 25485 -24195 -46565 -24162 15775
371A5775K3450r795l7201l6211J781M2834M0048m239m1606l5638k22L1364L7263
$$ 15775 39225 29430 -7771 -43982 -42201 633 40681 36442 -5164 -40802 -41024 -9660 27603
384B7603J1680k8915m3781j5186K9991M4124J5538k4041l9773k1126J6583M1768
$$ 27603 39283 10368 -33413 -48599 -18608 25516 41054 17013 -22760 -43886 -27303 14465
396A4465K8217j3797m2670k8779J1518L8824L1275l305l6476l6835j181L7569
$$ 14465 42682 28885 -13785 -42564 -31046 7778 39053 35748 -728 -37563 -38744 -1175
408a175L8906L213l3501l8065r139K7462M0889J5836k5309m2862j7919K2641L9223
$$ -1175 37731 40944 7443 -30622 -39761 -12299 28590 44426 19117 -23745 -41664 -19023 20200
421B0200K0787j5110l8462k7829J0931M0867L0699j0994l8579k9533M626L3142
$$ 20200 40987 25877 -12585 -40414 -29483 11384 42083 31089 -7490 -37023 -32397 745
433G45L3830L935l3186l9731n669L3590L8321P379k6890l5635j5726K0113M0375
$$ 745 34575 38510 5324 -34407 -40076 -6486 31835 39214 12324 -23311 -39037 -18924 21451
446B1451K2109j9828m2175k1618J6872L7408K4471q571l6113l1580M678L7971
$$ 21451 43560 23732 -18443 -40061 -23189 14219 38690 30119 -5994 -37574 -32896 5075
458E075L3017m133l4650l1367k590K8399L5246R717k8697l9876j0824K7319L6375
$$ 5075 38092 33959 -691 -32058 -34648 -6249 28997 38714 10017 -29859 -40683 -13364 23011
471B3011J4237k0027l7379k3100J5772M2049K5516j6456l9318k4235R941L2483
$$ 23011 37248 17221 -20158 -43258 -27486 14563 40079 23623 -15695 -39930 -29989 2494
483B494K9669j66l3691l6558J33L5631L3294J420k6597l1447j1550K1754L9345
$$ 2494 32163 31997 -1694 -38252 -38119 -2488 30806 32226 5629 -25818 -37368 -15614 23731
496B3731J8612k5063m1206j4427K3286L4859J7790j1709l4290k8164R471M1239
$$ 23731 42343 17280 -23926 -38353 -15067 19792 37582 25873 -8417 -36581 -27110 14129
508A4129K9576j1829l6268k5329L915K7187L0842Q126k8489l9889q670L0680L6393
$$ 14129 43705 31876 -4392 -29721 -25806 1381 32223 40349 11860 -28029 -36699 -6019 30374
521C0374P831k3943l3973j6517J6380L8291K1759k0037l9545j9572J6532L2012
$$ 30374 38205 14262 -19711 -36228 -19848 18443 40202 20165 -19380 -38952 -22420 9592
533I592K1141p614l1741k9812L787L4486L0105k178l0341l1007o162K7396L8055
$$ 9592 30733 23119 -8622 -38434 -34647 -161 29944 27766 -2575 -33582 -39744 -12348 25707
546B5707J1109k9090l8552r900K5753L4205J5855j5982l5426k2610J6522L9083
$$ 25707 36816 7726 -30826 -40726 -14973 19232 35087 19105 -16321 -38931 -22409 16674
558A6674K0904j5283k9741j9351L431K5655L2063M190l3911l7141K310L5076K8900
$$ 16674 37578 22295 -7446 -26797 -23366 2289 34352 38542 4631 -32510 -30200 4876 33776
571C3776K77k3285l1169j4641K2425M2630J3920l1451l8603o755K1104K4846J5677
$$ 33776 34053 10768 -20401 -35042 -12617 30013 43933 12482 -26121 -32876 -11772 13074 28751
584B8751l841l1277l4092N406M2138K8847j2220l2388k2342j789K1792L4769J2869
$$ 28751 24910 -6367 -40459 -35053 7085 35932 23712 -8676 -31018 -32807 -11015 23754 36623
597C6623l1611m2424j874L6456K9348j419j8318k3573j5207J1877L6796K3980
$$ 36623 5012 -37412 -39286 -2830 26518 25099 6781 -16792 -31999 -20122 16674 40654
609D0654j8607l8363j5866J4742K8199K2913N54l0880l6162J54L9820L4106o332
$$ 40654 22047 -16316 -32182 -17440 10759 33672 34226 3346 -32816 -32662 7158 41264 34932
622C4932l3668k7154j743K3381L1454Q859k4962l3954r202J9493K7248J4176j0791
$$ 34932 1264 -25890 -27633 -4252 27202 36061 11099 -22855 -32057 -12564 14684 28860 18069
635A8069l0522k5091R283L6323K3391j2542l3066k3066N240L1344L1100k384l7899
$$ 18069 -12453 -37544 -28261 8062 31453 18911 -14155 -37221 -31981 -637 30463 28079 -9820
648i820l1464Q513L3267K3407j73j6732k6620j6618J7649M0342J7804k3139l3561
$$ -9820 -41284 -32771 496 23903 23730 6998 -19622 -36240 -18591 21751 39555 16416 -17145
661a7145j0376J3460K4898K4874m43l6747l6075J2774M6419K2214j9302k8282
$$ -17145 -27521 -14061 10837 35711 35268 -1479 -37554 -24780 21639 43853 24551 -3731
673c731j3673q01J5767L0524J1508k9663l7795l29K8585K1381K300r411k5214
$$ -3731 -17404 -18205 -2438 28086 39594 9931 -27864 -28193 392 21773 24073 14662 -10552
686a0552k8189Q683M6152K7792k7654m4755j1935J9397K4685J7716J035k6761
$$ -10552 -38741 -30058 16094 43886 16232 -28523 -40458 -21061 3624 21340 22375 -4386
698d386l3615J383L6385K6083q222k2735j6467n172J1663L0461J9852k0043l9978
$$ -4386 -38001 -36618 -233 25850 17628 -5107 -21574 -26746 -15083 15378 35230 15187 -24791
711b4791j2631K6820L5068J1322j6258l0939j9444J3009L6739K1537j5455l2313
$$ -24791 -37422 -10602 24466 35788 19530 -11409 -30853 -17844 18895 40432 24977 -7336
723g336j6839Q770K3870K2086J537k5515l0234m548K5074K9738Q212k0466l4744
$$ -7336 -24175 -15405 8465 30551 32088 6573 -23661 -28209 -3135 26603 34815 14349 -20395
736b0395j7550K0477L8785J3672k4830l3220q778J4580K4138J6715p136l1244
$$ -20395 -37945 -17468 21317 34989 10159 -23061 -31839 -17259 6879 23594 16458 -14786
748a4786k3834J2657L3489J6507r583j9674k0164q954J9566L9423J3966l2982
$$ -14786 -38620 -25963 7526 24033 14450 -5224 -25388 -34342 -14776 24647 38613 5631
760E631l9460N73L0241K4576N291j1384k6401k1407J4765M1182J7017k4477k9789
$$ 5631 -33829 -33256 -3015 21561 26852 15468 -10933 -32340 -17575 23607 40624 16147 -13642
773a3642o010R890J4576K0555J0169k5307l7865k016L6767K8133q419k5643j9177
$$ -13642 -19652 -9762 4814 25369 35538 10231 -27634 -29650 7117 35250 26831 1188 -17989
786a7989n550J5015L1091J4368k7246l9717n386K9053K6160L708j2173k1395k1606
$$ -17989 -23539 -8524 22567 36935 9689 -30028 -35414 -6361 19799 23507 11334 -10061 -31667
799c1667J067L1780K8634p748l3332k1865O489K3663K2607M164k3317l1087m116
$$ -31667 -30600 1180 29814 22066 -11266 -33131 -26642 -2979 19628 23792 475 -30612 -34728
812c4728K9600L0839J353k5324k5262m695J7649K6857J3006j3900k7246j5551
$$ -34728 -5128 25711 27064 1740 -23522 -28217 -10568 16289 29295 15395 -11851 -27402
824b7402J0937K8149K0102p366k9896k2685Q174L0871K2268m773k6195k6718k711
$$ -27402 -16465 11684 31786 24420 -5476 -28161 -19987 10884 33152 28379 2184 -24534 -27245
837b7245K6919L1715L049k8326k7155k182J7966K0477J1084q702k7599k0254J2791
$$ -27245 -326 31389 34438 6112 -21043 -23225 -5259 15218 26302 17600 -9999 -30253 -17462
850a7462L3484J4617j7216k6780j3061O386K2406K4272J33l1639l0768O536L2903
$$ -17462 16022 30639 13423 -13357 -26418 -20032 2374 26646 26779 -4860 -35628 -29092 3811
863C811K0840o428j9395j8002p784J3078K9381J5030k1292l4195p054K1327K4334
$$ 3811 24651 18223 -1172 -19174 -26958 -13880 15501 30531 9239 -24956 -32010 -10683 13651
876A3651R823p739k3135k3253L669L3651K5967j1148l1141j6024P849K0086J7161
$$ 13651 23474 15735 -7400 -30653 -26984 6667 32634 21486 -9655 -25679 -17830 2256 19417
889A9417L833j8217k6909n447K5376K8202J693k2752k3384o248J3701K5912J6838
$$ 19417 23250 5033 -21876 -27323 -1947 26255 27948 5196 -18188 -24436 -10735 15177 32015
902C2015j1007l2515j9614J4290L1021J5873j1203k4584j6938L776K1706K2906
$$ 32015 21008 -11507 -31121 -16831 14190 30063 18860 -5724 -22662 -18886 2820 25726
914B5726M44k4668k6798k46K4796K4329J789j9397k3031r412J4296K7211J4211
$$ 25726 26170 1502 -25296 -25542 -746 23583 25372 5975 -17056 -26468 -12172 15039 29250
927B9250j5702l0434j3286J6911K6706J1758j1467k3522j7889M887K6791K3804
$$ 29250 13548 -16886 -30172 -13261 13445 25203 13736 -9786 -27675 -22788 4003 27807
939B7807m334k8946k3499L935K3376K1593L232j6783k4964j0715J7533L0043J0063
$$ 27807 23473 -5473 -28972 -25037 -1661 19932 23164 6381 -18583 -29298 -11765 18278 28341
952B8341k0484k6675o846J5820K2035J2406q344k5176j9814Q787K9827J9871r822
$$ 28341 7857 -18818 -25664 -9844 12191 24597 16253 -8923 -28737 -19950 9877 29748 19926
965A9926k6083j7272L623K0022K1893M505k1316k7553m817K3629K6540L422j9357
$$ 19926 -6157 -23429 -19806 216 22109 26614 5298 -22255 -27072 -3443 23097 26519 7162
978G162k2947q684J1918K4884J6393j0613k9234j7529J2630K6374J3864p880k0066
$$ 7162 -15785 -24469 -12551 12333 28726 18113 -11121 -28650 -16020 10354 24218 16338 -3728
991c728j6926k22K0593K3968J208k5609k4071K087K2890J9793K420j5416k2467
$$ -3728 -20654 -20876 -283 23685 24893 -716 -24787 -22700 190 19983 22403 6987 -15480
1004a5480j1533J4241K9215J2831j7224k6628j0087J1940K0965J4359m223k2205
$$ -15480 -27013 -12772 16443 29274 12050 -14578 -24665 -12725 8240 22599 18376 -3829
1016c829k1216L453K5796K1322n653k3712j7475R56J7326K0591O195j7074k6296
$$ -3829 -25045 -21592 4204 25526 19873 -3839 -21314 -20358 -3032 17559 23754 6680 -19616
1029a9616p910J9930K5012N367j6096k1036r630R988K2844J5698q773k6372j6675
$$ -19616 -27526 -7596 17416 22783 6687 -14349 -23979 -13991 8853 24551 15778 -10594 -27269
1042b7269R299K4746J5946n273k0577j8697k07K0338K2716K739k0894k2872k447
$$ -27269 -17970 6776 22722 17449 -3128 -21825 -22032 -1694 21022 23761 2867 -20005 -22452
1055b2452J8845K1570N174j3989k2002r859J2165K4560J3372j1849k5206j3273
$$ -22452 -3607 17963 23137 9148 -12854 -22713 -10548 14012 27384 15535 -9671 -22944
1067b2944J0179K2557J4477n610k0500j8392J273K1565K1532j415k1847k0320
$$ -22944 -12765 9792 24269 18659 -1841 -20233 -18960 2605 24137 22722 875 -19445
1079a9445l63J7755J9223N322j4523k3129j0204J4650K5136R407j4435k3273j0357
$$ -19445 -19808 -2053 17170 22492 7969 -15160 -25364 -10714 14422 23829 9394 -13879 -24236
1092b4236R751K0345J4736n543k2461j8575M682K3536J8322m069k0125j7952q44
$$ -24236 -14485 5860 20596 15053 -7408 -25983 -21301 2235 20557 16488 -3637 -21589 -22433
1105b2433J7074K1714N956j7208k3724o282J7063K2745P105j2614k0313j0849
$$ -22433 -5359 16355 22311 5103 -18621 -24903 -7840 14905 22010 9396 -10917 -21766
1117b1766Q796K3108J4590p874k3665j4815P491K1574J5267l064j8676j8699j398
$$ -21766 -12970 10138 24728 16854 -6811 -21626 -14135 7439 22706 19642 966 -17733 -19131
1130a9131J9332K1878K117j8950k1826l174J5942J9828O798j2278k1662j1398
$$ -19131 201 22079 24196 5246 -16580 -19754 -3812 16016 22814 10536 -11126 -22524
1142b2524J1011K3013J2171j1016k2010j2429O577J8563J6142k471j9971j9890
$$ -22524 -11513 11500 23671 12655 -9355 -21784 -15207 3356 19498 17027 -2944 -22834
1154b2834J831K1024J8407j210j7782j7600l312J4804K0471P577j5180k2146p336
$$ -22834 -21003 21 18428 17218 -564 -18164 -21476 -6672 13799 21376 6196 -15950 -23286
1167b3286J4539K0372Q544r258j9429j3848P627K2403J5758p106k1743j5149M800
$$ -23286 -8747 11625 20169 10911 -8518 -22366 -14739 7664 23422 16316 -5427 -20576 -15776
1180a5776J8846J7282M57j9088k0159j053J8835J8739K340j4733j8291p494J1765
$$ -15776 3070 20352 20809 1721 -18438 -19491 -656 18083 20423 5690 -12601 -20095 -8330
1193h330K0850R940j1909k1463j0292R783J9347J1970n656k0489j6275N145K2210
$$ -8330 12520 22460 10551 -10912 -21204 -11421 7926 19896 14240 -6249 -22524 -17379 4831
1206D831J6082n537j9504j4989Q25J5621J8729M228j6695k1126m282J6169J9413
$$ 4831 20913 15376 -4128 -19117 -18292 -2671 16058 20286 3591 -17535 -21817 -5648 13765
1219A3765O137j0565j8768j2572Q221K3767J4440j0923k3029j0435Q558J7451
$$ 13765 19902 9337 -9431 -22003 -13782 9985 24425 13502 -9527 -19962 -11404 6047
1231F047J3191k114j7985j8335K153K0547J6435k753j5705j5197m355J1841K0672
$$ 6047 19238 17124 -861 -19196 -17043 3504 19939 17186 1481 -13716 -18071 -6230 14442
1244A4442R277j5122k4176p588J4951K0202Q285q704j9883j4933P069K3130J4704
$$ 14442 23719 8597 -15579 -23167 -8216 11986 20271 11567 -8316 -23249 -16180 6950 21654
1257B1654q887j9442j1734K764J3520J6259M499j5930k1249k833J8334J7880K430
$$ 21654 12767 -6675 -18409 -15645 -2125 14134 18633 2703 -18546 -21379 -3045 14835 17265
1270A7265j1866j7112r452R732K4583J1326j5006k3318o720J3041J6272R088k607
$$ 17265 5399 -11713 -21165 -11433 13150 24476 9470 -13848 -20568 -7527 8745 17833 15226
1283A5226j7017j8013K179K2449J6558m358j7489j3150k892J0568K0191J0635
$$ 15226 -1791 -19804 -17625 4824 21382 17024 -465 -13615 -16507 -5939 14252 24887
1295B4887j6013k6515n004J9948J8575J291j0681j4470j0634N667K1583J3626
$$ 24887 8874 -17641 -22645 -2697 15878 17169 6488 -7982 -18616 -12949 8634 22260
1307B2260j0854k2170p966Q086J3436J1468K870j4911k2482k898K3035K1241k973
$$ 22260 11406 -10764 -18730 -10644 2792 14260 17130 2219 -20263 -23161 -126 21115 18142
1320A8142j8610j5565k665J1569J9787R820j4285k3443n938J5032J6712N251o000
$$ 18142 -468 -16033 -18698 -7129 12658 22478 8193 -15250 -21188 -6156 10556 15807 9807
1333I807j3543j3556J875J9415J6786n553j9639j3393K982J5065J7164K785j8546
$$ 9807 -3736 -17292 -15417 3998 20784 15231 -4408 -17801 -14819 246 17410 20195 1649
1346A649k1392m00K0402J7322j117j3299j4358p184Q895J9894J0690j1548j9968
$$ 1649 -19743 -20143 259 17581 16464 3165 -11193 -18377 -9482 10412 21102 9554 -10414
1359a0414q296Q055J3866J3015R42j8070k1062J716K4516J6815p410j7498j0847
$$ -10414 -18710 -10655 3211 16226 17168 -902 -21964 -20248 4268 21083 13673 -3825 -14672
1372a4672m67J0757J7990O899j6566k1809n08J7514J3411J295o103j2336j4616
$$ -14672 -15139 -4382 13608 20507 3941 -17868 -18376 -862 12549 13844 7741 -4595 -19211
1385a9211K777K4555J8157j1908k4822r589R313J4930J2088K393j6330k1893k98
$$ -19211 -16434 8121 26278 14370 -10452 -20041 -10728 4202 16290 18683 2353 -19540 -19838
1398a9838K3316J7323o261j5833q852k740M879J6100J3870j0374k4098r509J4858
$$ -19838 3478 20801 14540 -1293 -10145 -12885 -8006 8094 21964 11590 -12508 -22017 -7159
1411g159J8161N653o540j4683j4432K680K1499J6957q372k2899j0748P376J4666
$$ -7159 11002 16655 10115 -4568 -19000 -16320 5179 22136 13764 -9135 -19883 -12507 2159
1424B159J1335J498j2559j8783m458J5451J8896L722j1948j6068q674Q089J9490
$$ 2159 13494 14992 2433 -16350 -20808 -5357 13539 17261 5313 -10755 -19429 -11340 8150
1437H150J2582r952k1329r050R663J7011J0375m460j7177j4237M650J9123J2851
$$ 8150 20732 10780 -10549 -19599 -9936 7075 17450 12990 -4187 -18424 -13774 5349 18200
1450A8200m411j3765j2015k810J0340J9015P738j5451k1840l554J5420J6141M963
$$ 18200 13789 24 -11991 -14801 -4461 14554 22292 6841 -14999 -18553 -3133 13008 17971
1463A7971p584j7223j3915P376K3893J3141j2777j9976o536N562J0867J1563M664
$$ 17971 10387 -6836 -20751 -13375 10518 23659 10882 -9094 -15630 -10068 799 12362 17026
1476A7026j3610k1477j745K0286J6322l841j3484j1256m892P341J9717J1930j4366
$$ 17026 3416 -18061 -19806 480 16802 12961 -523 -11779 -16671 -9330 10387 22317 7951
1489G951k5006n885J7254J6502L884n974j2503j3626K62J9587J8115n302k0996
$$ 7951 -17055 -22940 -5686 10816 14700 8726 -3777 -17403 -17141 2446 20561 15259 -5737
1502e737j1567M438J3069J2409M593j1561k0784n910J7040K0667J843j4394j5296
$$ -5737 -17304 -12866 203 12612 17205 5644 -15140 -21050 -4010 16657 18500 4106 -11190
1515a1190m389Q063J5856R652p149j8409j0430Q412J7233R882n443j5537j3448
$$ -11190 -15579 -7516 8340 17992 10843 -7566 -17996 -9584 7649 17531 12088 -3449 -16897
1528a6897J995J6334J6490N3j6563j7260j980J4850J8078L395j3803j6907m183
$$ -16897 -14902 1432 17922 17975 1412 -15848 -17828 -2978 15100 18495 4692 -12215 -16398
1541a6398J0248J5553P554o826j7652j1228Q018J8919J0240p725j6163j0068K183
$$ -16398 -6150 9403 16957 10131 -7521 -18749 -10731 8188 18428 10703 -5460 -15528 -13345
1554a3345J3577J5228J818j7619j8236J693J8535J3149j604j1581j3017n719Q846
$$ -13345 232 15460 17278 -341 -18577 -16884 1651 14800 13196 1615 -11402 -17121 -8275
1567h275J9807R069j3982k0404n377J2069J4285P838k813j4821j6172J675K0489
$$ -8275 11532 20601 6619 -13785 -19162 -7093 7192 15030 12217 -2604 -18776 -17101 3388
1580C388J6199o468j7977r869L205J1152J2158M411j2004j8568m797J6849J8082
$$ 3388 19587 13119 -4858 -14727 -11522 -370 11788 16199 4195 -14373 -19170 -2321 15761
1593A5761J601j3123j3907n760O790J5847J1826o512j9881j1882Q701J8095R410
$$ 15761 17362 4239 -9668 -15428 -8638 7209 19035 12523 -7358 -19240 -10539 7556 16966
1606A6966n476j4214j2226K00J4619J6614J169j6830j6883q46J4347J4494L488
$$ 16966 11490 -2724 -14950 -14750 -131 16483 17652 822 -16061 -16907 -2560 11934 15422
1619A5422r784j4980p612Q203J7149R611r273j8434p734R347J5328Q421m856j4354
$$ 15422 5638 -9342 -16954 -8751 8398 18009 8736 -9698 -17432 -8085 7243 15664 10808 -3546
1633c546j2550J333J6491J6402j706j7522j4754J486J3125J3483L675r813j6550
$$ -3546 -16096 -14763 1728 18130 16424 -1098 -15852 -14366 -1241 12242 15917 6104 -10446
1646a0446p659J1467J8908O281j2354j6518n487P210J3840J0536k636j6895j4963
$$ -10446 -18105 -6638 12270 18551 6197 -10321 -15808 -8598 5242 15778 13142 -3753 -18716
1659a8716M341J8261J2276m936j3862j0488o72J0658J4753M533j3420j8176k739
$$ -18716 -14375 3886 16162 11226 -2636 -13124 -13796 -3138 11615 16148 2728 -15448 -18187
1672a8187J5122J5333K824r901j3416q385N949J7256J2076o304j8742j0158O756
$$ -18187 -3065 12268 15092 5191 -8225 -16610 -10661 6595 18671 12367 -6375 -16533 -9777
1685i777J4895R634k444j2062j2954r71J3966J6330L02j5692j4247mJ1915J2897
$$ -9777 5118 14752 12308 246 -12708 -13679 287 16617 16919 1227 -13020 -13024 -1109 11788
1699A1788M628q784j6160q019Q701J8164P820j0015j6256p344O266J3786J0008
$$ 11788 16416 7632 -8528 -16547 -7846 10318 18138 8123 -8133 -15477 -9211 4575 14583
1712A4583k365j5148j3994J339J6846J4052k406j4309j2902p97J0470J4183N123
$$ 14583 12218 -2930 -16924 -15585 1261 15313 12907 -1402 -14304 -15101 -4631 9552 14675
1725A4675r837j6779o367J1815J6433M542r075j3961p006N350J4898J1320l653
$$ 14675 4838 -11941 -18308 -6493 9940 14482 5407 -8554 -15560 -10210 4688 16008 12355
1738A2355j7385j2766N591J6439J0434k487j2161j1311k953J1109J6379L999j3123
$$ 12355 -5030 -17796 -12205 4234 14668 12181 20 -11291 -14244 -3135 13244 17243 4120
1751D120j6179k284J1959J3107M213o990j3560j0082O069J7471J0942q325j7027
$$ 4120 -12059 -14343 -2384 10723 14936 7946 -5614 -15696 -9627 7844 18786 10461 -6566
1764f566p935N834J2367R586j06j2497j4599p25J4953J4802j059j3728j1997j982
$$ -6566 -14501 -8667 3700 13286 13180 683 -13916 -14641 312 15114 14055 327 -11670 -13652
1778a3652Q988J3386P353q245j7690p841J0057J6100N876p142j2755q629K440
$$ -13652 -4664 8722 16075 7830 -9860 -17701 -7644 8456 14332 7190 -5565 -14194 -11754
1791a1754J4038J2332k676j5689j2101L250J4002J0508l81j0307j3279l570J0698
$$ -11754 2284 14616 11940 -3749 -15850 -12600 1402 11910 11529 1222 -12057 -15627 -4929
1804d929J5966M104j1417j4560m821R367J4215O749p041j4693q072N598J4300
$$ -4929 11037 15141 3724 -10836 -15657 -6290 7925 14674 7633 -7060 -15132 -9534 4766
1817D766R824l871j3850j1047K800J3346J1901j007j2223j1581k025J0895J4419
$$ 4766 14590 10719 -3131 -14178 -11378 1968 13869 12862 639 -10942 -12967 -2072 12347
1830A2347L572j1856j4612l271J0771J3153M303p228j2647q615N349J5903R841
$$ 12347 15919 4063 -10549 -13820 -3049 10104 14407 7179 -5468 -14083 -8734 7169 17010
1843A7010p014j5438p442M095J0712J0132R80j1256j5159j485J4669J4020j228
$$ 17010 9996 -5442 -12884 -8789 1923 12055 13035 1779 -13380 -14865 -196 13824 12596
1856A2596j2293j0318k434O787J3017P806q606j7397n800J0743J3470L892n548
$$ 12596 303 -10015 -12449 -5662 7355 15161 6555 -10842 -16642 -5899 7571 11463 5915
1869E915r759r803M64J4356J3823l537j6136j0743L976J1305R706K435r037j4928
$$ 5915 -3844 -13647 -13183 1173 14996 11459 -4677 -15420 -11444 -139 9567 12002 2965 -11963
1883a1963m220J2603J5439J572j1094j0421l868M682J2066R882n205j5367r073
$$ -11963 -16183 -3580 11859 13431 2337 -8084 -11952 -7270 4796 14678 9473 -5894 -14967
1896a4967O919J3808P134k820j0807j1060j00J3611J4022j921j4488j0475O83
$$ -14967 -8048 5760 12894 10074 -733 -11793 -11893 1718 15740 13819 -669 -11144 -10461
1909a0461J0057J1037M279r220j4470n650J0772J3724L744o819j1433q220K387
$$ -10461 -404 10633 14912 5692 -8778 -14428 -3656 10068 13812 6993 -4440 -12660 -10273
1922a0273J4805J1344m801j6314q879N067J1387Q052J79j0002j3623j522J3661
$$ -10273 4532 15876 11075 -5239 -14118 -9051 2336 10388 10567 565 -13058 -14580 -919
1935i19J3326j704j1776q592k628N495J2051Q504o794j7620o776J0237J3695N187
$$ -919 12407 10703 -1073 -9665 -12293 -6798 5253 13757 6963 -10657 -17433 -7196 6499 11686
1949A1686m952j0172j0161K16J4822J3730l844j5826q521M251Q875Q229L599o937
$$ 11686 6734 -3438 -13599 -13383 1439 15169 11325 -4501 -13022 -8771 104 8333 11932 4995
1963D995j4380m911J1989J4248J162r243r512n002L644J3225J0288o269j6948
$$ 4995 -9385 -14296 -2307 11941 13103 3860 -5652 -10654 -7010 6215 16503 10234 -6714
1976f714p603Q875J3028M771l090r133j1309j055J2826J3968k139j3177r640K36
$$ -6714 -14317 -5442 7586 12357 9267 134 -11175 -12230 596 14564 12425 -752 -10392 -10156
1990a0156O547J0680P164p156j6779o790J1360J4730K255p821r452o806J739J2980
$$ -10156 -3609 7071 14235 7079 -9700 -16490 -5130 9600 11855 4034 -5418 -12224 -10485 2495
2004B495J1567n046j5684p405O154J0260N734J359p280j3289m213J2962J5127
$$ 2495 14062 9016 -6668 -14073 -7919 2341 8075 9434 2154 -11135 -15348 -2386 12741
2017A2741N6j2074j0189k377O268J1457R327o726j6960p262J0200J3572K959m680
$$ 12741 12797 723 -9466 -11843 -5575 5882 15209 8483 -8477 -15739 -5539 8033 10992 6312
2031F312p964q472j143J1739J3406k331j3679r620L039Q924Q172L599p187j4602
$$ 6312 -1652 -10124 -11267 472 13878 11547 -2132 -11752 -8713 211 8383 11982 4795 -9807
2045i807n171J2065J4775J340j0807r772l349M203J1724R016n586j4796p525O568
$$ -9807 -14978 -2913 11862 13202 2395 -7377 -10726 -6523 5201 14217 8631 -6165 -13690 -7122
2059g122J1639O500j490q682j1574k616J3001J3891j272j2872r521J8P860J0032
$$ -7122 4517 11017 9527 845 -10729 -13345 -344 13547 12275 -597 -10118 -10100 -2240 7792
2073G792M886p517j4820m415J0891J2231J329o362q129p046J437J2817J1440m709
$$ 7792 12678 5161 -9659 -14074 -3183 9048 10377 4015 -4114 -11160 -9723 3094 14534 9825
2087I825j5822p640N354J0123P644J176q761j4156k547J3725J3970j575j2120
$$ 9825 -5997 -13637 -8283 1840 9484 10660 1899 -12257 -14804 -1079 12891 11316 -804
2100h04p973j203M983R774Q211n080j5318p271R810J1898L317m640p596q256k63
$$ -804 -8777 -9980 -4997 4777 12988 7908 -7410 -14681 -4871 7027 10344 5704 -1892 -10148 -10411
2115a0411J1995J2943l008j5763q809M802J0340P298J561p240j2977m839J1029
$$ -10411 1584 14527 11519 -4244 -13053 -8251 2089 9387 10948 3708 -9269 -14108 -3079
2128c079J4113K227j0106j0252l640M078J0690R095l520j4416r579O258J2908
$$ -3079 11034 13261 3155 -7097 -10737 -6659 4031 13126 9606 -4810 -14389 -8131 4777
2141D777P049l822r319r382m2J0572J1772p47j1009r679MQ062J0184L604q015
$$ 4777 11826 8004 -1315 -10697 -10739 -167 11605 10858 -151 -9830 -9826 -1764 8420 12024 4009
2156D009j2763m325Q793J2465M346o418j1661p375L658J3527R789m491j3625q248
$$ 4009 -8754 -13079 -4286 8179 12525 6107 -5554 -12929 -9271 4256 14045 9554 -4071 -12319
2170a2319L087R590Q634J575q754j2798j915J1668J1470l35r110p944l532M789
$$ -12319 -9232 358 8992 10567 1813 -10985 -12900 -1232 10238 9903 793 -7151 -10683 -5894
2184e894J1649P590o853j4990n501Q631J1645M070m237q343q626N50J1916J2193
$$ -5894 5755 13345 6492 -8498 -13999 -5368 6277 10347 6110 -2233 -10859 -10309 1607 13800
2198A3800k597j3801q853L151R000P989L149o600j2800n854R889J3846K560r336
$$ 13800 11203 -2598 -11451 -8300 700 8689 11838 5238 -7562 -13416 -3527 10319 12879 3543
2212C543r611l269M071R250P956l340j3291q292N607J2482O425m626r262p850
$$ 3543 -6068 -9337 -5266 3984 11940 8600 -4691 -12983 -7376 5106 11531 6905 -2357 -10207
2226a0207j40R396J1266J219j1104j1605j095J0128J0431J952p023j0897m827
$$ -10207 -10347 -951 10315 11534 430 -11175 -12270 -2142 8289 10241 3218 -7679 -12506
2239a2506N847J2832N681n955j2158o284N270J1111P149k889r989q441O66J0056
$$ -12506 -6659 6173 11854 5899 -6259 -12543 -7273 3838 10987 8098 -1891 -10332 -9666 390
2253C90J0293j52j0206j0344L47R707R321J677p704j0626m337P121J3203N041
$$ 390 10683 10531 325 -10019 -9672 35 9356 11033 3329 -7297 -11634 -4513 8690 13731
2267A3731q239j2347m967O280J0028O260k365j0174r680J238J2476R483k730j1570
$$ 13731 5492 -6855 -11822 -5542 4486 10746 8381 -1793 -11473 -10235 2241 11724 8994 -2576
2281b576p657J186P718R419L142q103j2762l255R944J1822J873p558r281m221
$$ -2576 -10233 -9047 -1329 8090 11232 3129 -9633 -12888 -2944 8878 10751 3193 -6088 -10309
2295a0309M267R982Q004m135j2609p949N726J1725O308l171q803q318p79R220
$$ -10309 -6042 3940 11944 7809 -4800 -12749 -7023 4702 11010 7839 -964 -9282 -10061 -841
2309h41J2055J362j1569j0944j86Q787R000K405n332j0247n979N511J2322N957
$$ -841 11214 12576 1007 -9937 -10123 -1336 7664 10069 4737 -5510 -11489 -5978 6344 12301
2323A2301p038j1802m492M960Q638P045j364r937r992N40J1113J0616j420j0466
$$ 12301 5263 -6539 -11031 -6071 2567 9612 8248 -1689 -11681 -11141 -28 10588 9168 -1298
2337a298q281p2P044R624L165o753j1676m412Q512J2035L453o817r775m915L241
$$ -1298 -9579 -9651 -2607 7017 10182 3429 -8247 -12659 -4147 7888 11341 4524 -5251 -10166 -6925
2352f925J0055Q569k169j1348r035K935J1623P091k492q344p675p81P824J0342
$$ -6925 3130 11699 9530 -1818 -10853 -7918 3705 10796 8304 -40 -7715 -8496 -672 9670
2366I670K525r695j1765j573R227J0138J970n816r542n838L413J1487Q132n007
$$ 9670 12195 2500 -9265 -10838 -1611 8527 10497 4681 -4861 -10699 -7286 4201 12333 7326
2380G326j2588o246M610R830N787j672p376r887q62R823J1019M19j0925r167j18
$$ 7326 -5262 -11508 -6898 2932 8719 7047 -329 -10216 -11078 -1255 9764 10183 -742 -9909 -10027
2395a0027O869Q565L820m643j1112o030O649J2430M082o544r799m073L128R076
$$ -10027 -3158 5407 9227 4584 -6528 -12558 -5909 6521 10603 4059 -5740 -9813 -6685 2391
2409B391P796q89j1187r623K073J1765Q548j656q239q111j844O391J0636L960
$$ 2391 10187 9298 -1889 -11512 -9439 2326 10874 9218 979 -7132 -8976 -2585 8051 12011
2423A2011p698j1753k517P501J0000K895n189r025n862K860J0981P731l492j1743
$$ 12011 4313 -7440 -9957 -2456 7544 10439 5250 -3775 -9637 -6777 4204 11935 8443 -3300
2437c300p571L379R646P081j057q075q753j534Q328J0336J894q853j0493j980
$$ -3300 -10871 -7492 2154 9235 8178 103 -8650 -10184 -1856 8480 10374 1521 -8972 -10952
2451a0952P550R519L333n156r621o537M372J1391O880m783j0764n638L631Q425
$$ -10952 -3402 6117 9450 4294 -5327 -11864 -7492 3899 10779 5996 -4768 -10406 -6775 1650
2465A650O447P4q422r538n57J0711J0335r85j0175p284o76N412Q688N470m948
$$ 1650 8097 8171 -251 -9789 -10346 365 10700 9715 -460 -7744 -8420 -3008 5680 11150 6202
2480F202j2256n677P427J1468L156n782p174n629J272Q722R725j842j2192q521
$$ 6202 -6054 -11731 -4304 7164 10320 4538 -2636 -8265 -6993 1729 11454 9612 -2580 -11101
2494a1101L740R567O316o33o191q923l406P491J1475K639r066r842j154N696P899
$$ -11101 -7361 2206 8522 7889 1698 -7225 -10631 -3140 8335 10974 1908 -7934 -9088 -3392 4507
2509D507M777l133j0440p646M697J1788O206m402r487o215J252Q250Q666R5q749
$$ 4507 9284 6151 -4289 -11935 -7238 4550 10756 6354 -3133 -9348 -8096 154 8820 8915 166
2524A66r109k78Q374Q670J410p151r217k888O585J0584L791o572r722m675M235
$$ 166 -8943 -9221 -847 7823 9233 2082 -7135 -10023 -3438 7146 10937 4365 -5357 -10032 -5797
2539e797J0585O212m410r895n935K614Q597O662l31p767r353q95R308R784k96
$$ -5797 4788 11000 6590 -3305 -9240 -6626 1971 8633 8302 535 -8818 -9713 -405 9379 9083
2554I083r012p706j016N126Q678N255n524j2092m642P683J0186K109m561o512
$$ 9083 71 -7635 -8651 -3525 5153 10408 4884 -7208 -11850 -4167 6019 8128 3567 -2945
2568b945n391K02R161R517j975j1724p421L797Q365N364J350n511j0091m286R233
$$ -2945 -8336 -8134 1027 10544 8569 -3155 -10576 -6779 1586 6950 8300 2789 -7302 -11588 -2355
2583b355J2092N85q984p873p07L997O812O382k515j1278p202N501J0946M144m034
$$ -2355 9737 10322 1338 -6535 -7242 -3245 3567 9949 7434 -3844 -11046 -5545 5401 9545 5511
2598E511o754n681j044P518J0447J30j0801q902J395Q631O313J620n586r382m124
$$ 5511 -1243 -6924 -7968 -450 9997 10127 -674 -9576 -8181 450 6763 8383 2797 -6585 -10709
2613a0709O563J0741L129o837q563l609L320Q047P422k107j1005p831L541R573
$$ -10709 -4146 6595 9724 2887 -5676 -9285 -5965 2082 9504 7397 -3608 -11439 -7898 1675
2627A675O460j618o847p861j201Q328R851q4q851p343l73N434P603M495m618j0749
$$ 1675 8135 6517 -330 -8191 -9392 -1064 8787 8703 -148 -7491 -7864 -2430 5173 9668 5050 -5699
2643e699m855O462J0223L632m820p194o247O65R704R578k436j1422p184L586P409
$$ -5699 -10554 -4092 6131 9763 4943 -2251 -8498 -7833 1871 11449 9013 -2409 -9593 -6007 1402
2658A402N656J309n194r595l933Q272J0819N02p759o946j728K880P469O584k761
$$ 1402 7058 8367 3173 -6422 -10355 -2083 8736 9238 1479 -5467 -7195 -4315 3154 9738 6977
2673F977j2063o713O298J0766L403m211n923o701p40Q361J0143n23j0890p677
$$ 6977 -5086 -11799 -5501 5265 8668 4457 -1466 -8167 -8907 -546 9597 9074 -1816 -9493
2687i493K152O591O115K576l771r882n378O421J1490K821o660p683k998K325P653
$$ -9493 -7341 -750 5365 7941 4170 -5712 -11090 -4669 6821 9642 2982 -4701 -7699 -5374 2279
2702B279P134j744j0795p008M306R340M369j884n759o787j861P429R914Q15q810
$$ 2279 9413 7669 -3126 -10134 -5828 3512 7881 5997 238 -6549 -8410 -981 8933 9748 938
2717I38q368m16N472P577M347m077j0928n152N780J0488L421m732p221m991O73
$$ 938 -7430 -7846 -2374 5203 9550 5473 -5455 -10607 -4827 5661 9082 4350 -2871 -7862 -7189
2732g189P613Q527j080r977p016K388P284N627O39n003q500l442P469J0899O78
$$ -7189 424 8951 7871 -2106 -9122 -6734 550 6177 6816 1813 -6687 -10129 -2660 8239 8917
2747H917p943p471j401M253P451N815l860j0034o169N188R635M089k959o212o687
$$ 8917 974 -6497 -7898 -3645 3806 9621 5761 -4273 -10442 -5254 4381 8470 5511 -701 -7388
2762g388o90P678R840P2r664p481N14O720O389K128m248r344m190O452R923K473
$$ -7388 -8078 -400 9440 9512 -152 -7633 -7119 -399 5990 8118 3870 -5474 -9664 -3212 6711 9184
2778I184o379p245l127K632P133O796k385j0037o889L885Q385N436j225o799p474
$$ 9184 2805 -4440 -7567 -4935 2198 8994 6609 -3428 -10317 -6432 1953 7389 6164 -635 -8109
2793h109j330P682R603Q69q623p785m20N242P082M359m025r418n259N115R603
$$ -8109 -9439 -1757 7846 8715 92 -7693 -8113 -2871 4211 8570 4545 -4873 -10132 -5017 4586
2808D586L871m092o863m585Q81P606P881q65j0157o629K671P642N525K96n616
$$ 4586 8457 4365 -2498 -7083 -6202 1404 9285 8420 -1737 -8366 -5695 1947 7472 7768 2152
2823B152p834k984O883R755J901p518p912j765M240P329M646k615r581o126L619
$$ 2152 -5682 -8666 -1783 7972 9873 2355 -5557 -7322 -3082 4247 8893 6278 -3303 -9429 -5810
2838e810R312M697k720p250n756J92O931P849n23p554p778L70O960O553J130m779
$$ -5810 3502 8199 5479 -1771 -7527 -7335 -404 7445 6922 -632 -8410 -8040 -1080 5473 6603 1824
2854A824q086l408N707Q883L651n730p906m015M185P891N292k349q778n954K402
$$ 1824 -6262 -9670 -3963 4920 8571 2841 -5065 -9080 -4895 2996 8288 5939 -2839 -8793 -6391
2869f391Q042O242n58p231p189l36P216P495J071o129p586j716N013P930L349
$$ -6391 1651 7893 7335 104 -7085 -7421 -205 7290 8361 2232 -5354 -7070 -2057 5873 9222
2884I222m777q972l414M609Q116L602l125p918n046J740Q089O457j270r457o018
$$ 9222 4445 -4527 -7941 -3332 4784 8386 5261 -2657 -7703 -5963 2126 8583 7313 -2144 -8162
2899h162J533O965O217R05n779q719k067O322R006J826o271p449k022L719O813
$$ -8162 -6629 336 6553 7458 1679 -7040 -9107 -2785 6221 8047 1776 -5673 -7695 -3976 2837
2914B837M645k373q910n165L494Q286M968l133o523n617R99O372P290N64p598
$$ 2837 7482 5109 -3801 -8966 -5472 2814 7782 4649 -1874 -7491 -6492 -120 7170 7734 136
2929A36q003J64P443O751P90n012p327l193M533R029M153n131q868l607L620P392
$$ 136 -7867 -7703 -260 6491 7281 2269 -5058 -8251 -3718 5311 9464 4333 -4535 -8142 -4522 2870
2945B870M699j835p006o296Q12P760P149j505p648o051L82O606N996J526n725
$$ 2870 7569 5734 -1272 -7568 -6756 1004 8153 6648 -1000 -7051 -6669 -63 5933 7459 1734
2960A734q031k249N780Q854K181n645p543k855L448P349M867k490p947o196K710
$$ 1734 -6297 -8546 -2766 6088 8269 2624 -4919 -7774 -4326 3023 7890 5400 -2547 -8743 -6033
2975f033Q202O038k222p121n486n7O176P323J221o073q480j295O655P016J290
$$ -6033 2169 8207 5985 -1136 -6622 -6679 -503 6820 8041 1968 -6512 -7807 -1152 5864 7154
2990G154m785o828l011L877P447M984l984q887m717M218P919M523k915o295n845
$$ 7154 2369 -4459 -7470 -3593 3854 8838 4854 -4033 -8750 -4532 3387 7910 4995 -1300 -7145
3005g145j79P028P867O2p509p801K63O514O179J774m633p166m043N095Q647L547
$$ -7145 -7324 -296 7571 7633 124 -7677 -7414 -900 5279 7053 2420 -4746 -8789 -3694 4953 8500
3021H500n093p820k959L144O501M934j411p248o558J615P998O426j788p055n554
$$ 8500 3407 -4413 -7372 -4228 2273 7207 5796 -1452 -8010 -6395 1603 8029 6241 -814 -6368
3036f368j0N740O831J736n646q477k119O579Q061J525m426o822l855K539P566
$$ -6368 -6378 -638 6193 7929 2283 -6194 -8313 -1734 6327 7852 3426 -3396 -7251 -4712 2854
3051B854N722l005q367n303L068P345M672j681n755n922p18O349P380J062p063
$$ 2854 8576 5571 -2796 -8099 -5031 2314 6986 5305 -450 -6372 -7090 -741 6639 7701 638
3066F38p853p57O411O766J585m186p132l790L744Q163M758m403p944l784L243
$$ 638 -7215 -7972 -1561 5205 6790 2604 -4528 -8318 -4574 3589 8347 3944 -4000 -7784 -4541
3081d541O695M609r33o188o824LP298P730k79p665n983L16M639N693K940m179
$$ -4541 2154 6763 5830 -358 -7182 -7179 119 7849 7570 -95 -6078 -5762 -1123 4570 7510 3331
3097C331p844l439N483Q101K477m821o497l297J532O677O361j310q540o433K026
$$ 3331 -4513 -7952 -2469 5632 8109 3288 -3209 -6506 -4974 1703 8064 6754 -1786 -8219 -6193
3112f193P925N071j211n420n222j840M711Q108K111o483q372n80N544O254K057
$$ -6193 1732 6803 5592 172 -5050 -6890 -2179 5929 8040 1557 -6815 -7395 -1851 4403 6460
3127F460k862o624n059K668Q277N135l240p967l794J737O580M906k0o508o494
$$ 6460 3598 -3026 -8085 -5417 2860 7995 4755 -3212 -7006 -5269 1311 6217 6197 -311 -6805
3142f805l03P065O908N03o621o391j225M684P086K652l829p602l789L818P784
$$ -6805 -7108 -43 6865 7368 747 -5644 -6869 -2185 4901 7553 3724 -3878 -7667 -3849 3935
3157C935L895l674p206l674K346O466M677j028o402o325J44P210O780o77o449
$$ 3935 7830 4156 -3050 -6724 -4378 2088 6765 5737 -665 -6990 -6846 364 7144 6467 18
3172A8n607q76M709O284L167m397q319l333N415P775J937m243n541l578J028O712
$$ 18 -5589 -6465 -1756 4528 7695 3298 -5021 -8354 -2939 4836 6773 2530 -3011 -6589 -5561 1151
3188A151O579j503q944n801L392O618M045m32m286o150k436N945Q242J454p209
$$ 1151 7730 6227 -2717 -8518 -5126 1492 5537 5105 819 -5331 -7767 -1822 6420 7874 665
3203F65o733K2M595N097K945j816p512n624L797Q777L823l949o356l072N19M978
$$ 665 -6068 -6046 -1451 3646 6591 4775 -2737 -8361 -4564 4213 8036 4087 -2269 -5341 -4822 156
3219A56O402N12o863p090R10O622N513k12m453o072k520M343P359L212m962p368
$$ 156 6558 7070 207 -6883 -5973 649 6162 5950 1497 -4575 -7095 -2752 4607 7819 2857 -4511
3235d511k801L938O163L762k209o840m984K294O787M822j399n993n742M91N340
$$ -4511 -7312 -3374 2789 6551 4342 -2498 -7482 -5188 1599 6421 5022 -971 -6713 -6222 -882
3250h82O873K14o300n544j021M644O232L032m508p411k820M942O845J862l451
$$ -882 5991 6205 -95 -5639 -6660 -2016 4216 7248 2740 -4671 -7491 -2549 4296 6158 2707
3265B707n082l469J084O684N975j965q087m875K902O319L404L75m290o339k884
$$ 2707 -2375 -5844 -4760 1924 7899 5934 -2153 -7028 -4126 2193 5597 5972 1682 -4657 -7541
3280g541O151Q536L63p016n770p7L334M682L794j512q476n070M163Q246K730l378
$$ -7541 -1390 7146 7509 493 -5277 -5354 -2020 2662 6456 4944 -3532 -8602 -4439 3807 6537 3159
3296C159n306k962n80M844P254J24p681o326J838O573L785J35l244o076l164M322
$$ 3159 -2147 -5109 -5689 -845 6409 6533 -1148 -7474 -5636 937 4722 4857 1613 -4463 -7627 -3305
3312c305Q861K220n796o829j248L381M943M136j177o667o186K606P529M333j994
$$ -3305 5556 7776 1980 -4849 -6097 -2716 2227 6363 5186 -1481 -7667 -5061 2468 6801 4807
3327D807n564m265m69M834O614J018o238o455k88N412N273J488l758o306l060
$$ 4807 -757 -5022 -5491 -657 5957 6975 737 -5718 -6006 -594 4679 6167 2409 -3897 -6957
3342f957L855P094K597l874n840l217J774N941N352j371p431m895J583N929M671
$$ -6957 -3102 3992 6589 2715 -3125 -6342 -4568 1373 6725 5354 -2077 -6972 -5389 540 5211
3357E211k38m267n943k026N313P624P26n622m832j238K708N443L818k283p448
$$ 5211 4973 706 -5237 -7263 -1950 5674 6400 778 -4054 -5292 -2584 2859 6677 4394 -3054
3372c054m704M657P131K421l071m618l616n58N655O692n6q007n519J670N736L978
$$ -3054 -7758 -3101 4030 6451 3380 -1238 -4854 -5412 243 6935 6879 -1128 -6647 -4977 759 4737
3388D737O96l288n996l380M446Q245J786n840n632j022K277M374L879n36o970
$$ 4737 5433 2145 -3851 -7231 -2785 5460 7246 1406 -4226 -5248 -2971 1403 5282 4746 -2224
3403b224n593L174O741L773k393m820m051k65M211O651J168o742n782k58N538
$$ -2224 -7817 -4643 2098 5871 3478 -1342 -5393 -5658 -1447 5204 6372 -370 -6152 -6410 -872
3418h72N208J563l167o253l744L627P593L526l947o317l003J724N547N020n99
$$ -872 4336 5899 2732 -3521 -7265 -3638 3955 7481 3534 -2783 -5786 -4062 1485 6505 5906
3433E906o704m972J122N997M297l53m055n572j545M901O273J447n222n686j032
$$ 5906 -798 -5770 -4648 1349 5646 5293 1238 -4334 -5879 -978 5295 6742 1520 -4166 -5198
3448e198L403N094L152k684o952m131L607O775K976k397n503m045L30N712N681
$$ -5198 -1795 3299 6451 3767 -3185 -7316 -3709 3066 6042 3645 -1858 -5903 -5573 139 5820
3463E820n22o116n814J189M987M497Q40l510o010k337M207O909J982m722n463
$$ 5820 5298 -818 -6632 -5443 -456 4041 4881 1371 -4639 -6976 -2769 4140 6122 1400 -4063
3478d063j389K292N186L866j483o619m523K441O632L768j735m654m590m24N004
$$ -4063 -5452 -3160 2026 5892 4409 -2210 -6733 -4292 2340 6108 4373 -281 -4871 -5295 -291
3493b91O339Q16n988n786n21M709N202J768l135o044l523L280O936K674l177n475
$$ -291 6048 6864 876 -4910 -5431 -722 4480 6248 3113 -2931 -6454 -3174 3762 6436 3259 -2216
3509b216k993J185N143M354p97n905m804J267N329M521k71m958m743j010M441
$$ -2216 -5209 -4024 1119 5473 4676 -1229 -6033 -4766 563 5084 4813 -145 -4888 -5898 -1457
3524a457N878J446n167n496j181L295N776K736k762n992l798K768O468L529k266
$$ -1457 4421 5867 700 -4796 -5977 -2682 3094 5830 3068 -2924 -6722 -3954 2514 6043 3777
3539C777n390l813Q28N115N297m00n570m815l3N202M719P42m384n151j800M044
$$ 3777 -1613 -5426 -4598 517 5814 5414 -156 -4971 -5004 198 4917 5659 1275 -3876 -5676 -1632
3555a632O030K103m227n363k456L035N500L063j997o224m045J950N671M334r49
$$ -1632 4398 6501 2274 -3089 -5545 -2510 2990 6053 4056 -2168 -6213 -4263 1408 5742 4793
3570D793n734m534o5N086N383L48m830n165j336M132N345J579l259n510k435L101
$$ 4793 -941 -5475 -5540 -454 4929 5277 447 -4718 -6054 -1922 3423 5002 1743 -3767 -6202 -3101
3586c101N497L032k892n392l156K220N125M240j220n639m605J444M973M814Q6
$$ -3101 2396 5428 2536 -2856 -6012 -3792 1333 5573 4353 -1286 -5891 -4447 526 5340 5426
3601E426m647n392o59M807N429J445m232n533j377K786N316K883k530o232k796
$$ 5426 779 -4613 -5272 -465 4964 6409 2177 -3356 -4733 -1947 3369 6252 3722 -2510 -5306
3616e306K244N646L272j819n003m191R45M901M740o16n196n134N85M576M489Q23
$$ -5306 -3062 2584 5856 4037 -966 -5157 -4212 689 5429 4813 -383 -5517 -4932 -356 4133 4956
3632D956m065n463j687L459O175K371l893n940j880K294N412L265j951m748m371
$$ 4956 891 -4572 -6259 -2800 3375 5746 1853 -4087 -5967 -3673 1739 5004 3053 -1695 -6066
3647f066J129N681M160j220m481m724Q15M292M842R03m255n514j120M454N636
$$ -6066 -4937 744 4904 3684 -797 -5521 -4706 -414 4428 5331 1076 -4438 -5558 -1104 4532
3662D532J246l819m844k030K605N513L143k210n934l776K373N490L915j923m590
$$ 4532 5778 1959 -2885 -4915 -2310 3203 6346 4136 -1798 -5574 -3201 2289 6204 4281 -309
3677c09m462N88M395M938K23m531n433m45M442M842J198l955n223j685K769N732
$$ -309 -4771 -4183 212 5150 5373 842 -4591 -5036 -594 4248 5446 1491 -3732 -5417 -2648 3084
3693C084K348l067n707k619K678M947L091k045m069m407Q30N215M687o00n176
$$ 3084 5432 2365 -3342 -5961 -3283 1664 4755 2710 -1359 -5766 -4936 279 4966 4366 -810
3708h10m375K16M212M261J682l752n498j909L925N857J668l468m991j622J993
$$ -810 -5185 -4969 -757 3504 5186 1434 -4064 -5973 -2048 3809 5477 2009 -2982 -4604 -2611
3723b611M827L501j356n566m316J587O078L383j613m403l739J41L691N144R92
$$ -2611 2216 5717 4361 -1205 -5521 -3934 2144 5527 3914 -489 -4228 -4087 -396 4748 5740
3738E740m801n391q45M393N099J162l356m707k688K485N550K933k346n550l184
$$ 5740 939 -4452 -5297 -904 4195 5357 2001 -2706 -5394 -2909 2641 5574 3228 -2322 -5506
3753e506K005M870L345j193m225m599K29M939M717j01m804m146o02M225M503J219
$$ -5506 -3501 1369 4714 3521 -704 -5303 -5074 -135 4582 4481 -323 -4469 -5071 -846 3657 4876
3769D876l612m573k157K949N904K025k915n480k445K626M707L031j192m791l991
$$ 4876 1264 -3309 -5466 -2517 3387 5412 2497 -2983 -5428 -2802 1905 4936 3744 -1047 -5038
3784e038O02N381M481r73n022l606J54L403M346J264l433n149k103L966N671J143
$$ -5038 -4436 945 5426 4453 -569 -4175 -4021 -618 3728 4992 1559 -3590 -5693 -1727 3944 5087
3800E087l337m894j334J390M661L767j531n895l994K702N440K285r10l537m019
$$ 5087 1750 -3144 -4478 -3088 1573 5340 3809 -2086 -6080 -3378 2062 4347 3437 -100 -4119
3815d119r88M184N621R31n036n583J64M330L466J593k029m295l882K631O456K380
$$ -4119 -5107 -923 4698 5629 593 -4990 -4826 -496 2970 4563 2534 -1761 -5643 -3012 3444 5824
3831E824l127m955j796J387L987L332m00m675m566L26N567M250n64m357l745j063
$$ 5824 2697 -2258 -4054 -2667 1320 4652 4252 -423 -4989 -4663 904 5154 4590 233 -3512 -4575
3847d575K909N569J541l933n483j060L078M766J724k146m826k905J862N040L299
$$ -4575 -1666 3903 5444 1511 -3972 -5032 -1954 2812 4536 2390 -2436 -5341 -3479 1561 4860
3862D860j357n067l656N74M877M176j98m410m477R2L888M230J396l640m923j801
$$ 4860 3503 -1564 -5220 -4646 231 4407 4209 -201 -4678 -4586 -698 3532 4928 1288 -3635 -5436
3878e436L930N275J517l231m020k742J858M227L775p91n958l491K040N005K759
$$ -5436 -1506 3769 5286 2055 -1965 -4707 -2849 1378 5153 4362 -1596 -5087 -3047 1958 4717
3893D717q05l247m000j509M148O004R8n378m384Q80K706L374J961j691n282l491
$$ 4717 3912 665 -3335 -4844 -696 5308 5406 28 -4356 -3476 -770 2604 4565 2874 -2408 -5899
3909e899K826O439K156l689m129j820Q33L159M279M55n281n224J324N532L356
$$ -5899 -3073 3366 5522 1833 -2296 -4116 -3283 -124 4155 4610 -671 -5895 -4571 961 4317
3924D317j296k439l869j340K074O082K024m432n086q33L452L644J982j049m500
$$ 4317 3021 582 -3287 -4627 -2553 3529 5553 1121 -3965 -4798 -1346 2298 4280 3231 -1269
3939a269l969J889N531L385k358m465k991Q73L961M201O7m159m921l28M343M057
$$ -1269 -5238 -3349 2182 5567 3209 -1256 -4247 -3374 587 4788 4855 696 -4225 -4553 -210 3847
3955C847Q96l239m194j991K958M978J837k783m793k122J729M340L140j145n135
$$ 3847 4743 1504 -2690 -4681 -1723 3255 5092 2309 -2484 -4606 -2877 1463 4603 3458 -1677
3970a677l387J497M651K828p78l176l942q33L653N622N18m929m301m7L018L466
$$ -1677 -5064 -3567 1084 3912 3134 -42 -3984 -4817 -1164 4458 4976 47 -4254 -4301 -1283 2183
3986B183K394j750n170l428L021N833J781k955l325k082K42L566M409L10n673
$$ 2183 4577 2827 -2343 -5771 -2750 3083 4864 1909 -1416 -3498 -3256 310 4719 5029 -644
4001f44m388J685M695K532k73k673l231k621K897O250J694m520n181k25K909L158
$$ -644 -5032 -3347 1348 3880 3607 934 -2297 -4918 -2021 4229 5923 1403 -3778 -4003 -1094 2064
4017B064K075o36m551m410J595N942L217k365m253k624L49L016M161J159l945
$$ 2064 4139 3503 -1048 -5458 -3863 2079 5296 2931 -1322 -3946 -3597 -581 3580 4739 794
4032G94n360m15M703L678K42k857l499j961K218M984K172k640n111j580K021M050
$$ 794 -4566 -4981 -278 3400 3642 785 -2714 -4675 -2457 2527 4699 2059 -3052 -4632 -2611 1439
4048A439L078j200m417l951J209M486L953q12l756l751o71L849M695J79l383m166
$$ 1439 4517 3317 -1100 -5051 -3842 644 4597 3785 29 -3722 -4393 -544 4151 4330 947 -3219
4064c219o28K886L501K228k000n298k162K154N366J842k284l791k397K80L795
$$ -3219 -3847 -961 2540 4768 2768 -2530 -4692 -2538 2828 4670 2386 -1405 -3802 -3522 273
4079B73M426p72n107m034J403M570K441lk017m431k071L322N616J044l487m605
$$ 273 4699 3927 -1180 -5214 -3811 759 3200 3197 1180 -3251 -5322 -2000 3616 4660 1173 -3432
4095c432o66J762L970K068m56m860l830J801N562K403k374l094k108k90L271M207
$$ -3432 -4098 -2336 1634 3702 3246 -1614 -5444 -3643 1919 4322 1948 -1146 -3254 -3544 -273 3934
4111C934J048m571m798M01M192L568K26k326l968k065K229N103K586l089n224
$$ 3934 4982 411 -4387 -3986 206 3774 4000 1674 -2294 -4359 -2130 2973 5559 2470 -2754
4126b754j290J955L741K153j96m143l931P61M753L410o48m103l225m08K674M618
$$ -2754 -4044 -2089 1652 3805 3609 -534 -4465 -3704 1049 4459 3811 -292 -3517 -3925 -1251 3367
4142C367J061l483m670q31L166M137J118k136m021k410K368M461K122j997l992
$$ 3367 4428 945 -3725 -4556 -1390 2747 3865 1729 -2292 -4702 -2334 2127 4249 2252 -1740
4157a740k955J278L836L695o28l832l649L99L746L525K82l115m002j164L099M460
$$ -1740 -4695 -3417 419 4114 3486 -346 -3995 -3596 150 3675 3957 842 -3160 -4324 -1225 3235
4173C235J124k947l771j087J560L853K128j213m538k837J585M915K208j282l698
$$ 3235 4359 1412 -2359 -3446 -1886 1967 4095 2882 -1656 -4493 -2908 2007 4215 2933 -765
4188g65k855j85L704L848L78l743m551j30L501L952O04k234m447j866K511M743
$$ -765 -3620 -3805 -101 3747 4125 382 -4169 -4299 -798 3154 3758 1524 -2923 -4789 -2278 2465
4204B465K055k565m703j486J752L617K995j172l691l346P37M047L462o08l984
$$ 2465 4520 1955 -2748 -4234 -2482 1135 4130 2958 -733 -4079 -3342 705 4167 3559 -425
4219d25l003L81K715L649R04k944m222j470L446L676J497k249l915k261J975M150
$$ -425 -3428 -3047 -332 3317 4221 1277 -2945 -4415 -969 2707 4204 1955 -1960 -4221 -2246 1904
4235A904K495j478m248k722P41M417K686k58l483l925K38L222L650L15l249l547
$$ 1904 4399 2921 -1327 -4049 -3308 1109 3795 3537 54 -3871 -3633 -411 3239 3554 305 -3242
4251c242r35K868L866J183k514m162j658K481M130K231k132m047k384J377L803
$$ -3242 -4177 -1309 2557 3740 1226 -2936 -4594 -2113 2017 4248 2116 -1931 -4315 -2938 865
4266H65L223j153l723l272M96L552L567L75l641l402q11L336L554J224k703l915
$$ 865 4088 2935 -788 -4060 -3564 -12 3555 3930 289 -3113 -3924 -588 2966 4190 1487 -2428
4282b428j848K892L867K056k258m182j825J749L777K112p61m113k959Q42L778
$$ -2428 -4276 -1384 2483 4539 2281 -1901 -3726 -1977 1800 3912 3151 -962 -3921 -3079 699
4297F99L245l33l937l456r7L223M188L58k962m096j116K727L684J723k102l912
$$ 699 3944 3611 -326 -3782 -3879 -656 3532 3890 928 -3168 -4284 -1557 2127 3850 1748 -2164
4313b164k049J861L908K364j523l893k618J196L434K774m35l231l861O93L662
$$ -2164 -4213 -2352 1556 3920 2397 -1496 -4114 -2918 516 3290 2855 -376 -4237 -3544 118
4328A18L543J13l434l287p54K758M074J026k438l902j582K180L685K019j451l820
$$ 118 3661 3774 340 -2947 -3701 -943 3131 4157 1719 -2183 -3765 -1585 2100 4119 2668 -1152
4344a152k771J240L615L437q16l930k816J76L324K905N32l246l794n33L557L258
$$ -1152 -3923 -2683 932 4369 3553 -377 -3193 -3017 307 3212 3744 498 -3296 -3829 -272 2986
4360B986R45k900l458j385J924L514K386k208l628k652J805L830K605j167l611
$$ 2986 3931 1031 -2427 -3812 -1888 1626 4012 1804 -1824 -4476 -2671 1159 3764 2597 -1014
4375a014l077O61L691L195j15l338l667k8L146L485Q90k739l785r59K473L593
$$ -1014 -4091 -3430 261 3456 3341 3 -3664 -3692 -546 2939 3829 1090 -2695 -3654 -1181 2412
4391B412J683k167l711j950J967L625K579j883l409k917R59L800L195q64l733
$$ 2412 4095 1928 -1783 -3733 -1766 1859 4438 2555 -854 -3771 -2812 988 4183 3319 -414
4406d14k859J38L088L247M80k518l987q66K210M088J301k593l806j404K142L145
$$ -414 -3273 -3135 -47 3200 3680 1162 -2825 -3691 -1481 2607 3908 1315 -2491 -3895 -1753 1392
4422A392K404j547l639k635J139L662K924j551l192k448m6K972L677M52l205l836
$$ 1392 3796 2249 -1390 -4025 -2886 776 3700 2149 -1043 -3491 -3537 -565 3112 3564 359 -3477
4438c477l02L306L165O84k409k802j696J564M139K331k287l996j606J481L249
$$ -3477 -3779 -473 2692 3376 967 -1835 -3531 -1967 2172 4503 2216 -1780 -3386 -1905 1344
4453A344K091j44l584l055K24L994L106m88l177k847n86K364L457J134l010l866
$$ 1344 3435 3291 -293 -3348 -3124 870 3976 3488 311 -2536 -3122 -758 2699 3833 823 -3043
4469c043p65K485L816R22j982l157k217J507L760K548j479m358j899P05L168L060
$$ -3043 -3808 -1323 2493 3415 1433 -1724 -3941 -2434 1326 3874 2395 -1963 -3862 -3157 11 3071
4485C071k59l379l185L36L141K909P53k699l664j083K634M097J355k828l271j249
$$ 3071 2812 -567 -3752 -3416 -275 2634 3387 688 -2976 -4059 -1425 2672 4027 1199 -2072 -3321
4501c321J604L267K313j001m048k676J320L989K163q51k810k475n81L204L767
$$ -3321 -1717 1550 3863 2862 -1186 -3862 -2542 1447 3610 2759 -51 -2526 -3107 97 3864
4516C864M73l723l779K19L033K266R90j503l164k464J603M544J575k138l791j184
$$ 3864 4337 614 -3165 -2946 87 2353 3343 1840 -1324 -3788 -2185 2359 3934 1796 -1995 -3179
4532c179J378K584K232k9l560l343L62M109L106j114k801k502m88J865L618J350
$$ -3179 -1801 783 3015 2986 -574 -3917 -3555 554 3660 2546 -255 -2757 -3245 -1380 2238 3588
4548C588k434m486k34K327K901J244j330k658k656R97M109K744j584l930k015
$$ 3588 1154 -3332 -3566 -1239 1662 2906 1576 -1082 -3738 -2741 1368 4112 2528 -1402 -3417
4563c417J230K862K444M8k720l440k13L092L181M34k229l461j041K246L525J302
$$ -3417 -2187 675 3119 3167 447 -2993 -3206 -114 3067 3501 1272 -2189 -3230 -984 2541 3843
4579C843k063l875j483J903L053K109p24m042k326J087L390K171o87k371k779
$$ 3843 1780 -2095 -3578 -1675 1378 3487 2763 -1279 -3605 -2518 872 3043 2356 -15 -2794
4594b794m98K571L924L67l421l572j53K943K648Q53j238l742j937J839M601J612
$$ -2794 -3292 -721 3203 3570 149 -3423 -3576 -633 2015 2868 1630 -2112 -4049 -2210 2391 4003
4610D003k612l178j198J015K435K598J19l792l140O98M186K484j119j890k712
$$ 4003 1391 -1787 -2985 -1970 465 3063 3182 -610 -3750 -3052 1134 3618 2499 609 -2103
4625b103p90J813L656J915l457l899k32K730K205J053o34l214k716J059M698K331
$$ -2103 -2893 -1080 2576 4491 1034 -2865 -3097 -367 1838 2891 2257 -957 -3673 -2614 2084 4415
4641D415k653l391j629J121J788K806P47k755l810m50L444L275Qk641k857r86
$$ 4415 1762 -1629 -3258 -2137 -349 2457 3204 449 -3361 -3811 -367 2908 2916 275 -2582 -3568
4657c568K073L371J693k003l824j148J669L337J570j002k842k741R74L182K722
$$ -3568 -1495 1876 3569 1566 -2258 -3406 -1737 1600 3170 2168 -674 -3415 -2441 741 3463
4672C463q22k777k850p0L153K963K96k859l470l3K644K833J093k053l163k125
$$ 3463 2641 -136 -2986 -3056 97 3060 3356 497 -2973 -3006 -362 2471 3564 1511 -1652 -3777
4688c777J827M042J915k536k973r58J53K700K981j67l852l230J081L692J928p57
$$ -3777 -1950 2092 4007 1471 -1502 -2460 -2307 393 3374 3207 -645 -3875 -2794 898 2826 2069
4704B069j761k624j209K358L704J294l433l530j42K256K292J519q97l100k884
$$ 2069 308 -2316 -3525 -1167 2537 3831 398 -3132 -3274 -1018 1274 2793 1896 -1204 -4088
4719d088J338M301K149j912k819j830O31K399K437Q74l031l697k14L905K349L3
$$ -4088 -2750 1551 3700 1788 -1031 -2861 -2230 169 2606 3480 449 -3248 -3462 443 2792 2825
4735B825k068k233j189J541K864K440k366m074j001K310K460J164n39k835k631
$$ 2825 757 -1476 -2665 -1124 1740 4180 1814 -2260 -3261 -951 1509 2673 2134 -701 -3332
4750c332M02L239L360j055k945k695K25K444K972O34k351l429q29J951L534J184
$$ -3332 -2930 309 3669 2614 -331 -3026 -2801 -357 2615 3249 898 -2531 -3360 -1409 2125 3309
4766C309j980l328j549J833L134J488j120l035k066R25K958K823j048k595l129
$$ 3309 1329 -1999 -3548 -1715 1419 2907 1787 -1248 -3314 -2389 569 3392 2344 -251 -3380
4781c380Q56L054K358K34k483l147n64K080L826Q02k586l182m14J261K925J496
$$ -3380 -2524 530 2888 3122 639 -2508 -3072 -992 2834 3636 1050 -2132 -2546 -1285 1640 3136
4797C136j073l017k433J202L603J887j545k428j639j17K326K891M03l203l434
$$ 3136 2063 -954 -3387 -2185 1418 3305 1760 -668 -2307 -2424 -98 2793 3196 -7 -3441
4812c441N24K916K056M75k275k292j247J645L220J834k239l252j492J536L119
$$ -3441 -2917 -1 2055 2530 255 -2037 -3284 -1639 1581 3415 1176 -2076 -3568 -2032 1087
4827A087J568k55k980k711J22L627K974j090k797k096J24J874K942O52k121l511
$$ 1087 2655 2400 -580 -3291 -3169 458 3432 2342 -455 -2551 -2427 -553 2389 3041 920 -2591
4843b591p91K892K790O23j781k790j008J262K884J798j056l258k288J388L051
$$ -2591 -3382 -490 2300 2923 1142 -1648 -2656 -1394 1490 3288 2232 -1026 -3314 -1926 1125
4858A125J970q74k557k334nK705K848K69k466l404l86K552K719P12j832k835j231
$$ 1125 3095 2221 -336 -2670 -2675 30 2878 3147 681 -2723 -3109 -557 2162 2874 1042 -1793 -3024
4875c024J529L053J157j273k987j934J537K847J738r89k520k181K20K721K741
$$ -3024 -1495 1558 2715 1442 -1545 -3479 -1942 905 2643 1654 -866 -3047 -2827 -106 2635
4890B635j21k298l224K87K455K534O75k037k483j333J372L493J605k099l121r03
$$ 2635 2514 216 -3008 -2721 -266 2268 2943 906 -1577 -2910 -1538 1955 3560 1461 -1660 -2563
4906b563R55K743J696n08k970k229Q99K345K708p52k434k237L27J588K758N75
$$ -2563 -1608 1135 2831 2323 -647 -2876 -1977 368 3076 2324 -110 -2347 -2020 -432 2326 2901
4922B901k225k977q71K180L121M13j597k526j615J434K948K009j203k951k231
$$ 2901 676 -2301 -3172 -992 2129 2542 945 -1581 -3196 -1762 1186 3195 1992 -959 -3190
4937c190J032K641K019m29k366k371JK288K779K74k352k745l15K230K164J163
$$ -3190 -2158 483 2502 2073 -293 -2664 -2663 -375 2404 2678 326 -2419 -2734 -504 1660 2823
4953B823j425l195j292J704K711J869j598k766j724J113K797J997o58k598k403
$$ 2823 1398 -1797 -3089 -1385 1326 3195 1597 -1169 -2893 -1780 1017 3014 2356 -242 -2645
4968b645L73K581K534j57k427k653m86K266K675N38j520k929j235J677K812J413
$$ -2645 -2272 309 2843 2686 259 -2394 -2880 -614 2061 2599 1079 -1850 -3085 -1408 1404 2817
4984B817j310l040j431J198K841J460o21k995k157Q41K979K060n17k212k522j03
$$ 2817 1507 -1533 -2964 -1766 1075 2535 1914 -1081 -3238 -2397 582 2642 2125 -87 -2609 -2712
5000b712J844L224M54k164k765o78J842K629J235j769k452j476J334K715K244
$$ -2712 -868 2356 2810 646 -2119 -2797 -955 1674 2909 1140 -1312 -2788 -1454 1261 3505
5015C505j477k765j732N03K731J837j97k432k335pK737K252O3k683j892p55J941
$$ 3505 2028 -737 -2469 -1966 765 2602 2405 -27 -2362 -2369 368 2620 2683 0 -1892 -2647 -706
5032g06K480J105j882k769j393J728K540J467r53k711j731P27K550K244n74k926
$$ -706 1774 2879 997 -1772 -3165 -1437 1103 2570 1617 -1094 -2825 -2098 452 2696 2122 -804
5048h04j891J9K629K338J67k886j926k02K249K169P08j782k574j007J617K901
$$ -804 -2695 -2676 -47 2291 2458 -428 -2354 -2556 -307 1862 2570 788 -1786 -2793 -1176 1725
5064A725J559j684k733j505J116K596J840o06k846j876K90K781K043j81k611k005
$$ 1725 3284 1600 -1133 -2638 -1522 1074 2914 2308 -538 -2414 -2124 657 2700 2519 -92 -2097
5080b097P3J829K512M26j662l100n68J756K670O86j173k509j458J285K602J359
$$ -2097 -2024 -195 2317 2743 1081 -2019 -2587 -831 1839 2525 1352 -1157 -2615 -1330 1272 2631
5096B631r36k882j676R92K080K415m81k733j889j89K327K271K58k013k232q22
$$ 2631 1695 -1187 -2863 -1871 209 2624 2143 -590 -2479 -2668 -341 1930 2188 175 -2057 -2879
5112b879J745K809J020j766k557j102J586K044J631r10k486k014R57K432J876
$$ -2879 -1134 1675 2695 929 -1628 -2730 -1144 900 2531 1621 -865 -2879 -1922 510 2386
5127B386j56k287k198M21K043J810M83k287k260j86K044K347N64j687k344j281
$$ 2386 2230 -57 -2255 -1834 209 2019 2502 215 -2045 -2231 -187 2160 2724 1037 -1307 -2588
5143b588J337L076R27j452k606j012Q57K218J689l84k462k313Q2K971K167o92
$$ -2588 -1251 1825 2752 1300 -1306 -2318 -1461 757 2446 2062 -400 -2713 -2631 340 2507 1815
5159A815j961j923l76K103J844J293j913l089n95J778K593R15j515j899j664Q70
$$ 1815 -146 -2069 -2445 -342 1502 2795 882 -2207 -2802 -1024 1569 2484 969 -930 -2594 -1724
5175a724K697J897j244k566j376O02K090J995p6k422j805m62K679K152N9j967
$$ -1724 973 2870 1626 -940 -2316 -1714 376 2371 2295 -127 -1932 -2394 285 2437 2496 529
5191E29k299j99J387K302R26j423k707j074J385K299J255o40k775j557P00K621
$$ 529 -1770 -1969 -582 1720 2646 1223 -1484 -2558 -1173 1126 2381 1741 -1034 -2591 -1891 730
5207G30J670o79k273j884O31J778K249J75k328k394l12K165K029K93j116k165
$$ 730 2400 1721 -552 -2436 -1805 -27 2222 2397 69 -2325 -2637 -472 1557 1850 734 -1431
5223a431r98Q85K891J459j662k327q87J031J952J644l96k561k351M44K797K194
$$ -1431 -2429 -1544 1347 2806 1144 -1183 -2070 -1039 913 2557 2161 -400 -2751 -2307 490 2684
5239B684o99k116j893o4J576K677Q16k294k905m78K121K419K39p85j998j793M25
$$ 2684 1985 -131 -2024 -2088 -512 2165 2981 687 -2218 -2696 -575 1844 2083 1298 -700 -2493 -2068
5256b068L043J926j505k488j236N82K144J262N64k132k578m44K708K247m62j581
$$ -2068 975 2901 1396 -1092 -2328 -1746 398 1660 2224 92 -2486 -2930 -222 2025 1563 -18
5272a8j876m24J207K160J768j706k778q40J595J726J923j338k190j835Q56K367
$$ -18 -1894 -2318 -1111 1049 2817 1111 -1667 -2507 -912 814 2737 1399 -791 -2626 -1770 597
5288E97J896p76k154j541K10J689K286J84j849k560m1J943J912M69j564k072j006
$$ 597 2493 1717 -437 -1978 -1768 -79 2207 2391 542 -2018 -2059 -116 1796 2265 701 -1371 -2377
5305b377J492K561J187k019k157j039Q56K181J801l82k544k281O20K423J775l79
$$ -2377 -885 1676 2863 844 -1313 -2352 -1496 685 2486 2104 -440 -2721 -2101 322 2097 1718
5321A718j882j599m47J592K296R46k140k702l08K121J663Q24r64j760j684O77
$$ 1718 -164 -1763 -2210 -618 1678 2624 484 -2218 -2526 -405 1258 2082 1118 -642 -2326 -1649
5337a649K810J632j285k608j090J037J664J353N22k271k367l21K641K172j81j972
$$ -1649 1161 2793 1508 -1100 -2190 -1153 511 1864 2386 115 -2252 -2573 68 2240 2059 87
5353H7j488l65P09K687J208j311l202o46J768J582R71n07j918j708M19K268J977
$$ 87 -1401 -1766 -1057 1630 2838 1527 -1675 -2321 -553 1029 2000 1493 -425 -2133 -1714 554 2531
5370B531o69k687j320O04J690J700L53j495k944m7J801K356O39j887k184r86J392
$$ 2531 1862 -825 -2145 -1541 149 1849 2202 707 -2237 -2284 -483 1873 2512 625 -1559 -2545 -1153
5387a153K357J334j196k590j127Q74J794J756m38k171j654K82K277J511j17j854
$$ -1153 1204 2538 1342 -1248 -2375 -1501 293 2049 1611 -560 -2214 -1932 345 1856 1739 -115
5403a15j568m89J775K358O62j918k643j16J645K146O47j007k396j230O43K781
$$ -115 -1683 -2172 -397 1961 2623 705 -1938 -2054 -409 1737 2384 1377 -1019 -2249 -1606 1175
5419A175J578j253k319r99L35J393J935K91k157k089k79K242K204j19j977j519
$$ 1175 2753 1500 -819 -1818 -1483 -90 1845 2136 -21 -2110 -2389 -147 2057 1938 -39 -1558
5435a558o16R92K441J173j508k968l61J481K082Q22n91k290j198P6K422K065n66
$$ -1558 -2174 -1182 1259 2432 924 -2044 -2405 -924 1158 1980 1389 -901 -2099 -2023 399 2464 1898
5452A898k805j290N06J748J866L44j479k608m03J722K771M5j698j803p30P39K216
$$ 1898 -907 -2197 -1691 57 1923 2267 788 -1820 -2223 -501 2270 2315 617 -1186 -1916 -1177 1039
5469A039J294q15k399j517J132K267J188o84j835j373j96K125K006j60k044k074
$$ 1039 2333 1518 -881 -2398 -1266 1001 2189 1505 -330 -1703 -1899 226 2232 2072 28 -2046
5485b046l73J910K434K6j703k075m56J312K314P83j182k143j327J167K114J596
$$ -2046 -2419 -509 1925 1951 248 -1827 -2283 -971 1343 2126 944 -1199 -2526 -1359 755 2351
5501B351j168k051j597R05J701K127k52j843k165J49J789J618L60j560j626p44
$$ 2351 1183 -868 -2465 -1560 141 2268 2016 173 -1992 -1843 -54 1564 1924 364 -1262 -2006
5517b006J051K689Q22j942k366l19J451J660J349o69k110k056M72K901J611q64
$$ -2006 -955 1734 2556 614 -1752 -2071 -620 1040 2389 1720 -390 -2446 -1974 927 2538 1674
5533A674j916j755M15J478J789L93j557k458n71J597K332M22j541j726p50J106
$$ 1674 -242 -1997 -1582 -104 1685 2078 521 -1937 -2508 -911 1421 1843 302 -1424 -2174 -1068
5549a068J972J265q92k628j322J081K275J168m05j952j667J53K099J985mj996
$$ -1068 904 2169 1277 -1351 -2673 -1592 683 1851 1446 -506 -2173 -2020 79 2064 2060 64
5565F4k081JJ709J739O58j387k159n03J318K156N86o96k516r72J507J351J354
$$ 64 -2017 -2016 -307 1432 2090 703 -1456 -1959 -641 1515 2101 1405 -1111 -2083 -576 775 2129
5582B129n13j729k208N49K603J737o63k367j196k17K094J534L25j686k093n73
$$ 2129 1616 -113 -2321 -1772 831 2568 1905 -462 -1658 -1875 219 1753 2078 392 -1701 -2274
5598b274J457K536M58j450k181o85O31J932J790p26k086j822O78K312J414o62
$$ -2274 -817 1719 2177 727 -1454 -2139 -1508 424 2214 1488 -598 -2420 -1742 570 1984 1322
5614A322j874j301L58J046K148M30k034j588p57J987J914N45j420j767r87J136
$$ 1322 -552 -1853 -1495 -449 1699 2129 95 -1493 -2250 -263 1651 2196 776 -991 -1978 -842
5630h42K011J273j022k300j122J102J726J342k34k035j785j05K026K189l29j698
$$ -842 1169 2442 1420 -880 -2002 -900 826 2168 1934 -101 -1886 -1991 35 2224 1895 197
5646A97j940l1J676J825L70j397j908r91J293K478M25j112k192p89R11J933J278
$$ 197 -1743 -1774 -98 1727 2097 700 -1208 -2199 -906 1572 1997 885 -1307 -2096 -1185 748 2026
5663B026o03k181j860R28K204J569m50j803j798L40J183K046M66j459k481l14
$$ 2026 1423 -758 -2618 -1690 514 2083 1633 -170 -1968 -1628 -445 1601 2067 608 -1873 -2187
5679b187J544J745Q93j573j343j147Q70K082J329n17k418j375O12K106J640l74
$$ -2187 -643 1102 1995 422 -921 -2068 -1198 884 2213 1696 -722 -2097 -1485 621 2261 1887
5695A887k047j494K08J438J824K33j759j868m87J659J931Q56j679j842p92N90
$$ 1887 -160 -1654 -1446 -8 1816 2049 290 -1578 -2065 -406 1525 2381 702 -1140 -1932 -1342
5711a342K036J355p78k627o68O70J946R92Qj973j731M05J842J837n58j721j413
$$ -1342 694 2049 1271 -1356 -2024 -1354 592 1584 1592 -381 -2112 -1707 135 1972 1414 -307 -1720
5728a720j93J105K195P72j485k369n41J673J849N35p75j739j349Q60K017J262
$$ -1720 -1913 -808 1387 2159 674 -1695 -2236 -563 1286 1821 1046 -693 -2042 -1182 835 2097
5744B097p19j823j494O26J568J518j06j763j689l72K008J838L93j689j675m85
$$ 2097 1378 -445 -1939 -1313 255 1773 1667 -96 -1785 -2157 -149 1689 2082 393 -1282 -1767
5760a767R88K000J050j479k052p58J168J731J183j193j642j190L26J923J670n22
$$ -1767 -779 1221 2271 792 -1260 -2018 -850 881 2064 871 -771 -1961 -1635 288 1958 1436
5776A436j773j787M19J441K096K6j881j602o57J761K087M59j632j197j083M43
$$ 1436 -337 -2124 -1705 -264 1832 1858 -23 -1625 -2282 -521 1566 2025 393 -804 -1887 -1444
5792a444K463J161j121j801r77P39J263K037o78j508j983O9K320J489l8j775j778
$$ -1444 1019 2180 1059 -742 -1719 -980 283 2320 1642 134 -1849 -1780 540 2029 1991 216 -1562
5809a562N1R46K010R59j787j939r39J569K214K03o98j810j249O56J999J061l96
$$ -1562 -1511 -565 1445 2404 617 -1322 -2261 -692 1522 1725 1027 -783 -2032 -1376 623 1684 1288
5826A288j532j562M52J388J466J72j588k009L18J372J894k59j038j651m87P99
$$ 1288 -244 -1806 -1354 34 1500 1672 84 -1925 -1607 -235 1659 1400 362 -1289 -1776 -977
5842i77J955J079r41k258r93J395J436R49k77j691j104qK072J248n49j718j011
$$ -977 978 2057 1116 -1142 -2135 -740 696 1645 1368 -323 -1427 -1435 637 1885 1336 -382 -1393
5859a393K37J303J446M26j525k111j87J709J575L06r32j762p44M85K138J202j271
$$ -1393 -1156 147 1593 2019 494 -1617 -1804 -95 1480 1786 854 -908 -1652 -1167 971 2173 902
5876I02j758j099O89J928R73l35j568j691J80J812J703k07j833j058m81J275K040
$$ 902 -856 -1955 -1266 662 1635 1300 -268 -1959 -1779 33 1736 1529 -304 -1362 -1843 -568 1472
5893A472m9p76k108o04J653J490Q04r54j755j082M02K075J281p18j744j257M47
$$ 1472 1423 647 -1461 -2065 -412 1078 1882 928 -827 -1909 -1507 568 1849 1131 -613 -1870 -1423
5910a423J560J367N62j984j547j73J754J594r1j448j388l78J105J633J004j095
$$ -1423 137 1504 2066 82 -1465 -1638 116 1710 1619 171 -1217 -1595 -490 1143 2147 1052
5926A052k116r89J371J805M64m42j404j415K29K207J244l78j940j180J59J078
$$ 1052 -1064 -2053 -682 1123 1587 1145 -259 -1674 -1445 762 2006 1628 -312 -1492 -1333 -255
5942b55J679M30j479k026k79J801J520L2q58j637p00M08K033J306j087k198n72
$$ -255 1424 1854 375 -1651 -1930 -129 1391 1423 565 -1072 -1772 -1364 669 1975 888 -1310 -1882
5959a882P13J832O93J62j370j589k98K084J411l92j406j128j75O44K055L76j029
$$ -1882 -1169 663 1356 1518 148 -1441 -1739 345 1756 1364 -42 -1170 -1345 -701 1354 1730 701
5976G01j836l47R26J646Q76r64j526j226M47J978J448o01k126j013K50J472J528
$$ 701 -1135 -1482 -556 1090 1966 1002 -524 -1750 -1303 675 2123 1522 -604 -1617 -1367 105 1633
5993A633k13j362j677k3J242K222l88r76j897l38J105J525J190j306j726r24J009
$$ 1633 1420 58 -1619 -1642 -400 1822 1434 458 -1439 -1777 -672 853 2043 737 -989 -1913 -904
6010i04J460J196m93j838j263N08J676J622n49j823j204L08J352J457K71j403
$$ -904 556 1752 1259 -579 -1842 -1334 342 1964 1415 -408 -1612 -1304 48 1505 1776 373
6026C73j717l92J725J516L03j203j203j257Q95J960Q82r58j671p15O92J112J370
$$ 373 -1344 -1736 -11 1505 1808 605 -598 -1855 -960 1000 1882 924 -747 -1462 -770 342 1712
6043A712k38j767j414M3J760J539l02j381j408j83Q00J760P65j416j696k56J096
$$ 1712 1474 -293 -1707 -1664 96 1635 1333 -48 -1456 -1639 -839 921 1686 270 -1426 -1682 -586
6060e86J451O22q67j045j103R8J574J695n79j873j290P44J333J278Q5j406j581
$$ -586 865 1487 620 -425 -1528 -1430 144 1839 1260 -613 -1903 -1159 174 1452 1537 131 -1450
6077a450l77J611J685L10j890j080r4Q30J757N54o85k053j049J039K106M62q51
$$ -1450 -1827 -216 1469 1779 -111 -1191 -1285 -455 1302 1856 1171 -882 -1931 -892 1214 1676 825
6094H25j268j052L76J384J254N0k018j086J38J417J431L5j445j165o76J467J079
$$ 825 -443 -1495 -1119 265 1519 1569 -449 -1535 -1397 20 1451 1486 41 -1124 -1800 -333 746
6111G46P99q29k041m35O15J929J126j368j311r39O65J342J194n58j258j448L40
$$ 746 1545 716 -1325 -1760 -1145 784 1910 542 -769 -1708 -1043 299 1493 935 -323 -1771 -1431
6128a431J801J297m10j319j119k81P06J900Q17j465j717m89J213J656M06n22j199
$$ -1431 370 1667 1257 -62 -1181 -1462 -756 1144 1961 496 -1221 -1710 -497 1159 1565 1043 -156
6145a56j742R23J617J381n77k232r26M46J608J027n3j102j897j5J333K060p8j846
$$ -156 -1898 -975 642 2023 1446 -786 -1712 -1266 342 1369 1316 214 -1683 -1698 -365 1695 1617 -229
6163b29j019k28Q72J317R47p81j812r28R21J741O07p19j274j091M54J460J232
$$ -229 -1248 -1476 -604 713 1660 879 -933 -1861 -940 801 1408 689 -585 -1676 -1222 238 1470
6180A470J8j889j297L99J652Q87K76j249j523j48J240J399N68q11k082n58R08
$$ 1470 1488 -401 -1698 -1299 353 1240 1516 267 -1256 -1404 -164 1235 1803 992 -1090 -1648 -740
6197g40J832P37r54j426j205P33J761Q79k74j693j487N14J397J251r7j415p35
$$ -740 1092 1829 875 -551 -1756 -1023 738 1617 1343 -350 -1837 -1323 74 1325 1228 -187 -922
6214i22q19J306J761L14j295j726j07Q70J453Q15o88j753j124P94J833J126r27
$$ -922 -1741 -435 1326 1640 345 -1381 -1488 -618 835 1650 962 -791 -1915 -1121 712 1838 911
6231I11j530j169J38J624J351q2j304j555J21J104J665K52j301j105o47J199J173
$$ 911 -619 -1788 -1650 -26 1325 1243 -61 -1616 -1495 -391 1274 1526 225 -880 -1527 -328 845
6248H45J168j159j973n68J025J317P93o48j167j168J71J774J431k24k204q63J42
$$ 845 2013 854 -1119 -1687 -662 655 1448 800 -367 -1535 -1364 410 1841 1617 -587 -1450 -1308
6265a308J417J072J97j039j468n59J109J700N57j368j469j22P92R19R09l91j764
$$ -1308 109 1181 1378 339 -1129 -1688 -579 1121 1678 310 -1159 -1281 -489 430 1339 948 -816
6282h16j064O22J534J174p41j186r86J0J473J541j26j606j478Q1J357J753l8j032
$$ -816 -1880 -1258 276 1450 709 -477 -1463 -1453 20 1561 1435 -171 -1649 -1568 -211 1542 1504 472
6300D72j173j041J197J618N42p65j474j008P63J676P28n16j337q26J0J464J215
$$ 472 -701 -1742 -545 1073 1615 850 -624 -1632 -869 807 1535 1019 -318 -1144 -1134 330 1545
6317A545j75j429j415OJ350J339L73j514r20o99O74J678R20j037j575n45P73J192
$$ 1545 1370 -59 -1474 -1468 -118 1221 1594 80 -840 -1539 -865 813 1733 696 -879 -1424 -651 541
6335E41Q17q02j164r30L85J315J047k21j171j506N68J145P60M33q57j525m59J103
$$ 541 1358 556 -608 -1538 -1153 162 1209 988 -183 -1689 -1121 24 784 1217 360 -1165 -1624 -521
6353e21J941oj031j247j85J61J386J023m26j418j293Q70J596O28l92j218j024
$$ -521 1420 1414 383 -864 -1049 -888 498 1521 1095 -323 -1616 -746 850 1478 1086 -132 -1156
6370a156j17J516J325P9j471j215p5J001J156O24j089j522m50M16J933O24r96
$$ -1156 -1273 243 1568 1647 176 -1039 -1114 -113 1043 1667 578 -944 -1394 -978 955 1579 583
6387E83j364q06Q12J033J387n35j599j022K35J437J313o02j190j212M1J607J170
$$ 583 -781 -1587 -775 258 1645 1110 -489 -1511 -1276 161 1474 872 -318 -1530 -1489 118 1288
6404A288O0j304j265m00J172J335P67q53j658q55R61J337N27K0j359j193L64J600
$$ 1288 1348 44 -1221 -1621 -449 886 1653 800 -858 -1713 -752 585 1112 1132 -227 -1420 -1056 544
6422E44J111l44j481r03l2J003J271K27p48j915k18J205J762Qq75j374p95M72
$$ 544 1655 1311 -170 -1073 -1105 -102 1169 1396 648 -1267 -1485 -280 1482 1490 615 -759 -1554 -1082
6440a082J848P52m54j785j084J054R53R28p5j022j304k33J616J125J36j743j074
$$ -1082 766 1518 1064 -721 -1805 -751 202 1130 1055 33 -1271 -1504 112 1237 1373 -370 -1444
6457a444K74R98R26P45j353j145k85P45J421P23j159r36r18O95J320J076n28j352
$$ -1444 -1170 -172 754 1499 146 -999 -1284 -539 882 1605 446 -490 -1408 -713 607 1683 1155 -197
6475a97j260K81J541J038r7r96j335J10M71J437M98r47j344m44J027J050O64j037
$$ -197 -1457 -1176 365 1403 1306 310 -1025 -915 -444 993 1491 544 -800 -1244 -217 833 1497 460
6493D60j458l82N65J448P49m93j022j273L05J314R61l65j176p68k67J343J171
$$ 460 -998 -1380 -815 633 1382 889 -133 -1406 -1101 213 1174 809 -367 -1135 -1402 -59 1112
6510A112K28j334j415K43M05J638N74p79j414q42Q55J494J021r19j787k58N99
$$ 1112 1340 6 -1409 -1166 -761 877 1451 672 -742 -1584 -729 765 1786 867 -920 -1178 -579
6527e79Q82Q96oj171j229l8J199J307j80j195j060J39K71J904L72r25j632r50
$$ -579 303 1199 1193 22 -1207 -1245 -46 1261 1081 -114 -1174 -1035 -764 1140 1512 587 -1045 -1995
6545a995J463J202O94q01j147o76P2J266J383n82j353o71o3J339J163J1j448j019
$$ -1995 -532 670 1364 563 -584 -1260 -1188 78 1461 879 -474 -1145 -1208 131 1294 1305 -143 -1162
6563a162r3R85J503J25j169j276m47P60J538P06p18j840k86N04J571R61q51j108
$$ -1162 -1255 -270 1233 1358 189 -1087 -1534 -774 764 1470 752 -1088 -1374 -870 701 1662 811 -297
6581b97j282M17J458J498n20j301j026NJ055J138j2p31j295l16R95J350j8n62
$$ -297 -1579 -1162 296 1794 1274 -27 -1053 -1048 7 1145 1133 402 -893 -1209 -214 1136 1118 556
6599E56j157q94P33J626N95o34j589n81P21J056Q78m54r48r00j92J366J031O1
$$ 556 -601 -1495 -762 864 1459 825 -764 -1345 -624 432 1310 856 -92 -992 -1184 182 1213 1274
6617A274j215r68q5O20J206L63o84j474o03R79J104O42m07r97j009L93J396Q94
$$ 1274 59 -909 -994 -374 832 1195 511 -963 -1566 -587 517 1159 752 -245 -1254 -861 535 1429
6635A429o15j212p55Q2R48J377J12q54j712j40J208J019M23j319j078j51R20J119
$$ 1429 814 -398 -1153 -1071 -123 1254 1366 512 -1200 -1340 -132 887 1310 -9 -1087 -1238 -318 801
6653H01O63p86j535n49P82J306N61k65j024j056P6J146J103n09r41o65n8O46J206
$$ 801 1464 678 -857 -1406 -624 682 1243 978 -46 -1102 -1026 120 1223 714 -227 -892 -950 -304 902
6672I02K47q55j354n58J366J225J76n74j327m24M01J347Q55n87j401o23L93J135
$$ 902 1149 294 -1060 -1618 -252 973 1149 575 -752 -1176 -775 572 1427 840 -561 -1184 -791 344
6690C44O56J27j163j140j64J450J168k19j322o70k56R66J173J85n23j403n81R86
$$ 344 1000 1127 -36 -1176 -1340 110 1278 1059 -263 -933 -1189 -223 950 1135 612 -791 -1372 -386
6708c86J202L73m38r92p95j5J703P18k07j599p15j52J363P91K65r36j187j49J150
$$ -386 816 1189 751 -241 -1036 -1051 652 1370 1163 -436 -1151 -1303 60 851 1116 180 -1007 -1156 -6
6727fJ052J02q88j190k25O14J328N87o10j519m03J54J428N86j12r57j119KJ672
$$ -6 1046 1148 260 -930 -1155 -541 787 1374 764 -755 -1158 -1004 424 1010 898 -59 -1178 -1176 496
6746D96Q58l41j149r47J49Q69J163J6q25j282jN77J463L92r31r95p66M27J471
$$ 496 1354 1013 -136 -1083 -934 -65 1098 1114 289 -993 -994 -417 1046 1438 507 -488 -1254 -827 644
6765F44Q27o58j230q65P05J036O34J47j184j386l4J611J010j30j057j126nO57
$$ 644 1471 813 -417 -1282 -577 459 1093 1240 56 -1330 -1364 247 1257 1127 70 -1056 -1061 -404
6783d04J245M24p06j369o87R27J126P02p07r86r57P91R27J037n19j106j072M36
$$ -404 841 1265 559 -810 -1497 -570 556 1258 551 -435 -1392 -601 326 1363 844 -262 -1334 -898
6801h98J109R94k78q34j040k9R09P91N43j151q57l57Q20J139L30m71j177q52L63
$$ -898 211 1205 927 93 -947 -976 -67 724 1267 116 -741 -1098 -278 861 1191 720 -457 -1309 -946
6820i46J796L17m47j212p18J41J522P46n27p44r10j3P42J269J16j132p98m42J117
$$ -946 850 1167 720 -492 -1210 -1069 453 1199 672 -72 -982 -995 -253 1016 1132 0 -798 -1240 -123
6839a23J168O8n29j127q51N46J479Q45q45j449m28M49R86P87J5j352o33k88J277
$$ -123 1045 1113 584 -543 -1394 -848 631 1476 631 -818 -1246 -797 189 976 991 -361 -994 -1282 -5
6858eJ355p0j012j387J19N90J283N9m39r38q42P60J426K57n06j227m32J16J248
$$ -5 1350 1280 268 -1119 -1000 -410 873 932 493 -445 -1287 -527 899 1156 650 -577 -1009 -893 355
6877C55J006n99j219r15P79P70Q12j90o82j223o6R99J277L36j402q34j49O80R20
$$ 355 1361 762 -457 -1372 -593 177 989 799 117 -1106 -1172 -173 1104 1440 38 -796 -945 -265 655
6896F55L32k85j157n94L66J088R52n61j281m76R7J083Q79k49q42j065j59R51J340
$$ 655 987 702 -455 -1049 -683 405 1357 796 -485 -961 -864 219 1098 849 7 -1058 -1217 -266 1074
6915A074Q1r51j029k53R23R49N06o18j020p89O57R31O55m52j089n81L06Q47P77
$$ 1074 1155 204 -825 -1078 -155 794 1300 682 -338 -1127 -470 461 1116 664 -425 -1006 -700 147 924
6934I24J06r93q43j01R65R90r7p42j129m8O64J115M48q09j440k76R09J156J92
$$ 924 1030 37 -806 -907 58 1048 951 209 -920 -968 -304 811 1259 450 -990 -1266 -357 799 991
6953I91l64j250p00L33J523P64l49j414o85K04J050Q45l83o28q90j12Q04J178
$$ 991 627 -623 -1323 -990 533 1297 948 -466 -1151 -947 103 948 565 -63 -953 -1065 -261 917
6971I17K70j064q89l43O38J200N77p41j020o99N22J266Q43j201k80r75L74O21
$$ 917 1187 123 -766 -1109 -471 729 1306 565 -455 -1154 -632 634 1477 276 -4 -979 -605 16
6989A6J177j17j056p87k77J194O17R0n61j040o51J172R36N46p56j108m32P35Q56
$$ 16 1193 1076 20 -767 -1044 150 767 857 296 -744 -1395 -223 713 1259 503 -605 -1037 -302 554
7008E54M56n49p10p41K18Q67J077m4j405q16M16N31J529o71p25p52l52P11J046
$$ 554 1010 461 -249 -990 -772 95 1172 1128 -277 -1093 -677 -146 1383 712 -13 -765 -1117 -406 640
7027F40M93r56r65m32R82Q40O57n86j227p36N22J027Q27k30j206n62J92O49J032
$$ 640 1133 177 -788 -1220 -238 602 1259 673 -554 -1290 -768 259 1086 856 -350 -912 -720 -71 961
7046I61K04j119j034J19N89J394j23p83n78o07O39O78R72q63j392l87P68J491
$$ 961 1165 46 -988 -869 -280 1114 991 208 -370 -977 -338 340 1312 449 -943 -1330 -562 929
7064I29j60l07j026m01K30P08R56K80j328r43n6Q49J166J50j041q11l84P01J244
$$ 929 769 462 -564 -965 -735 -27 929 1209 -119 -1062 -1118 -269 897 1047 6 -805 -1189 -488 756
7083G56K57p45j162J6N42O42Q14m51r73j021Q18J041O03l54j061r40M40R50M93
$$ 756 1013 268 -894 -878 -336 306 1120 669 -304 -1325 -507 534 1137 783 -278 -1218 -778 172 665
7102F65M71j204j163K9J079R60N56p91j251l02Q41Q05L14m43j026q07L81J362
$$ 665 1136 -68 -1231 -1202 -123 837 1393 602 -649 -951 -110 695 1009 566 -460 -1267 -886 476
7120D76M33j69j178p66K86Q84J112o08p29o24l37J161J115j89j056o61p8M07J288
$$ 476 909 740 -438 -1204 -918 -34 1078 470 -259 -883 -1220 -59 1056 867 -189 -850 -928 -521 767
7139G67K98o02r78o87J069O13M90l00p62j182M81J154R62n06j082o94J85N28R19
$$ 767 1065 463 -515 -1202 -133 480 970 670 -92 -1274 -793 361 1323 817 -265 -959 -774 -246 673
7158F73M46o48j220l28R31J043K00p41p70o10K97J126O72n68r48l92K6J331O85
$$ 673 1119 471 -749 -1077 -146 897 1097 356 -414 -1024 -727 399 1071 503 -445 -837 -811 520 1205
7177A205m68r86q38J91J056N06M8p50q67k04Q40Q41N50o91j269k27O87R22K87
$$ 1205 737 -249 -1087 -896 160 666 714 -36 -903 -1107 -267 574 1124 433 -836 -1063 -376 546 833
7196H33n06p37p57P06R97O57n99r26n98k3Q54R62M1r15o49k76R81Q44K38p73j069
$$ 833 327 -410 -1167 -461 536 1193 594 -332 -930 -953 -99 863 904 -11 -660 -936 45 889 1127 354 -715
7217g15j60O30P12N97n37j354l21Q63N97Q50n29r61l13n53J070J183l40p88r67
$$ -715 -875 -245 467 1064 527 -827 -1148 -285 312 1162 633 -328 -641 -1194 -124 1059 719 -69 -1036
7236a036L93O80M29N01q01j201j50J067P81N25j012q21j64L25O86R10m99r21j006
$$ -1036 -643 37 466 967 166 -1035 -1185 -118 663 1188 176 -645 -809 -484 202 1112 613 -308 -1314
7255a314R12P61M90l05p54q36j35J460O14Mp66o48o9M34J049ln38q40n32L69J349
$$ -1314 -402 359 849 544 -210 -1046 -1181 279 893 897 131 -517 -586 -152 897 894 356 -484 -1016 -647 702
7276G02N44q23p77o24M84J049O72n77j079n89l3R90R56J47r13j112j58R31R34
$$ 702 1246 423 -354 -978 -494 555 1227 650 -429 -1018 -1051 -61 895 1042 129 -983 -1141 -210 724
7295G24N09r25j022j63M77P19Q00n65j343j47M96J092J80k18r04p26Q2P66J138
$$ 724 1233 308 -714 -877 -400 319 1119 554 -789 -936 -440 652 832 614 -290 -1016 -934 -168 970
7314I70k61j028n14J48O89Q47L99r88j137k03O78J205P4k03j025k60J2J040M18
$$ 970 709 -319 -833 -685 4 851 1250 262 -875 -1078 -400 805 879 676 -349 -609 -597 443 861
7333H61m09j036m91M70P97P87l42o61o96K9P73P74K10j034q24oK25R06O05p06
$$ 861 452 -584 -1075 -605 192 979 637 -24 -720 -691 82 856 1066 32 -792 -798 -573 333 938 232
7353B32j086j90M44J015P36r59l74q88L91Q72Q50j68j058p94L17Q27P05m36k49
$$ 232 -854 -1044 -600 415 1151 192 -182 -1070 -679 193 1043 875 -183 -977 -660 167 872 436 187
7372A87j013L5O58J026L0o88j172K24L76R57N94q30j203K8N91M49O77m8j057r42
$$ 187 -826 -791 -133 893 923 235 -937 -713 -337 620 1214 384 -819 -791 -200 249 926 878 -179 -1121
7392a121M35J016N31k80n70p62L0Q52Q06J20q61q51m89R69N90M36o78r17k58M76
$$ -1121 -686 330 861 581 11 -751 -721 131 937 1057 196 -655 -1144 -175 415 851 173 -744 -1002 -526
7412e26J039O63o05j141n01M07J156M23m5r66q90J78P36J309n32n81o71j31K35
$$ -526 513 1176 571 -570 -1071 -664 492 915 870 -96 -986 -808 -72 1237 705 124 -547 -678 -443
7431d43J061M46m53j253k52O32P55K23K9j068n14L75Q30P39l41j131p09M01Q46
$$ -443 618 1064 611 -642 -894 -262 493 716 745 -323 -837 -462 368 1107 766 -365 -1074 -673 173
7450A73N40K92p93r94r7P18O96L24p81o22l64M61R08N17o04r25o61Q41Q89J03
$$ 173 713 1005 212 -782 -879 -161 535 859 78 -544 -908 -447 461 978 374 -551 -1212 -371 518 621
7470F21r4o61p67K66R67P10k74j170n03K02P16O59J51p92q07K1Q19Q80J04q98
$$ 621 527 -134 -901 -635 332 1042 768 -402 -905 -703 13 672 823 31 -776 -755 64 944 1048 150
7490A50p73m93Q55M96O16l97n99n57M28N74Q06o06q86k1l07R30N81L2o75o01o3
$$ 150 -623 -1116 -261 235 851 454 -145 -702 -274 300 1106 500 -386 -407 -714 216 797 829 154 -447 -510
7511e10M03O41L54n33q24m02L12R26P68o60p33n56L11M72R70k48j032p65J54R86
$$ -510 -107 534 888 355 -469 -871 -559 367 1135 475 -258 -814 -503 -31 939 691 -341 -1106 -952 34
7531C4P16R1r67p17J27J039L72J8n43q22l68M24R39N10k76r77l22J31R55P13m57
$$ 34 750 841 -126 -843 -716 323 695 713 170 -652 -1020 -596 343 853 577 -400 -722 -591 364 1077 620
7552F20r27m09J8J011O05l52o80n20l37J091N72K34q78p38l02R25P17k0m96n55
$$ 620 -307 -716 -698 313 918 566 -114 -634 -971 120 692 926 48 -690 -992 -67 650 630 134 -421
7572d21k76N45N99L11J46j217n26m2J216N02l66m76q08k84Q82Q32K17j375j62
$$ -421 -697 -152 447 758 904 -313 -839 -881 335 837 471 -5 -813 -1097 -215 617 834 -541 -703
7591g03j98P18O05N36m15j117m19Q20O98N39n69q66l13K91P41P56o72k39j119
$$ -703 -901 -183 422 958 543 -574 -993 -173 525 1064 495 -371 -684 -393 348 1104 432 193 -926
7610i26J31J081M26Nq05o85J65K95J090K84p02j158J9N46P95J35m08q88m80N07
$$ -926 -795 286 712 717 -88 -773 -608 -313 777 1061 359 -799 -780 -234 561 696 288 -600 -1080 -573
7630e73R40N73m04p79o13K44Q66O82n57m23n96j5L20Q12L29r18p48k67Q56J043
$$ -573 367 940 536 -243 -856 -612 254 936 379 -44 -640 -655 -335 477 806 -112 -860 -1127 -271 772
7650G72J07o83l79q96Q76P78L53q0j189m49N57M94M76p6p79k56l39Q82M67K47
$$ 772 879 196 -183 -1079 -203 575 928 848 -341 -790 -233 261 737 661 -118 -374 -713 169 636 883
7670H83o61q26p4N02R64j36m68p96k10L99J379J8p43m96o00L10O85O29j94q74
$$ 883 222 -604 -678 -176 788 652 184 -612 -822 -423 956 974 231 -265 -865 -555 130 759 565 -309
7690c09m25j1Q79N18k48k42q24P5K45J173j14k79j079j09M89N48M38n78m36n21
$$ -309 -734 -745 134 652 404 162 -662 -587 -342 831 717 438 -641 -750 -261 287 725 147 -289 -810
7710h10J04J383K87k80p09r13L78O43N92k3p85k43n3N37P64q8p19n68j65O26L21
$$ -810 -706 677 964 684 -25 -938 -560 83 675 652 -133 -376 -429 108 872 784 65 -503 -668 -42 279
7731B79O95n58q95p82J003O70L04j94j201n9k4O19N73N4n91n85J9O15Q03k50l90
$$ 279 974 416 -479 -1261 -258 412 716 522 -679 -738 -762 -143 430 484 -107 -692 -673 -58 745 495 105
7752A05p94r6O76N74L69j89j246k56P21R83k89j36j050LK06N96R04o29q86l02
$$ 105 -689 -785 -109 465 834 645 -601 -857 -136 847 558 422 -628 -625 -419 177 1081 452 -434 -736
7772g36J22O64P54K5p28n29n14J091N13J37n38p07l53M32Q11J36J47q63p43O14
$$ -736 -614 50 804 829 101 -428 -942 149 662 799 261 -446 -799 -367 444 580 727 -136 -879 -265
7792b65M20O51m11n73n91nP51O31J14o44l69n75P53N67N4j82j014r6N99P66P5
$$ -265 155 806 395 -178 -769 -774 -23 608 722 78 -291 -866 -113 454 508 326 -688 -784 -185 581 656
7813F56m30q39p5K31P38M44k45j033l21L19N72Q33k96r30n43L56K96M62O36n43
$$ 656 226 -613 -688 -457 281 725 480 -553 -874 -555 17 850 554 -376 -919 -563 -267 195 831 288
7833B88p66k91N75P63N08p50q69l43O61O24L64q74p2l15r2R06R73o74j040l25
$$ 288 -478 -769 -194 569 1077 327 -542 -885 -224 400 764 -110 -182 -497 -589 317 1290 616 -424 -749
7853g49K73Q05O8L60q74m71j34Q10N18M16r01o65o2J86L79O47l44p72k71L42Q59
$$ -749 -476 329 397 757 -117 -588 -722 88 606 1022 121 -544 -606 -420 -41 606 262 -510 -781 -439 420
7874D20K57n25n77m6k86P69O69J75r18p22K32N06J013k57l87r38j38M93P86P43
$$ 420 677 152 -425 -471 -757 12 681 856 -62 -784 -552 -46 967 710 323 -615 -753 -260 526 1269
7894A269r08r06j29L77M30N73p08n11l74N43M41O30k28m99q75L40Q82L02on53
$$ 1269 361 -545 -674 -297 133 706 -2 -513 -887 -344 97 727 499 0 -875 -535 347 649 643 90
7914I0o71m36J121M81J80o48o01m62O49P13N39n11p37l23j2J022N22n08o01k01
$$ 90 -581 -1017 104 585 765 117 -484 -946 -297 416 955 444 -293 -616 -628 394 916 408 -193 -394
7934c94K5J32J091k91o57m08j92O85P61J10o41q15M1K67Q64M62o11r26n2R9R68
$$ -394 -369 -237 854 563 -94 -502 -694 -9 752 862 221 -594 -553 -286 578 1040 429 -497 -549 -450 518
7955E18L40o34m13m83j99R24P92j71q47m81L34L92N64p5m81q71K37K59J060K4
$$ 518 858 224 -189 -672 -871 53 845 674 -173 -654 -320 72 636 561 80 -791 -554 -295 765 789
7975G89p13n43k36O17J38J004n81j014m32Q49L47L78m5m99o11l74Q44P62K22r06
$$ 789 76 -467 -703 -86 52 1056 475 -539 -971 -122 225 603 558 59 -552 -926 -82 680 902 -4
7995do04N2N33M15L99k46r95l91P22Q05K54n51q06l26N4Q82L32l19k70m45J28
$$ -4 -608 -556 -23 392 791 545 -450 -841 -119 686 940 389 -417 -743 -689 193 525 206 -64 -509 -381
8016c81K57R82j78l16j093m58J210N61R1o92l70j52K29M95P10n16r20j95N76O36
$$ -381 -124 858 680 364 -729 -1187 23 584 675 -17 -387 -539 -310 185 895 379 -541 -736 -160 476
8036D76K52j54q35n46K42O24J025n95p78lk37N13M71K20o81o85K00%J417k42m44
$$ 476 728 574 -261 -807 -565 59 1084 489 -289 -292 -529 -16 455 675 -6 -691 -491 -491 926 684 240
8057B40o60j08K97P33N51q05n95j12O1Q35M37p23l12m34l3M18P54j16l39p85j50
$$ 240 -420 -528 -231 502 1053 248 -347 -459 -398 437 874 151 -161 -595 -628 -210 544 428 89 -696 -846
8078h46N77Q37L13r41n63oO02N54j10j33o03l17m2J063L59l26n34n76J85O19L03
$$ -846 -269 568 881 -60 -623 -629 -27 527 417 284 -319 -636 -678 385 744 418 -116 -692 -507 112 415
8099D15Lm88m98J99K50N54L67q17p39K63L78M18L14l35n36m19N15N38N08m45n34
$$ 415 418 -70 -568 -369 -119 435 802 -15 -754 -491 -113 305 619 284 -252 -671 -156 382 890 445 -89
8120h9n52J42N65P19m15m52m90j80P21P04n1k18p19n65O68M61N91p70k42m95N37
$$ -89 -641 -499 66 785 370 -82 -572 -752 -31 673 622 404 -315 -880 -212 249 840 70 -172 -667 -130
8141a30N62M10m33p99j83lJ140K24l24o80p70M25O87O92k74l46q74r9R60P7N75
$$ -130 432 842 409 -390 -573 -576 564 788 464 -216 -986 -561 126 818 544 198 -676 -775 185 262 837
8162H37m88q13l10N95O48L10o47k49l23j58Q17N06j11j067l03K44O09P49m40m11
$$ 837 349 -464 -774 -179 469 779 132 -117 -440 -598 219 725 614 -453 -756 -512 97 846 406 -5
8182ep71J80L49R57N0k61j035l15O51
$$ -5 -776 -596 -247 710 760 499 -536 -851 -200
8191b00
$$ Imaginary data points
##PAGE= N=2
##DATA TABLE= (X++(I..I)), XYDATA
0@%%%%%%%%%Pj5J6j6J6j7K5l2L4m2N0n8P1q1R1j06J22j39J59j81K05k32K61k92
$$ 0 0 0 0 0 0 0 0 0 0 7 -8 8 -8 8 -9 16 -16 18 -24 26 -32 39 -42 49 -57 65 -74 85 -96 109 -123 138 -154
33a54L27l63M03m52N02n57O19o84P57q39R28j027J140j268J413j578J770j997
$$ -154 173 -190 213 -239 263 -294 325 -359 398 -441 487 -540 600 -668 745 -833 937 -1060
51a060K268k600L021l571M320n410P151j0378J8341p3395j28901J20199J14840
$$ -1060 1208 -1392 1629 -1942 2378 -3032 4119 -6259 12082 -61313 -190214 -70015 44825
64D4825j258n9218k1425m3183l8814M8833J08963Q230r5672o5414K7737M9879
$$ 44825 43567 -15651 -37076 -80259 -119073 -70240 38723 46953 -48719 -114133 -86396 -36517
76c6517M0739L2630j7015q7040n1868O5525J08518K4662n5840n9946k4547J9594
$$ -36517 4222 36852 19837 -67203 -119071 -53546 54972 79634 23794 -36152 -60699 -41105
88d1105P1976P0407j8900r7138n0524N3352P6780K0912j8479k9613m7535l4486
$$ -41105 30871 101278 82378 -14760 -65284 -11932 64848 85760 67281 37668 -9867 -44353
100d4353M1339R2473L2376o9825q7691j9110M7628O4308L0240l6163p8670l9835
$$ -44353 -3014 89459 121835 52010 -35681 -54791 -7163 57145 87385 51222 -27448 -67283
112f7283M2005O5976J7163l2987m9305m1677K080O4607O2865k0911p9652m3016
$$ -67283 -25278 40698 57861 24874 -24431 -66108 -64028 579 63444 42533 -37119 -80135
124h0135J8181L6931M1648L6303k7013r3451m4712P5138R6960l36o7996m3962
$$ -80135 -61954 -25023 16625 52928 25915 -67536 -112248 -37110 59850 59514 -8482 -52444
136e2444m791K0222N3827N4339k2075q5760l9867M6529N9250J9191k524k5251
$$ -52444 -57235 -37013 16814 71153 49078 -36682 -76549 -30020 29230 48421 45897 20646
148B0646n9284l1406O0716Q8514l306q2600m9738J9591L9557L2870K5119k3539
$$ 20646 -38638 -70044 -9328 79186 75880 -6720 -56458 -36867 2690 35560 60679 37140
160C7140p9885m4385O1203Q8780L893o1327m0955o737K588L0734N9374J2109p3238
$$ 37140 -42745 -87130 -25927 62853 66746 5419 -35536 -42273 -39685 -8951 50423 62532 -10706
173a0706o9177K2587P5004L7190j6565m0601m5144j6419M8926P7044J1436o7255
$$ -10706 -79883 -57296 17708 54898 38333 -2268 -47412 -63831 -14905 62139 73575 6320
185F320o0537L700M3385M2906K4651j7703o0526m2385L0449O8531L0559k8897
$$ 6320 -54217 -50517 -7132 35774 60425 42722 -17804 -60189 -29740 38791 69350 40453
197D0453n0603l5142N145N2715N7475l493o8783n9160Q927N7661M9246L033m4781
$$ 40453 -10150 -45292 -40147 12568 70043 66550 -2233 -61393 -52466 5195 54441 57474 12693
210A2693n7909j6045M2629N5226J2502l3388m6390k7189J5195N6261M4260k3970
$$ 12693 -45216 -61261 -18632 36594 49096 15708 -30682 -57871 -42676 13585 57845 33875
222C3875p0269l7037L0568N5070L0026q179m0232n1126r360N5891O3859l733n9549
$$ 33875 -36394 -73431 -42863 12207 42233 34054 -6178 -57304 -66664 -10773 53086 49353 -10196
235a0196m1941Q095L2869L6432K3404k0383o0494l4886L9480O8054J9700l4967
$$ -10196 -52137 -44042 -11173 25259 48663 28280 -32214 -67100 -27620 40434 60134 25167
247B5167m3707k4759O169M5881N2831n141o4876m6778K2915N2684K5989p087k7639
$$ 25167 -18540 -43299 -37130 8751 61582 56441 -8435 -55213 -32298 20386 46375 39288 11649
260A1649l9430j9997L7217O3260J2461n3566n2829j574L4563L8059K2002j4331
$$ 11649 -27781 -47778 -10561 52699 65160 11594 -41235 -42809 -8246 29813 51815 37484
272C7484n2911m2560K1929O4157L2294k8238m9654k6343R723L7816L9825K639
$$ 37484 -15427 -57987 -36058 28099 60393 32155 -17499 -43842 -34119 3697 43522 46161
284D6161m5776m9396k5M5373M2493K549l4691m2837j5776K8834N0335J9410l2093
$$ 46161 385 -49011 -49036 -3663 38830 41379 6688 -36149 -51925 -23091 27244 46654 14561
297A4561n0229j8076K6758M5155K3890j8699m7190l1880J4970M8855L6687j0163
$$ 14561 -35668 -53744 -26986 18169 42059 23360 -23830 -55710 -40740 8115 44802 34639
309C4639m5470l9970K788M3585M4790L216l9647m2749p515L2749M4454J8189k7825
$$ 34639 -10831 -50801 -48013 -4428 40362 43578 3931 -38818 -46333 -13584 30870 49059 21234
322B1234m9387k0473L1118M9091J8605k3664m0621k4436J1688M3536L7513r355
$$ 21234 -28153 -48626 -17508 31583 50188 26524 -14097 -38533 -26845 16691 54204 44849
334D4849n0080l8255J2757M4867L2515l482l4071m0329j0683L5309M9479J0946
$$ 44849 -5231 -43486 -30729 14138 46653 43171 9100 -31229 -41912 -6603 42876 53822
346E3822l9727m6835j0170K8155L9213K0736j7468m6121l2885J8236N0111K7931
$$ 53822 14095 -32740 -42910 -14755 24458 45194 27726 -18395 -51280 -33044 17067 44998
358D4998j9645m1018k7062O140L4522L6974K323m1062m3590R24M1856L7390J576
$$ 44998 25353 -15665 -42727 -36587 -2065 34909 37232 -3830 -47420 -46496 -4640 32750 34326
371C4326k9684l7435j4813K4380M6523K2482k7205m7379j8770K4009M0462K3179
$$ 34326 4642 -32793 -47606 -23226 23297 45779 18574 -28805 -47575 -23566 16896 40075
383D0075j2206l8769l2070Q702M3606L4549p903l9606l3040K135L3640L7577O460
$$ 40075 27869 -10900 -42970 -34268 9338 43887 35984 -3622 -36662 -34527 -887 36690 43150
396D3150l2977m1445q684L1904L9951J1943k5495l9950j9711K1157M3164K3885
$$ 43150 10173 -31272 -39956 -8052 31899 43842 18347 -21603 -41314 -20157 23007 46892
408D6892k0360m2826k4832J4386L8970K9181o653l9197l4914M208L8035L3991
$$ 46892 26532 -16294 -41126 -26740 12230 41411 34758 -4439 -39353 -35145 2890 36881
420C6881n60l2161l5737p153K9133M0773J0792l0333m0867j1130K5471L7269J7531
$$ 36881 36321 4160 -31577 -38730 -9597 31176 41968 11635 -29232 -40362 -14891 22378 39909
433C9909j7855l9332k5851J6052M2811K6233j5046l8187k6811P060L3673L2678
$$ 39909 22054 -17278 -43129 -27077 15734 41967 26921 -11266 -38077 -31017 2656 35334
445C5334N83l5718l7626j112L4286L5331M756k7284l6466j3405K4142M0889J6300
$$ 35334 35917 199 -37427 -38539 -4253 31078 35834 8550 -27916 -41321 -17179 23710 40010
458D0010k4587l9239j6821J8423L5950K2423j1124l8239k8813J1075L9264K8352
$$ 40010 15423 -23816 -40637 -22214 13736 36159 25035 -13204 -42017 -30942 8322 36674
470C6674p251l3994l0252j322L1680L8380N943l4014l7986m968K9038L4490J2575
$$ 36674 29423 -4571 -34823 -36145 -4465 33915 39858 5844 -32142 -37110 -8072 26418 38993
483C8993k0160l7500k0451J9931M2025J9908j9289l5348k0078R357L1867K9475
$$ 38993 18833 -18667 -39118 -19187 22838 42746 23457 -11891 -31969 -22612 9255 38730
495C8730k478l7949l4296N866L7431K9443k988k8294l1556r159K6098L9695J1281
$$ 38730 36252 -1697 -35993 -30127 7304 36747 33759 5465 -26091 -35250 -9152 30543 41824
508D1824l0609l9330q858K2972L1630J6368j2843l5796k7874J1641M0969K6519
$$ 41824 11215 -28115 -36973 -14001 17629 33997 21154 -14642 -42516 -30875 10094 36613
520C6613j3339l5766k5074L857L0575L1918K774l4071l5450J18L2447L1152L478
$$ 36613 23274 -12492 -37566 -33709 -3134 28784 31558 -2513 -37963 -37845 -5398 25754 29232
533B9232k3336l1515j2056K1647L7734J5941k1022l5310j7091J5355L5205K5495
$$ 29232 5896 -25619 -37675 -16028 21706 37647 16625 -18685 -35776 -20421 14784 40279
545D0279r293l8850k9081J1538L7896K6540m969l0429l0330l304L0053L5870L109
$$ 40279 30986 -7864 -36945 -25407 12489 39029 34060 3631 -26699 -30003 50 35920 39029
558C9029l1331l0884m099J9776K7800J5772j4461l8653k3753K0577M1034J5935
$$ 39029 7698 -23186 -27285 -7509 20291 36063 21602 -17051 -40804 -20227 20807 36742
570C6742k0340l2039j9321N900L1456L2244n276m2365l1441J3093L4810K0581
$$ 36742 16402 -15637 -34958 -29058 2398 34642 29366 -12999 -44440 -31347 3463 24044
582B4044k100j8900k8780j6054K3233M3400J4142l0075l5990p129J8476K7874
$$ 24044 21944 3044 -25736 -41790 -18557 24843 38985 8910 -27080 -34209 -15733 12141
594A2141K2417o375l8608l0295J7649M4591J9031j9840k8253j4639K830K1965
$$ 12141 34558 28183 -10425 -40720 -23071 21520 40551 20711 -7542 -22181 -19351 2614
606B614L0605N992l3046l5611Q73L0448K6990M936j7981l2592k0957J8380M2873
$$ 2614 33219 39211 6165 -29446 -28573 1875 28865 33801 15820 -16772 -37729 -19349 23524
619B3524J9106k6267m0020j3698J7614L0097J9455r132l3442k5544Q276L1381
$$ 23524 42630 16363 -23657 -37355 -19741 10356 29811 20679 -12763 -38307 -30031 1350
631A350K2560l272k3188k6545p830K4051L5962Q535k7949l3030n345K3345L2259
$$ 1350 23910 20638 -2550 -29095 -36925 -12874 23088 31623 3674 -29356 -34701 -11356 20903
644B0903J4847j9478l9462j5922K6710L8261J0938j8583k5017j6469J965K7560
$$ 20903 35750 16272 -23190 -39112 -12402 25859 36797 18214 -6803 -23272 -21307 6253
$$ [...]
8191G12
##END NTUPLES=NMR FID
##END=
