##TITLE=1H_AMl_NV107
 CDCl3
 8 sc, 
 12.1.2024
##JCAMPDX= 6.0         $$ Bruker NMR JCAMP-DX V2.0
##DATA TYPE= NMR FID
##DATA CLASS= NTUPLES
##ORIGIN= UXNMR, Bruker Analytische Messtechnik GmbH
##OWNER= root
$$ XWIN-NMR		Version 3.5
$$ Fri Jan 12 13:49:35 2024 Russian Standard Time (UT+4h)  she@DPX200
##.OBSERVE FREQUENCY= 200.1313
##.OBSERVE NUCLEUS= ^1H
##.DELAY= (6, 6)
##.ACQUISITION MODE= SIMULTANEOUS
##.ACQUISITION SCHEME= undefined
##.AVERAGES= 8
##.DIGITISER RES= 18
##SPECTROMETER/DATA SYSTEM= spect
##.PULSE SEQUENCE= zg30
##.SOLVENT NAME= CDCl3
##.SHIFT REFERENCE= (INTERNAL, CDCl3, 0, 15.7039)
##AUDIT TRAIL= $$ (NUMBER, WHEN, WHO, WHERE, WHAT)
$$ ##TITLE= Audit trail, XWIN-NMR		Version 3.5
$$ ##JCAMPDX= 5.01
$$ ##ORIGIN= Bruker BioSpin GmbH
$$ ##OWNER= she
$$ F:/spectra/data/she/nmr/H-F/1/audita.txt
$$ ##AUDIT TRAIL=  $$ (NUMBER, WHEN, WHO, WHERE, WHAT)
(   1,<2024-01-12 13:47:18.54 +0400>,<she>,<DPX200>,
      <created by zg, POWCHK disabled, PULCHK disabled
       configuration hash MD5:
       00 E9 B6 7A A2 85 ED C7 34 08 36 98 17 FE 4E 26
       data hash MD5: 16K
       97 99 FB 99 C2 3B A7 3C 37 2B 8D 0C 7E 16 F3 7E>)
$$ ##END=
$$ 
$$ hash MD5
$$ 93 A0 D1 A4 5D 55 53 87 6E B5 B5 8E 63 C1 68 5E
##$RELAX= 
##$RELAX= 
##$RELAX= 
##$RELAX= 
##$RELAX= 
##$RELAX= 
$$ Bruker specific parameters
$$ --------------------------
##$DU= <F:/spectra>
##$EXPNO= 1
##$NAME= <H-F>
##$PROCNO= 1
##$TYPE= <nmr>
##$USER= <she>
##$AMP= (0..31)
100 100 100 100 100 100 100 100 100 100 100 100 100 100 100 100 100 100 
100 100 100 100 100 100 100 100 100 100 100 100 100 100 
##$AQSEQ= 0
##$AQ_mod= 1
##$AUNM= <au_zg>
##$AUTOPOS= <>
##$BF1= 200.13
##$BF2= 200.13
##$BF3= 200.13
##$BF4= 200.13
##$BF5= 200.13
##$BF6= 200.13
##$BF7= 200.13
##$BF8= 200.13
##$BYTORDA= 1
##$CFDGTYP= 0
##$CFRGTYP= 5
##$CHEMSTR= <none>
##$CNST= (0..31)
1 1 145 1 1 1 1 1 1 1 1 1 1 1 1 1 1 1 1 1 1 1 1 1 1 1 1 1 1 1 1 1 
##$CPDPRG= <>
##$CPDPRG1= <>
##$CPDPRG2= <>
##$CPDPRG3= <>
##$CPDPRG4= <mlev>
##$CPDPRG5= <mlev>
##$CPDPRG6= <mlev>
##$CPDPRG7= <mlev>
##$CPDPRG8= <mlev>
##$CPDPRGB= <>
##$CPDPRGT= <>
##$D= (0..31)
0 1.2 0 0 0 0 0 0 0 0.06 0 0.03 0 0 0 0 0.0002 0 0 0 0 0 0 0 0 0 0 0 0 
0 0 0 
##$DATE= 1705052837
##$DBL= (0..7)
120 120 120 120 120 120 120 120 
##$DBP= (0..7)
150 150 150 150 150 150 150 150 
##$DBP07= 0
##$DBPNAM0= <>
##$DBPNAM1= <>
##$DBPNAM2= <>
##$DBPNAM3= <>
##$DBPNAM4= <>
##$DBPNAM5= <>
##$DBPNAM6= <>
##$DBPNAM7= <>
##$DBPOAL= (0..7)
0.5 0.5 0.5 0.5 0.5 0.5 0.5 0.5 
##$DBPOFFS= (0..7)
0 0 0 0 0 0 0 0 
##$DE= 6
##$DECBNUC= <off>
##$DECIM= 32
##$DECNUC= <off>
##$DECSTAT= 4
##$DIGMOD= 1
##$DIGTYP= 9
##$DL= (0..7)
0 120 120 120 120 120 120 120 
##$DP= (0..7)
150 150 150 150 150 150 150 150 
##$DP07= 0
##$DPNAME0= <>
##$DPNAME1= <>
##$DPNAME2= <>
##$DPNAME3= <>
##$DPNAME4= <>
##$DPNAME5= <>
##$DPNAME6= <>
##$DPNAME7= <>
##$DPOAL= (0..7)
0.5 0.5 0.5 0.5 0.5 0.5 0.5 0.5 
##$DPOFFS= (0..7)
0 0 0 0 0 0 0 0 
##$DQDMODE= 0
##$DR= 18
##$DS= 0
##$DSLIST= <SSSSSSSSSSSSSSS>
$$ [...]
##$SUBNAM2= <"">
##$SUBNAM3= <"">
##$SUBNAM4= <"">
##$SUBNAM5= <"">
##$SUBNAM6= <"">
##$SUBNAM7= <"">
##$SUBNAM8= <"">
##$SUBNAM9= <"">
##$SW= 18.0517328524113
##$SWIBOX= (0..15)
0 0 2 0 0 0 0 0 0 0 0 0 0 0 0 0 
##$SW_h= 3612.71676300578
##$TD= 16384
##$TD0= 1
##$TE= 0
##$TE2= 300
##$TE3= 300
##$TEG= 300
##$TL= (0..7)
0 120 120 120 120 120 120 120 
##$TP= (0..7)
150 150 150 150 150 150 150 150 
##$TP07= 0
##$TPNAME0= <>
##$TPNAME1= <>
##$TPNAME2= <>
##$TPNAME3= <>
##$TPNAME4= <>
##$TPNAME5= <>
##$TPNAME6= <>
##$TPNAME7= <>
##$TPOAL= (0..7)
0.5 0.5 0.5 0.5 0.5 0.5 0.5 0.5 
##$TPOFFS= (0..7)
0 0 0 0 0 0 0 0 
##$TUNHIN= 0
##$TUNHOUT= 0
##$TUNXOUT= 0
##$USERA1= <user>
##$USERA2= <user>
##$USERA3= <user>
##$USERA4= <user>
##$USERA5= <user>
##$V9= 5
##$VALIST= <valist>
##$VCLIST= <CCCCCCCCCCCCCCC>
##$VD= 0
##$VDLIST= <DDDDDDDDDDDDDDD>
##$VPLIST= <PPPPPPPPPPPPPPP>
##$VTLIST= <TTTTTTTTTTTTTTT>
##$WBST= 1024
##$WBSW= 4
##$XGAIN= (0..3)
0 0 0 0 
##$XL= 0
##$YL= 0
##$YMAX_a= 407853
##$YMIN_a= -476844
##$ZGOPTNS= <>
##$ZL1= 120
##$ZL2= 120
##$ZL3= 120
##$ZL4= 120
##$ABSF1= 10
##$ABSF2= 0
##$ABSG= 5
##$ABSL= 3
##$ALPHA= 0
##$AQORDER= 0
##$ASSFAC= 0
##$ASSFACI= 0
##$ASSFACX= 0
##$ASSWID= 0
##$AUNMP= <proc_1d>
##$AZFE= 0.1
##$AZFW= 0.1
##$BCFW= 1
##$BC_mod= 2
##$BYTORDP= 1
##$COROFFS= 0
##$CY= 11.3945322036743
##$DATMOD= 1
##$DC= 2
##$DFILT= <>
##$DTYPP= 0
##$F1P= 15.7292609196834
##$F2P= 12.9074282941183
##$FCOR= 0.5
##$FTSIZE= 0
##$FT_mod= 4
##$GAMMA= 1
##$GB= 0.15
##$INTBC= 1
##$INTSCL= 1
##$ISEN= 128
##$LB= 0.24
##$LEV0= 0
##$LPBIN= 0
##$MAXI= 10000
##$MC2= 0
##$MEAN= 0
##$ME_mod= 0
##$MI= 1.114404
##$NCOEF= 0
##$NC_proc= 0
##$NLEV= 6
##$NOISF1= 3.799351
##$NOISF2= 2.8
##$NSP= 1
##$NTH_PI= 0
##$NZP= 0
##$OFFSET= 15.70392
##$PC= 1
##$PHC0= -24738.06
##$PHC1= 17.2527
##$PH_mod= 1
##$PKNL= yes
##$PPARMOD= 0
##$PSCAL= 0
##$PSIGN= 0
##$REVERSE= no
##$SF= 200.130013532006
##$SI= 16384
##$SIGF1= 3
##$SIGF2= 2
##$SINO= 400
##$SIOLD= 16384
##$SREGLST= <1H.CDCl3>
##$SSB= 0
##$STSI= 0
##$STSR= 0
##$SW_p= 3612.71676300578
##$SYMM= 0
##$S_DEV= 0
##$TDeff= 0
##$TDoff= 0
##$TI= <>
##$TILT= no
##$TM1= 0
##$TM2= 0
##$TOPLEV= 0
##$USERP1= <user>
##$USERP2= <user>
##$USERP3= <user>
##$USERP4= <user>
##$USERP5= <user>
##$WDW= 1
##$XDIM= 8192
##$YMAX_p= 0
##$YMIN_p= 0
$$ End of Bruker specific parameters
$$ ---------------------------------
##NTUPLES= NMR FID
##VAR_NAME=  TIME,          FID/REAL,        FID/IMAG
##SYMBOL=    X,             R,               I
##VAR_TYPE=  INDEPENDENT,   DEPENDENT,       DEPENDENT
##VAR_FORM=  AFFN,          ASDF,            ASDF
##VAR_DIM=   8192,          8192,            8192
##UNITS=     SECONDS,       ARBITRARY UNITS, ARBITRARY UNITS
##FACTOR=    0.0002768,     1,               1
##FIRST=     0,             0,               0
##LAST=      2.2672688,     0,               0
##MIN=       0,             -476844,         0
##MAX=       2.2672688,     407853,          0
$$ Real data points
##PAGE= N=1
##DATA TABLE= (X++(R..R)), XYDATA
0 0 0 0 0 0 0 0 0 0 0 0 0 0 8 -8 8 -8 8 -16 16 -22 24 -30 34 -41 49 -57 67 -79 91 -105 120 -137 160 -178
34 -178 203 -231 260 -290 327 -364 408 -453 504 -558 619 -685 757 -833 918 -1013 1117 -1229
52 -1229 1353 -1492 1644 -1818 2010 -2227 2479 -2771 3110 -3513 4002 -4610 5385 -6400 7777
67 7777 -9688 12069 -16308 407853 9678 -440787 255764 271644 -364506 -57218 379137
78 379137 -149509 -250202 258235 85232 -273461 62156 185129 -140970 -88471 141157
88 141157 5878 -93917 18836 59412 1467 -47727 -18201 88721 5521 -130453 56123
99 56123 137761 -155238 -87558 223767 -36127 -239250 176027 158275 -280609 -382 306205
110 306205 -168943 -212037 305490 49220 -335614 139652 254412 -283368 -100355 319318
120 319318 -85072 -262225 212821 124773 -258722 25299 218400 -128258 -114293 171418
130 171418 15834 -139955 55400 81763 -74372 -31460 52524 4663 -33560 -17545 25998
141 25998 31040 -51782 -27387 91305 -7268 -108486 76971 92112 -138995 -22033 169885
152 169885 -75166 -143676 160261 55397 -204578 56552 175192 -160172 -86482 211310
162 211310 -30997 -188860 138924 110070 -191421 1222 180756 -98303 -115850 148390
172 148390 24121 -147210 51141 99229 -93119 -37535 94132 -10666 -65075 36346
182 36346 36172 -32938 -16257 22973 14663 -20987 -23673 30618 20055 -55215 -2265 69531 -36683
195 -36683 -62383 80489 28377 -103601 32296 98851 -88257 -52597 124632 -15905 -121608
206 -121608 82185 74007 -128186 -6822 127316 -65716 -89855 111817 27432 -118197 39764
217 39764 92806 -81041 -40058 95907 -10358 -79286 45949 44899 -61672 -13585 53514
228 53514 -12047 -40442 21240 26396 -22725 -17844 25490 16213 -29291 -8859 39580 -3856 -45045
241 -45045 25645 38663 -50825 -18888 64987 -15875 -63452 51311 39855 -75646 598 79964
253 79964 -42468 -57591 75021 18387 -85140 26005 69094 -62863 -36128 77747 -5779
264 -5779 -71229 41169 47260 -59771 -13363 62782 -15333 -48503 35935 27928 -44156 -7870
276 -7870 40790 -10241 -34641 19722 23804 -27130 -14417 31704 4704 -32864 9011 33590
288 33590 -21327 -25297 35730 11942 -43996 7644 42187 -30662 -31449 45952 7645 -53462 18154
301 18154 45379 -41468 -24271 55546 -2082 -52703 30363 38387 -47951 -13279 53219 -13518
313 -13518 -45225 33847 25819 -45360 -4033 43758 -16818 -33579 30524 17843 -35711 -978
325 -978 33966 -12656 -26064 22798 16130 -27674 -4773 28906 -6579 -26303 17018 20023 -25897
338 -25897 -9865 31405 -3328 -31557 17847 24767 -30768 -11803 37458 -6319 -36344 24176
350 24176 25435 -37224 -7115 42072 -12884 -34971 31058 20036 -40057 254 39002 -19433
362 -19433 -28579 31706 11368 -36210 5454 30662 -19716 -19945 26852 6805 -27296 5730 23576
375 23576 -13811 -15669 19851 8198 -21775 234 21645 -8878 -19392 16229 12778 -23687
387 -23687 -4040 26471 -8438 -24674 20909 16124 -29884 -1512 32757 -14493 -25905 28934
399 28934 12303 -35351 6048 32439 -22856 -20705 32640 3242 -33752 13129 25185 -25069
411 -25069 -11854 28513 -2499 -24832 13283 16595 -18420 -6998 19199 -234 -16593 5985
423 5985 14110 -9431 -11128 13210 7587 -17435 -2321 19874 -6792 -19910 16524 13432 -25480
436 -25480 -1692 28615 -13114 -23225 26920 10449 -32980 7793 30241 -23691 -17190 33179
448 33179 -921 -32262 17722 20939 -28821 -5333 28957 -10728 -21476 20156 9029 -21683
460 -21683 2847 17223 -9193 -9400 10835 4064 -8467 -1618 6912 2260 -7883 -2290 11402
473 11402 -1433 -15044 8883 13669 -18899 -6414 25172 -7455 -24263 22301 13741 -31901
485 -31901 4311 31908 -22380 -19645 34819 464 -34993 19716 23449 -32504 -4384 33315
497 33315 -14899 -23161 26258 5829 -27483 9566 18515 -18551 -5425 18354 -5023 -10625 9640
510 9640 2562 -6292 2460 626 -659 3289 -5617 -1490 10684 -6917 -10802 16154 2025 -21911
524 -21911 11516 17950 -24763 -4350 30515 -13825 -23710 30226 7246 -35368 14682 27942
536 27942 -31543 -9356 36740 -12851 -28789 28674 10065 -33512 9658 24700 -23471 -8423
548 -8423 25895 -7728 -17468 17402 4493 -16286 6978 8370 -10288 1631 5969 -6803 2512
561 2512 4023 -9133 4341 8154 -13908 422 16997 -13437 -11101 23363 -3102 -24274 19638
574 19638 14124 -29964 4527 29318 -22794 -15577 33613 -4809 -31024 23995 16141 -33690 4370
587 4370 29435 -22377 -14900 29339 -4330 -24349 18531 10257 -22461 5448 16159 -14571 -3253
600 -3253 15035 -7166 -6526 11351 -3577 -6835 9507 -3052 -8013 10697 -1533 -12494 11921
613 11921 4646 -18339 8164 15324 -19876 -2849 24672 -12723 -17541 25729 2414 -28166 15693
626 15693 19054 -28307 -1862 29238 -16920 -19143 27872 1098 -27958 15696 16794 -24836 -285
639 -285 23076 -13421 -11735 19537 -1629 -15208 11652 5057 -13093 5217 6754 -10058 2364
652 2364 6681 -9152 1457 8397 -10050 -1038 12644 -9499 -7262 16861 -3956 -15993 16229
665 16229 6917 -22085 7773 18936 -20405 -6521 25654 -9642 -20364 22484 6404 -26883
677 -26883 9893 20056 -22348 -6366 25070 -9261 -18192 19542 5230 -20672 7966 13979
689 13979 -14858 -2545 14443 -6455 -7240 9960 -1230 -6798 5969 -375 -5406 5721 -1061
702 -1061 -6656 7694 1142 -10964 7620 7744 -14376 1859 15849 -12182 -8937 19730 -2765
715 -2765 -19101 15085 10387 -22489 2752 20591 -15920 -11533 22189 -2320 -20417 14320 11201
728 11201 -19774 1540 17909 -11282 -9148 15830 -766 -13085 8174 6066 -10308 944
740 944 6925 -5156 -1878 4172 -2373 -573 2498 -3579 1090 4505 -5906 -854 8999 -5270 -6937
755 -6937 11623 655 -13504 8332 9851 -15290 -962 16897 -9396 -12153 16762 2036 -18597
768 -18597 8575 13146 -16371 -3540 17677 -6760 -12724 13640 4351 -14525 4607 10860 -9477
781 -9477 -3662 10269 -2298 -6887 5227 2193 -5081 749 2085 -1655 -32 -482 -509 2676 -1584
796 -1584 -3055 5273 1145 -7083 4035 6709 -8542 -1999 11263 -4608 -9647 10614 3507 -13978
810 -13978 4052 11599 -11551 -5497 14613 -2988 -12806 10400 6856 -13500 1492 12484 -7858
823 -7858 -6901 11147 423 -10074 4920 5912 -7458 -1471 6340 -2156 -3930 3082 1222 -2194
837 -2194 -206 838 908 -336 -2122 1717 2853 -3991 -1224 6209 -2069 -6156 6337 3433 -9257
852 -9257 1665 9200 -7380 -5736 10997 -597 -11411 6873 7416 -11514 -1120 11971 -5555
865 -5555 -8388 10419 2667 -10807 3960 8412 -7783 -3145 8779 -1869 -6754 4722 2724
878 2724 -5643 40 3727 -1950 -1882 1683 669 -359 -587 159 2331 -451 -2812 2993 2437 -5274
894 -5274 137 6111 -4329 -4941 7413 455 -9170 4464 6932 -9134 -2018 10936 -4028 -8615
908 -8615 9495 3749 -11233 2941 9535 -8101 -4623 10260 -1410 -8856 5959 4571 -7921
921 -7921 119 6571 -3668 -3469 4588 271 -3445 1457 1221 -1187 249 -315 147 1764 -1790 -1260
937 -1260 4163 -870 -4633 4318 2803 -7028 1156 7045 -6134 -4323 9096 -1371 -9314 6933
951 6933 5350 -10555 883 10504 -6893 -5973 10918 -25 -10158 6398 6299 -9652 -334 8956
965 8956 -5203 -5520 7350 109 -6863 3493 3242 -4873 494 3501 -2359 -214 2344 -1695 518
980 518 2139 -2884 283 3820 -3885 -2132 6054 -2361 -6059 6382 2039 -8836 3379 7271 -8362
995 -8362 -2132 10540 -4196 -7961 9691 2339 -11121 4761 8157 -9749 -2041 10631 -4720
1008 -4720 -7361 8896 1224 -9161 4535 5567 -7676 -263 6842 -4320 -3153 5832 -1315 -3997
1022 -3997 4240 249 -3892 3337 1086 -4160 2998 2144 -5203 2120 4372 -6116 -637 7120 -4841
1037 -4841 -4905 8351 -810 -8709 6631 4831 -10131 1984 9660 -7879 -4239 11310 -2487 -9408
1051 -9408 8613 3826 -11043 2903 8278 -8526 -2941 9355 -3580 -6632 7389 1274 -7215
1064 -7215 3944 3975 -5775 1172 4574 -4253 -477 4607 -3547 -1743 4917 -2876 -3445 5702 -1205
1079 -1205 -5905 5692 2228 -8043 3385 6681 -7996 -1396 9645 -4773 -6577 9591 639
1092 639 -10110 6090 6322 -10255 305 9818 -6797 -5443 9838 -1320 -8701 6721 3616
1105 3616 -8830 2366 6518 -6526 -1452 7029 -3444 -3687 6044 -989 -4602 4996 708 -5317
1119 -5317 3916 2355 -6139 2283 4608 -6473 -342 7013 -5178 -4198 8447 -1514 -7949 7154
1133 7154 3676 -9655 2942 8176 -8070 -2663 10107 -3852 -7468 8682 1485 -9784 4586
1146 4586 6102 -8729 -414 8281 -5292 -4351 7913 -1252 -6440 5882 2207 -6801 3043 4306
1160 4306 -5984 442 5345 -4651 -1823 5844 -3119 -3903 5976 -843 -5838 5276 2112 -7171 3183
1175 3183 5456 -7139 -399 8048 -4902 -4786 8554 -700 -8102 6154 4091 -8981 1761 7563
1189 7563 -6959 -3122 8581 -2863 -6655 6990 1727 -7802 3548 5046 -6615 -105 6420
1202 6420 -4081 -2933 6057 -1370 -4386 4701 735 -5111 3133 2433 -5286 1475 4037 -4938 -603
1217 -603 5477 -3669 -3071 6143 -1212 -5506 5455 2172 -6859 2902 5455 -6496 -892 7313 -3958
1232 -3958 -4718 7014 -202 -7147 4569 3629 -7194 942 6204 -5011 -2548 6645 -1739 -4863
1246 -4863 5310 1409 -5560 2788 3598 -4858 118 4344 -3447 -1931 4249 -1815 -3047 3772 -203
1261 -203 -3783 3170 1460 -4212 2050 3172 -4364 104 4752 -3477 -2431 5397 -1262 -4856 4539
1276 4539 1733 -6086 2158 4513 -5333 -1104 6018 -2910 -4026 5575 341 -5593 3402 3232 -5286
1291 -5286 453 4792 -3509 -2034 4802 -1211 -3527 3697 827 -3947 1938 2167 -3546 260 2911
1306 2911 -2652 -922 3076 -1669 -1798 3143 -589 -2570 3118 787 -3560 2162 2445 -3997 211
1321 211 3992 -3343 -2258 4601 -1147 -4418 3705 1754 -5152 1510 4212 -3985 -1272 5117 -1584
1336 -1584 -3506 4136 998 -4393 1914 2730 -3791 -304 3334 -2335 -1829 3097 -723 -2403 2399
1351 2399 461 -2422 1616 1280 -2457 886 1862 -2320 -48 2498 -1955 -1239 2983 -1048 -2534 3000
1367 3000 582 -3660 1980 2538 -3734 -166 3921 -2512 -2464 4025 -199 -3972 2767 2211 -4079 590
1383 590 3796 -2763 -1627 3919 -831 -3057 2694 994 -3359 1044 2074 -2613 -382 2267 -1634
1398 -1634 -1030 2216 -657 -1310 2123 -48 -1696 1894 650 -2297 1269 1548 -2821 58 2492 -2478
1414 -2478 -1435 3210 -1058 -2879 3005 1121 -3639 1588 3143 -3206 -643 3920 -1663 -2683 3413
1429 3413 377 -3695 1764 2142 -3423 -156 3020 -2029 -1560 2980 -433 -2318 2155 748 -2388
1444 -2388 1133 1447 -2183 239 1769 -1776 -433 2079 -1264 -1152 2421 -523 -2026 2353 634
1459 634 -2873 1502 1929 -3188 -104 3161 -2344 -1933 3542 -474 -3337 2793 1819 -3595 964 3324
1475 3324 -2738 -1186 3574 -1157 -2851 2688 499 -3376 1188 1836 -2736 -134 2456 -1625 -874
1490 -874 2581 -596 -1462 2320 274 -2093 1649 864 -2526 714 1569 -2509 -333 2398 -1854 -1421
1506 -1421 2890 -554 -2386 2656 1047 -3018 1543 2441 -3017 -244 3265 -2062 -2136 3265 -374 -3325
1522 -3325 2395 1528 -3457 795 2909 -2641 -879 3336 -1254 -2303 2723 203 -2817 1657 1367
1537 1367 -2678 642 2159 -2072 -384 2491 -1328 -1233 2573 -579 -2206 2174 459 -2937 1339
1552 1339 1717 -3027 119 2927 -2293 -1382 3465 -798 -2665 3113 1058 -3534 1725 2554 -3504 -349
1568 -349 3454 -2463 -2297 3425 -573 -3439 2634 1471 -3496 1195 2866 -2737 -468 3372 -1551
1583 -1551 -1842 3015 -277 -2774 2117 830 -3027 1048 1845 -2806 11 2681 -2027 -1154 3160 -921
1599 -921 -2308 3006 459 -3307 1994 1964 -3548 278 3311 -2736 -1675 3770 -1069 -3213 3260 1081
1615 1081 -3965 1629 2805 -3591 -447 3760 -2177 -2230 3580 -328 -3217 2473 1426 -3279 1197
1630 1197 2596 -2743 -254 3099 -1904 -1601 2959 -847 -2675 2456 502 -3255 1568 1931 -3165
1645 -3165 357 3103 -2414 -1098 3620 -1066 -2539 3309 503 -3677 1980 2175 -3776 -10 3411
1660 3411 -2770 -1900 3872 -850 -3273 3127 1380 -3714 1492 2960 -3126 -466 3477 -1860 -2031
1675 -2031 3083 -458 -2958 2232 924 -3046 1134 1930 -2740 69 2725 -2065 -1133 3026 -1051
1690 -1051 -2348 2840 348 -3173 1909 1810 -3306 471 3019 -2585 -1268 3492 -1163 -2725 3092
1705 3092 621 -3572 1742 2246 -3404 -32 3294 -2323 -1719 3365 -588 -2850 2633 1083 -3154
1720 -3154 1311 2294 -2688 -268 2760 -1793 -1554 2610 -706 -2312 2169 476 -2636 1461 1694 -2555
1736 -2555 486 2572 -2010 -822 2971 -1107 -2096 2721 163 -3022 1788 1576 -3183 329 2754
1751 2754 -2384 -1204 3203 -973 -2462 2833 699 -3061 1604 2076 -2888 -52 2852 -1949 -1457
1766 -1457 2776 -630 -2382 2195 664 -2626 1157 1659 -2377 1 2223 -1698 -992 2467 -787
1781 -787 -1868 2181 291 -2369 1481 1386 -2498 426 2273 -2011 -854 2634 -1010 -2050 2354 224
1797 224 -2711 1553 1512 -2711 375 2525 -2046 -1039 2867 -758 -2195 2333 659 -2644 1291 1704
1813 1704 -2509 -203 2284 -1659 -1257 2277 -564 -1902 1789 469 -2061 1154 1313 -1905 323
1828 323 1890 -1583 -675 2167 -900 -1557 1975 79 -2285 1304 1162 -2341 285 2052 -1741 -835
1844 -835 2339 -783 -1726 2093 365 -2206 1317 1425 -2260 140 2123 -1616 -1003 2237 -653 -1899
1860 -1899 1778 452 -2201 908 1363 -1892 -19 1873 -1282 -856 1923 -502 -1400 1641 380 -1721
1876 -1721 1075 1086 -1865 207 1644 -1514 -734 1889 -785 -1459 1726 166 -1870 1105 1187 -1879
1892 -1879 220 1838 -1419 -697 2009 -552 -1610 1667 399 -2073 917 1229 -1925 -147 1813
1907 1813 -1275 -1020 1804 -269 -1593 1398 615 -1775 693 1230 -1469 -90 1587 -986 -811 1530
1923 1530 -354 -1307 1269 296 -1604 711 933 -1437 67 1379 -1123 -556 1567 -508 -1142 1457
1939 1457 296 -1544 1006 1019 -1647 125 1565 -1258 -849 1697 -532 -1537 1321 537 -1738 507
1955 507 1302 -1438 -293 1617 -736 -856 1417 41 -1244 991 560 -1205 409 848 -1150 -104
1971 -104 1105 -865 -575 1188 -425 -1012 1066 167 -1263 829 777 -1350 227 1246 -989 -443 1394
1988 1394 -570 -1103 1260 197 -1508 794 908 -1542 -37 1414 -1033 -832 1530 -163 -1251 1113
2004 1113 560 -1343 458 1099 -1154 -271 1249 -593 -800 1084 -101 -1022 784 288 -1082 433
2020 433 700 -985 31 1028 -825 -381 1228 -446 -872 1206 64 -1227 804 738 -1359 186 1156
2037 1156 -1134 -559 1451 -511 -1180 1290 300 -1522 734 1014 -1361 -78 1442 -742 -743 1434 -59
2054 -59 -1124 1023 450 -1230 392 791 -1091 -150 981 -745 -615 1010 -281 -874 961 189 -989
2071 -989 738 690 -1125 274 1110 -955 -315 1364 -583 -1048 1260 68 -1472 841 805 -1483 161
2088 161 1469 -1055 -615 1598 -328 -1237 1275 485 -1442 609 1005 -1247 -169 1184 -843 -726
2104 -726 1189 -255 -1041 955 282 -1176 556 747 -1136 62 1102 -851 -429 1230 -367 -870
2120 -870 1190 117 -1269 826 718 -1330 225 1227 -1068 -471 1325 -509 -1091 1269 187 -1465
2136 -1465 760 936 -1406 106 1348 -896 -583 1439 -288 -1128 1149 276 -1327 514 769 -1257
2152 -1257 -80 1101 -922 -471 1172 -399 -836 1127 147 -1064 829 710 -1162 256 952 -1007
2168 -1007 -330 1171 -622 -918 1134 -58 -1244 831 661 -1277 292 1196 -1054 -362 1430 -471
2184 -471 -968 1229 231 -1336 697 779 -1349 103 1096 -1002 -509 1236 -449 -919 1091 100 -1198
2201 -1198 815 667 -1237 251 1051 -959 -349 1226 -573 -773 1155 -59 -1080 875 464 -1255
2217 -1255 422 965 -1161 -203 1293 -832 -821 1309 -140 -1311 1026 644 -1324 451 1210 -1099
2233 -1099 -311 1458 -553 -890 1173 -1 -1276 706 541 -1272 190 968 -1036 -236 1203 -502
2249 -502 -642 1233 -40 -1052 1027 498 -1162 454 964 -1129 -190 1181 -754 -752 1174 -254 -1117
2266 -1117 991 446 -1263 533 1018 -1148 -95 1344 -787 -791 1337 -83 -1290 936 544 -1332
2282 -1332 287 1036 -1109 -326 1238 -578 -746 1144 -78 -1029 845 433 -1132 363 894 -995
2298 -995 -135 1163 -669 -682 1210 -203 -1033 991 338 -1279 449 880 -1129 -176 1178 -818 -708
2315 -708 1226 -160 -1081 983 445 -1250 527 1042 -1162 -190 1238 -620 -770 1078 -55 -1155
2331 -1155 717 457 -1121 252 851 -978 -78 1092 -583 -577 1146 -163 -970 892 389 -1202 357
2348 357 827 -1087 -226 1077 -694 -662 1048 -193 -1015 797 437 -1073 463 920 -946 -144 1117
2365 1117 -619 -683 1033 -65 -1067 696 496 -1094 277 887 -918 -244 1021 -484 -662 935
2381 935 25 -920 669 401 -936 303 715 -896 -71 972 -603 -633 1016 -124 -1023 697 481
2398 481 -1024 217 745 -818 -289 905 -492 -658 871 2 -782 710 417 -861 297 788 -783
2415 -783 -159 848 -474 -621 893 -20 -909 586 386 -865 223 770 -687 -184 890 -302 -501
2432 -501 846 3 -714 656 278 -882 271 631 -816 -213 840 -494 -636 824 35 -824 566
2449 566 456 -784 153 718 -579 -165 750 -321 -470 718 -68 -724 509 329 -752 170 611 -613
2467 -613 -195 751 -314 -444 695 -19 -688 497 276 -737 207 578 -610 -211 730 -475 -430 727
2485 727 -132 -766 581 326 -932 222 699 -738 -222 880 -283 -562 687 83 -642 434 343 -671
2503 -671 173 498 -592 -154 631 -448 -436 632 -115 -699 512 277 -748 250 571 -598 -35 773
2521 773 -399 -451 764 -51 -744 551 263 -831 218 566 -791 -120 852 -458 -525 785 -1 -759
2539 -759 576 488 -831 141 735 -642 -220 747 -258 -505 599 -23 -638 426 239 -748 176 510
2557 510 -701 -121 752 -396 -455 790 -38 -706 541 394 -766 205 566 -675 -172 716 -428 -484
2575 -484 749 -70 -755 539 355 -883 221 700 -681 -149 834 -333 -534 736 16 -758 535
2592 535 408 -755 92 621 -575 -266 688 -313 -509 603 -38 -594 459 259 -702 232 562 -593
2610 -593 -92 700 -335 -419 700 -105 -661 530 251 -765 235 544 -665 -91 732 -424 -364 775
2628 775 -101 -643 660 267 -793 285 578 -652 -85 755 -476 -515 630 -66 -737 453 226 -692
2646 -692 169 558 -577 -121 636 -358 -359 675 -15 -549 489 204 -663 283 477 -660 -78 605 -420
2665 -420 -365 666 -176 -584 563 151 -670 391 524 -642 48 707 -500 -312 763 -219 -618 602
2683 602 212 -781 317 491 -709 -78 659 -494 -424 730 -107 -572 529 245 -667 280 505 -597
2701 -597 -5 626 -479 -276 686 -206 -585 537 74 -714 359 387 -670 59 688 -456 -231 722 -181
2720 -181 -520 695 57 -725 484 476 -783 35 670 -580 -373 754 -302 -680 569 121 -818 308
2738 308 455 -664 75 667 -458 -305 708 -155 -490 523 108 -645 327 337 -669 49 509 -489 -217
2757 -217 719 -294 -473 643 93 -670 441 427 -690 119 645 -523 -242 755 -246 -585 633 85
2775 85 -768 366 449 -754 -44 596 -544 -317 733 -132 -592 624 201 -648 388 468 -632 65 553
2794 553 -483 -237 620 -270 -491 525 16 -671 393 245 -677 143 571 -579 -167 740 -290 -497
2812 -497 595 102 -713 430 427 -703 87 626 -535 -314 691 -203 -577 582 96 -658 301 370 -577
2831 -577 79 599 -386 -269 626 -208 -429 493 98 -583 271 353 -550 96 491 -502 -245 569 -251 -420
2851 -420 540 12 -567 455 341 -656 156 572 -537 -225 700 -239 -543 520 79 -647 294 412 -650
2870 -650 -13 566 -446 -219 603 -152 -488 501 145 -507 306 376 -540 26 511 -380 -261 442 -149 -394
2890 -394 369 79 -472 356 287 -491 57 506 -406 -125 572 -238 -355 527 61 -555 370 355 -599 16 522
2911 522 -462 -267 595 -156 -470 458 143 -538 223 354 -478 40 434 -314 -144 608 -144 -383 448 85
2931 85 -588 245 307 -535 76 428 -321 -265 510 -130 -329 422 45 -408 333 231 -453 149 482 -415 -172
2952 -172 491 -205 -377 500 42 -518 344 320 -575 57 494 -373 -158 555 -129 -383 403 114 -438 271
2972 271 280 -504 47 443 -385 -265 514 -204 -410 453 88 -476 290 369 -462 39 404 -299 -114 454 -137
2993 -137 -370 445 43 -558 327 307 -553 64 505 -447 -230 545 -195 -342 511 117 -528 299 390 -464 6
3014 6 552 -284 -280 504 -121 -451 369 133 -501 161 325 -464 -44 449 -244 -267 464 -51 -357 351 176 -441
3036 -441 239 217 -418 55 413 -337 -194 473 -224 -350 464 30 -556 270 371 -502 77 521 -365 -261
3056 -261 560 -115 -499 351 173 -477 209 330 -485 -78 455 -283 -284 418 -105 -409 381 100 -381 120 277
3077 277 -336 -32 444 -267 -184 418 -75 -281 387 -24 -407 222 160 -475 74 425 -379 -191 520 -181 -384
3098 -384 539 127 -516 288 345 -411 -12 457 -265 -270 404 -78 -349 266 152 -386 210 249 -399 -3 365
3119 365 -249 -175 379 -106 -258 373 53 -382 216 214 -355 63 335 -251 -104 377 -195 -262 428 -27 -414
3140 -414 334 248 -488 100 424 -383 -135 486 -126 -349 335 109 -384 168 298 -351 -96 264 -264 -143
3160 -143 325 -167 -245 295 66 -352 229 251 -327 98 382 -265 -88 356 -166 -231 351 -13 -381 194 129
3181 129 -457 141 257 -348 -73 431 -238 -280 490 27 -463 271 204 -391 57 390 -298 -181 353 -142 -313
3202 -313 341 -30 -337 130 182 -319 93 277 -271 -41 376 -129 -293 383 -29 -310 279 113 -377 55
3222 55 282 -337 -86 385 -296 -227 374 -101 -361 333 84 -465 174 337 -403 -133 424 -206 -295 400 -10
3243 -10 -453 230 198 -422 21 320 -307 -110 248 -101 -252 302 87 -284 247 134 -315 145 278 -313 -24
3264 -24 339 -243 -206 390 -26 -398 265 92 -363 145 278 -290 7 321 -254 -178 407 -20 -392 267 109
3285 109 -439 65 353 -416 -165 399 -173 -309 374 88 -377 164 214 -303 0 285 -212 -39 324 -108
3305 -108 -150 300 -56 -256 214 41 -361 137 235 -275 -7 345 -226 -175 385 -82 -285 291 57 -323 160
3326 160 259 -336 -52 427 -210 -251 403 -21 -436 284 193 -411 32 351 -241 -68 385 -116 -168 328 74
3347 74 -278 180 132 -279 42 169 -222 -2 224 -145 -187 217 -83 -240 196 55 -326 176 178 -291 38 312
3369 312 -225 -113 410 -75 -292 324 37 -402 195 252 -372 -67 392 -193 -293 334 9 -342 237 146 -283
3390 -283 107 307 -240 -57 292 -136 -187 289 -108 -251 196 31 -272 107 172 -289 34 240 -222 -163 305
3411 305 -113 -270 294 59 -346 157 236 -313 32 340 -269 -212 388 -111 -366 316 75 -391 75 282 -278
3432 -278 -27 355 -115 -218 263 32 -249 241 111 -229 67 151 -284 32 217 -212 -81 303 -112 -258
3452 -258 197 41 -323 165 193 -310 22 289 -180 -119 350 -90 -308 273 14 -417 198 277 -331 10 323
3473 323 -224 -174 361 -59 -331 237 167 -356 123 255 -273 -63 320 -120 -219 274 -55 -307 224 162 -267
3494 -267 125 224 -282 -14 230 -213 -169 287 -35 -265 253 184 -291 161 215 -330 7 309 -193 -145 363 -80
3516 -80 -253 250 89 -388 120 273 -265 -39 291 -206 -174 325 -10 -268 198 184 -313 80 187 -275 -91
3537 -91 292 -145 -198 258 -19 -216 161 109 -245 106 153 -237 18 224 -170 -119 220 -96 -211 199 76 -315
3559 -315 132 134 -213 -23 241 -165 -92 318 -126 -214 250 92 -320 107 205 -316 8 277 -146 -234 267 7
3581 7 -289 139 143 -259 73 200 -230 -40 187 -63 -72 205 -35 -154 191 81 -142 155 87 -215 6 234
3603 234 -226 -63 219 -121 -215 272 -13 -308 164 165 -295 -12 296 -210 -140 290 -51 -320 194 82 -294
3624 -294 21 199 -276 -53 238 -122 -133 296 16 -210 151 150 -218 56 210 -166 33 152 -158 -66 240
3645 240 -92 -190 152 6 -255 166 118 -321 80 257 -222 -93 299 -136 -284 299 87 -292 114 232 -186
3666 -186 -27 259 -131 -181 227 2 -231 155 118 -237 8 199 -172 -36 200 -169 -110 220 -50 -176 168
3687 168 91 -199 82 151 -202 -33 239 -241 -118 205 -107 -160 242 116 -289 131 202 -234 38 333 -153
3708 -153 -152 309 10 -293 200 103 -326 73 160 -209 -114 179 -58 -97 239 -13 -189 152 29 -214 47 102
3730 102 -189 -12 192 -153 -143 149 -43 -205 171 31 -228 108 140 -225 35 186 -197 -112 258 -38 -236
3751 -236 206 10 -281 164 206 -286 -11 266 -141 -217 176 -32 -261 91 98 -218 49 147 -171 -17 184 -70
3773 -70 -92 184 -29 -171 152 82 -202 66 132 -244 -5 158 -165 -116 274 -72 -149 174 85 -212 173 168 -205
3796 -205 -4 235 -186 -129 229 -47 -246 200 62 -260 49 135 -154 -27 192 -97 -86 181 -75 -197 73
3817 73 49 -167 98 118 -199 20 182 -157 -63 166 -89 -158 230 6 -244 93 134 -186 76 167 -184 -70
3839 -70 266 -43 -102 177 57 -226 125 164 -219 30 173 -176 -181 188 -14 -197 177 9 -207 105 112 -183
3861 -183 28 180 -71 -89 166 -34 -98 96 7 -239 133 112 -209 71 137 -161 -33 204 -74 -68 248 73
3883 73 -230 149 136 -211 69 167 -209 -52 225 -110 -166 170 31 -222 72 88 -239 30 178 -141 -99 152
3905 152 -27 -112 142 25 -167 121 69 -184 27 157 -196 -52 167 -88 -107 194 -50 -184 154 93 -252
3926 -252 73 175 -140 -14 249 -81 -161 198 28 -241 115 184 -263 45 182 -150 -89 213 -50 -171 132
3947 132 -13 -212 92 61 -159 -6 84 -163 -8 158 -89 -103 198 18 -167 185 62 -214 47 149 -160
3968 -160 -8 164 -86 -140 233 -5 -176 153 99 -201 34 174 -173 -108 214 -53 -186 106 16 -193 89
3989 89 92 -139 70 174 -116 -86 242 -28 -162 113 19 -135 90 101 -124 21 92 -220 -77 221 -43 -89 140
4012 140 18 -164 135 145 -166 30 106 -122 -34 236 -116 -79 143 -31 -150 84 61 -147 5 137 -140 -36
4034 -36 206 -46 -147 169 -15 -150 103 100 -156 40 152 -131 -83 148 -43 -142 213 -13 -207 71 86 -178
4056 -178 113 150 -98 -16 121 -83 -80 192 38 -104 88 62 -182 67 126 -135 -57 138 -101 -117 178 -45 -190
4079 -190 72 53 -179 53 154 -131 -73 150 -29 -130 166 -55 -157 128 101 -167 49 94 -139 9 99 -101
4101 -101 -86 149 -66 -120 101 33 -177 87 97 -116 -29 111 -93 -157 132 -6 -196 125 49 -221 62 112 -147
4124 -147 -17 178 -120 -65 199 -17 -168 135 53 -145 57 166 -169 -67 166 -54 -128 74 33 -166 166
4145 166 32 -123 57 97 -58 2 128 -104 -49 174 30 -170 121 107 -199 57 98 -184 -45 154 -123 -127
4167 -127 182 -30 -138 136 101 -124 16 130 -95 -81 210 -71 -167 105 80 -156 91 133 -227 12 121 -86
4189 -86 -59 154 -26 -111 77 -27 -113 114 115 -107 106 108 -128 -50 116 -71 -79 163 -28 -174 164 84 -209 49
4213 49 170 -95 -37 182 -54 -98 200 -30 -153 85 81 -159 -28 172 -124 -46 123 -43 -109 96 -1 -121 63
4236 63 96 -106 61 94 -110 -76 153 -46 -83 77 -51 -147 128 27 -140 27 136 -87 -65 168 -120 -91 160
4259 160 -71 -125 107 139 -165 41 136 -130 -14 196 -66 -132 122 -5 -169 76 115 -228 -47 136 -77 -77
4281 -77 127 9 -81 109 -31 -92 106 50 -133 49 103 -126 -17 140 -87 -95 94 -16 -148 84 15 -187 87
4304 87 115 -115 -2 165 -129 -60 178 -8 -150 137 51 -213 -8 69 -137 -74 174 -45 -100 109 41 -189 125
4327 125 99 -128 25 125 -62 -6 99 -57 -88 150 -29 -105 93 69 -145 79 47 -182 -37 150 -86 -48
4349 -48 164 14 -119 122 55 -156 107 93 -186 -22 150 -140 -109 80 -56 -169 124 -11 -157 16 130
4370 130 -166 -36 145 -10 -92 160 65 -175 109 35 -130 -2 58 -154 -40 115 -44 -90 134 -58 -100 120
4392 120 26 -161 10 44 -187 4 154 -110 -82 173 -70 -152 76 101 -164 73 138 -138 -31 123 -56 -93
4414 -93 89 -11 -154 161 32 -94 27 153 -99 -42 154 -75 -25 84 -18 -93 48 51 -138 67 44 -115
4436 -115 38 70 -117 -39 135 -65 -115 165 -2 -155 52 91 -153 -19 152 -137 -154 119 -4 -72 77 25
4458 25 -148 43 90 -84 -4 104 -30 -65 144 -2 -75 121 -33 -101 37 46 -138 -24 75 -70 -80 115 -72
4481 -72 -77 97 -19 -106 79 109 -144 32 123 -82 -33 109 -39 -111 76 -2 -78 82 86 -107 -10 118 -78 -54 138
4506 138 10 -35 118 30 -137 83 79 -111 -4 78 -44 -80 74 -90 -67 104 20 -164 66 59 -119 38 103 -83
4530 -83 -52 97 -26 -126 96 10 -113 107 17 -145 22 103 -119 23 147 -16 -71 146 47 -84 98 98 -97
4553 -97 72 91 -80 -54 88 -85 -85 35 32 -162 48 72 -133 53 53 -128 -14 117 -64 -126 109 -21 -99 112
4577 112 93 -48 21 117 -72 -43 109 -82 -142 109 57 -80 79 55 -84 23 97 -112 -12 146 -6 -9 111
4600 111 -16 -139 70 9 -130 -7 68 -65 9 93 -49 -75 81 13 -151 69 3 -105 13 103 -81 -102 137
4623 137 -3 -56 99 1 -161 39 111 -89 26 92 -5 20 136 -23 -46 107 39 -69 34 80 -97 42 68
4646 68 -30 -23 91 -30 -87 58 36 -148 41 39 -95 -6 101 -107 -75 126 -49 -77 103 9 -78 80 -10 -108 9
4671 9 150 -68 -31 69 -32 -61 89 31 -83 37 109 -47 1 111 -47 -87 93 -30 -75 68 10 -130 103
4694 103 -10 -104 8 78 -138 -35 141 -38 -67 101 53 -133 87 69 -111 5 74 -50 -30 98 2 -20 115
4717 115 10 -109 67 84 -147 -39 39 -87 -39 63 -47 -83 42 54 -71 35 84 -86 35 80 -106 -29 102
4740 102 -49 -80 88 -23 -69 -5 58 -124 6 124 -138 -1 103 -19 -81 79 21 -137 17 62 -92 -58 131
4763 131 -53 -85 166 -32 -122 135 28 -68 82 118 -84 41 96 -83 6 136 -82 -16 52 -20 -87 53 16 -145
4787 -145 57 106 -127 -32 96 -88 -105 72 61 -142 47 64 -88 40 102 -92 -28 105 -75 -130 123 16 -117
4810 -117 25 87 -81 -16 67 -73 -48 131 -23 -64 77 -26 -52 35 30 -125 -8 80 -28 -14 103 -49 -86 70
4834 70 -69 -109 122 59 -110 6 158 -124 -28 111 -41 -42 155 27 -136 13 65 -141 24 72 -56 -85 110
4857 110 -50 -110 91 0 -108 23 43 -89 54 63 -41 -95 156 -55 -113 82 -3 -80 39 32 -76 38 78 -123
4881 -123 -24 164 -104 -53 110 -10 -72 85 63 -115 -6 113 -113 -39 75 -43 -92 47 -14 -82 42 61 -144
4904 -144 14 85 -23 -14 117 -18 -60 102 -41 -53 124 53 -91 -17 76 -31 -29 109 -56 -96 113 12 -70 58
4928 58 19 -117 50 159 -67 12 116 -25 -22 116 17 -111 25 49 -121 24 55 -79 -66 125 -32 -121 89
4951 89 20 -97 58 48 -67 15 115 -18 -9 70 -73 28 101 12 -130 71 12 -100 34 -6 -68 -26 79 -64
4975 -64 -48 104 -3 -28 151 88 -151 -13 73 -56 -60 96 -72 -118 85 -77 -141 57 66 -102 52 47 -13 3 87
5000 87 -9 -34 80 53 -64 123 7 -43 -13 26 -63 -6 55 -36 -51 88 -1 -45 91 -16 -96 28 51 -126 24
5025 24 103 -19 -58 116 24 -127 34 41 -110 38 78 -118 -36 85 -71 -40 61 12 -71 26 53 -52 12 132 -103
5050 -103 -14 56 -66 21 101 -8 -61 59 33 -55 29 115 -71 -28 119 -77 -38 141 -11 -50 23 83 -127 4 100
5075 100 -48 -32 61 -24 -118 42 -48 -48 81 46 -65 72 79 -66 -33 131 17 -35 89 4 -74 31 50 -90 -23
5100 -23 85 -78 7 78 -52 -45 118 -45 -99 72 24 -70 24 74 -91 -56 25 -28 -23 63 -46 -72 34 46 -91 -18
5126 -18 64 -72 -15 59 -56 -33 101 -2 -37 78 84 -101 -6 110 -38 -49 35 -81 -92 19 23 -36 30 7 -123 70
5152 70 92 -27 -30 72 -30 -38 68 -1 -132 88 40 -64 1 39 -91 3 122 -44 -35 90 14 -76 37 31 -70 -30
5178 -30 3 -16 11 103 -60 -37 63 30 -80 -1 21 -91 11 51 -36 -5 17 -82 -30 51 -53 -48 45 29 -113 76 69
5205 69 -84 -18 149 -90 -63 115 -12 -84 39 51 -92 24 78 -41 66 104 -75 -32 78 -14 48 69 -19 -86
5229 -86 37 63 -22 -21 79 -39 -88 144 -31 -66 59 64 -94 5 48 -38 -29 76 -32 -71 82 -30 -80 62 40 -88
5255 -88 -6 40 -61 -48 90 -60 -64 107 37 -93 86 116 -60 49 36 -60 22 68 -65 -48 97 -33 -37 63 19
5280 19 -105 -53 72 -66 -51 104 -53 -5 81 15 -92 67 35 -74 2 44 -69 -1 85 -84 -75 112 -15 -46 74
5305 74 47 -129 -11 105 -59 12 32 -28 -56 63 -2 -55 71 11 -114 14 44 -96 8 62 -10 -45 72 10 -146
5330 -146 39 81 -112 19 83 -94 -33 75 13 -48 93 -28 -87 43 -45 -113 -1 52 -99 19 65 8 -38 126
5354 126 39 -118 52 83 -96 -18 74 -43 -20 105 -63 -68 70 45 -63 31 60 -101 11 121 -101 -3 84 -67
5378 -67 -34 159 52 -102 89 23 -62 11 70 -33 -76 115 -3 -2 100 -45 -67 75 14 -117 -9 100 -135 35
5402 35 150 3 -96 80 -12 -91 34 24 -86 -11 52 -70 -55 104 -45 -28 138 -5 -88 75 35 -93 66 108
5426 108 -62 -40 74 -38 -12 81 -24 -102 58 18 -61 18 93 -81 11 81 -89 -7 166 -5 -81 81 42 -111
5450 -111 49 88 -98 -11 131 -70 -63 76 1 -91 34 20 -29 112 89 -16 -76 97 -72 -38 74 8 -80 70
5474 70 35 -71 5 88 -49 -2 48 -51 3 65 19 -70 53 21 -67 78 90 -119 -22 106 -23 -52 156 -19 -61 36
5500 36 33 -30 0 41 -64 2 56 7 -16 116 -5 -69 54 45 -54 -34 80 -77 2 55 -64 -91 37 -24 -134 49
5526 49 -9 -25 -4 74 -65 16 -24 -43 45 102 -25 -52 76 40 -94 15 71 -96 10 118 7 -77 112 24 -49
5551 -49 56 94 -92 15 125 -37 -41 66 -22 -66 45 -8 -113 62 -2 -104 23 45 -119 7 57 -29 -31 5 -40
5576 -40 -42 68 28 -21 36 75 -37 25 67 -73 -22 93 -37 -75 64 -6 -92 -10 101 -26 -33 74 -19 -37 67 4
5602 4 -64 46 18 -51 -22 25 -90 -12 119 20 -76 55 -57 -47 36 -4 -71 -19 63 -17 27 42 -10 -53 96 3 -43 63
5630 63 -5 -93 32 39 -55 -15 65 -63 -5 163 -8 -87 28 3 -70 -32 64 -65 -117 66 -20 -6 -34 -38 -70 27 -2 -70
5658 -70 -13 -6 -33 -44 27 -32 -36 38 8 -38 50 6 -6 6 11 -36 48 97 -51 -25 92 27 -9 104 36 -106 49 35 -123
5687 -123 -10 78 -78 16 97 14 -85 63 41 -96 -32 -20 -36 -16 41 -58 -99 106 16 -32 3 -12 -71 79 3 -52 -13
5714 -13 63 -83 4 54 -36 -53 86 14 -20 19 66 -118 -13 95 -127 -32 67 -58 -57 80 37 -149 64 88 -64
5739 -64 -2 61 -23 -116 63 24 -102 -35 9 -100 -5 37 -79 12 35 -12 51 78 29 -37 37 -9 -67 33 30 -83 11 37
5767 37 -99 -50 71 -44 -95 46 38 -97 31 61 -93 5 102 -38 -101 130 -16 -115 115 70 -105 -30 82 -9
5791 -9 -31 98 -72 -44 13 3 -34 52 70 -35 86 11 -27 8 108 -15 -27 59 -9 -75 68 46 -107 22 19 -114
5817 -114 17 94 -50 -24 24 -51 -43 67 42 -105 50 126 -70 26 81 -76 -69 115 18 -91 30 50 -93 16 29
5842 29 -68 8 44 -25 -49 62 13 -75 51 -15 -57 46 -26 -79 6 87 -79 -53 44 -25 -43 14 6 -56 44 30 -41 -50 114
5871 114 -27 -9 75 -43 -90 51 11 -117 -24 78 -61 10 164 -46 -78 101 31 -47 57 38 -47 37 107 -62
5895 -62 -40 21 -41 -30 44 -45 -89 100 -15 -99 66 5 -82 -7 90 -68 -18 119 -5 -47 69 43 -124 27 107 -55
5921 -55 -21 93 -30 -45 63 -52 -117 47 -10 -76 32 21 -104 -12 128 -2 -37 69 -40 -71 62 5 -59 -17
5945 -17 20 -83 -18 55 -49 -22 36 -18 -43 100 -41 -18 22 72 -106 -31 119 -41 -27 113 -13 -64 26 29 -37 11
5971 11 81 -117 -32 115 -22 -22 27 2 -66 79 37 -88 40 50 -52 -6 46 -45 -15 11 -26 -95 73 -19 -71 41
5997 41 30 -80 -1 54 -32 -37 84 45 -67 97 -16 -48 45 92 -45 -43 33 -46 -15 84 7 -84 78 3 -49 83 35
6024 35 -79 19 89 -44 -32 34 -16 -85 26 -3 -79 26 93 -61 1 48 -42 2 63 17 -70 39 -14 -7 -14 8 3 39 85
6053 85 -37 -41 98 -10 -38 126 -17 -87 45 83 -30 18 41 -58 -36 137 23 -30 55 -42 -27 79 28 -69 9 65
6079 65 -31 -40 70 -57 -47 34 66 -42 -3 50 -28 32 81 -46 -20 72 24 -10 101 78 -76 -1 47 -75 26 43 -60
6106 -60 -52 71 -8 -31 12 6 -12 21 9 -72 -16 59 5 -14 50 -61 -44 18 35 -37 48 45 -62 9 70 -83 -6 53 -21 -43
6136 -43 75 2 -1 5 30 -79 46 61 -74 6 45 -21 -71 48 -48 -46 -8 38 -50 -47 84 -50 7 131 -12 -34 44 6
6164 6 -23 70 64 -46 15 51 -89 -59 83 -14 -94 81 29 -67 33 54 -33 12 77 -10 -10 50 18 -75 -11 -12 -74 -5 22 -103
6194 -103 6 31 -35 -60 103 -55 2 71 21 -10 7 92 -24 -21 72 -38 -54 41 -4 -82 40 89 -53 63 52 -44
6220 -44 -29 29 -69 -73 50 18 -92 43 3 -28 79 17 -32 -67 3 -74 6 70 -72 -44 20 33 -46 34 27 -36 24 49 -22
6249 -22 -96 76 -9 -82 84 55 -18 34 49 8 -14 62 -96 11 112 -28 -81 49 32 -78 51 87 -37 34 78
6274 78 6 -54 86 -26 -79 19 20 -36 -19 37 -96 17 88 -78 -22 71 -43 -27 64 53 -91 65 77 -91 0 113
6300 113 -15 -45 88 -6 -10 80 -12 -57 62 24 -44 -25 123 -94 6 97 -71 -48 60 -30 -73 22 11 -31 3 77
6326 77 -64 -6 41 -35 -59 70 -20 -51 20 31 -35 10 84 -105 -10 85 -64 -67 9 4 -90 21 69 -76 80 26 -48 -34
6354 -34 99 -21 -52 111 -1 -81 59 49 -60 37 61 -19 -47 60 -43 -24 105 -37 -72 -7 70 -74 -12 22 -78
6379 -78 5 77 -24 -57 114 34 -65 48 60 -34 45 132 -53 -27 108 -54 -48 58 -16 -110 92 57 -41 13 35 -69
6405 -69 -54 108 11 -68 28 7 -59 42 28 -94 6 83 -60 -66 107 -75 -30 114 8 -62 55 5 -21 10 105 -32
6431 -32 -99 73 -12 -24 95 7 -92 70 65 -118 4 72 -36 -34 120 -18 -86 63 -28 -87 57 69 -78 11 53 -35
6457 -35 23 66 -22 -51 71 16 -33 65 13 -81 31 100 -74 1 146 5 -49 94 3 -37 46 39 -94 -12 59 -69 11
6484 11 82 -28 -42 105 1 -96 34 3 -48 10 34 -16 -23 101 -5 -30 64 57 -81 19 45 -75 -18 83 -55 -2
6510 -2 85 22 -26 27 45 -75 18 73 -56 39 36 -92 -21 16 -46 -91 56 3 -59 6 31 -83 15 100 -45 -8 48 -22
6538 -22 -68 106 72 -50 79 7 -3 8 72 -29 5 60 -19 -85 44 10 -62 23 31 -32 8 72 -46 -33 45 -66 -64 37
6566 37 16 -56 28 11 -58 -35 34 -67 -11 23 -61 -59 46 48 -82 72 80 -75 40 85 -56 -27 -10 1 27 97 50 -33
6594 -33 12 38 -89 -6 37 -15 0 32 -44 -3 -22 29 -40 75 28 -69 -28 39 -86 -8 21 -71 -75 45 -7 -66 -12 28 -32
6623 -32 -4 55 -37 25 9 -2 -39 20 54 -27 34 36 -57 -26 54 -64 -47 27 -31 -71 19 -2 -66 -2 24 -99 -17 51 -33 -13
6653 -13 46 -47 -73 90 12 -40 37 -9 -75 28 -5 -71 -3 93 -17 -15 52 19 -18 34 43 -77 25 37 -46 -39 78 -30
6681 -30 5 39 15 -45 -11 40 -84 25 13 -16 -23 67 -65 -51 12 -14 -2 40 30 -85 -12 81 -61 -51 89 -49 -17
6708 -17 47 10 -118 17 52 -43 -11 79 -34 -17 72 -27 9 35 3 -48 80 -27 -98 -23 66 -76 -12 83 -24 -96 -8
6735 -8 36 -86 12 10 -3 10 -32 -59 22 37 -57 -69 16 44 -51 14 43 -81 -26 52 -83 -19 93 -35 -28 25 7 -53 40
6764 40 65 -24 30 72 -6 -25 55 26 -118 33 0 -95 -27 15 -125 16 6 -63 -51 58 -44 -61 42 -32 -51 42 76
6791 76 -78 53 80 -9 -2 97 -80 -60 34 8 -105 48 28 -32 58 61 -27 -34 53 -36 -99 21 23 -60 40 32 -75 32
6819 32 72 11 19 67 -45 -69 54 -25 -63 44 28 -40 33 94 -42 -63 80 -72 -40 40 -1 -70 31 -9 -1 40 -6 -28
6847 -28 16 97 0 -30 75 0 -49 70 48 -89 53 22 -67 -43 20 -76 -78 60 -31 -61 64 30 -93 -2 23 -64 18
6874 18 77 -35 -16 48 1 -80 60 29 -97 11 40 -67 -14 65 -38 -25 70 -45 -65 54 28 -84 36 23 -88
6899 -88 11 71 -46 -62 56 -13 -108 32 15 -82 7 64 -58 -53 59 -27 -37 9 -15 -99 95 5 -83 12 69 -42 -34 70
6927 70 -44 -59 116 -13 -46 3 -3 -67 58 61 -131 -21 63 -48 -39 57 -13 -106 28 7 -98 11 4 -61 -1 16 -48
6954 -48 -27 100 -2 -56 23 2 -33 4 47 -38 19 33 -67 10 53 -1 -37 110 26 -51 9 63 -53 -19 70 -9 -5 47
6982 47 -4 -31 56 -29 -119 20 63 -66 18 53 -35 -55 52 -20 -18 42 27 -62 26 36 -66 20 59 -34 -5 36 -1 60 79
7011 79 -11 -51 -19 88 -33 66 64 -57 -52 48 1 -52 30 5 5 -23 -12 -17 0 59 -39 -17 15 -52 -1 22 -9 -104 33 61
7041 61 -50 -34 39 -51 -46 69 -23 -53 105 44 -85 94 34 -43 -13 64 -30 13 64 -30 -47 56 -17 -67 2 35 -89
7068 -89 -44 8 -46 -30 13 -21 -116 18 23 -38 39 12 -30 -68 89 -44 3 62 -30 -68 66 3 -71 -15 20 -58 -20 37 -41
7097 -41 -51 96 -2 30 60 37 -68 14 31 -48 -42 69 -39 -67 28 -44 -28 15 19 -81 40 -3 -65 47 34 0 -9 53
7125 53 37 -41 -5 25 -6 54 57 -9 39 40 -16 33 49 5 -28 57 45 -69 44 53 -69 -35 45 -21 -34 93 22 -52 -3 45
7155 45 -47 -17 28 -30 41 42 -39 -44 44 -51 -2 24 0 -90 31 51 -25 49 64 24 -22 39 -1 -70 -4 -47 -54 9 83 -91 -69
7186 -69 80 -57 -1 43 -71 -19 85 21 -38 38 16 -55 -51 -53 -73 -33 -16 -61 -18 6 12 -21 -5 9 -33 -18 39 -12 -52 40
7216 40 6 -40 48 73 -41 11 15 -23 4 43 -35 -1 83 -11 -6 12 10 -81 16 37 -37 -1 3 -71 -34 31 -44 -24 50 -23 -9 -9
7248 -9 49 -87 10 47 -47 -20 76 3 20 8 -1 6 28 12 -55 24 5 -51 -59 48 -66 -14 29 -2 -59 1 32 -65 27 29 -23
7279 -23 -54 30 -29 -51 0 14 -74 7 42 -120 -80 29 -36 -51 47 28 -39 46 -28 -78 -27 58 -39 3 40 26 2 20 27 -29
7309 -29 34 14 -30 -42 54 -42 -17 41 -54 -8 24 -20 -34 84 32 -72 -33 13 -32 10 15 -64 11 75 -41 -69 38 23 -29
7338 -29 13 13 -30 -17 20 16 26 145 18 -64 43 2 -27 36 19 -23 45 39 -52 34 95 -62 -59 75 43 -90 0 8 -49 7
7368 7 40 -14 -25 29 -6 -49 32 -1 -51 83 12 -28 26 36 -19 -28 8 55 -7 96 -36 -52 40 18 22 26 69 -4 -70 44
7398 44 -40 -12 22 -17 -98 -32 33 -23 4 23 -51 -41 43 -31 -45 58 21 -86 16 19 -53 -29 52 -19 6 55 2 -50 58
7427 58 -4 -49 38 45 10 38 54 -24 31 65 -48 -71 39 -15 -73 4 -18 -48 -11 77 -51 8 63 -12 -7 25 16 -24 37 48
7457 48 -65 40 79 -16 26 73 -38 -33 63 6 -64 17 22 -58 18 63 -27 -30 87 -25 -22 82 5 -55 35 50 -31 -36 21 -16
7487 -16 -16 -8 -74 -46 34 65 -50 -4 30 -66 6 46 -28 -3 -31 -21 -23 40 41 -58 53 1 -46 7 8 -32 -40 -19 -94 -3 101 -2
7519 -2 -6 15 19 -91 -21 62 -41 -6 50 -7 -56 13 9 4 9 -24 -107 -4 45 -18 -23 88 -30 -35 27 17 -21 10 55 -66 41
7550 41 97 5 12 99 10 -13 86 24 -54 37 3 -23 -15 38 2 16 34 0 -21 81 7 -12 51 38 -38 14 14 -40 2 72 -62
7581 -62 -26 46 5 -26 5 70 -89 20 45 -31 21 105 53 -25 70 34 -70 -1 42 -46 2 56 -75 21 29 -34 -29 -2 34
7610 34 -52 5 12 -57 -43 20 -39 -29 46 -21 -28 20 -45 -21 42 -27 -51 -14 13 -40 9 106 17 -3 12 7 -55 46 45 -31 8 75
7642 75 -49 -50 -17 -15 -27 46 26 -79 -6 -15 -108 21 34 -86 -21 -24 -50 -7 20 37 -22 15 54 -36 17 59 -9 -60 42 -32
7672 -32 -35 84 -10 8 64 10 -46 36 39 -38 17 34 -23 -40 34 10 -50 1 44 -55 -46 -28 -101 -14 -7 -31 -26 39 59 -6 19 39
7704 39 -21 21 66 -21 -10 -5 -15 -19 58 -32 -42 63 5 -53 2 8 -36 12 130 -28 -29 117 5 -19 54 9 -93 58 31
7733 31 -2 -25 57 16 -37 58 21 -75 -4 15 -70 -5 7 -46 25 48 20 -25 21 15 -55 -5 40 -71 26 62 -21 -28 7 -23 -24
7764 -24 2 23 -23 41 3 -38 -6 27 -44 -60 83 -27 -41 24 -20 -29 26 17 -63 24 25 -24 -10 16 43 -26 -33 33 -53 26 -12
7795 -12 -53 9 -41 -19 3 63 -57 -55 8 58 -57 27 64 -40 25 71 -13 19 79 -22 -14 59 -26 -30 19 -45 -54 -9 53 -42
7825 -42 -16 41 -24 -14 29 2 -89 85 4 31 8 15 -6 -58 1 -46 -14 7 24 -67 -12 11 -23 -29 14 21 -17 27 -36 -11 17
7856 17 -61 -66 -30 -8 -24 52 -13 -40 -4 -10 -23 -17 57 -33 -28 7 -32 -45 -16 38 -38 42 26 4 -32 67 -58 10 73 -15 18 0
7888 0 46 -51 16 25 -48 -19 45 25 5 13 5 -55 28 28 6 -77 -7 0 -41 30 -32 0 50 -72 -84 37 15 -7 -12 26 -47 -27 59
7921 59 -60 24 21 8 -22 35 9 -32 31 56 -20 -16 -12 -24 -8 30 -3 0 17 -37 -55 -16 -1 -12 -21 56 -15 -30 25 30 -53 -3 -9
7954 -9 27 31 8 -41 -16 53 -2 -35 32 -30 22 75 18 -46 24 69 -26 -36 -8 -23 -33 32 -9 -18 78 13 3 -53 -9 -32 -11 32
7986 32 -31 -5 -18 30 -30 15 24 -24 4 13 -19 -24 6 27 -30 25 10 -66 48 -66 -46 40 7 -26 58 50 -1 -35 -36 -39 -27 -3
8018 -3 22 -24 -4 -4 -55 -73 2 2 -62 30 51 -33 8 51 -3 -1 34 -32 -17 30 -13 25 42 -15 6 70 -8 -54 14 21 -25 3 7
8051 7 -37 -23 19 12 -30 25 8 33 52 12 -35 -21 38 -11 9 26 -19 -57 1 -8 -77 -12 -13 44 -63 -16 18 -6 19 -17 29 38
8083 38 14 -21 5 47 -30 -20 47 -18 -20 39 17 15 19 4 -15 -20 4 -41 8 15 -28 -28 53 -30 -32 -3 13 -48 3 94 -22 -59 -12
8116 -12 -60 -34 -21 52 -57 70 30 -33 26 49 29 -2 30 -15 5 43 49 -70 32 2 -6 5 32 -38 -46 23 -4 -4 55 39
8146 39 25 -13 45 9 -24 12 -75 -19 13 27 -22 36 -3 -29 16 64 -82 0 54 39 -69 -4 8 -8 75 -5 6 67 42
8175 42 45 71 64 16 26 -6 11 14 19 7 -21 -28 35 -20 4 42
8191D2
$$ Imaginary data points
##PAGE= N=2
##DATA TABLE= (X++(I..I)), XYDATA
0 0 0 0 0 0 0 0 0 0 0 0 -8 8 -8 16 -16 24 -24 32 -40 48 -56 66 -80 91 -107 129 -146 170 -195 225 -258 291
32 291 -331 374 -422 475 -535 596 -665 744 -827 917 -1015 1126 -1247 1374 -1516 1671 -1843
49 -1843 2028 -2233 2460 -2715 2996 -3313 3670 -4075 4543 -5092 5737 -6515 7474 -8693
63 -8693 10292 -12491 15716 -20898 30547 -54339 227940 157294 -476844 156252 355086 -312670
75 -312670 -178646 395627 -63989 -322601 208222 171221 -286250 -2778 232039 -108128
85 -108128 -137864 154287 41470 -114947 14267 78023 -11562 -45476 -13587 64861 15131
96 15131 -112351 16118 138938 -107783 -122645 193586 32344 -242038 108338 211554
106 211554 -233946 -84004 308599 -84761 -271078 246701 137107 -336061 45706 306165
116 306165 -222859 -185139 314510 5336 -302447 158819 200217 -246568 -46498 249000
126 249000 -84042 -169891 158978 62207 -163013 24631 111224 -71761 -54328 65994 13644
137 13644 -41377 -7349 27474 26507 -34543 -32048 72261 14818 -104056 39240 105107 -111859
149 -111859 -63996 159330 -26245 -165540 120920 105827 -189248 666 200284 -111025
159 -111025 -135420 195527 29991 -208399 89201 154787 -174164 -56693 192515 -55489
169 -55489 -155125 128869 69785 -154640 17238 127742 -76328 -66996 99879 12111 -80346
180 -80346 27909 50278 -36858 -24335 27142 12463 -21491 -20278 22992 23065 -43081 -14046 64469
193 64469 -15024 -68784 60196 49612 -94761 964 106481 -61565 -80134 110304 19559
204 19559 -128949 50359 101877 -110024 -42247 133416 -30789 -112666 93291 60568 -119843
215 -119843 7688 109296 -64304 -68451 91993 13306 -90971 30536 63084 -56578 -28044
226 -28044 60182 -129 -46654 18820 33441 -22097 -21173 23645 16365 -27456 -14127 33465 2774
239 2774 -44143 13277 43327 -38535 -30354 60267 3270 -65932 35201 55243 -64865 -20475
251 -20475 81045 -22096 -72064 60315 38610 -84315 3094 79180 -47031 -54692 73050
262 73050 15367 -76661 25675 61773 -51938 -29877 64133 -1388 -56792 27144 38338 -41939
274 -41939 -17928 43029 -2424 -38669 15130 29049 -23965 -19102 29767 9812 -32360 2188
286 2188 34045 -14865 -30119 28934 19611 -40656 -2689 44369 -19394 -38201 39428 20582
298 20582 -51314 5155 51212 -30762 -36195 50020 11197 -56426 16462 46778 -40756 -26615
310 -26615 52291 -337 -50482 25233 36926 -40601 -14583 46393 -6618 -39429 24648 25855
322 25855 -34471 -9602 35250 -6831 -31066 17796 21016 -25937 -10521 28824 -804 -27732
334 -27732 12463 24265 -21250 -14971 29511 3898 -32108 10538 28819 -25156 -19507 34542
346 34542 2595 -38531 15127 31758 -31744 -16927 41043 -2733 -39513 23053 28822 -36382
358 -36382 -9823 41115 -10154 -34614 26724 20381 -35353 -2978 34165 -13567 -26134 23829
370 23829 13139 -28048 -381 25850 -10238 -19766 17346 12168 -20978 -3667 22244 -4312
382 -4312 -20555 12879 16683 -20093 -8854 25536 -2106 -26529 14546 20865 -26353 -9666 32078
395 32078 -6674 -30559 22284 19979 -33013 -2955 35475 -14719 -27204 29165 12632 -34180
407 -34180 5437 30416 -20086 -19112 27592 4092 -27922 8129 20666 -16855 -11884 19188 2994
420 2994 -18045 3570 15631 -7485 -12322 11494 9762 -15000 -5056 18977 -1896 -20558 11464
433 11464 17317 -21688 -8484 27628 -5897 -27196 20342 17528 -31134 -1519 33077 -16120
445 -16120 -24469 29907 8702 -33759 10121 27748 -24311 -13482 30153 -3169 -26245 16145
457 16145 15160 -22211 -2967 19709 -6959 -13585 10411 6300 -9769 -2164 7661 2058 -6618 -2174
471 -2174 9859 1199 -13359 4712 15131 -13938 -11097 22425 -363 -26192 14835 19871 -28431
484 -28431 -5463 33272 -13705 -26982 29998 10868 -36219 10470 30949 -27117 -14208 34609
496 34609 -5742 -29425 21753 14645 -28623 2074 23665 -15510 -12310 19265 -639 -15187
508 -15187 8283 6398 -8599 834 3757 -1991 2221 -1915 -2956 8765 -2021 -11611 11698 7240
522 7240 -20104 4140 21011 -18910 -12475 28728 -4713 -28818 22825 16472 -34387 3824 33513
535 33513 -24004 -19348 36110 -1649 -34139 22224 20383 -32727 53 30347 -18000 -17358 25939
548 25939 -451 -23054 13463 10867 -18129 1941 12997 -9607 -2946 9281 -4771 -1587 6734
561 6734 -6209 -119 9871 -9393 -4823 16357 -7086 -15567 18910 4376 -25548 11321 20304
574 20304 -26089 -5357 31279 -14042 -23572 29955 6055 -33817 15438 25014 -30241 -5977
586 -5977 33305 -14404 -23384 27239 4985 -28610 12142 17748 -22158 -2138 20353 -11121 -9985
599 -9985 16140 -2423 -11254 10636 1591 -9833 7652 2329 -9653 7505 3818 -12766 6803
612 6803 9416 -16337 1197 17850 -14793 -10219 23386 -4920 -22506 20083 10834 -28320 6983
625 6983 25201 -22902 -10873 30597 -7753 -25428 23709 10572 -29559 7752 23282 -21763
637 -21763 -9011 25091 -7562 -18458 17550 4890 -18483 7547 10731 -13261 692 10936
649 10936 -8292 -1929 9502 -6336 -2887 9721 -6279 -5482 12080 -4559 -11294 13661 1917
662 1917 -17791 10312 12367 -20169 287 21992 -14523 -13358 24593 -1225 -24135 17116 14260
675 14260 -25993 1781 24620 -17207 -14061 24719 -2017 -22961 15187 11885 -21372 1774
687 1774 18223 -12251 -8211 15820 -2274 -11098 9417 3148 -8902 4351 3400 -6454 3434 2470
701 2470 -7214 4399 4374 -10241 2888 10053 -11635 -3612 16056 -7169 -13239 16907 3608 -20344
715 -20344 9459 15807 -19500 -3909 22797 -9679 -16853 19991 4619 -22523 8709 16290 -18273
728 -18273 -5001 19567 -7185 -14115 14389 4133 -15104 5195 10103 -9716 -2112 9351 -3360
741 -3360 -4298 5324 -559 -2642 2854 -1921 -1274 4239 -3774 -3426 7632 -2192 -8670 8678 4289
756 4289 -13079 4005 12641 -12034 -5653 17157 -4070 -15170 13818 7553 -18687 3288 16421
769 16421 -13309 -8924 17611 -1988 -16064 10728 8751 -14816 430 13279 -7460 -7162 10651
782 10651 602 -8731 4384 4609 -5494 -391 3708 -1685 -1018 585 -751 1470 -433 -3312 3323
797 3323 2377 -6492 1277 7427 -6289 -4617 10425 -1015 -10900 8047 7211 -12813 237 13445
811 13445 -8163 -9055 13623 1131 -14464 6885 10028 -12729 -2879 13475 -5062 -10018 10025
824 10025 3683 -10940 2756 8484 -6353 -3402 7454 -495 -5188 2931 2358 -2929 -703 1249
838 1249 42 -634 -1777 524 2588 -2919 -2257 5409 -30 -6235 4464 5458 -7750 -855 9786
853 9786 -4506 -7839 9442 2686 -11877 3705 9671 -9789 -4671 12116 -2509 -10672 8440
866 8440 5737 -11005 903 10162 -6067 -5743 8836 601 -7978 3597 4711 -5556 -1281 4683
880 4683 -1325 -2874 1876 1006 -1103 -515 45 1413 -106 -2738 1671 2989 -4076 -1242 6069 -2014
896 -2014 -5757 6233 3078 -8572 2017 8476 -7115 -4872 10332 -1144 -10472 6809 6312 -10962
910 -10962 -509 10814 -5809 -7316 9712 1818 -9753 4229 7177 -7193 -2024 7634 -2166
923 -2166 -5244 4313 1550 -4441 633 2156 -1818 -493 393 -316 1256 -771 -1595 3246 643 -4369
939 -4369 2777 4222 -5708 -945 7469 -3767 -6204 7834 1436 -9782 4088 7518 -9296 -2490
953 -2490 11007 -4050 -8655 9393 3230 -10998 3536 8711 -8286 -3245 9854 -2616 -7504
966 -7504 6712 2762 -7520 1891 5146 -4669 -1392 4312 -1818 -1918 2624 -1036 -1071 2281 -1784
981 -1784 -1076 3793 -1973 -3146 5401 189 -6285 4546 4454 -7938 496 8421 -6209 -5302 9734
996 9734 -1203 -10001 7124 5370 -11057 1230 10239 -7489 -5235 10924 -1265 -9163 7480
1009 7480 4594 -9475 1927 7747 -6695 -3091 7517 -2561 -5525 5310 666 -5404 3074
1022 3074 2271 -4396 1911 2954 -3951 1202 3735 -4239 -4 5305 -4315 -2815 6980 -2236 -6715
1037 -6715 6769 2087 -9215 3740 7147 -8810 -1612 10524 -5077 -7286 10212 1057 -10853
1050 -10853 6020 7119 -10297 -398 10227 -6056 -5941 9519 -447 -8553 5783 3953 -7853
1063 -7853 1455 5812 -5381 -1452 5551 -3029 -2747 4962 -1580 -3398 4716 -387 -4476 4667 1420
1078 1420 -6219 3634 4432 -7426 409 7699 -6148 -4539 9171 -1913 -8800 7484 3946 -10366
1092 -10366 3003 8831 -8471 -2975 10835 -3613 -7909 8931 2179 -9807 4290 6363 -8449
1105 -8449 -669 7990 -5004 -4317 7201 -1214 -5695 5238 1447 -5651 3452 3033 -5474 1849 4307
1120 4307 -5356 -123 5819 -4742 -2865 7110 -2652 -6223 7143 1409 -8835 4497 6175 -8822
1134 -8822 -387 9485 -5694 -5640 9730 -539 -9173 6835 4882 -9698 1692 8339 -7148 -3431
1148 -3431 9024 -2843 -6841 7049 1521 -7789 3766 4451 -6798 521 5904 -4783 -1949 6230
1162 6230 -2689 -3682 5829 -558 -5221 4947 1686 -6412 3216 4173 -6777 330 6567 -5613 -3311
1177 -3311 7967 -2436 -6878 7218 2275 -8748 3792 6668 -7845 -1011 8933 -4568 -5526
1190 -5526 8264 4 -8159 5100 4197 -8005 884 6656 -5631 -2816 6923 -2166 -4931 5477
1204 5477 909 -5507 3542 2928 -5201 1464 4087 -4549 -515 4946 -3563 -2641 5460 -1751 -4727
1219 -4727 5122 974 -6294 3486 4104 -6528 483 6644 -4802 -3276 7451 -1481 -6311 5870
1233 5870 2493 -7503 2468 5664 -6302 -1506 7016 -3294 -4738 6121 249 -6093 3770 3275
1247 3275 -5733 791 4861 -4045 -1746 5039 -1863 -3236 4273 55 -3960 2993 1504 -4164 1689
1262 1689 2782 -4136 164 3969 -3536 -1760 4844 -1915 -3832 4779 775 -5348 3224 3710 -5530
1277 -5530 333 5736 -3919 -3005 5974 -1068 -5486 4323 2132 -6055 1504 4493 -4690 -1435 5385
1292 5385 -2112 -3467 4579 535 -4286 2768 2431 -4076 606 3352 -3001 -1136 3354 -1792 -2177
1307 -2177 2997 -530 -2681 2588 647 -3079 2032 1955 -3473 774 3348 -3179 -1194 4323 -1833
1322 -1833 -3377 4137 659 -4819 2514 3228 -4729 -192 4839 -2990 -3008 4732 -258 -4581 3075 2299
1338 2299 -4498 643 3861 -2948 -1468 3946 -981 -2591 2975 586 -2925 1671 1450 -2740 506
1353 506 1833 -2328 -275 2240 -1772 -1062 2697 -869 -1906 2821 289 -2826 2274 1787 -3458 664
1369 664 3265 -3091 -1569 3983 -1427 -3576 3336 1017 -4346 1578 3277 -3611 -734 4292 -1658
1384 -1658 -2723 3694 533 -3615 1998 2117 -3335 -72 2814 -2023 -1336 2560 -775 -1832 2027
1399 2027 205 -1864 1546 721 -2036 1072 1348 -2212 341 2119 -2143 -817 2829 -1286 -2106 2977
1415 2977 251 -3262 2058 2089 -3552 187 3493 -2635 -2069 3734 -572 -3579 2679 1671 -3747 798
1431 798 3240 -2638 -1030 3583 -961 -2373 2717 549 -2910 1321 1455 -2612 52 1906 -1835
1446 -1835 -676 2119 -1057 -1077 2205 -278 -1550 2173 378 -2310 1619 1392 -2812 322 2441 -2596
1462 -2596 -1262 3117 -1305 -2790 3039 788 -3637 1810 2806 -3241 -307 3794 -1871 -2297 3418
1477 3418 -1 -3389 2066 1683 -3265 317 2739 -2156 -994 2754 -885 -1819 2344 181 -2196
1492 -2196 1579 932 -2387 722 1563 -2225 -5 2237 -1664 -983 2728 -715 -2053 2528 453 -2900
1508 -2900 1580 1746 -3134 149 2776 -2531 -1518 3332 -949 -2859 2999 1074 -3375 1666 2747
1523 2747 -2920 -214 3446 -1923 -2097 3037 -373 -3138 1898 1138 -3073 688 2222 -2332 -308
1538 -308 2700 -1303 -1113 2735 -378 -1949 2145 381 -2554 1317 1342 -2898 352 2378 -2498 -981
1554 -981 3119 -1323 -2295 3146 404 -3231 2176 2042 -3420 385 3305 -2743 -1554 3691 -1160 -3066
1570 -3066 3127 881 -3671 1702 2573 -3293 -174 3392 -2079 -1824 3223 -607 -2824 2471 822
1585 822 -3008 1333 1995 -2670 237 2724 -2017 -924 2987 -1042 -2143 2692 0 -3003 1952
1600 1952 1429 -3427 713 2802 -2937 -895 3727 -1434 -2499 3623 452 -3633 2416 2309 -3794
1615 -3794 308 3575 -2863 -1900 3739 -1040 -3274 2959 962 -3632 1554 2574 -3083 40 3268
1630 3268 -1977 -1398 3199 -790 -2451 2608 393 -3147 1671 1638 -3137 531 2690 -2572 -797 3345
1646 3345 -1482 -2211 3287 39 -3284 2367 1771 -3686 806 3177 -3116 -1240 3828 -1475 -2884
1661 -2884 3534 514 -3855 2055 2361 -3647 -14 3443 -2511 -1825 3512 -800 -2927 2688 930
1676 930 -3089 1530 2217 -2712 245 2769 -2095 -1034 2849 -1280 -2216 2585 -67 -3035 1937 1365
1692 1365 -3229 879 2659 -2666 -687 3537 -1453 -2180 3409 93 -3297 2260 1731 -3645 512
1707 512 2935 -2782 -1360 3463 -1331 -2677 3005 598 -3249 1793 2184 -3037 219 2966 -2051
1722 -2051 -1332 2953 -874 -2277 2394 367 -2738 1489 1457 -2582 480 2277 -2199 -688 2782 -1314
1738 -1314 -1830 2676 -137 -2700 2037 1278 -2991 861 2539 -2643 -637 3179 -1527 -2156 3035 58
1754 58 -3045 1966 1560 -3165 461 2712 -2420 -1093 3104 -970 -2217 2585 496 -2650 1566 1715
1770 1715 -2556 277 2277 -1920 -927 2413 -1028 -1895 2055 31 -2325 1582 1133 -2469 693 2121
1786 2121 -2069 -420 2582 -1256 -1637 2520 -105 -2524 1757 1109 -2787 626 2184 -2354 -676
1801 -676 2714 -1277 -1911 2597 165 -2628 1757 1551 -2630 366 2375 -1909 -936 2489 -773 -1880
1817 -1880 2061 272 -2204 1212 1188 -2108 260 1801 -1676 -563 2079 -969 -1400 1991 12 -1964
1833 -1964 1597 961 -2279 688 1832 -1941 -515 2304 -1202 -1545 2143 -58 -2213 1409 1008 -2325
1849 -2325 565 1973 -1891 -591 2400 -914 -1545 2181 292 -2198 1311 1291 -2113 201 1874 -1563
1865 -1563 -825 1939 -757 -1507 1657 120 -1838 1116 968 -1860 400 1573 -1480 -347 1881 -901
1881 -901 -1194 1794 -67 -1809 1290 816 -1991 417 1579 -1692 -495 2015 -857 -1378 1839 135
1897 135 -1884 1309 1082 -1905 307 1770 -1429 -718 1957 -663 -1548 1589 337 -1936 872 1108
1913 1108 -1734 27 1570 -1216 -737 1645 -389 -1245 1376 278 -1487 897 918 -1463 175 1276
1929 1276 -1221 -522 1461 -713 -1135 1371 -22 -1466 1064 809 -1535 408 1432 -1330 -428 1827
1945 1827 -732 -1259 1603 192 -1738 881 1078 -1688 -89 1558 -1182 -874 1548 -268 -1338 1105
1961 1105 466 -1366 577 993 -1142 -36 1235 -785 -513 1204 -369 -899 1074 93 -1215 706
1977 706 544 -1348 307 1107 -1156 -349 1397 -622 -885 1355 27 -1326 1025 712 -1436 337
1993 337 1359 -1201 -515 1585 -551 -1270 1275 244 -1581 644 916 -1385 -134 1316 -885 -741
2009 -741 1295 -148 -1024 983 376 -1102 510 735 -942 23 927 -832 -399 1014 -541 -768 1036
2026 1036 -97 -1148 870 556 -1224 439 1120 -1083 -221 1440 -649 -927 1356 -21 -1424 924
2042 924 664 -1620 158 1267 -1169 -676 1457 -384 -1138 1159 402 -1328 640 943 -1139 -8
2058 -8 1134 -792 -517 1109 -285 -869 915 150 -1109 651 537 -1108 262 904 -954 -226 1164
2075 1164 -651 -758 1344 -47 -1207 998 586 -1470 365 1216 -1303 -369 1514 -690 -1166 1377
2091 1377 139 -1556 752 809 -1464 40 1404 -972 -548 1418 -315 -951 1079 264 -1117 664
2107 664 628 -1153 134 995 -973 -416 1134 -558 -916 1117 -27 -1090 874 594 -1162 438 1102
2124 1102 -1078 -326 1332 -733 -837 1258 -59 -1389 854 635 -1480 293 1197 -1095 -454 1488
2140 1488 -520 -1049 1335 214 -1349 802 792 -1244 147 1095 -969 -430 1209 -486 -836 1053
2156 1053 25 -1122 725 507 -1140 309 921 -1001 -145 1134 -691 -700 1246 -157 -1071 972 514
2173 514 -1327 473 1014 -1142 -223 1278 -722 -876 1257 -90 -1353 876 650 -1371 341 1197
2189 1197 -992 -284 1378 -498 -778 1207 0 -1134 838 500 -1275 298 900 -1128 -271 1129
2205 1129 -745 -755 1212 -105 -1033 917 487 -1147 539 893 -1121 10 1185 -864 -599 1190
2221 1190 -354 -1185 1037 332 -1436 579 992 -1254 -46 1433 -743 -729 1391 -121 -1173 984
2237 984 499 -1317 382 961 -1106 -190 1139 -717 -704 1123 -192 -1007 915 389 -1215 525 832
2254 832 -1160 -13 1163 -799 -579 1281 -248 -1024 1100 325 -1230 642 829 -1254 57 1143
2270 1143 -929 -674 1261 -410 -1153 1158 357 -1309 623 984 -1162 -11 1229 -694 -674 1178
2286 1178 -217 -1019 898 278 -1275 404 661 -1143 -46 1158 -762 -536 1218 -279 -856 1048
2302 1048 353 -1130 606 797 -1131 -3 1108 -900 -577 1204 -346 -1061 1104 256 -1301 659
2318 659 913 -1175 56 1274 -827 -622 1246 -193 -1094 959 360 -1225 414 829 -999 -53 1027
2335 1027 -763 -513 1051 -243 -883 906 252 -1119 517 715 -1049 79 1093 -724 -501 1136
2351 1136 -213 -928 969 253 -1094 527 713 -1061 -42 1038 -756 -567 1083 -196 -935 890
2367 890 360 -1072 451 823 -930 -32 1043 -612 -598 991 -130 -947 735 249 -979 321 646
2384 646 -950 -37 901 -613 -381 1042 -202 -812 904 335 -1036 519 741 -962 -116 946 -605
2401 -605 -620 917 -204 -845 660 297 -914 443 742 -800 -58 863 -512 -528 919 -127 -776 686
2419 686 283 -887 265 641 -847 -130 911 -512 -501 867 -46 -709 599 216 -837 375 606
2436 606 -695 27 825 -583 -397 943 -175 -804 673 275 -960 199 621 -765 -154 734 -405
2453 -405 -456 719 -114 -613 632 285 -743 334 591 -651 -52 669 -402 -484 655 -185 -699 477
2471 477 208 -773 233 510 -635 -33 746 -403 -328 782 -138 -612 637 210 -833 332 595 -801
2489 -801 -71 834 -517 -525 778 -126 -740 467 369 -710 227 572 -540 40 643 -431 -313 662 -114
2508 -114 -557 591 164 -723 332 474 -751 -34 742 -482 -321 754 -171 -565 633 190 -712 415
2526 415 571 -719 44 730 -556 -356 856 -167 -718 662 234 -881 271 647 -784 -120 840
2543 840 -401 -456 745 -2 -709 536 310 -668 251 509 -630 -28 656 -489 -367 725 -235 -693
2561 -693 647 247 -759 374 578 -690 -11 815 -444 -382 797 -93 -666 628 183 -824 282
2578 282 499 -794 -128 734 -570 -455 746 -117 -744 601 343 -785 278 641 -615 -147 710 -300
2596 -300 -489 694 26 -636 503 246 -681 258 478 -686 -10 678 -455 -310 757 -112 -567 600
2614 600 173 -674 358 485 -659 -36 635 -493 -302 728 -269 -617 626 82 -727 359 556 -794
2632 -794 61 743 -405 -426 770 -143 -571 649 308 -748 311 497 -637 -45 658 -394 -366 583
2650 583 -173 -533 564 184 -634 349 446 -570 109 646 -420 -271 692 -221 -512 582 45 -658 382
2669 382 355 -730 58 543 -595 -224 682 -282 -524 668 161 -746 441 497 -721 84 735 -529 -291
2688 -291 730 -265 -638 574 148 -710 299 435 -647 34 594 -440 -230 681 -200 -503 597 96
2706 96 -630 399 375 -670 108 565 -487 -219 621 -306 -481 667 13 -690 487 313 -749 178 654
2725 654 -607 -143 799 -288 -506 753 85 -734 446 405 -754 78 646 -590 -280 696 -283 -561
2743 -561 626 25 -649 403 319 -616 208 550 -518 -157 626 -342 -396 663 -70 -721 413 340 -739
2762 -739 113 595 -663 -147 744 -368 -424 700 4 -700 543 363 -701 138 593 -583 -182 678
2780 678 -369 -609 672 44 -677 424 389 -729 99 616 -496 -156 619 -228 -452 617 9 -518
2798 -518 390 268 -631 180 474 -546 -108 612 -390 -416 691 -39 -610 517 336 -708 222 620 -569
2817 -569 -164 767 -318 -503 692 23 -691 419 342 -729 95 578 -573 -213 603 -259 -463 599
2835 599 76 -598 454 382 -595 156 570 -472 -151 554 -256 -341 536 -10 -537 449 273 -613 180 492
2855 492 -558 -154 696 -289 -384 676 -35 -588 410 351 -604 91 536 -481 -257 570 -254 -481 529
2874 529 58 -569 334 316 -582 100 476 -438 -171 593 -202 -342 495 83 -485 286 221 -502 132 418 -426
2895 -426 -127 549 -263 -309 561 -62 -543 389 275 -576 245 515 -499 -159 608 -255 -409 476 39 -562
2915 -562 252 290 -555 74 422 -374 -241 492 -138 -321 453 62 -447 306 306 -498 77 459 -425 -208 458
2936 458 -224 -390 462 -15 -493 257 127 -458 89 405 -440 -83 521 -258 -310 495 -26 -458 398 214
2956 214 -597 86 490 -469 -187 530 -259 -470 492 16 -513 321 288 -413 92 466 -425 -141 461 -238
2976 -238 -359 538 -12 -555 299 237 -508 110 449 -375 -129 457 -124 -319 389 -5 -422 305 228 -520 179
2997 179 373 -437 -74 505 -325 -421 478 -56 -542 293 239 -524 84 512 -410 -161 540 -172 -428 444 72
3018 72 -492 278 348 -448 82 417 -382 -217 455 -189 -395 358 58 -462 191 236 -414 24 387 -353 -79
3039 -79 452 -242 -270 474 21 -441 317 207 -555 119 368 -427 -271 527 -233 -402 490 106 -494 269 402
3060 402 -419 -25 465 -316 -224 479 -131 -398 382 103 -433 192 242 -425 29 360 -261 -195 453 -93 -266
3081 -266 318 13 -348 240 186 -355 148 312 -395 -72 423 -319 -287 483 -57 -534 324 229 -518 54 485
3102 485 -354 -208 499 -79 -318 383 125 -379 154 241 -372 -7 307 -295 -177 353 -141 -323 313 -4
3122 -4 -330 163 169 -365 96 293 -269 -66 349 -199 -224 346 -72 -329 328 118 -506 184 330 -474 -96 475
3144 475 -235 -286 454 81 -476 303 289 -419 37 342 -299 -121 365 -196 -223 305 23 -376 294 141 -398
3165 -398 96 295 -307 -44 359 -167 -173 368 -22 -290 307 148 -360 128 280 -388 -10 355 -270 -245 406
3186 406 -139 -389 420 180 -479 122 382 -375 -73 509 -181 -270 357 42 -390 238 217 -340 138 260 -349
3207 -349 -54 318 -242 -207 326 -83 -325 301 142 -341 127 313 -278 -20 357 -200 -149 327 -122 -356 248
3228 248 89 -350 162 224 -413 -31 395 -290 -209 432 -72 -444 366 182 -459 103 387 -380 -147 418 -150
3249 -150 -300 310 -8 -365 274 116 -337 109 234 -305 -2 346 -233 -137 395 -89 -313 309 62 -307
3269 -307 194 227 -361 27 350 -252 -152 411 -134 -356 303 145 -420 183 275 -351 -37 460 -244 -279 345
3290 345 -46 -381 291 217 -394 85 306 -297 -116 259 -202 -197 255 -32 -229 264 135 -288 198 265 -327
3311 -327 98 249 -245 -167 295 -134 -321 259 1 -377 199 199 -326 8 322 -262 -152 395 -54 -310 399
3332 399 102 -415 126 269 -371 -78 358 -222 -286 286 -27 -328 231 142 -271 61 256 -225 19 265 -128
3353 -128 -106 306 -43 -183 247 28 -261 138 177 -271 57 213 -272 -117 308 -127 -249 332 -19 -337 227
3374 227 245 -361 38 390 -300 -157 344 -91 -313 272 103 -393 104 213 -270 -75 319 -124 -132 292 0
3395 0 -246 217 103 -205 175 144 -238 29 216 -226 -122 224 -179 -228 316 -16 -325 179 171 -334 81 328
3417 328 -207 -40 432 -95 -222 351 93 -386 190 214 -363 -10 356 -202 -198 346 7 -274 255 131 -271
3438 -271 128 247 -146 -38 302 -155 -86 293 -55 -188 251 75 -253 173 185 -324 0 202 -256 -151 274
3459 274 -100 -208 296 34 -346 240 228 -331 76 325 -266 -113 373 -148 -317 220 12 -330 186 242 -337
3480 -337 -39 264 -201 -162 374 -44 -247 232 100 -254 109 159 -285 -43 262 -176 -97 212 -79 -220 201
3501 201 46 -248 210 226 -302 27 249 -277 -73 307 -48 -233 244 57 -355 136 203 -300 27 330 -231
3522 -231 -161 370 -65 -271 314 130 -332 107 267 -323 -43 332 -160 -179 227 27 -221 217 55 -237 107
3543 107 167 -236 6 211 -223 -136 269 -88 -193 213 38 -226 144 167 -234 86 255 -201 -64 243 -81
3564 -81 -204 237 48 -347 194 201 -274 -7 306 -188 -136 308 -40 -154 270 112 -280 48 191 -216 -79
3585 -79 212 -101 -107 310 25 -200 158 73 -155 82 111 -217 19 177 -123 -19 247 -146 -198 256 6 -249
3607 -249 253 64 -295 38 238 -225 -96 232 -122 -251 203 46 -313 167 175 -262 -11 278 -218 -112 282
3628 282 -49 -174 158 81 -246 82 214 -230 -11 163 -108 -28 189 -34 -133 216 27 -216 175 156 -206
3649 -206 49 177 -255 -36 275 -167 -237 185 16 -315 197 191 -248 20 328 -150 -98 240 -62 -182 165
3670 165 70 -272 120 154 -187 -6 233 -75 -52 260 -48 -181 154 62 -181 100 217 -150 -5 163 -175
3691 -175 -36 182 -83 -110 243 -12 -250 178 133 -282 84 173 -216 -72 266 -116 -222 290 24 -315 132
3712 132 203 -199 -11 229 -125 -121 216 -23 -220 162 58 -219 71 181 -199 -19 190 -159 -53 235 -64
3733 -64 -178 223 46 -148 141 153 -237 -18 183 -188 -104 174 -161 -205 227 -15 -247 159 208 -253 -31 205
3755 205 -157 -116 279 -43 -226 187 104 -200 119 196 -156 -42 228 -169 -100 216 -54 -120 180 34 -193 118
3777 118 145 -206 54 183 -164 -68 238 -118 -133 177 28 -171 200 91 -229 61 182 -150 -55 260 -63
3798 -63 -173 286 8 -248 137 115 -228 -14 258 -161 -105 204 -38 -196 194 26 -169 95 102 -133 -20 172
3820 172 -105 -30 190 -89 -115 182 -15 -210 107 34 -254 63 194 -176 -104 224 -57 -171 184 -16 -190
3841 -190 167 139 -232 69 204 -122 -55 223 -97 -165 176 58 -186 116 128 -182 17 197 -169 -36 168
3862 168 -69 -116 136 56 -171 131 25 -160 65 155 -180 32 215 -64 -101 196 -41 -208 155 130 -246 56
3884 56 161 -149 -115 261 -109 -159 215 2 -161 168 108 -193 24 181 -193 -65 224 -78 -131 143 14 -158
3906 -158 144 98 -133 74 124 -134 3 152 -105 -75 154 -86 -205 124 18 -237 41 133 -243 5 203
3927 203 -138 -151 228 5 -227 221 151 -257 38 209 -198 -27 211 -68 -190 170 0 -193 132 107 -189
3948 -189 4 166 -132 -20 190 -98 -99 128 -40 -162 167 49 -163 88 147 -149 -42 168 -91 -133 174
3969 174 -10 -199 189 85 -241 55 180 -185 0 208 -74 -120 183 -12 -176 154 73 -202 8 133 -132
3990 -132 -55 183 -101 -155 149 26 -187 105 60 -193 104 98 -162 15 165 -90 -112 160 -35 -130 134 49 -174
4013 -174 74 125 -187 8 200 -81 -126 198 6 -121 93 80 -129 46 130 -171 -22 131 -104 -132 107 -40
4035 -40 -223 142 42 -148 90 120 -131 -18 169 -85 -59 176 -72 -152 130 73 -157 44 100 -158 -5 136
4057 136 -154 -64 180 -9 -129 127 28 -146 118 101 -152 32 150 -123 -53 162 -14 -166 148 11 -141
4078 -141 104 51 -137 -26 161 -64 -99 169 21 -135 67 84 -127 48 99 -136 -20 116 -79 -84 122 -33
4100 -33 -88 122 64 -168 88 25 -147 29 142 -86 -91 160 -95 -121 136 21 -154 79 95 -192 21 117 -144
4123 -144 -121 141 25 -106 151 91 -151 46 163 -167 -5 138 -144 -64 184 35 -125 92 51 -132 74
4144 74 128 -192 -27 109 -142 -80 142 -17 -118 126 19 -125 95 72 -104 -27 163 -105 -135 169 -60 -166
4166 -166 154 51 -220 43 117 -174 -48 201 -87 -78 193 28 -140 129 63 -222 86 98 -140 -68 123 -43
4188 -43 -98 160 -63 -95 119 67 -114 113 69 -144 -4 142 -90 -89 103 -9 -86 89 41 -181 51 57 -136 -7
4212 -7 229 -94 -90 183 -34 -176 71 56 -161 29 105 -79 -30 145 -62 -118 206 42 -111 47 53 -166 36
4235 36 83 -141 -19 120 -68 -72 128 10 -164 93 62 -93 48 92 -172 -40 165 -94 -87 104 -32 -144 109
4258 109 -15 -150 55 131 -126 36 217 -134 -109 204 53 -158 103 90 -137 38 106 -124 -98 163 -100 -93
4280 -93 173 -11 -121 81 1 -142 43 137 -96 -49 110 -76 -108 151 -43 -44 103 16 -140 68 126 -167 40
4303 40 147 -105 -102 163 -52 -136 148 78 -187 111 128 -129 36 179 -61 -74 178 -43 -115 84 35 -168 47
4326 47 124 -133 -68 158 -31 -94 168 -3 -113 79 28 -143 14 109 -117 26 137 -87 -47 175 -91 -113 133
4349 133 -3 -133 80 102 -133 32 206 -128 -66 153 6 -137 96 85 -166 73 90 -135 -41 80 -73 -128
4371 -128 177 -8 -157 112 85 -140 37 127 -145 -23 139 -89 -54 136 -22 -85 84 20 -140 25 91 -82
4393 -82 0 139 -154 -59 169 -54 -116 198 70 -118 154 120 -139 -11 130 -71 -127 145 -59 -109 77 -7 -160
4416 -160 34 53 -141 38 148 -1 -81 133 10 -74 101 37 -79 26 70 -57 31 110 -79 -107 164 -63 -109
4439 -109 89 17 -142 38 44 -116 32 73 -96 -9 162 -28 -128 173 18 -146 27 165 -149 -30 111 -141
4461 -141 -24 97 -39 -80 113 10 -91 83 60 -92 -5 106 -78 -65 127 -37 -31 99 10 -89 32 43 -95
4484 -95 -1 98 -141 -9 131 -80 -23 108 -10 -71 115 133 -108 -8 104 -83 -76 96 -57 -95 89 -13 -131
4507 -131 31 68 -124 -24 123 -65 -71 137 -2 -35 115 16 -124 76 80 -122 66 78 -112 -49 88 -51 -31
4530 -31 74 37 -96 86 97 -98 51 89 -69 -1 119 -96 -84 70 -65 -46 38 79 -120 28 126 -132 -51 154
4554 154 -100 -60 116 22 -64 54 73 -97 10 70 -111 -16 118 -11 -57 60 0 -109 96 68 -159 4 101
4577 101 -37 -61 121 -51 -48 106 -4 -100 40 47 -74 43 92 -103 -63 112 -96 -83 94 -42 -131 62 47 -75
4601 -75 23 84 -50 17 157 -20 -42 126 33 -94 93 9 -165 44 65 -104 -48 71 -56 -87 149 -21 -80 93
4625 93 43 -123 -8 56 -83 -44 134 -25 -105 134 -45 -88 68 43 -95 24 115 -90 14 85 -22 -61 116
4648 116 -5 -91 59 87 -111 18 150 -114 -10 100 -57 -59 53 -46 -95 93 63 -97 19 67 -50 -75 125
4671 125 -35 -104 114 -12 -52 42 77 -66 7 25 -103 -23 95 -72 2 122 9 -51 73 23 -68 35 95 -31
4695 -31 17 92 -28 -49 77 10 -148 76 75 -107 39 113 -107 5 87 -70 -124 85 77 -141 102 56 -117 4
4719 4 69 -119 43 77 -6 -89 69 1 -80 91 18 -93 62 60 -78 21 106 -11 -88 74 31 -125 33 81 -99
4744 -99 36 117 -116 -17 82 -48 -108 71 23 -153 103 104 -74 -3 107 -105 8 115 -14 -53 103 74 -96 108
4768 108 73 -110 7 81 -51 4 118 -8 -39 124 2 -58 121 89 -81 68 115 -50 2 116 -59 -97 114
4791 114 -7 -75 83 110 -174 -1 123 -146 -53 114 -21 -80 121 -19 -109 111 58 -112 57 47 -47 -34 125
4814 125 -63 -59 135 -2 -91 68 80 -90 23 52 -67 -1 70 -36 -51 64 -28 -86 62 83 -128 6 45 -55
4838 -55 -13 114 -111 -102 121 -40 -111 73 82 -67 40 142 -48 -26 147 -42 -64 150 34 -62 94 65 -165 16
4862 16 74 -115 5 90 -8 1 83 64 -61 92 30 -100 36 85 -109 -24 116 -106 -54 87 -13 -85 34 36 -111
4887 -111 30 76 -41 31 163 -58 -49 106 -43 -102 76 76 -79 46 38 -104 -79 160 -39 -45 110 -1 -74 12 92
4912 92 -89 29 63 -38 -43 111 -16 -69 76 18 -78 43 21 -89 -29 121 -89 -22 111 -85 -74 142 -17 -71
4936 -71 136 39 -102 31 105 -61 -16 133 -52 -55 70 -1 -92 49 69 -133 -52 77 -72 -50 79 -80 -80 83
4960 83 20 -83 90 53 -40 50 83 -71 -5 132 -93 -23 143 -23 -70 97 31 -67 38 61 -73 -26 98 -40
4984 -40 -86 94 -34 -89 112 46 -89 -8 83 -40 -34 41 19 -64 80 -17 -80 71 9 -112 -19 56 -81 52 115 -38
5010 -38 -51 112 31 -16 67 9 -110 -5 95 -98 -8 111 -27 -30 103 37 -45 86 63 -34 3 91 -86 -13 99
5035 99 -75 -51 16 -30 -87 -1 -35 -124 -7 65 -67 -17 61 3 -27 69 11 -59 115 2 -59 16 -5 -33 -16 109 -108
5062 -108 -28 89 17 -86 66 46 -143 53 106 -99 1 104 -92 -63 116 -4 -105 94 15 -150 18 65
5084 65 -117 -4 72 -41 -91 73 30 -103 89 53 -149 28 71 -86 4 76 -61 -62 99 -50 -81 73 -21 -44
5108 -44 122 57 -71 -6 64 -49 -37 93 42 -74 56 23 -52 61 64 -95 27 63 -92 -76 31 -27 -70 31 -12
5133 -12 0 63 72 -39 23 71 -45 0 54 -5 -72 83 34 -27 68 95 -34 4 80 -44 -35 77 -18 -82 71 24 -97
5160 -97 81 97 -83 8 93 -94 -12 58 35 -95 49 24 -83 70 94 -60 -17 74 -56 -21 108 -10 -116 62
5184 62 76 -93 17 77 -80 25 83 -74 -7 58 -62 -84 6 31 -116 104 59 -94 10 57 -70 -38 103 -26
5208 -26 -63 110 52 -95 34 49 -100 -14 125 -57 -57 127 -11 -90 85 27 -52 61 66 -49 39 57 -3 14 77 20
5234 20 -33 63 66 -108 23 53 -112 -25 5 -131 -43 62 -41 -58 93 24 -114 109 84 -77 3 87 -59 -8 83
5259 83 -23 -87 30 26 -85 38 50 -64 -13 61 -14 -29 88 18 -60 74 39 -130 22 59 -128 3 79 -95 -120
5284 -120 49 -58 -136 85 53 -85 16 53 -49 -13 104 -18 -37 76 -24 -47 120 59 -16 3 60 -89 -2 121
5308 121 -72 -25 68 -23 -105 66 66 -107 42 109 -71 40 145 -29 -33 109 16 -58 50 15 -135 37 93 -133
5332 -133 -22 57 -112 -61 104 -24 -58 69 17 -93 101 44 -98 12 70 -72 -37 150 -4 -74 79 66 -135
5355 -135 86 46 -75 -13 68 -61 -90 87 1 -127 83 6 -51 51 32 -152 13 46 -55 -27 87 -24 -84 63
5379 63 45 -57 -16 53 -71 25 111 -5 2 82 -26 -26 88 -25 -63 13 102 -110 34 85 -90 -45 135 -30 -61 110
5405 110 39 -67 76 60 -91 24 66 -17 -46 82 -20 -22 36 -7 -112 13 44 -118 -52 71 -31 -73 111 -15
5429 -15 -26 72 96 -144 28 36 -105 38 47 -60 -12 103 -60 -63 92 27 -68 33 42 -54 38 198 -79 -82 118 17
5455 17 -84 98 30 -89 27 64 -119 -15 49 -29 -79 99 -2 -37 55 80 -61 8 115 -41 5 35 25 -3 90
5480 90 -13 -56 63 10 -34 28 35 -130 31 73 -102 9 74 -10 -66 64 59 -95 44 71 -72 -11 145 -52 -108
5505 -108 72 16 -106 62 39 -97 -4 64 -98 -3 128 -59 -28 100 54 -26 63 36 -87 -31 69 -68 40 58
5529 58 -60 -24 65 -76 -10 68 21 -85 -1 105 -77 3 67 -116 -79 92 -85 -97 30 23 -109 -12 34 -49 -92 101
5555 101 12 -53 81 -27 -85 93 19 -38 53 68 -38 14 30 -65 23 82 6 -87 45 -13 -64 24 -74 -74 20 64 -51
5582 -51 15 57 -65 -66 81 54 -97 88 88 -58 -8 93 -53 -70 36 -51 -90 44 45 -74 46 69 -45 2 22 -5
5608 -5 -20 19 -18 -14 65 -25 -81 38 38 -58 -15 48 -88 -66 54 -4 -37 63 20 -18 75 41 -53 59 20 -57 -18 96 -79
5637 -79 -95 67 13 -101 49 64 -106 1 102 30 -36 64 -4 -19 75 5 -47 49 38 -46 29 65 30 -56 51 -11
5663 -11 -13 66 2 -118 -31 15 -40 35 57 -86 18 56 -43 -27 94 62 -85 34 19 -68 10 58 -61 -14 36 -10 -104
5690 -104 41 37 -58 21 69 -28 -20 99 24 -62 61 -36 -29 64 -14 -32 60 -19 -155 -6 31 -33 -23 -4 0 -22 40 -32 -55
5719 -55 62 22 -8 36 54 -86 2 50 -26 -53 132 -6 -137 38 41 -94 9 35 -91 -54 76 7 -96 64 92
5744 92 -103 10 74 -23 13 35 -20 -19 76 -87 -44 68 -21 -88 2 53 -93 45 76 -99 7 100 -46 -5 111 9
5770 9 -45 101 41 -55 63 82 -83 -57 96 -28 -77 87 21 -105 27 73 -56 11 42 -93 -11 95 -13 -59 82
5795 82 35 -101 9 40 -18 53 62 -31 -58 40 35 -72 58 56 -28 34 33 -98 -15 39 -33 49 122 -60 -32 138 -46 -69
5823 -69 41 8 -115 -29 117 -93 -37 117 -10 -57 44 45 -121 51 83 -81 -15 92 -42 -14 81 -26 -69 57
5847 57 3 -85 51 7 7 6 75 -33 -16 55 17 -111 71 2 -71 38 46 -69 37 109 -119 -54 101 -11 -42 86
5873 86 48 -50 44 13 -51 -67 71 -83 -34 86 -11 -35 49 -10 -73 7 93 -64 -35 137 -11 -35 104 1 -57 76
5899 76 11 -11 59 26 -105 35 94 -79 8 49 -52 -101 46 -40 -165 80 81 -63 2 76 -85 -14 89 20 -74 100
5925 100 43 -78 32 24 -68 -16 40 -45 -33 58 22 -50 87 24 -35 58 34 -91 36 60 -65 -45 114 3 -19 60
5951 60 -26 -128 54 33 -39 -30 71 -45 10 104 -12 -6 97 54 -132 87 82 -69 25 115 -30 21 107 -48 -142 75
5977 75 -2 -43 67 98 -42 -15 83 -38 -6 111 -36 -93 68 50 -76 18 59 -61 19 46 -75 14 47 -28 -28 47
6003 47 49 -56 28 69 -42 0 27 -54 -33 71 1 -33 53 45 -60 3 82 -69 25 8 -70 -97 49 5 -71 64 34 -45
6031 -45 27 41 -127 3 84 -51 -50 66 1 -53 7 14 -51 12 0 -100 32 61 -71 48 18 -44 -46 131 -8 -54 38
6058 38 30 -27 1 24 -103 -40 75 0 -34 82 -13 -3 4 -11 -7 -33 60 -47 -8 113 5 -30 80 -37 -42 -8 -1 -56 7
6087 7 93 -20 -32 90 36 -51 72 -25 -101 20 -6 -43 54 45 -33 -10 64 -22 -71 54 -9 -77 29 -4 -116 30 14
6114 14 -70 -49 77 15 -77 40 -17 -16 55 15 -67 -37 52 -52 -85 84 11 -120 75 -2 -53 -2 36 -30 -29 61 -44 0
6142 0 42 -41 17 65 -10 -17 116 80 -94 -19 40 -67 -38 37 -9 -49 28 -32 -44 77 48 -83 44 27 -97 -38 69
6169 69 -10 -27 62 -34 -69 37 56 -23 39 83 -80 -34 86 -34 -55 48 18 -25 34 12 6 63 92 -40 -40 71 -11 -57
6197 -57 75 7 -92 57 -4 -73 -51 37 -108 -6 126 -37 -43 55 40 -42 40 65 -38 27 27 -54 -66 71 -62 1 8
6224 8 25 -100 7 65 -94 4 43 -50 -24 50 -26 -46 145 10 -51 29 -9 -55 48 21 -73 -11 37 -23 -49 106 -3
6251 -3 -39 -2 27 -123 -11 80 -28 -1 87 13 -68 53 -1 -42 0 63 -49 40 47 -52 -28 59 -6 -86 46 35 -60 40
6279 40 11 -94 -52 51 -93 -21 68 -90 -14 35 -61 -44 41 26 -110 -1 66 -38 -36 97 -36 -52 77 23 -81
6304 -81 17 50 -25 -6 50 -47 -3 61 -15 -83 54 43 -40 48 -6 -53 9 78 -58 -31 79 -1 -15 75 -27 -90 48 12
6332 12 -125 18 56 -32 -23 40 -37 -65 121 46 -52 69 55 -62 28 84 -79 -4 38 26 -41 72 -4 -86 83 34 -111
6359 -111 -6 3 -75 13 125 11 -27 76 32 -101 81 23 -86 32 40 -66 -16 89 -43 -41 112 45 -80 48
6383 48 9 -85 0 35 -62 -31 81 -8 -111 136 -21 -59 87 20 -88 56 63 -146 5 70 -24 -61 74 12 -83 85
6409 85 39 -94 41 91 -83 13 107 -40 -47 66 -61 -77 63 60 -128 7 22 -114 33 65 -84 -52 86 -19
6433 -19 -57 34 57 -88 43 101 -74 3 80 -65 -86 60 -20 -86 22 26 -65 -30 64 -75 -9 108 -78 -32 97 20
6459 20 -63 78 35 -35 35 59 -22 -45 22 13 -56 112 17 -68 62 43 -106 51 111 -15 -3 85 11 -1 143 31 -56
6486 -56 19 3 -71 11 32 -51 -62 74 -56 -53 54 -13 -82 55 61 -61 97 34 -82 -22 58 5 -33 44 17 -47 36 33
6514 33 -9 9 -9 -105 -2 79 -39 -45 41 -34 -15 119 -19 -98 21 44 -59 -4 72 -71 -63 73 -17 -22 -21 70 -40 3
6542 3 38 -49 -5 39 -60 -76 11 -12 -61 81 14 -46 40 9 -47 26 17 -57 -38 53 87 -44 83 -7 4 14 115 -87 10
6571 10 62 -69 -17 112 3 -60 46 66 -79 -10 35 -40 -38 72 -27 -66 -1 -31 -27 53 36 -112 -18 57 -40 8 99 -38
6599 -38 -51 110 28 -104 15 55 -33 36 42 -86 0 76 -25 -40 56 -11 -32 37 33 -107 34 25 -32 -7 20 -37 -58 35
6627 35 -1 -60 54 9 -100 24 79 10 -38 98 30 7 68 71 -52 21 22 -87 24 3 -48 -51 34 1 -20 67 21 -58
6655 -58 24 44 -73 30 92 -66 1 56 -1 -31 87 7 -62 65 -3 -76 41 58 -60 31 96 -7 -12 34 40 -63 88
6682 88 45 -106 71 65 5 0 48 -38 -14 64 -16 -11 -6 19 -95 -5 1 -1 -16 77 -24 -14 24 -10 -70 75 -1 -29 11 63 -54
6713 -54 -23 100 -18 11 59 -10 -32 76 52 -20 22 16 -13 -32 37 -24 -5 23 -8 -40 63 50 -119 13 91 -72 43
6740 43 27 23 -18 20 20 -6 65 36 -106 30 76 -17 -17 44 -51 -23 56 -20 -27 32 29 -118 35 50 -57 25 27 -11 -74 32
6770 32 -45 -80 53 40 -8 13 20 -2 20 43 -59 -40 35 8 -27 11 62 -74 22 58 -44 50 72 -71 -30 -3 -3 -45 63
6799 63 4 -84 31 18 -58 -24 41 -28 -6 -12 15 -68 26 83 -33 9 68 -22 -4 63 -53 -73 37 -9 -57 61 -21 -35
6827 -35 51 12 -29 21 31 -20 -37 69 -17 -40 110 14 -6 40 52 -23 6 69 -33 6 104 -68 -57 58 21 -58 64
6854 64 87 -54 -18 82 -66 -13 93 -9 -19 83 42 -78 16 36 -85 -9 57 -26 -67 62 -19 -56 18 20 -32 49
6880 49 47 -81 5 82 -22 -20 81 -80 -27 86 -22 -42 31 59 -70 -41 66 -26 -26 82 1 -28 5 4 -72 2 19 -126
6908 -126 -9 53 -69 16 81 -58 -60 17 48 -67 -21 30 -37 -16 86 -38 -14 87 -7 -47 69 -1 -92 32 8 -54
6934 -54 -4 4 -38 -36 75 -57 -61 86 48 -63 91 43 -37 34 77 -35 -59 30 19 -71 35 63 -65 9 18 -49 -31 76
6962 76 -71 -37 34 -19 -96 44 29 -79 62 55 -49 51 64 -73 -69 87 -15 -41 93 22 -67 88 0 -60 81
6987 81 55 -10 -34 54 22 -27 81 6 -50 65 99 -102 16 107 -80 -37 67 -4 -70 77 11 -80 24 -21 -41 -16
7013 -16 36 -41 -77 32 -22 -71 28 6 -53 16 27 -64 -10 34 -39 4 27 -39 -24 48 56 -77 -7 33 -111 20 29 -28 -3
7042 -3 78 -18 -75 66 -21 -109 28 14 -74 -8 51 -19 12 9 -19 -27 95 1 -61 71 123 -46 -1 42 -61 50 64 -10
7070 -10 -86 57 35 -34 34 54 -50 10 -1 -55 4 78 29 -8 32 36 -37 2 -18 -35 14 39 -61 -45 34 -8 -112 65
7098 65 74 -46 26 80 -35 14 99 54 -8 26 -4 -68 52 8 -41 42 78 -61 -35 46 -73 -59 38 39 -22 -5 45 -26 -33
7127 -33 71 1 42 57 -18 -29 21 -13 11 56 0 -6 59 83 -69 52 47 12 -22 104 -4 -29 28 41 -18 26 34 -79 -49
7156 -49 33 -31 -22 44 -5 -49 38 63 -44 48 11 -78 -5 48 9 4 55 2 33 42 10 -18 27 29 21 -25 33 -28 -28 6 -8 -9 57
7189 57 36 -29 63 2 -1 50 13 26 -16 10 70 -13 -7 34 -34 -24 -14 -51 -21 1 13 -49 76 -13 -50 62 27 -57 21 36
7219 36 -7 32 78 -45 -29 42 -32 1 38 -33 -80 41 60 -76 30 -9 -2 35 70 9 -7 19 29 -103 47 5 -35 53
7247 53 89 -16 28 69 -9 -73 5 22 -37 35 29 -10 15 44 26 13 106 17 -31 55 23 -18 -20 45 -25 7 16 -54 2 79 8
7278 8 -37 40 -42 2 48 37 -75 20 99 1 35 22 -64 -51 24 77 -38 70 63 -35 35 23 10 -13 37 35 11 45 44 -15 12
7309 12 -16 -29 34 -42 -24 4 53 -27 -69 35 13 25 5 34 -99 90 7 -67 -74 36 5 -53 45 23 -63 23 69 -19 25
7338 25 -29 -7 -31 20 5 -28 92 32 -64 32 44 1 57 58 -55 -21 26 -17 14 20 -15 -35 25 -20 -67 35 8 -111 -45
7367 -45 46 23 -42 58 1 -11 -5 90 -82 16 61 -31 -3 69 8 -37 33 -38 -39 8 41 -47 34 52 -14 58 39 25 34 69 16
7398 16 -35 65 47 -35 20 20 -61 -46 56 -39 23 16 -37 9 19 38 -13 34 10 -15 -63 63 -34 -12 57 3 -10 46 36 -4
7428 -4 -6 9 9 -32 33 0 -34 84 -29 -35 43 -29 -52 53 104 -60 -30 55 -32 56 92 6 -52 2 -25 -71 -9 16 -16 -92
7458 -92 35 -7 -57 104 5 -13 49 1 -3 40 51 -20 -19 109 26 -40 41 -4 -31 44 21 -88 22 58 -18 -3 37 -32 9
7487 9 87 -3 -50 38 0 -90 -24 70 -57 -33 44 -43 -11 75 80 -32 64 -11 -60 10 52 -36 40 100 -43 -38 58 -47 -37 19
7517 19 -16 -15 -43 41 -73 -20 17 -61 -72 91 62 -42 33 16 -22 24 -2 -32 -11 11 -27 -39 56 10 -11 83 23 -70 21
7546 21 50 -40 -21 100 -10 -4 62 39 -66 73 -2 -51 -26 36 -8 23 65 -29 -49 28 -7 3 27 33 -41 7 34 -9 -3 21
7576 21 2 16 45 30 -71 15 32 -11 30 32 7 -59 69 28 1 43 9 -71 13 54 -1 59 60 -26 -13 82 2 -15 42 -12
7606 -12 -18 25 76 -24 18 32 -32 10 21 46 -23 4 -12 -42 59 -8 3 0 -17 6 5 55 29 -49 22 27 -32 47 20 -24 26
7637 26 31 -37 -30 59 -5 26 91 -26 -46 2 38 -30 -6 51 -56 -8 -9 9 -55 23 36 4 40 68 -1 9 14 -87 0 -3 29
7668 29 -52 2 25 7 -9 -40 13 -16 16 -107 -18 36 -45 -50 33 19 -31 24 16 -14 70 24 11 -32 70 -59 -59 31 18 -60
7698 -60 -18 1 -7 16 83 -21 -10 45 6 -24 -1 -42 -36 15 -3 -12 37 40 -59 -21 49 -92 3 32 24 -28 31 11 -4 75 40 -14
7730 -14 31 89 -38 -40 65 16 -54 14 10 -1 18 7 -71 -9 33 -63 -62 24 50 -37 11 48 -6 -19 60 4 0 40 -30 -32 34 1
7762 1 -34 13 24 -17 -52 30 -58 -11 20 28 40 87 -8 -78 92 37 -80 46 55 -50 57 4 -35 -48 5 12 -74 0 -9 -12 34
7793 34 20 -40 -19 66 6 14 -50 42 -40 46 50 -82 19 34 -33 10 36 -44 -12 75 2 -9 65 51 -23 44 35 12 -55 -10 -1
7824 -1 -47 37 10 -18 28 -35 3 -16 69 -15 2 50 -16 -73 58 -39 -18 17 35 13 1 5 -10 16 0 2 -20 51 -47 6 48
7855 48 23 -23 52 39 -34 -8 72 -2 9 88 -5 64 -3 15 -44 -38 37 9 -24 16 -74 -53 13 2 -20 -24 8 -36 24 22 -19 -26
7887 -26 58 -41 -12 59 53 -67 38 31 -72 36 7 -15 -10 13 43 45 2 25 -33 -18 -18 27 7 -1 -7 25 14 -61 -1 16 -8 -59
7919 -59 40 -24 -53 9 13 -20 15 74 -41 -6 101 -21 -13 58 42 -49 -12 39 -48 -10 88 -2 -56 25 -33 -47 42 6 -30 21
7949 21 67 2 53 -6 -42 -14 46 7 18 -20 6 -4 23 15 -32 -7 -5 -30 -39 11 5 -14 -1 71 -26 38 16 -31 15 30 0 -25
7981 -25 82 15 -35 46 -10 -6 13 37 -7 -89 -12 -67 -14 -1 11 -16 24 43 -14 0 29 -36 34 -22 -5 -36 25 -37 8 -48
8011 -48 -23 -25 -24 6 -7 26 -3 -10 1 39 42 -36 35 13 -36 50 -33 -32 -4 32 -62 0 27 -9 -54 -16 -30 -13 -61 20 -16 -9 51
8044 51 -11 -33 22 -6 -31 9 7 0 14 -9 -71 -19 28 -31 -66 41 -23 21 52 -9 -19 36 23 9 53 42 44 -55 21 -33 -7
8075 -7 7 -43 -12 -4 43 -46 -28 42 -77 -24 90 4 0 21 27 -18 40 56 -7 -41 42 -7 2 46 31 -18 106 17 -8 -6 8 -45
8107 -45 -23 24 -14 -27 58 9 16 32 -26 -49 -38 8 -63 -14 -24 2 25 -26 -23 17 26 101 -42 -31 42 6 -22 46 -34 -10 9
8138 9 -28 -24 46 -39 -17 -6 -5 4 12 -26 -53 10 28 -27 9 59 4 -16 -31 -4 -16 30 63 8 29 11 -39 -24 -26 35 -15 35 17
8171 17 -22 16 43 -10 6 50 -23 19 10 55 -10 2 56 12 26 29 -37 17 -1 14
8191A4
##END NTUPLES=NMR FID
##END=
