##TITLE=1H_AMl_NV106
 CDCl3
 8 sc, 
 12.1.2024
##JCAMPDX= 6.0         $$ Bruker NMR JCAMP-DX V2.0
##DATA TYPE= NMR FID
##DATA CLASS= NTUPLES
##ORIGIN= UXNMR, Bruker Analytische Messtechnik GmbH
##OWNER= root
$$ XWIN-NMR		Version 3.5
$$ Fri Jan 12 13:44:22 2024 Russian Standard Time (UT+4h)  she@DPX200
##.OBSERVE FREQUENCY= 200.1313
##.OBSERVE NUCLEUS= ^1H
##.DELAY= (6, 6)
##.ACQUISITION MODE= SIMULTANEOUS
##.ACQUISITION SCHEME= undefined
##.AVERAGES= 8
##.DIGITISER RES= 18
##SPECTROMETER/DATA SYSTEM= spect
##.PULSE SEQUENCE= zg30
##.SOLVENT NAME= CDCl3
##.SHIFT REFERENCE= (INTERNAL, CDCl3, 0, 15.7039)
##AUDIT TRAIL= $$ (NUMBER, WHEN, WHO, WHERE, WHAT)
$$ ##TITLE= Audit trail, XWIN-NMR		Version 3.5
$$ ##JCAMPDX= 5.01
$$ ##ORIGIN= Bruker BioSpin GmbH
$$ ##OWNER= she
$$ F:/spectra/data/she/nmr/H-F/1/audita.txt
$$ ##AUDIT TRAIL=  $$ (NUMBER, WHEN, WHO, WHERE, WHAT)
(   1,<2024-01-12 13:43:15.26 +0400>,<she>,<DPX200>,
      <created by zg, POWCHK disabled, PULCHK disabled
       configuration hash MD5:
       00 E9 B6 7A A2 85 ED C7 34 08 36 98 17 FE 4E 26
       data hash MD5: 16K
       9B 8C 67 04 7E BD 86 4A 70 CC 29 E0 C3 07 50 A1>)
$$ ##END=
$$ 
$$ hash MD5
$$ 79 C2 2C 26 8E 93 29 61 FC 19 EE 8C 30 B2 B3 75
##$RELAX= 
##$RELAX= 
##$RELAX= 
##$RELAX= 
##$RELAX= 
##$RELAX= 
$$ Bruker specific parameters
$$ --------------------------
##$DU= <F:/spectra>
##$EXPNO= 1
##$NAME= <H-F>
##$PROCNO= 1
##$TYPE= <nmr>
##$USER= <she>
##$AMP= (0..31)
100 100 100 100 100 100 100 100 100 100 100 100 100 100 100 100 100 100 
100 100 100 100 100 100 100 100 100 100 100 100 100 100 
##$AQSEQ= 0
##$AQ_mod= 1
##$AUNM= <au_zg>
##$AUTOPOS= <>
##$BF1= 200.13
##$BF2= 200.13
##$BF3= 200.13
##$BF4= 200.13
##$BF5= 200.13
##$BF6= 200.13
##$BF7= 200.13
##$BF8= 200.13
##$BYTORDA= 1
##$CFDGTYP= 0
##$CFRGTYP= 5
##$CHEMSTR= <none>
##$CNST= (0..31)
1 1 145 1 1 1 1 1 1 1 1 1 1 1 1 1 1 1 1 1 1 1 1 1 1 1 1 1 1 1 1 1 
##$CPDPRG= <>
##$CPDPRG1= <>
##$CPDPRG2= <>
##$CPDPRG3= <>
##$CPDPRG4= <mlev>
##$CPDPRG5= <mlev>
##$CPDPRG6= <mlev>
##$CPDPRG7= <mlev>
##$CPDPRG8= <mlev>
##$CPDPRGB= <>
##$CPDPRGT= <>
##$D= (0..31)
0 1.2 0 0 0 0 0 0 0 0.06 0 0.03 0 0 0 0 0.0002 0 0 0 0 0 0 0 0 0 0 0 0 
0 0 0 
##$DATE= 1705052594
##$DBL= (0..7)
120 120 120 120 120 120 120 120 
##$DBP= (0..7)
150 150 150 150 150 150 150 150 
##$DBP07= 0
##$DBPNAM0= <>
##$DBPNAM1= <>
##$DBPNAM2= <>
##$DBPNAM3= <>
##$DBPNAM4= <>
##$DBPNAM5= <>
##$DBPNAM6= <>
##$DBPNAM7= <>
##$DBPOAL= (0..7)
0.5 0.5 0.5 0.5 0.5 0.5 0.5 0.5 
##$DBPOFFS= (0..7)
0 0 0 0 0 0 0 0 
##$DE= 6
##$DECBNUC= <off>
##$DECIM= 32
##$DECNUC= <off>
##$DECSTAT= 4
##$DIGMOD= 1
##$DIGTYP= 9
##$DL= (0..7)
0 120 120 120 120 120 120 120 
##$DP= (0..7)
150 150 150 150 150 150 150 150 
##$DP07= 0
##$DPNAME0= <>
##$DPNAME1= <>
##$DPNAME2= <>
##$DPNAME3= <>
##$DPNAME4= <>
##$DPNAME5= <>
##$DPNAME6= <>
##$DPNAME7= <>
##$DPOAL= (0..7)
0.5 0.5 0.5 0.5 0.5 0.5 0.5 0.5 
##$DPOFFS= (0..7)
0 0 0 0 0 0 0 0 
##$DQDMODE= 0
##$DR= 18
##$DS= 0
##$DSLIST= <SSSSSSSSSSSSSSS>
$$ [...]
##$SUBNAM2= <"">
##$SUBNAM3= <"">
##$SUBNAM4= <"">
##$SUBNAM5= <"">
##$SUBNAM6= <"">
##$SUBNAM7= <"">
##$SUBNAM8= <"">
##$SUBNAM9= <"">
##$SW= 18.0517328524113
##$SWIBOX= (0..15)
0 0 2 0 0 0 0 0 0 0 0 0 0 0 0 0 
##$SW_h= 3612.71676300578
##$TD= 16384
##$TD0= 1
##$TE= 0
##$TE2= 300
##$TE3= 300
##$TEG= 300
##$TL= (0..7)
0 120 120 120 120 120 120 120 
##$TP= (0..7)
150 150 150 150 150 150 150 150 
##$TP07= 0
##$TPNAME0= <>
##$TPNAME1= <>
##$TPNAME2= <>
##$TPNAME3= <>
##$TPNAME4= <>
##$TPNAME5= <>
##$TPNAME6= <>
##$TPNAME7= <>
##$TPOAL= (0..7)
0.5 0.5 0.5 0.5 0.5 0.5 0.5 0.5 
##$TPOFFS= (0..7)
0 0 0 0 0 0 0 0 
##$TUNHIN= 0
##$TUNHOUT= 0
##$TUNXOUT= 0
##$USERA1= <user>
##$USERA2= <user>
##$USERA3= <user>
##$USERA4= <user>
##$USERA5= <user>
##$V9= 5
##$VALIST= <valist>
##$VCLIST= <CCCCCCCCCCCCCCC>
##$VD= 0
##$VDLIST= <DDDDDDDDDDDDDDD>
##$VPLIST= <PPPPPPPPPPPPPPP>
##$VTLIST= <TTTTTTTTTTTTTTT>
##$WBST= 1024
##$WBSW= 4
##$XGAIN= (0..3)
0 0 0 0 
##$XL= 0
##$YL= 0
##$YMAX_a= 470586
##$YMIN_a= -555943
##$ZGOPTNS= <>
##$ZL1= 120
##$ZL2= 120
##$ZL3= 120
##$ZL4= 120
##$ABSF1= 10
##$ABSF2= 0
##$ABSG= 5
##$ABSL= 3
##$ALPHA= 0
##$AQORDER= 0
##$ASSFAC= 0
##$ASSFACI= 0
##$ASSFACX= 0
##$ASSWID= 0
##$AUNMP= <proc_1d>
##$AZFE= 0.1
##$AZFW= 0.1
##$BCFW= 1
##$BC_mod= 2
##$BYTORDP= 1
##$COROFFS= 0
##$CY= 11.3945322036743
##$DATMOD= 1
##$DC= 2
##$DFILT= <>
##$DTYPP= 0
##$F1P= 15.7292609196834
##$F2P= 12.9074282941183
##$FCOR= 0.5
##$FTSIZE= 0
##$FT_mod= 4
##$GAMMA= 1
##$GB= 0.15
##$INTBC= 1
##$INTSCL= 1
##$ISEN= 128
##$LB= 0.24
##$LEV0= 0
##$LPBIN= 0
##$MAXI= 10000
##$MC2= 0
##$MEAN= 0
##$ME_mod= 0
##$MI= 1.114404
##$NCOEF= 0
##$NC_proc= 0
##$NLEV= 6
##$NOISF1= 3.799351
##$NOISF2= 2.8
##$NSP= 1
##$NTH_PI= 0
##$NZP= 0
##$OFFSET= 15.70392
##$PC= 1
##$PHC0= -24736.96
##$PHC1= 17.2527
##$PH_mod= 1
##$PKNL= yes
##$PPARMOD= 0
##$PSCAL= 0
##$PSIGN= 0
##$REVERSE= no
##$SF= 200.130013532006
##$SI= 16384
##$SIGF1= 3
##$SIGF2= 2
##$SINO= 400
##$SIOLD= 16384
##$SREGLST= <1H.CDCl3>
##$SSB= 0
##$STSI= 0
##$STSR= 0
##$SW_p= 3612.71676300578
##$SYMM= 0
##$S_DEV= 0
##$TDeff= 0
##$TDoff= 0
##$TI= <>
##$TILT= no
##$TM1= 0
##$TM2= 0
##$TOPLEV= 0
##$USERP1= <user>
##$USERP2= <user>
##$USERP3= <user>
##$USERP4= <user>
##$USERP5= <user>
##$WDW= 1
##$XDIM= 8192
##$YMAX_p= 0
##$YMIN_p= 0
$$ End of Bruker specific parameters
$$ ---------------------------------
##NTUPLES= NMR FID
##VAR_NAME=  TIME,          FID/REAL,        FID/IMAG
##SYMBOL=    X,             R,               I
##VAR_TYPE=  INDEPENDENT,   DEPENDENT,       DEPENDENT
##VAR_FORM=  AFFN,          ASDF,            ASDF
##VAR_DIM=   8192,          8192,            8192
##UNITS=     SECONDS,       ARBITRARY UNITS, ARBITRARY UNITS
##FACTOR=    0.0002768,     1,               1
##FIRST=     0,             0,               0
##LAST=      2.2672688,     0,               0
##MIN=       0,             -555943,         0
##MAX=       2.2672688,     470586,          0
$$ Real data points
##PAGE= N=1
##DATA TABLE= (X++(R..R)), XYDATA
$$ [...]
1722C480l607l255N764r83m860M397J557n433K488L605n110K85M996l940k041
1737b657N525j993m332N277N34n761L484L380o029P73N533m662k371O389j959
1752A131n051N448J311o280K969M282n836j45N779l839l009N803j057m943M419
1767I82J708n559K212L735m782k50M891l222k447M952j053m126M133J076m855
1782b605K458L040m695L22M506l656j924N129j883l951M682P14n261L036L242
1797C154n332M52N073l912k392N619j448m529M529J386n480K367L720m791m54
1812b038M900k973k704M770q03m078L628J426m459J970K968l978j3L947k847j890
1828b174M224j221l415L759O98m309K294K717m325L44M077l234j865M606j314
$$ plain form
1722 3480 -127 -3382 2382 1399 -3461 936 2493 -2940 -452 3153 -1957 -1672 3324 -616 -2657
1737 -2657 2868 875 -3457 1820 2354 -3407 77 3457 -2572 -1799 3734 -928 -3299 3090 1131
1752 1131 -3920 1528 2839 -3441 -472 3810 -2026 -2171 3608 -231 -3240 2563 1506 -3437 982
1767 982 2690 -2869 -657 3078 -1704 -1954 2937 -285 -2732 2220 1167 -2959 1174 2250 -2605
1782 -2605 -147 2893 -1802 -1480 3026 -630 -2554 2575 692 -3259 1423 2137 -3124 -88 3154
1797 3154 -2178 -1726 3347 -565 -2957 2662 1214 -3315 1214 2600 -2880 -513 3207 -1584 -2038
1812 -2038 2862 -111 -2815 1955 1152 -2926 702 2128 -2331 -361 2607 -1371 -1384 2563 -284 -2174
1828 -2174 2050 829 -2586 1173 1871 -2438 -144 2573 -1752 -1408 2669 -565 -2430 2176 862
1843H62l698L926J046m592K202L079m377m4M374l000k275M453p48l957L419J475
1859B145m420J623L136l733m32L962k296k182L811m62l420K934J205l731J552
1874c08K475l306j37L378k418j673L625r31l038L158P97l690J761K609l682k1
1890a401L720k567j885L905p72l421L149J271l989J426K965l502n52L769k096
1905B0k243L615k24l398K626J508l569J021K805k896o61L317j650k108L059j80
1921A042k973K352J136l082J053K215k708k42K882j845j486K989o03k608K628
1936G50P91l250J473K247l076j73L275k183j854L456m60l191K597J397l519J011
1952g09K817k845r09L401j412k250K859L40l009J732J745k881L94K373k090q58
$$ plain form
1843 862 -2836 1090 2136 -2456 -254 2825 -1552 -1596 2778 -222 -2497 1956 1208 -2749 670 2145
1859 2145 -2275 -652 2484 -1249 -1681 2281 -15 -2197 1614 1152 -2268 666 1871 -1860 -308
1874 -308 2167 -1139 -1276 2102 -316 -1989 1636 705 -2333 825 1622 -2068 -307 2302 -1380 -1401
1890 -1401 2319 -248 -2133 1772 1000 -2421 728 1999 -1990 -564 2401 -1101 -1653 2116 20
1905 20 -2223 1392 1168 -2230 396 1904 -1665 -644 2161 -735 -1396 1921 271 -1837 1222 1042
1921 1042 -1931 421 1557 -1525 -472 1743 -965 -1207 1675 -170 -1656 1333 730 -1878 750
1936 750 1541 -1709 -236 2011 -1065 -1238 2037 -146 -2000 1456 996 -2195 402 1799 -1720 -709
1952 -709 2108 -737 -1646 1755 343 -1907 952 1292 -1717 15 1760 -1121 -727 1646 -444 -1302
1968a302K607j143j712K423r6k353J829J044k609R54J940k319k53K649j738j488
1984a567K914n41k623K386R86l209J176K441k909m95L242j658k162L130J02l206
2000a993K129J742l101L82K756k246j148K943p97k341K276N53k588J279J480k290
2016i64K68K001j670p37K235j032j410K228k21k090J818R13k637J007K001k531
2032h21l08K874j778j729K861j47k863K099J548l171O17K739k427j021L102j078
2048D97k239K577M64k828J426J745k561M5K338j718j036K379p29j794J991K77
2064H34k138J378J093k177N31J866j916l70K309j357j448K471l21k376J947J075
2080A401k836R81K204k588n18K995j470j989K835J13k935J889J684k903L65K554
$$ plain form
1968 -1302 1305 162 -1550 873 777 -1576 253 1297 -1312 -358 1582 -737 -990 1659 -79 -1567
1984 -1567 1347 806 -1817 569 1555 -1654 -478 1963 -946 -1441 1801 143 -2019 1111 1213 -1993
2000 -1993 136 1878 -1223 -841 1915 -331 -1479 1464 667 -1674 602 1155 -1433 -154 1326 -964
2016 -964 -696 1305 -365 -1102 1133 101 -1309 919 698 -1392 426 1339 -1298 -291 1710 -821
2032 -821 -1129 1745 -33 -1762 1099 952 -1911 188 1736 -1435 -818 1921 -506 -1527 1575 497
2048 497 -1742 835 1299 -1529 -103 1642 -919 -874 1464 -254 -1290 1089 360 -1434 557 834
2064 834 -1304 74 1167 -1010 -479 1387 -529 -899 1410 53 -1395 1076 755 -1621 326 1401
2080 1401 -1435 -454 1750 -838 -1356 1639 169 -1820 1015 1128 -1807 82 1766 -1137 -772 1782
2096A782k123j072K780r09k040K219L85k408J294J387k312M02K008j869o22K346
2112A248j109j466K257j23k237J787R47k529Q53J968k317m05K662j489j707K702
2128A042j90k598J945J265k766O72K336k295p09K853j234j978K586J58k628J632
2144I1J415k710M81K315k107p32K579j118j751K294N8k238J620J037k370P18J932
2161A514k117l43K351j392j395K454l56k314J964R10k640Q97K102k476l53K707
2177A513j478j700K775j79k594K000J141k714O63K238k208o71K673j271j775K527
2193I40q9k430J771J145k618O97K127k197m28K490j316j537K431k19k235J849
2209C81Q58k414Q03J882k309j77K430j586j353K573m74k315K134Q54k741J113
$$ plain form
2096 1782 -341 -1413 1367 458 -1582 637 1022 -1386 -92 1295 -1017 -615 1393 -476 -1098 1248
2112 1248 139 -1327 930 807 -1430 357 1304 -1225 -372 1596 -721 -1126 1536 47 -1660 1042
2128 1042 852 -1746 199 1464 -1302 -630 1706 -589 -1298 1555 321 -1657 929 1087 -1541 91
2144 91 1506 -1204 -723 1592 -515 -1247 1332 214 -1537 757 815 -1423 197 1234 -1136 -418 1514
2161 1514 -603 -946 1405 13 -1382 1072 716 -1598 366 1276 -1364 -467 1635 -841 -1194 1513
2177 1513 35 -1665 1110 931 -1663 337 1478 -1236 -573 1665 -543 -1214 1459 188 -1587 940
2193 940 851 -1579 192 1337 -1281 -584 1543 -654 -1082 1408 92 -1445 986 767 -1468 381
2209 381 1239 -1175 -372 1510 -799 -976 1454 -132 -1485 1088 614 -1701 433 1287 -1454 -341
2225c41J999k483k22K676j549j673K706k21k494J923J108k769Q30K139k250n59
2241a180K578j353j502K375j67k150J713R23k330Q04J786k167k76K407j525j301
2257a365K448m87k187K013P69k594J076J860k348j57K499j624j402K650m82k291
2273a622K058R03k611R34J981k413k63K511j448j528K425k45k221J805R92k455
2289a197P96J868k052l40K231j212j331K191k94k031J773P55k352R14J637k130
2305g74j23K255j505j205K419m94k121K003P70k520J010J773k216l15K468j372
2321E3j493K399j30k227J699Q94k307O50J841k002l48K204j209j321K118k51j837
2338a267J652P34k220Q26J607j997j70K077j264j304K233l04k014J684Q02k211
$$ plain form
2225 -341 1658 -825 -1047 1629 80 -1593 1113 892 -1602 321 1429 -1340 -510 1629 -621 -1180
2241 -1180 1398 45 -1457 918 751 -1399 314 1237 -1093 -289 1497 -670 -946 1461 -64 -1365
2257 -1365 1083 596 -1591 422 1191 -1403 -327 1533 -815 -972 1527 -97 -1499 1151 669 -1622
2273 -1622 436 1339 -1272 -338 1643 -770 -1033 1478 30 -1498 927 682 -1539 266 1258 -1197
2289 -1197 -401 1467 -585 -925 1306 94 -1237 954 660 -1371 402 1157 -1195 -281 1356 -774
2305 -774 -897 1358 -147 -1352 1067 573 -1548 455 1225 -1295 -285 1488 -728 -1043 1425 53
2321 53 -1440 959 829 -1398 301 1195 -1112 -462 1379 -623 -971 1233 24 -1297 821 570 -1267
2338 -1267 385 1119 -1101 -275 1332 -665 -835 1242 -22 -1326 907 603 -1411 273 1075 -1136
2354a136P86J633j892k82K159j221j316K094r3j997J507R28k213O80J679j853
2370e37l97K109j106j354K051j19j941J513Q38k015O28J570j702l85J985j092
2386D6j144J917j92j824J465P60k030O36J533j736k81J948j124j198J958p7j853
2403a196J365R47k015N40J590j624m70J909q64j309J763M1j778J137Q99j776M20
2420d21J488j457m24J782q25j159J662Rj705J267P98j861M82J514j511m98J820
2437I61p99j341J721J09j744J113R85j806L73J522j407n43J823p25j233J516J14
2454F39j586R21J009j690K30J475j263n84J593n58j190J444J73j495R19Q82j543
2471f24K37J399j257n47J660p02j117J476J43j643J029R18j729J95J603j256p40
$$ plain form
2354 -1136 -350 1283 -609 -891 1268 47 -1269 825 732 -1265 242 1170 -1043 -363 1316 -537
2370 -537 -934 1175 69 -1285 766 647 -1294 219 1057 -958 -330 1240 -462 -847 1138 46
2386 46 -1098 819 627 -1197 268 1028 -1002 -366 1167 -569 -850 1098 -26 -1224 734 657 -1196
2403 -1196 169 1116 -899 -359 1231 -393 -863 1046 182 -1127 636 677 -1101 36 935 -841 -421
2420 -421 1067 -390 -814 968 143 -1016 646 655 -1050 217 1015 -846 -364 1150 -361 -859 961
2437 961 162 -1179 542 651 -1093 20 1005 -801 -428 1094 -313 -856 967 242 -991 525 639
2454 639 -947 -26 983 -707 -477 998 -265 -849 744 186 -1004 440 613 -882 37 919 -624
2471 -624 -387 1012 -245 -792 868 166 -951 525 668 -975 54 972 -757 -562 1041 -215 -955
2488i55J726m67j335J432L95j713Q33J088j504j5J488j044p00J429k99j228J198
2505C29K38j356P30Q81j434K79J165j157l86J448n58j054J304J64j436R06Q61
2522I24j554J68J435j186o13J607n54j265J342L45j587Q15J074j500L9J412r53
2539e1p83J580l55j283J243L52j490O56J011j396n2J344r50o36J421l23j095J149
2557C42K47j395P68Q65j418K17J256j104m54J476n92j101J328J80j479Q60Q60
2574H56j521J45J447j117o59J562l72j273J327L23j519P04J011j391JJ361r94
2591a09o42J361l10j166J159L27j447P15Q87j388J60J220r53n43J433n14j043
2608h53J258J58j307Q15P28j356J94J188j087l77J339n73j034J373N4j439J011
$$ plain form
2488 -955 771 304 -1031 401 796 -917 -84 1004 -500 -515 973 -71 -771 658 359 -869 329
2505 329 567 -789 -59 822 -612 -333 832 -325 -711 737 179 -875 429 593 -843 63 924
2522 924 -630 -462 973 -213 -826 781 227 -1038 304 649 -938 -123 951 -549 -510 902 -51
2539 -51 -834 746 391 -892 351 703 -787 -131 880 -516 -568 776 -174 -810 611 288 -807 342
2557 342 589 -806 -38 827 -591 -374 882 -222 -676 800 208 -893 435 615 -864 -4 856
2574 856 -665 -520 927 -190 -849 713 341 -932 395 718 -801 -97 914 -477 -476 885 -109
2591 -109 -751 610 300 -866 293 620 -827 -112 775 -613 -453 767 -186 -729 704 190 -853
2608 -853 405 563 -744 71 799 -557 -363 825 -262 -639 700 127 -907 466 520 -919 92
2625I2P38j494K63J358j213m48J510n39j228J435J83j507P87R25j445R8J280r82
2643a87n27J404m76j051J194K69j369Q06P51j302J72J166j043m48J358n71r46
2660h00J278j3j300R31O30j401L59J209j244k56J388o09r92J418j36j301J031
2677A92P08j569M31J225j267m59J536o46j043J298J59j456Q98P75j359J53J277
2694H53j018m73J333m75r99J174Q7j209R01N35j270K76J052j134k07J268o68q51
2712h25J351j33j230J010N81j460M76J159j291k63J443p94r40J480n8j458J025
2729G3O85j484L86J197j195l28J413o86q92J378k6j344Q87O87j319K99J089j078
2747b58l22J270o39p82J165p2j173R84M39j266M57R73j171j35J349q08q23J364
$$ plain form
2625 92 830 -664 -401 957 -256 -704 806 267 -961 474 657 -850 -63 862 -583 -485 795 -187
2643 -187 -714 690 214 -837 357 626 -743 63 814 -488 -316 850 -193 -641 717 146 -800
2660 -800 478 465 -835 96 726 -675 -316 893 -351 -607 781 172 -820 598 462 -839 192
2677 192 900 -669 -238 987 -280 -739 797 151 -892 406 565 -891 7 782 -577 -424 853
2694 853 -165 -638 695 220 -779 395 482 -727 174 709 -561 -285 767 -367 -574 694 26 -825
2712 -825 526 393 -837 173 754 -706 -230 929 -362 -625 818 24 -916 564 506 -952 73
2729 73 758 -726 -340 857 -338 -666 747 61 -831 547 521 -823 64 751 -568 -269 820 -258
2747 -258 -580 690 51 -731 434 362 -811 173 612 -654 -197 776 -395 -530 819 11 -812 552
2765E52j19j338J121N97j531N11J111j326k78J494o80r86J331P7j405Q43P92j298
2783e32K13J116j003l47J249n96q08J141l4j060P87N20j236L62R41j119j48J264
2801G10p05p57J274j93j130J000M89j303M33J021j153k23J272o29r32J308K7j349
2819h40Q81O85j374L37J118j058l47J301n22r72J154J42j208P94N99j220K44R99
2837G13q91l83J158n17p95J102p7j063R20L58j148M20R08j080j13J208p34p45
2855g59J322j49j190Q66O29j347K74J143j106k71J231n43q75J178O2j158P25O63
2873F95j174J18J065q34l78J126m74p49R37Q1j040O00O11j118J94R62q83l18J120
2892E41m68p06J041l4j014P81M91j135K31J011j008k69J150n16q00J107K1j128
$$ plain form
2765 552 433 -905 216 813 -718 -207 904 -422 -700 794 114 -872 459 536 -869 -26 766 -532
2783 -532 -319 797 -206 -553 696 100 -708 433 399 -661 126 646 -590 -228 713 -406 -554 710
2801 710 5 -752 522 329 -801 199 688 -615 -182 839 -314 -537 735 106 -826 482 509 -840
2819 -840 41 726 -648 -311 807 -251 -598 703 181 -791 363 505 -703 91 690 -530 -286 713
2837 713 -178 -561 597 80 -715 387 310 -753 167 525 -623 -203 705 -375 -488 720 -14 -759
2855 -759 563 414 -776 90 719 -628 -354 789 -317 -588 643 100 -775 403 465 -693 32 695
2873 695 -479 -361 704 -130 -508 618 144 -605 332 413 -627 -27 584 -534 -340 622 -261 -579 541
2892 541 73 -633 408 374 -640 141 632 -503 -272 739 -269 -538 612 96 -704 403 424 -704
2910g04P24O14j167K42R90r04m11J183l23q82R75J00j031O30O08j019L6R55p21
2929a05m42R73k98p29Q78J41j068O50N41j010K25Q60p69l14J032m02q08R91J33
2948D79j105O74N96j118J10R72p64l98J088l89p93R67J50j029N41N92r70P8R38
2967F19p07m92J045k53q40Q53J87r83M14P09q76KQ50n73m51R33k25p89Q07K02
2987D32r20M66N78q86R2Q01o98l81J033l64q17R41P6r52N41O44r54J4R86p23n03
3008e94J106k34q80P58L64j033L86P39r02j04R35n88n30R75k19o94O70K31q13
3027d27L31O26q32KQ39n71l63P94j99p25P47J25q34M40N92q38J8P76o69l63R99
3048D68k78p61Q11K43j010M26O97r13n0R52o10n93J000o9q70O00M03q63K25P56
$$ plain form
2910 -704 20 634 -533 -291 699 -205 -616 567 244 -638 337 437 -594 36 644 -375 -339 616 -105
2929 -105 -547 426 128 -601 277 418 -650 0 541 -469 -244 616 -153 -467 565 163 -645 346 479
2948 479 -626 48 644 -474 -364 608 -156 -554 534 145 -648 319 469 -560 -19 573 -397 -319 619
2967 619 -88 -580 465 212 -628 225 412 -571 -157 552 -324 -322 528 -45 -496 437 212 -577 230 432
2987 432 -488 -22 556 -330 -238 563 -135 -516 517 153 -664 277 353 -599 -58 586 -368 -354 632 -91 -594
3008 -594 512 278 -602 156 520 -513 -127 612 -290 -394 541 -47 -577 398 179 -515 155 386 -427
3027 -427 -96 530 -302 -300 539 -32 -395 399 200 -525 222 347 -487 -47 545 -293 -275 501 -168 -531 468
3048 468 190 -571 240 483 -527 -101 596 -317 -367 585 -25 -618 382 313 -557 43 446 -417 -192 564
3068E64q05q0P69m52m15P31j04o57N95K49p70L61N16p56nP00n35l49Q75l08o92
3089e68P41K39q92M29N79q86M3R24o79m39R34j69p85P12K76r55L53O41p32j85
3109d19R26n15n41Q18K5p83O02K90p58K33N95o60k4O74m29m23P64j87o38O53J20
3130C23p82M22N12p94K8Q23o51l55Q77k20p01P64J45q60M03O46q30q2Q40m74n81
3151e47R23q5q48O35L38p91K49N66o58j27P49l59m19O67j14n97N57K33p78L28
3171g8N24p12j1P18n30l40P50j99o55P60J31q33M17N62q75J35P82n94m48Q83j67
3192B20p06P03J77q54L63O15p43j00P88m72m28P65j41o37N69K85p25K48M79n56
3212a50o7O04m42k88O47k53m88O27Q8p16M29L70p09J27O63n40l48Q12j99o33O85
$$ plain form
3068 564 -241 -321 448 -4 -419 312 208 -449 146 395 -375 -14 502 -254 -259 441 -94 -443 432 124 -568
3089 -568 173 412 -480 -51 528 -358 -315 609 -70 -509 425 256 -529 183 459 -496 -143 498 -234 -419
3109 -419 507 -8 -549 269 294 -489 113 403 -355 -122 473 -187 -211 463 34 -389 375 188 -450 203 323
3130 323 -459 -37 475 -319 -291 532 -119 -474 403 183 -518 246 391 -469 -66 580 -250 -332 508 34 -547
3151 -547 376 291 -557 78 416 -375 -126 440 -218 -345 404 45 -374 293 179 -418 139 372 -406 -78
3171 -78 446 -266 -277 441 -89 -429 321 122 -533 227 358 -475 -58 504 -371 -236 546 -48 -496 387 220
3192 220 -486 217 394 -460 -97 518 -225 -325 463 -9 -437 328 187 -450 119 404 -321 -73 406 -150
3212 -150 -217 387 -55 -343 304 51 -437 190 278 -438 -9 361 -348 -221 442 -98 -446 366 167 -466 219
3233B19J80q16L73N81p59r9Q07m88m72Q06j43o76N24L56p21K14N65o69p0O84l84
3254A2l56N89q6n04M60J43n99K88M16n97RO49n75k00O75k69m90O20J61p60M49
3275C5M67q03M5P72o06l46Q28j63q14P34K44p85L35M90o63j31P39l26m54O65J9
3296B82o40M56J88n59K59L50m91o1O17m37k54N67j91m80N49J13o52L71L70p24
3316c67J48O06m62l09P78k47n99O94J34p53L14N15p16J4O75m59l75O52n8o51N35
3337F9K85o80K26N57o06j20O29l37l42N15Jn32L97K33o07K89L47n89L1O08m71
3358i7k05O09j68n34O37lo14L76M02o71R7O29m85l90P90k10o26O45J65p40L01
3379i2N67p15o6O87l67m37O43l2n73M63K41o02J43N18m62j51N37l21l40N46o5
$$ plain form
3233 219 399 -417 -44 537 -222 -321 486 -2 -474 332 189 -487 37 393 -328 -114 451 -218 -288 396 12
3254 12 -344 245 159 -345 115 258 -341 -53 363 -234 -225 424 -151 -351 324 55 -435 185 346 -414 35
3275 35 502 -301 -256 516 -90 -436 392 229 -585 149 393 -392 -57 433 -230 -361 378 52 -402 263 282
3296 282 -358 98 286 -273 -14 336 -155 -216 401 -36 -290 277 86 -394 155 268 -384 -13 357 -367
3316 -367 -219 387 -75 -384 394 147 -452 242 376 -377 -63 452 -264 -250 425 -34 -409 243 185 -466 69
3337 69 354 -326 -100 457 -149 -269 360 23 -319 196 197 -335 62 295 -312 -23 324 -265 -234 374 -97
3358 -97 -302 307 139 -395 242 239 -375 1 403 -268 -171 458 -27 -417 373 163 -463 182 347 -393 -92
3379 -92 475 -240 -306 381 14 -423 220 188 -385 78 319 -283 -140 378 -84 -235 302 -19 -359 187 122
3400A22m50M06J42n26K83L49n64N2N60l96k63O32k41m88N40J81p13L55M56p17
3420b80QP18m87m02P51j06o39N18L51p11J95N20n39j96O63k98m04M68J21o07L98
3441D2K10m81J17L68m24j08N46k64l02N70j72m85N49J03n43K60L95n92RN53l69
3462a8l21O33j58n79O01R3n85K46N04o20n5O03l34l78O21jn97M22K83o14J27M94
3484C67n04j33N75k78l67M91K2m82L45J95m45J93L26m58q6N74l21l30N98j50m81
3505c49M79J84o45K19M61n74k5O12m02l80O49m2o16M81K64o22K13M92m92j93O31
3526C45k59m86O02L6n90L99K49n03J00M21m13j63N68l03l12M92Qm41K65K64m99
3547b20J41M10m41r2M71k68l22M98l0n12M58J47n82K26M49n27p9N55k29l71N78
$$ plain form
3400 122 -328 78 220 -306 -23 326 -238 -186 374 -22 -285 347 106 -382 158 339 -374 -19 437 -280
3420 -280 -272 446 -41 -443 308 202 -437 81 432 -279 -84 436 -103 -299 364 66 -338 130 251 -356 42
3441 42 252 -229 -112 256 -168 -276 270 6 -296 274 102 -383 166 269 -274 -14 381 -211 -202 351 -18
3462 -18 -339 294 136 -443 158 251 -334 -88 416 -204 -259 344 10 -368 253 252 -345 77 360 -254 -127 367
3484 367 -137 -270 305 27 -340 151 173 -309 36 231 -214 -21 305 -153 -239 335 14 -316 282 132 -349
3505 -349 130 314 -331 -112 349 -225 -250 362 -40 -420 229 187 -429 52 316 -306 -93 399 -93 -286 345
3526 345 86 -400 202 238 -352 47 296 -207 -107 314 -99 -262 306 3 -309 183 191 -250 15 279 -220
3547 -220 -79 331 -110 -202 269 1 -321 177 147 -365 93 240 -342 -116 333 -194 -273 282 53 -318 260
3568B60l3o11M31L12n95P0N18n25j31N40j82m18M76R8n30L22L01m84L3M78m45
3589a15r3M66j61l68M08n0l49L23J58m77J43M46m97l6M64k65l28N51n8m67M00
3610I5J93n37J57M90n26j26N84k88l98N44P2o30L18M13n77K6N11l15k73N16j42
3631A07l89M00J42n11K15L28m90R5L09l06j30M25j86k56M05n7m23L87J27m58J77
3652h9M10m74o0N63k80l78M70M8n80M02K94n33O4N10l95k78M89n0m50L89J87n46
3674b87K82K05l48K1M08k85j80L75j57k82M16Qm26K09K70m52J11M01m51n3N04
3695B89k81k89M96J7n39L91L01n70Q7M38m37k12N50j64m50N29R4n19K07L36m69
3716a95KM93l25k21M63j15l37K67J88l83J53K40l90O8L69l78j17M45k29k65L65
$$ plain form
3568 260 227 -384 47 359 -236 -166 352 -173 -304 236 54 -364 112 210 -320 2 303 -181 -148 330 -115
3589 -115 -208 258 97 -271 137 87 -262 61 219 -258 -115 331 -166 -202 262 -3 -331 220 162 -305 95
3610 95 288 -249 -92 398 -128 -254 330 42 -356 188 260 -370 -52 361 -216 -190 321 6 -267 249 107
3631 107 -282 118 260 -251 -36 292 -198 -103 206 -100 -230 195 9 -247 158 101 -322 65 192 -266 -89
3652 -89 321 -153 -213 350 70 -308 162 210 -370 32 326 -207 -143 367 -28 -306 183 133 -317 72 259 -287
3674 -287 -5 200 -148 -127 281 -4 -184 191 34 -248 168 176 -250 -41 229 -223 -112 289 -162 -215 289
3695 289 8 -281 215 232 -307 84 385 -185 -98 340 -97 -309 241 77 -373 156 250 -269 -62 274 -195
3716 -195 -193 300 -25 -246 217 102 -235 32 220 -163 -10 230 -160 -92 277 -101 -218 227 -2 -267 98
3737I8L4m56L22K97n17Q1M93m51j53N21j65m67N42Q7n54K15L78n14j3N22k46m13
3759c59N65l8m39K85J62l46J16L08l52n9M00k97j80L79o0l13L74M8m47K34K48
3780B29m71P7M74l96j25M53k25l16N03N0n33K62K93m98Q8M28l27k59N13j30l96
3801c06M08N4m43K42L24m30l7M16k35j79L38J6l86K60J86l96J30K99m04j4M07
3822B50l34j41M58k09k92M36L9m75K80K38m91J50M32l98j40M99j98l88M45O7m92
3843b64K23L72m82p4M48k18l06M70q6l88L33J51l25J01K85l67k9M10k41j91L77
3864A99j43k96L73l1l62K21K94m27Q8L84l51j41M25j34l75M74J0m50J86L38m43
3885a61N2L90l21k69N14j05m57M07J82m72K12K48k92j20M04k42j73L84p8l47L08
$$ plain form
3737 98 132 -324 -2 295 -222 -141 352 -99 -252 269 104 -363 179 266 -288 -73 305 -209 -222 300 54 -359
3759 -359 206 168 -271 14 176 -170 -54 254 -98 -157 243 -54 -234 145 85 -228 146 194 -253 -19 229
3780 229 -242 -165 309 -87 -212 241 16 -300 203 253 -280 -18 275 -223 -135 293 -34 -293 220 90 -306
3801 -306 102 156 -287 -45 279 -151 -188 228 -7 -186 152 168 -218 42 228 -168 -38 261 -143 -157 250
3822 250 -84 -225 233 24 -268 168 207 -268 12 250 -241 -91 341 -57 -197 302 104 -284 161 228 -264
3843 -264 -41 331 -151 -225 223 5 -301 169 83 -305 28 179 -146 -45 240 -127 -156 254 13 -178 199
3864 199 56 -240 133 102 -260 -39 255 -172 -84 300 -51 -192 233 99 -276 198 208 -242 -56 282 -161
3885 -161 -109 281 -40 -309 205 100 -357 50 232 -240 -28 220 -72 -192 212 -30 -203 181 103 -244 64
3906F4Q7m04K80K02m19jM40l07j07L68j46l25M10Q6m91K93K21m46R5M17l63k39
3928b85M35j14l22L99R0m76K11K79m20L2M21l10k22M66p2l58L25J21l63J31K99
3949B67l80lL10k66j23L46n9k88L01N9m15K44J99l42M9M06l44j78M78j60l45L44
3971A00J22m57K46K79m31j6L75k66k21M34j29k94L54O7l63J61K84m07k0M63k79
3992Bk06L87r5l08L12R1l99J81K58l67L1L47l38o2L28q9l24K96J87l99J94K09
4014B36m23J32L20l18j92M78j90l23L76L8l89K36J94l18N2L17k49k17M69j05l32
4035b08K89J66m45J74K52l06n3L12k17j30K96l9l04L03O8l77K10K03l89J00L61
4056B66k98j32L87j98k29L32jl67K30J80l15J9L74k59j79L86j02k74K48J45l80
$$ plain form
3906 64 151 -253 27 229 -190 -191 249 -58 -165 203 57 -268 142 228 -263 30 251 -195 -100 317 -46 -285
3928 -285 150 36 -286 113 203 -273 -62 217 -203 -171 250 -60 -282 184 112 -246 79 200 -163 -32 267
3949 267 -113 -116 194 -72 -195 151 92 -196 105 164 -251 -7 192 -150 -101 305 -39 -217 261 101 -244 100
3971 100 222 -235 11 290 -141 -157 218 -48 -269 165 36 -258 96 163 -200 -39 245 -162 -182 281 2
3992 2 -204 183 88 -220 92 183 -216 -35 223 -144 -113 234 -104 -166 162 73 -251 45 232 -167 27 236
4014 236 -187 -55 265 -53 -245 233 43 -280 96 134 -255 -19 175 -143 -91 226 -23 -240 229 124 -208
4035 -208 81 247 -198 -24 228 -78 -131 181 -36 -166 130 91 -213 90 158 -219 -9 194 -195 -95 266
4056 266 -32 -164 223 25 -204 128 127 -240 -10 170 -145 -126 248 -11 -190 196 94 -180 68 213 -167
4077a67J53K86l97k9M72l40k48L98m8k61K43P1k98J38J88k68j9K83j85j31K90
4098A31o1k26K33O4l34J54K40l20L9K83j88k29L90j24k62K80P9l68J66K75l56
4119a34k3L69k39j52L71n7l97L17J56l80J12K55l06k2L21j76j82K46j5k17J73
4140B0J62l34J10K39k64m5L10j78j53K56n6k78K63mk48K02K31l05p2L41k09j47
4162a59L32j23l04K96J28l35J23K86l12r1L90k05k03L08ql45K38J28l00J10K41
4183A95k53j22L67j47j90K02P5k86K20P6k82J09K19k15p0K79j48k53L51l6l11
4204b20K52J30l36R7L28l72k7M03k26k43L86mm24L28J52m45J37L43l15j30K89
4225A03j12k11K80J01l37J58K15l07j8L71l00r8K95o7k17K33Ok66K61M8k86J34
$$ plain form
4077 -167 -14 272 -125 -154 318 -22 -270 128 80 -181 62 133 -165 -27 161 -107 -126 157 -28 -159 131
4098 131 70 -156 77 141 -193 -39 201 -119 -80 203 15 -214 176 52 -210 70 149 -219 -53 222 -134
4119 -134 -157 212 -27 -179 192 135 -262 55 211 -169 -57 198 -108 -130 191 15 -167 79 64 -153 20
4140 20 182 -152 -42 197 -67 -112 198 20 -133 123 67 -211 52 48 -200 2 233 -72 -144 197 -12 -159
4162 -159 173 50 -254 42 170 -165 -42 244 -68 -159 231 26 -177 131 123 -222 16 144 -156 -46 195
4183 195 -58 -180 187 40 -150 52 127 -159 61 137 -145 -36 183 -32 -102 177 29 -224 127 91 -220
4204 -220 32 162 -174 -77 251 -121 -148 255 29 -214 172 168 -256 72 224 -221 -84 259 -56 -186 103
4225 103 -9 -220 60 161 -176 -18 197 -110 -128 243 -57 -155 140 73 -144 89 95 -171 90 138 -148 -14
4247a4K74l98kK93j70j45L30p2l05K69K00m01L4L70l61l3L44j90k47K79P2l10
4269a83J61J70l02L6L37k88j25L69j36k56L05P9k88J47J59k90L8K89k84r6L31
4290A73j67j67K98l7k97K36R8k73M1K78k31q5L59j86k45K99K0l77K43J85l23O3
4312i5L54l23j41L38n4l52L22J21l88K10J76k85K3K68j76j28L09j30k39K80O5
4333A55l35J84J47l31J24K03k13o1L19j79k12L57m6k99K18J02k43mL83l50k5K53
4355A47j40k46L05O0l45K38J80l66O4L35l01l6K65j29k39L02P3l15K09J82l47
4376a04J3L13k79p7K64j09k33L09Nl09K84P0k75M6K98k84nK63j51k34L40m6l77
4399b78L10J49l06J5L33l15j6K98j48k34K58J1k82K42J77l22N5K45k01j39K51
$$ plain form
4247 -14 260 -138 -140 153 -17 -162 168 96 -209 60 260 -141 -107 263 -98 -131 213 23 -224 55 127 -183
4269 -183 -22 148 -154 -118 219 -69 -194 175 39 -217 88 167 -121 26 185 -105 -67 222 -62 -158 173
4290 173 6 -161 137 100 -197 39 137 -136 -95 183 -48 -133 226 40 -205 94 114 -263 -20 165 -158 -95
4312 -95 259 -64 -205 133 79 -273 49 170 -218 -8 168 -117 -94 174 -2 -130 179 49 -190 90 155
4333 155 -180 4 151 -180 -56 147 -66 -127 192 13 -199 158 112 -187 31 133 -110 -114 269 -81 -106 147
4355 147 7 -239 66 126 -219 19 199 -167 -103 232 -69 -105 160 31 -208 94 167 -148 61 243 -104
4376 -104 -91 222 -57 -134 130 21 -212 97 102 -207 77 147 -128 -82 216 -68 -73 190 39 -195 145 99 -278
4399 -278 32 181 -125 -110 223 -92 -108 190 42 -192 66 77 -205 37 214 -108 -53 192 -9 -148 103
4420A03j15j93K42Q7l32K29J64l15L1K21k00p5K79j16j69K48j8k42K60O3l21J12
4442e7K66k98j5L16k14k29L38L1l08J70K03l18M1L15k88j21L65j24k47K37mk13
4464a54J95J12k75K9K44k21n9L19k16j15K40qk39J59Q7k53J39J83k31qK99k05
4486B2j29K22Ql42K49J24k82Q8K20k69jK79j49k11K80Qk70J78J39k58N9J28j93
4509a00l2K47j15j91K91pk98K18J57l29J35K23k70j8K25j34j30K38r7k07K06J22
4531A34k50Q4K21k35q4L03j73j95L57j08k41K65P6k79P9K05k07k1K05j10j31K20
4553A15mk74J62J41k89Q9J93k30L6K18j83j49K78l3k44J99J30k50K9K98l08J4
4575f2K50j36j84J84L1k92K39O0k03M5J99j87o9L03j71j21J84Jk30J87P6j72J4
$$ plain form
4420 103 -12 -205 37 124 -208 21 185 -130 -99 122 -78 -153 126 10 -159 89 71 -171 89 152 -169 -57
4442 -57 209 -89 -104 212 -2 -231 107 138 -170 0 203 -115 -74 241 -47 -168 197 73 -174 63 59 -154
4464 -154 41 153 -122 -93 151 -70 -129 190 -26 -141 99 91 -148 11 98 -155 -16 167 -64 -72 227 22
4486 22 -107 115 123 -219 30 154 -128 -40 180 -89 -90 189 40 -171 109 117 -153 25 164 -94 -35 93 -100
4509 -100 -132 115 0 -191 100 93 -205 13 170 -159 -24 199 -71 -89 136 2 -128 110 13 -194 12 134
4531 134 -116 -32 189 -46 -130 173 0 -195 162 54 -187 78 154 -125 -46 159 -48 -69 136 26 -105 115
4553 115 111 -163 -1 140 -149 -60 133 -97 -61 157 -26 -175 103 70 -174 25 155 -95 -66 232 -76 -62
4575 -62 188 52 -132 52 83 -209 30 90 -113 -68 131 -56 -125 178 7 -114 70 71 -159 28 104 -68 -54
4598e4K08k02j05K62r5j47K47m5k21J37J63k69N8K18j74m5K24j17j78K53l4k72
4620a88J94J19k33P7J83j90p3K07o1k53K62N1j88R5J11k47J22J19k17M6K14j35
4642A5j80L01q0k36J23K26l35J65J94k88j4K61j09k07L08pk64J65J46k53pK41
4664A65j63j46K74j19j26K08m5k00K03Q1k46P6J89j91j06K78j09k22K75P0k87
4685a41J72Q2j33n2J92j82r8K67n9j87J83O2k76K26J01k93N3K28k13k3K59j10
4707E8k27K67L2k99J77J14k22PK46j79j52K65r6j42J62N9k37J80R2j62kK44k26
4730d1l3K32q8j69J80L7l23J85J52k71OL27k11q8K21k4k51K13J48l67J33J85j89
4753c6JJ98j58j11J86nk65K45N1k28M4K08k10lJ90j31j18K42J7k36J85O5k45Q7
$$ plain form
4598 -54 154 -48 -153 109 14 -133 114 69 -152 -15 148 -121 -63 155 -19 -64 160 43 -135 118 84 -188
4620 -188 6 125 -108 -31 152 -38 -111 96 35 -218 44 95 -93 2 113 -134 -12 107 -110 -64 150 15
4642 15 -165 136 56 -180 -57 169 -166 -1 193 -95 -109 152 43 -164 144 137 -127 38 184 -69 -76 165
4664 165 2 -144 130 11 -115 93 48 -152 51 132 -114 -38 151 -40 -146 132 23 -199 76 146 -141
4685 -141 31 113 -20 -72 120 -62 -160 107 48 -139 44 106 -170 56 157 -136 -83 145 -68 -91 168 58
4707 58 -169 98 130 -169 8 122 -100 -93 153 -26 -178 87 -9 -151 11 70 -167 13 105 -57 -59 185 -41
4730 -41 -74 158 70 -99 81 118 -205 -20 132 -139 -133 194 -17 -105 116 92 -159 54 202 -165 -32 153 -36
4753 -36 -35 163 5 -106 80 75 -190 55 106 -122 -78 130 -80 -83 107 -24 -142 100 117 -119 66 131 -114 -27
4777b7J62k05%K37k05q5K49q7j69K09K9l14K59J41l36K5K68k30k9K90j20l35L35
4800F2Q1k94J06J99k13m4K80k15j34K39j0j68J65J06l36J80J67k79L1K34j49j43
4822a35K40p8j94K24L5k08N3J95k30O1J68j46j74L56j39j93L01K6l12J31J97k92
4844a14j0K94k14j52K65j1k06J92J09k89J19J72k65J2K26j39j14K47r1j33J46
4865D4Q5k49J48J27k43L4K24k51q8K73o1j80K06K5k36J44J32k30MK25j50r3K30
4888A20n0k26K42M6l23J72J74k56o9L06j26j35K18q5k22K48P5k15P7K07k57K4
4910e5K53k52m3K27p4k20K27J3k72J48J62k28M0K75k56m8K39o7k53K77L4k90J57
4933fJ31k01j3K36j48j30J98j0k00K25qj76N9K02j72n6K13j18j32J92p2j49J87
$$ plain form
4777 -27 135 -70 -70 167 -38 -123 126 39 -130 79 108 -206 53 194 -142 -117 151 -79 -108 182 62 -273 62
4800 62 143 -151 -45 154 -59 -103 177 -38 -172 67 57 -111 54 160 -176 4 171 -108 -77 157 8 -135
4822 -135 105 27 -167 57 92 -116 -63 132 -98 -37 131 -15 -189 167 28 -165 136 162 -150 -19 178 -114
4844 -114 -124 170 -44 -196 69 58 -148 44 153 -136 -17 155 -110 -98 128 -11 -125 122 31 -102 44
4865 44 129 -120 28 155 -88 -54 170 -81 -169 104 43 -137 69 94 -142 2 134 -96 -92 133 -17 -110 120
4888 120 70 -156 86 132 -191 -19 155 -101 -170 136 10 -125 93 8 -214 34 109 -106 -29 178 -79 -55
4910 -55 198 -54 -97 130 56 -164 63 76 -196 -48 114 -114 -74 201 -55 -103 136 69 -184 93 127 -163 -6
4933 -6 125 -76 -89 147 -1 -131 67 57 -143 82 74 -102 -43 159 -13 -69 144 26 -106 86 14 -135 52
4956E2K6j95J21J43k34JK54j95j02K86j27j88K18lk55K18J23k65N1K36k18m4K46
4979A49j22k07K21M4j98R3J57k85O4K07j55p9J60J6j82K13N7k74J30R2j70K8J68
5002A27j60j00K56r7j81K09k1j42J16J61l10J08J35j22l5J57p0j56J85N2k22J05
5024eJ34k36j8K29j46r8K68l7j62J03O7j86L5K02j67k0J73j44j06K24p3k10K22
5047D9J2j54J04J37k04kJ55j20n7J32J1j84J39M6j77O3J54j75K7J45q7j11J86
5070H9n9r5J65m6k06J50J00j86N8Q2m0j01K03j00j00J26M6j78J27M3j25LJ31k5
5094F2j80K09n5j52J44J8j62J49M5k31J00J86j06r6J64l3k08J70K9j48J01R1j35
5117c8k7J66r3j04K01l7j63J43K0j71Q1J49j55k3J30o5j06K00q0j53J01O5j16
$$ plain form
4956 52 78 -117 4 147 -87 -86 168 -27 -129 157 30 -158 60 57 -198 20 143 -122 -71 165 -53 -97 149
4979 149 27 -180 41 85 -113 -20 137 -148 -84 123 -32 -111 49 65 -117 96 153 -121 9 101 -69 -41 127
5002 127 -33 -133 123 26 -155 54 33 -109 7 168 -142 -34 101 -21 -56 101 31 -125 60 112 -110 -5
5024 -5 129 -107 -125 104 -42 -140 128 91 -71 32 99 -87 -52 150 -17 -37 136 -8 -114 110 37 -173 49
5047 49 61 -93 11 148 -56 -58 97 -23 -80 52 63 -121 18 64 -113 -50 104 -71 -44 101 14 -97 89
5070 89 30 -65 100 54 -152 -2 98 -88 -30 52 12 -89 114 14 -86 40 86 -92 35 78 -47 -44 87 62
5094 62 -118 91 36 -116 28 46 -116 33 78 -153 -53 133 27 -69 95 62 -146 24 53 -95 6 97 -38
5117 -38 -65 101 8 -96 105 68 -95 48 68 -103 -22 127 -28 -51 79 14 -92 108 28 -125 -24 41 -75
5140g5N6J26j52J6J09n5j14K02q7j39J85jk21J19J67j49p4K24j40q5J97r2j32
5163a15J53Q2k00j8K56k12k0J52o2q0J43k7q5M1P1j66N8R2j15MJ23j03o1J33j0
5188C4j72J56R8k33J16Q5j19qJ84j23j11J80J2j14J06K2k45J26J40j85J8J05r7
5211b5o1J73l9j47J36L2j23R2Q5j79q1K43j33r3K10p3j22J34P8k29J61L2j63M3
5235d9J08r6l5K06m2k16J93Q2k62P2J75k03PJ95j71l3J51M3k73J58R3j87O8J53
5259A37k11l1K40j93j22K28N5k06R9Q7k05Q6J65k07K4J23j08j05K17k4j60R1P5
5282E5j94J15K02k01m8K27j42q5J71m5j29Q3O1j55N7J42k02J0J63q6o2J16k4j54
5306a25J55M0j44P6J16j82L2J87j57j54K23Pk44J24J47k16N6J76j89K7J70j15
$$ plain form
5140 -75 -19 107 -45 -29 80 25 -89 113 26 -113 72 71 -150 -31 136 -13 -87 137 -3 -88 109 17 -115
5163 -115 38 120 -80 -98 158 -54 -74 78 16 -64 79 52 -33 8 79 -87 -29 63 -52 -48 75 -28 -89 44 34
5188 34 -138 18 116 -117 -1 84 -35 -43 141 18 -93 87 99 -15 91 113 -132 -6 134 -51 -33 72 -25
5211 -25 -86 87 48 -99 37 69 -54 38 123 -56 -137 106 -27 -120 90 17 -105 29 107 -122 39 71 -92 -49
5235 -49 59 -37 -72 134 92 -124 69 151 -111 -39 136 -67 -60 135 -36 -69 82 125 -148 10 103 -84 -16 137
5259 137 -74 -105 135 -58 -180 48 103 -103 -4 83 -122 -36 129 -78 -54 69 -39 -144 73 49 -111 -20 55
5282 55 -139 -24 178 -23 -71 156 14 -71 100 55 -74 9 70 -85 -28 114 -88 -78 85 -1 -63 53 29 -125
5306 -125 30 70 -74 2 118 -64 -32 155 -2 -156 67 74 -170 -46 101 -115 -59 117 -72 -45 125 10
5328A0j39K48l7j73J61jj85J23O8j08l6K18j41q1J05Pj78J54N7j90O6J74j43m3
5352f4J79j06j08J50pj87K81j1j88K9J92j76l5J69j24j56K36oj83J25P2j71O4
5375b5J42j53LJ27j12p8J75l5j36J48rj46L4J28j27k5J47n6r3J91j0j95J21P2
5399H8j52O3J10j41n6J97j47r5K26Jj76P9K7o7L5J23j57p0K10j00j04J82k6j00
5423e0M6J23j75L3J00j76K8J49r6j22J49L7j42J45K0j75N5J39j50mJ91r3j42J97
5447H7o6j43J72P4j81L1J62k07KK04j28m4P2N4j56N8R5j43L0J48j24q8J42n6r5
5472a00J16Q8k09Q7J4q2L4J48j22N3M2n9o2J70j00j24J35K5j01L6J32j63k8J41
5496G1o8p3R7K4j14P6O4j22kK05j59o8J77r5p6J63p9j53J58O3j81J2J42j16J5
$$ plain form
5328 10 -129 119 82 -91 70 69 -116 7 75 -33 -69 149 8 -73 32 39 -139 15 72 -118 -52 122 -21 -64
5352 -64 115 9 -99 51 44 -143 138 127 -61 -32 160 -16 -51 118 -6 -162 74 68 -115 10 82 -89 -25
5375 -25 117 -36 -33 94 -18 -96 79 44 -92 56 47 -99 -65 63 -64 -89 58 2 -91 100 90 -105 16 88
5399 88 -64 -1 109 -32 -88 109 -38 -133 93 94 -82 -3 24 -43 -8 115 -42 -112 98 -2 -106 76 50 -50
5423 -50 -4 119 -56 -23 77 -99 -71 78 -18 -140 9 46 -96 49 69 -106 -51 88 -62 -66 125 32 -110 87
5447 87 21 -122 50 124 -57 -26 136 -71 -69 135 7 -37 35 89 -67 -9 86 -57 -27 121 -3 -91 51 -5 -100
5472 -100 16 104 -105 -18 -4 -86 -52 96 -26 27 69 10 -52 118 18 -106 29 54 -47 -11 121 -42 -70 71
5496 71 3 -70 27 51 -63 13 77 -45 -47 158 -1 -69 108 13 -63 100 21 -132 26 89 -92 -80 62 -54 -39
5521c9J02r3k7R5k1r4N6M5j42J27J17j81LJ57j03q4J60o7m8P2K3j43J16lm6q5
5547a03K08p7j35K43q6j54Q4J25j79M9J16j47J0J09n8q2R5J4j56J16P4j17K5R2
5571F6r5K1O7j23M6J09l5q6J21n8j16N5J15j51L5J34j01j17K31p6j48J18Q7j68
5595f9K9J14o4o7J60o3j79K04Jj68J12P6j60O4P8o5o4J22n8j11J74Mj41Q8O6j46
5621f3J03R0j45J8J06o4j11J55n7j55J54L1j89J12J14j52n2K47q5j58J52Lj27
5644g3R8Q8j88K1J31o6l8P4r6m6J22m5k5M2M6j20P9N8j05J9J22j03j09K08m0j35
5670h1J07M8j31O9P2j61J3J62p9j34J55J7j84J46J11j64K3R7j44M4N7k2j61J39
5694aJ54k50J58%j71Q7J36r9j03J32k5q2J12j2q6R6j3o4R3Lj19PJ55j21n9J20
$$ plain form
5521 -39 63 -30 -57 38 17 -77 -21 24 -118 9 126 -55 -52 105 2 -82 78 11 -37 35 58 -85 31 28 -18 -103
5547 -103 105 28 -107 136 50 -104 -20 105 -74 -25 91 -56 -46 63 5 -77 18 32 -124 -8 66 -51 -26 66
5571 66 -29 -8 59 -64 -18 91 56 -30 91 33 -83 -28 87 -64 -29 105 4 -113 118 42 -106 12 99 -69
5595 -69 -40 74 10 -57 103 40 -139 65 66 -102 10 86 -74 -10 68 3 -61 61 3 -108 66 70 -71 17 83 -63
5621 -63 40 130 -15 3 109 45 -66 89 32 -123 31 62 -127 -15 99 -53 -105 142 57 -101 51 54 -73
5644 -73 25 113 -75 -54 77 11 -27 47 -49 -95 27 -18 -43 -1 45 -75 4 62 -43 -24 98 -5 -114 94 54 -81
5670 -81 26 74 -57 12 84 -77 -64 98 19 -115 40 57 -127 19 130 -34 -11 86 -58 -14 43 21 -140 -1
5694 -1 153 -97 61 61 -110 -23 113 14 -89 43 18 -64 48 36 -50 46 33 -31 62 65 -54 -47 108 -13 -72 48
5720D8l4j02J49N0k23Q7J14j99N9J30p5p3J24O2k05O8J47j51RQ3o4q0J20n4kM
5746hN3r6K2J35j93Q9P3o9jP4j22%J26m4j57J57L6j35P6N6j62M1J03j08n1K13
5772A08n5j02O2N3j51N6J08j53pJ12N6j73J88n7r7pJ39j72O1J27j26qR8l6j08
5797h4J40L7j66J17J8j42P6O6j44K0J64j15j04J44nj01J05K1j48P3J74k31L3J69
5821A17r2j22J54j7n9M9R5k05M7J63q5r9J23r2q1J44j0p8jP2r5N0J15j21j6J48
5847A04j26k5J29o7j03J59j4r3M4M3j12JJ68j18j3R1l2j16J47M0k47J05R9n3j20
5872a09J83n4j16J77l3j08J39jr7l4J22p9k7J55q3j01J65o8m9N2N0j10JJ32r9
5897Hj0J02j15q0J66o9n1Q8K3j47J14O8j10k4J51j32m0R6k2q3O3P8j66O7J14q4
$$ plain form
5720 48 14 -88 61 111 -112 -25 89 -110 -51 79 4 -69 55 117 -88 -20 127 -24 -15 68 4 -76 44 -10 -12 -8
5746 -8 45 -51 -29 106 -87 2 75 6 5 79 -43 -43 83 39 -118 39 75 -60 16 72 -90 -49 54 -54 -105 108
5772 108 53 -49 13 66 -85 -29 79 -74 -81 31 87 -86 102 45 -52 -59 80 -92 -31 96 -30 -38 60 24 -84
5797 -84 56 93 -73 44 62 -80 -4 62 -82 -62 102 -13 -117 27 22 -79 26 47 -101 -28 146 -85 -52 117
5821 117 25 -97 57 40 -19 30 125 -80 -33 130 45 -54 69 -23 -104 40 30 -48 -49 23 -72 -22 93 -28 -44 104
5847 104 -22 -47 82 15 -88 71 57 -36 8 51 -61 -60 108 -10 -23 68 36 -80 67 107 -140 -35 64 11 -109
5872 -109 74 20 -96 81 48 -60 79 78 -19 -53 69 -10 -37 118 35 -66 99 31 -18 34 84 -26 -25 107 8
5897 8 -2 100 -15 -95 71 2 -49 39 62 -85 29 97 -13 -37 114 -18 -58 38 16 -67 -4 74 -92 -25 89 5
5923Er2J83n8r7J13j0q2j9J38j47J0P1l6pP5k8j7L8l5q2O7L0n9K3O1p2kP9l0n2
5953c2J01Oj61Q7P7j69R9O7j08k4Q7n0p7R5N2j31J07L3j09J8J35j32l9J19n2q8
5979h9R0K0j29J46M5j36N0P7m5m5J31r2r1Q9K5q5M3M7j01R3K0l0k7Q9q2p6R7j8
6007A6n3KJ20j35L1P2l1p1J22m3q9K9K4q5R8J4j2k2N0o2kQ2j3p9P1O7k27J82l
6036E3r7M2N5j10O6Q7j19L4K5lj34M4M0p2J48K3j00QQ5m8j02J40l9q5Q9Lo2K0
6064iQN0r2M1P4j26P3Nr0R5K5j39M9J03j01J0P2n5OJ8J2n5J7O1j13O0L3r1k2J42
6094F1o6m4J01Pj40R8J1p5K6N0l4j1M6o0QQ4n3n0O9M1p8l3J48q2l5K6k6j6N1K3
6124D7p8L8Q1j31NJ22j39KQ5mp8J15l6j42J21j2RqK7q9M2P9o0q6J05Rp3P7jq7
$$ plain form
5923 5 -87 96 38 -59 54 44 -38 -57 81 -66 -56 15 -21 -28 47 19 2 40 5 -77 -10 20 -39 -16 45 -27 -29 50 20 -32
5953 -32 69 75 -86 1 78 -91 8 75 -33 -57 30 -20 -97 -2 50 -81 26 59 -50 -32 103 -29 -68 51 -1 -89
5979 -89 1 21 -108 38 83 -53 -3 74 29 -16 115 23 -68 21 46 -39 4 51 -50 43 63 33 6 95 13 -63 34 16
6007 16 -37 -35 85 -50 -19 53 22 -49 73 30 -59 -30 -6 -91 7 21 9 -13 37 -25 -27 55 42 -37 34 101 -126 56 53
6036 53 -44 -2 53 -57 9 96 -23 11 36 33 -101 -57 -17 -89 59 82 -18 -10 75 27 -75 65 26 -59 30 33 -29 -9
6064 -9 -1 49 -43 -2 72 -54 19 24 -66 29 54 -85 -36 67 -34 -24 48 -7 -1 17 29 -26 -9 52 -61 -1 32 -59 -81 61
6094 61 -5 -49 52 59 -81 17 28 -47 -21 29 -5 -16 30 -30 -22 62 9 -41 28 69 -9 -42 106 24 -11 15 -11 -27 24 47
6124 47 -31 7 88 -43 -38 84 -55 -53 32 28 -50 65 29 -113 8 -4 5 -3 24 -65 -23 56 -4 -90 15 24 -49 28 27 -60
6154f0OJ50r6j1N4k0o4P2nj10P2O3p2j7R5m9o4J05k4p0N9k0m6O2M2j08M9M5o3
6183b5rJ11j04k7J00r0LN7K6p0j2J01p5n2J34l0n8Q9j7q9J7M7o2K1J04j32k9J26
6211E5kr4J20p9l8N3M7r0K1N2o6kQ4m0q2P5L2m4M2Pr5O6pq8M5R2m0p4R4l0lk3
6243a2M9l2L4L7j20j0J11j13m0R1R1j07OR5j24l1O7l9J5M1kj7RM0qj0L1q1N8J5
6273D4p5k2J00l2n1J20m8q0J9J09j47M8P9j41N1J52j40j5Q3K0j08%Q0j52N7J15
6299F6p7LP8j05n6O7K1j13R0N0n0L4K5m0m2J29q6o5J30m7n2M3K8l7J0Q3j21J5
6327a9N2l2j7P1m4p4L4N6n4M7R9j10q1J31l3r1J48m1j17J05L1j18RP0r1mJ14m8
6355gm3O6J8r1K1O4q5N6R4j39J4N3j0p5J69q4r5R5M6j26M9N2j06O1Q3n4k7M4J8
$$ plain form
6154 -60 -54 96 0 -11 43 23 -41 31 26 -84 -12 51 -21 -38 57 8 -56 49 25 -45 14 -6 -52 10 52 -56 -7 38 -25
6183 -25 -34 77 -27 -54 46 -44 -41 16 42 -28 -40 61 -14 -66 68 38 -20 69 52 -37 -20 27 -35 -14 90 -42 -71 55
6211 55 53 -41 79 0 -38 15 62 -28 -7 45 -21 -23 61 21 -61 14 46 2 44 51 -44 22 15 -73 -28 64 24 -50 44 14 11 -12
6243 -12 37 5 39 76 -44 -54 57 -56 -96 -5 86 -21 -15 80 -44 -75 -8 -47 -32 9 7 -10 -1 39 31 21 52 -29 29 44
6273 44 -31 -53 47 15 -36 84 36 -44 -25 84 -63 -15 64 -77 -26 126 -14 -29 54 74 -34 -34 46 -106 -49 66
6299 66 -11 -8 70 -35 -91 -24 -3 -116 -26 24 -26 8 33 -7 -49 80 -6 -71 59 12 -40 3 31 -6 4 87 -34 -19
6327 -19 33 1 -16 55 11 -63 -29 27 -27 20 119 9 -72 59 26 -65 83 42 -75 30 61 -57 -48 22 -69 -73 41 -7
6355 -7 -50 16 34 -57 -36 28 -57 -1 93 -46 -32 21 11 -64 105 21 -74 21 67 -59 -10 42 -64 -3 80 26 -1 43 61
6384F1j16O2P8j11M0J0m4L2Lk6m4R8k3p6Q4L8o9j2J30j08j03J61n1m9Q9%n5N6
6412E5j2o6K6N7r1MO7l7p4N2P7p5O3rm0L4K6j05M3O1p3j8Q0L0j20Q1K1j05K0R2
6442F4o0ML8j1j46J57Mm7kL2ol5P0p8j7J00j11J5K8L4j30J19j4o4P6N9r0l4O4
6471A9J1p1Q9p9k7K3Jpj2J48j32J0N1J5p0R7or4M1J1Ml0O4l8k9K4om1Q1Kq5N4
6503A8L0o5n3J21m8j6j3K8p4J01k5p7P4L7o8N9N9j50K0J04l4q0O5l5k7O5L9j12
6531e7J17J2n9o9J42j02QQ2n0p9N5O8p2L0Ln0J4M7q6JN9K6m4j0R1m3m0O0m8n1
6561d5J24o9j7L6k9l5K3R1j18N0J3J3j00J21l2k3Q3p6rL4M0n8l5R0r2J5R8j02
6589im2N8Oj0mL1o2M6K6p4K7L5p2qR7p5KPM3p1P9j0k8L7o1K3j9Q0k7o0O2j1l3
$$ plain form
6384 61 -55 7 85 -26 14 24 -20 12 15 -11 -55 43 20 -56 28 66 -3 -15 115 7 -96 65 14 -35 54 54 -1 55
6412 55 43 -23 3 60 -31 -27 40 3 -71 -19 58 -17 46 37 -3 31 57 -48 -5 56 -17 -35 45 75 -45 36 57 -48 -28 64
6442 64 4 8 46 35 -111 46 50 3 1 33 27 -8 62 -16 -33 67 -44 -29 -1 33 -97 22 8 -56 20 79 -11 -45 19
6471 19 30 -41 48 -31 -58 -35 -34 -41 -53 95 -37 -27 24 39 -31 66 60 -34 7 18 22 -8 56 18 -11 13 7 -34 47 49 -36 18
6503 18 48 -17 -70 51 3 -13 -26 2 -72 29 4 -73 1 38 -30 29 88 -62 -42 62 28 -52 13 -22 -49 16 55 -57
6531 -57 60 72 13 -56 86 -16 -8 74 24 -55 0 68 -4 26 29 -21 -7 40 -46 -45 14 40 -4 -14 77 34 -6 54 6 -45
6561 -45 79 10 -7 29 0 -35 -12 79 -39 11 24 37 -63 58 26 3 86 10 1 35 75 17 -18 72 -20 -5 93 -9
6589 -9 -51 7 13 3 -1 30 -32 14 40 -34 -7 28 -44 -52 45 -30 -28 -21 22 -49 30 20 -8 29 -32 -9 -28 52 25 -35 27 16 -17
6622a7K3J26j05n0J06n6J8m5O7j31L8L4m2J7K4k9m4R2J2o2Q3k1p1M1M3j07M1P4
6650E9n9m2O5m9RP6k6j03R8L8j28R2%n0MJ12j05k7N4Q8j20PQ9j34j2O5l0L0O6
6679F7o5n2N5j9q0J14J4o4J8P6o1On6N2NJ2j2n6L8M1l1k7MM1oL8m9K9J3n4ql1
6711d8J04r0J2K9m5J9R2m2o7N4m4qL0J2k7l3J73j02k5M8n2j5P2lr1L0Nm7O7N9
6741F7o8j3O5Om7N1n8k9N8rll6MOk3J15q4k8R2o5k9N6J5q9j9P7m0%M9M0j04M1
6773bK0k9J7L5q3N6K6j8LK3o0K1N2p4KO7m2J2L0m3j0MPn7O8K5o2oN6j0j5K3J8
6806E4j33O0K2qkL2om4L9J0nqL0r2M5M8m9l2Q6Kr2R0l0LJ6N0r5J7Om0k1K4N4k2
6840INK9j21J23j5n5j5M9K1n7N0m0k1K2Lj6N8N6r8k1Q7q4k2M8j2o4J04L5o2M3
$$ plain form
6622 -17 6 132 27 -23 83 27 45 0 67 -64 -26 8 -34 -17 7 -22 -66 26 38 -24 59 38 -33 8 51 -56 -15 59
6650 59 0 -42 23 -26 -17 59 33 -70 28 66 -62 30 30 -20 -16 96 -9 -36 18 106 -14 -7 82 -52 -64 1 -29 1 67
6679 67 2 -50 5 -14 -94 20 34 -30 -12 64 3 9 -47 5 10 22 10 -46 -8 33 2 -25 -21 20 14 52 3 32 45 -9 -17 -48
6711 -48 56 -34 -22 7 -38 -19 73 31 -36 18 -26 -34 -4 8 -19 -52 121 19 -6 42 -10 -25 47 44 -47 -17 -12 -59 8 67
6741 67 -1 -14 51 57 10 61 3 -26 32 23 20 -16 -12 -6 -29 86 2 -26 66 1 -28 28 43 -46 -65 12 -28 -28 21 61 -43 -2
6773 -2 18 -11 6 41 -42 14 40 22 25 48 -12 9 61 -13 -11 56 14 26 56 13 3 7 14 -43 25 50 -12 -18 38 28 13 36 54
6806 54 -79 -19 3 -5 -7 25 19 -25 14 24 19 11 41 -51 -6 42 -7 -39 47 49 -43 47 17 20 36 86 -9 8 14 -26 -47 -23 31 9
6840 9 14 43 -78 45 30 -25 -40 9 30 -27 23 -17 -38 -16 -13 -29 29 85 -13 -34 53 -31 -53 -5 -17 -81 23 58 -4 39
6870C9L0j07Q0l0l3L2M8Jj23R3Pq4N4k0rj8O7k4n4K9Nr3J56L3j31L9O1p8jP9r8
6901e0PJ01m5p5N0J4MNM7l0j4j3qNK4K9m8%K6r6L3N4j7j6M1l7m6O6j5J6K1k5m4
6934c6N1M5q0n5R9p6j3R9qn8M7L8p1M7JrmK5m6l7M0k2RMRl9L8%Kl3J28q0n4P2
6968C3n0j3M0J2J1kOl1k9M5k1k3N0l6K4K6Mq7N1K5m1j8M7l8L1J4no9O3J6p0J6
7000a9O6m1K1k6L5m7K2moj4k3J8O2Klq0KJ2M1J0J7q2L5L8m3J9k0L8o6P9k3o4O3
7033A9j0l1O6%j15M5M0m8J1L8Pn8M1j0Oj3L6j04Q6J19j83N2N7p5k2L9P0p6l7Q4
7063C4n7L7K2n5k8Q2r4MJ11m8m3K8O2k4KO1j01nP2k9l2R4l2q5M7J1n7M0j4j3p1
7094h1O6J2j3J7M6r4N0N8j06J2Mk4O8mk2l3pL4K3k5O5n4M3L9n4m9k5M0l1R2j4
$$ plain form
6870 39 69 -38 42 12 -21 11 59 60 -63 30 37 -47 7 -13 -22 -40 27 3 -51 -22 -17 -110 46 79 -52 -13 48 -30 -31 48 -50
6901 -50 -43 58 13 -62 -12 2 6 11 58 28 14 1 -7 -2 22 51 3 3 29 -67 -34 20 3 -13 28 -9 -55 11 -4 12 33 8 -36
6934 -36 15 60 -20 -75 24 -52 -65 34 26 -32 15 53 -18 29 30 21 17 42 -4 -41 -1 -23 -14 -10 -1 -40 -2 -2 0 -33 95 15 -39 33
6968 33 -17 -30 10 22 33 31 37 6 -23 22 1 -22 28 -8 16 42 46 -41 10 35 -6 -24 23 -15 16 30 25 -44 19 35 -35 -19
7000 -19 47 6 27 1 36 -11 11 7 1 -13 -36 -18 44 46 43 -37 -35 -23 18 28 45 -37 -2 36 -7 12 -8 30 -36 43 20 -44 19
7033 19 9 -22 44 44 -71 -26 14 -34 -23 15 22 -36 5 -5 1 -12 24 -80 6 125 -58 -6 51 -24 -46 -7 63 -13 -50 34
7063 34 -23 14 36 -19 -47 35 -59 -55 56 8 -35 -7 55 31 33 94 -7 -12 60 31 -1 93 61 -24 23 34 -23 17 3 -10 -81
7094 -81 -15 -3 -16 1 47 -47 3 61 -45 -33 -29 -53 15 11 -11 -44 -51 -17 6 -19 46 -8 35 74 20 -29 -54 -14 -45 47 33
7125C3m0K2j7m0K2L4l9K9J6n3j8Q5m2p2J14Lj3p9P8J1k8pJ2m3Q2m5J5j7K1j1N
7156A8L4l2n3J27p1n5J26o9J2n1L6k3K1J1mlpm4m7Q8L0n2J6O1k3o1N7n9rP4n8
7187a0k7Q1l6J4No8O2j8rL2jL5o3rJ4K3m8O6k1J7k3J9j4k9Pn2J6J13q9j3J6M1
7219C1l2j1j6K9JL8j7k9M4K4m9j4K9l0j0M1m9M9K9r0L4mMj8N1L9p4OlK6j02R2
7251A9J5n2rM5q2N6P3q1J6P8j34NM3JK0j7k8M9k3N4l5l9L9o3O0L8N1r1J7JlL9
7283F2m3J8j5j4m3J0M6j2J8j7K5j6k4M6n7P6p5pOj6k0L7L6l7k8lQ8m5K4l5j6L5
7315DMJm3L9L9m7J6M4q4K0N2k9k1KNlk8O7l9J7K7o5k0Q9n0o3R0m7M4Qj7k0j5O6
7349D3q0K0j1K2M8j9Mn5N0j6k2L9L6j09L8N7l0M0m6j1j7Q6k6o8kM7p9M8L6NJ6
$$ plain form
7125 33 -7 15 -2 -42 -20 14 -25 4 20 -33 -51 34 -8 -80 34 37 24 -55 23 34 6 -1 11 -32 50 5 20 3 24 13 18
7156 18 52 20 -33 94 23 -32 94 25 37 -14 22 -1 20 31 27 24 17 -27 -74 14 44 -8 8 69 46 -15 42 -17 -26 48 -10
7187 -10 -37 44 8 22 27 -41 21 3 -6 26 25 60 -3 -12 2 25 -23 43 22 39 16 35 21 -8 -1 -53 -37 76 -13 -26 -10 31
7219 31 -1 -12 -28 1 2 40 23 -6 38 62 13 -1 28 -2 -12 29 -20 29 58 -32 2 -2 2 -16 35 74 0 6 3 29 -73 19
7251 19 34 -18 -27 18 -64 -8 65 -16 0 78 -56 -51 -8 -7 13 -4 -32 17 -6 48 13 -26 13 -50 10 48 99 8 25 26 23 62
7283 62 19 37 22 8 -35 -25 21 9 27 10 35 19 -5 41 -16 60 -15 -22 -16 -32 -52 -15 21 -16 -44 -47 41 -4 20 -15 -31 4
7315 4 8 9 -34 5 44 -3 13 57 -27 -7 45 16 -5 -3 2 -1 -29 38 -1 16 43 -22 -42 47 -3 -66 24 -23 21 29 12 -8 -23 43
7349 43 -37 -17 -28 -6 42 23 27 -28 22 6 -16 23 59 -50 -12 45 15 55 9 -2 -19 67 41 -27 -29 18 -61 -13 23 28 44
7380D4j8m5LQJ1L3m1QJ0o5J06l2k6l0L0m7J1O6j34J27J2n9N2j8n7N0N0p9MQ0l9
7411A5k0j1ll0M3K1m2L7K9l7jO8l6k1llJ5m8Q5m4l2M7n1K2R3j04J7N2l3n6j6P9
7443C2Mj1M5q4qP3K3o9j3N5k1L3N2j41j5J06k5o8L3pJ0K5K8j03Q9m5jk9J8O7j06
7474e3N7rJ9J3J5k5oJ4l5L3j1O8m2J1K8r2M0L4l0%j4k1J8N0p1J6k2L0o0M5P3q8
7506a5M5q3O5Nk7L4m2J1L1n8J5Q2r1K0L3m3j1R9p0j8M1k1l4J03k0n0M1l3n6J7
7536c0N5Mn4l3P3l4O7m9PJ4L8p9J8L3Kj7J1K2n9mL7l9j8R4p2j8L5K3q9J09l1l3
7568a7O6p0M6M5o7j1L6j3J2j6PL2m0l2Q9p9J0MQj9qQn9O8M9p4%L5K0n4L7l5kM7
7602B3n6k1Q0j5OK2n7PLM8jm6M5j9o6N7l7L1L2j2m0K3Kj6L1rj1j8L3J0m1K1K8
$$ plain form
7380 44 26 -19 -16 -8 3 36 -5 3 13 -52 54 22 -4 -34 -4 -51 -40 26 -108 19 31 -28 24 6 -51 -1 49 -30 -26 54 15
7411 15 -5 -16 -19 -49 -6 15 -27 10 39 2 1 69 33 12 9 6 21 -27 58 14 -18 29 -22 0 93 -11 6 58 25 -31 -47 32
7443 32 36 25 70 -14 -22 51 74 5 -8 47 26 59 111 -30 -45 61 36 -32 1 -6 4 29 57 -46 43 -2 -3 -32 -14 53 -53
7474 -53 4 -5 14 27 42 17 11 25 -10 23 12 80 38 49 77 -15 25 59 29 29 15 -6 12 62 -9 7 -15 15 -45 0 73 -15
7506 -15 30 -53 12 17 -10 24 -18 -7 24 -34 -19 63 -28 -8 25 -18 -29 70 0 -18 23 2 -32 71 51 1 42 9 -47 -30
7536 -30 25 29 -25 -58 15 -19 48 -1 6 20 58 -21 -3 30 32 15 26 48 -11 -15 22 -17 -35 59 -13 -31 4 27 -62 47 16 -17
7568 -17 49 -21 25 70 3 -8 28 15 27 11 18 50 10 -22 67 -12 -2 2 10 -9 -17 -9 -68 0 49 -25 -25 10 30 -24 13 -22 -24 23
7602 23 -33 -54 26 11 17 39 -18 -11 -8 40 39 -7 38 19 -47 10 -27 4 36 24 -16 7 9 -7 24 15 4 -14 19 29 -12 9 37
7635C7j3m0M0K5m3k3K7L4j3m2l1J5K6k7Oj4PK3L8o9M2l2N2Ql9JQPj4J8lk5JL6
7669B3JJ2j5RNn0RL3K5j04O4j4J2k0M8k6pMk5PK2J6p7P9l6qJ1pJN2k5j0j8l6L5
7704a0L9l7oR3p2M1m8OO1j06O7n3O2m1K6m6j7O7k5j0M3j8k2J0n5M5j9O2kj6L1
7735E0p0KN9j6k6N9rp2L3J9OJ9p3O5k0k3K8p6K7j5N0m1J7j0m6L8k0M6l7L6l5O3
7767B8k7J1m4N0N4q1M0n8K5jM6o7J2M0j0Pk3Mj0%Q6j38P4jm6NM9L2m7M6p2M0L3
7800E7l3p3P5l1M3m0mM4m5L4Mq0N8qNoJ6m0nN9ql7L0pl9j4N4n1J7O0n3L7Lk3k3
7835b4O1o7J1P4p2kJ7L0o1O6k4l1Nj3M6n5R0j6l2lM3l7l5L7OJ4L5m7J2K5j4p3
7867c4N1Kj9K7K3o3j6N3o4J10r6L4l0K2rN0l8Kk6nM7o2k1K8JJ6oN1m5Oj3J21o4
$$ plain form
7635 37 24 -16 24 49 6 -17 10 44 31 -11 -42 -27 -1 -28 -22 -36 -29 -6 32 -37 5 -27 25 33 -6 -5 3 10 -4 14 11 -14 -13 23
7669 23 24 36 21 30 35 -15 -6 27 52 -52 12 -2 10 -10 38 12 5 9 -16 -9 13 29 -48 31 -5 -13 -2 -9 -8 44 19 9 -9 -45 -10
7704 -10 29 -8 -14 79 7 48 0 6 67 -39 28 -25 37 -4 22 -24 -41 26 1 -9 34 16 -6 4 -51 -6 -25 37 35 19 50
7735 50 -20 -18 41 25 -1 58 49 -23 10 29 35 54 -19 46 26 3 31 -45 -18 -33 17 -24 -7 -17 -63 -25 -45 1 -36 0 -35 28
7767 28 1 12 -32 18 72 -9 31 -27 -2 -3 43 -24 -12 28 18 25 2 6 -4 -4 82 -56 18 17 -29 -24 25 57 10 56 -16 24 57
7800 57 24 -49 26 -5 38 -2 -6 38 -7 27 31 -49 9 1 6 0 16 -24 -29 30 22 -15 15 8 -31 -45 9 -42 -25 35 -18 19 22 -1 -24
7835 -24 37 -30 -19 55 -17 -19 -2 28 -33 33 9 -22 -17 -30 16 -39 51 35 3 0 43 6 -29 8 14 28 63 16 28 53 39 -34
7867 -34 17 19 0 27 50 -13 -29 24 -40 70 -26 8 -22 0 -9 41 3 5 -21 -26 21 -41 -62 -34 -33 -17 -23 28 -17 -11 -24 97 33
7900C3J4j3m5J0M3m8M0L2q7N9j9j9M1k9N7m8K7k8j6OP7j06PQ0r2O3l6j9j7mN7
7931B0k0N2l6k7nM7k8KK6l8k0M4NM9Lp6M4l5m2PM9m4K6j2K9Ol4K3L4k3jjl4M3
7965C3m6Jk3O1j3K7o5Q6l1m7RJ1L4j3J6q6J13p4P8p0m7M7j1L3o3J8K7l9M1KLJ
7997A3N2p6N3k3j4mk0O4l0j7L1rn1Q2m3l7k2M8pL5k9m7P8j6j2K6k6Qm0K7LLN9
8030E9o7KrK8j8j5O4j9m0P4ll6M2o6k7K4jmM6n8Q2q3M1NK3j1lJ6n7j0m4j3J02
8063B4q2P6m0L7k2J0k9P8p1oL1kJ0K6o5O0k3O5n0o1R4k8n8N8n0mol3N4oRk0Jl0
8097e3L8L2k9J6M1k2m2L2kn0K6K3N6o0J2k4J9j6L1k0j8M4p0J8L8j4k3k3M4K1o
8128A9k8MK0k9M2o4P7p0K4j0L2Jl3qM5l0J3j7jN6n1L7m5j3L7k6O5l9OQJ8K4ql1
$$ plain form
7900 33 47 34 -11 -1 42 -6 34 66 -21 38 19 0 41 12 69 21 48 20 4 10 87 -19 -12 68 -24 39 3 -16 -33 -37 20
7931 20 0 52 16 -11 -16 31 3 5 31 -7 -27 17 22 71 74 -2 42 7 -35 -28 21 -23 3 -9 20 26 -8 15 49 26 25 24 -10 33
7965 33 -13 -12 -35 26 13 40 -25 61 30 -17 -8 3 37 24 40 -46 67 -7 71 1 -46 1 -10 23 -40 -22 5 -34 7 9 12 13
7997 13 65 -11 42 19 5 1 -19 45 15 -2 29 20 -31 51 8 -29 -51 -3 -10 25 -4 -51 27 11 -1 25 -1 7 -33 -6 -3 0 59
8030 59 -8 -6 -15 13 -5 -20 44 25 -15 59 56 20 62 -4 -31 -7 -8 -12 34 -24 58 -25 16 21 44 33 30 46 -11 -21 -65 -78 24
8063 24 -58 18 -22 15 -7 3 -26 52 -19 -25 6 4 14 40 -25 35 12 77 27 -34 60 32 -26 32 -18 -22 -28 -61 -7 -13 -4 -24 -23 -53
8097 -53 -15 17 -12 4 45 23 -19 13 11 -39 -13 10 66 6 18 -6 13 -3 28 8 -10 34 -36 -18 20 6 -17 -40 4 25 19
8128 19 -9 -5 15 -14 28 -36 41 -29 -5 -15 17 18 -15 -23 22 -8 5 -12 -13 43 -8 29 -16 -29 8 -18 47 8 14 22 40 64 56 25
8162B5p7K6M6l0Qm6j3P7j9K3KRo4N1q5J04p4L5j7l6N2J4qo2P0j2k6j4L6
$$ plain form
8162 25 -52 -26 20 -10 -2 -48 -61 16 -3 20 22 31 -33 18 -67 37 -37 -2 -19 -55 -3 11 3 -59 11 -1 -27 -41 -5
8191e
$$ Imaginary data points
##PAGE= N=2
##DATA TABLE= (X++(I..I)), XYDATA
0@%%%%%%%Jj%qJ6k4L2l2M0n6P2q2R3j15J39j64J94k27K67l14L63m15M75n45O22
32C31p06Q01r06J021j147J284j436J604j788J986k201K438k698K981l289L627
48A902l998M405m850N339n887O497p176P941q807R803j0960J2319j3943J5925
62H510j8404K1613k5945L2131m1731N8675r6908L22426p9151p37159P30263K37403
74D11723p79463J58120O80206n40508l13898O35639l3248n58336L25917L00525
84B86677m05717o1500L55799j14037k04297J42906R5971j03907n4472M4930J02739
95H5092o4948j53025J58163J45335k97064j8927L78250j92803l35162M17827J34745
106B57483n39930J64367M88937m57304k51265O20183r4160n80613M24688L42130
$$ plain form
0 0 0 0 0 0 0 0 0 1 0 0 -8 8 -16 16 -16 24 -32 40 -42 51 -64 75 -89 105 -122 145 -169 194 -221 254 -291 331
32 331 -375 426 -480 541 -606 678 -758 846 -942 1044 -1157 1281 -1417 1564 -1725 1902
48 1902 -2096 2309 -2541 2798 -3089 3408 -3768 4173 -4634 5169 -5791 6528 -7415 8510
62 8510 -9894 11719 -14226 17905 -23826 34849 -62059 260367 181216 -555943 174320 411723
74 411723 -367740 -209620 470586 -69922 -383820 251819 218571 -339765 -13848 286677
84 286677 -119040 -180540 175259 61222 -143075 -169 95802 -8105 -62577 -17647 85092
95 85092 20144 -132881 25282 170617 -126447 -145374 232876 40073 -295089 122738 257483
106 257483 -282447 -118080 370857 -86447 -337712 282471 188311 -392302 32386 374516
116C74516o14180N866N95600l35877l85059N28546P3078n29922K17549L64477
126B94594l86773j19772L98128r8812k83941K18159J24115k22961K178J55475
136H0390n1851q2256L5134N5021j642q4567M680J35005o9926j51387J76000R0991
148A35592k66987M7187K81990k17010j87696L46808K474l70997K11057K65834
158B48252l70046o0878M09385j70854l11477L43202J12603l95893J10655L16195
168B31144k77645j44676L35207m7058k78364J88852J48041k40117n561K05068
178A14891r3824j21207J27007L8637j06617P539O7899j2852m6722j508N6971K280
190C2494q6230L0928J03239r4108p8394J58674L366j85418J02535J48457j97390
$$ plain form
116 374516 -239664 -233798 361802 25925 -359134 169412 242490 -287432 -69883 294594
126 294594 -92179 -211951 186177 87365 -196576 21583 145698 -77263 -75085 80390
136 80390 28539 -53717 -18583 36438 34796 -49771 -45091 89914 19988 -131399 44601 135592
148 135592 -131395 -84208 197782 -19228 -206924 139884 142358 -228639 -17582 248252
158 248252 -121794 -182672 226713 55859 -255618 87584 200187 -195706 -85051 231144
168 231144 -46501 -191177 144030 96972 -181392 7460 155501 -84616 -90177 114891
178 114891 21067 -100140 26867 65504 -41113 -33574 34325 21473 -25249 -26757 30214 32494
190 32494 -53736 -22808 80431 -13677 -92071 66603 69969 -115449 -12914 135543 -61847
201f1847m7784K38288q5291k00770K01823R1846k57036N1017K28187j77285j26754
212a45606K42023r325k26928J30931J44219j98210k9610J97303p3727j39713J34933
223B6290N6962j43873J7790J13008o2903o6988P5122K7898o7615o706N7476j937
235B4524n6500J0615O3349l1335o5444O5282M8968j00315o153J17857n4811j01602
247h5565J14668M8065j48870K9731J39775j06922q6417J55665L602j58727Q1108
258a3887J14192j40067l7893J55733m3989j26262J06447O5706j32340M132J20504
269G2276o1409q1017R3033L0798r7127J3906Q0369m4612n4540N9553K8247o3885
281b4408n554O2588j4200n8114L4184M9245n4495l1566P2258L452p9927L2933
$$ plain form
201 -61847 -109631 128657 43366 -157404 44419 136265 -120771 -69754 158433 -18852 -145606
212 -145606 96417 87092 -139836 -8905 135314 -62896 -92506 104797 31070 -108643 26290
223 26290 83252 -60621 -42831 70177 7274 -59714 15408 43306 -24309 -31015 26461 24524
235 24524 -31976 -21361 41988 10653 -54791 10491 59459 -40856 -47009 70848 16037 -85565
247 -85565 29103 77168 -71702 -41971 97804 -9118 -95535 60130 63732 -94995 -13887
258 -13887 100305 -39762 -77655 78078 34089 -92173 14274 79980 -52360 -48228 72276
269 72276 10867 -70150 22883 53681 -43446 -29540 50829 6217 -48323 11230 39477 -24408
281 -24408 -29962 32626 18426 -39688 -5504 43741 -10754 -42320 29938 33390 -46537 -13604
293a3604P0643o9346m1803R3927k785r7231N1640P4229r0814k9714J07329k4450
305B8021r5296P2786N8088j00846o344J01868m4307p6540Q0340L4320r3203J1830
317b9283Q2355m9943n4288P1348J8242p4634J5424O2593m0648m1414N4761J7299
329C1812n8295O106N3870k6000m3081M2408K7228n3889o489N8530j7895n3828
341c9523M2309L7456o1883j0843O9946k2110o2341N3274L8465p3865k602P6840
353D5123l5479n9690O5710K7037p8796J2642P1154m7678m5859O8472J0655p0881
365c7590K3516N5832m8365l0044N8586J774n5039K2057M1720l7226k3695M3971
377A5497N876m3757J0454L9095k4622l0430L6610J7247m5522L43M8316k2017m1780
$$ plain form
293 -13604 57039 -12307 -54110 39817 37032 -60199 -8559 65670 -25144 -54858 52471 28021
305 28021 -67275 5511 63599 -37247 -43591 58277 13970 -62570 17770 52090 -41113 -29283
317 -29283 53072 3129 -51159 20189 38431 -36203 -20779 41814 1166 -40248 14513 31812
329 31812 -26483 -20377 33493 7493 -35588 6820 34048 -19841 -26330 32200 14305 -39523
341 -39523 2786 40242 -21641 -32484 37462 15352 -46989 6285 44750 -29115 -31717 45123
353 45123 9644 -50046 15664 42701 -36095 -23453 47701 23 -45836 22636 33291 -37590
365 -37590 -14074 41758 -6607 -36651 21935 23709 -31330 -9273 32447 -4779 -28474 15497
377 15497 21373 -22384 -11930 27165 2543 -27887 8723 25970 -19552 -19209 29107 7090 -34690
390c4690M2902K4072n7386K800N9199l2630m5071N7022J7318o7052J7199N9032
402D2715m7760l4072O4781J48o3420L1985M4574n2989j5995N7378j3009m6704
414c2368L3487K6973m1809n976L9382r894l0782J9430K1512k3915j3697K7183
426I526O583l0853K637L3591j6322l1697L2695K0417m6817M57N1531k7467m1383
439c7102N1639J6575o3328J6997N6772m8122l1531O5738l946o3067L7901M1042
451C9568n8775q044N9791k4125m2976M4106J6181m7477R346L6246k4802j8410
463a9371K7700L424k1551L847J4271l645j1583J605J5271m392k0908J4893K0753
476B0314l0305r698M2278j2658m2088L8736K4933n7459O321N8413m0531l7960
$$ plain form
390 -34690 8212 32284 -25102 -22302 36897 4267 -40804 16218 33536 -33516 -16317 42715
402 42715 -5045 -39117 25664 25812 -37608 -5623 38951 -14038 -30033 27345 14336 -32368
414 -32368 1119 28092 -13717 -19693 19689 9795 -20987 -1557 19955 -3960 -17657 9526
426 9526 16109 -14744 -12107 21484 5162 -26535 6160 26577 -20240 -19783 31748 4281 -37102
439 -37102 14537 31112 -32216 -15219 41553 -6569 -38100 27638 23692 -39375 -1474 39568
451 39568 -19207 -27251 32540 8415 -34561 9545 25726 -21751 -12405 23841 -961 -19371
463 -19371 8329 11753 -9798 -5951 8320 4675 -6908 -5303 9968 5576 -15332 -439 20314
476 20314 -9991 -19689 22589 9931 -32157 6579 31512 -25947 -19626 38787 -1744 -39704
488c9704O4508K085o7061L6435M6591o2791j0195O6824k8020m8052N3188J4919
500B8727n7532J8218M1474l8841j4775M0849r511k7473K1654R098j9082M048P817
513D671n182K585l969l016J4652q225j7419K5109N675l6843J7514L3031m2103
526a3520j1226N4796k1859m6461N2620J7424o6060K2239N5005n6025k1905O9526
538C4554j9884n6750N3039K3332o4774J6036N1080m5147k0296N2824j3112l8802
550b7900L4421J2637l6214J1922K1417k2665o73J7032j3030p71J2222j4268K047
563c823J7042k0326m397L0149j8750k3074L9378q23m5054L1521K9489n4070L081
576a9657N6356l8973l4497O2546l513o1680M1800L6128o3965L569O0182m0492
$$ plain form
488 -39704 24804 26889 -40172 -3737 42854 -19937 -30132 36692 8672 -39380 13808 28727
500 28727 -28805 -10587 30887 -7954 -22729 18120 8609 -18864 2790 11888 -7194 -3146 4671
513 4671 -511 2074 -1895 -4911 9741 1516 -15903 9206 14881 -21962 -4448 28583 -13520
526 -13520 -24746 30050 8191 -38270 14350 31774 -34286 -12047 42958 -13067 -34972 34554
538 34554 14670 -42080 10959 34291 -30483 -14447 36633 -8514 -28810 24014 10902 -27900
550 -27900 6521 19158 -17056 -5134 16283 -6382 -7055 9977 -3053 -3824 8398 -5870 -3823
563 -3823 13219 -7107 -11504 18645 -105 -23179 16199 15376 -29678 1843 31332 -22738 -19657
576 -19657 36699 -2274 -36771 25775 22262 -39418 2382 38510 -25455 -21886 38296 -2196
588b196l3225N8633m478n2072L5952K5447m8099P207L7947k9982j3385L4322j1632
601D439k0216K4205j651j8993J7834J110j9006J7545M392k5086J7180J5212l3094
614a6129P958L2309l2843j2992M6031j7307l8527M4692J1921n5041K3243M2557
626C5872n1215j1123N9180k6148m2960N2626R521n7527K6175L9061m9087o733
638b2358N0100k4568l0748M1429J910l7650K2275J8310l0771N229K1945j9997
650d894l048J9132j3956m967J8606j3292q469K3666j1323j8695K8680m20l2953
663b1933K4747J9666m1136O633M0487l3913k0931M9555r876m5110L8569K1669
675B8427n2623J0811M5453l8682k0883N0178j0565m1444L5100J7511m2913R978
$$ plain form
588 -2196 -35421 23212 18734 -33338 2614 28061 -20038 -12831 25116 -4866 -18251 16071 4439
601 4439 -15777 8428 6777 -12216 5618 6728 -12278 5267 9659 -15427 1753 16965 -16129
614 -16129 -8171 24138 -8705 -21697 24334 7027 -31500 13192 25113 -29928 -6685 35872
626 35872 -15343 -26466 32714 6566 -36394 16232 25753 -31774 -5599 33462 -15625 -22358
638 -22358 27742 3174 -27574 13855 15765 -21885 390 18700 -12071 -6842 15103 -4894
650 -4894 -7942 11190 -2766 -7733 10873 -2419 -10888 12778 1455 -17240 11440 11020 -21933
663 -21933 2814 22480 -18656 -12023 28464 -5449 -26380 23175 13299 -31811 6758 28427
675 28427 -24196 -13385 32068 -6614 -27497 22681 12116 -29328 5772 23283 -19630 -9652
687i652L3011k8847j1438L2213j0027k0670K1424K744j8887J1131O165j4071P677
700G73N147j3907R049P790j9223P387J7765k3107l576L0014j7091k2109L4247
713A3159J743l8355K3032K6165m0852j811M3182k4802k8710M2132K985m3386K2777
726b741K8424l8596m164L8607j8460k4598L1078M135k9653J3670J7393k1329j797
739h031J7804r218p385J0887k863m683O436m377j783R227p916n674J5958n183
753C199j6385J8449O762k5966R607K3131k5520q992L3170j1170k8067K8793J1368
766A8379l6405J0254L0208k8217j3230L5267p781k9277K4356J3654l0350M836
778h306K4815j7971j1874K2194j982j7353J0833P751j2262P49P563m248j561J978
$$ plain form
687 -9652 23359 -5488 -16926 15287 5260 -15410 6014 8758 -10129 1002 7167 -6904 773
700 773 5920 -7987 1062 8852 -10371 -2984 14781 -8326 -11902 18112 1021 -21088 13159
713 13159 14902 -23453 -421 25744 -15108 -16919 26263 1461 -27249 14883 17868 -25518 -2741
726 -2741 25683 -12913 -17077 21530 3070 -21528 9550 13685 -15968 -2298 15095 -6234 -8031
739 -8031 9773 555 -6830 4057 1194 -3489 2947 -1430 -3213 6014 -1902 -7576 8382 3199
753 3199 -13186 5263 12025 -13941 -4334 18797 -6723 -15715 17455 6285 -21782 7011 18379
766 18379 -18026 -7772 22436 -5781 -19011 16256 8475 -20802 3554 17208 -13142 -8306
778 -8306 16509 -1462 -13336 8858 6876 -10477 356 8107 -4155 -3406 4157 -91 -1652 326
792C26j550K967o89o243O974M246j2878L376J4368j3537q310K0999l471k1376
806a4798J6991J2922k6161J917K6149j7595j6606K7492O83k7984J5404J8567k5454
819h473l305K6211j1531j7928K0730N110k1468P185J4947j4147n189J4272l218
832C196r582O896L519o037J38K739k08k39k536J126M992n061m281J0079n33j2426
848h218Q474R639j5799j421J8601r604j4715J8952M464k2751Q485J8560j9564
861d897p586K4021o046k0218J7352J0071k2215K857J9477j3188j0745J7818P2
874F773j5873Q251R112j1607j744R888l391n633M485J825k680o26M18K370q2m927
890c441L060N844p778k915J1735l630j1758J1264O629j6829K625J6656j2841j0312
$$ plain form
792 326 -1224 1743 1054 -5189 1785 6031 -6847 -3471 10897 -2640 -10950 10049 6578 -14798
806 -14798 2193 15115 -11046 -9129 17020 -575 -17181 10311 10994 -16990 -1586 16981 -8473
819 -8473 -11778 14433 2902 -15026 5704 10814 -10654 -3469 11478 -2669 -7858 6414 3196
832 3196 -6386 510 4029 -2008 -1870 869 661 422 -2114 -988 4004 -1057 -5338 4741 4208 -8218
848 -8218 256 9895 -5904 -7325 11276 1672 -13043 5909 10373 -12378 -3893 14667 -4897
861 -4897 -12483 11538 5492 -14726 2626 12697 -9518 -6661 12816 -372 -11117 6701 6773
874 6773 -9100 -849 8263 -3344 -5088 4800 1409 -4224 261 2086 -594 -1220 -802 1568 1486 -3441
890 -3441 -381 5463 -2315 -5230 6505 2875 -8883 2381 9010 -7819 -5194 11462 -1379 -11691
904a1691J9683p75j9973J2454J3068k0027j438K0801j0406j4242J8224L381j9122
917a0063P612J3460j4525m246J5180m670j0622R592L498r488K215N705m247j369
931a968K736q00O36n39k365M348P19p299M249O975j0257j990J3588o508j1614
946a0089J4482L849j8431P087J5361j6717n978K0890o201j7487J6776P601k0935
959i792M985J7324j4833p899J8588l538j5062J1847O617j4479K610J0691q463
972a404l657Q907k724m879N366n98l134M012j777k626N806k478n695Q331O37j1057
988f970P254P835j3955L89J5431j0766r989J8164r58j8614J2802J1465k0326J053
1002g185J9991j3283j1683K0341r49j9146J2610J0382j8207J293J5971j1108p737
$$ plain form
904 -11691 7992 7217 -12756 -302 12766 -7261 -8699 12102 1696 -12546 5678 9059 -10063
917 -10063 -2451 11009 -3516 -7762 7418 2748 -7874 1718 5216 -4272 -2057 3648 -599 -1968
931 -1968 768 -32 604 65 -2300 2048 2767 -4532 -283 6692 -3565 -5555 8033 1525 -10089
946 -10089 4393 8242 -10189 -3102 12259 -4458 -10436 10454 4253 -13234 3542 11143 -9792
959 -9792 -4807 12517 -2316 -10215 8373 4835 -10227 1620 8237 -6242 -3632 7059 -1404
972 -1404 -5061 3846 1122 -3757 1609 1011 -2123 1889 112 -2514 3292 814 -4881 3450 4087 -6970
988 -6970 284 8119 -5836 -5447 9984 -782 -10771 7393 6435 -12179 623 12088 -8238 -7185
1002 -7185 12806 -477 -12160 8181 7232 -11914 696 11078 -7129 -5836 10135 -973 -8710
1015h710J4542k271j1124R116L277r660M204M964p411K228M911o950J574O495
1029E185q064m82J0089p813n928J3573l271j3314J2948N805j8153N904J5501j6420
1043d440n474K0794p779j6172J8362M734k1323Q864J5376j8455l163J9633r522
1056A435j2684J7012Q11j6394R895Q560j4655K047J1738r909l342J1375n477n984
1070e572J0005k517p792R274J71j0129Q299M368j2898N194J0346j3745j354J6029
1084I679r856j0532J7879q95j8160J3121J0228k0124K756J8757j4991r027K0773
1097I608m473j7528J5538O859j9362N950J4322j5066l426J6231p841r694J4054
1110E172r24j2142R753M145j2216N565P489j1421J747J0235j0121k743J2794p228
$$ plain form
1015 -8710 5832 3561 -7563 1553 4830 -4830 -626 4338 -3073 -845 4066 -2884 -1310 5185
1029 5185 -2879 -3361 6728 -1085 -7013 6560 3289 -10025 2923 8728 -9425 -3521 11980 -4440
1043 -4440 -9914 10880 3101 -13071 5291 10025 -11298 -2434 12942 -5513 -8676 10957 1435
1056 1435 -11249 5763 6574 -9820 75 8635 -6020 -3973 7765 -2144 -5486 5889 412 -5572
1070 -5572 4433 1916 -5876 3398 3569 -6560 1739 6107 -6791 -1597 8749 -4996 -6350 9679
1084 9679 -177 -10709 7170 6275 -11885 1236 11464 -8660 -5904 12853 -2138 -11165 9608
1097 9608 5135 -12393 3145 10004 -9358 -3408 10914 -4152 -7578 8653 812 -8882 5172
1110 5172 4248 -7894 1859 6004 -6212 -647 6842 -4579 -2832 7403 -2718 -5461 7333 105
1124A05q219J3925j700j3741J1906O054j6960N581J4038j5535l822J8711q519
1137A824j3389J7700J840j9071J0790J1840j8485L67J7770j2059r456J7709k675
1150D705j5101J2561N826j5683N239J1023j2442j412J2727p805o113J2030l345
1163B210r104J0455P13j1228Q125N211j2728M307J0201j2434j564J4319q680q895
1177i092J5543j525j5079J2048P426j7274M116J4743j3984n480J7533o233j3201
1190a0459J4757L150j6553P774J0667j4539n24J4201q987p348J3525k311j0958
1203g605R885L439j1744N331P189j0437R74R417q274l138J0672n168o985J0707
1217D263r73j0565Q965M487j2714M649R988j1987j844J3880p663q979J4089l60
$$ plain form
1124 105 -8114 5811 4111 -9630 2276 8330 -8630 -3049 10989 -4546 -8368 10343 1824
1137 1824 -11565 6135 7975 -11096 -306 11534 -6951 -6584 11186 -873 -10329 7380 4705
1150 4705 -10396 2165 7991 -7692 -2453 8570 -3872 -5284 7443 -362 -6475 5555 2210
1163 2210 -6894 3561 4274 -6954 1171 6382 -6346 -2039 8162 -4272 -5836 8483 -197 -9092
1177 -9092 6451 4926 -10153 1895 9321 -7953 -3837 10906 -3078 -8558 8975 2742 -10459
1190 -10459 4298 7448 -9105 -1331 9336 -5203 -5727 8474 -513 -7861 5664 3353 -7605
1203 -7605 2280 5719 -6025 -694 6495 -3942 -2968 6449 -1825 -4963 5709 541 -6444 4263
1217 4263 3290 -7275 1690 6177 -6537 -1888 8100 -3887 -5731 8149 486 -8493 5596 5236
1231E236j4088R746P590j4862K231J3157j0972n660J4305l945j1212J1122L451
1244F099j2812N407Q454j0718n79J0425o631n094R874k296p602P730J428q661
1258d976N181M465q664K096P211p775j458R219n372n522R779j326r202Q081L935
1273E672j1147L770Q854j0102k146J1775n820q140J1286N00j1670P178O794j1547
1287d743R41J0692p863n075J0943k281q803Q000L021r456L467O417p578p09P357
1302D330m676l413O773j923n050N792L35o053M582K616o829K625N375o793n78
1317b887P742n003m675Q699j260q254O836L877r767K503Q254q039l098J0060l457
1332A531p687Q475K044r498M208O540q195q53Q344m683m741P427n56o472M849
$$ plain form
1231 5236 -8852 894 8484 -6378 -4147 9010 -1962 -7622 6683 2738 -8474 2648 6099
1244 6099 -6713 -1306 7148 -3570 -4149 6276 -355 -5449 4425 2129 -5473 2257 3685 -4976
1258 -4976 205 4670 -3994 -1898 5313 -2462 -3920 5299 -73 -5595 4184 2858 -6344 1737 5672
1273 5672 -5475 -1705 7149 -2953 -5099 6676 856 -7284 4002 4502 -7168 10 6804 -4743
1287 -4743 -3802 6890 -973 -6048 4895 2614 -6189 1811 4832 -4624 -1157 5260 -2318 -3027 4330
1302 4330 -346 -3759 3014 1091 -3959 1833 2168 -3885 697 3313 -3516 -891 4484 -2309 -2887
1317 -2887 4855 -148 -4823 3876 2616 -5638 1198 5075 -4692 -2189 6065 -1974 -5072 4988 1531
1332 1531 -6156 2319 4363 -5135 -927 5613 -2582 -3435 4909 226 -4515 2912 2356 -4116 733
1347G33K613o381K024M319n042k98M943l512j939N081k127l363N033m44n062M485
1363A063K037o406K542N013o338r08P358m172n005P712k2p985N238M741q334O00
1379b866P967n632m196Q310j134p158N599L286p488J721N797n412j831O099k471
1394E91l893M904om481L305J731m450J971K807m190N79L988l798j125M972k649
1410B56l395N419l43n679M397K812o659J551N907n663k324P434k525n854O396
1425A730J839p552L170N488o662j047P158l656m602O414K38o233L774L227n663
1440b377P86M694l983j462M696k118k698M162o14l522L580O46m230K751K344m867
1456b212J192M374m719j405O106k941m410O115M51o691M058M201o955M18O902
$$ plain form
1347 733 3346 -3035 -1011 3308 -1734 -2032 2911 -601 -2540 2541 414 -2949 2084 1640 -3422 1063
1363 1063 3100 -3306 -764 4249 -2089 -2997 4361 189 -4816 2896 2874 -5111 127 4868 -3466 -2866
1379 -2866 5101 -531 -4727 3583 2449 -4709 890 4176 -3312 -1591 4206 -1206 -3037 3062 591
1394 591 -3302 1602 1596 -2885 420 2151 -2299 -328 2479 -1711 -1132 2856 -942 -2067 2905 256
1410 256 -3139 2280 1937 -3742 655 3467 -3192 -1641 4266 -1397 -3721 3713 1188 -4666 1730
1425 1730 3569 -3983 -813 4675 -1987 -3034 4124 468 -4134 2280 2518 -3715 59 3286 -2377
1440 -2377 -1591 3103 -880 -2342 2354 236 -2462 1700 1086 -2436 1144 1790 -2440 311 2655 -2212
1456 -2212 -1020 3354 -1365 -2770 3336 395 -4015 2100 2551 -4140 -82 4119 -2836 -2418 4484
1471D484m907l586P210j134o314N234K678o900J889N343n425j519O189k721m033
1486c512N283L6n025L612K235m992J580L686m253l60M541l112k203M922j558l931
1502c051M606N14n412L480L122n954J018N472m995k196O840k389n368O231J260
1517C178p159L630M833o894k39O998m520l858O913r62o083M896K567o522K060
1532a162M823n277q90N664l167l052N371r37m544M339J283n298K763L370n467
1547b181N60N022m390j964O023k368m535N729O31o388L985L692o651R03O330n345
1563i47k698P285k240n840O343J481p433L522M897o883k43O971m554l721O980
1578B920j151n932N229K099o405K521M451n542l43N705l864k663N653j675m456
$$ plain form
1471 4484 -423 -4009 3201 2067 -4247 987 3665 -3235 -1346 3997 -1428 -2947 3242 521 -3512
1486 -3512 1771 1807 -3218 394 2629 -2363 -783 2903 -1350 -1710 2831 -281 -2484 2438 880 -3051
1502 -3051 1555 2069 -3343 137 3259 -2695 -1677 3795 -1200 -3396 3444 1055 -4313 1918 3178
1517 3178 -3981 -351 4482 -2412 -2651 4347 -173 -4031 2882 1920 -4163 733 3300 -3222 -1162
1532 -1162 3661 -1616 -2506 3158 -9 -3061 2310 1373 -3171 1168 2451 -2847 -84 3286 -2181
1547 -2181 -1621 3401 -989 -2953 3070 702 -3833 1896 2527 -3861 124 3816 -2835 -1932 4398 -947
1563 -947 -3645 3640 1400 -4440 1903 3384 -4049 -527 4370 -2513 -2756 4215 -339 -4060 2920
1578 2920 1769 -4163 1066 3165 -3240 -719 3732 -1810 -2153 3552 -312 -2975 2678 1003 -3453
1593c453N074O41n709L582L152o096J249N443n205j848O821k925m928O559N41
1608B898p084M378M209p362P12O825n466l104P539k052o122O134J825p334L312
1623f92M871o523j67O512m332l185O447j414n210N086J377o021L095L604n821
1638b373O48N238m668j788O078k630m257N857mn957M444L023o759J789N759n866
1654a466j859P288l156n275O839N83p338M310M319p248N96O770n095l264P196
1669C200j690n774N733J626o564K999M256n831N7N598m183k429N838j947m431
1684c542N241M27n573L673K966n976J390N171n198j424O459l141m312O262mo365
1700c946M482L308o928J435N911n629k048O973k696n107O135Q54o598L681M089
$$ plain form
1593 -3453 1621 2262 -3447 135 3287 -2809 -1560 3883 -1322 -3170 3651 726 -4202 2357 2898
1608 2898 -4186 192 4401 -2961 -2249 4576 -890 -3994 3545 1493 -4629 1505 3330 -4004 -692
1623 -692 4179 -2344 -2511 4001 -331 -3516 2931 1517 -3693 1393 2770 -3251 -156 3448 -2373
1638 -2373 -1725 3513 -1155 -2943 3135 505 -3752 2105 2101 -3856 588 3611 -3148 -1359 4400 -1466
1654 -1466 -3325 3963 807 -4468 2371 2954 -4384 -74 4245 -3003 -2407 4363 -732 -3996 3200
1669 3200 1510 -4264 1469 3095 -3469 -470 3786 -2045 -1988 3610 -573 -3002 2836 889 -3542
1684 -3542 1699 2126 -3447 226 3192 -2784 -1394 3777 -1421 -2845 3614 473 -3839 2423 2419 -3946
1700 -3946 536 3844 -3084 -1649 4262 -1367 -3415 3558 862 -4245 1890 2744 -3854 -173 3916
1715C916o384L82N937m383k753O277j638m966N038J194n721K914L387n358N75
1730a583M772m073j878N479k247l741N132N2n235L811K653n813J503M917n064
1745a315j439O184k943m282N916K13o101L936L345o214Q94N583m738k224O191
1760C006j959m688N216J038n738K951L559n374K71M962l829k157N275j671m042
1775c180M503O52m835K839K689m756Q52M151l824j369M973k195l421M640R9m835
1791c017L416K491n364J238M482m460j419N530k344l981N098M52n320L222L142
1806C166n296N29M896l827k173N189j413m003M111R58m690K337K814m375L54L958
1822B535l128j572M224j512l130L882L63m086K645K256m351Q45L742l529j246
$$ plain form
1715 3916 -2468 -2086 3851 -532 -3285 2992 1354 -3612 1426 2620 -3101 -187 3200 -2158 -1583
1730 -1583 3189 -884 -2762 2717 470 -3271 1861 1913 -3322 489 3142 -2671 -1168 3749 -1315
1745 -1315 -2754 3430 487 -3795 2121 2334 -3767 169 3514 -2700 -1806 3777 -961 -3185 3006
1760 3006 1047 -3641 1575 2613 -3125 -174 3385 -1989 -1718 3244 -585 -2742 2533 862 -3180
1775 -3180 1323 1975 -2860 -21 2668 -2088 -1236 2915 -909 -2278 2695 500 -2921 1719 1818 -3017
1791 -3017 399 2890 -2474 -1236 3246 -1214 -2633 2897 553 -3428 1670 2122 -3198 24 3166
1806 3166 -2130 -1601 3295 -532 -2705 2484 1071 -2932 1179 2137 -2553 -216 2598 -1777 -1423 2535
1822 2535 -593 -2165 2059 547 -2583 1299 1662 -2424 221 2477 -1874 -1029 2713 -816 -2062
1837b062M471j989l172M150L00m448K792K513m486N51M173l462j629M652j501
1852H53l572L944Q22m470K201K847m232J18M098k978j949M135r94l372L329R30
1868A710l847J853K444l509J63L373k561j378L622j313k677L208L90l562K178
1883I4K026l759O15L375l027j305L890j419k924L432O24l861K076K470l674O0
1899a307L664k599j774L786q23l258K956J079l698J536K564l317k90L493k157
1914a45j817L383n64k820K546J024l262J396K153k852j23K916k052j397L013r18
1930D81k331K617N03l018J666J841l017L09K960k479j227L424j028k763K916P92
1946A646l496J578K445l289k67L384k050j998L265k16l031K326J368l164Q57K474
$$ plain form
1837 -2062 2409 420 -2752 1398 1698 -2750 42 2555 -1931 -1380 2793 -669 -2298 2354 853
1852 853 -2719 1225 2047 -2423 -222 2625 -1607 -1489 2609 -369 -2318 1817 823 -2549 780 1710
1868 1710 -2137 -284 2160 -1349 -1186 2187 -374 -1752 1870 557 -2120 1088 1478 -2084 94
1883 94 2120 -1639 -1024 2351 -676 -1981 1909 490 -2434 998 1622 -2239 -163 2307 -1367 -1307
1899 -1307 2357 -242 -2016 1770 947 -2311 645 1724 -1974 -438 2126 -1191 -1481 2012 -145
1914 -145 -1962 1421 857 -1963 583 1607 -1655 -259 1894 -958 -1081 1835 -217 -1614 1399 481
1930 481 -1850 767 1270 -1748 -82 1759 -1258 -949 2011 -468 -1695 1729 701 -2062 854 1646
1946 1646 -1850 -272 2173 -1116 -1383 2001 -49 -2047 1218 1002 -2029 297 1665 -1499 -642 1832
1962A832k411o74K812j359j788K641k26k343J926Q60k587J016J805k395n5K354
1978A408j698j130K684p69k205K427N82k932J538J985k992O9L015k186j587L281
1994A490o43k892K544J152l352J102K559k743p75L244j426k130K829K17k786J675
2010F5J485k559L41K238j979o26K254j049j457K070j54k003J698P35k359J109
2026a91J623k400J68K477j876j287K883o73k535K440Q70l137J307K239k881m14
2042a387L139j658j992K916%k857J981J422k796N41K453k151q55K634j028j858
2058a496K262J12k153J391J103k308N80J803j923l18K151j264j227K330m81j982
2074a420J986N67k505J294J741k614r0K771j870j551K928m87k618K265J177l113
$$ plain form
1962 1832 -579 -1253 1559 200 -1588 1053 827 -1516 410 1270 -1317 -301 1504 -891 -946 1408
1978 1408 -290 -1420 1264 495 -1710 717 1299 -1633 -95 1890 -1102 -1033 1982 -204 -1791 1490
1994 1490 847 -2045 499 1651 -1701 -599 1960 -783 -1558 1686 260 -1870 959 1176 -1610 65
2010 65 1550 -1009 -668 1570 -409 -1035 1219 170 -1287 783 629 -1374 324 1059 -1300 -191
2026 -191 1432 -968 -800 1677 -199 -1486 1397 724 -1811 629 1499 -1638 -331 1908 -973 -1387
2042 -1387 1752 94 -1898 1018 1018 -1839 142 1564 -1232 -691 1762 -389 -1244 1390 362 -1496
2058 -1496 766 878 -1275 116 1219 -1089 -509 1294 -629 -947 1204 -60 -1287 1043 562 -1420
2074 -1420 566 1133 -1372 -78 1663 -951 -1041 1730 -140 -1691 1237 750 -1868 397 1574 -1539
2090a539R45K456k519p54K998j360j863K562R0k546J699J320k525M49K055j950
2106d82m94K204j210j309K194k93k060J833P53k442J042J705k280n5K449j620
2122f5j356K614n09k342K193Q07k785J058K083k559l16K762j620j643K771k33
2138H60k625K093J148k761P57K281k391n24K671j380j659K491j32k369J811R13
2154A184k462Q81J834k254j64K360j553j246K525n33k093K109O00k568J250J638
2170A508k417%K486j823j277K745o60k325K284Q04k800J119K043k584j46K641
2186A598j631j500K684l35k366J978R23k691J002J895k392j39K441j609j347K533
2202A044m72k131K028P06k437J053J694k297k1K359j731j105K582q20j982K207
$$ plain form
2090 -1539 -594 1862 -657 -1411 1587 227 -1636 926 1016 -1530 169 1489 -1036 -587 1468 -482
2106 -482 -976 1228 18 -1291 903 610 -1450 383 1136 -1306 -264 1441 -839 -894 1555 -65
2122 -65 -1421 1193 684 -1658 535 1342 -1443 -385 1698 -861 -1177 1585 -35 -1678 1093 860
2138 860 -1765 328 1476 -1285 -528 1753 -638 -1162 1509 129 -1530 961 829 -1540 271 1184
2154 1184 -1278 -397 1437 -817 -981 1379 -174 -1420 1105 572 -1521 588 1188 -1380 -130 1508
2170 1508 -909 -909 1577 -246 -1523 1222 562 -1763 521 1325 -1475 -356 1687 -897 -1043 1598
2186 1598 -33 -1533 1151 816 -1550 428 1351 -1340 -338 1557 -835 -974 1467 -142 -1489 1044
2202 1044 572 -1559 469 1175 -1262 -209 1485 -812 -833 1526 -205 -1310 1272 452 -1530 677
2218F77M15k604J414J622k639K19K526j934j181K770p15k274K319P07k741J224
2234a95J861k535j95K627j634j364K500m17k244J939Q51k532J033J680k219k5
2250h69K278j587j134K384n93j950K149M41k494J311J580k463J24K338j880j044
2266a409K678q37k059K208M89k550J321J780k553O1K445j746j185K632o58k167
2282a550K088O83k575J084J705k255r2K351j636j112K341n56j885J875N48k215
2298a201J129J402k097K5K156j687r49K378o95j937K078L87k382J341J490k397
2314i59Q1K355j723j138K522n51k091K011P15k532J122J687k182k21K254j446
2330i6j166K216m71j870J822N32k180J054J386k038O8K043j484r34K186n88j801
$$ plain form
2218 677 1092 -1512 -98 1524 -1115 -896 1630 -304 -1485 1285 570 -1704 615 1322 -1419 -195
2234 -195 1666 -869 -1064 1563 -71 -1435 1065 648 -1596 343 1194 -1338 -305 1375 -844 -869
2250 -869 1409 -178 -1312 1072 479 -1471 678 1119 -1375 -64 1516 -947 -823 1515 -365 -1409
2266 -1409 1269 432 -1627 581 1070 -1480 -159 1621 -932 -871 1574 -172 -1357 1275 617 -1550
2282 -1550 538 1221 -1354 -270 1435 -820 -912 1439 -197 -1309 1032 476 -1409 466 1014 -1201
2298 -1201 -72 1330 -767 -742 1414 -273 -1222 1156 461 -1476 602 989 -1393 -52 1438 -959
2314 -959 -878 1477 -246 -1384 1138 587 -1504 507 1222 -1310 -188 1499 -683 -904 1350 -96
2330 -96 -1262 954 483 -1387 435 967 -1213 -159 1227 -811 -743 1300 -184 -1118 1068 480 -1321
2347a321J893M73k215J084J420k100p0K144j474j057K199n07j858J843N28k181
2363a199R90J526j996j12K063j362j090K107l66j882J646P33k129Q30J421j849
2379f69j38J927j244r66J926l19j712J607N48k042R21J344j801j18J915j322r54
2396a097J991m21j724J589O05k040Q47J431j824k14J990j087j094J810j31j731
2412a100J378P29j889O06J382j579k84J789j004j070J723k01j576J328O61j808
2428i15O43J416j625k73J861j070j103J840k43j636J320P66j917N97J438j585
2444d86l44J786r12j137J644Nj591J161Q10j705M53J396j420l72J643q66r72J469
2462E62n9j432J030P21j571L80J300j296l56J513p56j020J537l1j427J092O95
$$ plain form
2347 -1321 572 1045 -1170 -86 1334 -766 -836 1308 -166 -1223 976 469 -1389 454 982 -1199
2363 -1199 -209 1317 -679 -791 1272 -90 -1180 927 561 -1321 325 1058 -1071 -241 1180 -669
2379 -669 -807 1120 -124 -1090 836 517 -1195 412 960 -1082 -161 1183 -618 -736 1179 -143 -1097
2396 -1097 894 473 -1251 338 943 -1097 -250 1181 -643 -857 1133 46 -1048 762 631 -1100
2412 -1100 278 1007 -882 -276 1106 -473 -757 1032 28 -1042 681 480 -1096 232 893 -915
2428 -915 -272 1144 -481 -754 1107 37 -1066 774 531 -1105 215 981 -936 -339 1099 -486
2444 -486 -830 956 44 -1093 551 556 -1035 126 936 -769 -316 1080 -340 -712 931 65 -907 562
2462 562 503 -929 101 822 -749 -369 931 -365 -721 792 36 -984 553 522 -905 187 882
2479H82j651N08J313j414l67J655p84j197J649J5j592R50R09j595J80J541j239
2496b37n38J534m90j193J383J44j419Q62P32j344K30J186j205k62J379o93r53
2513h84J428q7j350J017O57j487M21J225j274l63J543p25j050J491M5j534R68
2530D1Q90j638K83J388j236n33J534n42j118J327K32j502R18Q51j527K37J315
2547I20j105n44J507n83j004J189J77j344P63P59j361K50J201j110l91J386n81
2564A29r62J392l7j352R74P24j530L04J308j278l93J505o65j079J409R7j492Q87
2582e9Q29j441K75J308j162m77J447m67j083J269J74j323P42P76j397K47J191
2599H49j107m09J360o09r86J294J00j348Q79P18j341L48J079j088l38J372o76
$$ plain form
2479 882 -769 -261 1052 -362 -729 926 142 -1055 594 609 -983 -33 876 -719 -539 1002 -237
2496 -237 -775 759 269 -924 459 603 -816 46 778 -566 -336 850 -355 -617 762 69 -884
2513 -884 544 457 -893 124 781 -706 -285 940 -334 -697 846 121 -929 562 607 -927 41
2530 41 931 -707 -424 964 -272 -805 729 187 -931 396 628 -874 44 895 -632 -395 920
2547 920 -185 -729 778 195 -809 380 557 -787 -24 735 -626 -376 825 -285 -676 710 129
2564 129 -833 559 522 -830 144 868 -662 -358 950 -328 -721 784 119 -960 449 546 -946 -59
2582 -59 770 -671 -396 912 -250 -727 720 253 -830 439 613 -710 32 808 -589 -342 849
2599 849 -258 -667 693 84 -902 392 492 -856 23 741 -600 -252 827 -261 -599 773 97
2616I7q38J243r4j288J021O52j540M61J155j350k02J507p95r08J402M3j532J074
2634A08P48j518L12J278j186l71J415o16j030J300M2j323Q52P03j361L14J128
2651G95j100l11J332o19q79J309q3j207R51N29j346M44J049j278j43J355q56q02
2669h60J425j57j322J105N14j467N57J088j288k18J529q62r06J467j39j400J092
2686A58O39j510M03J174j190l47J424o69r60J348r3j169R11O27j353M57R20j108
2704c38j63J204o63p46J286k59j129R94N02j421N81J010j364j2J366r20p37J442
2722F33k65j222J152M60j453N56J082j346j72J449q58q65J454k26j228R92N13
2739F56j361M36J128j278j12J306p53p53J277j79j167J040L80j289N19Q75j134
$$ plain form
2616 97 -741 502 408 -880 141 793 -747 -286 869 -481 -683 824 29 -879 523 566 -966 108
2634 108 856 -662 -350 928 -258 -629 786 170 -860 440 482 -841 11 714 -647 -333 795
2651 795 -305 -616 716 97 -782 527 444 -763 188 717 -629 -185 864 -414 -557 798 -58 -860
2669 -860 565 408 -914 191 705 -762 -205 883 -405 -623 906 44 -862 605 466 -934 158
2686 158 797 -713 -310 864 -326 -673 751 82 -878 470 377 -792 119 746 -607 -150 770 -338
2704 -338 -501 703 40 -706 580 321 -808 186 688 -733 -152 858 -506 -518 848 -72 -809 633
2722 633 368 -854 298 758 -695 -139 943 -403 -575 874 16 -849 605 379 -849 143 656
2739 656 -705 -269 859 -419 -531 775 22 -731 546 367 -800 240 620 -669 -150 725 -409
2756d09p2J203q38o81J387l22j138J108M51j499O74J005j325o4J430r15q48J481
2774F28j77j338J091N44j466M36J117j245k47J385p24p50J224j50j125J024M21
2791F48j277M66R26j159KJ111q11n96J235k56j146J124K97j293O41Q92j304M7
2809d53J291r04o31J333l21j081J060M27j409N13J023j244j84J321p16p67J262
2826E20j65j129Q37N19j165L68R54j083j17J107o26o77J148j43j042Q87L53j100
2844e54M27Q30j107j5J121q06n53J243k83j053J046L13j250N53R15j223r0J288
2862H02p89p09J198j14j144Q31N35j217L51R28r42k98J212n81p01J028J4j047
2880f43P59M94j079K72Q46r43j52J091o07o96J066j03j012Q81K80r97L57Q40r69
$$ plain form
2756 -409 -481 722 -116 -797 590 268 -870 238 689 -810 -136 869 -456 -520 910 -5 -853 628
2774 628 451 -887 204 748 -718 -282 835 -410 -657 728 4 -746 478 328 -797 227 648
2791 648 -629 -163 763 -396 -394 717 -94 -690 545 289 -857 267 564 -729 -88 804 -500 -453
2809 -453 838 -66 -697 636 315 -766 294 721 -688 -175 848 -396 -580 741 25 -742 520
2826 520 355 -774 63 582 -583 -215 739 -344 -461 646 20 -657 491 348 -694 193 546 -554
2844 -554 -127 703 -404 -419 702 -104 -657 586 303 -750 296 609 -641 -88 827 -396 -486 802
2862 802 13 -696 502 388 -756 75 610 -607 -256 672 -270 -568 644 63 -638 390 404 -643
2880 -643 116 610 -469 -197 649 -294 -446 645 38 -658 408 305 -707 174 454 -543 -186 654 -315
2899c15j50J130o54o56J169j84j035R07L85j149L72Q64j031j65J102n63p13J087
2917D01K5j092P09O04j152K17R39q16l07J083m90p35R70k7q95O06M83j020K36
2936b61Q39q30j89J041n40o56R38K5j015P72M74j081L11Q19q72k49J070n01p26
2955f31R65P5j035O24N68j055K09R01q14l07J079m65p55R36J30j050O77N70j020
2974c98J27Q75p36l95J018m24o46Q53Q8q90N42M32q56J73Q01p33k80J003m37o43
2994e26Q42K7r31O36N40r85J98Q14q10l41J044l86q07R48J81j054N64O28r23L1
3014c10R19o46m77R49k25p45O92K80r51M66N15q13N7P94o05l47Q81l80n81P83
3034B56J08q56N96L90q87K04O91o41k79Q46l61o72Q91N1r28N95N11r17J27Q43
$$ plain form
2899 -315 -465 665 11 -645 524 340 -695 212 597 -552 -180 684 -347 -512 590 27 -686 401
2917 401 426 -666 43 647 -505 -288 651 -165 -472 611 121 -614 356 329 -566 40 523 -497 -261
2936 -261 578 -252 -441 600 60 -596 342 367 -648 124 598 -483 -172 647 -225 -474 596 95 -631
2955 -631 334 409 -626 -2 566 -489 -280 621 -193 -500 579 114 -641 295 425 -625 52 622 -398
2974 -398 -271 604 -132 -527 491 67 -579 274 362 -528 14 446 -410 -237 564 -169 -449 554 117 -526
2994 -526 316 343 -588 48 588 -397 -199 615 -195 -536 508 122 -685 263 444 -610 -46 582 -341 -310
3014 -310 609 -37 -514 435 210 -535 157 437 -514 -48 467 -346 -289 505 -100 -447 434 54 -527 256
3034 256 364 -492 104 494 -393 -189 502 -139 -418 428 67 -605 286 337 -591 4 515 -402 -275 568
3054E68p67k76R73k97q09Q73K30r60L59P06q75o9Q51n82m33Q29j37p48P04K33
3074C73q18L54N20p86R9P02n62k80Q53l63n46O87Q4q47N61M88r06J52P65o28l74
3095d72R45l23p32Q29J35r24M97O63r12pQ27n80m85R30j63q04P05K65q37L20O01
3116D78p71L4O66n24l04P93k28n95O08K03p60M39M35p72J66O44o97k61Q72l28
3136I8o29Q37l2q25N49M96q81J40P88o29l68R25k83p14P97J38q33L74N18p00j00
3157c34P71m77m04O88p6o52O11K01p09L04M47o32O3N96m67k45P05k93n71O83R3
3178C02p61N09L79q13J89O97o98k16Q40l00o64P63J58q98M98N42q80R7Q29o16
3198d3m33Q42j82o88O15K23p55L10N22o18n7O42m19l05O09j43n07O28K9o53M10
$$ plain form
3054 568 -199 -475 498 201 -608 265 495 -465 -106 600 -275 -344 507 -75 -508 321 184 -564 140 373
3074 373 -445 -91 429 -357 -258 444 -118 -398 455 92 -454 233 317 -530 31 519 -387 -235 530 -98 -472
3095 -472 473 150 -582 247 382 -542 -45 618 -294 -301 526 -54 -539 391 228 -576 129 394 -443 -123 478
3116 478 -293 -259 407 -117 -421 372 144 -451 157 360 -400 39 474 -298 -132 512 -185 -446 426 98
3136 98 -531 306 274 -551 -2 494 -387 -247 541 -88 -456 469 186 -528 269 407 -426 -52 466 -234 -334
3157 -334 437 -40 -444 244 168 -484 127 328 -381 -77 370 -262 -199 397 -70 -315 390 97 -474 209 302
3178 302 -459 50 429 -384 -195 502 -196 -412 428 128 -536 227 385 -513 -15 527 -353 -256 573 -43
3198 -43 -476 366 184 -504 111 334 -421 -111 411 -207 -264 378 -41 -346 263 120 -387 241 270 -383 27
3219B7L79p32J89N41n92j43P63m40n04P57P1q06N01N07q55N0Q47o51l78R27k39
3240B19p35P26K10q26K95N49p45lP42m69l53P07k04n71O44J05o23L30L47n16N
3261a66N48m75j91O54l47l69O04k3o64M91L54q21J73O81o07k00P82l27n75P30
3281B52J57q73M67M56p18mP25n16l33O62j17o30N40K59o82K37M74n12j9N46l83
3302a2k99O56k81l83N37mn32L93K69o72K07N49o11j91P95l86m87O73N9p28N07
3323E9L28p24J27P10n54l22P34j93o35O27J86p25L33M28o02o7O73m03l76O72j04
3344A72n44M60K36o18K93L27n00O5M51m51j32N51k53m03N69Oo52M32L46o98J66
3365a77N93n81k05P57l02n59P44L5p90N21M20o74K1O29n25l36P48j38o22N40K33
$$ plain form
3219 27 406 -326 -137 404 -188 -331 432 -8 -512 245 316 -490 11 518 -337 -287 560 -91 -469 458 219
3240 219 -516 210 420 -406 -111 438 -307 -310 432 -37 -390 317 113 -458 186 291 -332 -2 345 -171 -166
3261 -166 382 -93 -284 370 23 -346 258 235 -429 62 416 -405 -232 449 -158 -358 424 97 -478 252
3281 252 409 -464 3 459 -259 -263 462 -54 -387 275 158 -472 68 327 -355 -118 356 -156 -175 371 -12
3302 -12 -311 345 64 -319 218 214 -318 75 344 -328 -121 428 -183 -374 421 35 -452 221 280 -448 59
3323 59 387 -337 -210 500 -54 -376 358 165 -470 157 343 -382 -49 379 -223 -290 383 -20 -396 276 172
3344 172 -372 88 324 -294 -1 326 -174 -109 342 -109 -241 310 57 -346 223 229 -423 9 355 -343 -177
3365 -177 416 -165 -370 387 85 -474 270 305 -485 36 456 -218 -197 432 -93 -429 319 181 -441 99 332
3386C32o90K90M46n60q7O13l51k62N23r4m85M86J23n80L01K72m72M8M78m17k10
3407b96N76k09m04N26L0n92M02L24o69J35O63o06k56P02k13n87O42J54p33L44
3427f7M74o32o1P15m58l62O43p2n06M33K38o02J93M11m67n6N30l54k80N05j11
3448A14m48M97M5n43L01L24n85J38N75m76k27O29k27n46O40N9o13L33L65o26M7
3469b24O54m86l13O54j37o02N80J97p10L26M53o04l4O01l68l10N64n3n62M22J63
3490B11n15K56L04m53nM41l05k62N50j11m67N24Q0n83L39L33n32K6O07n07k38
3511c07O09j76n08M91J63o34K77M43n70o2O51l79l78O68r8n40M18K74n98J43M57
3532C44m89j37N78k45l53M82o9m46L70K00n05J58L90m77J5M58k67k86M87q2m14
$$ plain form
3386 332 -358 -68 378 -182 -269 344 -7 -269 254 160 -325 161 284 -296 5 277 -195 -147 331 -86 -296
3407 -296 280 71 -333 193 223 -369 33 357 -312 -177 486 -120 -376 326 113 -474 168 322 -411 -67
3427 -67 407 -225 -286 429 -29 -391 252 180 -326 107 345 -257 -64 347 -120 -176 354 0 -280 225 114
3448 114 -334 163 208 -335 -34 290 -295 -157 418 -58 -285 344 117 -429 211 270 -343 -10 355 -271 -224
3469 -224 430 -56 -369 285 148 -454 126 323 -387 -61 392 -212 -246 355 -13 -323 241 188 -374 48 211
3490 211 -304 -48 256 -197 -202 239 -66 -328 222 111 -356 168 248 -335 4 337 -195 -169 438 -69 -307
3511 -307 302 126 -382 109 272 -362 -85 358 -212 -274 377 -2 -380 288 190 -350 68 342 -256 -113 344
3532 344 -145 -282 296 51 -302 180 111 -335 35 235 -270 -112 278 -199 -184 274 7 -279 208 126 -288
3553b88L94J80n67K57L36n59N5N05l70k45N73j92m82M60K80o70K80M51m96j56
3573b54O05l35l64N73Mn44L59K15n62K19M10m18j72M81k42k74N07j05l56L06J88
3594B41m61K00L19m53jM38l41k50N62k00l34M03J82o43K87L87n05p6N58l08l41
3615c36N69J8n95M38K46o07J71M74m37k05N02j78m55M97J18n07L02K46m80J23
3635i6L64l96n5M21j59l21M37o2l76L25J91n75L16L11n05nN22l50l34O05j20m79
3657c41M35J74n47J60M51l80j34M59k30l63M71M2m69K85K82m49m6N20l74j84M35
3678A97j96k61M50l8l69K55J46l58J04L32l81n5M41l10k88N17j04l86L40K10n80
3699c34K05M54m79j08N73k87m07N93O2n94L04L36n41J17M63m66j97M70o4m12M49
$$ plain form
3553 -288 106 286 -281 -24 312 -247 -192 313 -57 -302 271 79 -403 57 337 -333 -53 398 -98 -254
3573 -254 351 16 -348 225 229 -315 44 259 -303 -84 326 -92 -264 217 -25 -299 208 103 -253 53 241
3594 241 -220 -20 299 -154 -155 283 -58 -308 254 54 -280 123 305 -338 -51 336 -169 -245 313 5 -336
3615 -336 233 251 -344 94 340 -267 -96 378 -59 -264 238 60 -395 102 220 -287 15 261 -219 -96
3635 -96 268 -128 -183 238 79 -242 195 133 -243 82 273 -302 14 325 -180 -185 337 -13 -347 258 138 -341
3657 -341 94 268 -279 -119 332 -48 -182 277 47 -316 155 197 -272 13 295 -154 -200 320 -54 -238 197
3678 197 1 -260 190 152 -217 38 184 -174 -70 262 -119 -174 267 -43 -331 186 82 -304 36 246 -334
3699 -334 -129 325 -154 -262 311 24 -383 210 272 -322 -18 318 -223 -106 357 -109 -306 164 100 -312 137
3720A37R7m69K21K08l45O0K93k39j29L35j06k47L43l7l79L21J51m56J68L57m20
3741a36j07N15l05l15N49k0m96L91J94n19J01M76m50j77N81j85m28M33P2m14J67
3762g3L53m59J4L63k30k01M14j27k56K98K5l39K24K27m27R4L48l37q9L78k21k44
3784b65L94Qm49L04K50n22J42N06m89j01M97k36l66M54O7m35J76L69m91jM49l34
3806g3j57M31j37l26L82R3m67K13K67l51RL87k90j60M02j93k90M11jm64L45J93
3828B24m19Q9L93m07r1M79k10l67M64J8m83L71K11n10J10M35l24j93M44j26m28
3849c20M27J20m92K23K54l62j6L40k06j56L77j51k88L53J01m23J97K64m33R2L55
3870B56l37q7M18k47k77L56P7m46K91K56m43K8M64l93j56M88j17m86M56R9m86
$$ plain form
3720 137 234 -235 -14 194 -151 -91 202 -37 -166 169 63 -184 159 122 -257 64 215 -241 -73 284 -136
3741 -136 -243 272 -33 -348 201 181 -315 76 270 -249 -148 328 -122 -299 282 97 -331 102 174 -240 -73
3762 -73 280 -179 -165 198 -32 -233 181 54 -202 96 121 -218 6 233 -194 -100 248 -89 -178 200 -21 -265
3784 -265 129 137 -312 -8 242 -280 -138 368 -121 -222 275 39 -327 127 194 -241 -65 304 -187 -188 261 -73
3806 -73 -230 201 64 -262 120 213 -254 -41 226 -125 -116 271 -19 -179 223 30 -260 151 150 -314 31 224
3828 224 -195 -106 287 -120 -211 268 58 -309 155 173 -310 61 272 -238 -128 307 -17 -210 234 108 -320
3849 -320 107 227 -265 -42 212 -150 -166 174 -32 -188 189 38 -250 103 204 -219 -22 242 -191 -99 256
3870 256 -81 -168 250 3 -274 82 159 -287 4 260 -183 -155 309 -84 -240 248 131 -355 101 200 -286
3891b86K69K83m52K8M02k85j87M32j34k62K70R6l85J99K76l63L7K92l20j22M26
3912B14j77k68L70n5l28K82K04m14M6M18l92k03N78k18l57M79Jm36K35K46m42
3933b17R2L96l46j54M14j12l68L59R8l53J70K79m03N5L25l14j02L72j71j92K97
3954A25K3l49K54J31l81J71K30l33l1M30k48k55L89o3l36L11J74m07N7L65k89
3975c2j98M85j49l23L29N4m76K95K67m34N4L13k77j18L76j04l37L70P6m10K62
3996B3J63l40Q0L04l28q5L96j38k97L06L8l48K20J77l28R0K71k84j34M89k49k62
4018b36L95l4l64L06J39m09J19L21k81j33L45q5l30L30P0l54J73J66l09%L93k76
4040e4j27M10j39k77K87K6l26J94K27l86J1L99l62r4L96j22k79L35L0m12L34R9
$$ plain form
3891 -286 -17 266 -186 -158 244 -41 -228 204 70 -192 78 174 -211 -12 264 -99 -62 230 -90 -212 214
3912 214 37 -231 139 84 -244 38 242 -172 -126 292 -100 -303 275 57 -300 179 180 -256 -21 225 -217
3933 -217 -125 271 -75 -229 185 73 -295 64 162 -191 -21 258 -145 -90 235 -79 -181 191 20 -172 125
3954 125 148 -201 53 184 -197 -26 204 -129 -160 270 22 -233 156 93 -243 68 242 -165 -108 257 -32
3975 -32 -230 255 106 -217 112 166 -310 -15 252 -182 -128 185 -92 -210 166 62 -275 95 171 -239 23
3996 23 186 -154 -74 230 -98 -183 213 75 -222 84 122 -226 -6 171 -157 -67 204 -80 -214 275 26 -236
4018 -236 159 125 -239 67 206 -203 -84 237 -44 -177 168 83 -247 83 153 -201 -28 138 -171 -171 222 -54
4040 -54 -181 229 90 -187 100 126 -200 -6 221 -165 -154 245 -117 -211 185 63 -216 119 149 -263 71 170
4062A70l52P7L53l18o8L46j70k54L65k8l56K65J77m14J02L44k94j75L83rl54L15
4084A05P4l77K13J47k91L9K84j87j78L42j15k41K72K9l21J95J09k07j9L44k35
4105a8p6K60j87j28K02J15l28J95J80l80O4L52k99j94L87q1l18L75K3l67K50J81
4127B08k65n9L75k50j37K32qk63K16J21l17O4J83j60o7K21j01j52K82q5k13K40
4149F5N4k59J51J35k59M7K66k69j63M33j14l06L08N6l23J47K67l69j4L83k57k45
4171b66M37o6l26K37K31l76P1K75k75j18L64j54k11L06n9k68K62R4l12R8J74j98
4193h0QK58j98j40L18j00k39K45J19l58J15K47l84O2L38k43j43L77j60k44K35
4214C3K10m14J33K56l22k4L33j28k70L61k0l16K29J77m06O1L18k69q6L13j82j47
$$ plain form
4062 170 -182 -105 248 -70 -138 208 38 -216 149 121 -235 30 207 -207 -105 239 -55 -230 153 144 -210 105
4084 105 179 -198 15 162 -129 -90 194 7 -171 171 56 -185 87 116 -205 -10 99 -108 -127 217 -18
4105 -18 -94 166 -21 -149 53 168 -160 35 215 -165 -101 251 -48 -242 145 64 -254 121 144 -223 27 208
4127 208 -57 -116 259 9 -128 104 96 -167 49 170 -147 -83 100 -60 -127 94 -7 -159 123 38 -175 65
4149 65 119 -140 11 146 -113 -66 200 -69 -232 201 87 -219 89 145 -178 -31 236 -133 -147 236 -21 -266
4171 -266 171 105 -221 16 247 -129 -58 217 -58 -176 188 34 -177 129 70 -198 64 158 -154 -56 118 -80
4193 -80 -72 186 -12 -152 166 66 -173 72 191 -167 -52 195 -189 -127 211 -32 -175 202 42 -202 33
4214 33 243 -171 -38 218 -104 -128 205 77 -193 168 148 -168 61 238 -168 -107 211 -58 -144 169 -13 -160
4236a60K67n2k15K25Q8l22R4K67k61j3L03k10k04L59j07k40J69R4k86J29K84l06
4258i7k3L14j74j97L41l9l22K40J85l78N3L14k54j11L36j34l52L70N5l47K44J87
4280B11l53J18K61l82j9L37j84j84L41j28j86J89J83m09J85J41k07k5L17k89j39
4301b22M08q6k73K49J32m17K29K78m02k0L82k54k34M04M5m72K72K30l97j9L94
4322B27k60j69M13j67k35K45K9k16J51J36l03J36J95k35o8L19k48j83M02r9k63
4343a93K40J79l81J01L03l69M2L01k32j66L23k9l07K76J13l04R7K58l49o1L68
4364B10k21j89K66k4k74J79K59l66P9K61k47p5K90j45j61K34Pk52J84J51l46J24
4386e6K08k73M7K57k08j28L03p6k58K78N6k97P8L11l85pL56j73k91L27N7l39K39
$$ plain form
4236 -160 107 55 -160 65 153 -169 -75 192 -69 -82 221 11 -193 166 59 -181 -12 82 -204 -75 209 -97
4258 -97 -120 194 20 -177 164 125 -197 43 228 -150 -97 217 -37 -148 188 54 -298 72 127 -220 24 211
4280 211 -142 -24 237 -145 -164 173 -11 -195 146 18 -168 21 204 -205 -20 121 -86 -111 206 -83 -222
4301 -222 186 100 -173 76 208 -209 20 298 -104 -124 258 4 -230 174 219 -253 19 249 -148 -167 227
4322 227 -33 -202 211 44 -191 54 83 -133 18 154 -149 -13 182 -53 -121 198 -50 -233 169 70 -193
4343 -193 47 226 -155 -54 249 -120 -78 223 -9 -175 148 119 -188 88 201 -103 -6 252 -97 -158 210
4364 210 -11 -200 66 42 -232 -53 206 -160 -81 180 -67 -142 148 3 -158 76 83 -169 15 166 -180 -56
4386 -56 152 -121 -74 183 -25 -153 150 74 -184 94 150 -147 -69 242 -143 -150 206 33 -258 69 126 -213 26
4409B6J56l93R0K88k28r0L62j97k02L06Pk93J91J64l01P0K59k74n5K48j39j56
4431a61K72k9k68K18J01k72J13J73k97P1L02j94j46L21j46k59K55J03k98P6K26
4452A61k52q9L80k28j95L55n4k38K09J03l55J73K01k15m8K94k27j56K69Ok33J38
4474aJ06k53R5K46l42K7L37k06j58L16o2k30K41K2k90J71J27k81P1K61k14r8K65
4497A50o5k59J93J40l01J51J84k81j5L06k48j03K45J4k50J63O5j85P3J77k40m0
4519a26L07j89j72K72l5k48L04Lk54Q5K49k65k5K58j44j64K67l8k21J77L2k11
4541a38R4K02k80k7L06j73k07L36n2k35K40N4k54J29J72k22n8K59j59j53K98k9
4563A03k41K25Nk23J27J50k00k7K28j80r6K20k3j85J65J31k65L1J76k26Q1J61
$$ plain form
4409 26 182 -211 -121 167 -61 -151 211 14 -188 118 125 -168 23 187 -114 -44 215 -59 -114 134 -5 -161
4431 -161 111 82 -186 32 133 -139 -26 147 -150 -79 223 29 -117 204 58 -201 54 157 -141 -65 161
4452 161 -91 -180 200 -28 -223 132 78 -160 49 152 -203 -30 171 -44 -92 202 -25 -181 88 94 -139 -1
4474 -1 105 -148 -53 193 -149 -122 215 9 -149 167 105 -125 116 138 -152 19 146 -135 -64 197 -17 -115 150
4497 150 85 -174 19 159 -142 9 193 -88 -103 203 -45 -148 97 111 -139 24 89 -96 -23 154 -86 -126
4519 -126 181 -8 -180 92 57 -191 113 116 -138 -53 196 -69 -94 164 20 -144 123 85 -136 41 73 -138
4541 -138 -44 158 -122 -149 157 -16 -223 113 61 -174 66 120 -134 -5 167 -55 -113 146 -13 -166 132 103
4563 103 -138 87 92 -131 -4 146 -54 -81 147 -33 -129 91 68 -117 48 179 -86 -55 121 -105 -24 137
4585A37j49j08K12p1j60K33mk46J14K00k01m4K51j74j22K66j46j99K80M3k61J61
4607A2J75k80J3J43n7j11K09L1l17K32P1k80J27K25k68j6K39j63j55K16Kj98J40
4630a0J76k49L8J74k11j5K35j22j99K28j0j86K09M2j85J17J16j96r5K72j33j18
4652a22K03jk70K12R6k41J06J83k32o9K44j42j08K38L2k43J31J32k66Q4J88j65
4674a0j32L04r7j64K03n6k26J98J37k68J12J08k49KL04j49j54K64p6k00J90N5
4696I6k40J29J74k15j03K60j12j60K53m0j69J45P4j88M2K23j83j10K25j03j15
4717a17K51n6k62J68Q2j10l9J71q9m6K12j47j44K22J0k71J55J90k60O8K05k07
4739a4r3K98j32j90J72N6k44Q3K68l32N2K59k36p3K66r3k47L06l8k19J51J89k35
$$ plain form
4585 137 -12 -120 92 21 -139 94 90 -156 -42 158 -43 -87 164 -10 -132 134 -12 -211 69 112 -149 12
4607 12 187 -93 -80 63 6 -105 104 135 -182 50 121 -159 -32 193 -75 -91 148 -15 -170 46 48 -150 -10
4630 -10 166 -83 -45 129 -82 -97 138 16 -183 45 35 -151 58 100 -85 32 148 -48 -143 129 -4 -122
4652 -122 81 80 -190 22 118 -123 -17 166 -66 -135 109 -33 -141 97 129 -114 17 149 -117 -33 155 -10
4674 -10 -142 162 65 -99 104 48 -178 20 157 -111 1 109 -140 -138 166 17 -137 127 51 -149 41 96
4696 96 -144 -15 159 -56 -159 101 -11 -171 82 42 -127 18 92 -96 -54 169 -14 -124 101 -2 -117
4717 -117 134 78 -184 -16 66 -44 -83 88 -1 -47 165 18 -126 96 106 -165 -10 180 -80 -12 193 -14
4739 -14 -107 191 59 -131 41 97 -147 -64 204 -128 -76 183 -53 -126 140 47 -200 106 68 -151 0 189 -46
4762d6pK26j86j31K72q2k21K63K2l09K21J08k07L5J81j64r4K70j33j44J98J7k10
4785a21J43J52k92PK17j89p6K82n8k54K86Mk64J82J31k31J9K32j95j23K67m8k33
4808a62K01R8k84J36J25k11O4J78j73q7K34n4k09K42pj97J60J27k87P8K51k47
4830b4j01K37j36j11K41m0k86K30J99l68J15K71k96m5K72n3k51K64M4l41K06J08
4852A35k24J3K88k28j54K65rj75J20J9k42J99J20k16O4J59j26j05K25q3j73J92
4874F4M1k44J28J43k18K5K08j99p0K60p4k00K38l3k22J66J86k67j1K67k13r1K20
4897A04j6k77K49P1k85J87Q6k34M9J72j15r8K29j01j64K11J5j86J10Q7k31P5K00
$$ plain form
4762 -46 -53 173 -13 -144 128 46 -175 88 110 -199 22 130 -77 -42 139 -25 -119 151 18 -126 72 89 -121
4785 -121 22 174 -118 -111 106 -83 -159 123 65 -189 97 101 -163 19 150 -81 -62 170 -25 -148 119 71 -162
4808 -162 39 137 -147 -11 114 -97 -33 145 -28 -115 119 65 -144 98 91 -106 54 181 -106 -28 223 -24
4830 -24 -125 112 -24 -135 106 66 -220 10 209 -159 -44 227 -69 -114 158 105 -146 118 162 -179 27 135
4852 135 -89 -76 212 -16 -170 95 86 -89 31 50 -192 7 127 -89 -25 134 8 -97 128 45 -128 64
4874 64 105 -139 -11 132 -86 -61 147 -52 -122 138 64 -136 102 69 -153 13 199 -68 -79 188 -25 -116 104
4897 104 88 -189 60 131 -154 33 119 -115 -66 106 -9 -107 122 21 -143 68 83 -103 7 94 -137 -62 138
$$ [...]
8191A3
##END NTUPLES=NMR FID
##END=
