##TITLE=1H_AM-Sh2
 CDCl3, 24 sc, 
 3.2.2020
##JCAMPDX= 6.0         $$ Bruker NMR JCAMP-DX V2.0
##DATA TYPE= NMR FID
##DATA CLASS= NTUPLES
##ORIGIN= UXNMR, Bruker Analytische Messtechnik GmbH
##OWNER= root
$$ XWIN-NMR		Version 3.5
$$ Mon Feb  3 14:03:49 2020 Russian Standard Time (UT+4h)  she@DPX200
##.OBSERVE FREQUENCY= 200.1315
##.OBSERVE NUCLEUS= ^1H
##.DELAY= (6, 6)
##.ACQUISITION MODE= SIMULTANEOUS
##.ACQUISITION SCHEME= undefined
##.AVERAGES= 8
##.DIGITISER RES= 18
##SPECTROMETER/DATA SYSTEM= spect
##.PULSE SEQUENCE= zg30
##.SOLVENT NAME= CDCl3
##.SHIFT REFERENCE= (INTERNAL, CDCl3, 0, 15.7039)
##AUDIT TRAIL= $$ (NUMBER, WHEN, WHO, WHERE, WHAT)
$$ ##TITLE= Audit trail, XWIN-NMR		Version 3.5
$$ ##JCAMPDX= 5.01
$$ ##ORIGIN= Bruker BioSpin GmbH
$$ ##OWNER= she
$$ F:/spectra/data/she/nmr/H-F/1/audita.txt
$$ ##AUDIT TRAIL=  $$ (NUMBER, WHEN, WHO, WHERE, WHAT)
(   1,<2020-02-03 14:02:20.70 +0400>,<she>,<DPX200>,
      <created by zg, POWCHK disabled, PULCHK disabled
       configuration hash MD5:
       00 E9 B6 7A A2 85 ED C7 34 08 36 98 17 FE 4E 26
       data hash MD5: 16K
       9A 87 39 D7 00 81 B2 73 D7 E6 5C AA 93 58 23 50>)
$$ ##END=
$$ 
$$ hash MD5
$$ 10 66 2C 8B 5A 92 4B E0 37 81 40 6D AB 66 D2 1D
##$RELAX= 
##$RELAX= 
##$RELAX= 
##$RELAX= 
##$RELAX= 
##$RELAX= 
$$ Bruker specific parameters
$$ --------------------------
##$DU= <F:/spectra>
##$EXPNO= 1
##$NAME= <H-F>
##$PROCNO= 1
##$TYPE= <nmr>
##$USER= <she>
##$AMP= (0..31)
100 100 100 100 100 100 100 100 100 100 100 100 100 100 100 100 100 100 
100 100 100 100 100 100 100 100 100 100 100 100 100 100 
##$AQSEQ= 0
##$AQ_mod= 1
##$AUNM= <au_zg>
##$AUTOPOS= <>
##$BF1= 200.13
##$BF2= 200.13
##$BF3= 200.13
##$BF4= 200.13
##$BF5= 200.13
##$BF6= 200.13
##$BF7= 200.13
##$BF8= 200.13
##$BYTORDA= 1
##$CFDGTYP= 0
##$CFRGTYP= 5
##$CHEMSTR= <none>
##$CNST= (0..31)
1 1 145 1 1 1 1 1 1 1 1 1 1 1 1 1 1 1 1 1 1 1 1 1 1 1 1 1 1 1 1 1 
##$CPDPRG= <>
##$CPDPRG1= <>
##$CPDPRG2= <>
##$CPDPRG3= <>
##$CPDPRG4= <mlev>
##$CPDPRG5= <mlev>
##$CPDPRG6= <mlev>
##$CPDPRG7= <mlev>
##$CPDPRG8= <mlev>
##$CPDPRGB= <>
##$CPDPRGT= <>
##$D= (0..31)
0 1.2 0 0 0 0 0 0 0 0.06 0 0.03 0 0 0 0 0.0002 0 0 0 0 0 0 0 0 0 0 0 0 
0 0 0 
##$DATE= 1580724139
##$DBL= (0..7)
120 120 120 120 120 120 120 120 
##$DBP= (0..7)
150 150 150 150 150 150 150 150 
##$DBP07= 0
##$DBPNAM0= <>
##$DBPNAM1= <>
##$DBPNAM2= <>
##$DBPNAM3= <>
##$DBPNAM4= <>
##$DBPNAM5= <>
##$DBPNAM6= <>
##$DBPNAM7= <>
##$DBPOAL= (0..7)
0.5 0.5 0.5 0.5 0.5 0.5 0.5 0.5 
##$DBPOFFS= (0..7)
0 0 0 0 0 0 0 0 
##$DE= 6
##$DECBNUC= <off>
##$DECIM= 24
##$DECNUC= <off>
##$DECSTAT= 4
##$DIGMOD= 1
##$DIGTYP= 9
##$DL= (0..7)
0 120 120 120 120 120 120 120 
##$DP= (0..7)
150 150 150 150 150 150 150 150 
##$DP07= 0
##$DPNAME0= <>
##$DPNAME1= <>
##$DPNAME2= <>
##$DPNAME3= <>
##$DPNAME4= <>
##$DPNAME5= <>
##$DPNAME6= <>
##$DPNAME7= <>
##$DPOAL= (0..7)
0.5 0.5 0.5 0.5 0.5 0.5 0.5 0.5 
##$DPOFFS= (0..7)
0 0 0 0 0 0 0 0 
##$DQDMODE= 0
##$DR= 18
##$DS= 0
##$DSLIST= <SSSSSSSSSSSSSSS>
$$ [...]
##$SUBNAM2= <"">
##$SUBNAM3= <"">
##$SUBNAM4= <"">
##$SUBNAM5= <"">
##$SUBNAM6= <"">
##$SUBNAM7= <"">
##$SUBNAM8= <"">
##$SUBNAM9= <"">
##$SW= 24.9337058887773
##$SWIBOX= (0..15)
0 0 2 0 0 0 0 0 0 0 0 0 0 0 0 0 
##$SW_h= 4990.01996007984
##$TD= 16384
##$TD0= 1
##$TE= 0
##$TE2= 300
##$TE3= 300
##$TEG= 300
##$TL= (0..7)
0 120 120 120 120 120 120 120 
##$TP= (0..7)
150 150 150 150 150 150 150 150 
##$TP07= 0
##$TPNAME0= <>
##$TPNAME1= <>
##$TPNAME2= <>
##$TPNAME3= <>
##$TPNAME4= <>
##$TPNAME5= <>
##$TPNAME6= <>
##$TPNAME7= <>
##$TPOAL= (0..7)
0.5 0.5 0.5 0.5 0.5 0.5 0.5 0.5 
##$TPOFFS= (0..7)
0 0 0 0 0 0 0 0 
##$TUNHIN= 0
##$TUNHOUT= 0
##$TUNXOUT= 0
##$USERA1= <user>
##$USERA2= <user>
##$USERA3= <user>
##$USERA4= <user>
##$USERA5= <user>
##$V9= 5
##$VALIST= <valist>
##$VCLIST= <CCCCCCCCCCCCCCC>
##$VD= 0
##$VDLIST= <DDDDDDDDDDDDDDD>
##$VPLIST= <PPPPPPPPPPPPPPP>
##$VTLIST= <TTTTTTTTTTTTTTT>
##$WBST= 1024
##$WBSW= 4
##$XGAIN= (0..3)
0 0 0 0 
##$XL= 0
##$YL= 0
##$YMAX_a= 939706
##$YMIN_a= -198179
##$ZGOPTNS= <>
##$ZL1= 120
##$ZL2= 120
##$ZL3= 120
##$ZL4= 120
##$ABSF1= 10
##$ABSF2= 0
##$ABSG= 5
##$ABSL= 3
##$ALPHA= 0
##$AQORDER= 0
##$ASSFAC= 0
##$ASSFACI= 0
##$ASSFACX= 0
##$ASSWID= 0
##$AUNMP= <proc_1d>
##$AZFE= 0.1
##$AZFW= 0.1
##$BCFW= 1
##$BC_mod= 2
##$BYTORDP= 1
##$COROFFS= 0
##$CY= 11.3945322036743
##$DATMOD= 1
##$DC= 2
##$DFILT= <>
##$DTYPP= 0
##$F1P= 16.9975609425685
##$F2P= -3.02152046262296
##$FCOR= 0.5
##$FTSIZE= 0
##$FT_mod= 4
##$GAMMA= 1
##$GB= 0.15
##$INTBC= 1
##$INTSCL= 1
##$ISEN= 128
##$LB= 0.24
##$LEV0= 0
##$LPBIN= 0
##$MAXI= 10000
##$MC2= 0
##$MEAN= 0
##$ME_mod= 0
##$MI= 1.114404
##$NCOEF= 0
##$NC_proc= 0
##$NLEV= 6
##$NOISF1= 3.799351
##$NOISF2= 2.8
##$NSP= 1
##$NTH_PI= 0
##$NZP= 0
##$OFFSET= 15.70392
##$PC= 1
##$PHC0= -9798.336
##$PHC1= 19.00081
##$PH_mod= 1
##$PKNL= yes
##$PPARMOD= 0
##$PSCAL= 0
##$PSIGN= 0
##$REVERSE= no
##$SF= 200.130013532006
##$SI= 16384
##$SIGF1= 3
##$SIGF2= 2
##$SINO= 400
##$SIOLD= 16384
##$SREGLST= <1H.CDCl3>
##$SSB= 0
##$STSI= 0
##$STSR= 0
##$SW_p= 3612.71676300578
##$SYMM= 0
##$S_DEV= 0
##$TDeff= 0
##$TDoff= 0
##$TI= <>
##$TILT= no
##$TM1= 0
##$TM2= 0
##$TOPLEV= 0
##$USERP1= <user>
##$USERP2= <user>
##$USERP3= <user>
##$USERP4= <user>
##$USERP5= <user>
##$WDW= 1
##$XDIM= 8192
##$YMAX_p= 0
##$YMIN_p= 0
$$ End of Bruker specific parameters
$$ ---------------------------------
##NTUPLES= NMR FID
##VAR_NAME=  TIME,          FID/REAL,        FID/IMAG
##SYMBOL=    X,             R,               I
##VAR_TYPE=  INDEPENDENT,   DEPENDENT,       DEPENDENT
##VAR_FORM=  AFFN,          ASDF,            ASDF
##VAR_DIM=   8192,          8192,            8192
##UNITS=     SECONDS,       ARBITRARY UNITS, ARBITRARY UNITS
##FACTOR=    0.0002004,     1,               1
##FIRST=     0,             0,               0
##LAST=      1.6414764,     0,               0
##MIN=       0,             -198179,         0
##MAX=       1.6414764,     939706,          0
$$ Real data points
##PAGE= N=1
##DATA TABLE= (X++(R..R)), XYDATA
$$ [...]
1914A01N9j45r7j66M75p6k46K05k15K73k74J67J56j73n6j28J50rJ06k61n9K98
1936H5p3k83O04l43J01o2k19K09J33l42mJ88R2j58n8RL63k57M2M6k5R3N3j97j04
1961a07L54k46J39k40J61j1q0j29K08k47K70n0l6lj93K3K75Q1J39j39Q7l10J32
1984G8j10K07k00J05Q9j68j41j06K73j49P5K2q8J05j88J5K92k51J79N3j24q2j5
2007a29K12J81n6m35K1K82l03J81J98j1k74M27k73K96j9j47Q2j92l5j0P1J80j4
2030B33m3k17R9l46K19j42K51o7o9P6k10k0L46O8j29r7j3k5N9j40L04j60p8K62
2054A61n1l05J95j21K25k00J87k60p9L25j64J34n43P43k84N7k19K84K19n41K6
2075b11K30Nj56J71N8l21K08J0Q5J88n3k23P9j01J29j93K46k76K62k55K73l4l25
$$ y = [101, 160, 15, -82, -248, 227, 151, -95, 110, -105, 168, -106, 61, 217, 44, -12, -140, 10, 1, 107, -154, -213, 85, 12, -271, 333, -10, 91, 29, -190, 19, 152, -190, -194, -6, 86, -72, -130, -121, 242, -15, 27, 73, 48, 141, 194, -3, -107, 247, 1, 140, -100, 61, 50, -30, -159, 49, -198, 72, 22, -14, -17, -210, -187, 88, 169, 308, 169, 256, -54, 78, -32, 175, -25, 80, 169, 1, -140, -246, 27, -122, -47, -25, -113, -8, -196, -181, 111, -140, 39, 92, -32, -114, -129, 83, 264, 208, -227, -206, 76, -227, -46, 152, 141, -133, 294, 21, 317, 298, 151, 233, 41, 6, -4, 67, 247, 233, 190, -27, 72, -274, -55, -197, 54, -13, -82, -6, -216, -236, 110, 178, 49, -48, -61, -86, -27, -167, 137, -23, -101, 161, 110, -195, 0, -121, 104, -96, 91, -169, -248, 77, -87, 47, -496, 247, -37, 20, -199, 85, 304, -237, -211, 19, 24, -132, 39, 97, -224, -16, -6, 79, 267, 214, -9, 70, -31, 98, -95, 151, -125, 137, -118, 155, 121, -204]
2098b04J80L9r6o3n7K11J1J47l16p2K22Q6l68J21J95J17k46j77M18k77K06P8j10
2121D5J22Q6l72R4J01L8j30lK11l28K43j40J29j83J20J24k20K74j07qj05j03n3
2144a65J60j39R8o2p0j75L98r8M7K58l24k11K77q9L5k7Q0J45L0k6o1j06K20k38
2168d3L2N1j89L08k11K34j90J45k66O0L19k3k79J03k13J52K19n8k90M26p08O65
2190B44k53q2J64j42n7j61P0K2O1K88j84qO6l80K38K62j52N3J50Mk82k2j3R5R
2215a0J57J37o76J93n6L03R1j3j41J78m47N09j69j2NJ81k68L9O8J53m22J53PJ10
2239G0k11J32J17l5O2l30J35J33M7r4o0J91j79k8j38K25j79K46J55k02n29O29
2261A57k35n6K76k36K46l83L08j29o2J63K2j60j4K38j82R1l0k81n2L01J08k46
$$ y = [-204, -24, 15, -81, -144, -201, 10, 21, 168, -148, -220, 2, 88, -280, -159, 36, 153, -93, -270, 148, -129, 77, 155, 45, 167, 253, -119, -25, 76, 114, -16, -19, 192, -136, 107, -33, 96, -87, 33, 157, -63, 211, 104, 96, -9, -112, -165, -5, -144, -46, -108, -178, -353, 45, -53, -6, 252, -72, -283, -6, -95, -60, -87, -7, 138, 168, 142, 81, -25, 195, -43, -11, 40, -149, 159, -52, 182, -8, 137, -129, -69, 250, 227, -52, 51, -162, -10, 209, 151, -139, 287, -421, 244, -9, -91, 73, -69, -126, -287, -217, -195, -134, 154, -30, -38, 28, -352, -114, 148, -4, 49, 199, 203, -79, -101, -114, -19, -10, 147, 284, -392, -199, -255, 48, 139, 126, -15, 163, -284, 225, 56, 44, 49, 230, -38, 1, 69, 222, -200, -47, -40, 70, -141, -9, 108, 73, 135, -195, -60, 73, 120, 26, -34, 157, -22, -50, -188, 37, -142, 104, 259, 57, -472, 157, -78, -134, 142, -94, 152, -231, 77, -52, -114, 49, 71, -89, -103, 135, -47, 44, 14, -267, -319, -18, 90, -156]
2283a56K85o8M2N9l87O1l3L3K70n0M0j72K65k03M2k13OK85q5m6j54J75K71l68
2307a01J52r9N0O0j64J31R9q0O5j8j97r3K32n5p5K04k30L07q6k45l9Q6J1P1j56
2332a70K11k9j98J69k8K9M46k82mJ5l2l2J4J7l68K29J08l52K29j42K13J0j72J00
2356a9L36k38N2r6q7k4j27L70k06R0k46L58j99R0Q2k08o4J64kj47J57j31K31o6
2380G0j33j2j3J40j83K70j96K5J50K0o7j08O8j86K93j93K1L8K83l37j01j0K10
2403D9j16J61J88j51m1r0o6K9L15l79j8Q5k4J54j36K65l07M9LK06j88r8K00l88
2427b98K94K03j69J94l05K19j50l21M81P7l80L13K5k93L92m79M42k50R3k11m5
2448a68J61J93j51j45K32n5Jk50L43r8K50j80j03J01k53m3J49j03L08j03l2j1
$$ y = [-156, 129, 61, 103, 162, -225, -164, -197, -164, 106, 56, 96, -76, 189, -14, 28, -185, -179, 106, 21, -25, -179, -4, 267, -101, 51, -48, 2, 62, -102, 29, 128, 48, 113, 95, -102, -195, 37, -18, -93, 111, -119, 188, 102, -143, -182, -96, -85, -14, -170, 41, 12, -186, -17, -45, -16, 430, 148, 144, 159, 127, 95, 109, 126, -242, -13, 95, -257, -28, -170, 43, 53, -119, -19, 317, 79, 131, 35, -52, -76, -203, 167, -39, 51, -195, 163, -36, 54, 136, -72, -136, 28, 26, -121, 36, -95, 136, 70, -63, -75, -88, 52, -131, 139, -57, -32, 118, 138, 71, -37, 31, -155, 138, -55, -34, 4, 287, -50, -151, -161, 49, -67, 94, 282, 131, 90, 0, -66, -37, 278, -101, -119, -34, -58, 96, -40, 225, -82, -33, -30, 176, -12, -110, 90, -298, -4, 199, 30, 224, -81, 138, -12, -333, 148, 225, -155, 158, 183, -110, 282, -197, 245, -5, 88, -123, -168, -7, 186, 35, -110, 122, 67, 68, -182, 161, 63, 313, 133, 30, 131, -122, -165, -16, -119, 189, 86, 54, 43]
2470D3l44O1j11K61K78j61j03J69r6j47L26J56p8q5j17p3P6k51J50K54j13k63
2492a68L4L25j82o9J66j50NK3J75k17mJ43o5J8K45l3j96N9k99K22j20J16j64J35
2516ar6K47j51J34O3k15J75j61lm09L31P7r5J69K22l2j23r4J09J47m43L15l56
2539a90o5L37jk02k62L17n3J90k3j54Q9j11P9Q0K14k58j85K40K8J09k16R4j12
2562e5K52k04l2lj25j2M53j92j84K22o6K33l54L52l15J23j51N9l1K2rJ01j54P
2586f3K65l75O3l4J44J0N4j37K55r3l10O6K04K24k12j18m1q7M01l32NJ7L37j66
2610G7j85K56l68K76l5q5o3n8k2J57k23J13J29j40J18j63j2M66j85l4k7r0j21
2633b19M06j44K06l29Q4L6k39lk09K20J91O6k53P5J71R9j29J67%o3l17J4J52j6
$$ y = [43, -301, -240, -351, -90, 188, 27, -76, 93, -3, -150, 176, 332, 254, 169, 52, -21, 55, -196, -46, 208, 95, -168, -134, 191, 9, -60, 106, -44, -39, -16, 159, -58, -62, 81, 16, 34, 279, 246, 50, 109, -190, 32, -88, 28, -136, -1, -97, 150, -1, 133, 196, -19, 156, -5, -8, -417, -86, -9, -104, 65, 287, 255, 132, 38, 147, 294, -149, 166, -190, -255, 82, 81, -121, -383, -66, -119, 71, 48, -106, -17, -128, -49, 31, 245, -13, -198, 42, 70, 179, -37, 57, -55, 197, -7, -39, -42, -167, -179, 274, 82, -102, 120, 54, 287, -67, 285, -30, 93, -58, 1, -30, -8, -17, 84, -70, -63, 202, -173, -110, -144, 0, 10, 64, -73, 182, 89, -221, -155, 49, 273, 61, -57, -98, -185, 216, -116, -111, -94, 243, 77, -108, 148, -220, 56, 21, -64, -127, -185, -207, -50, -273, -160, -31, -171, -53, -216, -228, 238, 53, 19, -8, -98, -219, 187, 43, 249, -80, 4, 40, -199, -202, -411, -191, 0, 66, -187, -112, 59, 158, 29, 196, 196, 133, -184, -170, -18, -34]
2657c4M2J6K61j45k33J25j88lK77O1k58k3L40r6j1k95j99K97L09k07j50L51m00
2680a63K11l52L23j88M40l20J71j53k39M03k54L65j75j09J09m9j27P5J96j95R8
2701F7j28J77mJ08j40p6Q2m9J80J44l18j69Q2P3J19j71J25J19p8j48j23O29m21
2724H0k21J41q1J96p1R5q0J53j80j32R5L22j26l2l15L30Q6j89k16mL98m10k9L20
2748A30j87k21M65Nl89J24n0k95P06j42q8q7N2K20j11l17m3N27L2j88m86K32o4
2771a75r6K60L9oj3J1lq9N4J49j06l0J4J23K9j9N0j85K52j63k74K74j59J64l0
2796G1j12L25l06j53J06J6J2pJ6j19L26k04o0K11n5l6j30K01j05K4q7R8k95J14
2820a49M95l80j24N13j94k36RP0M3j38L23p8Lj60j13L64m56K31J09rl6p1oj86
$$ y = [-34, 8, 24, 285, 140, -93, 32, -156, -159, 118, 179, -79, -102, 238, 142, 131, -164, -363, -66, 243, 36, -114, 237, -163, 48, -304, 19, -169, 271, -49, 122, -31, -270, 133, -121, 244, 69, -40, 69, 20, -107, -32, 164, -31, 67, -61, 116, 112, 220, 80, 4, 86, 37, 217, 361, 43, -126, -44, 29, 148, -23, 102, 221, 143, -5, -128, 501, 80, -141, 0, -81, 115, 44, 139, 59, 212, 32, -100, -5, 317, 191, 159, -156, 174, 260, 71, -145, -149, 249, -161, -190, 130, -57, -278, 187, 192, -197, -73, -123, -418, 288, 146, 58, -29, 23, 243, 132, -185, -228, 299, 331, 143, -343, -111, -175, -271, -11, 28, 22, 9, 20, 17, -72, -18, 131, 25, -5, 9, 132, 161, 142, 192, 7, 259, 96, -178, 96, -63, 101, 71, -41, 284, -22, -175, -69, -53, -41, -48, -32, -151, 175, -29, -89, 122, 67, 31, -99, 102, -3, 21, -66, 32, -263, -149, 346, -34, -158, 355, 161, -75, -66, 4, 47, -91, 232, 154, 157, -3, -116, 248, -208, 23, 132, 123, 87, 16, 10, -176]
2844a76P2M8J18l2m92O53o8j17n3K59r7k34L04j23n7j24K50k01q5K93j41Q6k13
2867a30K74o1p7Q0Mj63N3K68l46K7Q1l3J06j23J30m5k47R9J56M4r4k02j92J86
2891b05J06L79j93O0j02j38J99N3j70J10l09M34j16J38l46j93M32n15J60N69l67
2912a4j00L77k84J31o2O5j55J27M6j01K96M5m64K28l21K32J57m12K67j99J46k07
2934b02r0K70L3N1k59M23k52L6Q9j63J10k35J34j42J20mj90K24j46L09k25j28
2956b37K75l46Q8r7K39j8Q4j40L40k1p9L4k25J76j8K8l63P1M12m21L25j17j79
2979a89J60P7o2lQ0p4j76k7o2M28j91j85K22k6j07L29l04J59Pj05Mq1J64N9j99
3004a02P6j67L76j67K32k65n1OP0n1O1K45n0l04p0j58J73L06j84l8k4K41rl69
$$ y = [-176, -104, -56, 62, 30, -462, 191, 123, 6, -47, 212, 115, -119, 185, 62, 5, -119, 131, -70, -155, 138, -3, 83, -130, 144, 83, 6, 86, 90, -73, -20, 248, -98, -71, 10, -23, 83, -40, 90, 45, -202, -103, 53, 97, 3, -199, -391, -205, -99, 280, 87, 147, 45, -93, 106, 159, -11, 99, -210, 224, 108, 246, -100, -293, 139, -376, -216, 353, -14, -114, 263, -21, 110, 48, 113, -42, 85, 131, 30, 326, 371, -93, 135, -186, 46, 203, -209, 58, -141, 5, -202, -292, -22, 11, 62, -197, 226, -26, 10, 99, -64, 46, -189, -55, -197, -77, -81, -271, -47, -193, 116, -109, -237, 38, -308, -220, -317, -78, -96, -12, -152, 188, 167, 88, 122, -103, 73, 55, 83, -280, -209, 203, -218, 107, -10, -189, -29, 48, -14, -17, 63, -11, -187, -214, -276, 152, -39, -224, -2, -28, -135, 194, -110, 49, 56, -49, -45, -126, 38, 97, -102, -26, -193, 183, 16, 248, -17, -68, -62, 8, -43, 18, 263, 213, -91, -161, -319, -146, 160, -24, -62, -86, 155, 146, -223]
3028b23n4L50j19%Q3n8j4KJ14j6r5j21J39k62L05l0J53p2M0N1n7K1P0j41m5j62
3054a41o8J95L53j37k36k3o2pR2J26k47L65k22k04L94k45J2J35l08J28J42R6o
3077A32k64P3qK0K66n86O41j01P7n51J06L71j2j45j47l51O78k44K4J70j04J70
3099B15m20L14J0k17k21O35j35J42k44l31J60P1Lj29L10m49K51j7J10J03j99p1
3121a09J05n1Q7j51rQ2j74J89J71l57N02j30j24k48K49J6l4J3J97l42L32j77J52
3144A89j83J37J32k14J4O3p0q8O8J12j86jq3n7J03K28o2j70J03r6J08N2q8R5j83
3169g7J88n5j37J60k23J66j58MJ39l2K61k38k23J72O5k34M81L9N3k47M8j56M24
3192D20k58l71L69j62j40mJ09l44N37j38J50l07j58K19K09k21N0j67J26J13n9
$$ y = [-223, -277, 73, -46, -46, 37, -21, -35, -33, 81, 65, -30, -151, -12, -274, 31, 1, 154, 82, 122, 173, 116, 137, 207, 66, 21, -141, -209, -14, 339, 202, -34, -57, -119, -126, -34, 92, -155, 210, -12, -216, 178, -67, -55, 80, -228, -100, 42, 138, 132, -132, -59, -67, -47, 219, -367, 274, 173, 250, -301, -195, 176, 164, 19, -128, -479, 199, -45, -21, 149, 45, 215, -205, 109, 119, -98, -319, 316, 181, 323, 79, -252, -92, -21, -18, -147, 163, -286, -35, -52, 58, 161, -38, -109, -4, -55, 32, -119, -128, -46, -220, -31, 140, -217, 285, 155, 31, -217, 32, 48, 14, 27, 224, -118, 214, 37, 189, 6, 143, 275, 61, 75, 138, 68, -20, 48, 160, -26, -27, -110, -167, -64, 164, 102, -68, 35, -61, 47, 99, 11, 106, -77, 111, 56, -81, 79, -144, 22, -136, -132, 7, -25, 236, -2, -225, -53, 12, -222, 259, 298, 351, 104, 152, -4, 420, 162, -209, 160, -2, -142, -146, -37, -381, 156, 18, 168, -139, -297, -78, 131, -90, -40, -207, -81, 32, -27]
3213b7M03l09J5j41Q2ok17O1K64M8j62r1j77L03j81m2J47l34M63k18k4k16R8L10
3237D9O0O0j46J64n9k60K16j99R3J63j78Q3j28J27P6J33j54P1l0l13M31k22r1
3260e4M2Q1l2Kk7P6j88J6J82k6q5J7o9j3p1L50k68J64ll00L47j61J63j46p8L49
3286B68m96J7R2o4L09l55J69J64K5k32P9k51J51j09j08M4L29j03j92K84j52k0
3308a51j2n0K98J44r8K87k79j1k11k0k61J10L37k60R9o8J19j49K23j16j47J28
3330h8mL48n34M16j1Q9o0l68R0M4QJ74q3m96L08m0K09J60l40L99l42K54j73m6
3354h6q0J89p4m6K9j82J87J79q5K47k16j65J07r5K17j5p2J94l26j39K19J85P4
3377B46k04k14K10j73L32J04m56L95k85J31L5Kl53L91j40j6J90k07p0J94j12j6
$$ y = [-27, 376, 67, 82, -59, 23, 17, -200, -139, 125, 173, 11, -80, -257, 46, -135, -177, -30, -364, 99, -119, -143, -359, -261, 49, 109, 169, 23, 187, 128, -132, 84, -115, -22, 141, -37, 46, -82, 45, 121, 254, 100, 171, 141, -172, 259, 37, -54, -12, 69, 37, 39, 12, 88, -100, -84, 98, 72, -13, 4, -65, -78, -149, 201, -67, 97, 94, -206, 141, -20, 143, -3, -81, 268, -228, -211, -119, -183, 126, -229, -60, 104, 129, -103, -24, -275, -124, -233, -341, -297, 32, -71, -263, 21, -131, -151, -163, -213, 85, 229, 131, 418, 139, 128, -83, -103, -364, -254, 83, -177, -78, -146, -27, -176, 47, -69, -216, -88, -92, 256, -278, 138, 127, 216, 156, -212, -122, -78, -70, 104, 21, -475, -167, -207, 2, 162, -178, 221, -121, 133, -40, -86, -166, 23, -51, -97, -68, -250, -63, 116, 31, 278, 62, -103, 4, -91, 126, 111, 39, 233, -93, -232, -13, 172, 246, 42, -172, 38, -135, 197, 301, -155, 240, -45, 86, 121, 123, -230, 161, 21, 5, 195, -12, -82, 112, 0, -16]
3399a6J6J41m41L31J39j02J37k35K27k24N2k8J60l46O0K98k81K32j43p3J49m7
3421FL3J08r7l82K88k62L12k25K93k61K10j73K00J55k04N9j0R7k62M69n95J2K23
3444fJ83l71M14m68L93r2J08J5n15M86k05J31k40K34%j69K51j87j50L99j08k27
3466a24L59l04j40K03q5K60k59j50K14M3J6J15k2oj36P2J39j86K89k35K69k17
3488A15k72r3K48K92l45O5k7O3k0j03n7L46l06K00j34o4K38j05M6k79J31l2J77
3511H4k22R6k9K81m50K55l5J86J07k40j5K77k73K29p0l3r8J73j90j72N0r6L78
3534A93j29k58J92l0N1L7k96K22k9k61L81n1j32M6J32j56j32K68l49L09k49K10
3556c1J81k14J52k97R9k3j6K43J53k53j76O4l10L33J91j54k4J05J8N3l1o7p1k52
$$ y = [-16, 0, 141, -300, 31, 170, 68, 205, -30, 197, -27, 25, -3, 157, -189, -129, 169, -112, 120, -23, -96, 53, 6, 39, 147, 50, -332, -44, -306, 6, -219, 74, -187, 23, -150, 50, 205, 1, 60, 50, 147, -115, 354, -241, -229, -6, 177, -194, 220, -248, 145, 53, 161, 176, -339, 147, -58, 73, -167, 67, 67, -102, 149, -38, -188, 211, 103, -124, 235, -69, -209, -6, -91, 169, -90, -240, -26, 17, 33, 148, 126, 120, -16, 56, 195, 9, 298, 63, 332, 115, -157, -250, -2, 290, -55, 10, -17, 46, 26, -77, -134, 212, -94, 106, -28, -92, 146, 41, 87, -192, -61, -93, 84, -138, -42, -71, 210, -240, 15, -20, 166, 273, 33, 18, 295, 22, 251, 181, 148, 50, 223, 33, -139, -89, -185, 193, 64, -194, -2, -32, 19, 56, -240, -18, -47, -308, 73, 22, -110, -64, 68, -88, -220, 48, -301, 8, -241, -31, 150, -64, 88, -209, -110, -133, -149, 94, 247, -6, -182, -118, -428, -95, 96, -58, -82, 23, 41, 94, 63, -4, -75, -327]
3580c27M20m0j37J01J7j76J74M8l19L56O5j70L3q4J42J91k38q4J91m4j39k18J77
3603f1p4J76k06J09p9K69k8j53J68q1J6o7mK95k69Q3k39K42j55P4J12lq0m03L49
3628ik89K94J00J94n00K72j28j64M1J03K16q8j81K65l12m3L00K43m79J18K66n3
3650A66k02R1p4n2j8jK4N4o4M5r8O9R2J5k3j28J30O7k4J44j54l9N6p1k01K68j61
3677h9J00j88Q6J99j96R2J47j38q7Q0KK08J0k76Q1j03j68M69l49K05j02J84j79
3700a2J34j81J12j2j40J43n6J83j80N1k4o4M4L5j49Ql1J15j17K73l41L54m70K16
3724a09r8J07N23o99L33q4p0O2J58m9r9L5j92K93r2J36k67K63j86J41j37o9j82
3747b82L03o8J44ol94J94J63P2mk22O5P3j5l05J60n4J38K26l84N7L28j98k11k2
$$ y = [-327, 93, 53, -84, 17, 34, -142, 32, 80, -239, 117, 182, 12, 45, -39, 103, 294, 56, -28, 163, 119, -20, -238, -61, -135, 41, -165, -56, -135, 134, 106, -47, 121, 40, 56, -11, -15, 280, 11, 94, -145, 97, -58, 16, 128, 125, 45, -358, -9, -298, -4, 96, 290, -210, 62, -66, -230, -189, -86, 130, 42, -139, 126, -186, -229, 71, 314, -165, -47, 219, 166, -36, 55, -19, -71, -89, -90, -66, -12, -76, -31, -129, -60, 32, 47, 24, -104, 26, 93, 69, 213, 59, 20, 76, 5, -196, 72, -89, 11, -177, -91, 108, -88, 4, 151, 13, -74, 6, 8, 216, 226, -50, 31, -72, -240, 229, -120, 85, -17, 167, -12, 122, -59, 53, 41, -99, 44, -12, 171, -9, 42, 18, -46, -2, 33, -116, -108, -139, -24, -141, 132, -209, 145, -325, -109, -207, -100, 423, -276, 57, -27, -97, -35, 123, 74, -25, 10, -182, 111, 19, 155, -112, 151, -35, 106, -31, -100, -282, 21, -47, 97, 91, -303, -109, 54, 126, 122, -100, -35, 38, 23, -282, -122, -176, -38, 188, -196, -139, 189, -9, -220, -242]
3771b42J01M1l6P8j32J9J30J71q2l7J15j97n9q3K93J04j24r6Q3J39j48L6j88J29
3795A5k67RL15j18J53L2k72N2J62k82J20L78k69j71L55r8%o6j82J03p4m5j33J63
3819a20J34k5q7j23j4L79l31K37j37O7K03k02J25k03J8j1L98m53L60j68l06L05
3841D6j03j46N5o1K73L82l67k14K38j75J13k58l8K44K6j04j14N7J65J54j8p1J5
3864I9k43Q2K5J17m0j48k8m5J61N2k57O9o0L31O0k47K22j27J08r9j70J34J63O9
3888B28j42l07L2L58k93J03J80k03j3rL59j01j7j83OJ95k90N06l32m70K72K92
3910A71k92j94N47k28j89M39m04N66k87j93P2j90K41k35J90j05k63K45j81L89
3930I9k56M2J67M4j82Q7j19L34j13j61K21j64j23M1j90M3M01l32P1J00N9j69O8
$$ y = [-242, -141, -100, -136, -58, -190, -171, -41, 130, 48, 11, 126, -71, -130, -213, 80, 184, 60, -36, 47, 186, 38, 74, -114, 15, -252, -243, 72, -46, 107, 139, -133, -81, 81, -201, -81, 297, 28, -143, 212, 114, 114, 48, -134, -31, -105, -150, -283, -120, 14, -11, -98, -221, -235, 144, -187, 50, -87, -20, 183, -19, 106, -97, -79, -90, 308, -145, 215, 47, -259, 46, -57, -203, -148, -209, 64, 446, 79, -135, 103, -72, 41, -217, -255, -11, 15, -89, -203, -146, 19, 173, 155, 84, 99, -144, -62, -37, 80, 40, -108, -136, -181, -20, 32, -225, -156, -216, 115, 175, -72, 150, 23, 131, 32, -138, -4, 159, 228, 86, -221, -189, 169, -124, -21, 159, -44, -57, -66, 293, 192, 175, -8, -2, 193, -97, 409, 77, -393, -121, 171, -121, -315, 232, 4, -185, 254, -150, 416, 129, -64, 8, -182, 59, -176, 14, -91, -354, -109, -290, 99, -157, -115, 52, 96, -86, 1, -118, 216, 103, -58, 163, -1, -124, -83, -273, -230, 171, -161, -90, 10, 69, -100, -32]
3953c2j42K91j01J07Rj15o0J75l77L81j13p3K69m71P7J47p1J20J86j33J52j78
3975D8J59k34P3r1J21n0j0J03l82K37m6o2K58q6k65M70j42j47J54m62M38N8j51
3998ijJ66j68On2k84J48K37k1K41l55K42k31M00j33r0j50L00J07j44j01O0O5k08
4022B5j56R3n3L12l05L6p3M2K3k7R1L5n0n4j00L85l71J34K07r4k50R9J13o4n1
4047e3j0KM6k14K98k25K27j35k0j80M46k05K2j9K10J09m45K59j85k32L60k08j7
4070a69J20j84L06p3j20K68k58J31J88l05J35q4K32m73K63K58j69L3p3N4l58M20
4092A42k15M8N3q5K64j87l77M07j33K12m3J1k65J33R9N4o1k58j34J69K17l42M44
4115A53jk27K9j17L8J34j23l2j04L26o3Q1k5L49m84P6j21J2K56J64m20J51J24
$$ y = [-32, -174, 117, 16, 123, 132, 17, -43, 132, -245, 136, 23, -50, 219, -252, -175, -28, -99, 21, 207, 74, 226, 48, 207, -27, 46, -45, 76, 26, 16, 119, -263, -26, -72, -134, 124, 38, -227, 243, 101, -46, 108, -354, 84, 142, -9, -10, 156, -12, -6, -58, -342, -194, 43, 22, 263, -92, 150, -81, 319, 186, 96, -54, 246, 353, 209, 108, 168, 233, 25, -131, -38, -91, 221, -84, -48, -121, -79, -56, -83, 8, 43, -7, -61, -161, 224, -147, -13, 194, 100, -150, -51, 62, -2, -53, -63, -61, -15, -229, 69, -156, 71, -64, -84, -264, 182, -23, -1, -20, 190, 299, -146, 113, -72, -304, 56, -152, -169, -49, -233, 73, 0, -120, 148, -110, 21, 209, -96, 39, -45, 187, -286, -23, 235, 66, 99, 26, 80, -278, 142, -73, -25, 28, -57, 207, 20, -357, 50, -83, 129, 86, 97, -168, -35, 64, 118, 57, -201, -335, -166, 51, -291, 153, 152, -75, -46, -163, -125, 9, -114, -146, -250, 76, 13, 94, 69, 418, -66, 10, -111, -99, 157, 321, -99, 52, 176]
4138A76q1j57J42q2k2j00M55k57O3k33K73r5j35m6J9rJ26K5j30j55J82K6r3J27
4162A9k63O8M8j66L13J45r6j54K5L7R8k64NL5K75j25j51k02K23j01J40P2l8m7
4186a04j39J76n0Q7K92m84n2M48j01n7l50L22j06L38l40R3J9Q1j07j4K76j16k51
4209a39K8J3J36j9k6J43K44l81k00J02l3J01j00o3M20m57N28k00k29l3K63l29
4231b31L54l5j56R8j44J22r0rK33k21J1Pj2J20j97L0K29j75j06M33j6o43N13J7
4255A32p6j61M6K36n22N69l81M45j71l80j9m4L25j66J67J6m2n0RJ95m1K86m27
4278e4k98K70R4J29ML0p2l47K72j1o4J77J20l55P2J17J34k55J26o5Pq0r8l4K95
4303A14k20J80K13l05K3O7j8r3MK20l56K18r1l3J80P2k16k78L29L46k86k90J03
$$ y = [176, 95, -62, 80, -2, -24, -124, 331, 74, 137, -96, 177, 82, -53, -99, -80, -89, 37, 62, -68, -223, -41, -15, -108, 19, -244, -176, -128, -294, 19, 164, 68, -86, -61, -24, 74, -190, -185, -150, 125, 0, -151, -353, -130, -231, -91, -19, -57, -104, -243, -67, -117, -30, 262, -222, -274, 174, 73, 16, -334, -12, -118, 220, -120, -27, -8, 73, -34, -48, 228, 112, -139, -111, -98, 38, 19, -7, 136, 380, -1, -201, -99, -132, -31, -131, -194, 226, -231, 297, 97, -132, -165, 98, -231, 123, 88, -68, 30, -114, 8, -82, -91, 142, -79, -68, -61, -73, 47, -150, -120, 109, -66, -172, 261, 245, -398, 115, 132, 56, -105, -59, 177, -345, 224, -157, 288, 117, -263, -282, -326, -1, -167, 0, 16, -26, -76, -67, 128, 87, 373, -54, -352, -82, 12, 141, 145, 175, 103, -244, 28, 17, -47, 130, 250, -105, -33, 84, 218, -37, 89, 24, 31, -49, -147, -181, 114, -106, 74, 287, -18, 5, 72, 54, -39, -35, 185, -171, 47, -44, -77, 103, 175, -41, -319, 10, 356, 70, -220, -117]
4326a17L50l00R6l7O2K5j94K30J44k6j30j03J07J09k77K49l74L07O7k07J9j86
4348a86j36K85O9k75P6M75l25M5k0l3Q6j98j2Qj86M92k96K92j80m4J44k0N6l33
4372b16L28o91P21j46O5j87n2J83j3L30j62n2k43l3L52j15j18J1M1j20k21N17
4394A79n14M41p1k44J62%J91j82J45J28j10J03m93K97j8l2r2K06k51m6M14l38
4416a25M22k42Q3M1j93MJ77k12j37K03j15J70K7j04N5P9j22j46j06J03J19k6l9
4439h4K08j45J25P4l37L22L5k97Q3L58l99K58j82K29j59m2j95%p1L15n8J77k67
4462e2k3J31r7rK14k10l69O99o9j84p7P5r1K47l13k9K05K2l43M34N2Q0l96R2j6
4487b7M2l05J25M30l48l19L75J5n3O7J7MJ55k77Q0J9J64J08l49Q8%j2j24L55L9
$$ y = [-117, 233, -67, 29, -8, 54, 79, -115, 115, 259, 233, 103, 0, 107, 216, -61, 188, -186, 121, 188, -19, 0, -186, -322, -37, 32, -243, -167, 308, -17, 28, 8, -25, 61, -137, -149, -141, -327, 165, -131, 161, -19, -63, 81, 61, 117, -216, 112, -579, 142, -4, 61, -126, -178, 5, -8, 322, 160, 108, -135, -168, 184, 69, -49, -38, 3, -117, -338, 179, -335, 106, 35, -209, -47, -47, 144, -38, 107, 235, 125, 228, -265, 32, 14, -18, -110, 96, -155, -201, 213, -125, 297, 55, 138, 179, -14, -10, 167, -45, -182, 21, -94, 76, 103, -1, 54, 133, 11, -135, -241, -138, -19, -45, -84, 124, -21, 104, 178, -159, 163, 198, -99, -16, 342, -57, 201, 19, 248, 89, 47, -148, -148, -219, 96, 38, 215, -52, -75, 56, -41, -50, 164, -46, -415, 284, 215, 31, -46, 29, -62, 185, -128, -157, 48, 70, -273, 161, 213, 293, -103, -11, -27, 15, -290, -165, 265, -83, -402, -27, -12, -65, 2, 19, 23, 178, -99, -19, 0, 164, 272, -77, 11, 11, -1, -125, 230, 269]
4512B69m06N0K33k0j53n6J37r2p1J15j22J90p7m1m9l5n0j62M45j79j77M99n19
4535b71K52N1Q1j98k3O5J97j41j90J94j35J19R6Q9k22k09L98j65k06R1P5p8K32
4558A02R7l05J92j59J03j14K06j86j1j46J90LNJ80l44K82K8j67J70J43m86N8j31
4581b90L24K73j78j35n4K19r6k60K2L30k62K97k31k02J98K02K13m63K82k41K7
4602b5L61k96j62Q9j32N8r1J45J9O8lj34k46N48j30j87q5p4M19l07K95k27J77
4625H0j12l5J80j50J06j78P1j42K18j67K20L6O9l25O5L1Q1j09J30r7J57L3j39
4648B3K53l19lN7j54O1k05L34k70K24L0L5j16K07p9l9p0j22J5J69l51N35l25J03
4672gJ76m08M61l34J36J02J29l70L41j79j11J0J15j4j47M00j00j65n4k21m1L89
$$ y = [269, -137, -87, 146, 126, -27, -83, 54, -38, -109, 6, -116, 74, -3, -44, -93, -128, -178, -340, 105, -74, -251, 248, -271, -19, 32, 113, -85, -108, -43, 154, 13, -177, 17, -118, 1, 97, 186, -36, -245, 153, -12, -218, -127, -52, -130, 102, 199, -106, 86, -73, 30, -84, 122, -64, -75, -221, -31, -28, -23, 157, -187, 95, 123, -44, 126, 269, -217, -159, -290, 34, 307, 129, -6, -60, 159, 63, -197, -175, 155, -107, 190, -41, -243, -45, 157, 370, -93, 189, -52, -25, 336, 40, -122, -33, -165, -107, -198, -53, -34, 34, 31, -103, -349, 199, 69, -118, -203, -277, 142, -165, 130, -97, 80, -32, -67, 113, -37, 69, -109, -38, -180, 38, -129, 91, 127, 196, -129, -64, -33, 48, -61, 69, -28, 129, 162, 23, 276, -43, -46, 11, -143, -82, -287, 47, -223, 1, 31, 66, -50, 157, 78, 39, -31, -153, -138, 31, -320, 215, -110, -7, 169, -239, 222, -112, 24, 126, 255, -115, 226, 47, -64, -54, 61, 47, -100, 300, 200, 35, -19, -240, -281, 108]
4694A08k2k6J03J5m16L38K10m60J83O5j50J21k63L1L2K08j41K30j55lL6J27k74
4717a03n4N0j90K48J85j79j98L04J00k30K74J20m10J00l55L34j37Q5qJ19l08L42
4739H9N4j61r0j08M6K02L2J2O4l50L31k42M4J30J79p0j00j94J96L2r5J13J65m84
4763b05K49R0k89k20L22J09j63J59P6k93J3K47kj01K1q2J01L58m98O2J61k88J71
4786bK18l38P5n2m8L65j97rJ96k68J51k39K47k72P1J39j79J31P7j42K38k05Q6
4809D3J92k32n2J94l41K91j40K27j83K03k02o3J83o6j58Q9j4mOl09L55P4l9L4
4833H8jQj11l00M09j24j12p5J13L36k61j65L98k58J28on2l6J42m7n6j96L09l53
4857b22L82p9j39p3Q9j00J1k3R1L2Q9K10l66J57M8j43J08K07r9k64J13J69l59
$$ y = [108, 86, 60, 163, 178, -238, 100, 310, -150, 33, 98, -52, 69, -194, -163, -131, 77, -64, 166, 11, 8, 44, 171, -103, -157, -107, -297, -49, 136, -43, -241, 63, 163, -67, 207, 327, -83, 17, -338, -4, -141, -56, -64, 55, -253, 89, 143, -18, -108, -216, -170, 32, 64, 76, 140, -210, 121, -121, -77, 53, 232, 162, 62, -132, 64, 96, 1, 114, 279, -205, 44, 134, -155, -375, -53, 56, -107, 52, 128, -165, -152, 95, 93, -8, 13, -69, 32, 390, -108, -46, 115, -173, -2, 216, -122, -47, -99, -147, 218, 21, 12, 208, -60, 91, -148, 99, -173, -102, 37, -142, -11, 66, -76, 162, -43, 43, 235, 3, -49, 145, -196, 95, -45, 182, -1, 202, 0, -63, 120, 54, -104, -15, -29, -33, -27, -336, 19, 93, 54, 88, 87, 95, -16, -316, 93, -31, -143, -218, -105, 231, -30, -195, 203, -55, 73, 67, 15, -21, 121, 74, 18, -178, 131, -222, 160, 81, -58, -131, -42, -142, -131, -154, -63, -31, 58, 268, -98, 59, 107, -36, 72, 279, 180, -84, 29, 198, -161]
4880a61J97L4j78J44K15l35Po8qQ4R1J56m04K5M15m23L29j97m7K94k34p1K21j66
4904h0r8M9j13L52J1k08RK28Q2k55L65k67J31l27Q1N9j73J36r4M38j28l32J10
4927b4J45q6J02n1j4o6j34N5N8M58k35k33K8k4j60L9J45j66J7L56k19j61J02M22
4951C54o98M3K77J84l47J12J41ooJ78l2j33j25R6m5j21P1K1L6k6K43j97j03K98
4975B15m58N44m1k48L46m52l4J19J14l28P3L90j01n1k48M12k48o2R6j1j76M24
4997B75j63j90j06L33r9j12m4K88l01n2J26j81J3P6L2J24l51K40K70l54K84p4
5019C4n0r8M19l74J45R8k43k05R8J53K6J35j31L9m7K81j39Km13K41J17J1l5K5
5043H9Lk31K88j49N9L5J17j6k26J50o5j34K48l61J7J61m5J28k08Q2O4J14k29j54
$$ y = [-161, 36, 70, -108, 36, 251, -84, -77, -145, -153, -69, 22, 178, -226, -201, 214, -209, 120, -77, -124, 170, -64, -135, 86, -80, -178, -129, -242, 110, 121, -87, -78, 150, 232, -23, 342, 75, 206, -121, -40, 19, -154, -18, -112, 326, 198, -134, -24, 121, 35, 137, 86, 72, 6, -128, -73, -15, 443, 208, -25, 3, -21, -181, -142, 3, -163, -146, 210, -9, -170, -68, 354, -344, -301, -24, 160, -187, -75, 66, 60, 54, 232, 200, 67, -58, 38, -7, -128, -57, -36, 0, -26, 217, 20, -83, 215, -243, 301, 260, 12, 358, -94, -128, -9, 105, -223, -150, 240, 139, 88, -160, 252, 4, -58, 38, 27, -149, 275, 112, -78, -184, 149, 50, -62, -106, 182, -119, -171, -45, -226, -213, -137, -105, 19, -332, -92, 178, -176, 108, 34, -16, -114, 305, -69, 76, 174, -69, -274, -176, -23, 3, 138, 7, 46, -1, 280, 141, 143, -270, -29, 88, 99, 64, 89, 92, -139, 149, 0, 59, 94, 211, 195, -31, 119, 54, -80, 168, -193, -176, -15, -60, 68, -140, -58, 6, 120, -109, -263]
5067b63K38j44K81k87N3K43j03J67k09J58k75M58k95J63k99K77l2K65k25j08r3
5088c0K1m2q3j47j57J97J30L96k85j33N23l75j19J69j74K70k41N06l79p1o9K51
5110A58j94K31k41K82k13P1q2j14l5J86j9J00j92nJ79j77K60j57L9k76K64m6j3
5133FK8J0pj11q8K84j68j90L72J49l42L01k43K16p5l59r1K21j00L10j46r0J06
5156go0L3J14k0k42K26J6l0k30J83R6p7j46P03m60j12J30k90j0o0R4O6J19J70
5180B06j67m1k38J96r7K69j58J6R7j0k48K38r2k1J19o1j00l2J81k1j6N33k75J05
5204C83n78K7K0L38j46j33R3q4K80j57J35k12J81j95K88J0k36lq2O5K4l3n6k6
5228i7p1J33R8j16q7K10r8k6J90m59K5M09k34J09l6j10K53j5j98K59k63J00N4
$$ y = [-263, -25, -169, 112, -175, -122, 121, 18, 185, -24, 134, -141, 317, 22, 185, -114, 163, 131, 396, 171, 63, -30, -9, -51, -134, -281, -438, -241, -111, 285, 0, -133, 390, 15, -104, 65, -109, 161, -80, 426, 47, -24, -93, 158, -36, 195, -46, 236, 23, 94, 12, -102, -137, 49, 30, 130, -62, -67, 112, -65, 195, 38, 77, -199, 65, 19, 6, 34, 44, 37, -74, -162, 122, -46, -236, 136, 285, -57, 244, 1, 217, 142, -217, -308, -87, -187, 123, -23, -113, -7, -67, -34, 80, 60, -182, 44, 60, 30, -200, -17, 79, 2, -144, 559, 99, -13, 117, -173, -183, -243, -149, -83, 36, 206, 39, -2, -240, -44, -141, 128, -30, -14, 83, 73, -175, 63, -29, -50, 69, 8, -92, -124, 57, 36, 20, 553, 278, 383, -195, -168, -148, 190, 44, -89, 4, -80, 200, 43, 178, -34, 147, -48, 240, 250, 14, 11, -71, -6, 18, -15, -71, -97, -168, -35, 63, -53, -140, 70, -28, -54, 136, -323, -298, 111, -123, -14, -50, -160, 93, 78, -120, 139, -124, -24, 30]
5251C0j72J30j36p6L12K91k86j09J89j44j93K58k75J52j06L8P8j2J07j45J76l27
5273b20k8O7L37j56j58P7q6J29L14l07j24L62j99J5N1N1K25m43J47q7j17n7J05
5296a02M09k56j60%L24j73k10L62k85J42j26PJ41L77o16N7J19J95m37K71K8m5
5318B2k20L09L43l97j63L0J68J53k96J42k30K92J89n08K54j7j53J42j04j24r1
5339b59MK31P1R5k21R7k59K53j1j52K86J09m08N61l75j52K84j45K43m89L25k8
5361F0K18m28K4R8Qj06K97r9l3n9K47k11o1J49J56l23Q4P5k47K01Q6q2RK16j85
5386I4k74J36j9k7O3q2J83j6M6r4K70n7m9j22Q1k41M9N6Q8j00L12l60N2J39j90
5411f2P3j24N39k61j14j67N3K35k03N8M9J1rl27J81J73j94R9NK1j83L00m27K15
$$ y = [30, -142, -12, -148, -224, 88, 379, 93, -16, 173, 29, -164, 94, -181, -29, -135, -97, -19, -31, 76, -69, 107, -220, -248, -181, 156, 0, -158, -81, -167, -38, 276, -31, -155, 207, 8, 23, 74, 125, 350, -93, 54, -33, -150, -207, -102, 307, 51, -109, -109, 215, 42, -168, 194, -91, 51, -75, -68, 73, 450, -166, -109, 10, 205, -232, 39, 67, 22, -198, 111, 454, 57, -106, -76, 92, 245, -51, 91, -139, 153, 342, -166, 88, 71, -82, 60, -44, -168, -259, -255, -24, 47, 142, -79, 18, -241, 12, 1, -151, 135, 244, -164, 397, 22, -130, 154, 9, 252, -237, 88, 60, 278, -150, -126, -28, -20, -126, 171, 72, 39, -20, 227, 16, -45, 104, 260, -63, 21, 96, -151, 50, 136, 54, 63, 279, 94, -180, -44, -63, -90, -27, -109, 74, 58, 104, 10, 280, 223, 174, 52, 133, -108, -59, -3, 85, -15, 297, -63, -11, 128, -62, 11, -113, 426, 165, 51, -116, -63, 172, -31, 27, 76, 87, 78, -249, -68, 105, -89, 10, 15, 36, -147, 153, -274, -59]
5435e9J49N5p9J7J71j7k27j26K35r8l8R3j50L56j6k70J14j90K80J11l50J21j42
5458f0J12r3PL3l79K47j3K76l8l34K43k62M43o0j43r2N0J18j97J70K2J4l7N1k31
5483a53K20N3j76m4N1Kj87L89k66M0J09r5J29Pnj11M6r8J64Q9k80J79k47K18l21
5508b87N53l42K32j30p2j70Q7j58O7L37j87J66k02j1J95r7j95K65J40J7k16K46
5530B38k23j24K11l4l64K35J40K10l56J11k40L65k12pQ0k55K30J87Q9m60J16J37
5552G4j88L43k89q9L99k03j05j10J54j35O5M04j30j59j12M9j08j06M07k72k93
5573d04M94j17j36N31n65J58P6N0J31j27k82j38L36m6J12j48J90l74K18O5K2L0
5595G6N1Q9k65R3J58l95M37j17k78P5n1L53m48K60p8L20k33J30j05j8j3J09m01
$$ y = [-59, 90, 145, 66, 83, 254, 237, 10, -116, 119, 21, -17, 76, -74, 282, 266, -4, 110, -80, 200, 311, -39, 82, -60, 52, -41, -34, -1, -380, -133, -146, 130, 92, -242, 1, -261, 182, 122, -21, -113, -63, 55, -142, 28, 50, 64, 27, 78, -153, 67, 120, -56, -100, -49, -47, -234, 155, -111, -71, 38, -57, 72, 79, 74, -37, 9, -89, 75, 164, -116, 63, -184, 34, -287, 266, -76, 156, 26, -46, -216, -129, -287, -220, 117, -70, 96, -106, -117, 78, -19, -214, 51, 191, 208, -8, 238, 15, -109, 102, 68, -296, -61, 79, 289, -67, 44, -196, 169, -43, -50, 30, -225, 5, 192, 281, -179, -63, 74, -114, 229, -60, -149, 250, 47, -58, -168, -14, -149, -84, 320, 190, 31, -81, -32, -140, -246, 161, -111, -404, 90, -27, -163, 368, -197, -39, 37, 87, 218, 91, -191, -329, 7, -39, 73, -75, 115, -259, -41, 24, 46, 76, 127, 216, -49, 44, 202, -193, 244, 127, -151, -76, -127, 226, -222, 38, -40, 280, 47, 177, 72, 54, 41, 150, -251]
5618b51K89M2j12k3j69J27J05K44j67k32O7K3q9J0K83j01k25K77k00qN9K34l47
5641a64J57j3J68j01q3K9K20k35n1o5m2J58K82j20k28J83j90P3J25k26j34M8J26
5664h3l6KP3k85J34J22J46N3rk1k83K07r3P3L01k38m7r8m4K53l5k54J19R6k7J57
5690A83k60k1J99k12lK10j80K32r1j03L0j0j37K66L20n85j50L76j62J61l97N80
5712B46l3l47L19k15ql5m5J23J20k76K84q9j54p5Q0r9J74J39j01M7l65L73J18
5735A81j15n2rQj67K31j68l5O4J68K11l19P4J5R9l70O8J36M43n96j68J98PJ13
5759A7k36L37k2k49J3M4K20k07m1N29k80O6j3j20K74m16l03L44j04M5K27o5m1
5782A9J30N6l66K62Kp6j46J40M6m5K69l99P8j2j91J60K75j07k3jk80M62k20q7
$$ y = [-251, 38, 80, -32, -55, -224, -97, 8, 252, 85, -147, -80, -57, -146, -136, 147, 46, -179, 98, -102, -110, -51, 183, -164, -7, -20, 148, 47, -36, -7, 213, -22, -73, -138, -180, -22, 260, 140, -88, 95, -95, -22, 103, -123, -257, -209, -83, -119, -117, -44, -329, -195, -73, 73, 126, 117, 96, -187, 20, -73, 0, 301, 63, 16, -82, -126, 127, 92, -162, -43, 53, 26, 183, -77, -98, 101, -111, -114, 96, -84, 148, 57, -46, -16, -26, -163, 103, 423, -162, -312, 64, -98, 63, -334, 246, 213, -134, 185, -30, -38, -73, -118, 5, 125, -151, 133, 44, -110, -185, -105, -204, -30, 109, 8, 55, -310, 63, 181, 66, 14, 5, 13, -154, 77, -91, -126, -62, 106, 317, -2, 72, 87, 186, -184, -116, 20, 463, -133, -301, -103, -96, 17, -219, 118, 96, -153, -140, -96, 124, -83, -124, 405, 125, 191, 178, 58, 332, -84, -387, -43, -147, -102, 125, 60, 19, 149, 205, -161, 101, 103, 27, -119, 21, 67, 22, 291, -108, -30, -42, -233, -73, 202, 95, 72, 71, -209, 253, 33, -54]
5806e4j25M9L72j20j4r5M8j50K96n32J38J61J04K04j63k30O6l3qJ96r8N7j97J01
5830b7k4l5L8M8J06K5k4L8l95p8K72j26J09k42K79k75J12J5J55k6J82K7j81R6
5854F9r7k13J80k39J05R0J25K07n42L60q2J18k62K74J7j18j03J83j64J17q5J34
5876G4P0j93j5K18j61m8n6R9j13J99l4j37j25J52L16k69Q0j40Ok5n3J72R9l2j64
5901h0J01K61l45K02j69K11K20n06J21M4L8j29j79K42J56l13K39J9r4J8J54j41
5923G0q3K59Jj78k05K10J90k70J13P9J0l12J9M54k98j50P6j42J64Mj53M19r5j89
5947gK6Q3Nj42K9o9JJ96j30K06J48k45j26n4K1N1%R2j6l22J34R1nJ97J0k29o6
5974a21K19j92J12K6o8k11K31K56k07j01J08k95K02J17k46R9J08M3j5k01M59o41
$$ y = [-54, -179, -130, 242, 122, 108, 13, 61, -89, 207, -325, -187, -26, 78, 282, 119, -111, -45, -78, -86, 110, 12, 69, -128, -27, -51, -86, -48, 0, 106, 131, 107, 145, -250, -328, -56, -182, -73, -315, -36, -311, -199, -184, -29, -55, 127, 154, -27, 69, -28, -241, -61, -300, -195, -105, 20, 227, -315, 45, -37, 81, -181, 93, 110, -8, -111, 72, -92, 25, -60, 74, 144, -49, -64, 154, -7, -55, -111, -12, -125, 74, 40, -97, -222, -70, 246, -23, 57, -83, -77, -102, -155, 17, 116, 84, -80, 21, 282, -63, 139, -30, 181, 401, -105, 16, 60, 98, -31, -210, 32, 188, -125, 114, 133, 39, 57, 211, 70, -13, 246, 247, 69, -136, 74, 264, -6, 107, 186, 196, -116, -97, 357, 59, -91, -15, -157, 7, 11, -142, 277, 182, -7, 19, 102, 107, -35, -6, -75, -74, 122, -8, 198, 346, 101, -25, -79, -58, -7, -7, 85, 69, -253, -119, -28, -33, 164, 174, -55, -121, 98, -94, 18, 44, -24, -235, -4, 252, 45, -56, 52, -243, -41, 76, -170, -71, 37, 80, 65, -136, 323, -318]
5996c18N45q2l9j3Q2j02l8J39k80o2J12J81L3j75r1P8K60k29k87K76K11k08o2
6019f9q4M42o0m30j09K54n3J34O3j38k6J47j26O8j85R4q9L71j64j42p3K75j65
6042f5K11l64K10M3o8J67L36l03k74L54k19K06n00J35L8J5k79L20j96L74n7O9
6064A53m25L69K38k14j5j37j94J38P9k01J46j35J71Q5j09RO0K60k17o8L5l73L70
6087B5j38j67M42k7j46PP1n4J4j03j74m1N94l80K18j06j02M10l89J63J43j09k63
6110a12K18n3l18K85L2Q0m02L6K75n0j1k4r4J82R6q3K1J1j7o5j39j49L39M8j31
6135b5J94m3j58J11M0m55L72j41J50j34nN7l63L60k90L12j68L12j94O0J03k3k05
6158a33J81Q3K48m94K61j90K4j59P6M73m86L83k19J16k1j43j1m6J26M2j85K30
$$ y = [-318, 227, 145, 106, 93, 175, 73, 35, 174, -106, -168, -56, 125, 158, -17, -108, -30, 230, 1, -286, -10, 201, -7, -69, -153, 289, 229, -201, -310, -56, -109, 25, 88, -50, -76, 71, -55, 13, -172, -78, -167, 204, 40, -102, -175, 100, -65, 146, -218, -8, 35, -33, 134, 470, 167, -107, 247, 28, 234, -266, -131, -93, -78, -357, -37, -233, 141, 84, 153, -272, 97, 335, 121, 106, -31, -225, -87, -8, -209, -63, -198, -27, 58, -51, -42, 18, 278, 61, -7, 28, -345, 25, -113, -280, 162, 135, -11, -4, 67, 13, 27, -76, -250, -291, 303, -77, 141, 35, -67, 343, -46, 117, 260, 151, -112, 106, 53, -265, 20, 52, 132, -270, -234, 41, -9, -20, -44, -138, 44, 140, 57, 78, 89, 72, 7, -132, -281, 58, 106, -25, 169, 126, -32, 79, 119, -336, 36, -105, 45, -89, -94, -37, -400, -40, -330, -18, -186, 126, -68, -8, 95, 72, -133, 48, 131, 379, -115, 146, -44, -20, -179, -103, 370, -116, 267, 48, 164, 143, 0, -11, -57, 69, 111, -74, 156]
6180A56j15J17K7m71J21J84J46k39K54l31L36k14o0J53k78K94j24qQ3L1m5r1J32
6203E8K2j29j84L90j7j3p0J52j69p0j21J91R9ql14K37j62J39r9n1N3l9J27J90
6227B12l21L02j96l11J93K67k08J42k15N1L51m37K12q2K60Mo1k07JN9J1L28m16
6250f1K26l34O5j26r4N95j29L51l87K3p6J37K7k65J11q4J53L6j92k72M98K74n04
6273b8J59J4j91J87J07n32N75l78K82Q1j84K6j14P8k9j13J01K08k33J47q6N0k36
6296a09j32J90j30K49k9k13K5K46m58O44k69j55L25m69n1K52K33m5j10J69l22
6317a59K92j12l03L01m8J55j42P1j11J1J69l54K14O4J33l20J81K20k53l48N8J94
6339h7L0K27j85j31j8R8J63ok09j33K86J96j35j98K84q4j87J46k71L30k37j0o7
$$ y = [156, 41, 158, 185, -286, -165, 19, 165, -74, 180, -151, 185, -29, -89, 64, -214, 80, -44, -52, 31, 62, 17, -74, 58, 80, -49, -233, 157, 140, 127, 57, 209, 40, -30, -151, 40, 139, 131, -183, 54, -108, 31, -68, -119, -66, -105, 22, 212, -109, 193, -3, -314, -121, 146, -62, 80, -135, -84, 267, -170, 42, -40, 220, 224, 163, -44, -43, 16, 27, 355, -61, 165, -169, -104, -230, -324, 271, 142, 493, 106, 129, 53, 190, 217, -48, 63, -21, 132, 168, -24, -296, 202, 476, -28, 131, 145, -46, 141, 248, -284, 291, -87, 195, 276, 92, 118, 4, 82, 53, -60, 41, 249, 16, 163, 77, 127, -109, -241, -51, -181, 68, 39, -174, -149, 97, -361, 283, 14, -141, 184, -285, -336, -84, 149, 104, -6, 163, -159, 133, 21, -282, 19, -29, 126, -16, 55, -56, -45, 124, -230, -16, 48, 181, -139, 42, 262, 9, -339, -281, -87, -57, 170, -15, -146, -164, -66, 97, 91, -118, -251, 35, 231, 96, -102, 182, 98, -89, 57, -214, 116, -121, -131, -198]
6362a98K67J65k47n2j17J0O5K65jk41l7p5K20m6q3J35o9l40L06k39M73L0K6l30
6386a13J65J26k35n8J23q7j88L33k26J91J49k67K60o8l98L24P6J33j28j11P9k76
6408a96M47k71lO1K9j22l4l27L82K0J40j13r5P7j98L73j98j02K31k36J14K05j41
6431D3o7MK98k30k41L05k85L09J6p8j91J16K4K19k50J45J80k45l41N9J90J07j23
6454c6J44l92J50L02j35Q6o8j1k79J25L59j23l12J44J15l48K05K12m0rk46q4L42
6477A01j01j06J5O1J79k33O2L8n0j8r2R7J65k65L05K64o38M58m24J57L97j04o4
6500B04k18k1j93K27k1k22L40J41p7k29K75m6o68P19j94k69L36M9J25k61K9k98
6522b72N5K40J08j80P4K50j33j69r7R6Q5O4k62J67m9P3j13o5L17J4k66K76m34
$$ y = [-198, 69, 234, -13, -65, -182, -172, -107, 158, 157, -84, -121, -196, 24, -22, -105, 30, -39, -379, -73, -312, 161, 191, 217, -113, 52, 178, -57, -115, 8, -79, -267, 66, -160, 31, 180, -87, 173, 105, -293, 31, 107, 240, 112, 1, 80, -196, 251, -20, -23, 38, 67, -55, -89, -416, -34, -14, 126, 13, -82, -5, -203, 170, -28, -130, 101, -135, -21, 184, 43, -24, -20, 278, 48, -193, 112, -173, 136, 152, 74, -117, -1, 23, 242, -8, 137, 317, 72, -269, -210, -20, 87, -36, 108, -284, -134, 168, 33, 119, 51, 40, -239, -114, 245, 122, -190, -46, 69, -279, -74, 138, 98, 89, -157, -241, 101, 0, -106, -91, -30, 149, -84, -22, 16, -34, -52, -144, -47, 118, -147, 158, 422, -216, 242, -182, -25, 372, 268, 204, -14, -35, -228, -1, -22, -244, 96, 237, 160, -69, 206, 160, -508, 211, 17, -252, 84, 133, 258, -3, 26, -272, -217, 23, 131, -49, 25, 275, 142, -27, -124, -28, 57, 121, -141, 26, -23, 50, -63, -128, 189, 203, -63, 213, -221]
6545b21K50J02j49L1o2j6K07L4m35K85K95k12k4k08l6L28j80l74K94J52k29j77
6567c45K47o6J51r5j83J12J42j01J7K01k72L97j92k41N40m39J28J5m0l83M57j94
6589a44p7M38l78O3J42j08l03K81j15O05n74M9K22k40N8J76l21K81j4k8j60M6
6611a01J44l17M42j3j99P7N3l2j52K43k45J26J8K24k90K11j79l8j62J43L50p51
6633d48M09Q3K5j49Kj0R4j34L52k7j28j73O0J93l39M23l83J44L64n45J98P7K01
6656B89n32K24qQ3J88j54q8j14J02j02K14k81K94k27P7K86l02Q9K44l4o0l83K53
6679E8J41r0L56l54l5o1J57m36L41k21J74p9J84l2N6j41j54L28k71K05j30O5j66
6702a05J17k1l59O47j92P6M3k00j0q9K3J48k14K78K40m92L8L7K8qj1R7l48L49
$$ y = [-221, 29, 131, -18, 13, -49, -65, 142, 176, -259, 26, 321, 109, 85, -123, -159, 169, -11, -385, -91, 61, -168, -345, -98, -164, -13, -108, -291, -179, -37, -138, -121, 80, -192, 205, 13, -228, 312, -127, 1, 16, -24, -407, 50, -144, -221, 217, -161, -98, 44, -64, -367, -86, -201, 404, -170, -121, 101, -139, -81, 95, -226, 55, 41, 13, -147, -101, 43, -274, 168, 155, -44, 33, 86, 54, -98, 145, -100, 26, 44, 268, -22, 189, 10, -28, -190, -47, 303, -448, -39, 44, 69, -80, -78, -88, 6, -128, 224, 197, 69, -104, -44, 149, -190, 233, -150, -6, 358, -187, 11, 88, 289, -243, -19, -27, 56, 244, 90, 2, -112, -10, -112, 102, -179, 115, -112, -35, 251, -51, 38, 282, 248, 188, -195, 58, 199, 109, 465, 111, 76, 15, 172, -264, 77, -144, 30, -49, 135, 103, 159, 18, -136, 192, -79, 126, -4, 61, -105, 12, -9, -368, 279, 87, 163, 206, 6, -4, -93, -70, 78, -136, 142, 382, -110, -72, -35, -7, -15, -26, 71, -277, 72]
6726G2j69j53L52l07q4J26L17n5m98N40k79L8L82k73k97M23j73K09j65q7L17j7
6748B19k75o8L69j8p3p1n4K22m9m82J82L04r4k08L89l15J22P5l39J95J44k45K28
6771A58j72K61j22k13r3K69lk86K84l68K86P9m8J81k74j2o9J55l02M05L8k23J30
6794F1J26k64K98j75k44M72m52M35m86M7j99O10j21l30L79j45J91o3j04jN9l57
6816b63j29K34K29J06L3k86P6j47R6J55j17j8n0o2P6%%j67M00j41mK12r5n9j41
6841f2l3p6J04J40j67J54k50K24M0J6O4k55L5j14L75k30J38k33P9L2J9m6p0K46
6865A30K2j7j44j44K35Q4l74P2K11J06j2j73M7J37k42r3l1N2Q4J99k10J8Q8J87
6889B32j47J28l09J6J00q4j38M2K82k11K02N3j96o6m1J19J92q5j08l3M0J50j60
$$ y = [72, -97, -250, 102, -205, -289, -163, 154, 99, -399, 141, -138, -100, 282, 9, -288, 135, -38, 171, 6, -81, 236, 219, -56, -124, 245, 227, 154, 83, 29, 251, 202, -280, -98, 206, 112, -96, 293, -22, 100, 175, -164, 31, 175, -70, 158, -14, 247, 125, -88, -181, 88, 85, -201, 83, -285, 1, 80, 32, 213, -61, -73, -142, 13, -289, 116, 154, -69, 61, 187, -77, 221, 46, -198, 274, -178, 257, -229, -182, -381, 229, 108, -222, 157, 12, 203, 140, 36, 35, 94, -263, -392, -158, 71, 177, 210, -76, 0, -147, -51, 104, -13, -31, -81, -143, -67, -67, -67, -234, 166, 25, 21, 233, 138, 79, -62, -95, -171, -67, 73, -94, 60, -190, 34, 74, 90, 154, -101, -66, -180, 195, -35, 103, -130, -51, -19, 0, -46, -116, 130, 152, 135, -9, -153, 82, 166, -208, -136, 75, 181, 169, -4, 43, 180, -62, -155, -186, -134, -50, 149, -61, -43, 45, 232, 85, 213, -96, -80, 20, -64, -202, -160, 122, -89, 113, 166, -30, -96, -137, -18, 174, 89, -19, -52, -12, 138, -22]
6912b2j13k5J99k28J76o2j58J12Q8Q5l68J93P0m9M08l56J76k20J92J61k72Q9j31
6935e5k19L60K0j57K59Mk74J28M9k14M8J18%k32q6M9J02J38l12K14L3O9j33k7
6959a18%kJ48j22J90k50L82j81J70l67J64K64l59j84K7J77J52p3R0k9l47K90J16
6982A38j82J25J7k77j00L45L8k23J55M1J88l10n6l7J10j56K66r7N8R7J4j26r0
7005f2K14j81l4j03J97k68L28p5J31K54m57lm8J24Q6m3j49K89l21J0j11L67J65
7028C10l32n4nK5N28k77J21l99J65k41M3M1M2KJ57p7q5J38k44j7J60L19m20q5
7052a85K50l9J64k40M4J86j05l03R2K6oL71o03M65j11l44K37J83m42L82J05j47
7074b0J61q8j86J98j16J11O1k29J79q9O5l13L30l07J60N1O5k58J01J62j51L89
$$ y = [-22, -135, -160, 39, -189, -13, -75, -233, -121, -33, 52, -316, -123, -53, -102, 306, -50, 126, -94, 98, 259, -13, 76, -55, -274, 86, 106, -51, 208, 212, -62, 66, 115, -99, -51, 67, 67, -165, -251, -202, -100, 38, -274, -60, -27, 42, -91, -118, -118, -120, 28, -94, 96, -154, 228, 47, 217, -150, 14, 278, -81, -265, -238, -61, 91, 18, 108, 79, -268, 22, 138, -44, 81, 98, -179, -279, 66, 104, -119, 36, 77, 265, -45, -101, -138, -28, -184, 82, -15, 43, 140, 154, 28, -62, 152, -29, -63, -166, 31, -237, 91, 16, 147, 401, -56, -59, -107, 17, 103, 60, -89, 200, -121, -111, -222, 145, 310, -22, -76, -81, -56, 472, 195, 316, -83, 82, -159, -116, -75, -33, -31, 126, 49, -36, 102, -142, -159, 1, 320, -100, -185, 65, 26, 190, -50, -6, 180, 75, -228, -136, -110, -116, 255, -348, 117, 6, -338, -101, 82, -360, 22, 127, -20, 141, 53, -133, 65, -51, 60, 121, -108, 71, -18, 47, -266, 64, -243, -83, -32, 33, -225, -124, 38, -113, 276]
7096B76l18p6J15L43n18l6K20j48K13L2K08j94j96j0o4J75o4K87O8n05M22l38
7118a08L79m57%R3R6j25J07r8L0j2K7N4J18O4j46jJ3R1K15l74L5M7k35L86k24
7143b5j73K07J13l3m26N0N1K39p2N0j8J04m25m9M00K53q6KP3l55K43J06M5k73
7167AL8j28M47j98k02K9j40K96P2l51Mj7K41kPJ77k84j00R2K76k33o9k53M49l11
7192a59K03RJ06k86j28J91j13Q4q3L21j11j88%L0L49l62K37l56L19M7j81L8J88
7215A55r5j15J29j52m4m9J80J46O9l81J73p3m0J95M7k43r1M4J18J71J17m16L26
7238A71j65l36L42k55J92P4J91k62qJ84k93L71n18L03P5l75M38j02j36J42j22
7259h9J99k51J9j69J37J23j72R6J39r0J59K8L0j74j31q8K18L11m01k46M40p3j0
$$ y = [276, -42, -118, -3, 340, -178, -214, 6, -142, 71, 103, 311, 117, -79, -89, -153, 22, -42, 245, 313, -192, 230, -108, 271, -186, -186, -93, 3, -122, -15, -113, -83, -95, -68, -14, 104, 168, 22, 21, 34, 125, 340, -34, 1, 48, -187, 199, -25, -198, 9, 122, 89, -337, -287, -236, 3, -69, -19, -37, 67, -358, -407, -7, 246, 160, 162, 235, -120, 123, 229, 274, 1, 39, -89, 358, 160, -42, -13, -153, 143, 215, -136, -132, -149, 92, 90, 97, 274, -10, -110, -18, 258, 25, -44, -297, 152, -159, 44, 53, 159, -127, -255, -64, -177, -93, -176, 145, 34, -154, -154, -124, 225, -137, 100, -256, 63, 110, -71, -33, 155, 60, -55, 74, -78, -122, -171, 9, 155, 224, -157, 16, -57, -97, 98, 145, -98, -189, -145, -27, 144, 261, -155, 171, 6, -330, 12, -243, -51, 23, 214, -48, -56, 128, -165, 206, -312, -9, 66, -309, 129, 27, -109, 33, -89, 110, -141, -122, -291, -154, -31, -203, -107, 32, -58, 101, 129, 159, -15, -146, -234, -16, 295, -106, -352, 88, 15, 5]
7282Ek52M98k40j02J50o7O3k19J86j6K60N5k84L3j51K52r1p1J87j22n0m1j20P0
7306f7L56j75l92L59n6O4Mq5L8j44L03l13o1N68n31L55n25N18OK3j94o6J9K89
7330B93jl47J00K27j23j06o8k55L97j86L57o06j80N99R7k28K06l44J63Qn0K57
7352B10P1j85j90L4J34k2K13m50K7J40K81j77k19K38m7j02j35K5p1J40k9J92P4
7375A52k01Q7k01P8J20Oj11J11K43l00j10K72k18N6j65j6J27J32J1j99K54j99
7397g1J13M3R7m22K74O3J14j85J2K5L7j50P5k65L00R6j20J14O3k91J97j38R8L7
7421A16j81J75k2l09L82l67N7L27j55P6j72K88l60n8R6M5R9l24N93k39j40L06
7443B33l12J45j04j24M57l88J20K34k63K07j08j21K55n45L37J42j28J94k48J34
$$ y = [5, -247, 251, 11, -91, 59, -8, 55, -164, 22, 6, 266, 321, 37, 70, -81, 171, 80, 9, 196, 74, 24, -17, -137, -67, 289, 114, -278, 81, 25, 89, 93, 8, 46, -98, 205, -108, -169, 399, -132, 223, -302, 216, 222, 245, 51, -15, 4, 293, 292, -55, 45, 272, 149, 43, -25, -280, 117, -69, 288, -318, -498, 101, 198, -30, 176, -168, -5, 3, -47, 210, 281, 96, -94, -60, 74, 52, 265, -185, -158, -18, 263, 86, -133, 105, 58, -44, -179, -154, -225, -85, -114, 78, 152, -49, 38, -163, -85, 35, 41, -70, 41, 284, -16, -126, 146, -72, -16, -181, -197, -70, 62, 73, -126, 128, -71, 42, 85, 182, -240, 34, 97, 211, 26, 38, 63, 100, -50, 25, -240, 60, 156, 36, 150, 213, -78, 119, -19, 79, 116, -65, 110, 88, -221, 161, -206, -149, 178, 23, 99, -73, 215, -145, -203, -107, -62, 37, -287, 306, 67, -73, 233, -79, 66, -38, -162, 295, -93, 27, 261, -2, 205, 97, -24, 231, -314, 23, 165, 37, 231, -17, 117]
7463A17l0j16l64N39j98J55l24J23K01l27O36n26OK00k29J34j56p0M29o1j00O6
7485A05J07o8l06J34j35mK63l3j40M7n0N8j89J99n3P3R0j50l3K86k41p3M21k45
7509F3N8k42L52k14k80O27l67O6j63L59k26J7N1l36R0o6J51J6n4L62k79R2L55
7532D32l14Pk16J47j77K22j12j38K68J3k02J05M0k03n5M31n6j45N8k6k56R9L2
7555d6K54k80Q2KJ94Kj98R3j22k65O34m20K02l01J07P9J0k5j63P3P6j3j29K05
7579E1pK74l43L16l40K1K68m15Q6l0J22j0K29j99k59J31J08N8k18K46J23j98l19
7602c05Q1L25r2k4J0j46j49o2L54J03j42K87k81Q1M0o0j32K12j27j9N7k65K55
7625AO7j17J41r3o1n5N9Qp1J7M29q7k59j64L31k97K8L10j05k30J32J36k1k04q9
$$ y = [117, 87, -29, -393, 146, -52, 103, -221, -98, 103, -224, 412, -114, -108, 92, -137, -3, -159, -229, 200, 139, 39, 105, 212, 144, -162, -28, -163, -167, 96, 63, -77, -30, -80, -22, -211, -12, -65, 8, 98, -52, -85, 201, -40, -113, 308, 63, 121, -121, 231, 17, -263, 364, -3, 63, -100, 259, 33, 50, 101, -235, -145, -211, -60, -44, -98, 264, -15, 77, 432, 118, 125, -91, 56, -121, 101, -11, -149, 119, 132, -70, 35, 75, -128, -183, 248, 192, 47, 105, 79, -177, -78, -46, 208, -72, 10, 12, 206, 208, 10, 103, -19, -284, 350, -70, 132, -169, -62, 17, 27, 2, -161, -88, -12, -25, -154, 51, 44, 318, -25, 291, -49, -28, 240, -175, -89, -119, 3, -7, 222, 23, -236, -105, 3, 61, -157, 89, 212, 14, -305, -224, 101, 9, -15, -5, -151, -300, -362, -8, 95, -47, 240, -41, 40, 80, 20, -112, 100, -27, -46, 11, -254, 1, 68, -49, 92, -1, -62, -117, -58, -50, -121, -104, 325, 238, -21, -185, 146, -151, -123, 187, 82, -148, -16, 120, 99, -105, -194]
7650a94r1J81J16J8j68n2K74k48J85L7j74K2P4K09j72j4k15J94r8J03OQ2n6L71
7674C90m22M2ml7j48J90J37KJ08j28L16m48R8J13l64K19j89N05k70p3j14k37L14
7697@k04N7M6q3O5L11m9J01j64J68o22K97K92m2K45m23j3J82K1j2j4m28K63mJ15
7722A05l18K17j32K51J5o6J1n9n0M8k49K10j14J32p0K82M7l9l23J19R6j10K85
7745B88k75l95P4L47rM0K1Q8m31L33j23r3P9k58L34J41J52j77k59j06K37J07J27
7768B42m79L34R6j87K24p0p2k30L72j31P2j67j2j17M5j21o0L00n9J91k7J7j7J5
7792A59q6J99m81J51m6J28N5K68j54n60N23k87M18n38L06K0j87N04m93J82O0k44
7814a03L81Rl02k56K19K16j04j67o0L0L68k92j00k8M89k79p2K07o5L16j85m79
$$ y = [-194, -285, -104, 12, 30, -138, -190, 84, -164, 21, 58, -116, -94, -20, 189, 17, 3, -212, -18, -116, -13, -7, 75, 19, 390, -32, 10, 6, -31, -179, 11, 148, 150, 258, 130, 446, -2, 96, 209, -155, 64, -125, 380, 110, 37, -77, -314, 0, -204, -147, -101, -184, -119, 192, 143, 244, 80, 248, -374, -77, 215, 173, 418, -5, -18, 164, 185, 173, 159, -269, -6, -10, 105, -213, 4, -128, 123, 138, 72, 83, 24, -26, 22, -227, -17, -131, 1, -69, 213, 260, 221, -102, 17, 113, 3, 288, 13, -382, -308, 39, 30, 70, 91, 179, -252, 81, -42, -135, -56, -314, 20, 161, 313, 136, -123, -229, 8, 115, 242, -237, 97, 193, 6, 230, 160, 88, -142, 230, 99, 171, 4, -8, -125, -80, -201, -261, 39, -20, 171, 144, 161, 144, 159, 73, 272, -209, -58, -104, 24, 79, 347, 193, -367, 156, -131, 287, -251, 55, 75, -112, 392, -101, 81, 141, -103, 278, 287, -15, -271, -52, 164, 60, -107, -167, -137, 231, -61, -161, -189, 300, 21, -51, 156, 91, 407, 222, -257]
7836b57K43K6j94k21L52o3J23R2j11oK63k16j13J96l00J28J05J90j33N0m14L79
7858A19k71J81k6p8O6l8M9j95J98j29j11K64P6k71Q7j54J9L6K75r0P2j71P6p2
7882h8j11K73k76K16r1R5k0n5J17j20L07l73Q0k6M7rK8q7j58K84j31K9OM0N6j50
7908a17R3K23j52o5L33p7j95j31J30J15N1j04J67K4k78N9j10L2J70N6m17J42K5
7931b6K22j51j27K59J41k18q9j30J31J86k73K04K16m23j4l3K69q0pk83L66p1j0
7954E9l11L27k23L53l25L32k33R2J23M6j44j54L63l79%k1j28j23K20lKm1K36K53
7978C21n67M84j14n5j33R0J34k27J24j42L25l9J41m10m2J96OM8k96J70K6j87P1
8001g6pJ19l2J20j13p1J6r7r0M94j51k13J03O5p7J83L5l06L44k95K4M5j8j14J78
$$ y = [-257, -14, 12, -182, -403, -51, -114, 9, 101, -10, -16, 247, 31, -82, 114, -186, -58, 47, 237, 104, 154, -260, 119, -152, 29, 3, -75, -9, -47, 2, -193, 5, -124, -235, 29, 105, -166, -79, -233, -214, -178, 97, 7, 79, -92, -16, -88, -199, 74, -202, 14, -77, 18, -2, -57, 60, -60, 247, -126, -46, -72, -25, -34, -6, -93, -251, 33, -98, -69, -63, -23, 33, -117, -24, 199, 47, -18, 315, 238, 43, -88, 42, 157, 208, 104, 271, 295, 17, 76, -34, -2, 168, 224, -193, -51, -26, 196, 45, -82, 177, 318, 100, 11, -119, 12, 198, -75, 129, 345, -78, -92, -125, 144, 64, 57, -226, 140, 69, 59, -252, 75, -148, 205, -120, 212, -21, 71, 194, 240, 96, -58, 305, -74, -74, -95, -223, -346, -126, -129, -127, -168, 68, 321, -246, 238, 124, 69, -64, 26, 160, -67, 57, -85, 240, 201, 342, -68, -110, 86, 92, 140, -156, 14, 40, -147, -76, -83, 36, 4, 124, 11, -60, -44, -141, -231, 263, 112, -101, 2, 67, -10, 173, 208, -98, 246, -49, -25, 20, 2, -112, 66]
8026F6j9j61K87K6j00j40j21j9J70K06k41L5o8Q5O7Qk06kK53j37J12k44J17MJ72
8051A50n6j49K06LK2l63L25k25K19p6j5j70J80R1j32K03l68N19n68K18J73l0k44
8074h7j56J56M2J29kK10j18j22Pj1j10l3J31J62p1rj41o1L74k58j24N5j35J2N2
8099a08J37o2K35p8j48J7j11L09l15J80j26k29L68o4o8K32j13q3J51j50J25k79
8121a80J11Nr0OL45m1j77J3K36l75J36k3J64P5l33M92n63K48J4l31K98j83K53
8144A00l94J99LJ84k82J64M9mk85m6K42n9J18j8r6K88j16L2k87Nj7J32L29k90
8168d9J39q1K70o10L11k24M23J2j64L62l72R5j09J60j67M01j1k37m31L0M27j62
8190A3J58
$$ y = [66, 47, -114, 173, 199, 99, -41, -162, -181, -11, 195, -46, -11, -79, 6, 73, 81, -125, -127, 126, -11, 101, -143, -26, -22, 150, 94, -55, 151, 154, 176, -187, 138, -87, 132, 56, 41, -129, 51, 142, 10, 213, -155, 364, -204, 14, 187, 157, -87, -243, -87, -45, 84, 82, 292, 174, 52, 59, 48, -62, -95, 36, 198, 127, 118, -23, -84, 290, 32, -92, -37, -172, -160, -108, 29, -33, 202, 124, -24, -7, -118, 191, -124, 56, -70, -299, 69, 5, -63, 169, 56, -27, 124, -26, 99, -180, -69, -64, -154, -148, 197, 156, -21, -8, 228, -147, -11, -34, 130, 205, -128, 364, -199, 49, 63, -268, 30, -153, 100, -294, -95, -92, 92, -190, -26, 23, 19, -266, -312, -70, -129, -11, -29, -125, 163, 47, 79, -208, -203, -220, -88, 241, -49, 90, 9, 279, -331, -20, -244, 179, 191, 27, 389, 17, 112, 3, 163, -4, 397, 386, 149, -282, -252, 175, 13, 171]
8191A71
$$ Imaginary data points
##PAGE= N=2
##DATA TABLE= (X++(I..I)), XYDATA
0@%%%qJ6j6K4m0N6p2Q8j04J28j60K00k44K92l52M16m88N72o68P76q96J032j184
26f32J352j538J746j976K228k507K814l151L520l925M370m858N394n980O626p338
42c855Q123q994R963j1045J2263j3645J5226j7054J9197k1750K4853k8723L3709
55A8268m0410M9961o4793R1217j52749N46761M91451o72260k12532j31363L4600
66d1849o9951N9053M1441N2588m0682J7899l24L558m0377J4653P959N600k5000
79a5432J5258R943M294k0096L923L749M203r465M306Q54K900o315K069l13K742
94B620k183N61j400Q93q40J103J61M10k002l02J518R83j519j102R01J092q69r60
112i35P41J017r38l79P78q5p87L30P89k19o47k91J136j80q30Q6J020m38j200Q76
$$ y = [0, 0, 0, 0, -8, 8, -8, 16, -24, 32, -40, 48, -56, 72, -88, 112, -132, 160, -192, 224, -264, 308, -360, 416, -480, 552, -632, 720, -818, 928, -1048, 1180, -1327, 1487, -1664, 1856, -2069, 2301, -2557, 2837, -3143, 3483, -3855, 4268, -4726, 5237, -5808, 6455, -7190, 8036, -9018, 10179, -11571, 13282, -15441, 18268, -22142, 27819, -36974, 54243, -98506, 448255, 939706, 267446, 54914, -76449, -41849, -111800, -52747, -11306, 41282, 600, 18499, 18175, 21733, -18644, -3991, 3968, 9568, -15432, -174, 9769, 14063, -6033, -2110, 1639, 5842, -3623, 683, 1537, 4437, -1878, 191, -122, 2620, 437, 998, -402, 491, -349, 754, 915, 1325, -677, -979, 539, 1522, 3, -1099, -198, 894, 25, -935, -194, 823, -115, -494, 284, 199, -588, -258, 531, 312, -335, -626, 510, 330, -500, -414, 606, 168, -1032, -156]
132a56N24j9m86l79N04J24n01K22L90j08k14L47j12l51Q9L73l69L3L8J49k04R2
154a4k54J96k24K28l2M72j66l60l4J4K25K7k98Q8J14O7o1J4J95k16l6NN3J08l1
179H0j39j4M5L64n01K77L8j86J04k51M52l15J37n4K93k25l46K78J19j23r7P9K5
202D0l4j85J59J16k33K41m2K24k88P9j81kJ49l10M07j00N0J1J23j36j15r6q6K17
226HK67k11R4O8k29J20k75J72J67l02nL21L2o00M27K16l01K9p1r4L36j69q1n6
250a37L95l52j31K83p1l6J71j32K6j06J00j49n3J46K68k64K4L49o42L62j25J56
272H2Rp7J68k9j25R4m8n4o3j88l1O3j7L02j28N4o6L12m53J57K94q5j39k9K9m5
298a3L31m27Q1K35k92J81K55m78O5K87q3k77n7J35J71m3l67M41Q8l06J93j62j11
$$ y = [-156, 368, 349, -137, -516, -12, 112, -389, -167, 223, 115, -99, 248, 136, -215, -126, 247, -122, -89, -51, 98, -106, -14, -268, -72, -296, -68, -100, 372, 206, -154, -188, -174, 51, 78, -220, -132, -18, 49, -12, 2, 197, -19, -55, -50, 3, 111, 80, -59, -73, -28, 336, -165, 112, 150, -36, 68, -183, 269, -46, 91, 37, 330, 105, -241, 37, 156, 33, -64, 15, 40, 6, -179, -20, 96, -137, 104, 62, 286, -2, 77, -104, -106, 43, -267, 140, 40, 90, 101, 224, 88, -27, -123, -209, 8, 275, 64, 158, 226, -3, 117, -158, 14, 181, -121, -126, 195, 227, -373, 54, 270, -31, -2, -73, -167, 169, 0, -81, -137, 258, -94, -225, 58, -13, -49, 122, -10, 16, -90, 10, -139, -192, -46, 222, -42, -18, 331, -311, 51, -74, 82, 91, 14, 182, 153, 28, 122, 74, 20, -43, -231, -262, -199, -216, 86, -42, 12, -54, 258, -195, -38, 256, 171, 32, 3, 32, -13, 318, -109, -28, 207, -85, 96, 351, -127, -62, 225, 142, -135, -192, -57, 114, 71, -296, 145, 233, -73, 120, -42, -153]
321a53J27k35K77k94M83j08K50j24j28q9k36L8J24j7K9M4p6J97j60J9qj14J33
344b1L81k87R7k0n9k1p1j54J85l65O99k78R0m2l37J65N9j19R9k33J69j41J1Q7
368a06M9q3L16l08K67n4j81m6M48m45L73k27P7p7J8k6O5k3r9n8J89O1M9j50q4
393e5J19k53J91j22J8J09K34k04j5k5ml4Jj80L50l12k5n1K99k3j70Q1j4Q3j9M5
419B4j71j46L72J48l16J73%j9j3n8J84k12J45n00L81j55K51j67J68n7k22K43j57
442a04L48o6k29J91j67j71M6L61n01L36j42K51j3j52J90j95o2j3J14j43J65M8
464I2j95j12M12l19J81k60K38KO1m10K44kl8K77k78J96j09J74J39k70O3k61L7
487a38J07j49j31J95K49j56k6J20n1J95r8k82K0J92O3l35K99K5l59J60K31k12
$$ y = [-153, -26, -261, 16, -278, 205, 97, 347, 223, 95, 6, -230, -192, -68, -85, -56, -12, -88, 109, -51, -32, -40, -154, -21, 360, 73, 170, 150, 91, 70, -1, -155, 30, -335, 364, 86, 176, 134, -203, -38, 21, -98, 1, -232, -63, -204, -193, -106, -57, -140, 176, -132, 135, 81, -100, -146, 302, -143, 230, 3, 80, 3, 21, -5, 60, 37, -62, -120, 69, 130, 179, 29, -55, 64, -189, 2, -120, -102, 7, 241, 37, 22, -3, -7, -41, -40, -220, 130, -182, -207, -258, 41, 18, -152, -71, -85, -2, -21, 24, -147, -293, 79, 227, -89, 84, 84, 65, 52, -6, 178, -34, 111, -389, -8, -163, 88, -79, 89, 32, -190, 53, -104, 244, 178, -51, 140, -27, -198, -152, 209, -292, 44, -98, 153, 140, -12, 178, -17, -79, -92, 22, -121, 44, 92, -103, -215, 197, -122, 59, -201, 37, 39, 100, -310, -66, -68, -106, 171, -107, 89, -20, 154, 293, 23, 86, -175, -138, -31, -180, -311, -116, 133, -23, -49, 71, 20, 215, 117, -165, -145, 47, 110, -225, 74, 99, -260, -100, 131, -81]
509h1q8K74k26L55j84j56J19k6n3j9K45j13j50M4J72o2j4k64M62j44n8K13n26
532b80K90J77l26J01L53k91q5P7K0P5j5M5j53j92l7L53L6j94K9O4j67J27P2oo7
557FR2k14J08K7l85P83j54k30K8k52P4q4L65k17kP7l28J03j1M52k81j66J10Nj5
582a09M5j18P8K03l03L51%j63l1m8L78j80j4Q8l31Q3K61l39K57j70J30j80J39
605B7j60m3J78j71L74k59n6J68n4L8N4j73K01k60K6J91N2j31K83l35r6J13M7j43
629a29m1L46L6k94J94j19R2p3nj1j11K93q4o7M3r4L03k05l65K15j43M72j09M1
653A85k25J03j6j87M7K05n7R9n2N4N0k13Q5j42o4R1l5K09k75K59k19J54k1P4M0
678A49j23j18m4J82j46j27K8L61k13n8M12n33M01j22J67l28J91j41J49j18j50
$$ y = [-81, -169, 105, -121, 234, 50, -106, 13, -13, -66, -85, 160, 47, -103, -59, 113, 51, 37, -227, 235, 91, 33, 246, -280, 10, 187, -139, -38, 315, 24, -61, 16, 36, 111, 96, 141, -12, -204, -241, 112, 148, -46, -17, 47, -120, 7, 79, 73, 6, 98, -116, -8, 19, -366, 417, 263, 33, 61, -191, -117, -201, 164, -53, -55, 22, -306, -203, -214, 238, -43, -209, -99, -94, -109, -64, -182, -104, 99, -204, 147, 147, -16, -47, -95, 283, 103, 89, 177, -154, -71, 190, -149, 108, -62, 68, -112, 27, -133, -176, 2, -169, 205, -54, -110, 58, 4, 42, 96, -77, 124, -136, -110, 81, 133, 2, 285, -50, -146, -33, 14, -129, -170, 176, 212, -82, 112, -7, 85, 12, 7, -4, -115, 178, 94, 27, 70, -24, 279, 74, -291, -76, -219, 253, 144, 185, -40, 63, 47, -140, -93, 112, 55, 154, 102, 156, 206, -7, 78, -64, -128, -37, -72, 137, -138, 121, -98, 56, 35, 109, 149, 26, -92, -136, 46, -100, -227, -199, 162, -51, -109, 303, -230, 171, 49, 216, -112, 79, -62, 87, -31, -181]
699a81KO4J77Q2l03J13j50Q3J07j38o0l6K44k84J55J06N2q9l1K57j89J63o3o3
723A8p4K5j76K55j52J6J45j58l0K05j77m3J34j10K76N8j09l58M88j7j35j2j50
746h1J81QK3Q7j85L8l2P3k61J88k2oL79k88j44j6j74J80J64p6J12O2j65nj63K11
772H8k46m6K25JJ52J7j83j28k26P22l93Q9l08J34Nj11K45j44J09R7j85m3K86j35
796B2k80K52q0J17p8j6J62q3M1l84K69l07J34K80k83L75rj90M90m27r0K10P4k31
820c2N3j38J97m00L74L5m39J04L73q9n0j09J64J09j17j38K33l00J58K81l68J60
842F1J72j94j92K40k22L75j39q1J35l0J22m65J14K6J17N3O7Pj68Q5p2K4K6R4j64
867iL1o7P1J70j24k06j4R9k6P0O4m9K07m56K70n1j36J87J13l86L68k85N44n94
$$ y = [-181, -179, -115, 62, 144, -159, -46, -196, -113, -6, -144, -204, -240, 4, -280, -125, -19, 33, -56, -87, 170, -19, 144, 81, 18, -56, -31, -207, 48, -104, -88, 57, -101, -131, 74, -103, -146, -12, -122, 154, 212, 103, -255, 233, 216, 81, 69, -81, 100, 108, 131, 218, 33, 71, 39, 112, -149, 39, 17, 11, 390, 102, -42, -58, -232, -52, 112, 36, 148, 210, 45, 40, -123, 88, -158, -204, 21, 22, 174, 191, 8, -120, -346, 376, -17, 72, -236, -102, -97, -208, 37, -107, 2, 99, -86, -129, 157, 22, -258, -6, -86, 31, -47, -63, 99, 16, 57, -327, -58, -365, -231, 49, -234, 141, 132, -58, 432, 5, -85, 125, 199, -32, 21, -117, 80, -320, 54, 89, -350, -246, 127, 38, -12, -121, 43, 152, 35, -103, 130, -170, -12, 269, -99, 61, 233, 39, -153, 87, -135, 240, 101, 20, 155, 125, 247, -218, -104, -78, 39, 92, 159, 166, -2, 83, 11, 35, 61, 155, -9, 22, -45, 26, 196, 72, -134, -148, -49, -75, -5, 59, 10, 217, -239, 31, -20, -156, 31, 144, -242, 126, -159, 385, -209]
891b09M35m80J79K65K0j41k22K14n6k31J04q8L70r3p5OK8r0j88N0j40N51l77J58
915a0j38J73o8k84L18j58J0P3j02K24k89L97k24K75r0p1k8K9J2j79q5j71J29N93
939C36k18m4Ok03L84k52M9pm5P7j59j91J28J57Q2l7j94J25l5R6L31l00j17p6N6
964e1Mj39L61j72J78j60J83m02L98l00K09j64J28j34J88k45K21j25J1m2m3oN26
987D24m90q1J51Q1K1j9l40J11J30n7K24q6q2K57j78j82J16o5p9K44J3l0j51k3
1011i1K62J7n38K46LO0O1o9L7r2J20j57n7L0L48j41j41%k20M6J83Q2L3j6q8J07
1037B5R1K9o0j02K24l10L5P3r7R8j76L64j43l10J61J97J4l02L55j34j07J27K9
1060H1l82K42J19J05j58m9N4k9j62J22L13j83L1j72L0M2n9j30J53m5P4J26P3n48
$$ y = [-209, 226, -254, -75, 190, 210, 69, -153, 61, 5, -226, -122, -210, 160, 67, -8, -2, 26, -64, -252, -202, -342, 209, -168, -10, -148, 25, -43, -327, -9, -167, -157, -84, -186, 38, -251, 146, -78, 197, 107, 36, 8, 37, 49, -130, -215, -386, -257, 336, 118, 74, 80, -123, 261, 9, 58, 51, 6, 83, -76, -267, -139, 18, 100, 63, -131, -6, -41, 55, 386, 86, -31, -107, -51, -47, -186, 175, 3, 181, 21, 204, -198, 200, -100, 109, -55, 73, -61, 127, -118, 103, -22, -11, -53, -96, -102, 424, -66, -147, 4, 85, 106, 87, -253, -142, -12, -69, 155, 69, -13, 244, 66, -116, 0, -65, -144, 100, 113, 83, -68, -91, 171, 188, -350, -104, -101, -41, 20, -49, -12, -104, 16, -141, -198, -168, 180, 39, -102, -102, -322, -276, -93, -11, 22, 6, -82, 25, 116, 145, 85, -17, 207, -103, -68, 5, -92, 6, -170, 194, 51, -259, -98, 99, 113, -189, 166, 32, -75, 52, 81, -301, -59, 60, 165, 7, -42, 12, -17, -179, -57, 256, 73, 104, -68, -38, 4, -55, -185, -32, -77, -3, 123, 196, -352]
1084c52L04J55p3m7P4j56L17k53k74J43r5M15k46P8p6J9l13P37k89l27K84Q6J02
1107B13l41o8J80j01O11p50j25M16k4Q8n0J40j73L6j30M5j4k10M0J54j9J2J86
1130A16O9k43j31J65J84j13K8N6k94J7K5L37j64r1K26l3k49M6J78l06K11M1k66
1153a91K38j89R7N3R8k08j87M31k93R5j8K50k72r9l4M91k74k51M85j53Q3k09J78
1176A21O1j08k88J13j2K70k07K46j2l13J75J50k56LK1J89k94q7N37l56m6p4J68
1199Aq6J25J19k18j66L91j78m23P06k52k28L67l19J83k5M4j13j15K46j68l0L5
1221a04K05r7K26k60l1n5J72Q3j28J07J95n68J78L1K11j30k0p1N5J04k31L03l29
1244a54j7K02J80m06N30j82k55K8K0k7K11J22m27J98p9K09j08j45K52j09N4J52
$$ y = [-352, -48, 107, 34, -13, 61, -95, 222, -31, -305, -162, -257, 158, -88, -10, -86, -67, -380, 357, 68, -259, 25, 111, 213, -128, -196, -16, -117, 494, -256, -381, 35, 11, 99, 49, 189, 16, 52, -78, -33, -47, -257, -217, -63, -82, -70, 116, 185, -58, -189, -24, 160, 47, 75, 131, -163, -146, -121, 216, 52, -39, 187, 154, -95, -49, 129, -177, 34, 75, -191, 47, -142, -45, 8, 106, -102, -289, 142, -151, -56, -74, 176, -96, -195, -229, 262, -12, -263, 222, 69, 152, -57, 121, 182, 74, -214, -101, -113, 157, -50, 196, 184, -129, 46, 196, -60, -57, -36, 153, -141, -228, 309, -47, -93, -167, 1, -85, 40, 159, -59, -225, 166, -12, -435, 271, 19, -209, 158, -161, 22, -3, 41, -72, -187, 59, -109, -139, -104, 101, 4, 230, -30, -61, -116, 56, 139, 11, 118, 313, -255, -77, -46, 165, 35, 15, -56, -1, 103, -128, 175, -154, -171, 31, 211, -195, 335, 153, -102, -74, -54, -81, 130, 252, -175, 23, -56, 153, 45, -100, 152, 43, 97, 249]
1266B49nj85k6l36L30k31J23K36j31pP0N5j42k98j69N95j02l35L28O2l44J15j41
1289b89q6J93K18Q9P0l27K25j0k14J09J81k86L24j92L2Q4k49k00O30l21M5J28
1311A54k32K73j64m5Q6j46j58K34O9Qj75j53J70L39r6k04L70n47J64k3K59l84
1333b01M26j54o6RP2j69JM03l12j14J79j85m7M6j07J30N75o38R7o5K14l90P2K03
1357b1p3R0j80L21j85jN6m3o3k8K44j45m6J77K70k21j55j5r1J63O3k05j01J06
1381h3J57r8M0m8R4j60L09l02K06j21K65k62L6J06j31L3J01k31P3J92l81M40n9
1404A76k74K95k10n4J24k96K24j02N3n3q5m9K23q8J85L2r7J52o1k27L89n0m97
1427b90M30j02L7j49N2R7K58m35J22J29j09Jk10M33l70R9m4J15q9J71k03K07k47
$$ y = [249, 244, 59, 33, -303, 27, -204, -81, 155, 24, 17, 87, 142, 0, -298, -467, 128, 26, -309, 19, 81, -263, -148, -289, -375, -182, 36, 125, 195, -132, 93, 83, -131, -22, 159, -127, 197, 5, 37, 121, -128, -328, 302, -19, 26, 154, -78, 195, 31, -14, 72, -74, -232, 2, 71, 79, -96, -249, -79, 260, 164, -40, 330, -217, -53, -76, 183, -201, 225, 71, 5, 14, 86, -83, -82, 321, 9, -105, 74, -111, -158, -112, -219, -89, 486, -152, -55, -120, 94, -296, -224, -21, -94, -4, -184, 137, -48, -49, 7, -36, -99, -127, 117, -28, -74, 103, 373, 152, -3, -18, -109, 54, 117, -88, -189, -83, 74, -24, 16, -32, 62, -98, 211, -91, 115, -6, 259, -3, 33, 139, 8, 41, 142, -89, -16, 176, -205, 235, 176, -98, 197, -13, -67, 57, -239, -15, -117, -64, -117, -202, -251, -28, -116, 69, 101, 4, 156, 95, -132, 257, 207, -290, 140, 38, 75, -74, -22, 75, 333, -102, 20, 149, 40, 41, -169, 264, -106, -7, -51, 64, -25, 146, -57, 150, -97]
1450i7P0J7k6j31k1L1P9O6L1K65o36J61K22q1j7J53j7j16J19p4J50l05r5L07J86
1475B41k63J68J8m8J07j84K8j44lj57J78J05J20L1r6PL25k33j31j11J63j89j95
1498b63K90r5J56q2J62l5k7p8j39K46k28J47l48K45O1J88k00j7Nj27J37k2k2O
1522d0K06K01j29k97L96j22k02J56ll61K71k57J97J66k48N9q3L2J55k21N3j30
1544b01K15M2J19l34J08N5L43l70m1l3K98k71k1LP2K82k63ll0K6j30J66J11q9
1568E4Q0j76K2J90k47M2k17K62M4j15J98p1J03k76J28Lj02J09j24j9N8J10n2J41
1592A45q8R3k85J7k4L37l11L9J78k4o5k74J99k8K2K66l03K36J10k76j79M53k95
1615e7M8K68m1l54m6J43r1P4j68Q9k02O67k75r3J22k10K81j13oO6k04P3K03k58
$$ y = [-97, -27, -10, -36, -167, -188, -157, -78, -12, 19, 284, -352, -191, 31, -50, -67, 86, 69, -47, 72, -2, 148, -157, -252, 55, 241, -22, 146, 164, 116, 223, 39, 67, -77, -80, -237, -59, 46, 166, 197, 101, 108, 433, 200, 69, -42, 121, -68, -263, 27, -68, 88, 6, 168, 133, 106, 28, -111, 135, -93, 54, -294, -49, 12, 200, 0, -17, -12, -139, -2, -24, -46, -40, 166, 367, 238, -59, 337, 215, 13, 169, 166, -195, 76, -181, 16, 182, -66, -7, -90, -58, 97, -124, -71, -201, 14, 56, 175, -159, -51, 4, 347, -23, -64, -97, 201, -70, -91, -88, -16, 266, 3, 0, -30, -4, -134, 32, 143, 54, 134, -42, -20, 170, -77, -35, -252, 10, 54, -61, 137, 66, 169, -107, 21, 24, -78, 31, -93, -112, -54, 56, 4, 145, 57, 150, -135, -118, -142, 195, -116, -77, 101, 77, 12, -262, -63, -91, -69, 197, -106, 130, 240, -36, -215, 238, -57, -9, 259, 218, -136, -182, -39, -130, -56, -224, -135, -337, 330, 55, -38, 84, -126, 155, 42, 36, 102, -102, -29, 174, -84]
1639h4N4P7j59J27j64O4K49m88K86L39n8k49o1N06n75M5R4L79k30p1lj81J3j11
1663b01kR7O9O6m3o5m9j6J8R1j44K24j17m9K00l13K44n6J2Lk07L06m3K12m94J88
1689f9l5J29l8J75k66J22J9J56l02P3k22J12J89q8Q4N2j57r6N2J59M6m48J61P8
1713a14J91J47j50j42J13o2k62K57K63l64L6K77k94K70j84r5J41j62l61L63J60
1734B8j5m1j40N26j52k86L69k82o2J55k20n1j10J19l9L15j60o6Mk1Q1k1K12k80
1758a37J58J16r6j9q5n2l3N84m94m6K84j90j5J77K0k60J59j05lk61K51K67l50
1781a30K95n6k08M18m34J72K98m98Q4k1K11m00L39N1k38J75k13q7J76%P0j27Q0
1804d3K00j67j42K13J08j88L99k07Q1o52L91L91l96r3j37L43k82n9J54L47r0Q
$$ y = [-84, -30, 47, -112, 15, -149, -85, 164, -324, -38, 301, 243, -6, -67, 439, -136, -91, 3, 382, 152, 81, 78, -103, -90, -201, -203, -106, -37, 29, -14, -79, -128, -144, -126, -35, -179, 45, -72, -121, 79, -234, 10, -46, -34, -31, -238, 68, 25, 237, -257, -69, -104, 25, -13, 162, -104, 18, 37, 193, -109, -36, -258, -146, 43, -45, 39, 91, -66, -162, -110, 49, 95, -353, -192, -114, 77, 224, 74, -68, 45, -17, -279, -22, 241, -123, -87, 190, -104, 166, -18, -113, 28, -134, -495, -132, 28, 13, -28, -168, 358, 206, -80, 289, 7, -55, 100, -120, -171, -281, -162, -201, 114, -46, -112, -108, -129, -48, -69, 143, -137, 21, 137, 41, 22, -63, -115, -148, 436, -58, -104, 180, -10, -25, 152, 172, -88, 71, -34, -37, -298, -47, 220, -130, 165, 109, -99, 319, -115, 57, 355, -143, -59, -80, 131, -269, 70, 121, -117, 58, -155, -242, -66, -66, 4, -123, -43, 157, -10, -152, 61, 169, -19, 380, 173, 254, -398, -7, 384, -12, -105, -242, 101, -181, -240, -86, 261, 171, 179]
1826A79k55J4n3q0Kn0K11K30k57j08oK39j25M25k91p1k2N8N4j58r3K71k42J92
1850F4o0N3j31J4K25j83J66k2m2J05q5l86K83K15k34K35j32l12K3K29k17N46k96
1873E8J23m4k98J98k26J26Mj89L17J8k15K74j82K42j45q2o3N1J04J0j47J38M1
1896A13K70m00M3o7R4m8j25R2r8o4M45j8j63Nl48L36O7L7J13l83K00k24J98NJ69
1921B49l75L2Q6K21k16j8L5J9l56L58j38J92k57K35L5l35J68o1J44j12Q7J00j61
1944f8j25L62l81K67J97j68j18K7k9j09J84j4n2R4l4j40L49m54Q4J17j01J2L38
1967B38l81Q9R9j2l81N92n23J60K21q1J21l74J46K80l11j7j69k1J61L48k42J56
1989I9l16L28J71m77K05M6N0k66L42n87L08Q7J83r6p3j40o5K22J1l16K78J65J9
$$ y = [179, -76, -62, -115, -195, -193, -243, -32, 198, -59, -167, -173, 66, -59, 366, 75, 4, -18, 40, 94, -64, -157, 114, -128, 64, 4, 57, -74, -60, 165, -18, 148, 126, 84, 189, 104, -282, 1, 216, -18, 217, 85, -227, -204, 25, -192, 354, 58, 181, 137, -161, 37, -189, -63, -59, -248, 69, 87, -128, 146, -36, 206, 61, -21, -84, -33, 71, 81, -66, 72, 113, 383, -17, 26, -41, 53, 5, -120, -28, -126, -190, 255, 237, 74, 79, -269, 67, 134, 171, 284, -99, 101, -123, 75, 80, 249, -126, -94, -8, 213, -3, -21, 14, 33, -323, 35, -103, 89, -168, 67, 102, -233, -65, -126, 18, -94, -7, 93, -68, -193, 169, -212, 55, 252, 84, -34, -7, -36, -145, 39, 25, -27, 67, 33, -107, 242, -212, -128, -11, -112, -100, 238, -143, -54, 45, 33, -348, 244, -279, -119, 102, 21, 142, -232, -86, 194, -117, -134, -303, -324, -163, 185, -57, 99, -217, 111, 282, -195, 10, 56, 106, -160, 182, -405, -97, -10, 173, 77, 4, -136, -201, 21, 32, -284, -6, 159, 178]
2012A78k73K25k17j37K97l64K58rk5L90l10J9J91j16L9j67K74r3q6L18l68k3j93
2035a92J63M6l4m0q5J66J86m1m18L02j19j20k7L12o7J05N8l96L40N2k4n5r5j32
2059a15j09K08j94L81k12m54L02J54p8L33j39k66O8K68L8k72Q3O5j0J56k23l1
2081d7M0L9J19n7Jk17K09k1j86K67L7K4k46K54j63l2n6j14J69m57R0K03J10J13
2105G9P5L7j24k86K34j54L63j26l77P4J20r3N26m78k41O17o79L66k0Q5m8Nkm9
2129i6K70l3Ml49M52m41J17L2k5j2J6J46K35k64k98J57J04j62K71q1j15O6J6J40
2153A50n6J65k10K36k90r4K61l97K07j86N4M9L75k80q0J46k41J5J71l18M34j61
2175e0J00m4l0j42N20n11M66k97j66M10l83k14L28J99J97n17J49N2kL1q5m7J6
$$ y = [178, -95, 130, -87, -224, 73, -291, -33, -42, -67, 323, 13, 32, 223, 107, 146, -21, 253, 160, 74, 392, 24, 1, -192, -29, 17, -17, -57, -142, 24, 210, 169, -249, 53, -66, -186, -213, 99, 32, 137, 195, -201, 139, 191, 167, 112, 17, -115, -224, -16, -210, 171, -41, -495, -193, -39, -117, 216, 77, -189, -121, 147, 185, -87, -4, 61, 51, 207, -16, -47, -7, 32, 151, 94, 95, -122, 87, 66, -120, 147, 184, 208, -38, 216, 53, 21, -35, -149, 20, -437, -347, -144, -34, 79, 154, 191, 67, -219, 15, -139, 224, 98, -279, -205, -85, -178, 348, -130, -371, 246, -433, -67, -87, -2, -50, -45, -47, -96, 174, 141, 145, -204, 248, -193, -76, -44, -69, -81, -65, 81, 316, 52, -246, -89, 15, -147, 124, 43, -72, -6, 10, 150, 94, 259, 49, 285, -5, -99, 162, -235, -28, -214, -160, -111, 264, -16, -96, 50, -191, -176, -5, -323, 111, -50, 50, 6, -24, -166, 354, -157, 309, 12, -154, 256, -127, -341, -13, 186, 383, -134, 15, 67, 65, 96, 11, -36, -20]
2198b0lnl4J20j86O4J17l3j16P0J94lO8l93L04r0rj48J53Lp9p5l5RJ08L3L2K88
2226C34m52L50k91J69j22J01P2L2j87L75k71j63O2J10jo3j55O1K2P6j0j05Q7j32
2250a01o4K61j50m5K35o7k68Q5K17l0m9k43M41l03K07k47L79j98k4K0Ql22K59
2273AQ1k5J21k31K59k37K24k33k33L57l73M75o41M42j97J01J10j96J24n1K84n8
2295A04l74J47K14j90L4M6k6K19j63j51M2j30K30j04K43o5O9j92R6k35q1K3J67
2318g7l0J47O2l95K18q4K25Lo6j85J84J95j64q1n0J22m7P4n42M25p4J99j32M30
2342C57m97K75J2k42K35o0j13Q8r9j99K50j61J80J64k33O1J42n6J9j02p2K2J22
2365I3m0M9k90L83M5j92j19J68m00M78j82n9m8K24n4P3q7j51O6J32j34JJ41L7
$$ y = [-20, -23, -28, -62, 58, -128, -64, 53, 20, -96, -26, 168, 165, 233, -160, 144, 54, 45, -103, 50, 53, -26, -101, -136, -127, -19, 14, 46, 334, -118, 232, -59, 110, -12, 89, 161, 193, 6, 381, 110, -53, 9, 119, 118, 55, -100, -39, -17, 59, 49, -56, 31, -101, -165, 96, -54, -99, 136, 69, -199, -114, 103, 73, 24, -219, 222, -81, 126, -121, 258, 60, 36, 56, 64, -258, 1, 82, 57, 178, -53, 206, -31, 193, -40, -273, 84, -289, 186, -455, -13, -210, -109, 1, -195, -71, -122, 162, 104, -270, -123, 91, -99, -65, -19, -45, 174, 11, -140, -98, -228, 2, -102, 141, 76, 145, -47, 49, -186, -267, -244, -77, -107, 40, 102, -293, -75, -159, 66, 69, 3, -182, 2, 197, 33, -48, -98, 24, -23, 51, -491, -66, -140, 59, -73, 357, -140, 135, 147, -95, 140, 80, -33, 55, -44, -243, 7, -154, 26, 190, -43, 18, 160, 104, 123, 21, -51, -29, 93, 53, 102, -188, 195, 240, 48, -71, 97, -303, 175, -7, -66, -114, 110, 56, 129, 42, -109, -43, 89, -45, -44, 97, 134]
2389A34R5n4j35k24J65o8J53P4k58K27j67o6QR0l07J75K74K9J8j28J55n4j00r6
2413f0r1J47k44L79m2n6p2J9L2M1k2l3P5L5NJ14k91j62P7P6j6J73k3J23q1l7k64
2440a98J97O8J6j14j2O3J06q2K5q7k86O35l64k2K85l31n7J3L20l55K70r6K0J89
2464B03j03J92j32j09j0k86K09l9L00j78k43L77j34n7j0j48q5J85L3K19k13L69
2486C40l50J63l06L18k91J83LK4J0m1K27j59j89L9J41m4N1j00R7m05J16J45RJ35
2510A16j51j62N14m00K93l63J12q4J65N7j61r8K75LM3k77L19m68K56O6p1j40K56
2533A00j49q0j08LL49J73n70N00j02k92L31mp2oJ42k90L42m50O98l90K52j49l29
2556a01K34j23j28K19o3k85K15M8K10L6m43L69N0j95k25J34J41j87L98l40P1K53
$$ y = [134, 229, 175, 40, -184, -19, -87, 66, 140, -118, 109, -58, -124, -116, -26, -333, -158, 116, 145, 163, 35, 190, 136, 36, -60, -151, -4, -248, 131, 89, 33, -39, -20, 12, 53, 31, -2, 73, 108, 113, 227, -64, -226, -149, -73, -89, 84, 61, 184, 103, 66, -198, -1, 67, 83, -31, -43, 20, 126, 44, 69, -18, -304, 331, -33, -55, 230, -101, -158, -145, 175, -180, 90, -6, 14, 203, 100, 292, 160, 51, 41, -245, -36, -75, 225, 47, -196, 181, 47, -10, -20, -168, -253, -68, -35, 184, -29, 340, -10, 153, -153, 165, -126, 57, 60, 84, 94, 53, 280, 121, -68, -29, 112, 68, 119, 19, 116, -289, -173, -28, -19, 116, -35, -197, 317, -83, 210, -153, -41, -125, 40, 97, -64, -162, 113, 116, 159, -118, 201, -267, -11, 55, -16, -156, 100, -49, -129, -237, -234, 115, 288, -282, 218, 116, -176, 155, 151, 79, 73, 215, -75, 267, -183, 515, 125, 377, 228, -101, 133, 10, -118, 101, 38, -247, -32, 16, 226, 262, -181, 188, 238, 43, -182, -48, 93, -94, 304, -36, 35, 288]
2578B88n23R6K2J43k7J15J44o31M15n6n4J68r5K2l7J76O8k51k15O15l92m22J57
2601b74K8K99l85L74Q8J58j05J25l51L32k94l14M33j22j6j83K40k24J53L0mQ5
2623G3j03k4j5L23j30n4ol08j53L19J34j41J8J49%J65j64k5j04K93l12n5J03j65
2647a82O7P5L1J17k69L75l7lp2j33j26Q7K7O9k40J99j6Rq7M70l66K15j38k89J60
2672e7m3k9j32L63l62M9L79l19K05J68m92K37L3NN7n4j58M4j25k8L08lN3k43q6
2697b30M41k12L16j59k12N3P0j12K10j45k9r0M9J11l0j89K13Q9l12L0J99l72J62
2720a49J62K19j47j14J77R7l85K17j48NL49l87K04o8k58K47J81m75K50q3O3r4
2742a37j0N1j44J76l5M6MK4O9j61J61J38m4k53J7L17j48M41n20K39rk70L02k39
$$ y = [288, -235, -139, -117, 26, -1, 114, 258, -373, 42, -14, -68, 100, 5, 27, -10, 166, 234, -17, -232, 383, -9, -431, -274, -246, 53, -332, 42, 130, 288, 183, 308, -43, 289, -5, -319, 114, -8, -24, -207, 33, -191, -38, -8, -12, 73, -30, -54, -69, 254, 124, 70, 64, -244, -397, -78, 56, -85, -67, 82, 82, 247, 83, 58, -46, 247, -65, -120, -17, -182, -115, -40, -9, 108, -161, 214, 177, 174, 102, -31, -157, -70, -43, 26, -214, -15, -31, -22, -109, 361, -5, 210, 72, -217, -57, -100, -129, -261, 102, -260, -211, 168, -151, 54, 222, -270, -33, 0, 5, 62, 8, -150, -106, -231, -259, 49, 46, 99, -144, -230, 211, -1, 315, 156, -56, -3, 67, -45, 165, 20, -9, -99, -50, 61, 31, -158, 55, 144, -168, -138, 61, -311, -149, 13, 232, 85, -29, 148, 245, -140, 77, -71, -66, 283, -104, 100, 32, -226, 21, 202, -273, -23, -106, -43, -137, -147, -96, -240, -64, -99, -53, -49, -25, 44, -117, 44, 182, 138, -115, -98, 219, 71, 512, -8, 231, 222, -48, 254, 15]
2766A5M50l42j22p9o6j58M07j05k5J95j66k98M08J9k99K38j78L57l41R6j71M4
2788a21J47R3J63l00r2j55L60j14L02m01J42k32PK31K52j37Rj58j88K28j60P0
2810e4q5K57l6o5k86M41r9ko7j21l3jJ96L79m86M3Q7j24K64j42P6k76p5K74J02
2835A67j97Q9J85j05k38NJ34K1k89K77K05j11k48L9J9P3q3K3L5k21O68m34j6K1
2859A9P0k75J65J35p4j25M48o8R5j41k51l4J7j65J92L29l42n3j12L35j96J12q1
2882@J02K7l52J67o5L34m0J49j3m06L09k75K49Q0m29K19j35L33l16J14j94K54
2904A12o0Qj18J84r2l1j02K47k10J42j12P1M4k97K95n6l80M07j86J64k23K95o2
2927D0K30k34j90L71j16k72J79j4N6P4k35J0L38o79O24n25N13j94K51j86k82N75
$$ y = [15, 465, 123, 1, -78, -144, -302, 105, 0, -25, 170, 4, -294, 114, 133, -166, 72, -106, 251, -90, 6, -165, -121, 26, 119, 282, -18, -110, -265, 95, -19, 283, -118, 24, -208, -201, 30, 282, 145, 154, -4, -192, 36, -124, -54, -139, 118, 82, 17, -269, 172, 73, 71, 4, -117, -150, -151, 45, 424, -62, -19, 68, -56, 208, 66, 142, -134, -209, 65, 167, -30, 59, 244, 139, -99, -94, 40, 61, -228, 49, 254, 143, -105, -66, -47, 26, -57, -34, 1, -220, 448, 14, -2, 19, 89, -186, -21, 114, 40, -85, 363, 295, 390, 249, -2, -36, -19, -184, 8, 337, -5, -58, -170, 165, -31, 81, 0, 102, 129, -223, -56, -121, 213, 173, 322, 309, -97, 212, -63, 186, 266, -163, 56, -79, 254, -62, 52, -142, 112, 52, 60, -58, 126, 34, 3, -99, 148, -62, 80, -32, 39, 83, -214, 81, 25, -355, 52, -134, 30, -193, 102, 40, 270, 36, -154, 217, 101, -171, 8, -6, 50, 124, -111, -101, 237, -442, 182, -343, 170, -24, 227, 41, -241, 334]
2949C34k6j76j57J33r5q5L6O9m0M1l8rm94K83L83j75J91n3k63J54qj1J06k29M17
2974B88l38r3L80k08O8k41L70k56l9O2m46K96J28j49M51j15j87J67j88j86J63
2995g3J05J49m04L14m02J15L16k11o5J21j97K53j53J09K07L7o5j6j52q4M9J2l6
3018g1P4Q0k62K50R2j93R3k01J19p0J77l24M76l20M22j68m50K32j85N59l71k2
3040f3M7p5K8Q5K5k48L56j80O4m29M54m55M00j88J54j0J83j07m51M59L0l1j52
3063a04K6j14J26j63K94l69K81K74j01p7J20j37l25L08l4J00m00L36k25K13j21
3084i2O5o9J32J61j67L2j51K49j43k28K25K60l91P2j22M0p4j54M35j2r3L4J84
3107A93k51R2l34J72O9j05J10rJ59k81J35J23J02k20J57l1J69l77J84J18k03O9
$$ y = [334, 308, 132, -25, 108, 13, -72, -36, 33, -7, 34, -4, -13, -507, -224, 159, -16, 175, 122, -141, 13, 5, -6, 100, -129, 288, -50, -143, 237, 29, 97, -144, 226, -30, -69, -7, -453, -157, -29, -178, 273, 158, -29, 138, -50, -236, -73, 32, 181, -223, 91, -311, -196, 120, -91, -156, -35, -232, 21, -132, -23, 184, 221, 156, 140, -12, -96, -47, -35, -71, 3, 83, -179, 71, 163, -30, 63, -138, -19, -89, 88, -236, 240, -80, 342, 174, -276, -44, -229, 330, -41, -63, -16, -91, -63, 22, 47, -201, 155, -25, 39, -390, 64, -391, 9, -179, -25, -35, 148, 41, -410, 49, 79, 48, -104, -78, -192, -66, -229, 65, -304, -23, 251, 150, 73, 193, 56, -269, 39, 5, 105, -295, 41, -184, 29, -92, -27, -96, 36, 197, 30, 62, -89, 160, 17, -211, 14, 274, -117, -45, -167, -127, -201, -355, 80, 68, -25, 9, 193, -58, 34, -300, -128, -59, -164, -54, -63, 96, -185, -50, 73, 175, -45, 112, 81, 250, -127, 57, 175, -28, 41]
3129D1o3J48j81L07l94N7J77j93L56l58K18o7p6P9K6j37j27O3J98j56R6j85L40
3152A69j00k13L35Ok81J44J26l6R0k55M6K03k75J60o4m9J9j43J69j42j35L40p4
3175D0j60M6J02k17J83Q9P2k61r2K21N3j84J41k09M04j98P3O8m95L31L13k37l7
3198D6j1k65n7L51M1j51k24K04j3K72l05J12J68l15J53P9Q6n55M03k17L12n6r0
3221c2j05R5j9lk26J47r0L13r4l5K03k63J34N8k25M55l46l2R6n3J33Q6Q7l79k3
3246a18L14k86K16o6J16M2j31j04J44J04lj16j6M0j97K95k01L5l07K66j50l2M30
3269B75m48J93Kj47K05l72K68J23n3J92m31J65j66J60J26j68K09l9l7J23k94p7
3291a91L79J32j09o7j77J34L2r3Q4N0K6k12R6K5M5l33M34k66J0N1rj16J97K31
$$ y = [41, -22, 126, -55, 252, -142, -85, 92, -101, 255, -103, 115, 48, -28, 51, 77, -60, -187, -124, 74, -82, 14, -171, 169, 69, -144, 191, 197, -84, 60, 186, 150, 240, -15, 31, 234, -41, 119, 55, 6, 25, -118, 51, -91, -226, 114, 40, -120, -74, 28, -189, -6, 83, 155, -106, -198, 23, 76, -108, 33, -176, 228, 30, 103, 171, -324, 7, 320, 83, 46, 35, -230, -287, 64, 105, -46, -270, -66, -79, 193, -112, 0, 168, -147, 6, 85, 171, -384, 19, -198, 114, 58, -32, -137, -42, -61, -64, -290, -143, -233, 80, -14, -49, 154, -109, 25, 83, -142, 313, -33, -65, 31, -22, 111, 197, 284, -95, -118, 196, -90, 126, 60, 176, 218, 87, -17, 127, 231, 228, 112, 96, 136, -61, 234, 33, 68, -239, 27, -123, -155, 275, -173, 20, 22, -125, 80, -292, -24, 99, 46, 238, -193, -28, -194, -34, 92, -76, 133, 94, 57, 180, -114, -191, 188, 320, 211, 144, -33, 101, 133, 40, 124, 174, 200, -12, 84, 109, 154, -179, 255, -11, -1, 50, 41, -75, 122, 353]
3315C53l81j36n2L68j23J8k79M5L23k2l28J49j50K28k9K12k01P3j8K96n18Q2K59
3338A69R8k03J25K4k7l32M1K6N4J15K1l00O7J36j6J02j21R1J52r9k54J85k68J11
3362a03J74j20M16l72j67L95n5j86l33K93m9J62j8p1O5J41k13R9j38K89n73M12
3384D8l11Q4J48K8j21M12n52K03j19P9J03n3J65L9j79P2j78N8Q4L5j43n3L91j86
3408E4j96J49P8p9l17L62k88M1jJ28k49L21j86m6K47o9L10j62q8k02L78m86O2
3431b39L50j38j37L13N1rk36j2M6k01K97K60m54j89N80k15Q0L0m6k28P7J56j54
3454a8J19J2R5m44K96L3l3K13j28l1K3j38J24m6K56n61J72n0J54j72K81m26K91
3477B2%k1O0O8j81l13M74r7R3j37M4P2k7k26J89k57K76k07L47q3n0J72j31n5K5
$$ y = [353, -28, -164, -216, 152, 29, 47, -232, -187, 136, 114, -214, -65, -215, 13, -16, 196, -5, 68, 50, 346, -172, -90, 169, 267, 64, 189, 213, 186, -146, -105, -79, -25, 90, 111, -189, -122, 14, -2, 100, -21, 70, 222, 123, -131, 54, -214, -103, 71, -49, 367, -5, -172, 223, 168, -18, -351, -58, -107, 55, 37, -34, 31, 172, -41, 58, -80, 209, -364, 48, -263, -179, -31, -3, -124, 288, -264, -61, -180, -101, 2, -51, 114, 153, -26, 46, -132, -74, 10, 45, -98, -151, 240, 54, -142, 7, 85, 6, -311, 51, -237, -196, -197, -69, -318, 3, -183, -229, 18, -51, 259, 97, 9, -193, 185, -301, -239, 111, -27, -164, 149, 200, 191, -45, -57, -11, -212, 85, 345, -109, -298, 282, 67, 147, 177, 131, -97, -20, 136, -18, 101, 113, 208, -236, 60, 93, 60, 273, 145, 114, 137, -1, 123, 77, 333, -228, -56, -106, 48, -124, 157, -269, 22, 22, 1, 61, 129, -52, -365, 109, 12, 105, -32, 12, 84, 57, -169, 20, -237, 39, -168, 179, 96, 46, 218, 87, 32, 57]
3502E7n8K75l41Q6j12O48n08J14j24J07k14J96r8M1j32J1O7J16k46pk5J52J04
3525A09p3K32j41k20JM60k90j0k20n8L46j59j98K74J84k25K58l55J44j75L05j08
3547H1J38j63r7R4k27L45K9q8m0k92K88q4j71J75J4J50p0P4o0Q8k91p9L4J06R5
3572D9r5P1o9k18M50k68J39k10L5M7l3o4K46k16J24j28J57j52L05k38J52l50J51
3595a15j07n5L07L4j54k4L85l50J21R6j97q7m2R1j39K71l5N5J16K21m42L02l03
3618e1K06r2j48J21m8m8K6J04p1rj2p5R7M23p08M65k79j45J79J36j25K7K60l49
3642a16M79k35P2j38rk12J79P7m7R6n9j66K15m06L86k01l8N2M8N5J6K14k71J56
3666A47k56K24k6Q0j33J20n93L73K25j20Mj24j0K13l26n1J73J51ll24K59j48j9
$$ y = [57, -1, 274, -67, 19, -93, 555, 47, 161, 37, 144, -70, 126, 28, 69, -63, -52, 15, 131, -115, -122, -147, 5, 109, 36, 268, 127, -93, -92, 368, 78, 68, -152, -210, 136, -23, -221, 53, 237, 12, 270, -85, 59, -116, 189, 81, 219, 56, -41, 53, -174, 171, 200, 112, 72, -220, 68, -16, -187, -12, 2, 152, 82, 156, 96, 184, -107, -186, -152, -46, 49, -46, 25, -44, -262, 188, -80, 59, -151, -116, -69, -102, -166, 80, -136, -12, -140, 17, -135, 170, -68, 84, -266, -115, -222, -277, 30, 64, -90, -114, 271, -79, 42, 138, -59, -146, -188, -97, -236, 35, 0, 55, 171, 392, -50, 252, -51, 155, 63, -85, 36, -12, -60, -34, 70, -1, -10, -22, -97, 0, 423, -285, 180, -99, -244, -65, 71, -54, -27, 233, -116, 363, 128, 200, 62, 53, -159, 20, 97, 50, 146, 87, -79, 136, -270, 116, -85, -123, -71, -23, 32, 48, 262, -9, 147, -109, 115, 89, 169, 36, 156, -437, -64, 161, 41, 45, -79, -89, 124, -202, -253, -80, 71, 68, -256, 3, -145, -164]
3689a64J60mJ23j84J88j88J06o0L5nj02K02k59L69n0l56K97j61J4K34k5k47J74
3712I7N8J16m51o0K87k42J06L0l8j63N48m05K03Q1j12k66L17k23k4L19k65K14
3734A27p1J65k09j49J41K97k06l40K17O6J54j09L03l36l8M3k2l76L57O3j03p1
3756i7J34O5m0j35k5K26p1k0l5j00J11k5p2r1K98l35O5J44K84j68o9J54K4k24
3780bj8N8Q4l1K4n7j4k9j28J2K11k25L66k61k15M48j08P6l46pJ94j05k6j97L76
3805H0k07L09l67L0L48l01M9kJ11j51J91k80L7J60j62M77q9l31M20l55rM9L2k29
3829a90J85k89L90K60k43l28N15k67k27O08l93q9n5O2J42K37j21m26J80J19l2
3850C8j16L11l39O9j36K68M9k28J62Q7k11J67l25K15l3J05o7p4J78j41K26q4M2
$$ y = [-164, -4, -8, 115, -69, 119, -69, 37, -23, 12, 7, -95, 107, -152, 217, 167, -189, 108, -53, -39, 195, 170, -77, 97, 155, 271, -180, -240, 47, -195, -89, -59, -97, -260, 288, -117, 86, 167, 55, -211, 106, -117, -141, 178, -87, 127, 56, 221, 12, -137, 4, 301, 95, -245, -28, 38, 192, 83, 386, 50, 12, 55, 33, -343, 14, 77, -26, -97, 37, 102, 62, -73, -98, 128, 57, 37, 2, -98, 13, -12, -84, -175, 123, -212, -147, -3, 281, 113, 44, 198, 222, -2, -20, 38, 122, 91, 115, 58, 44, 15, -113, -101, 110, -115, 251, -10, -225, 223, 115, 191, -155, -162, 32, -73, -99, -296, 80, -127, 182, -185, -155, 193, -108, -59, -61, 50, -101, 90, -190, -153, 7, -155, 322, 233, -98, 322, -33, -42, 7, 39, -190, -5, -294, 96, 356, 113, -215, 300, 33, -194, 414, 21, -68, -123, -61, 81, 318, 197, -229, -49, 70, 38, -78, 233, -106, -37, -173, 95, 144, -84, 78, 165, -46, 121, -204, 11, -22, 83, 16, -58, 120, -21, 205, 121, 163]
3873A63j78J21j10j0R5k18K11R7l46J33j41J49R5R0P5l87K91l64L80k80K04k43
3895a73J61J6k81K37p5J0L5j54K17K58n72L62n7PK30l22n3N7N9MJ15j30j75J91
3919c3q7N2K90j77K24k45o9R4j10M20n17L38j53r5J80J43m73J67p5j6p6K24l9
3942c3o1Q0RL76l92j22J0K78j31J28l18jj14J81j3J46k30K22J19m10J47J86j64
3965a07J84j79J59L2j47J03J7m52O94l89P3R6o3j85K02J03J9l21J77J66k75K11
3987A18r7q3L53j79J03r9K7j58j49L54k09n7K36l2k06J31n0k23O6p0L85k3l6k51
4011a49L87l33L2M5M1Q6J60k69K28k32j04k16M15R4q8K69m02oP3o5J20q2Rm6J58
4036A25j87L87k48j10o2Q5j70MN35l22J40k60m6K67r5q9K22l74Q7K92k59P4j19
$$ y = [163, -15, 106, -4, -14, 81, -137, 74, 171, -175, -42, -183, -34, 61, 151, 226, -161, 130, -234, 146, -134, 70, -173, -12, 4, -277, -40, -115, -105, -70, -224, -7, 251, -321, 41, -16, -9, 221, -101, -154, -97, -38, -34, 81, -49, -224, -33, -120, -68, 222, 45, 269, 24, -45, 49, -61, 359, -158, 180, 27, -68, 112, 255, -218, -51, -126, -142, -218, 6, -33, -94, -14, -5, 371, -21, -143, -133, 145, 14, 142, -176, -177, -291, -110, -123, 23, -207, 15, 134, -276, -129, 57, -107, 77, -102, 57, 89, -58, 45, 62, -390, 304, -85, -12, 84, 21, -164, 38, 141, 160, -161, 16, 182, -93, 118, 21, -62, 291, 112, 215, 116, 143, -15, -164, 190, -19, -76, 160, 128, -78, 53, 3, -220, -154, -224, 161, 138, 102, -149, 238, -95, -63, -18, 23, 109, 269, 0, 228, -4, -108, -324, 91, 185, 97, 366, -36, -42, 31, -34, 86, 4, 13, -33, 125, -62, 325, 77, -33, -95, -10, -180, -176, 359, 37, 177, -83, -129, 138, 43, -46, 176, -198, -111, 181, -78, -4, -123]
4059a23J12j9J5j71m2L02j11j3J5R0l2j05k14P17o49K11k4Q3oj16J52j44L76l19
4083a5J74k32k20K22J29j20K57k30J04j0m3J2J68j90o2j04J32K27j75o6K0j08
4105a30J11M31l06j43N0J7l7J24j10Nk4l12L27J3o5q4R8p1K5o2L9j00O49m69K86
4130B62l53K72j61j44J14o5k84J52J56L29K3j34o01N15k11L22J1n12K88k45L51
4151H5p0pN6J07k78j31L73l81K77L18k32l39K36ok32J38l3J13P7k73J80rj38J0
4175a59N13m21q2M4J43J07k46K25j75J42J27m71J70J39m20K71Kk26J11m9K70J6
4197C1j85J60j4L8k21K21k00L75k84J1N6J32N2J2K1k09P9j97k6jJ87j3j18j3J6
4222i0K90r4j83J90o9k51O8L21r3j75L7K64m33J63J4l31M45Qk56j09j09M84j84
$$ y = [-123, -11, -30, -15, -186, -228, 74, -37, -50, -35, 55, 23, -82, -296, 421, -228, -17, -41, 42, 36, -80, 72, -72, 304, -15, 159, -73, -293, -71, 58, -62, 195, -35, 69, 59, 16, 28, 196, 6, -56, -160, -28, 199, 24, -42, -22, -130, -19, 412, 106, -37, 13, 30, -7, 117, 7, 12, -12, -324, 3, 16, -49, -133, -35, -106, -81, -143, -104, -204, 445, -24, 262, -91, 181, 20, -124, -10, -75, -359, -207, -51, 278, 301, 167, -434, 81, -130, 192, 203, -309, -21, -266, 85, 15, 8, 64, 171, -107, -238, 135, -246, 31, 349, 117, -222, 14, 8, -224, -86, -119, -6, 71, -202, -22, -31, -169, -159, 354, -67, -149, -105, 38, 145, -101, 124, -51, 91, 218, -253, -83, 56, -364, -93, -91, -317, -206, -255, 15, 31, -154, 6, -8, 30, -191, 30, -170, 205, -79, -68, -12, 120, 172, 184, 205, -4, 75, -122, -148, -149, 38, 25, -93, -106, -90, 200, 106, -77, 113, 44, -207, -139, 182, 89, -86, -49, 215, -218, -55, -41, -372, 73, 81, -175, -284, -393, 91, -93]
4245i3L29m23J12m7J75k98L38J23kl28J33M7n6j39J94j62K88r2j43J33k40Q7O3
4268ap5q5L15l24L13j92m8k9On8j02L98J65m49J60j46K82o0o3K51n07L08j30L13
4292B42k68k37J2J37P4K16k59K33J7q6j73J21o1J1j95J70r0K19j49O4l0N7j7J9
4316B7j6l42M50k74J76NQN1k39J14m1J44q5r4J56J97j13k07n7K57k74M69j95j33
4340a6J46J55l2o36K80L59k60J80l66M0K46j02N3J56j17J5p2q9M07k76J52k99
4362g6M6j75J51mj67K91r7l2J04Q5k42k5P3P1j50K99m33K78l1p4P6J79l08K28
4386F7m0Ko8P9J7o5l9J29j15O3j60J7m8L1K53k63N4J96l7j79K72o5K3l4j40K34
4412A84n56M04L9p1k56J97M6K1L4q8q9J41P6j03nj6K04L3l17R4J54O0l2q7J54
$$ y = [-93, 236, -187, -75, -122, 53, -245, 93, 216, 214, -114, 19, 66, 10, -129, 65, -97, 191, 99, -44, 89, -151, -64, -1, -76, -161, 154, -170, 143, -49, -97, -126, -120, -178, -280, 118, 283, -166, -6, -152, 130, 70, 7, 258, -249, 59, -71, 242, -26, -263, -251, -114, -40, 176, -83, 150, 167, 81, -92, 29, -32, -21, -216, -46, -136, 83, -66, -2, -32, 25, 8, 27, 11, -331, 119, -155, 21, 26, 34, 85, -154, -40, -81, 63, -22, -116, 40, 237, 124, -83, -140, 117, -157, 312, 117, -16, 130, 285, 253, -383, -103, 256, -4, 176, -190, -150, 96, -6, 47, 203, 86, 101, 29, -60, 347, 71, 223, -76, -30, -205, -54, -58, -225, 66, -31, -63, 41, 126, -116, -141, -68, 3, -147, 152, -281, -3, -34, -108, -32, 147, -161, 67, 27, 29, -39, 40, 57, -8, -47, 82, -33, 30, -130, -113, -161, -130, 123, -140, -86, 110, 73, -106, 166, 101, 124, 90, -50, 184, -372, 32, 71, 0, -256, -59, -13, 8, 42, -46, -135, 6, 82, -21, -26, -42, 162, 195, -122, -28, 126, 186, 154, 67, 221]
4437B21l6J38o15J98J06j31K1K14k12K30l16r2J00J97r5O0J07l61J72M3r8qK79
4460A22j50o2Q5K72k82j28j9K16O7j32k19J67l9J95k46J89M9q7M1J60l00K09l08
4483b00O2M7K89l8j38j6K98n4j16j35K61q7k6k95K3J87k91mJ61J50k7j07L4K63
4507B41l57j85K08L05j36l0j11L49l57k28J73J0P8j25M65l36K12n6l11K90J10
4528B09Jj40r1Q0j33J25MK03k46j49ro4J11L7K19j11m0k12L3Q2R3M5o6j11kr5
4554b27K72Nj26K8N0l3l53P34n74J08K44k28P5J99k46J33j35j51p2L32j79J54
4576A0Mq6K44j80O9q6J3o8j23K34J78j28j30k4J80k56J12p4L22k20J28j45L81
4599C55n12M32j73k7Rj83K77l63J98K0J07J20m62L4L68m73K16n6K16m3l60J46
$$ y = [221, 185, 323, -292, -94, 12, -119, -98, 116, -96, 134, -182, -274, -174, 23, -72, -12, 95, -266, -94, -51, -149, -157, 122, -28, -90, -5, 267, -15, -143, -162, 54, 121, -11, -230, -63, -102, 93, -153, 36, 85, -2, 39, 199, -101, 108, -200, -138, -91, 198, 160, 22, 6, 304, 250, 134, -1, 260, 173, 147, -148, -125, 62, -229, -233, -72, 78, 51, -56, -22, 241, -116, -301, -93, 212, 76, 46, -65, 284, -73, -301, -128, -118, -40, -165, 300, -36, 176, 120, -191, 99, 209, 210, 70, -21, 59, -74, 51, 55, 258, 12, -137, -146, -210, -99, -62, 157, 46, 6, -206, -173, -91, 2, 47, -19, -130, -132, -227, 45, 50, -76, -48, 2, -31, -384, 350, -224, -116, 128, -100, -25, 174, -72, 61, -74, -225, -297, 35, -144, 10, 14, -72, 172, -8, 61, -25, -12, -80, -203, 31, 209, 81, -49, -73, 107, -149, -37, -111, 211, -9, 119, -26, 355, -157, 275, 102, 75, 84, -99, 178, -185, 13, 33, 140, 260, -202, -168, 200, -273, -57, -113, 103, 60, -300, -154]
4621a54K25j16J12N7l7o1j5j23P0M6l8M5m26M79J19k71K84q7L7k98M47m89L0L52
4645A88j55J06j00L3m06K47Q3N0pj51kl3P0P2K72m00K89p3O0Q8m14M51n10K47
4669Ej67M15l63J88j12K9P9j16K75k20l51M43j54o7J14J87p9l13L03k13j51J67
4691a01J39J2j29R6K33n25jL40k18J16K06l40M54k89m0K25l31K95k64J11L1j36
4713a16L2n8J21J19j55L0R1j31j63K36%j74J84j80L3L50j33J35l95Q0J27j57J97
4736G3j12Q9pj68PP7K33o7j54R1l7J18k47J43rj97r7R5J35J84k06J19M5m2k98
4761b32R5m0L6J28p1K77j12j6L6m6j96PN37m92j26J25J33J36k29Q3l90L79k06
4784a84K63n28M20J60j44J96l93J55m7P8j26n1K11K11m46N6KL27j23J10j28j77
$$ y = [-154, 71, -45, 67, 124, 87, 26, 11, -112, -42, 4, -34, 11, -415, 64, 183, -88, 196, 109, 146, -152, 295, -194, -164, 188, 33, 139, 39, 72, -334, -87, -4, 46, 39, -112, -114, -147, -77, -5, 267, -133, 156, 83, 143, 231, -183, 268, -242, 5, -162, 253, -110, 78, -34, -5, 74, -42, 233, 13, -338, 105, -49, -116, -2, 185, 106, -207, 96, -117, -268, -101, 38, 50, -79, 17, 250, -275, -276, 64, -154, -38, 168, -172, 282, -7, -47, 178, -153, 142, -122, -11, 20, -116, -84, -142, -21, 98, -57, -27, 64, -67, -230, 6, 6, -168, 16, -164, -131, 219, 86, 221, -174, -94, 33, -124, 73, -39, 50, 43, -125, -118, -41, 192, 125, -29, 62, 25, 143, -104, 39, 30, -167, -264, -169, -34, 150, -56, 63, 108, 66, -232, -137, -177, -141, -13, -84, 193, 81, 65, 101, 55, -141, -134, 403, -89, -215, -90, 43, 179, -50, 33, -357, 22, -184, 79, -449, -29, 131, -13, 183, -210, -55, -102, -24, -150, -201, 10, 221, -225, -169, -167, 160, 37, 147, 19, -158]
4806a58J2K94q0j30N7J59m24Q3O7P2J38J18k54J09J91m42K06L73m34L74m64K00
4828F7o2n6O8j97J56J73k99J81k6p7j6O1L93j35k37O1P3m01K06J5K80q8j34p4
4852f8K53k86J78K2l46J97r4j7R1K95k94M8n1j0kJ64K29l81L4k32M38l41L7j27
4876b63J64P7k71K82J10n8l09N22j77n9j70L48k65P5j6j66K46Q2O0m46J01J39
4898FQ2M9j67j73J73K09r5J9k32p5j6J91j32L02o04O06J53o03N53M8l14K93k71
4921BK5j09J68J03L3J21r2l24K54j1j82k28J99R8r1j22R6J45j88k0n8M10j40Q5
4945A74m8j28j67J70j25K06lM0p0Pm3R2L9k7m6k32O0K18k24Q5J31j39j07K18j89
4970a08o2J03K74l1o6r7l42J79K52l6k18r3L56k96l5J64J86j04q2J07j26K56k44
$$ y = [-158, -146, 148, 68, -62, -5, 154, -270, -187, -120, -48, 90, 208, -46, 63, 254, -188, 18, 391, -43, 331, -133, 67, 5, -51, 17, -180, -24, 149, -150, 31, 5, -72, -88, -27, 366, 231, -6, 55, 128, -273, -67, -52, 228, 140, 6, -68, 185, -101, 77, 99, -247, -50, -144, -161, -70, 225, -69, -21, -72, -82, -84, 80, 309, -72, -38, -270, 168, -173, -136, -263, -99, -22, -293, -11, 99, 41, -268, 254, 77, 18, -152, 196, -69, 6, -10, -176, 70, 152, 212, -234, -133, 6, 88, 137, -30, -203, -30, 179, 84, 103, -129, -204, -220, -29, -161, 141, -463, 143, 296, -307, 246, 294, -20, 273, 2, 27, -82, 86, 189, 222, 343, 251, -73, 181, 170, -12, -240, -41, 57, -34, -156, -60, 85, -103, -123, -181, 229, 89, 174, 126, -2, -169, 1, -124, 82, 79, 119, 49, 56, 13, 105, 144, 117, 71, -161, -101, 117, -107, -22, 109, -30, -137, 81, -108, -170, -67, 207, 176, 110, 13, -329, -150, 102, 66, -152, -245, 111, -185, -220, -56, 130, 26, -56, 51, -75, 181, -63]
4993f3K73k32k33K61l56N15r9j51kq7K55j42J14J10r7j12N8k83L75O1l3k88K85
5016A29j26l21j7N98k06O8m0l6l7r0p8K48j75K51k00j64n9J47k6J05N1J29k82
5039a31K4Q5K00k64M7K19l45j74L76J22n3J69m65K72J5j05K6j98K44j59J81K05
5061B91j83k09N7K22j53Pj03K7p5P8R5k3k7J7k79M60j63j83K89l61L70r1j8q1
5085c6k1l23M56K4j50j67L55j47K1M7n1K41l76J67j13O9O6K25l6m09qM46l77J31
5109C4J5p5J48j23J12j66j3j54K49k16K94j98J3J30j03K73K51n71P3k79J79K33
5131A06Pn6J01m03J66L21m01L37m07K14l2J06J84j95k71J34K74L8m19L45k97J06
5153d2n1J77J4l51l0m8K81O3N9N3J37n3j05j63L05K3k26j80j11L70K8r5J48k73
$$ y = [-63, 210, -22, -255, 6, -350, 165, 66, -85, -87, -174, 81, -61, 53, 163, 66, -46, 12, -271, 104, 165, 132, -156, 129, 3, -318, -335, 263, 57, 125, 85, 49, 12, -78, -156, 92, -83, 168, -32, -196, -255, -108, -134, -29, 22, 151, -131, -107, -22, 178, -86, -39, 180, -165, -339, 37, 159, 106, 275, -190, 82, 97, -8, 18, -180, 64, -95, 86, 291, 108, -101, -44, 178, 25, 32, -71, -44, -119, -41, 54, 31, 4, 21, -258, 202, 39, -144, 145, -216, 154, 63, 45, -36, -57, -380, 76, 100, -50, -217, 138, -9, 12, 59, 8, 249, -127, 40, -73, -4, 62, 287, 251, -158, -166, 280, -97, 34, 49, -26, 122, -1, 111, -55, -68, -222, 27, -189, 105, -93, -80, 50, -53, 220, 471, -100, -27, -306, -127, 106, 113, 57, 158, -245, -79, 242, -159, 178, -229, -15, -47, 59, 243, 48, -223, -89, 185, 223, -196, 149, -148, -42, -93, 84, 98, -253, -283, -331, -50, 13, 72, 125, 262, 209, 104, -59, 246, 269, 43, -137, -248, 122, 150, 55, 203, -70]
5177g0J3j99J85J31k95L21l08J67M85m30J16m44M43j46K06n7M1Qk67O5p2L40k33
5200@j74R0M31j06k41J60J13k30L0K21k72O7k6m53M58M7J14m44K60j26J00j48
5222a29P4J80q9M6R1j91J16R4j80j60J32k13K16n3J81k27L32j06n5j51m3l3R8
5245g0J67m3P7j26j74m8K08J35Q7j94l21M27j87J71n7p7L60m31R2j40J81K62l32
5268c3J95l34J81j64R4o7K34J56j16Jj60rJ40J45k83j50K95n0p6n6r8K07k17K93
5292A28l06J61K7k47M37l69K24K06l30j51K83n5L2J69k39rQ8l49K14N35l75j15
5314d1j3L34l26k73N28n90M02J0J24j39J35q2k30J79K79l21m07M35l1J29j57P9
5336B4j01J9P4J61l17Kj51M61n2o6j58p1l0J26M2j87L34N2j36l79J19N01m19J05
$$ y = [-70, -57, -256, -71, 60, -235, 86, -222, -55, 430, 0, 116, -328, 115, -31, 175, 118, 159, 167, -100, -35, -107, 233, 0, -174, -84, 347, 241, 0, 160, 273, 43, 73, 294, 22, 89, 63, -390, 68, 115, 229, -215, 45, -81, 19, -129, -55, 125, 36, 82, 173, -18, 98, 192, 12, -148, -16, -229, -13, -66, 115, -112, 220, 114, 59, -92, -135, -168, -70, 97, 54, 131, 5, -169, -217, -9, 126, 213, 19, -302, 125, -62, 109, 52, -25, 335, -96, -4, -144, 37, 299, -33, 162, -172, 9, -155, -61, -128, 106, 262, 146, 147, -13, -22, 118, 263, -20, -170, 125, 75, -1, -57, -155, 52, -165, 128, -178, -17, 10, -237, 200, -169, 55, 261, -69, -220, 63, 8, 40, 209, -30, -39, 49, -300, -86, 449, 74, -41, -54, 280, -46, -319, 209, -381, 21, 31, 155, 16, 151, 69, -161, 18, 297, -24, -431, 4, -27, 102, -55, 24, -77, -58, 16, 177, -140, -138, -289, 172, 120, 54, -104, -175, -205, -79, -37, -224, 110, 162, 26, -353, -234, 267, -152, -47]
5360d7j15K01j76K02Q3O7L4j64o7N1j60Q8J64l35K32k21J92o2p8K7q9K14J15j38
5384A8l02L45m9J16k81K22J39k54Q6Q8m81L36J02k50K96p0k5J12k21J18N0k56
5406a61J00K53k48J91lj15k30K9J56oj81L39J08k21k51K32m9P5j87J72q4K7K89
5429B35l46lO8J27j64N6J9o9L3l30L74j33K63l5r3k95L00K6j23K15l36K24j41
5452a28j26L96k37j02J49j10K21J8q1nJ8M6j33l1k10L69P6J65j37j29j43r4K53
5475D5J20j33k80L72O5k33j60K82M4PN0j54M6J0k3j07J08m9J97k75O8M4k58K29
5499A5p4k3J03n6Q1j56p9L08r5J93k34l63L97m3J24q1k41K32m7L1J29n4o0j46
5523a39p8K02j66M47k75p0K75k83Q5R0m1k08R3J24k53K69q8K57r7k96m0m9N41
$$ y = [-47, -162, 39, -137, 65, 148, 215, 249, 85, 18, 69, -91, -3, 161, -174, 58, -163, 29, -33, -111, -84, -173, 41, 156, 18, -284, 61, 12, 128, -153, 69, 208, -46, 40, 128, -353, -17, 85, -165, 131, 61, 36, 148, -73, 45, 95, -161, -61, 192, -56, 135, 132, 17, -213, -184, -28, -34, -215, 124, 232, 11, -240, -8, -57, 18, -169, 3, -81, -54, 235, -111, -114, -46, 81, -83, -27, -8, -77, -44, -374, 0, -133, 130, 95, 2, -293, 7, 33, -90, 125, -211, 13, -128, -254, 142, -95, -197, -48, -158, 63, 81, 0, -5, 13, 59, -74, -105, -315, 54, 130, 295, 158, 29, -114, -208, 45, 165, 32, -248, 124, 189, -44, -204, 78, 122, 129, 179, 25, 71, 81, 58, -49, 59, 10, 207, -68, 0, 44, -214, 15, -59, -82, 21, -35, 46, -110, -189, 119, 24, 217, -17, -380, 17, -26, 98, 17, -224, 8, -39, -8, 121, 67, 7, -139, -217, -15, -181, 266, -9, -79, 196, -87, -2, 88, 47, -161, -68, 56, -197, 72, -16, 241, 144, -152, -192, -241, 300]
5546C00k35j36K48k53K8Q8k40L74r4k09L43k49N8J14k41L75j95o1j18L85j80j53
5568e1o4J91j75o5K20R1n1l23M63k04q9r0J64J27j53L5R2k75L62k64o4QN7K28
5592A70j82l7J62j70N8L2j13j83K51j27J2M38l05K26l04K90l55K64j29J29k3p7
5614B7k28K83M9J32k71LR5J86k2n13K9K14k2P2r7J61j51J00m54O20r4j3l16J3
5638a97L0L85j41o4J61j49J11m01K48Q6m7j20K60j21K14l50j1Q0J3M4k66R5J41
5661Aj46L93j63q5M9j11j73J81M20m40o5J39oj04P7RL83m76J16R2k49M7k3j00
5685b34J89K0Q0M3j4o3J53N9n49M00k4r6m3L2J21K02l41J97j74K6p5j6j97K40
5709f4K71ql09K84k04J91p7l89J10J94L5j53L17k44N9j29j16M2M46m0j19J96m65
$$ y = [300, 65, -71, 177, -76, -48, 40, -200, 174, 80, -129, 214, -35, 23, 137, -104, 271, 76, 15, -103, 282, 102, -51, -115, 76, -99, -164, 56, 147, 96, -227, 236, 32, -57, -147, 17, 144, -9, 26, 118, -157, 205, -59, -123, -115, -58, 170, -12, -49, 113, -57, 1, 33, -80, -263, -12, -139, -127, 311, 6, 232, -72, 218, -137, 127, -2, 127, 104, 27, -201, 82, 131, 263, -8, -5, 90, 276, 254, -259, -230, -16, -38, 34, -63, 98, -53, 47, -407, 213, 119, 106, -210, -197, -167, 218, 77, 13, 174, 25, 136, -265, -17, 69, 22, -98, 162, 41, 255, -95, -106, -26, -13, 31, -235, -140, 1, -145, 248, 85, 0, 49, -62, -235, -54, 366, -74, -139, 0, -6, -110, -33, -24, 359, -117, -1, 91, -158, -111, -134, -234, -45, -25, 55, 98, 84, 21, 174, 233, -316, 84, 60, -36, -79, -47, 74, 276, -65, 132, -42, -16, -91, -107, -304, -64, 207, 199, -110, 174, -30, 161, 84, -305, -195, -1, 34, -119, 198, -46, 13, -116, -232, -190, 256, 216, 97, 293, -172]
5732a72K96K2k4l11o2K50J8j73J7P2M43j89p3J50j29k41N5J2K52j74J50l7j53
5755aP5l2j42K44j41J60Lp8j45M7Q7K52l87J59k68j0K28M0k29Q0L53k36J51l1
5779A79j73J31j18j32oj10J35L0L2K30j79L05n82O4J01N1m8o5K54m2lj59RJ05
5803Im04L35L09l9m6k1k47J47P2k91J73k90J70p9K55j64j86L45j95J68J00J08
5825B29k77%m0J58n47L63L9K20m1L5M6k66O8k27N76o81N20n35K07R6m6r0K14P3
5849I4j34Q7j98K48j59O1J81j01j40J7L4K15K8k79J05n7J75Ql6l93K21K4l3M48
5873D16m95K63k27o7K66o8k38J04J80J66M5k19l43K13mKK16l21J16k27L62r9n6
5896a5J14k41QJ67k93J50K04J0n9q6L4k27L00j25P4k23J60j82K04M4l67M92p1
$$ y = [-172, 124, 146, 122, -189, -251, -1, 17, -156, -139, -67, 376, 187, 114, 264, 135, -106, -51, -39, 213, 39, 189, 152, -1, 74, 42, -100, 144, 3, 163, 166, 88, -57, -10, 77, 329, -58, 101, -167, -177, 51, 91, -138, -58, 295, 59, 210, 179, 6, 137, 19, -113, -119, -229, -94, -64, -32, 198, 19, 324, -258, -194, -93, -42, -90, -155, 99, 57, 54, -105, -96, 9, -395, -60, 249, 210, 164, 143, -104, 43, 115, -176, -3, -293, -123, -202, 53, -111, -297, 48, -147, 21, 121, 229, -48, -48, -88, 70, -477, -114, -75, 145, 104, 139, 185, -81, -13, -240, 336, -345, 175, -360, -153, -57, -103, -193, 21, 94, -40, 47, -151, 97, -62, -1, 180, 79, -61, -44, -10, 205, 233, -46, 59, 2, 177, 185, 149, -244, -23, 1, -32, 416, -79, 184, -43, -110, 156, 88, -150, -46, 134, 300, 345, 126, -217, -4, -8, -6, 210, -111, 5, -222, 140, 41, -15, 99, -142, -134, 33, -260, -110, 94, 104, 45, -41, -7, -234, 66, -59, 15, -208, -48, -230, -26, 18, -349, 143, 72]
5919G2J79l10J87k29r1L43M4n16K57J09j94J96J27l2k25N6k5L2R6j49O8m7rJ94
5943A33k99J36J17q7R5R1r8k47K90O6j0l19K3Q0K5j51J68O7j47N6rQ5m2k5J77
5968A75l49J02M4j04K00J55j42r0j50J6K20k73J56r2r2M93l73R8j24J48K16j62
5990G2Q6j85q1Nj0J36J88P5k10K66m16K3k8R3j40J33j01p3J76J03q8K9k85L83
6014A51n8k93R8Nj76J62J89L9j70J75l4k79M6J12n9l15M05J22k9j90K33j83J39
6037I0p5N3r9j1k08M23k18j61N8QK34j22j59K37M47m68j30K6k14K65J96k56lj10
6061a97M76j91O4j82P1J8k34K53J16m05O3K05k34M53l16j33L89m53K58j1p1K40
6083A79j70K20m83M06j19k75K54Q8k01n3J03N7J00k72J86k99N11m49J68l9K8k53
$$ y = [72, 251, -59, 128, -101, -192, 151, 195, -321, -64, 45, -149, 47, 174, 142, -83, -27, -52, -20, 76, -73, -5, -52, -61, 133, -166, -30, 87, 0, 95, 186, 88, -159, 131, 197, 187, -132, -109, -29, -4, -155, 13, 80, -67, -11, -20, 65, 23, -2, 175, -174, -72, -28, -132, 68, 223, 81, -9, -159, -143, 77, -196, -40, -132, -224, 269, -104, -6, -130, 18, 234, 72, 158, -27, -108, -103, -113, 23, 211, 286, 76, 342, -74, -51, -79, 14, -126, 7, -94, -167, 9, 112, 24, 53, -232, 151, 93, -200, -102, -97, -273, -111, 78, 117, -53, 122, 88, -191, -145, -33, -92, -407, -2, 120, 91, -99, 134, -49, 90, 15, 68, -31, -42, -250, 173, -45, -206, -148, -140, 94, -28, -187, 50, 497, 29, -101, -75, -289, -24, 172, -84, -87, -197, 279, 88, 152, -30, 41, 59, -175, 78, 194, -211, -148, 57, -177, 276, -40, -173, 216, -237, 21, 10, -61, 179, 9, 229, -254, 152, 33, -242, 12, 100, -101, -154, -51, 6, 106, -166, 20, -279, 232, -217, -49, -88, -60, -313]
6105c13K11L13n05K68J74k18j55K95j34k22L01r8N2J43k44O2k5L43k73k10K85
6126E0P8j20l4o2m7j08L38L0k30O1O1J28n0J54m30K88K6j03P2j10R0k3O3m56L74
6151D0J42j30l21M31k24j53L44l34J10K62p0J32j6k47M34n07L45j48M2l67J63
6172g2j36J8j42L91r3j15k7K44k54L01j9Q9k57L02j7l74M4J94l53K73L6j36k08
6195c11L61N5k81J57K36m61J38K92j18O2k61M17n2l25J86j15l24O95q8k71M2n6
6217b2L4M34m97j10J1L55n2l06K11J19j29k5j92J96L4J07j15j73O9J08j66J86
6239G7q8j5n8K76j48J11l28P3K21k0O9r7p7m8J61k65J05J33j59L8j58J81K36o5
6263A55l50N7N33n86L13l78L37k39k6P7L65k81L9KL6j26J90l27K60Q0mn7Q4j08
$$ y = [-313, -102, 211, -294, -26, 148, -70, -225, 70, -64, -286, 15, -83, -31, 112, -132, -70, -95, 248, -25, -235, 50, 128, 8, -26, -88, -135, -243, 95, 125, -105, -44, 17, 145, 95, 249, -181, 107, 133, 30, 102, -8, 82, 59, 122, -334, 40, 182, 52, -269, 162, -62, -215, 129, -205, -95, 167, 97, 229, 213, -34, 400, -107, 238, 90, 132, -235, -72, -208, -190, -332, 59, -34, -149, -176, 68, -186, 115, 96, 185, -72, 230, 213, -161, -117, 77, -276, -3, 33, -103, -311, 50, 105, -176, -19, 217, -244, -106, 186, 68, 130, -131, 286, 234, -91, 95, -20, -344, 351, 263, -8, 34, -22, 12, 446, -51, -161, -150, 205, 153, -153, 58, 177, 48, 23, -169, 27, 61, 168, 53, -120, -51, 57, -109, 77, -11, -26, -84, 192, 44, 155, -173, -100, 121, 101, 170, 73, -4, -52, 109, -156, -51, 82, -77, -39, -197, -16, 220, 155, -195, -138, 395, -191, 122, -256, 81, -158, -184, -107, 258, -23, 16, 18, 54, -72, 118, -209, 51, 131, 127, 70, 154, 46]
6287D6m0J32j0k88J49J56J7Mm15J78J39j58J44j65L41k13J51m57L41o1k47L38
6309H2r9J44k02k1j5J75M1L2p6Q9J08K5k98J53N5l31o1K95j37J74l25L42k56K83
6333A77l32K0P6M2R0j02p2R4J9P1k45P9J45k83N60m22N0l2NJ13K5l24J55j8M37
6358C28l72J7j0j58j63O6K39J01J74o83L62o9L23l97M38J6q4k33J24k74K21n5
6380h9R3o6r6L18l25L47r7j71K19J02j67K11m36R9R4j2r0J42J12K6k58N6j29q4
6404b01L82o75N77k36O5K45j71K49n33L84j94J10J97pp1K2N2n8j22m6P0k03J33
6427c1j3KR9j40l40L04L13j48J29k26J0n5m9L26j0j31p8K06l81J90k65K43j22
6450a67O7K67j59L14k05j23L1k4J97l52L57l67M67k30O8j04O7Ln4n3n8K99k67
$$ y = [46, 6, 138, 128, -160, -11, 145, 162, 166, -249, -71, 68, -90, 54, -111, 230, 17, 168, -289, 52, -9, -256, 82, -17, 127, -75, -96, -111, 64, 105, 137, 61, 150, 258, 283, -15, 138, 193, -138, -199, 96, -41, 133, -192, 150, -106, 177, -155, -135, -59, -17, 73, -29, -101, -7, 12, 83, -162, -83, 62, -221, 339, -83, -33, -65, -60, 53, 78, -246, -91, -109, 328, -44, -27, -37, -195, -358, -292, -53, 48, 222, -461, -99, -168, 155, -242, 196, 212, 128, -105, 19, -255, -34, -89, 4, -62, -158, 160, -165, 182, 85, -86, 133, 235, 68, 279, -157, -58, 36, 24, -66, 76, 188, 214, -44, 12, -117, -201, 181, -494, 83, -153, -88, 157, -14, 235, -298, 86, -108, 2, 199, 192, 121, 143, 195, 137, 15, -31, 39, -164, -31, -44, -42, 57, -83, -423, -119, 194, 46, 175, -51, -41, -96, -145, 181, 171, 40, -38, 168, -213, -23, -288, -45, -167, -100, 167, 8, 322, 117, -6, 25, 1, 198, -154, 203, -164, 303, 73, 141, 37, 104, 107, 53, 0, -58, 241, -26]
6473b6n5O4P5p1R4j99R9Q4l0J41j10J9j5q1k52L38n3qj18j20L25jN4n3j81J33
6499E3n1r1P8J26J42k55J70n8j70P4p3O1J75j41RK36j01J38m69L59k6O8j21r8
6523C5k7r9J62P3l47M46n3j66j43K46j51j13K40j01j25J62l4l22M73j84J20j05
6545a3o3K30k78J94k4K8o5k87M08k56k7K98j63j44Q9j84K58j77K63J29L8k83K43
6568B14m30N49l31J91p8J03k96L07k00j45L42k76k7m2L16j54n9M1R4j55r3K03
6590G4O2k61Q1l03%K75J07R2k76J77j5K02l65p8L60j20Nn1n8O9J10J30j56j14
$$ y = [-26, -81, -17, 58, -13, 81, -118, -19, 65, 35, 176, 66, 85, 70, -11, -263, 75, 22, 14, -104, -224, 101, 100, 154, 101, -80, 53, 2, -89, -11, 115, 257, 2, 172, 114, -56, 18, -55, 6, 181, 40, 49, 285, 184, 322, -147, 212, 186, 254, 133, 35, 8, -91, 71, 144, -203, 243, 190, 24, -119, 127, -24, -137, 103, 2, -123, 39, 5, -317, 156, -28, 92, -13, -76, 154, -124, 70, 46, 74, 9, -278, 130, -126, -153, 145, -18, -162, -73, -257, 1, -176, 87, 216, 254, -29, 214, -216, 333, 2, 193, 115, 218, -78, 229, 29, -116, 226, -50, -77, -119, 197, 43, -16, 25, 119, -36, -129, 74, 136, -125, -44, -347, -347, -72, 35, 127, -149, 28, 13, 215, -150, -228, 132, 12, 17, -34, -92, -23, 87, 217, 61, -53]
$$ [...]
8190hm5
8191e3
##END NTUPLES=NMR FID
##END=
