##TITLE=1H_AM-NVSTILBE
 aceton-d6
 8 sc, 
 27.10.2023
##JCAMPDX= 6.0         $$ Bruker NMR JCAMP-DX V2.0
##DATA TYPE= NMR FID
##DATA CLASS= NTUPLES
##ORIGIN= UXNMR, Bruker Analytische Messtechnik GmbH
##OWNER= root
$$ XWIN-NMR		Version 3.5
$$ Fri Oct 27 15:14:40 2023 Russian Standard Time (UT+4h)  she@DPX200
##.OBSERVE FREQUENCY= 200.13135
##.OBSERVE NUCLEUS= ^1H
##.DELAY= (6, 6)
##.ACQUISITION MODE= SIMULTANEOUS
##.ACQUISITION SCHEME= undefined
##.AVERAGES= 8
##.DIGITISER RES= 18
##SPECTROMETER/DATA SYSTEM= spect
##.PULSE SEQUENCE= zg30
##.SOLVENT NAME= Acetone
##.SHIFT REFERENCE= (INTERNAL, Acetone, 0, 15.7039)
##AUDIT TRAIL= $$ (NUMBER, WHEN, WHO, WHERE, WHAT)
$$ ##TITLE= Audit trail, XWIN-NMR		Version 3.5
$$ ##JCAMPDX= 5.01
$$ ##ORIGIN= Bruker BioSpin GmbH
$$ ##OWNER= she
$$ F:/spectra/data/she/nmr/H-F/1/audita.txt
$$ ##AUDIT TRAIL=  $$ (NUMBER, WHEN, WHO, WHERE, WHAT)
(   1,<2023-10-27 15:13:39.59 +0400>,<she>,<DPX200>,
      <created by zg, POWCHK disabled, PULCHK disabled
       configuration hash MD5:
       00 E9 B6 7A A2 85 ED C7 34 08 36 98 17 FE 4E 26
       data hash MD5: 16K
       EE 5C 32 1E 3D 2A 62 F0 89 03 1B E5 DF CF 9C 8B>)
$$ ##END=
$$ 
$$ hash MD5
$$ 1D 96 52 82 CE 09 0D 26 D6 D6 57 F2 91 6A 49 A8
##$RELAX= 
##$RELAX= 
##$RELAX= 
##$RELAX= 
##$RELAX= 
##$RELAX= 
$$ Bruker specific parameters
$$ --------------------------
##$DU= <F:/spectra>
##$EXPNO= 1
##$NAME= <H-F>
##$PROCNO= 1
##$TYPE= <nmr>
##$USER= <she>
##$AMP= (0..31)
100 100 100 100 100 100 100 100 100 100 100 100 100 100 100 100 100 100 
100 100 100 100 100 100 100 100 100 100 100 100 100 100 
##$AQSEQ= 0
##$AQ_mod= 1
##$AUNM= <au_zg>
##$AUTOPOS= <>
##$BF1= 200.13
##$BF2= 200.13
##$BF3= 200.13
##$BF4= 200.13
##$BF5= 200.13
##$BF6= 200.13
##$BF7= 200.13
##$BF8= 200.13
##$BYTORDA= 1
##$CFDGTYP= 0
##$CFRGTYP= 5
##$CHEMSTR= <none>
##$CNST= (0..31)
1 1 145 1 1 1 1 1 1 1 1 1 1 1 1 1 1 1 1 1 1 1 1 1 1 1 1 1 1 1 1 1 
##$CPDPRG= <>
##$CPDPRG1= <>
##$CPDPRG2= <>
##$CPDPRG3= <>
##$CPDPRG4= <mlev>
##$CPDPRG5= <mlev>
##$CPDPRG6= <mlev>
##$CPDPRG7= <mlev>
##$CPDPRG8= <mlev>
##$CPDPRGB= <>
##$CPDPRGT= <>
##$D= (0..31)
0 1.2 0 0 0 0 0 0 0 0.06 0 0.03 0 0 0 0 0.0002 0 0 0 0 0 0 0 0 0 0 0 0 
0 0 0 
##$DATE= 1698405218
##$DBL= (0..7)
120 120 120 120 120 120 120 120 
##$DBP= (0..7)
150 150 150 150 150 150 150 150 
##$DBP07= 0
##$DBPNAM0= <>
##$DBPNAM1= <>
##$DBPNAM2= <>
##$DBPNAM3= <>
##$DBPNAM4= <>
##$DBPNAM5= <>
##$DBPNAM6= <>
##$DBPNAM7= <>
##$DBPOAL= (0..7)
0.5 0.5 0.5 0.5 0.5 0.5 0.5 0.5 
##$DBPOFFS= (0..7)
0 0 0 0 0 0 0 0 
##$DE= 6
##$DECBNUC= <off>
##$DECIM= 32
##$DECNUC= <off>
##$DECSTAT= 4
##$DIGMOD= 1
##$DIGTYP= 9
##$DL= (0..7)
0 120 120 120 120 120 120 120 
##$DP= (0..7)
150 150 150 150 150 150 150 150 
##$DP07= 0
##$DPNAME0= <>
##$DPNAME1= <>
##$DPNAME2= <>
##$DPNAME3= <>
##$DPNAME4= <>
##$DPNAME5= <>
##$DPNAME6= <>
##$DPNAME7= <>
##$DPOAL= (0..7)
0.5 0.5 0.5 0.5 0.5 0.5 0.5 0.5 
##$DPOFFS= (0..7)
0 0 0 0 0 0 0 0 
##$DQDMODE= 0
##$DR= 18
##$DS= 0
$$ [...]
##$SUBNAM2= <"">
##$SUBNAM3= <"">
##$SUBNAM4= <"">
##$SUBNAM5= <"">
##$SUBNAM6= <"">
##$SUBNAM7= <"">
##$SUBNAM8= <"">
##$SUBNAM9= <"">
##$SW= 18.05172834244
##$SWIBOX= (0..15)
0 0 2 0 0 0 0 0 0 0 0 0 0 0 0 0 
##$SW_h= 3612.71676300578
##$TD= 16384
##$TD0= 1
##$TE= 0
##$TE2= 300
##$TE3= 300
##$TEG= 300
##$TL= (0..7)
0 120 120 120 120 120 120 120 
##$TP= (0..7)
150 150 150 150 150 150 150 150 
##$TP07= 0
##$TPNAME0= <>
##$TPNAME1= <>
##$TPNAME2= <>
##$TPNAME3= <>
##$TPNAME4= <>
##$TPNAME5= <>
##$TPNAME6= <>
##$TPNAME7= <>
##$TPOAL= (0..7)
0.5 0.5 0.5 0.5 0.5 0.5 0.5 0.5 
##$TPOFFS= (0..7)
0 0 0 0 0 0 0 0 
##$TUNHIN= 0
##$TUNHOUT= 0
##$TUNXOUT= 0
##$USERA1= <user>
##$USERA2= <user>
##$USERA3= <user>
##$USERA4= <user>
##$USERA5= <user>
##$V9= 5
##$VALIST= <valist>
##$VCLIST= <CCCCCCCCCCCCCCC>
##$VD= 0
##$VDLIST= <DDDDDDDDDDDDDDD>
##$VPLIST= <PPPPPPPPPPPPPPP>
##$VTLIST= <TTTTTTTTTTTTTTT>
##$WBST= 1024
##$WBSW= 4
##$XGAIN= (0..3)
0 0 0 0 
##$XL= 0
##$YL= 0
##$YMAX_a= 20530
##$YMIN_a= -19906
##$ZGOPTNS= <>
##$ZL1= 120
##$ZL2= 120
##$ZL3= 120
##$ZL4= 120
##$ABSF1= 10
##$ABSF2= 0
##$ABSG= 5
##$ABSL= 3
##$ALPHA= 0
##$AQORDER= 0
##$ASSFAC= 0
##$ASSFACI= 0
##$ASSFACX= 0
##$ASSWID= 0
##$AUNMP= <proc_1d>
##$AZFE= 0.1
##$AZFW= 0.1
##$BCFW= 1
##$BC_mod= 2
##$BYTORDP= 1
##$COROFFS= 0
##$CY= 11.3945322036743
##$DATMOD= 1
##$DC= 2
##$DFILT= <>
##$DTYPP= 0
##$F1P= 15.7292609196834
##$F2P= 12.9074282941183
##$FCOR= 0.5
##$FTSIZE= 0
##$FT_mod= 4
##$GAMMA= 1
##$GB= 0.15
##$INTBC= 1
##$INTSCL= 1
##$ISEN= 128
##$LB= 0.24
##$LEV0= 0
##$LPBIN= 0
##$MAXI= 10000
##$MC2= 0
##$MEAN= 0
##$ME_mod= 0
##$MI= 1.114404
##$NCOEF= 0
##$NC_proc= 0
##$NLEV= 6
##$NOISF1= 3.799351
##$NOISF2= 2.8
##$NSP= 1
##$NTH_PI= 0
##$NZP= 0
##$OFFSET= 15.70392
##$PC= 1
##$PHC0= -23423.07
##$PHC1= 8.652719
##$PH_mod= 1
##$PKNL= yes
##$PPARMOD= 0
##$PSCAL= 0
##$PSIGN= 0
##$REVERSE= no
##$SF= 200.130013532006
##$SI= 16384
##$SIGF1= 3
##$SIGF2= 2
##$SINO= 400
##$SIOLD= 16384
##$SREGLST= <1H.CDCl3>
##$SSB= 0
##$STSI= 0
##$STSR= 0
##$SW_p= 3612.71676300578
##$SYMM= 0
##$S_DEV= 0
##$TDeff= 0
##$TDoff= 0
##$TI= <>
##$TILT= no
##$TM1= 0
##$TM2= 0
##$TOPLEV= 0
##$USERP1= <user>
##$USERP2= <user>
##$USERP3= <user>
##$USERP4= <user>
##$USERP5= <user>
##$WDW= 1
##$XDIM= 8192
##$YMAX_p= 0
##$YMIN_p= 0
$$ End of Bruker specific parameters
$$ ---------------------------------
##NTUPLES= NMR FID
##VAR_NAME=  TIME,          FID/REAL,        FID/IMAG
##SYMBOL=    X,             R,               I
##VAR_TYPE=  INDEPENDENT,   DEPENDENT,       DEPENDENT
##VAR_FORM=  AFFN,          ASDF,            ASDF
##VAR_DIM=   8192,          8192,            8192
##UNITS=     SECONDS,       ARBITRARY UNITS, ARBITRARY UNITS
##FACTOR=    0.0002768,     1,               1
##FIRST=     0,             0,               0
##LAST=      2.2672688,     0,               0
##MIN=       0,             -19906,          0
##MAX=       2.2672688,     20530,           0
$$ Real data points
##PAGE= N=1
##DATA TABLE= (X++(R..R)), XYDATA
$$ [...]
1181A824l25l153N83L150p94l047Q86K943q99k982Q92K989j103k915J343K713
1197B105j298k770J245K855j492k765J587K729j716k517J708K451j829k536K063
1212a80K258j962k259K011K149k185k040K297J882k234j978K397J813k360j753
1227b144K370J766k525j592K562J329k571j041K484J270k827j133K757J036k739
1242i98r75K860Q11k765q24K916N29k800n94K953M38k803l78K780M22k978j72
1259a578K867Q9k932R9K813j12k785L11K681k15k862N75K673p36k600P77K739
1276A804p99k634P14K676r04k603J036K527j064k525J255K370j200k385J268K446
1292A982j527k160J520K142j532k259J777K051j785j835J567J994j746j854J824
$$ plain form
1181 1824 1499 -1654 -1071 2079 1285 -1762 -876 2067 1168 -1814 -922 2067 964 -1951 -608 2105
1197 2105 807 -1963 -718 2137 645 -2120 -533 2196 480 -2037 -329 2122 293 -2243 -180
1212 -180 2078 116 -2143 -132 2017 -168 -2208 89 1971 -263 -2241 156 1969 -391 -2144
1227 -2144 226 1992 -533 -2125 437 1766 -805 -1846 638 1908 -919 -2052 705 1741 -998
1242 -998 -1973 887 1698 -1067 -1891 1025 1554 -1246 -1840 1113 1551 -1252 -1630 1150 1572 -1406 -1578
1259 -1578 1289 1378 -1554 -1455 1358 1246 -1539 -1228 1453 1238 -1624 -1049 1624 888 -1712 -935 1804
1276 1804 1005 -1629 -915 1761 857 -1746 -710 1817 753 -1772 -517 1853 653 -1732 -464 1982
1292 1982 455 -1705 -185 1957 425 -1834 -57 1994 209 -1626 -59 1935 189 -1665 159
1307A59J790j942j759J911J724k013j550J976J555k147j386K171J257k106j289
1322a649K195J279k353j157K412R54k281j045K430Q85k427q52K457O89k393o91
1338a547K469N24k471m28K499L52k587k15K459K08k516j91K548J3k380n1K611
1355A297k01k550L47K457l84k536N02K411m44k541O20K591q19k359O68K414p75
1372F98k459R82K350j041k337J192K240j110k314J302K212j360k103J446K073
1387A771j601k033J694J847j564j909J756J800j710j704J712J716j829j630K025
1402C41J408k036j325K000J283j997j295K208J222k196j205K247R81k252r35K285
1418G34Q91k422o61K288P26k391m71K341M72k337l36K285L06k399j52K460o5k400
$$ plain form
1307 159 1949 7 -1752 159 1883 -130 -1680 296 1851 -296 -1682 489 1746 -360 -1649
1322 -1649 546 1825 -528 -1685 727 1681 -600 -1645 785 1670 -757 -1609 848 1537 -856 -1547
1338 -1547 922 1446 -1025 -1453 1046 1398 -1189 -1404 1055 1263 -1253 -1444 1104 1117 -1263 -1314 1297
1355 1297 1096 -1454 -1107 1350 966 -1570 -1068 1343 899 -1642 -1022 1569 750 -1609 -941 1473 698
1372 698 -1761 -779 1571 530 -1807 -615 1625 515 -1799 -497 1715 355 -1748 -302 1771
1387 1771 170 -1863 -169 1678 114 -1795 -39 1761 51 -1653 59 1775 -54 -1684 341
1402 341 1749 -287 -1612 388 1671 -326 -1621 587 1809 -387 -1592 655 1636 -616 -1551 734
1418 734 1625 -797 -1458 830 1556 -835 -1306 1035 1507 -830 -1166 1119 1425 -974 -1126 1334 1269 -1131
1436a131l8K461j79k301J90K291k09k366M21K241m71k261O25K042n20k133N70
1453g68K231p37k127P20K104q07j978Q55J970j102j902J126J793j092j765J153
1469c26J711j194j665J157J723j350j552J296J589j322j533J443J340j453j342
1484a478J528J321j595j241J468J294j539j181J578J138j591j173J653J173j828
1499d73r46J751Q79j659q68J793Q02j791p88J764P54j874o43J836O76j912n35
1516a234J875M97j847m14J862N26k034l70J991L56k026k51K011J39j924j34J992
1533A015Qk022P8J957ok090J35K185l29k060M13J996m62j912M55J956n89j994
1551a266P70J927q23j972Q79J993j004j841R70J914j067j923J141J842j191j781
$$ plain form
1436 -1131 -1169 1292 1113 -1188 -998 1293 1084 -1282 -861 1380 909 -1352 -727 1315 795 -1338 -768
1453 -768 1463 726 -1401 -681 1423 616 -1362 -507 1463 361 -1541 -415 1378 286 -1479 -326
1469 -326 1385 191 -1474 -317 1406 56 -1496 -200 1389 67 -1466 -23 1317 -136 -1478
1484 -1478 50 1371 -224 -1465 3 1297 -242 -1423 155 1293 -298 -1471 182 1355 -473
1499 -473 -1419 332 1211 -448 -1316 477 1279 -512 -1300 464 1218 -656 -1299 537 1213 -699 -1234
1516 -1234 641 1138 -709 -1123 739 1265 -769 -1139 852 1208 -818 -1069 942 1081 -843 -977 1015
1533 1015 1023 -999 -921 1036 1030 -1060 -925 1260 931 -1129 -716 1280 818 -1094 -639 1317 728 -1266
1551 -1266 -496 1431 608 -1364 -485 1508 504 -1337 -367 1547 480 -1443 -302 1540 349 -1432
1567a432J335J646j357j688J445J580j470j533J592J395j718j273J660J273j628
1582a73j393J959J082j954r42J833J015j995q09J928Q14j981p51J946O41j989
1598g69n50K036M19k035k71J959L14k118j59K073K6j934n7K069o8k036J76K025
1616A100l49j903K59J926l38j884M49J870n82j746M79J797o61j799R65J581q07
1633C57j594Q34J510p90j518R35J374q96j400R50J451j032j356J084J311j141
1649G9j155J129J003j056j073J121J011j056j000J138J035j193r53J050J019j156
1665e7r03J207Q59j239q84J255Q67j309p54J253P38j271p29J340O23j204o91J279
1683C80O77j429n97J436N15j342n92J445M65j401m70J450M23j523l40J456L77
$$ plain form
1567 -1432 -97 1549 192 -1496 -51 1529 59 -1474 118 1513 -205 -1478 182 1455 -173
1582 -173 -1566 393 1475 -479 -1421 412 1427 -568 -1377 551 1365 -616 -1367 579 1220 -769
1598 -769 -1319 717 1136 -899 -1170 789 1103 -1015 -1174 899 925 -1009 -1066 1003 935 -1101 -925 1100
1616 1100 751 -1152 -893 1033 695 -1189 -740 1130 548 -1198 -719 1078 417 -1382 -417 1164 357
1633 357 -1237 -403 1107 317 -1201 -266 1108 212 -1188 -238 1213 181 -1175 -91 1220 79
1649 79 -1076 53 1056 0 -1073 48 1059 3 -997 141 1176 -17 -970 80 1099 -57
1665 -57 -960 247 1106 -133 -1017 238 1105 -204 -958 295 1033 -238 -967 373 996 -208 -899 380
1683 380 1057 -372 -969 467 982 -360 -952 493 958 -443 -913 537 960 -563 -903 553 930
1700I30j515k83J492K12j416l15J564R5j489m8J536J5j572lJ585r9j610J03J629
1719H11j96j555K92J547k79j579K66J791o20j531M78J595n18j698O59J620p04
1736C79j589P66J545q53j466R20J455r54j477J038J412j099j391J203J343j246
1752a4j274J272J240j321j189J447J080j465r75J436J008j545q99J550Q52j606
1768d03p35J596O80j598o34J662N38j676m58J699L82j693l21J722K37j693j85
1785h80J707J08j697k2J665l0j693J50J641k37j586K81J582l47j558M09J529m54
1803E68j509N11J461n52j442O21J382o66j360P10J287p30j259P76J181p78j179
1820i78Q29J142q70j103R03J027r27r86R10R56r11r33R76Q74j004q42R95Q20j023
$$ plain form
1700 930 -585 -868 624 836 -580 -895 669 764 -725 -773 763 778 -794 -797 788 689 -921 -818 811
1719 811 615 -940 -648 899 620 -959 -693 1098 478 -1053 -575 1020 502 -1196 -537 1083 379
1736 379 -1210 -444 1101 248 -1218 -298 1157 203 -1274 -236 1176 77 -1314 -111 1232 -14
1752 -14 -1288 -16 1224 -97 -1286 161 1241 -224 -1199 237 1245 -300 -1199 351 1203 -403
1768 -403 -1138 458 1138 -460 -1094 568 1106 -570 -1028 671 1053 -640 -961 761 998 -695 -880
1785 -880 827 935 -762 -784 881 851 -842 -692 949 712 -874 -593 989 642 -916 -507 1022 568
1803 568 -941 -430 1031 479 -963 -342 1040 374 -986 -276 1011 281 -978 -202 979 201 -978
1820 -978 -149 993 123 -980 -77 950 23 -963 -53 903 -8 -941 35 909 -95 -937 58 878 -145
1839a45p64J001P09r62p49J048O35j023o23J053O16j094n32J034N74j103n07J105
1857B73M50j088m84J146M29j161l54J107L82j149l61J201L24j184k72J160K55
1874F74j182k34J233J87j228j69J243J18j216n4J175J06j217m0J214J9j244O2
1892e53J220j17j217J58J327k89j249K60J267l14j258L33J250l64j231M16J255
1909H94m96j243N62J232o19j189O66J138o79j154P15J143q10j031P95J087q39
1926A72j152R48J052r48r92R88R30j060q29J034Q38j090q42J162P42j157o79J178
1944B95O06j209n45J222M98j237m87J225M37j292l80J318L78j338k58J303J81
1961G17j337j00J321Q5j309r6J322M1j361N1J253p1j303J92J243j76j220K78J192
$$ plain form
1839 -145 -909 92 801 -161 -910 138 773 -250 -873 180 796 -298 -830 204 778 -325 -832 273
1857 273 723 -365 -849 297 726 -435 -789 318 700 -449 -810 391 715 -469 -741 419 674
1874 674 -508 -742 491 678 -550 -719 524 642 -574 -628 547 653 -564 -604 610 629 -615 -553
1892 -553 667 550 -667 -509 818 529 -720 -460 807 493 -765 -432 818 454 -777 -361 894
1909 894 398 -845 -283 949 330 -859 -193 945 266 -888 -173 970 160 -871 -76 1011 172
1926 172 -980 -32 1020 72 -920 68 998 -62 -891 143 981 -109 -951 211 953 -204 -883 295
1944 295 901 -308 -853 369 867 -370 -857 368 805 -487 -867 451 829 -509 -767 536 717
1961 717 -620 -720 601 686 -623 -719 603 644 -717 -666 587 516 -787 -595 648 472 -748 -470 722
1980G22k96j217L39J172l28j162M12J109m45j069M73J046m66j111N56J026n60
1997B01r86O17R73p16r36P48Q35o50p97O74Q54p59q85P60Q36p73p98Q57P58r30
2017a17o54R35O34r09n80Q15N71r15n00R00N65r16n21R23M93r90l65R71L43r31
2037b48l00Q40L65q64m10R64L71r70k86J029J74j117j35J016J66j036j51R83J60
2056E51j033l9J046l7r25n9J017mj039M9J065q9j034R9Q96j11j013K60R66j49
2076D17j034K20J108l80r58K87J006m39r10M11R40m98r24M81Q73m23q72N44Q42
2095F91o04q51N86Q52o45q27P39P20o77q08Q16P40p26p11P78O50q74n41O98N83
2115E89p52n32Q19N06q29n29R10N04q53n60R68M47j043l26R02M40r84k87R03L36
$$ plain form
1980 722 426 -791 -452 720 392 -770 -358 751 306 -763 -290 756 290 -821 -265 761 201
1997 201 -785 -168 805 89 -847 -99 736 86 -711 -37 817 58 -827 -67 769 -4 -802 55 813 -117
2017 -117 -771 164 798 -111 -691 124 695 -220 -720 180 745 -171 -692 231 724 -266 -631 340 683 -248
2037 -248 -548 292 657 -207 -617 347 718 -252 -538 491 665 -452 -587 429 595 -441 -592 391 551
2056 551 -482 -521 525 488 -437 -496 521 517 -522 -473 592 503 -531 -432 464 353 -660 -400 566 417
2076 417 -617 -397 711 331 -627 -340 666 227 -683 -272 668 170 -754 -273 600 177 -695 -151 691
2095 691 87 -764 -178 674 29 -798 -59 661 -16 -824 -8 732 6 -705 73 723 -151 -692 6 589
2115 589 -163 -695 124 630 -199 -728 182 686 -167 -727 241 688 -355 -681 221 661 -323 -610 293 629
2135F29j047k02J077J22r24j88R91J24r87j25J009O2r98J9R84J8j036J3J016j45
2155D12q71N6R19j62r46K34R68j67j042L18R76l83q52L24Q55l86q14K90R21m75
2175A75q13N46Q07n16q03N11P37m87q18O20P10n93p16O49N99n84o56O24O40n60
2195G2p37P72M41n83n90P03N48p75m56P17N49p45n68Q24M22q63l91Q77L78q71
2215b76k93P95L28q60k74Q78K55j010p6Q90J18q33j93R29J06q82j10Q72N9p53
2235c30j32Q63N3j016J84Q46q5p74L9P80l3q80J73P78r2q65J94P69j47q85L36
2256b24P47k18p21K28O73k31p57K92P46l89o29L74O41m16o70M28P37m65p07M76
2276h5P48n88n32M44N92n12o35O11N01n39n87O50M58n50m96O48M20o35n01O70
$$ plain form
2135 629 -418 -620 457 579 -345 -533 458 582 -405 -530 479 541 -457 -438 546 564 -472 -459 557 412
2155 412 -459 -403 516 354 -592 -358 610 443 -599 -281 695 312 -540 -216 639 253 -561 -271 650 175
2175 175 -638 -92 715 199 -604 -93 644 157 -661 -41 669 76 -640 9 608 24 -632 -8 632 72
2195 72 -665 107 548 -35 -625 78 626 -149 -605 112 661 -84 -652 172 594 -269 -660 217 595 -276
2215 -276 -569 226 554 -306 -580 298 553 -457 -533 357 475 -358 -551 378 484 -398 -508 364 423 -330
2235 -330 -462 401 454 -562 -378 468 383 -391 -352 428 395 -485 -312 466 374 -491 -297 472 325 -560 -224
2256 -224 523 305 -416 -188 485 254 -503 -211 535 146 -483 -109 532 116 -554 -126 611 146 -561 -85
2276 -85 663 75 -457 -13 579 67 -568 43 544 5 -582 68 526 -24 -520 128 548 -87 -588 82
2296H2M86p06l71P66K88p24l10P23K70p25k02P16J90p22j94P57P4p15j69Q04J58
2317D76p01k27Q47Q3p90r2P50P1q47L0P22P9q26j2P74k6o97Q4O47j03p25J67P35
2340D19j19p94J93P13j96o99J65P80k18q23M14O64k99p36M00O41m13o42M23O23
2360D96l91o86M94N09l72o03M25O93o30m85N51N56o20m14M88M84n42n32O34M35
2380D90n33n35O49M18n78m10O25M35p11k67O49J98o07k70O66K16o22l18P11L44
2400E50p84k00P40J74p61j78P72Q4o41q3P02O9p31n0P09K6p57K7O92j9p07J22
2422b44O34r9o59P6P14j46o12J01O20j30o46K05N97j72o99K49P22k12p41K65O56
2443D79l73n06K73N10k59n67L16N85l85n87M56N43m99m53L80O02m17n48M38M63
$$ plain form
2296 82 568 -138 -509 257 545 -179 -489 234 504 -221 -423 293 483 -239 -433 324 398 -317 -486 318 476
2317 476 -225 -452 395 478 -312 -404 346 417 -430 -400 322 401 -425 -437 337 311 -386 -302 345 242 -483 -316 419
2340 419 300 -494 -301 412 216 -483 -318 462 244 -579 -165 499 200 -536 -136 505 92 -550 -127 496
2360 496 105 -581 -87 422 50 -553 -128 565 -65 -550 1 557 -63 -477 11 495 -47 -579 55 490
2380 490 -43 -578 71 489 -89 -499 126 561 -150 -417 232 430 -177 -447 219 435 -187 -505 206 550
2400 550 -234 -434 306 480 -281 -459 313 397 -244 -327 375 444 -287 -337 372 398 -359 -332 360 341 -366 -244
2422 -244 390 291 -368 -292 422 276 -336 -235 385 255 -391 -186 411 239 -460 -211 511 299 -442 -177 479
2443 479 106 -400 -127 383 124 -443 -127 458 73 -514 -58 485 -14 -467 -87 515 98 -450 -12 451
2463D51m45n34N78L98m51m40M70M80o46l33N01L60m07n01O60K91n45l73O42L10
2483D66p07j73N90K66o82j29O22J52o53r7N67J51p12j9O21J19o28j42O35J31o48
2504b70j9O09No82O5O41j28n43N8O21q6o76J65O08j45n78J89N96k58n89K77N26
2526C86j90n76K36N79k88n24K45N39k68n27K83N09l44m75L18N06l95m66M15N06
2546D69m54l90L30N18m75m46M55M57n18l47M02L60m41l54N54K64n05k83M51L13
2566C60m84k62M54L00n38k21N84J98n98k06N97J16m87j48N63R4n95p6N93L4n06
2587b28r3N73P2n94n3N83K0o06O2O22j26n36L8N69n6o05J34N94k14m94J24N66
2609C52j52n03J10N22j93m94J75N24j71n42K12N63k89m70K92M01k19l89K25M51
$$ plain form
2463 451 6 -528 50 448 -3 -443 27 507 -139 -472 29 389 -18 -519 141 432 -113 -486 156 466
2483 466 -241 -414 176 442 -240 -369 253 405 -248 -345 222 373 -339 -358 263 382 -246 -388 247 378 -270
2504 -270 -289 320 325 -357 -292 349 221 -322 -264 357 271 -405 -240 368 223 -355 -166 430 172 -417 -140 386
2526 386 196 -380 -144 435 147 -377 -132 407 139 -388 -105 404 60 -415 -97 409 14 -452 -37 469
2546 469 15 -375 -45 473 -2 -448 7 464 -54 -401 1 361 -80 -434 120 384 -121 -404 47 360
2566 360 -124 -386 68 368 -170 -391 193 391 -207 -413 184 300 -187 -335 228 322 -273 -349 244 278 -228
2587 -228 -321 252 324 -270 -323 260 280 -326 -264 358 232 -304 -266 303 247 -358 -224 370 156 -338 -214 352
2609 352 200 -303 -193 329 136 -358 -183 341 170 -372 -160 403 114 -356 -64 337 118 -271 -46 405
2629D05l68l79K49M34l31l66L66L46l17m19M47L80m68l57L90L88l87l99M90K43
2649C47m19k85M43L37m87k87M75K48m39k60N37Q2m76j86N30K00n07j68M97J66
2669C48m74j95N83M2m75j44N63K2n36N0M30P4n56MM71J6m74L0N04j1n86N5N04
2692B45nn28Q4N32j42n20J35N19j83n04K27M89j82n07J56N30k90m14K76M37k69
2713H6m36K21M34k20m28L31L20k96l70L60L49l16l75L59L93m14l51L24L59l77
2733d7l05M03K87l47l43M36K63l70k86L78L17n09k11M35K78m96k22M88J64m44
2753a31j48M18J21l77j65M62P1m63l9N07Q1o00L9M29L9m36j42N88l6m46L4M87
2775B93n1n06P8M39kn63J30M86j30m46J01M35j12l84P9M50j38m89J63M28j54m02
$$ plain form
2629 405 37 -342 -93 341 10 -356 10 356 39 -380 67 447 -21 -378 12 400 13 -386 104 347
2649 347 -72 -357 86 423 -64 -351 124 372 -67 -327 210 292 -184 -370 160 360 -147 -315 182 348
2669 348 -126 -321 262 304 -171 -315 248 270 -266 -216 214 288 -268 -264 207 223 -251 -221 283 272 -314 -259 245
2692 245 240 -288 -204 328 186 -334 -199 320 137 -367 -140 349 167 -340 -184 346 56 -358 -82 355 86
2713 86 -350 -129 305 85 -343 -12 308 12 -358 2 351 35 -340 19 412 -2 -353 -29 330 -47
2733 -47 -352 51 338 -9 -352 84 347 -23 -309 69 386 -123 -334 101 379 -117 -339 149 313 -131
2753 -131 -279 139 260 -117 -282 180 251 -212 -251 256 337 -263 -224 205 244 -192 -334 254 218 -228 -194 293
2775 293 242 -264 -186 253 251 -312 -182 304 174 -272 -171 264 152 -232 -153 297 159 -330 -167 261 107 -295
2797b95J66M04k08l47K35L28k58k95K31L34k37l53K27L17j88k97K46K65k43l54
2817c22K90L50l44l32L76K71l79k78M81J23k91k78M49J94l64k86L86K53m00k04
2837c05M46J08l57j18L57R9m28n1L94P9m26k3L91R7l92r2L90M4m03j3L58R0m83
2860b38L7M18l5l93n3M66J4m51K8M16lm02J8M76j19m48J39L38p3m12K39L14j40
2883A36l89Q4M69k16l24K78K26k85k61K16L39k21l13J89L59k85k72L13K87l09
2903B1l47L38K37k77k60L15K76k84l47L69K87l98j38K94J30k42k55L22K16k73
2923a6k36L11K40l58j52K41K79n21n8L46K12m93K4K76M5k84j09M26k6l06j0L78
2945B09Q8m96k7L54M5l38O2K63J7l62K3M06j24l73J21L27r3l28Q4L21j21k62R3
$$ plain form
2797 -295 -129 275 67 -280 -45 283 25 -270 -39 295 58 -295 -68 249 61 -236 10 275 32 -322
2817 -322 -32 318 -26 -358 18 289 -90 -368 113 236 -55 -333 116 310 -54 -340 46 299 -101 -305
2837 -305 141 249 -108 -226 131 230 -198 -249 145 224 -202 -225 166 263 -129 -221 169 213 -190 -203 155 245 -238
2860 -238 -201 217 182 -211 -264 202 216 -235 -207 209 206 -196 -178 298 179 -269 -130 208 135 -277 -38 276 136
2883 136 -253 -169 300 84 -240 38 264 -21 -282 -66 273 52 -261 -72 287 2 -270 43 330 21
2903 21 -326 12 249 -28 -288 27 303 19 -328 41 328 -70 -208 86 216 -26 -281 41 257 -16
2923 -16 -252 59 299 -59 -211 30 309 -212 -270 76 288 -205 -181 95 140 -144 -253 173 147 -159 -169 209
2945 209 297 -199 -226 128 173 -165 -103 160 177 -185 -162 244 120 -253 -132 195 102 -226 -142 179 58 -204 -111
2968a11L08j79l30J93L03j63k40J37L87k77k49J82K35j02l40K29K72k05l09J97
2988f2K97j90k25J87K16j74k58K44J56k02k08J65K81k79j77K41K62k76j90K22
3008C0J77l10j50L83O1l07j3J75J83l57r1K79K12l30j72L69Q1m00j8L41M0k87
3030a04j34L52J33l54q8K92L0l26Q6K28P8m33NM10j8l28o1L63j6k75l9L71J0m34
3054b52P9M25j38k73O6K78ll11qM03k62k22J22L18o1l95K4M16j69l08J86L11k57
3077c1k51J32L29j50l44L50J64k16k34K56K76l32k83L92K50m00j27K85K25m02
3097a11q5J93K83l21k49M15Q3k06k65L73Q3m05RK72J18l13k3K07K54m26q3K31
3119C4K23l83k1L54M6l75j8K95J8l75J4L62J0k23k8L16j36k34M6J74l6k63J50
$$ plain form
2968 -111 197 18 -312 -119 184 21 -219 -82 305 28 -221 -39 196 94 -246 -17 255 50 -259 -62
2988 -62 235 45 -180 7 223 49 -209 35 191 -11 -219 -54 227 -52 -229 12 274 -2 -192 30
3008 30 207 -103 -253 130 191 -116 -129 46 229 -128 -219 60 272 -58 -230 139 220 -180 -198 143 183 -104
3030 -104 -238 114 247 -107 -195 97 127 -199 -113 115 193 -240 -235 175 157 -171 -232 131 115 -160 -199 172 182 -252
3054 -252 -173 252 114 -159 -93 185 182 -129 -137 266 4 -218 -96 222 161 -234 -210 206 37 -271 -85 226 -31
3077 -31 -282 -150 179 29 -315 35 199 -17 -251 5 281 -51 -334 58 308 -92 -219 66 291 -111
3097 -111 -196 -3 280 -41 -290 125 208 2 -263 110 193 -212 -203 69 187 -126 -149 58 312 -114 -197 34
3119 34 257 -126 -147 207 253 -122 -140 155 173 -202 -188 174 184 -39 -67 249 113 -121 -75 99 63 -200 -50
3142e0K73o8l74J14L07r5k95J33J93l2k41M7L95l26n3O5J73k04j36J46K78k48
3164Bj96Q0L29k31j37J53J21k15j69J47L50l55p1K59P2o1j98J15Q0o5j86J73K60
3187B57k13j48J15J13j38k40K56K28k98q3L33q9j14j26K75Q9k60j25J83P3j73
3208h5JJ47Qk03o2L28j12n4k04M27j0k98J20RL1j19JJ15L8j41r2M07j23l52mL62
3234A35K5k45J6J68Pk91l0L95o7l84K46L88k87k70N8L02p7l90L28J87j86j80K01
3257D9J57j97j53J54J76k96p2J02L65k37l87L49K81m32o8K79K54k58j70N6K73
3278B25l56k27M42N6k72p1L42k2k32j11L09J11k40r2K17J00k76p4M39m3l01k4
3300a00K67l5k48J3J83J11l08O0J71j01j85J50J64k2k14%K25j0k48P7K12p8k40
$$ plain form
3142 -50 223 155 -219 -105 202 107 -188 -55 138 106 -135 -88 307 -19 -72 -7 166 -38 -174 -28 250 2
3164 2 -194 -114 215 -16 -153 0 121 -94 -263 -116 234 -121 -192 67 139 78 -120 -5 75 10 -176 -3 257
3187 257 44 -104 11 124 -14 -254 2 230 -68 -151 182 93 -21 -147 128 217 -43 -168 15 88 -85
3208 -85 -84 63 71 -132 -194 134 22 -32 -236 191 181 -117 3 12 43 -76 -75 40 78 -63 -155 252 129 -223 -227 135
3234 135 160 -85 -69 99 106 -185 -215 180 113 -271 -25 363 76 -194 -136 166 89 -301 27 214 28 -152 49
3257 49 206 9 -144 10 186 -110 -182 -80 285 48 -339 10 291 -141 -209 70 324 66 -104 -48 225
3278 225 -131 -358 84 140 -132 -203 139 117 -115 -226 83 194 -46 -138 79 179 -97 -171 268 225 -76 -100
3300 -100 167 132 -116 -103 80 191 -117 -57 114 13 -172 -22 142 120 -94 -94 131 121 -127 -50 162 84 -156
3323a56L3K55j09k27K55K32l92QQ0J60q5k29J49J77j68j68K23PK0k01K27J17k29
3346b1j68J40K28j51j40J23M0j49K8Q8J26j60j73J98J46j96p2K39l5K0k03J37
3368D5J33k70r9K18J07j70q2J76J1j19q7P9J21q2k8K09q2j07j15L05j11l4k23
3391b05K17J7j85M0K10J9j82r7K44M2j83J3J03J05k55k1K43j7j36j02L20J0l31
3414a31O2J40J8j34j5K41j79p6k1K68j27j80K7K69r1j95R7K26j79j23l1K30q2
3437A4k15J07L02j23k50R5K56j16j86J61J57j86k34K91R0j73j83K89L2j39k05
3458b16K56J58k02k03K10J98k95j24L08J23l25o7K34J30l38L3K07J14k50j36K93
3479A08K8k66KK24K8k49Q5Q7Rj97R4J88j01j98P2K09k7k38R2K33j29k25O7K81
$$ plain form
3323 -156 -123 132 23 -204 51 283 -109 -101 -21 139 54 -175 -26 151 -17 -185 38 45 65 -136 91 208 -21
3346 -21 -189 -49 179 28 -112 11 51 -98 -70 18 144 -16 -189 9 155 -41 -113 126 91 111 -92 45
3368 45 178 -92 -191 27 134 -36 -118 58 69 -50 -137 -58 63 -19 -47 162 80 -27 -142 163 52 18 -205
3391 -205 12 29 -156 -116 94 113 -69 -166 78 120 -63 -50 53 158 -97 -118 125 108 -28 -130 190 200 -131
3414 -131 -69 71 89 -45 -60 181 2 -74 -95 173 46 -134 -107 162 71 -124 -27 199 20 -103 -134 96 14
3437 14 -201 -94 208 85 -165 -70 186 70 -116 45 202 16 -218 73 163 -10 -193 96 128 -11 -216
3458 -216 40 198 -4 -207 3 201 -94 -218 90 213 -112 -179 55 185 -153 -120 87 201 -49 -185 108
3479 108 136 -130 -128 96 124 -125 -40 47 56 -141 -47 141 40 -158 -86 123 96 -142 -50 183 54 -171 -104 177
3503A77j26j95M2K75j30j78R4J77j45j57J51J22q4j85J75P3o1j69K26L4j49p1
3525a04P6Q8j13m8J28N7j17n2J99j4j37o4J64J2m7j18J17M8r0j64J60P4j30l4
3549a09J52O1j68j9R1P3j47n8J40K0j24m8J37O8r6QN3R3j69n7J30mr4pJ89q9j25
3576i9mK47J1k02o6J16P7j40J7J67qj73M5J42r8j43Q1J35n9j73L4K32m9k23M6
3601h7J70m3j35J11J21j57j48N5K69j62m9L2J73j44j49P3K30j50p0J7J39j07j63
3624a74K21M8n4j51R6N1m7r7Q1K07k10j55K03R9j81K6Q4P0j28j40J75J49j45k07
3648a79L14K9j94r1J65L0j79J5J64lj25m7J98j1k01N9J12rj48M6J59K9k62L4K19
3673A24j0k16M9J05Qk30R5J01M0k16J47J28q1n8q4J49L4j68R0J48q8k67J08J90
$$ plain form
3503 177 51 -144 -102 173 43 -135 -41 136 -9 -166 -15 107 23 -162 13 86 25 -144 82 116 -33 -104
3525 -104 -28 60 -53 -101 27 84 -33 -85 114 100 -37 -101 63 75 28 -90 27 75 -15 -179 -19 55 -75 -109
3549 -109 43 104 -64 -83 8 81 -66 -124 16 36 -88 -136 1 69 -27 -19 34 127 -42 -99 31 27 -67 -74 115 26 -99
3576 -99 -103 144 155 -47 -113 3 80 -60 -43 124 116 -57 -12 130 32 -111 -30 105 46 -127 -93 139 90 -133 -87
3601 -87 83 40 -95 16 137 -20 -168 -113 156 -6 -55 -23 150 6 -143 -70 160 10 -60 -43 96 -11 -174
3624 -174 47 95 41 -110 -14 37 -10 -107 -26 181 -29 -184 19 118 -63 -37 47 117 -11 -151 24 173 28 -179
3648 -179 135 164 -30 -121 44 74 -105 -90 74 71 -54 -101 97 86 -115 -56 56 47 -101 -55 104 133 -129 -95 124
3673 124 114 -102 -53 52 60 -170 -75 26 66 -150 -3 125 44 -14 -98 51 85 -83 7 155 67 -200 -92 98
3697I8j20j97J22J27n1j25N9K59k14o6J35P4p0j07O3P7q6j32Q3J47r7j03J29J21
3721A26j40j24K16Nm5j36J53M4r6k6k4J60j15o7J13M8k45J06P1L5o6m0Q0M8j57
3746g6P8J09k2j60MN5P9j39K8J12Lj21m9J65j5j57%J75J7j76j0J67M2k04K1K11
3772A37l9j69lJ44n1j99J56J40j08k3o5J91j78m1N4J10pj81J34R1p6j18L7J92
3796A28j34j05J04KQo6P0J74j21j54J27R6j50j42J75K5j03o4J51J13r6j41J35
3819C2K4r9j2R2R1j38q3Q4R5k22O3J94k7j32j06J81N8j42n5J78j2j82MJ71J5j29
3845e7N4J41m6j65N2O1J9j09k1J28J8j12r6K01Qj36L3J07m3j07j3R1N0j35L5J33
3871I1r9r7J00R0p1j06P5J02j51j24J88J29j04r4J22K2j27j04Q4J96j96qQ7J00
$$ plain form
3697 98 -22 -219 -97 30 -21 -146 -87 172 -42 -108 27 101 31 -76 -13 64 -22 -154 -71 76 -21 -124 5 126
3721 126 -14 -138 78 83 38 -98 55 99 3 -23 -47 113 -2 -69 44 92 -153 -47 24 59 -7 -47 33 81 -76
3746 -76 2 111 89 -71 -67 -12 67 -72 -44 68 71 -50 -99 66 51 -106 -106 69 86 -90 -100 67 109 -95 -74 137
3772 137 98 -71 -74 70 19 -180 -24 116 8 -15 -80 111 -67 -108 -54 56 49 -132 2 93 17 -101 -64 128
3796 128 -6 -111 -7 -5 3 -63 7 181 60 -94 33 129 -21 -163 12 37 -66 -130 21 134 38 -103 32
3819 32 56 -43 -55 37 128 -10 -93 -9 86 -136 -73 121 94 -38 -144 37 95 -47 -102 76 64 -118 -114 57 72 -57
3845 -57 -3 138 92 -73 -21 40 59 -50 -71 57 75 -37 -133 68 76 -60 -27 80 37 -70 -83 8 58 -77 -42 91
3871 91 -8 -105 -5 85 14 -92 -17 85 -66 -190 -2 127 23 -71 51 73 -54 -158 -74 122 -74 -82 5 105
3895A05j51Qk3J08o1j00N0J54j63n4K86l0j64q3J38M0n2r9J04L6j07L4K3R7j20
3920b4q3J33J14j93L2O0Kr5q5K13k6j16nJ94q9k0j41N4J24j83K3J53K8j61K8J06
3946D3k3M7o5M7m0j04J27n0o1j9O7Q9Po2K0N9m4j00J10L5j16m3J18l8N5j72R2
3973b1R6j24n9J09J4l0l2JJ38q3r9O0J54k14J2J68j35J23j93N4J66j13pM1M1j04
3999c7l3J04l4l1j18K18K2n4j20P5O3j46Q7J01r5J4r7N1P2j70J62pJ00j13j41
4024a27J54M4j04k4J26m3j22O3R6l1q8m3J91q3m9J5P9q4m3J0J91m0k31K2J25K7
4050C1r5Q2R5q6j51J16R6n3j09KJ20m1q9O6R2j58j0R0P7j14j10J26K1l3L5l3J38
4077A05n8j28Q8J32j71l2J12O9j86Q5k5L5n8j53K24N4j01o8Q7L0j10L3R3J9j02
$$ plain form
3895 105 -46 -38 -61 47 -14 -114 -64 90 -73 -127 159 129 -35 -118 20 60 8 -91 13 49 -58 -24 -1 96 -24
3920 -24 -107 26 140 -53 -21 39 41 -54 -139 74 48 -68 -73 121 32 12 -129 -75 49 -134 -111 42 70 -91 -63 43
3946 43 20 67 2 49 9 -95 32 -18 -79 -98 -31 58 65 3 23 82 38 -62 48 83 -33 -76 42 4 59 -113 -21
3973 -21 75 -49 -108 1 15 -15 -47 -46 92 9 -90 -30 124 -90 -78 90 -45 78 -115 -61 105 -8 -15 26 67 -37
3999 -37 -70 34 0 -31 -149 69 91 37 -83 -8 55 -91 -4 97 2 16 -81 -30 42 -128 34 27 127 14 -127
4024 -127 27 71 -33 -57 69 26 -96 -33 63 32 -56 -99 92 9 -40 -25 54 -30 -73 -63 128 88 -143 -121 4 31
4050 31 -64 18 113 27 -124 -8 88 35 -74 -72 48 7 -82 -16 76 -82 -92 -2 75 -39 -149 -23 -2 -35 0 -33 105
4077 105 47 -81 7 139 -32 -64 48 117 -69 16 -9 26 -32 -185 39 93 -8 -76 11 41 -69 -36 57 76 -26
4102b6M5O9j6p6n8J12l7ln8J11J3j37J1P9M1j05PJ20n2j14R2J16j18q5OJ01m3
4129ej19j3J44N3r1J5J04m7k5o6J00p2r8O1J02o4k2P8jK6j66J26N4m6j20O1J1
4156b0M2k6J4L9j42J2J00Q3q1l6LM6k7r9J14N0p6j12J81K2r0j86K25N3j41kJ1
4183d3Q8n4L5N0Qq3j60J91J9p4J6l3Q2Kp5P7q0l7o1J68j9o4o8J05J1p2k3Q6O3
4212E5r1qQ1L3j16oJ00J3o5J1j0J6l3J6M0j3j38J23K0k9o3R4J1o1J9m5Q8Pj79
4241a30J10Q8j0k15J98M5j58P6nO5m6j38J30J7j3j08J25N7o8l6PO5p5o3P1O9m4
4268A4n5R5Kp9m5J08M4j17n3J53jj52J8J32j4o5r1J19J1r6JJ44n2n6m8J18J8p7
4296b4q5J29K4k2N4l9jj46kR1J2k3K3R4p0j48K04jo8q3k8J99n2l6n0K7o0k6J31
$$ plain form
4102 -26 19 88 72 -4 -62 50 13 10 -48 63 76 -61 -50 29 70 -35 -28 92 40 -74 18 134 16 -69 -63 38 -5
4129 -5 -124 -137 7 60 -31 -16 88 41 16 -50 50 -22 -120 -59 43 -21 -43 35 34 60 -106 20 74 28 -92 -31 -20
4156 -20 22 -4 10 49 -93 -81 19 102 21 -15 -12 34 7 -92 22 72 -4 -116 65 87 -3 -189 36 89 -52 -54 -43
4183 -43 45 -9 26 76 84 1 -159 32 51 -23 -7 -40 42 44 -31 46 -34 -71 -132 36 17 -47 -115 -10 1 -71 -94 -8 55
4212 55 -36 -44 37 70 -46 -52 48 61 -4 7 -3 13 -20 -4 36 23 -115 8 28 -1 -64 30 41 -20 -1 -46 42 49 -130
4241 -130 -20 68 58 -157 41 86 -72 4 -1 64 18 -120 10 27 14 -94 31 88 20 -16 -9 56 -19 -82 -11 58 14
4268 14 -41 54 56 -23 -68 40 84 -33 -86 67 66 -86 -68 64 50 -15 -106 13 24 -72 -71 73 21 -35 -83 35 53 -24
4296 -24 -109 20 44 22 76 37 36 -110 -112 -21 -9 -32 -9 85 15 -133 71 70 2 -81 -109 90 38 2 -48 -21 -81 -107 24
4325B4k4L8j24j9J23q0nJ2J59j53l4N5Q6m8j32J27R3r7l0J4J03q0o4j29J73Pn2
4352e7J05k0n5l8Q5jl2n9J65r3L2n8P8j7j38K9J34m2pj24J20L5q7K6P0K0r5l9
4380f3J33p1l2m0O3M6l2mL6o4k8J04o0kkoL1K0l3o1P6J12j70J42p9J8q8l4J54
4409F6m6r9N3P1n4q6Q8N8q6K0m6J78j05o1O8N1n0j38O6J65p3j34J25P7mj98J24
4436C0J9j00O8RM1K1j25O5j8o2N1Rk4Nl8L2K0J1m2Q5p0m9M4oQ8n6l8nQ5p7n2J65
4468H6n4n9l8Q0j9M9r1J11p1j4K4MK0r0N2K1O6m8j50J65M2j25nLP2j4m3L5krq2
4499h4J85p1j6lN1o6o5O5J36j45r0J53L%k6K2J0J3j95M6J53k6j43J21M0J1l4m3
4527Bj1M9j49J03R7j05n5R5p7N0M9l1R9k24M6k2R9n5oR0K9o5k7M7o0N0n5J4Pj17
$$ plain form
4325 24 0 38 -86 -105 18 -62 -67 -55 104 -49 -83 -28 58 10 -122 5 98 1 -29 -15 88 8 -56 -185 -12 -5 -57
4352 -57 48 28 -27 -65 20 19 -13 -72 93 0 32 -26 52 35 -103 -74 60 18 11 -113 7 42 -45 -19 51 71 -24 -63
4380 -63 70 -1 -33 -73 -10 36 4 0 36 -28 -56 48 -12 -14 -16 -22 9 29 -4 -65 11 123 -47 95 16 34 -54 -88 66
4409 66 20 -79 -26 45 -9 -95 -7 51 -35 -15 -61 117 12 -49 19 70 20 -118 -52 113 40 -94 31 108 104 -94 30
4436 30 49 -51 17 26 67 88 -37 28 10 -52 -1 8 -16 -11 -49 -17 3 14 -28 57 -13 -62 -18 -24 64 8 -30 -35 50 -27 -79 86
4468 86 32 -27 -65 15 -4 45 -46 65 -6 -20 4 8 28 -62 -10 11 77 29 -121 44 86 -39 -44 -41 31 17 -26 9 7 -2 -84
4499 -84 101 30 14 11 62 -4 -69 -4 132 -13 -103 50 53 53 27 49 59 72 -123 -77 76 50 -93 28 68 79 45 2
4527 2 -9 40 -109 -6 91 -14 -69 26 -51 -1 48 17 116 -108 -62 -84 15 -40 -46 44 73 8 -19 28 -32 18 -37 -23 -16 -133
4557a33J31l3M4M8j53J51l0j7j09J64j02kM2k0K0k5J2J3j4M6q8J29j7p1o0O9R2
4584H7j68M3oJ31j42QJ52q2n8J45j38N6k2j7J01r1%j2mo2R0ppj1j5N5mJ0q8M4
4614a2Rjl0J15n4p4l2P2J42j15N9j28K08k07mO8l2L1m2j1Q5p1o3Q3M9j3m8j04
4642a20J71k7j8L6k1m4rL3Qmq3O4l6o0J05qk5PJ16Lk19J24p6J72m4o7j6R1l2j1
4672A0mJ4ro7JJ53j08l1O8m0K2j08P7O2o8K1j08J17mL2n9J60j14L4m1jj5m3Q0
4701C1k8l9P7j03Q5p5j2J95j45P3j07J9k3J03j10jnJ53o2Np0k3nK0M9k1L7R7p5
4730D0p2K2j8J9m7K1M7J8Jk4J08q6r9Jj0J16j00j7K41k25l0O7M7N7j80M7k6Q1
4758aj14J8J51j69L1J20J2j4k3r0O3P2j40Q2K0O7j26p6J87j2r4j7m8J42j61J7
$$ plain form
4557 -133 -2 -35 9 57 -96 55 25 8 -101 63 -39 -41 1 -19 1 -24 -12 1 -13 33 -55 74 57 -14 -74 -5 87
4584 87 -81 -38 -44 87 -55 -47 105 23 -35 110 -28 28 6 -11 90 -1 -1 -13 -17 -79 11 4 -3 -14 -29 26 22 32 -56 -12
4614 -12 -3 -4 -34 81 27 -47 -79 -7 135 20 79 -49 159 -48 -52 16 -16 15 -27 -38 47 -24 -87 -4 45 32 -16 -120
4642 -120 51 24 6 42 21 -23 -32 1 9 5 -78 -14 -50 -110 -5 -13 -38 -31 85 88 -131 -7 -83 89 45 -22 -38 53 21 10
4672 10 6 20 11 -56 -55 98 -10 -41 27 -13 9 -99 -22 40 -28 -7 -115 2 -2 30 -29 131 17 51 10 9 -6 -49 31
4701 31 3 -36 41 -62 23 -52 -64 131 -14 59 -48 -29 -52 51 -59 -60 -65 88 26 31 -39 -62 -67 -47 2 -19 18 115 40
4730 40 -32 -10 -28 -9 -56 -35 12 30 31 7 115 29 -70 -69 -79 37 -63 -80 161 -64 -94 -27 20 77 -103 -56 -82 -1
4758 -1 -115 -97 54 -115 -84 36 48 34 11 -79 -16 56 -84 -2 18 85 -41 -117 70 58 -36 -53 -101 41 -120 -103
4784a03R3j8kJ02J6r9l6J39k01P0j23J75L6k5l1L9k9J6p2J38k5j28L9NNk4O8n9
4812c4P7l9o6l7L5R4O8j36J11n5l0P8k6j47J10k1M4P0j10J36kj90L0L8J05j31
4838b8J23j14M5l0%ml3k6J6J21j29L9R4p8n7J07l4j5p1J55j14J6N1k2O2%q5r6
4866a07K04p2L1j03L7%P7j49Q5k8QK0nM7m3P1p8P0q6P4k6n6o9J14R0q8l1N3N1
4895I1j69J33l7r5O5Jo2M2M7LOr1J22L4Mp4J05j48Nm4J20j16K9Lk0N5o0Q6m6J18
4925A07r8m2M3R2j86J85l2m0J0L9m9k0j0N8qj70L0P2M9r9KJ62n9j2J03k38J83
4952G2j02l5lO6r2J30l1Q7j85J42p7j2J52r1l8N8l5L5M4j26R8j22O6qqmJ43j12
4980A2ljMo2N5M9k4OM7j06K8j0JO4k0o0p9J82m2k4j4n0J12p3Q3Jm7r5n1J32M9
$$ plain form
4784 -103 -10 -28 -30 72 88 -11 -47 92 -109 -39 -162 13 49 24 -7 32 3 19 -53 85 60 -68 -29 -24 -19 -43 25 -34
4812 -34 43 4 -62 -99 -64 30 98 -38 73 18 -12 66 40 -107 3 -18 26 96 -14 122 120 -70 -40 -2 103 -28
4838 -28 95 -19 26 -4 -4 -8 -41 -67 -51 70 -59 -20 74 -4 -61 46 12 -3 -74 81 -33 -17 34 12 74 74 -11 -107
4866 -107 97 25 56 -47 -10 -10 67 -82 3 -25 -17 3 -2 45 2 73 -5 65 -21 53 27 -29 -98 16 106 18 -13 40 91
4895 91 -78 55 18 -77 -12 -11 -73 -31 16 19 25 -66 56 90 94 20 125 -23 -18 -62 58 -58 -29 -26 -46 9 -51 35 -11 107
4925 107 9 -33 10 102 -84 101 69 29 39 78 29 9 -1 57 49 -121 -91 -19 30 -69 -67 95 36 24 127 -111 72
4952 72 -30 -65 -68 -2 -94 36 5 92 -93 49 -28 -40 112 21 -17 41 6 41 85 -41 57 -65 1 -7 -15 -19 124 12
4980 12 9 8 12 -50 5 54 30 36 83 -23 5 -5 -4 60 40 -20 -99 83 41 17 3 -47 65 -8 75 76 29 -66 -117 15 64
5011F4j76M3N7k2m9N5Q9j71J11Rj31k8K06l4j6m5rj3p9J39p9QJ51j07j5M2j7M1
5039B4N7j38M7Q7j42Q2nq4N7M0K6p1j6K1k9J39j49J07r2M7k3O1n2N3q8M6MJ2m4
5068b3jJ37j59J10p9L6N6j23l5N6N4n2N8O2j74j1N5R4j0j84J70o7M3P2p5K3M5
5095G8p4N9j86R7M8P6N9o3j29l9K51j64n2m1R6k8M3Q3k12J43J6k1n9k6oJ96p9
5122F6m0kk2K9o1l9J29r3L0J1op5J1J9L5R8J2J6j16j47J55O3n4l6j9N0j0P1m7
5151B8p1N9L4n7L8K5o3j3R1o5Nn4O9M7j31J05r0J1L0L7j03M4r5J60o1K7p5J28
5179F0j11P7j50M5M7N1n4M1l9Np4J52q2qj4L7N2l6J1Jjmk9L8O6m7m7MJ11k35N8
5210g5Q9n9k1l0P9L7m4O5Lq9L7R8j88Q4O0pMl9M5m4m8J58r7J1j15O4O8l0j9j03
$$ plain form
5011 64 -112 -69 -12 -34 -83 -28 61 -110 1 10 -121 -149 57 23 7 -38 -47 -60 -139 0 -79 -71 80 -27 -42 0 -17 24
5039 24 81 -57 -10 77 -65 17 12 -72 -15 25 51 -20 -36 -15 -44 95 -54 53 -39 8 -15 46 -6 47 -41 5 9 21 -23
5068 -23 -24 113 -46 64 -15 21 77 -46 -81 -25 29 -23 35 97 -77 -88 -33 61 51 -133 37 -30 13 85 10 33 78
5095 78 4 63 -123 -26 22 98 157 94 -35 -74 177 13 -39 -80 16 -12 31 114 -98 45 61 40 -19 -45 -51 145 66
5122 66 26 24 2 31 -30 -69 60 -33 -3 8 2 -73 -62 -43 -8 90 102 118 2 -145 10 73 19 -17 -36 14 4 75 28
5151 28 -43 16 50 -7 31 56 -7 -20 71 6 11 -43 26 73 -58 47 -43 -32 -2 35 -68 -24 -119 41 -20 7 -68 60
5179 60 -51 26 -124 -79 -32 19 -35 6 -33 -28 -102 50 -32 -40 -54 -17 35 -1 10 11 10 6 -23 15 81 34 -13 -9 102 -133 -75
5210 -75 14 -45 -66 -96 -17 20 -24 41 44 -45 -8 90 -98 -14 46 39 43 4 49 5 -43 115 18 29 -86 -22 46 16 -3 -106
5240a06J92q4m7%n7J26m5N1m9J22j32lO5j12K2J1q2J05n7L0O6l5q7N1Q2j07P8
5267bp7P3jM4q0q5J64jM8j40R7k8j4m0LoQ5q7l8J21k8l1K3M6n8K7q0Q9qj3JJ5
5299A9j3J9M9j08K3n7m1J55l4o2O2K6n2J4j4L2J6o1N0k2m8J09n7L9l5p7R0J5p5
5328c8J9Qn1O2j9KP9j62JJ31M7l8j01J13q4J3MR1p1p4M6oN4k8M4l8K3n7O7r9Q3
5359B1p5J8J03p8l9J63p8M1j18M6j9M1M8r0l1Q7K5j87J02mK2lJ2mqoj0N0N2j20
5389c9P8j8j42J17L4J1j01Q4%l0m9RM3K4j9r1P4L1k8j5o5O4M4k8L1j9L4%n5N0
5419B9m0j3K6j8m1K0J8K6n2Q7j37J8J30l3L1n5K8j5n1L3K6m8J38p8l5m0J63j61
5447d4O6J1q4LJ5J56j21j00P3Ql1KK5R5p5m8k1J27n7P4j25M7p6J27l6K9l9p2J09
$$ plain form
5240 -106 86 2 -45 -45 -102 24 -21 30 -19 103 -29 -32 33 -79 -57 -46 -128 -23 -80 -50 16 -19 -106 -55 27 -80 -2
5267 -2 -79 -6 -7 37 -43 -128 36 35 83 -57 40 12 -2 -42 -39 -45 40 -47 -85 36 8 -23 0 46 -12 15 -65 24 16 3 4 19
5299 19 6 25 74 -34 -11 -68 -109 46 12 -50 12 38 -14 0 -14 18 34 -27 23 1 -47 62 5 44 9 -68 22 37 -38
5328 -38 -19 -11 -62 0 -19 -17 62 -100 -99 32 79 41 -60 53 -31 -18 -14 77 6 -68 -22 -28 26 -2 42 4 27 -30 37 -62 21
5359 21 -54 -36 67 -11 -50 113 35 76 -42 4 -15 26 74 -16 -47 40 65 -122 -20 -24 -2 -5 7 3 -5 -11 -21 29 81 -39
5389 -39 39 21 -121 -4 30 41 -60 24 24 -6 -55 -46 -3 21 2 -89 -15 16 -12 -27 -92 -28 16 -12 19 0 34 34 -21 29
5419 29 -11 -24 2 -16 -57 -37 -19 7 -45 42 -95 -77 53 20 51 -4 24 9 -42 -9 17 -31 107 29 -6 -46 117 -44
5447 -44 22 33 -51 -48 -33 123 2 -98 -25 -17 -48 -46 -21 74 -1 -49 -70 57 0 74 -51 -4 -80 47 11 40 1 -71 38
5476C8o1K4j32lK03j17MP0p6pO3K0%O4j79M4J29o2J2j30M1Q2o0L9q6R5p7N9n4
5505e7j4M4k5L8M9o3J9j0K2q0j6J42j5pr0P4rK0p4P4q7L4Q9j04J7K3m8P6m3m0
5535f1J35j01n1M8k1J11mj11P6lp4m3M3L6L3qP3l2nRr8mO2k7j7k3n9R9N2J17l4
5566A18k58J74O2m1p6K0k3P3o2M5r8P2m4l6Q9l3OO6m0rM7jKj37J15OM9k01J31
5595A6m0l5P6J5K5q4j2k6J27q5j5K4J06j27J1j0P3k6J2n3j1L3M2Mo9%mpP0N7j13
5626b6R3pn8M9o9O0p6K1j4nN5k7o8O7j12J14P2j06o8J08M7m5k8K1K6m4J8%Qk2
5656a6o7R7J8j3p6Q4n1oJ4k8J8J39p3o3O7m5j1J3N6Pmo2m0L6RO6k5N8j23J7O3
5687E9j5o0K9L0jj18Q8p9LN3m2J09l3r0P3P7o7K7k0K5q3K8k4N4p0M2p6P0m2J10
$$ plain form
5476 38 -23 1 -131 -134 69 -48 -44 26 -50 -57 6 26 26 90 -89 -45 84 22 34 -96 -55 27 -33 6 -80 15 -62 -3 -57
5505 -57 -71 -27 -52 -14 35 -28 -9 -19 3 -77 -93 49 34 27 -63 11 2 22 -52 22 -65 -31 58 -46 -29 -6 -54 22 -21 -61
5535 -61 74 -27 -78 -30 -51 60 56 -55 21 18 -56 -99 -56 -20 13 5 78 46 41 50 -48 -52 10 -17 -34 -57 -116 -17 35 152 118
5566 118 -140 34 96 55 -21 -1 -24 49 -13 32 -66 6 -38 -74 15 -18 -12 54 14 5 52 51 53 -84 31 37 86 -115 16
5595 16 -24 -59 17 32 57 -27 -39 -65 62 -23 -38 -14 92 -35 -24 -34 39 13 25 -28 -39 -6 36 40 -29 -29 -33 -40 30 87 -26
5626 -26 67 60 2 51 -18 42 -34 -13 -27 -32 23 -4 -72 -5 -117 -3 69 -37 -105 3 50 5 -23 -2 24 -20 -2 -2 6 -16
5656 -16 -83 14 32 19 -57 27 -24 -30 -16 -44 -26 113 40 -23 44 -1 -12 1 57 64 60 -2 -42 -6 3 69 44 102 -21 -4 59
5687 59 44 -16 13 43 42 -76 12 -67 -64 -11 -53 56 23 -67 6 83 16 43 23 48 -35 -7 -31 23 -47 -5 -81 -11 -53 57
5717E7k2q0KJ7O5j49R6j6k0Q5qj0J0pj0N2o2n5J19Ok9k8%Oj7p9J24j30R8k1Lj1
5749a4K8j11J29Lk8j3l1R0n8J6%J5k4n1N7%q6J16j8L2Q8j86O5j9P6j8m9J7q0O0
5779FN0j22J06k5j15R5Oo5J08Pj14J9l7KJ23K5r1J28j26K5p8J31o6PJ7p7J74j93
5807h0J65j29J70o5L2j12Q1j05oL3R6r0j1R9j34J56j34o3J44k0m9l1L8J2j3J5
5833ak1m7J14n7N7q1Mj0N7p0P4n8Q0l6j00J95o3Mk8O4r0L1m5Qqk5R2n8J70mj81
5864c3m2L8R0p8L5M7j21J07M3l0n5n6O9q0N3P2l2r5J92pq4R8q3l3n6J2k9J12K
5893E6k2o9o7Q7l0N5Q3q9j6N9l7nlKr3P3l8K1kJ15j76R3K3jj33Q5P2O9j87N1P1
5924D7Qj39R4nL7n2Ol6Q1m4P2j45%M5R6l2n4l1M2P5k05K21r5OQ9j5j04P9j34O8
$$ plain form
5717 57 35 -45 -43 -26 39 -110 -14 -30 -50 35 27 17 27 20 10 62 0 -55 64 70 41 13 13 19 2 -77 47 -83 15 -6 -3 -14
5749 -14 14 -97 32 35 7 -6 -37 53 -5 11 11 26 2 -49 8 8 -78 38 20 52 140 -46 19 0 76 58 9 26 -54 6
5779 6 56 -66 40 15 -100 -5 1 -64 44 51 -63 -44 -81 -79 44 69 -22 106 -20 5 -73 58 -8 -1 16 -61 113 -80
5807 -80 85 -44 126 61 93 -19 62 -43 -49 -16 80 -10 -21 78 -56 100 -34 -97 47 27 -22 -53 -15 -3 -16 -1
5833 -1 -22 -69 45 -12 45 -36 -32 -42 15 -55 19 -39 41 5 -95 100 37 41 13 77 -13 18 -27 -19 -27 -52 40 -18 152 148 -33
5864 -33 -75 -37 53 -25 10 57 -64 43 86 56 1 -55 14 -66 -13 59 27 -68 124 117 33 131 48 15 -41 -29 -58 54 56
5893 56 34 -35 -102 -15 -45 10 93 4 -12 47 10 5 2 4 -89 -16 -54 -33 -35 80 -96 -3 20 19 -114 -29 43 112 -75 -24 47
5924 47 55 -84 10 5 42 -10 -4 -40 41 -3 69 -76 -76 -31 65 33 -21 -52 -10 65 -140 81 -14 -8 81 66 -38 41 -93 -25
5954b5LJ04o4j23P1M0J6Lo7J48n9j04J9J0M6rL5n3M9j6n4O8J7p8j5rn1J21j8m
5984AM7o2k0O8l5K9L8j29R8p0J6nL8J8rko9Q2j7m0k6PP5j6k5l1L4j5J0J8Jj6k3
6017c0L9n6N3Pl6J4Jl1k5P4Kk5j6RM9m3L8K3l5qrJ4K8p4K9J1Mk2J9j9j0RK3OK
6052A5j0K6%K2r3mJ13r4PJ1jJ1qL5o1J6J4k4L0K7o8k2L0j8N2n3LO0k6J1K0ok8
6085a3j9M0J1p9N3pk4K0j8M0OK0l8N0m1kj4J6Oj3Rk0K5k7L1l0M2m3L0l0K4m3L
6118c5K1j3L1k7L3n7L3Jj6L0j0j9N1%m4K7k7rK2qN9p3jK6oJ5KJ7k6L1q1M2J5k8
6152b4k6L9j0oO0m0l4M6l0J5k3OK2k5M5k9K2j1K0o3RK6qL3k7k0rK3mJpK5RRRk1
6188BQk7K2ql0J7Lj1%m0R8m7rM8l1lLK2m8M0l3L2PKj2nk2K0k7N5m3K5j6LknM6
$$ plain form
5954 -25 -22 82 18 -105 -34 6 22 25 -42 106 47 -57 -38 -28 18 9 44 -9 40 24 -30 38 55 -23 -38 -47 -98 23 5 1
5984 1 48 -14 -34 34 -1 28 66 -63 35 -35 -19 -24 14 32 23 21 -48 34 17 -23 -49 -42 33 17 -8 -39 -5 -20 -10 8 9 -7 -30
6017 -30 9 -47 6 13 -23 -9 -8 -39 -64 10 12 -13 -29 -20 29 -14 24 47 12 4 -5 9 37 -37 -8 3 7 -15 4 -15 -25 -16 7 13 15
6052 15 5 31 31 53 -40 -44 69 -25 -18 -7 -8 3 -5 30 -31 -15 -1 -25 5 32 -36 -58 -28 -46 6 -47 -44 16 -10 1 21 15 -13
6085 -13 -32 8 19 -60 -7 -14 -38 -18 -36 4 10 30 -8 42 1 -1 -15 1 7 -6 3 -17 8 -19 12 -18 24 -19 11 -19 5 -38 -35
6118 -35 -14 -27 4 -23 10 -47 -14 -13 -29 1 -9 -28 23 23 -21 6 -21 -30 -8 -16 43 -30 -31 -5 -11 4 6 23 -3 28 -53 -11 4 -24
6152 -24 -50 -11 -21 -27 33 -7 -41 5 -25 -10 -33 -27 -5 -30 15 -14 8 -3 17 -46 -37 -11 -19 14 -13 -33 -42 -19 -23 -22 -29 -4 5 14 23 2
6188 2 10 -17 5 -3 -33 -16 -13 -24 -24 -64 34 -13 -22 26 -5 -8 -5 17 -31 9 -24 8 15 17 5 0 -22 -2 -29 26 -17 8 -8 -5 -7 -12 34
6225C4k7j6kK0l1N1n0k0j1K4npK6j5O3j3m5j4j1L2N1n0J1j6O7m9l1N5m8L2j5K1
6257A1Nj9K8n2K1K0j5LRK6p8M9k6JK7l1K1%j9L2k4l0M8j9K4ll8NO%J0k2M0l0J
6292a9J9poJ1jk0J1LkOj4M2n2J5lJ8k6M4pj4l5O0n0QJ2J3kj4J4l1MK4n5O4L0o2
6328b2K2j1oJ5Kk6K4oNLj2J4k7%NL4J3m8L8k1L1k5j9J6J5j6j2QOJ1krm4O0l6J2
6364hoOJ8j2Km3N4k4%J3k0QJ6kk2M2j5kJj6PLRj6PjK5k8MK3n7QK0j2MrRJ7J5k4
6404fpJ4ql3K9J0Jj5M5l8Rk4pM3rK7k5lj9N0n8K1j3k3N9j5k3J8mJ9oQk0kOPj5
6441gLj6OJ4j6jQQn0mO0kkqQk8jJ6J2Pj1%J7k4j4K2JK5Lm9J3oN0k4k6K9l1NK0
6480GK6l6qOK3o8O1l5N1Rm0oJ9n7j9O1oMj7J2K8qJl3O8o6J1k3L4m1K7K2rk0Ok
$$ plain form
6225 34 7 -9 -11 9 -22 29 -21 -41 -52 -28 -33 -40 -14 -29 34 21 -24 -38 -49 -17 34 -16 -5 -21 46 -3 -34 21 -27 5 -10 11
6257 11 16 -3 25 -27 -6 14 -1 2 11 37 -41 8 -18 -17 10 -21 0 0 -19 13 -11 -41 7 -12 12 9 -29 -24 -18 -18 -8 -30 10 -20 -19
6292 -19 0 -7 -13 -2 -3 -23 -12 -9 -11 -5 -19 23 -29 -14 -17 1 -25 19 12 -2 -37 23 -27 -19 -7 6 4 -10 4 -27 -23 1 -54 10 40 -22
6328 -22 0 -11 -17 -2 0 -26 -2 -8 -3 0 -12 2 -25 -25 -20 14 27 -21 17 -4 27 2 -17 -1 14 -2 -14 -6 0 11 9 0 -44 16 -20 -8
6364 -8 -14 -8 10 -2 0 -43 11 -13 -13 0 -20 -12 4 2 -20 22 7 5 6 -10 -3 0 9 -7 0 -1 24 -4 0 23 -34 -26 -6 -18 -14 -23 -14 3 18 -6
6404 -6 -13 1 -7 -40 -11 -1 0 -15 30 -8 1 -23 -30 13 4 31 6 3 -16 34 -24 -3 -16 -39 20 5 -18 0 -4 15 9 17 -3 -5 1 8 -7
6441 -7 -4 -20 -14 0 -16 -17 -9 -1 -51 -55 5 3 1 -7 1 -27 -28 -12 0 7 -4 -4 13 -11 -25 -3 -2 23 26 -23 -10 -16 34 10 -16 13 -18 -13 7
6480 7 33 -3 -11 -5 18 -50 11 -24 27 36 -4 -10 9 -48 -67 -6 -12 -8 -25 -13 15 7 8 -25 43 -23 -12 -35 -1 -42 -15 7 -2 -22 -16 -18
6516a8M9l8J4J9l1J2l8M7Orj5Jlrj4L1kkj9J7Nj3j4J8j5J6J5j3pPl0K8Rl2K9K1
6552B2l6m%J2j3J5kJ7k7J4j8L5j6j2K2jk8L1J0k6m3KM0rK5o8N4ll2K4Q1l5m2M
6586gK8Kn1M4j6J9Nk5L8l4M8l4l6N7l0l6K3j0K4j06R6QlL4p6l9O9M5l0j6J3l1
6618b7kL0l0O2N9j21N6J7m0j7L6q1R4p5nJo1Q3N1%k2PO9r7k2M6J6m1L0l1jk7L0
6651a3n1O1j2L3j37J30j9o0N3Q6j90R9J01m0k5j57J69m2M2J1r0L8k9K2L2J4p8
6678e2L5k2O4l2l8K7kJ3r1Q3K%N7o0K6J8j1n0k2N9m9L8p6J05J7r3R4J3m8j1J3
6709Gl8J09j19Nlk4lN3Q1j24K7j6P9n9l8L8K5n2K9J2n8R0mL7p5O5mr5K4M1n1P2
6741C1q6m0oJ17k1J1j01P9oMl5O3j5M3J6l7m2Nl3N4N0r9O7j7m7P3M0j03O6l7m4
$$ plain form
6516 -18 31 -7 7 26 -5 7 -31 16 22 13 -2 -1 -4 -13 -27 4 2 0 -19 -2 3 -10 -24 -6 -21 -5 10 -3 -10 -3 -33 -5 4 -28 1 22
6552 22 -14 -18 -18 -6 -19 -4 -6 11 -16 -2 -20 15 -1 -13 9 8 -20 11 21 -5 -48 -46 -6 -15 10 -58 -4 -7 -39 -15 66 31 -11 -7
6586 -7 21 23 -28 16 0 19 24 -1 37 3 51 17 -19 38 8 -28 -5 -15 9 -97 -1 7 4 38 -38 -77 -8 37 7 -9 4 -27
6618 -27 -29 1 -29 33 92 -29 27 44 4 -13 23 -58 36 -39 -44 -43 -104 -21 30 30 8 15 84 -13 -35 11 27 -14 16 -15 -16 -43 -13
6651 -13 -64 -3 -15 18 -119 11 -8 -68 -15 71 -119 -20 81 41 16 -141 28 -14 28 39 -51 -13 -42 -20 12 26 -52
6678 -52 -17 -39 25 -7 -45 -18 -20 -7 -98 -15 -13 -13 44 -16 10 28 17 -33 -55 4 -45 -7 -83 22 39 -54 40 53 5 -6 7
6709 7 -31 78 -41 -36 -39 -63 -66 -13 68 -56 -29 -45 34 -25 -63 -25 0 -52 -23 -11 -69 21 17 54 -21 44 40 -55 -31 10 -41 31
6741 31 -55 -95 -101 16 -5 6 -95 -16 -22 -18 -53 10 -5 38 54 17 -25 -20 -53 1 51 -48 19 2 -45 28 68 -35 31 -6 -50
6772e0k6J51k8k6l9oL9J8k2k9JL1J9m4Lm3L2P4o5J4o5M6L6l4O9o3J2N7n6o1k1
6803g6O1j4LM6qL0k9L8J1j19M7J06j44nP7J3j11P6l8L9J7m5J8k2J43j34oJ3K8
6832A5m8N8L6q7K3k2K6m1L7m6P7m9O3n2m6K5O1l3k1RL1Qk1m5M9Mn0P6j01J10k6
6863B0M3Op6Qj0nO5m9p2L6rQ1m2k8L7K1p1l3J09p8M6j8j5L3N5p5j6%j2R4q9Ql
6896c9J7m8P5o0M9k7K7J2j9k8M2M7l1p5rJ12o3M4p7N1M0n7pM3j77K53n9J8n7K8
6926B5Jo2m5N5PP8q9J8j5l8N6K6pj29J16O2j06l6P0m9P3k7J9JO5j2ln4l0M6nK8
6958C9l0ko6L8M4j4K%l4m0P0K0M6p7J9m2k4M2J2o6R0Lm1K9k2J5k2N7o5J5j9l2
6990e5N1MK1k3l7N7l7J9oM9m4J3mmJ0qj6Ok7K9J4k3PPJ0nk1L0j5jj2J5klJ2kr
$$ plain form
6772 -50 -76 75 47 21 -18 -24 15 33 11 -18 -17 14 33 -11 -8 -51 -19 55 -10 4 -61 -15 21 -13 56 -7 5 62 6 -55 -76
6803 -76 -15 -29 -26 20 12 42 13 51 62 -57 -10 96 -48 -53 24 37 -74 2 -36 3 20 -25 -7 -29 114 -20 -26 -13 15
6832 15 -33 25 61 -26 -3 -25 1 -40 -3 -49 28 -21 42 -10 -56 -31 30 -3 -24 -15 16 24 3 -42 7 11 -39 37 -64 46 20
6863 20 63 69 -7 1 -9 -14 51 2 -70 -34 -43 38 -4 -32 5 26 -45 -78 31 -47 -1 -19 -34 -1 54 -21 -37 -37 -49 45 -44 -36 -39
6896 -39 -22 -70 5 -55 -6 -33 -6 6 -13 -41 1 48 17 -58 -67 45 -18 26 -51 0 40 -17 -24 19 -158 95 36 54 -3 25
6926 25 26 -36 -81 -26 -19 59 -30 -12 -27 -65 -9 17 10 -119 -3 59 -47 -83 -13 -62 11 -16 3 4 69 57 54 0 -30 16 11 39
6958 39 9 7 -59 -21 23 9 11 11 -23 -63 7 27 73 -4 15 -27 -51 -9 3 -63 27 30 -11 18 -4 11 -11 46 -19 -4 -23 -55
6990 -55 -4 0 21 -2 -39 18 -19 0 -6 43 -1 12 8 4 14 6 -10 -4 -31 -2 12 -11 -4 3 13 8 -13 17 2 1 -11 4 2 -1 11 9 0
7027@j6J4jK5k1nQKk6K4nmj9J4NPrlJ9roOJ3j3Ok7K8j7LoK2jorJ0jl8M1Mj9nL8
7069B3l8KkK1rJpJ9Jj8rJ5oj5RRj0mPmJmNJ6Kj9J2Qnk3J3K1j1j1PNopJ0JLj8J7
7112BjQmnpK1j8rK1j2MoQpoj5J8%rnJ4J0k3OK5j7j1QmNj0J2J1k0mJ9Oj6MKqqK6
7155Ej9J1j0QLPj1Qj8J5Lj2j3M3k4rRnlK3qj6%MLkj4J9JRl1KJ0OOj2oJ9rqJ9N
7197Hk3K4roj9K0NrKlNRmj6NOl%K1j2j5mJ3lKj2J2rJ5pJ5k5J9j7kMnRpJ0MJmQ
7241Cnk0L5rj9RLJ0qOk4K1k6J4J3k1kK8j9mmK6j0nmJ9j6qqK1J8k6j8J9Llk0L3
7279Bk1K8k8L5k0j6PJ3j1K0k1J7l9M6k3Kj2lK0k8L0l5K2K9J2r4L8rj1K1J4J8o6
7312f3J16l5lor7N5R4o9J9lO0n9n7N1O1j3r8R3o4j4N1Kk0m3J0j4R6m3Ko7M0K7
$$ plain form
7027 0 -16 -2 -3 22 1 -4 4 6 -20 4 -1 -5 -24 -10 -5 2 -7 -10 9 0 -6 0 13 0 6 -21 7 -10 -7 -13 9 8 2 -7 3 2 -36 5 9 -10 -15 23
7069 23 -15 -13 -15 6 -3 -2 -9 10 11 -7 -16 -1 -7 -22 -13 -4 -14 -18 -11 -15 -14 -18 -13 3 5 -14 -2 6 1 -22 -9 12 1 -10 -3 2 -4 -11 -1 0 3 -15 2
7112 2 1 9 5 0 -7 14 -4 -13 8 -4 0 -6 2 -5 -11 -26 -8 -8 -17 -22 -8 2 -21 -15 10 -7 -18 -10 -14 -9 -19 -7 4 -16 -20 -1 5 -11 -7 -5 -13 -21 5
7155 5 -14 -3 -13 -5 -2 5 -6 2 -16 -1 2 -10 -23 20 -4 -13 -4 -9 -12 11 3 -13 -13 -9 -6 -8 -22 -3 -2 7 -24 -22 -12 -6 0 -12 -18 1 -8 -16 3 8
7197 8 -15 9 0 -6 -25 -5 0 -9 -7 -10 -5 4 0 -16 -11 -5 -8 -8 13 1 -14 -18 -5 -8 -6 -18 -6 -15 0 -7 8 -17 2 -15 -17 -13 -18 -9 -16 -6 -2 -1 -5 3
7241 3 -2 -22 13 4 -15 -6 -3 7 -1 5 -19 2 -24 -10 3 -18 -20 8 -11 -15 -19 7 -3 -8 -12 7 -9 -17 -25 -4 14 -12 -30 -11 -8 -11 -31 2
7279 2 -19 9 -19 16 -4 -20 -13 0 -11 9 -12 5 -34 12 -11 -9 -21 -24 -4 -32 -2 -37 -15 14 26 -68 -30 -39 -50 -29 -15 3 -63
7312 -63 53 18 15 9 -88 -33 61 -8 11 8 68 9 -48 3 64 51 -47 46 -18 -32 19 21 1 -42 -32 -46 50 7 9 -58 -18 9
7344Il9j2K5J0M3o4J2m2J5N7k2K8j9M0n7L7k7k3KP1o7PN9rp2L0Mk6K6J8Op9M6
7377a3Lj1N1l3J4pj5l3M0K2r3K4N8k4LJ6Jk1j7M5k3j2jJ4L2m7%QN1m0j6pJ4N0
7411C3n0K0j5J0k6K9K0m6j4j2K9K3rJ8Nm0pN2Oo0P8p5O8Rq4K4Pk8O3k4kjkL8K6
7446F3q0K8J2j3l2kJ2ML4k4J2Rk4oJk1P5l9l9ONk0J8K9O5r6L3l4k3Q8n9%kJ9k2
7481b3qP3jk7jl7J5K4l7rQJ9nj5J%L7n0R9j13K6J1K5l3qLN0J0p6P0l8L7m7L0j5
7516eM3j5Nn6P3l5n2O6n0L7KL4n6ON6m4J1m9rK4k7L0M2ql8qM5J7n7qj7J3K9j2
7550a3K7Lj6Oj0L8Jm9Oj0J7j7K0Nk4jJ8nJ8l4J2J1Mj1j2K1nrPLLj0J7Klk4M%M
7589fmJ0LJ4l6J9Rk7J7j4J3j3kK4Lj0k2K2ppPMmJjKJ0j2jKK2j9j5NJ7nKj0K2k3
$$ plain form
7344 9 -30 -42 -17 -7 36 -28 -16 -58 -43 14 -8 20 1 41 -16 21 -6 -29 -27 44 -23 -16 43 34 -38 -8 -4 -30 -4 14 20 -59 -13
7377 -13 -10 -21 30 -3 11 4 -11 -44 -4 18 -75 -51 7 -17 -14 2 3 -18 -35 10 -13 -25 -26 -12 20 -27 -27 -19 32 -8 -24 -31 -17 33
7411 33 -17 3 -12 -2 -28 1 21 -25 -39 -51 -22 1 -8 10 15 -25 -32 20 26 -34 44 -31 37 46 -38 -14 -7 -35 28 4 2 1 -1 37 63
7446 63 -17 11 23 10 -22 -24 -12 -8 26 2 14 23 -1 -7 -6 -27 48 9 -30 -24 -19 -39 -21 8 73 -23 10 -24 -47 41 -18 -18 -20 -1 -23
7481 -23 -31 42 41 14 13 -24 -9 15 -22 -31 -23 -4 -9 -24 -23 -23 14 -36 63 -50 -24 -13 12 -21 -29 -26 24 34 -42 28 -10 27 -20 10 -5
7516 -5 38 23 28 -28 45 10 -42 24 -26 11 13 47 -9 -3 53 9 20 -29 -38 -14 -41 -11 31 23 -15 -23 22 39 -18 -26 -43 -30 -1 -13
7550 -13 14 17 1 7 -3 35 36 -13 -7 -17 0 -17 3 8 -16 -17 1 -4 14 -20 -8 3 7 -4 -16 5 0 -9 -2 1 4 -6 11 13 10 -14 -10 -10 -6
7589 -6 -10 0 3 17 -19 0 9 -18 -1 -15 -2 -15 -17 7 10 0 -22 0 -7 -14 -7 -3 -7 -6 -7 -5 5 -7 -8 -6 16 -3 -18 -13 4 -1 1 -9 13 -10
7629a0nJL0k1RoNpj0J8j7%kJ8%k2J6J1j4PrQj0j3K5jnk9L2J1K2m6j6L6Nk4K5j8
7667fJ5k8J6j0J8Lj8J1qpJ4J2j1oqJ1J2Ol9J2kj5J00o3jrOL3k5k2mL6n1K0JJ9
7703A2k7RMOk5L8k4K8j9qlM3m2MJ3Ko8O0j8KJ4k4M3m3M1q8N9M0m1rK9nl6J7J0
7738fJ1rj2M2nj8k1J5J7m3J1M3k3k2K4NJ5k2Rkk0k7L8kLNoJ1kl0j3M1lpMk5K7
7775Cj8L3m3K3j3k6O3n4JRpJ1pJ4K0NMj9K0K9o7K9pk8L2k5L8k6QK3n0oJ7L8Nm7
7811a8K4j3Lk1K7Oo0J4M7J9r6N0QMJ5Rm4N2l8%K8k0K5Pk0Mj9kj9k0K2L1o4P4m5
7846c0NJ6l5Q0j68J64l6k6JL1L0m6l3J1L3l9M7K2K3j9n6%K8j2%K0mj5n1L5N1m2
7878a5M5j3k8j6L1J9j4l0l2P1j2j1qN6km6p1J15o4nL6k8m0P2q%qjjL2j9MJ7j4
$$ plain form
7629 -10 -15 -14 16 -5 4 -2 3 -4 -14 4 -13 -13 -15 3 3 -19 -3 8 -6 1 -8 0 -10 -23 2 1 -4 -33 -1 10 32 -14 -30 6 11 -13 12 -6
7667 -6 9 -19 -3 -13 5 8 -10 1 -7 -14 0 12 1 -5 -13 -2 10 16 -23 -11 -13 -28 72 9 8 -1 5 38 13 -9 -13 23 -28 -8 -7 12
7703 12 -15 -6 -2 4 -21 17 -7 21 2 -6 -9 34 -8 -4 9 11 -57 3 -15 -13 1 -23 20 -23 18 -70 -11 29 -12 -21 8 3 -33 -16 -6
7738 -6 5 -4 -16 26 21 3 -18 -3 14 -29 -18 25 2 -20 4 9 24 2 11 9 -11 -38 0 -2 1 6 0 11 9 -21 -34 7 4 -3 1 -24 3
7775 3 -15 18 -25 -2 -15 -41 22 -32 -31 -22 -29 -18 -25 -11 9 14 18 -1 19 48 -19 10 3 -25 7 -18 20 -6 2 25 -25 -31 -14 24 29 -18
7811 -18 6 -7 -4 -25 2 8 -52 -38 9 28 -68 -18 -10 -6 9 18 -26 26 -12 -12 16 -4 21 28 8 12 -7 -9 -28 -48 -26 5 -59 15 -30
7846 -30 -25 -9 -44 36 -132 32 -4 -30 -29 2 32 -14 -47 -36 -3 -42 5 27 50 31 -25 -25 3 -9 -9 11 7 -8 -59 -24 27 -15
7878 -15 30 17 -11 -27 4 23 9 -21 -53 18 6 -5 -13 43 41 -5 -76 39 -25 -30 6 -22 -62 10 2 2 -6 -7 -8 24 5 9 26 12
7912A2J2k7J5l2P1q9k7N8kn7Q9km9L4m5P2J2o3N2%o6K7O0p7O8n7k2L2k2j4L6o
7944gN2p4J1K5k9%M4k5l2l0K5m6R6K0Rl2k4N8o6J9j1qrL4M1j6J5j8j6lj2J9j9
7977iMjL0p1L6POj7Nj4J8K1l6k0L7j0KoKrK1J0J0qo6N0j7OJ4j1M7p5L4J6kKk1
8014a5J2k3JlJ0J8M7j1l4J2k4j8L9J8r2N8j9M2l4J6L7n1J0j7O7m8k0K0K8j9k2
8045a5j3N3n2J7k9PL7L4RK6p2J5l9JL5l2Kj1J9M1J5p6%L8l6L3k7kM4k2j3Mj5k4
8079d8O5m9K7k5M0m7N7j8l9L3J9k5kL4k9mj6QjK5j5mKK1Lkl3K7k0Mlmj7N1j5k
8115bm0M3Pl0L9%L1j9m5j9O2k9j5J6k3K8JPoj4nJ2jqJ5lMj0mJ3Nk0j8L2J3k4r
8152a6K3l1L8n3K4O%jMpj7K3kJ8m7L8J6k6jQL3k1k7%mO6o0J5k0K1ONj3j3j1K7
$$ plain form
7912 12 24 -3 12 -20 51 -38 -65 -7 -9 -66 23 21 -28 6 -39 33 45 -18 34 34 -32 -5 55 -22 46 -11 -33 -1 -23 -37 -1 -7
7944 -7 45 -29 -18 7 -22 -22 22 -3 -35 -65 -40 -86 10 30 39 7 -17 41 -25 -6 -17 -25 -34 0 41 25 40 22 6 3 -9 10 -9
7977 -9 -5 -6 24 -47 -11 -4 2 -15 -10 -24 -6 15 -21 -41 -4 -14 -12 -18 -16 -25 -4 6 16 8 -58 -8 -25 -19 -5 -16 31 -44 -10 6 4 6 -15
8014 -15 -3 -26 -25 -28 -18 0 47 36 2 14 -10 -28 11 29 -63 -5 -24 18 -16 0 37 -14 -4 -21 46 -2 -22 -2 26 7 -15
8045 -15 -28 25 -27 -10 -39 -32 5 39 48 74 2 17 -22 -21 14 -18 -16 -27 -8 33 48 -28 -28 10 -26 7 -20 -22 22 0 -13 -9 -24 -48
8079 -48 17 -32 -5 -30 10 -37 20 2 -37 -4 15 -10 -12 22 -7 -11 -27 -19 -20 5 -10 -14 -12 9 12 10 -23 4 -16 -12 -15 -19 -36 15 0 -2
8115 -2 -42 1 8 -22 17 17 48 29 -16 -35 27 -2 -17 -1 -24 4 5 12 6 -8 -13 -1 -2 -10 5 2 6 -4 -8 5 10 -10 -28 4 17 -7 -16
8152 -16 7 -24 14 -39 -15 -9 -9 -10 -6 -13 -30 -7 -9 9 -38 0 16 -10 -11 -3 30 9 -18 -18 -22 44 -16 -1 -21 0 6 11 -2 -15 -26 1
8188AJ3m4L4
$$ plain form
8188 1 14 -30 4
8191D
$$ Imaginary data points
##PAGE= N=2
##DATA TABLE= (X++(I..I)), XYDATA
0@%%%%%%%%%%%%%%%%%%%%%%%%%%%%%%%%Lj0J4j4J4j4J4j5J6j6J9k6L0l0L0l3L9
49B1m3M4n1N9o2O9p8Q6r6J08j21J38j60J88k26K79l62N03p71J474o487j4418K4057
72D151J4213k3543j3331K4365J2123k3958j0694K4485R506k4082q134K4604O815
85A6520k4381n448K4645M560k4483l365K4700K631k4338j782K4130J055k3496
98i052l58K3085m61k2299J262K1843k250k1408L242K0791m143k0380M982J9780
112A4634n755j9614O443J9135p256j8857P542J8295q047j7938Q172J7141q658
125E237j6614Q621J5758r219j5125R320J4205r918j3779J0042J2908j0530j2545
138a1639J0672J1892j1136j1731J1146J1242j1499j0965J1137J0565j1324j0223
$$ plain form
0 0 0 0 0 0 0 0 0 0 0 0 0 0 0 0 0 0 0 0 0 0 0 0 0 0 0 0 0 0 0 0 0 0 3 -7 7 -7 7 -7 7 -8 8 -8 11 -15 15 -15 15 -18 21
49 21 -22 22 -29 30 -32 37 -41 45 -51 57 -64 74 -86 102 -124 155 -207 296 -475 999 -5488 -19906 4151
72 4151 18364 -5179 -18510 5855 17978 -5980 -16674 7811 17317 -6765 -14899 9705 16520
85 16520 -7861 -13309 11336 15896 -8587 -11952 12748 15379 -8959 -10741 13389 14444 -9052
98 -9052 -9410 13675 13214 -9085 -7823 14020 11770 -9638 -6396 14395 10252 -10128 -5146 14634
112 14634 8879 -10735 -4292 14843 7587 -11270 -3728 14567 6520 -11418 -3246 13895 5237
125 5237 -11377 -2756 13002 3783 -11342 -2022 12183 2265 -11514 -1472 11436 906 -11639
138 -11639 -967 10925 -211 -11942 -796 10446 -1053 -12018 -881 9684 -1640 -11863
150a1863J1048R683j1137r276J1148Q521j1232q174J1291P634j1479p350J1722
163E36O896j1891o607J2159O378j2386o086J2505N919j2457n644J2648N416j2414
177e028n051J2556M715j2478m195J2779L777j2566l397J3080K945j2934k395J3286
191E094K111j3260j669J3604J518j3565j039J3760Q09j3535k63J3467J23j3299
205f144N35J3344r68j3004J578J3126k029j3096K728J3177l220j3071L861J3129
219I946m394j2929M757J3068n267j2853N620J2619o015j2362O443J2099o947j1766
233g981P470J1322q083j1107Q515J0687r053j0375R412R902r994r704J0358R202
247A0571j0803q793J0703Q398j1172p954J1292P218j1628o794J1609O145j2034
$$ plain form
150 -11863 -815 8868 -2269 -11545 -397 8124 -3108 -11282 9 7643 -3836 -11186 536
163 536 7432 -4459 -11066 1093 7471 -4915 -11001 1504 7423 -5034 -10678 1970 7386 -5028
177 -5028 -10079 2477 7192 -5286 -9481 3298 7075 -5491 -8888 4192 7137 -5797 -8192 5094
191 5094 7205 -6055 -7724 5880 7398 -6167 -7206 6554 7363 -6172 -6435 7032 7155 -6144
205 -6144 -5609 7735 6767 -6237 -4659 8467 6438 -6658 -3930 9247 6027 -7044 -3183 9946
219 9946 5552 -7377 -2620 10448 5181 -7672 -2052 10567 4552 -7810 -1367 10732 3785 -7981
233 -7981 -511 10811 2728 -8379 136 10823 1770 -8605 807 10709 715 -8989 1369 10571
247 10571 -232 -9025 1678 10076 -1096 -9050 2242 9460 -2168 -8962 2647 8792 -3242
260c242n612J2033M928j2254m608J2481L713j2602l439J2544K930j2846k255J2547
274D318J931j2704j545J2627J000j2594m69J2264K4j2207L85J2243j080j2035
288g842J588J2048k162j1830K557J1693l075j1414L458J1533l872j1256M249J0902
302F577m216j0759M775J0213m874r798N383R562n550r284O029R065o135q564O440
317a136Q460o672p990O892P950p069p628P474P333p495o868P530O798p638o269
332f328P770O153q011n556Q101N487q280m973Q187M975q536m564Q755M320q914
347a414m001R118L712r171l463R246L129r242l015R366K560r300k277R342J787
362F377r365j672R377J232r319j099R333N03r403j59R235q3r446K87R338n86r494
$$ plain form
260 -3242 -8854 3179 8107 -4147 -8755 3726 7439 -5163 -8602 3942 6872 -5974 -8229 4318
274 4318 6249 -6455 -8000 4627 5627 -6967 -7436 4828 4852 -7355 -6970 5273 4193 -7842
288 -7842 -6254 5794 3632 -8198 -5641 6052 2977 -8437 -4979 6554 2682 -8574 -4325 6577
302 6577 2361 -8398 -3623 6590 1716 -8082 -2699 6863 1313 -7971 -1942 7123 988 -7576 -1136
317 -1136 7324 652 -7338 -446 7504 435 -7193 281 7614 119 -6749 781 7579 -59 -6328
332 -6328 1442 7595 -416 -5972 2129 7616 -664 -5637 2550 7525 -1011 -5575 3180 7500 -1414
347 -1414 -5415 3703 7415 -1756 -5219 4027 7156 -2086 -5101 4265 6825 -2475 -4752 4590 6377
362 6377 -2988 -4660 4717 5949 -3370 -4469 4864 5367 -4036 -4195 5040 4957 -4489 -4202 5136 4550 -4944
379d944Q40R263j230r052J299Q998j898r049K126Q850k455q814K753Q605l227
394B065q512L346Q521l911q385M131Q224m614q088M781Q026m966p942N258P696
409E630n460p528N878P077n990o951O190O849o523o438O746O022o857n721P247
424A71N538p395n243P615N021p665m767P873M537p920m081Q002L859q066l360
439e881Q220L140q100k819Q394K371q190k074Q415J738q444j431Q736J102q577
454c400r49Q913M69q485l15Q556J14q670L96Q488o49q416J058Q368j393q236J769
471b382Q045j886q193K340Q079k521q142K914P791l050p721L199P597l342p530
486d802L599P190l914o944L903O880m273o578M502O109m773o080M863N962n240
$$ plain form
379 -4944 -4104 5159 3929 -5123 -3824 5174 3276 -5773 -3647 5203 2748 -6066 -3313 5292 2065
394 2065 -6447 -3101 5420 1509 -6876 -2745 5479 865 -7223 -2442 5584 618 -7324 -2066 5630
409 5630 170 -7358 -1480 5597 -393 -7344 -1154 5695 -828 -7266 -520 5502 -1355 -7076 171
424 171 5709 -1686 -6929 686 5707 -1958 -6725 1148 5685 -2235 -6316 1686 5545 -2521 -5881
439 -5881 2339 5479 -2621 -5440 2954 5325 -2865 -4939 3476 5214 -3230 -4661 4075 5177 -3400
454 -3400 -4349 4564 5033 -3452 -3767 4789 4903 -3767 -3371 5117 4468 -3948 -2890 5478 4085 -4151 -2382
471 -2382 5663 3777 -4416 -2076 6003 3482 -4660 -1746 6045 2995 -4726 -1527 6070 2728 -4802
486 -4802 -1203 5987 2073 -4871 -968 5912 1639 -4939 -437 5672 899 -5181 -318 5644 404
501D04n786N365N620n674n517N736N278n861n287O021M906o258m626O283M344
516D948o431m142O434L814o654l664O846L266o970k925O911K829p137k728P328
531A725K566p378k271P252K025p319j711P355J451p300j188P318P83p232m32P298
547B942K47p277K47P153k97p276O25P362p90p209Q89P271j104p119J390P025j427
564B652o940J842O884k078o681K290O708k544o534K876O530l165o376L483O291
579E238l647o141L882O023l950n926M139N786m288n482M444N355m617n153M869
594E32M818m901m624N011M458n233m292N495L983n467m062N903L607n950l536
609d258N929L336o009l096N900K902o074k699O114K441o300k101O205J800o284
$$ plain form
501 404 -5382 -17 5603 -71 -5588 148 5426 -435 -5722 299 5205 -1053 -5679 604 4948
516 4948 -1483 -5625 809 4623 -2031 -5695 1151 4417 -2553 -5478 1433 4262 -2875 -5603 1725
531 1725 4291 -3087 -5358 1894 3919 -3400 -5111 2244 3695 -3605 -4793 2525 3308 -3924 -4356 2942
547 2942 3189 -4088 -3841 3312 3015 -4261 -3636 3726 2936 -4273 -3384 3887 2783 -4336 -2946 4079 2652
564 2652 -4288 -2446 4438 2360 -4321 -2031 4677 2133 -4401 -1525 5005 1840 -4536 -1053 5238
579 5238 1591 -4550 -668 5355 1405 -4521 -382 5404 1116 -4366 78 5433 816 -4337 532
594 532 5350 449 -4175 836 5294 61 -4231 1264 5247 -220 -4282 1621 5228 -722 -4258
609 -4258 1671 5007 -1002 -4098 1802 4704 -1370 -4069 2045 4486 -1814 -3915 2290 4090 -2194
624b194j701O365J396o557j167O602Q89o594r01O626O70o716m84O693J08o532
640c497N7O429k03o520M19O407p85o443J052O321j254o370J600O223j758o206
656d528K024O184k261o012K402N888k557n792K704N641k858n349K954N328l267
671E01n039L429M941l604m766L810M756l973m613M266M440m280m289M468M159
686D206m512l956M674L854m868l485N027L284m969l070M992L009n225k723N447
701A685K476n396k300N416K235n601j968N685J860n816j489N667J413n652j141
716b926N638R49n548q04N588N99n680m18N696J23n616J00N473k56n637N42N547
733C370n97n572P62N371q50n388J065N171j145n448J489N236j680n170J917N060
$$ plain form
624 -2194 -3895 2470 3866 -2691 -3858 2744 3633 -2961 -3862 2764 3434 -3282 -3766 2927 3035 -3497
640 -3497 -3440 2989 2786 -3734 -3315 3092 2307 -4136 -3084 3237 1983 -4387 -2787 3436 1678 -4528
656 -4528 -2504 3680 1419 -4593 -2191 3697 1140 -4652 -1948 3693 835 -4514 -1560 3768 501
671 501 -4538 -1109 3832 228 -4538 -728 4028 55 -4558 -292 4148 -132 -4421 47 4206
686 4206 -306 -4262 412 4266 -602 -4087 940 4224 -745 -3815 1177 4186 -1039 -3762 1685
701 1685 4161 -1235 -3535 1881 4116 -1485 -3453 2232 4092 -1724 -3213 2454 3867 -1785 -2926
716 -2926 2712 3661 -1887 -2691 2897 3496 -2184 -2602 3094 3217 -2399 -2299 3174 2918 -2719 -2177 3370
733 3370 2773 -2799 -2037 3334 2484 -2904 -1839 3332 2187 -3261 -1772 3464 1784 -3386 -1469 3591
749C591k169m987K339M817k425m901K601M707k845m536K868M524l198m339L160
764g93M282l342m171L444L967l528l884L613L752l663l702L877L450m029l250
779c977M011L195m297k816M312K770m394k687M479K481m456k289M523K241m585
794a489k183M812J866m771j614M776J482m891j250N042J044m872r51N005Q54n040
810b180o58N070N73n131k66N165J6n027K36M890j81n050N01N077p23m881Q35M824
828C090r64m816J212M726j358m647J602M547j615m602J822M541j996m390K111
843g37M210k161m230K411M024k569l993K849L760k820l919L114L630l227l466
858c124L271L390l388l366L511L123l584l106L643L041l730k902L859K571l931
$$ plain form
749 3591 1422 -3565 -1226 3591 1166 -3735 -1134 3573 728 -3808 -940 3584 386 -3953 -793
764 -793 3489 147 -4024 -580 3387 -141 -4025 -412 3340 -323 -4025 -148 3302 -727 -3977
779 -3977 34 3229 -1068 -3884 428 3198 -1196 -3883 596 3077 -1379 -3668 855 3096 -1489
794 -1489 -3672 1140 3006 -1765 -3379 1397 2879 -2012 -3262 1780 2824 -2048 -2999 2006 2860 -2180
810 -2180 -2838 2232 2805 -2326 -2592 2573 2589 -2438 -2202 2688 2507 -2543 -2042 3035 2312 -2569 -1734 3090
828 3090 2126 -2690 -1478 3248 1890 -2757 -1155 3392 1777 -2825 -1003 3538 1542 -2848 -737
843 -737 3473 1312 -2918 -507 3517 948 -3045 -196 3564 744 -3175 -61 3569 342 -3124
858 -3124 147 3537 149 -3217 294 3417 -167 -3273 370 3411 -319 -3221 638 3209 -722
873g22k586M061K307m069k159M216J970m273j819M267J451m212j460M295J294
888B561m246j213M343J020m357r62M345P18m223o71M333M69m425k53M384J44m342
905b375N6M255k00m279L96M257m45m360O78M250p44m118Q04M253j157m053J128
922a654M111j265m071J513M088j716l799J572L988j902l713J915L845k077l670
937b835K338L430k322l494K491L384k458l337K663L136k720k979K744L011k858
952A94k892L040K742l168k470L226K368l242k462L387K270l451k150L623J869
967B884l532j888L618J791l784j441L733J402l875j315L822J204l764j153L989
982A691P75l972p18M036N43m057l23L964J48m086p4M035o0l878N2L899k07l953
$$ plain form
873 -722 -3308 753 3060 -1009 -3168 1048 3018 -1255 -3074 1193 2644 -1568 -3028 1267 2561
888 2561 -1685 -2898 1445 2465 -1892 -2854 1491 2209 -2014 -2685 1648 2117 -2308 -2561 1823 1967 -2375
905 -2375 -2319 1936 1736 -2543 -2147 2110 1665 -2695 -2017 2233 1489 -2629 -1825 2428 1271 -2782 -1654
922 -1654 2457 1192 -2879 -1366 2722 1006 -2793 -1221 2767 865 -2848 -933 2912 835 -2835
937 -2835 -497 2933 611 -2883 -392 2992 534 -2803 -140 2996 276 -2703 41 3052 194
952 194 -2698 342 3084 -84 -2554 672 3040 -202 -2664 723 2993 -458 -2608 1015 2884
967 2884 -648 -2536 1082 2873 -911 -2352 1381 2783 -1092 -2407 1415 2619 -1145 -2298 1691
982 1691 2466 -1506 -2224 1812 2355 -1702 -2025 1939 2087 -1999 -2073 1962 1902 -1976 -1924 1975 1768 -2185
1000b185M22L931n93l849N82L896q40l915J125L649j052l715J248L631j494l506
1016b665J535L415j599l481J726L411j829l328J910L268k011l177K252L081k316
1031A92k954K261K935k521k802K642K660k597k591K796K431k779k441K977K270
1046B479k974k245L117K196l224j912L170J803l210j645L324J601l323j469L360
1061A048J356l434j215L456J098l447r46L508P99l456q16L546O57l532m59L581
1077A744K48l419k71L502J51l499j9L503o3l471K62L435n77l325N90L434p65l330
1095a870Q79L141q06l388J002L348j041l366J275L118j424l032J438L182j504
1110I52l149J613K991j937k701J823K763k021k779K041K755k095k693K264K420
$$ plain form
1000 -2185 -1763 2168 1575 -2274 -1692 2204 1364 -2551 -1426 2223 1171 -2544 -1296 2335 841 -2665
1016 -2665 -1130 2285 686 -2795 -1069 2342 513 -2815 -905 2363 352 -2825 -573 2508 192
1031 192 -2762 -501 2434 -87 -2889 -247 2413 -184 -2775 21 2452 -327 -2768 209 2479
1046 2479 -495 -2740 377 2573 -651 -2563 607 2410 -800 -2445 879 2480 -843 -2312 1048
1061 1048 2404 -1030 -2245 1211 2309 -1138 -2084 1424 2223 -1233 -2049 1497 2154 -1378 -1837 1744
1077 1744 1992 -1427 -1698 1804 1955 -1544 -1563 1940 1877 -1594 -1332 2103 1526 -1799 -1209 2225 1460 -1870
1095 -1870 -991 2150 1344 -2044 -1042 2306 1265 -2101 -826 2292 868 -2164 -726 2456 952
1110 952 -2197 -584 2407 470 -2231 -408 2355 334 -2445 -404 2351 256 -2437 -173 2247
1125B247k190k443K379K287k432k221K578K059k640j982K676J838k727j792K693
1140C30J675k626j821L008J524k893j553L026J295l057j203L020J171k982j168
1155b254L103R56l097o88L062Q12l280m89L062O09l356k60L161K81l327M9L136
1172A480L6l140N0L218k78l100L44L209m38l213N86L107o73l048Q25K937p90k898
1190a786R09K897j032k792R88L050j341k788J302K819j433k717J538K604j761
1205D57k436J653K651j758k565J827K216j817k177J966K187k101k067K136K054
1220B226k377j855K300K045k486j788K356J768k469j635K582J461k631j356K604
1235G45J128k674j031K694J008k729r42K740P39k678q69K930O57k776p06L003
$$ plain form
1125 2247 57 -2386 -7 2280 -152 -2373 205 2264 -376 -2358 318 2156 -571 -2363 330
1140 330 2005 -621 -2442 566 2090 -803 -2356 670 1965 -1092 -2295 725 1896 -1086 -2254
1155 -2254 849 1805 -1292 -1980 1082 1894 -1386 -1875 1187 1796 -1560 -1820 1341 1622 -1705 -1656 1480
1172 1480 1516 -1624 -1574 1644 1366 -1734 -1390 1819 1381 -1832 -1246 1861 1188 -1860 -1035 1902 1112 -1786
1190 -1786 -877 2020 988 -1804 -816 2234 893 -1895 -593 2226 793 -1924 -386 2218 457
1205 457 -1979 -326 2325 567 -1998 -171 2045 228 -1949 17 2204 103 -1964 172 2226
1220 2226 -151 -2006 294 2339 -147 -1935 421 2189 -280 -1915 667 2128 -503 -1859 745
1235 745 1873 -801 -1832 862 1870 -859 -1801 939 1678 -1000 -1869 1061 1718 -1058 -1764 1239
1251A239M16k903l30K700M20k973k23K981O0k893K7K896j43k902K49K840l78k825
1269a742N50K743n70k868O61K800o46k776Q33K728j026k573R93K607j047k537
1285a870J209K419j301k422J317K416j453k284J555K251j475k274J620K125j630
1300B03k046J682J988j737j855J848J769j923j708K006J687k013j660K093J473
1315A807k055j469K190J438k172j336K189J276k284j171K292R73k212j035K387
1330H18R36k453q10K453O69k324p94K445O93k510m99K559L66k500l94K524K70
1347A449k653qK461J08k530RK515j43k499K02K448k78k450K60K615n57k320M61
1365i10K395o40k410P07K260n85k515Q42K360r17k375J162K317j137k336J297
$$ plain form
1251 1239 1655 -1248 -1578 1122 1542 -1431 -1654 1327 1387 -1506 -1479 1417 1274 -1628 -1379 1461 1083 -1742
1269 -1742 -1192 1551 981 -1887 -1226 1574 928 -1848 -1015 1713 687 -1886 -893 1714 667 -1870
1285 -1870 -661 1758 457 -1965 -648 1768 315 -1969 -414 1837 362 -1912 -292 1833 203
1300 203 -1843 -161 1827 90 -1765 83 1852 -71 -1779 227 1914 -99 -1759 334 1807
1315 1807 -248 -1717 473 1911 -261 -1597 592 1868 -416 -1587 705 1678 -534 -1569 818
1330 818 1754 -699 -1509 944 1613 -711 -1505 940 1633 -877 -1376 1183 1549 -951 -1345 1179 1449
1347 1449 -1204 -1212 1249 1357 -1173 -1164 1351 1208 -1291 -1089 1359 1081 -1369 -1109 1506 949 -1371 -910
1365 -910 1485 845 -1565 -858 1402 817 -1698 -856 1504 587 -1788 -626 1691 554 -1782 -485
1381d85K043j177k137J346K125j577k027J604J961j667j839J651J841j800j662
1396a800J822J672j908j634J902J585k002j493K059J453k106j356K174J306k168
1411d94j216K197J152k274j012K274R58k395p67K336P33k369n27K334M53k393
1427a010k32K247K96k301j71K363K8k318O3K259j32k201K3K442k98k285L70K126
1445A269l40k117M60K188n60k092N73K087p18k087Q38J899p39j922Q06J893q18
1462F20k034J047J880j039j796R91J847j223j685J283J573j232j647J385J488
1477A458j343j538J404J451j354j473J450J316j483j201J381J256j469j268J559
1492A46J183j592j143J688J056j703r47J568R78j732p83J725P78j686q54J868
$$ plain form
1381 -485 1558 381 -1756 -410 1715 138 -1889 -285 1676 9 -1830 -179 1662 -138 -1800
1396 -1800 22 1694 -214 -1848 54 1639 -363 -1856 203 1656 -450 -1806 368 1674 -494
1411 -494 -1710 487 1639 -635 -1647 627 1585 -810 -1577 759 1492 -877 -1404 930 1383 -1010
1427 -1010 -1242 1005 1301 -1000 -1171 1192 1220 -1098 -1035 1224 1092 -1109 -1086 1356 1058 -1227 -857 1269
1445 1269 929 -1188 -728 1460 900 -1192 -619 1468 750 -1337 -499 1400 661 -1261 -455 1438 620
1462 620 -1414 -367 1513 474 -1322 -331 1516 293 -1392 -109 1464 232 -1415 -30 1458
1477 1458 115 -1423 -19 1432 78 -1395 55 1371 -112 -1313 68 1324 -145 -1413 146
1492 146 1329 -263 -1406 282 1338 -365 -1312 256 1234 -498 -1281 444 1222 -464 -1318 550
1508E50O42j808p09J838P07j896o77J932M94j862n20J984M48j990l59K027J63
1525I64j806l69K109R1j993j53K064J06k074j2K039m6k066J86K096k97k044K65
1543i40K210m58k050N04J970m82k110P43K035p74j983Q41J907q58j874R05J908
1560A494j099j825J187J879j208j902J348J744j373j705J416J550j412j564J579
1575A09J501j642j349J634J380j835j161J749J202j807j115J723J077j872r00
1590a306J945P45j937p51K006O39k012o14J999O30k051m52K055K74k011k40K084
1607A003P4k031L1J857O7k011J29J904j49j925K09J999m61j783L39J838n19j763
1625a192N28J772o89j639O80J662p32j629Q56J448q20j449Q58J515r96j420R23
$$ plain form
1508 550 1192 -616 -1325 513 1220 -676 -1353 579 1073 -789 -1309 675 1123 -867 -1226 801 964
1525 964 -842 -1211 898 989 -1004 -1157 907 1013 -1061 -1073 966 920 -1146 -960 1136 839 -1205 -940
1543 -940 1270 812 -1238 -734 1236 754 -1356 -613 1422 648 -1335 -494 1413 555 -1319 -414 1494
1560 1494 395 -1430 -243 1636 428 -1474 -126 1618 245 -1460 -44 1506 94 -1470 109
1575 109 1610 -32 -1381 253 1633 -202 -1363 386 1588 -219 -1334 389 1466 -406 -1306
1590 -1306 639 1384 -553 -1304 702 1341 -671 -1285 714 1344 -707 -1159 896 1170 -841 -1081 1003
1607 1003 1077 -954 -923 934 1001 -1010 -881 1023 874 -1051 -842 1157 696 -1087 -748 1090 571 -1192
1625 -1192 -664 1108 419 -1220 -540 1122 390 -1239 -383 1065 245 -1204 -346 1169 173 -1247 -324
1642c24J434r63j420J024J309j013j228R78J187r50j139J102J003j033j050J098
1658A5R89j092j019J196R29j201q57J146R82j293q51J205Q95j246p91J307O89
1675A003j284o77J303O39j271o76J295O40j370n22J324N85j313o05J425M56j382
1692d30m41J417L79j413k94J356L44j447l08J492K99j484k55J500J58j534j44
1709h05J670n4j450j11J649j11j603Q3J649j23j710K51J557k69j553K62J704m15
1727F21j620L93J638n01j621O20J528o21j603P86J521q06j494Q42J525r92j435
1744a219J022J378j060j435J183J308j191j305J286J226j310j193J379J131j425
1759b25j051J474R86j553q74J499Q85j558p95J579P76j661o61J674N67j668n11
$$ plain form
1642 -324 1110 147 -1273 -249 1060 47 -1181 -203 984 34 -1105 -3 1000 -33 -1083 15
1658 15 1004 -88 -1107 89 1018 -183 -1040 106 1088 -205 -1056 149 1044 -202 -993 314 1003
1675 1003 -281 -958 345 984 -287 -963 332 972 -398 -920 404 989 -324 -929 496 952 -430
1692 -430 -871 546 925 -488 -782 574 918 -529 -837 655 954 -530 -785 715 873 -661 -805
1709 -805 865 811 -639 -750 899 788 -815 -732 917 794 -916 -665 892 623 -930 -668 1036 621
1727 621 -999 -606 1032 531 -1090 -470 1058 437 -1166 -380 1141 335 -1159 -317 1208 216 -1219
1744 -1219 -197 1181 121 -1314 -131 1177 -14 -1319 -33 1193 -117 -1310 69 1200 -225
1759 -225 -1276 198 1184 -369 -1243 256 1141 -417 -1212 367 1143 -518 -1179 495 1062 -606 -1117
1776a117J709M11j707l03J674K57j694j81J695J14j673n3J656j4j644J15J655
1793I00k05j574J94J627l20j568L89J541m32j523M81J489n32j438N88J408o27
1810C98j373P01J312p09j271P46J220p76j205Q22J157q49j090Q66J043q57j025
1827h90R22R50r35r45R55R21r90q78J007Q03r64q26J026P33j011o95R92P16j044
1846a53o75J022O71j083n77J066N53j053n51J035N59j115n13J117M49j084m37
1863g69J101M11j145l57J140K96j108l01J171K60j183k60J204J77j170j52J171
1880D86J20j193j08J199Q7j253k8J241L2j298J26J203q2j303K12J253k03j289
1898g98K45J309k93j250K97J293l29j303M11J288m94j263N35J196n09j208N97
$$ plain form
1776 -1117 592 1003 -704 -1007 667 924 -770 -951 744 858 -815 -868 788 774 -870 -755 900
1793 900 695 -879 -685 942 622 -946 -557 984 552 -971 -490 999 467 -971 -383 1025 398
1810 398 -975 -274 1038 329 -942 -196 1024 248 -957 -135 1022 173 -917 -51 992 135 -890
1827 -890 32 982 47 -898 57 978 -12 -890 117 920 -44 -870 156 889 -122 -817 175 891 -153
1846 -153 -828 194 865 -218 -795 271 824 -229 -780 255 814 -301 -814 303 752 -332 -769
1863 -769 332 743 -402 -759 381 677 -431 -732 439 699 -484 -744 460 637 -533 -685 486
1880 486 606 -587 -695 504 591 -662 -690 551 583 -715 -589 614 532 -771 -559 694 491 -798
1898 -798 -553 756 463 -787 -490 803 474 -829 -418 870 376 -887 -352 844 335 -873 -276
1915b76J172o65j131O72J107o91j090P60J131q63j079R13J033r93r06R85R25j003
1933Ar24J079Q39j090q24J116P55j098p45J147P29j226o62J276N46j225n63J304
1951D35M47j297l67J284L21j283k88J272L07j348j79J285J07j278n3J315J5j369
1969f74Q2J313j68j175J18J234j52j315K15J246l66j095L43J161l31j197K78J191
1987G08l72j089M71J063n72j000N25J037m99j102O10R63o13r65O53R20o37r74
2005h73P90Q57p77p94P49Q21p76q46Q73P55r03p03R06N51p44o54Q34O67r35m85
2025f87P88N92q99m33R15M97r01o25J052L57q88m22R64L53r59k95R24K63j012
2044d16k86J052K10r87j93J071J59j037j49J048N7r09j89J042J04j070KJ029M3
$$ plain form
1915 -276 896 231 -900 -228 879 188 -902 -142 989 126 -953 -40 993 0 -906 79 1004 1
1933 1 -923 156 995 -95 -919 197 952 -146 -891 256 985 -241 -903 373 919 -306 -869 435
1951 435 882 -415 -782 502 823 -460 -748 524 831 -517 -696 589 696 -582 -635 680 695 -674
1969 -674 -592 721 553 -622 -504 730 578 -737 -522 724 358 -737 -394 767 436 -761 -483 708
1987 708 336 -753 -282 781 209 -791 -266 771 272 -830 -220 743 130 -835 -182 738 101 -873
2005 -873 -83 774 -3 -797 -48 773 -3 -849 24 779 -124 -827 79 630 -114 -768 66 733 -202 -687
2025 -687 101 693 -206 -639 276 773 -128 -753 299 656 -232 -654 310 663 -296 -591 333 596 -416
2044 -416 -702 350 560 -427 -620 451 610 -427 -576 472 529 -380 -569 473 577 -493 -491 538 581
2063E81j117Q6J145k32r99L1J066j71r41K04R21k37q95K24J060l56r38K63R97
2082F92l77r55L86R37m31r31M42R01m72q63M93R33n52r37O37Q89o99q23N60Q91
2102G21o30q39O74P67o98o98P21P08q20n76O77O49q04n46R64M89r07o53R54M87
2122F40r03n24J092L47r48m03R02M77j018l75R51K85r24k57J043K25j034k25J026
2141C77J81j119m4J042Q0j003l0J016n1r49M4J010j38r36O0J054j80r53J54Q58
2161D73p9r71K15R95l66r33M04Q91l82q96M48Q70m10q45L27Q91m67q24N36P83
2181F60m91q43N47Q20n70p22N71P01o72o08N17P62p08n25N44P06p01o13P98M89
2201F62p11o05Q24M53p22n19Q24M39p91m56Q13L58q17l70R05K81q27l23Q99K12
$$ plain form
2063 581 -536 -450 695 463 -536 -505 561 390 -551 -347 574 337 -558 -334 726 370 -568 -305 692
2082 692 315 -640 -254 683 252 -679 -237 664 192 -671 -178 755 203 -734 -97 792 93 -730 -170 721
2102 721 91 -748 -74 693 -5 -703 18 726 -94 -670 7 656 -148 -694 270 759 -148 -801 153 640
2122 640 -263 -787 305 652 -296 -699 203 680 -338 -713 238 523 -401 -658 385 610 -424 -649 377
2141 377 558 -561 -605 437 517 -486 -516 500 449 -500 -456 554 416 -520 -460 594 414 -539 -385 473
2161 473 394 -577 -362 633 267 -666 -262 629 247 -649 -201 669 259 -586 -259 632 165 -659 -123 660
2181 660 169 -674 -127 693 123 -599 -28 673 1 -607 -90 672 -36 -561 -17 689 -12 -625 173 662
2201 662 -49 -654 170 623 -99 -618 206 645 -146 -602 211 569 -248 -618 287 568 -259 -582 317 529
2221E29q56k48R22K35q98k26J000K8q51n7P94l5p44nQ26K7q89m0R04k8q38O1Q30
2244D41p2q53P7Q92r5r15K25P93k49p89K25Q15k15p89K74Q11k94q89L75P89l41
2265B16p84M14P69n30o56M19P13m00p06N52O04n48o53N25O59n56o39N95N86o44
2285f4n16O20N25n76n29O03N79p80m77P70L83n81n00P16L70p38l00O76L67p60
2305b12m19Q99L24p97k40P43L37r07k17Q01J36o89j35Q16J9q04p9P85Q6p95PP32
2327C91P9q24j1Q03k7q39P2P48p6p48J45P11j61p27K29P37j99q20L15P34l47o80
2349d95K77P51m14o53M23O41l05p13L72O56m06o22L33O61m26n39L67N76m18o52
2369e86N07N78m97n40M69N93o15l97N48M92o46l70N59M23o19m55O73M15p52l10
$$ plain form
2221 529 -327 -575 347 582 -316 -542 458 486 -365 -422 372 337 -407 -412 414 441 -448 -488 416 388 -450 -389 441
2244 441 369 -484 -407 485 390 -525 -300 493 244 -545 -320 495 280 -509 -235 576 282 -607 -232 557 216
2265 216 -568 -154 615 85 -571 -152 561 161 -545 7 611 63 -590 -65 594 38 -601 -6 580 -64
2285 -64 -580 40 565 -11 -540 63 642 -138 -615 155 538 -43 -543 173 543 -195 -495 181 548 -212
2305 -212 -631 268 592 -205 -445 298 635 -272 -489 312 448 -241 -376 440 459 -345 -424 361 447 -348 -341 391
2327 391 470 -354 -365 438 411 -428 -356 392 316 -432 -287 424 263 -464 -235 502 303 -517 -202 532 185 -495
2349 -495 -218 533 119 -534 -111 530 225 -488 -116 540 134 -488 -155 506 80 -459 -92 484 66 -586
2369 -586 -79 499 2 -538 -69 524 -91 -488 60 552 -94 -464 95 518 -101 -556 117 532 -220 -530
2389e30P25K88o52l23O71K73o67k93P34J82o46j97O70K69p18j85P08J03p21r9
2409d08O98J16p49j8O85R7p85l0O84J2o52m1P86j17o47J42O91j53o45P5O80k12
2431B09n87J15P27k70o43L15O04k39o54K63O10k32o64K97O21k90o69M22M55k97
2451I3m97L87N32l84n59L74N05m58n01N24M40m56m21L99M82n57l64M48N21n61
2471e3l63N47L12n44m21O46L32o29l37O65K39n78k43O14K10o38k27O74J91o41
2491b44j78O11K67p59l4N83P1o14q9O73O9o61k6O59No62K0O35o6o45J01O66j49
2514B33o85J89O27q7o84R3O67j73n32J38O02k48n54J93O33k36o36L43N39k77n70
2535d25K86N88k96n46K83N32m20m04L80M86m76m52M73M48m44m51M67L39l81m10
$$ plain form
2389 -530 195 483 -169 -492 179 452 -215 -508 226 408 -238 -435 235 504 -214 -399 309 412 -309 -408
2409 -408 290 406 -343 -361 324 421 -364 -394 290 302 -350 -391 395 278 -369 -227 464 311 -334 -259 421 209
2431 209 -378 -263 464 194 -449 -134 470 231 -423 -160 450 218 -446 -149 472 182 -487 -65 390 93
2451 93 -404 -17 515 131 -428 -54 451 -7 -508 16 456 0 -421 -22 460 -97 -461 -13 508 -53
2471 -53 -416 131 443 -101 -522 124 456 -173 -510 155 394 -184 -427 187 397 -241 -468 206 397 -244
2491 -244 -422 189 456 -303 -337 246 317 -297 -386 287 356 -305 -331 328 333 -329 -309 326 260 -385 -284 382 233
2514 233 -452 -263 364 277 -407 -314 353 180 -352 -214 388 140 -414 -221 412 176 -460 -117 422 145 -425
2535 -425 -139 449 153 -393 -110 422 2 -402 -22 464 -12 -464 9 457 13 -438 29 368 -13 -423
2555d23M55L87m40m09M83L50m53l78N40K99m61l74N77K74n50k49M87J81m61j80
2575c45N39J94n20j83N32J38n82j01N49P5m81j63N62J29n84j05N98N3o33MO11
2596B87K4o11M9N67l5o12O9N42o8m88Q7N31j64n13J14N49j98m86J66N63k14n51
2618c92K29N12k12m93K06N32k87m23K65M40l25l74K30M56k74m96K92M68l91l47
2638c84L18M24l30m30M59L38m67k52L55L55m27l45M77K77m15l44M76K86m89k05
2658c23M47K43m74k43N45J35m59k14M88K14n79n7M55J50n56r7N89M2n89j8N17
2679B16J03n48p8N90J5n49o5N64m7m81L9N38o5n08O1N62j26m75O2N42j55m98J40
2702a63M50j47n08K92M64k64m71K07N13k87m25K81M32l37l90K74M11k52m60L38
$$ plain form
2555 -423 32 419 -21 -430 53 403 -50 -428 112 411 -50 -424 153 427 -123 -372 115 296 -165 -345
2575 -345 194 388 -132 -315 217 355 -227 -328 221 296 -185 -348 214 343 -241 -346 252 305 -328 -324 287
2596 287 311 -300 -251 316 281 -331 -262 280 212 -276 -189 342 178 -335 -221 328 130 -356 -190 373 159 -392
2618 -392 -163 349 137 -356 -150 382 95 -328 -63 377 52 -322 -92 364 90 -406 -114 354 -37 -384
2638 -384 -66 358 28 -402 57 395 -72 -324 31 386 -41 -386 91 368 -47 -391 85 371 -118 -323
2658 -323 124 367 -107 -350 195 330 -129 -343 145 359 -220 -277 178 328 -228 -325 264 306 -283 -301 216
2679 216 319 -229 -307 283 298 -251 -316 248 201 -280 -241 297 232 -276 -215 347 221 -254 -192 350 195 -303 -163
2702 -163 287 140 -368 -76 388 124 -347 -140 373 86 -339 -58 374 37 -353 -79 332 80 -380 -42
2722d2M09l75l52L70L57l79l05L10L38l55l00L24L43m14k68M23K60l96k25L16
2742C9K83m20k14M25J42m03j84N01J54m58j86M15J72m50p1M06J05m66j2M16O2
2763B56m62p2M51J01n30o0N46O7m96l6M37J1m48M7M03p5l69l1N63j09m15R4M03
2786B76r0m87J15N47k50m22K23M18j93m15K46L66k81l15J76M09k11m07L47K99
2806C51k84l54K45M09k98m28M38K75l68l13L95K36l14l24L47K37k71k92L73K54
2826C14l89k06L09L16m15j93L79K31m65k19M53J64m61j12M34J26m15j01L92J11
2846B53m49r4M49N4l62j55M64P5m66M6L97nl59j60N13k6l90k8M64m7m26P7L39
2869A64k5l42nL87l6l47j4L67k5l73O0M76j68l98J59L21j18l14J22M09j77m04
$$ plain form
2722 -42 367 -8 -360 10 367 -12 -317 -7 331 -24 -324 0 343 -71 -339 84 344 -52 -277 39
2742 39 322 -98 -312 113 255 -148 -332 169 323 -135 -321 94 266 -184 -255 151 256 -210 -222 194 256
2763 256 -206 -278 173 274 -256 -316 230 297 -199 -235 202 213 -235 -188 215 140 -229 -260 303 194 -221 -127 276
2786 276 186 -301 -186 361 111 -311 -88 330 137 -278 -32 334 53 -262 -86 323 112 -295 52 351
2806 351 67 -287 -42 367 69 -359 79 354 -14 -327 68 304 -10 -334 13 250 -21 -313 60 314
2826 314 -75 -281 28 344 -71 -264 115 346 -119 -338 115 279 -182 -294 140 266 -149 -250 142 253
2846 253 -196 -290 159 213 -149 -304 160 235 -231 -185 212 207 -152 -312 201 175 -215 -243 221 174 -252 -175 164
2869 164 139 -203 -208 179 143 -204 -218 149 124 -249 -189 287 119 -279 -120 201 83 -231 -109 300 123 -281
2891b81K14L06k46k74K12L41k51k72K14L20l21k56L38K69l44k18K46L33l15k67
2911b52K48K64l38k06L43J22k17k22L40K16l59k84L79K44l22k20M41J0l44j42
2931b99M77J07m78%L49J4k80j37M24Q9n38J02L38N5l86o6M22J7l26p5L98q2l24
2954a99j4M20l5l37L8L41j5m45J29L13m0l58N8L43p3l70J79K88j20k32O8L28j56
2977A11l92J90L29j71l83J83L51k40k27K51K06k23k40K86J63k26j51K09K08l02
2997f8j56K34K04l16j41L56J26k43l20M11J77l14j19K62J48m03m6K88J12k84q5
3018a77K28K28l96m7K65J22l02j54L25Q7l14j00L78L5k78j00L83k1l31L3L12O2
3040B38l09r3L15n1k82L0L15J8l67L9L26Kl34p4M80j86l53K13K48n4l64J61L22
$$ plain form
2891 -281 -67 239 -7 -281 -69 272 21 -251 -37 283 -38 -294 44 313 -31 -249 -3 330 15 -252
2911 -252 -4 260 -78 -284 59 181 -36 -258 82 298 -61 -345 34 278 -44 -264 177 187 -157 -299
2931 -299 178 285 -193 -193 156 170 -110 -247 177 266 -272 -170 168 223 -163 -229 193 210 -116 -191 207 125 -199
2954 -199 -213 207 172 -165 -127 214 199 -246 -117 196 156 -202 -144 199 126 -244 -65 223 103 -129 -61 267 111
2977 111 -281 -91 238 67 -316 -133 218 -22 -249 2 208 -15 -255 31 194 -32 -183 26 234 -68
2997 -68 -224 10 214 -102 -243 113 239 -4 -324 87 264 -50 -169 93 241 -162 -208 80 192 -92 -177
3018 -177 51 279 -117 -164 101 223 -79 -233 92 179 -135 -235 143 178 -100 -200 183 162 -169 -136 176 238
3040 238 -71 -164 151 100 -182 -152 163 181 -186 -147 179 181 -153 -227 253 67 -286 -73 175 121 -243 -82 240
3063B40r6l80J28L55j17l74J43M15k22l73K19K73j84l66K87K60k08l24L15L17
3083C08l17k61K01K97k62j48J78L02l34k69L75J75k26k70L38J46l08j04L44P3
3103B38l59oK43R1l41m6K64J78m54o1L32J51l32j56L81kk49j06M32l1m25M9K71
3126F2N1j43l3K13N5l81L6L78k83r3Q8J87l3l07J69J54q6k54J73K10j91j86J45
3149f9L42k63k34J68K42r3l94K42K87k77j24K11K22k32k80J81J96j41j49K33J88
3170B56k62k56L97L1q1k96K26J71k37j21J89J45j33j64K22n7j59kJ63J74k40K
3192c2J13J16j43k27K62J14k08k30L34N8j92k22M07m2j32p8J66K14l38j61L25
3213A04K2l29J6M13j36k62k8L09J33l17j22L38K5k45n6K74M4k39P6J09R6m58K14
$$ plain form
3063 240 144 -236 -108 247 130 -244 -101 314 92 -281 -62 211 27 -339 -52 208 0 -324 -9 308
3083 308 -9 -270 -69 228 -34 -182 -4 298 -36 -305 70 245 19 -251 87 233 -75 -179 165 238
3103 238 -121 -127 116 207 -134 -180 84 262 -192 -253 79 230 -102 -258 123 121 -128 -234 198 167 -258 -209 62
3126 62 113 -30 -63 150 205 -176 -140 238 -45 -138 -50 137 104 -203 -34 120 34 -220 -47 163 -28 -214 -69
3149 -69 273 10 -224 -56 186 93 -301 -59 228 -49 -173 38 260 28 -252 -71 125 -16 -165 68 256
3170 256 -6 -262 135 166 85 -211 15 186 -51 -172 17 162 29 -135 87 30 -129 -131 32 206 -34 -32
3192 -32 81 197 54 -173 89 203 -5 -235 99 157 -35 -257 150 108 -24 -102 64 278 -60 -221 104
3213 104 126 -203 -187 226 90 -172 -200 109 242 -75 -197 141 166 -79 -135 139 183 -56 20 129 225 -233 -19
3236a9L14j98k98J89J58o7l09J34L03q0l23J1L13q5k75K18J31r7l16K57L19k43
3258C7k15M1M52l29k29K21K78l47o7L24J3j83j84J65J11j34k35L61Q1j97j63J11
3280h8L19l57j13K60J88l02j06L78J5k35j52L47J73m46J0K26P6k95j9K45k2j96
3302i4k5K16o7j15L3K04j50k58R5L73p2l11J16L19j60l79J93L08k59k13K03J39
3324I6J3k35Q0J76j51j76J92K04j12j88k2L72l18r2K06k7nj80M3J93Nj57K19J9
3348A55j40j13P6N5J7k18J79J25k19n1K43L9j44j61J99J33j59j26J46P4k28l5
3370a53K47K4j86q9J30K29k70r6K29m1n2m4K09j6j54j16K19P6j98p6J75R5k62
3393a20J31K8P5j92k8K00P5l19J8K40Lj70N9O3kj15n3K86k8k32l1K86m6j85pK32
$$ plain form
3236 -19 295 97 -201 -12 146 79 -230 -96 207 127 -196 -185 128 43 -232 -14 117 20 -296 -39 280 37
3258 37 -178 -137 315 -14 -243 -22 256 -91 -158 166 179 -4 -188 -23 88 -46 -281 80 161 -36 -199 -88
3280 -88 231 -126 -239 21 209 -93 -199 179 194 -41 -193 154 327 -119 -109 117 193 -102 -121 124 102 -94
3302 -94 -119 97 30 -85 -52 152 2 -256 -161 212 140 -171 -55 264 104 -275 -82 226 -33 -246 -43 96
3324 96 109 -126 -46 130 -21 -197 -5 199 87 -101 -123 249 -69 -161 45 18 13 -167 -124 69 74 -83 136 155
3348 155 15 -98 -22 33 50 -168 11 136 -83 -134 109 148 4 -157 42 175 16 -110 36 110 -118 -153
3370 -153 94 118 -68 -157 -27 202 -68 -164 65 24 -28 -72 137 121 -33 -149 70 146 -52 -128 47 142 -120
3393 -120 11 39 114 -78 -106 94 169 -150 -132 108 111 -59 0 63 61 -54 -107 179 151 -81 -112 174 128 -57 -64 168
3419A68r6j43n0K91j04k44J49M3J40l23R1K66j67j24Q2J07ok48J21K59k14k25
3441b27J91K37k25j16Q0K24j33j96J92K19k99j41J81K22k71j56K44K03k06j71
3461a48K42J17k29j40L17rj44j88K84P4k71RJ53K7k10j7K45J6j72p1K42K8k83
3484a28j0K49j1k61K9K32N5l14R8J79q7j28LJ98r3j70Q1K48p7k25J30J65j32k47
3508b16K22J16n5k66J86Q4q2j61J36J64j32r8J54J14k53j03K30R4j43j42J21K04
3530A74k10r3J98N1k06k9J01J32j55j22K17N2j95RQ3J20j71q4J39J54k05r8J91
3553E3J04k42m2K46Rk09qK12l8o9o9J79j04j35MJ93J7j81QJ61k2j57l7K15J8k02
3579i6J8J51J3j94L7J42oj67N6K07Qk58M5J33K2k19N9J91p7j52L4J15L4k39P0
$$ plain form
3419 168 72 -71 -121 170 66 -178 -29 14 154 -169 -78 188 21 -103 -21 86 80 -168 -47 212 -2 -227
3441 -227 -36 201 -24 -140 -60 164 31 -165 27 246 -53 -194 -13 209 -62 -218 26 229 23 -148
3461 -148 94 211 -18 -158 159 150 6 -182 102 176 -95 -86 67 94 -116 -133 112 128 -44 -115 127 155 -128
3484 -128 -138 111 100 -161 -132 100 155 -159 -61 118 31 -97 -94 104 11 -159 -78 170 93 -132 -2 163 31 -216
3508 -216 6 122 67 -199 -13 71 -11 -172 -36 128 -4 -102 52 166 -87 -190 40 134 -9 -151 -30 174
3530 174 -36 -129 69 120 -86 -115 -14 118 -37 -159 58 110 -85 -76 7 127 -44 -128 11 165 -40 -138 53
3553 53 157 -85 -127 119 128 -81 -89 123 85 16 -53 126 22 -113 -109 84 101 -80 -72 89 67 -90 -127 88 106 -96
3579 -96 -78 73 86 -108 -71 71 65 -102 -46 161 169 -89 -44 89 111 -108 -49 142 65 -87 -53 62 96 -143 -73
3604g3K73j57j14K9J30q4j17%J94rj67N0J29kj90M9J82j30j10K20lj01o4R4j6
3629A3J9j36P8J15j39j05J61J29j97j21J61J37j55p3J60J37k42p0J63l2l0q1K51
3652A43l7k12NJ66M0j94k8J77J8q3j35K07l1j87Q4R3P7k27J24O7mk27J02J27m
3677F1k10J03J33m8j06M9J04r9q1M6J37p2j14N9R5l6o0J4J14j45j8k8K57j72q5
3702a02J12J28j19j34J00J85k21o9Q7J96k34l7P2J45j19j22J77K5j33K1L0J01
3724H9n5j92J48J81j27j52J23R7j24j16J64J31j61j28K04k0j10OQ8N0j26k2J79
3747A27l8j72n3K13O0j08j52J68Q9k25j6J53M3k35R6J38M9k05J7Q0O1j60K1J33
3771H4j8q4OJ84j06k05J00J80j32k7j9J20L0j74oJ71p5r0N0J38n7r1k5J77j24
$$ plain form
3604 -73 200 43 -71 -42 88 4 -113 -113 81 72 -95 -45 84 82 -108 -59 123 -7 -117 103 100 -1 -65 29 13
3629 13 32 -104 -26 89 -50 -155 6 135 -62 -183 -22 115 -40 -113 47 184 -58 -128 35 3 -27 -108 143
3652 143 106 -106 -101 65 105 -89 -117 60 78 -5 -140 67 36 -151 -67 26 103 -124 0 67 63 -164 -62 65 61
3677 61 -149 -46 87 39 -67 -18 86 -13 -94 -48 89 17 -97 -38 57 21 -39 -25 89 -56 -74 -102 155 -17 -102
3702 -102 10 138 19 -115 -15 170 -51 -120 -33 163 -71 -108 -36 109 -10 -132 45 70 -63 -42 -12 89
3724 89 34 -158 -10 171 44 -108 15 112 -12 -128 36 167 6 -122 82 62 -48 -42 46 96 -30 -52 127
3747 127 89 -83 -136 77 137 29 -123 45 134 -91 -107 46 89 -146 -50 88 137 -68 -51 29 90 -70 -49 84
3771 84 66 -18 -12 172 66 -139 -39 141 9 -18 -37 83 113 -61 -67 104 29 -61 -11 127 70 -21 -46 131 7
3796Gj88J63J61j53j54J96O0o5r7R6O0m6j29J43N5j07j14J08O5j06n0J87nj16
3820b9k5J33K8j09j02K00J6j88m2Q0J61j76j1J71kj82l7J24j5%p7L6R5j41K5Q4
3846A7K6p0n3R3L6j12P4P6k8j94M9K15l0j72J35l5qn5M4Q7k3r2K6j2m1o0J01J14
3874A08m7j57R3P9l7r2J8J13j33n0L2P7K2q3p2K98j62j00J37j19k0n3J32N2n4
3899a8r8K36j29q5Q6M4M4q7m0P5P1j71K5J4J88k16OJ12Pj79M5J11L3m0j49J14
3925aM7n4m1Q4O5r9r2J50L5j25mJ63p1k51J35Q0K8r3NO0m7n5J17j6oj02n6K08
3953F4j4p3O2P3j21o9O7R1j23m9J63J4j12j45J29Q1pk02J88L8n8p0Q2M9j17P1
3979A2l8J70k53qJ43J16j50j2r9J90pj76J56N7p9j56K22m9J1j46J71L6o1j86J56
$$ plain form
3796 7 -181 -18 143 -10 -164 32 92 27 -70 26 86 40 -89 54 109 2 -112 -4 61 -45 -95 92 87 -29
3820 -29 -54 79 107 -2 -104 96 112 -76 -118 -38 123 -53 -64 107 105 -77 -114 10 -5 -5 -82 -46 49 -92 -67 17
3846 17 43 -27 -80 13 49 -63 11 87 59 -135 -86 129 99 -73 62 27 19 -36 8 95 72 -20 6 -6 -47 -107 -6 108
3874 108 61 -96 -3 76 39 -53 -35 78 -55 -105 -73 4 26 -57 -129 169 7 -93 44 -75 -95 -148 -16 36 -18
3899 -18 -116 120 -9 -94 -8 36 80 -7 -47 28 99 -72 -47 -33 155 -61 -55 57 64 -115 -70 41 74 34 -115 -1
3925 -1 46 -8 -49 35 100 1 -91 59 94 -31 -35 128 57 -194 -59 21 49 -44 -39 21 -26 -81 36 20 14 -88 -144 64
3953 64 50 -23 39 112 -9 -78 -11 80 -43 -92 71 85 -27 -172 -43 38 31 -171 17 55 -3 -73 9 58 -59 12
3979 12 -26 144 -109 -117 26 142 -8 -20 -119 71 64 -112 44 101 22 -134 88 39 50 -96 75 111 50 -136 20
4004B0J02j30j50J81J12k45J4J16O6j26J8N1K4j25J2J23J5j60J41o7N7j24lJ37
4028E9L7j77MJ19lm7k5qJ4L9l4J3L5o2p5J74k5k1l6J69j34j05M3J58m6j43J21
4055D4J27j15j44L8J01J3j70J2K23j36l0M4M4j17j2J67l3k7p5P8K6r6j21K02j4
4080B9q8P8m4J61q4j55J67Oj60J7J65K0j61J8QK1j31J64k0Q3j36J2oJ36p0r4J79
4107A15l0j42o3K57j4j15j37K22j33M5q5J46j7j48MJ24N9j27k4O8k4o3N9kQ9j86
4133a22P9Q0q4M7k3P3k2j7j4N3k1no4J17k8j28j6M1J20n1Lm5J08j69Q0Ql6j7L8
4162a5O2j42K4J57M7j21o2K2J15j09rN8M2m7q8R4P1q0k4L8N2n2l8M6j6l5p5Q6
4190AO8j50R5j5N8j18J7J24j9q6rO0N8j99J31Nnp3L1J28j25n3j4J72mj05m2J70
$$ plain form
4004 20 122 -8 -158 23 135 -110 -96 20 86 -40 -22 29 53 -72 -60 63 78 -82 59 -8 49 -75 -78 59
4028 59 96 -81 -77 42 39 -8 -33 -41 -27 12 -22 -9 26 -36 -111 63 38 17 -19 150 16 -89 -46 112 66 -77 44
4055 44 171 56 -88 -50 51 64 -106 -94 129 -7 -37 7 51 -66 -78 89 56 29 -46 32 58 -38 -159 43 29
4080 29 -59 19 -25 136 52 -103 64 70 -90 -73 92 112 -49 -31 -23 -2 -133 31 11 94 -42 -30 -36 100 30 -64 115
4107 115 85 -57 -120 137 123 8 -129 93 -40 5 -80 66 49 -99 -95 29 88 -39 -63 5 -19 -82 -23 -25 64 -122
4133 -122 -43 37 -47 0 -23 50 28 11 -3 50 29 24 -40 77 49 -79 -95 -54 66 15 18 -27 81 -88 -8 0 -36 -53 -15
4162 -15 47 -95 -71 86 133 12 -50 -28 87 -22 -31 27 69 22 -66 28 99 19 -5 33 85 33 -5 41 25 -10 -85 1
4190 1 69 -81 14 -1 57 -61 -44 80 61 -25 -34 26 84 -115 16 21 16 -57 -26 102 -23 -76 -90 82 78 -27 -69 101
4218A01j36p6J19j3Pr1J05oK2r9l2J70o5m9K4J80k05p2J39m3j6j1O9j1L7j38J16
4245B6J3n3k4K1l2O8q8Q1K5o8m4Q0R0n4k3J0K4k9j13J22Mp0p4J29O4o0j19J09
4273A5P5j28M4M2M5j44N7J8O6j43j8Q2L3m4l9N2M1j44O9P9L3k05J32Q8j16n5j3
4300g8J45l6j07JJ81J3k17O0P9p1n2RJ83j09k0j0J27j5r4l0R7m2o7rJ08j4n3K2
4328AM5p5%M1J7No3M4Qk5o9M2O7m1k4qJ01lp2P3k9o3j2O7M3j50M4L1R0j96J09
4359bM3K9j58j9J69J8j21O3o1J91j39n7J62j16n1RJ07q0m7j6J61k9p8n1J26Kj55
4386a00O0P4K2q3L3N4j2m6l7J44j22j4L7lM6q6pP7j8n6O9K7n5j6N6N4p2o2JQ2
4416D7q0J1O7k1K4j08J00l7M2q9M8Q6o7q5M1N4k7k4L4K8k3m6L1M4n2j35J64O7
$$ plain form
4218 101 -35 -111 8 -5 2 -89 16 10 32 -67 -99 71 6 -43 -19 161 -44 -116 23 -20 -36 -47 22 11 48 -90 26
4245 26 39 -14 -38 -17 -49 19 -69 12 37 -31 -75 5 95 41 18 28 52 23 -90 32 36 -34 -108 21 85 25 -94 15
4273 15 90 -38 6 48 93 -51 6 24 90 -53 -71 11 44 0 -39 13 54 -90 -21 58 91 -114 18 106 -10 -65 -78
4300 -78 67 31 -76 -75 106 119 -98 -38 41 -30 -82 -73 110 1 -19 -29 98 83 -11 -41 56 14 -53 -62 46 32 -21 1
4328 1 46 -29 -29 12 29 34 -29 15 23 -2 -71 -29 38 -3 -27 -35 66 63 -9 64 35 -28 -40 27 70 -80 -36 -5 85 -111 -2
4359 -2 41 70 -88 -107 62 80 -41 22 -39 152 13 -44 118 2 -49 -40 67 -13 -60 -76 85 56 -22 -73 53 55 -100
4386 -100 -40 34 56 -27 6 60 48 2 -35 109 -13 -27 10 7 53 -33 -40 37 19 -37 32 59 4 -12 44 98 26 -36 -35 47
4416 47 -33 -22 45 24 48 -60 40 3 45 -44 4 90 23 -62 -21 33 6 -18 16 44 21 -25 6 50 -2 -137 27 94
4444I4j10n6J42K0n7j25R1Q4j39J4J0M3l6l1J28q8%l7J25n7l3MJ8np3j7Q3P4j02
4473c6qL4Q2j18JK4j4%rJ10j06K1k5M2n0N2m6J11l0q4P9Mnq9Q3J9o9n2Q3N5k1
4504C8j13L1M8k6k9K0n7J1N7M2j9l2J0J17j7p7j22R3N6r2mJ29j5p0K3r8J08k5
4532a3q3R2J6ro5J89j11j0p0%M2L3l7J00l5l6l1M1m4l1P4l7P5l2k6K4L5j67Q4
4561c2N2l1l1K2P2q0j8q3J16qL6m1L2N8k09J53P7o0rq4J65o0kp3O0Rm2o2P5j6
4591a4k4M9J02n7j06Q1P0j63J1Q4p1J5j4L7O4j21k1J36r8j9LQ6LN9j97J45p1m2
4619g3J5P0m5K2j48R4M5k4K4M7n1r1J32o7J79j44k1M6m6K5K4J0l8r7J3J01L1J8
4647E1j75J15j7K2K7k1l9q1Q4N3k2QJ9pL0lj11P2mmJ20m6p2N5o5l0P0o7M3m3R8
$$ plain form
4444 94 -16 -72 70 90 33 -92 -1 83 -56 -42 -32 11 -25 -56 72 -16 -16 -53 72 15 -18 -14 4 -1 -74 -91 -8 66 -36
4473 -36 -44 -10 72 -46 -45 -21 -35 -35 -44 66 -40 -19 -44 -2 -52 0 -46 65 35 -49 30 34 29 -60 23 42 -27 -79 4 59 38
4504 38 -75 -44 4 -22 -51 -31 -88 -77 -20 22 3 -29 -19 98 81 4 -118 -25 31 -61 -65 64 49 -21 2 -96 12 -13
4532 -13 -96 -4 12 3 -62 127 16 6 -64 -64 -22 11 -26 74 39 3 -28 13 -31 -62 12 -25 50 18 -8 16 51 -116 -32
4561 -32 20 -11 -42 -20 52 -28 -46 -129 -13 -21 15 -26 6 64 -145 8 85 25 16 -68 97 37 35 -38 22 31 -11 -73 2 -14
4591 -14 -38 11 113 56 -50 31 101 -62 -51 33 -38 -23 -37 0 64 -57 -78 58 -40 -59 -56 30 33 92 -105 40 -31 -73
4619 -73 -58 12 -33 -11 -159 -65 -20 -44 -20 27 -24 -115 17 -50 129 -15 -36 10 -36 -11 13 23 -15 -112 -99 2 33 51
4647 51 -124 -9 -26 -4 23 2 -37 -118 -34 19 -3 5 24 17 47 44 -67 5 1 -3 117 71 -1 54 -11 -41 29 -38 5 -38 60
4678F0k0p1K9Ook8k0M5MK4N8l5j83O6k3R7JQM4j4l4qm1N4q8J13m5k5M2L5P7q6
4710C6j40J20N2q0k9J25n4L9j18n1J75n8r9R7K1j15O8oL8pj38J11P3j04J54k20
4736a10J62o6JJ41q4j75M5J23q5O9j7k4kJ33j90J16j16m6J61n3N6k0j4J8o6P1
4762B8l4Q6j37nKM0lj5N7pL3p2J03O6j80J3K1Qm0N6q2J06J8q8L6N8m6p7M5K8M0
4793E8o8L2o5Q3l1L7p7J6rn8p8J60rQ1n3j11O0M4J8r7j7Q3j01R6Q7NJ15k13L3
4822B1r9J54q2j15J14J54k05j26J63N9o2N4q1J01%RL6j35O0o7J36r2j3rQ2jp9
4849b3N7J1O5j80R1Jm9nM0o7k3Q9o3K9K0m3N4j7p1J10N5q3J0K1l5K5M2r2P%K7
4880Cm8J15qK3p0J20j74L2q7J11J5L0j13K5P6m2n4j8J09jo4L2l3r9J47n1P3l6
$$ plain form
4678 60 40 -31 -2 4 -2 -30 -50 -5 -1 23 81 46 -137 -71 -94 3 4 12 56 42 8 0 -41 13 -75 38 -7 -32 10 45 122 36
4710 36 -104 16 68 -12 -41 84 30 69 -49 -100 75 17 -82 15 36 -79 -11 -17 21 14 -124 -13 60 -44 110 -110
4736 -110 52 -14 -13 128 44 -131 -86 37 -48 21 4 -20 -22 111 -79 37 -79 -125 36 -17 39 19 5 23 -43 28
4762 28 -6 80 -57 -62 -60 -20 -23 -38 19 12 45 -27 76 142 -38 -25 -4 4 -36 20 -62 44 62 -26 10 68 22 -55 -10 18 58
4793 58 -10 22 -43 40 9 46 -31 -15 -24 -82 -160 0 -9 72 19 -92 -32 12 30 -67 -84 -1 -102 -6 81 86 201 -12 21
4822 21 -78 76 -6 -121 -7 147 -58 -184 -21 38 -24 30 -51 50 50 59 95 -40 20 -47 89 -3 -16 -25 57 56 -23
4849 -23 34 45 110 -70 21 22 -27 -32 8 -59 -82 7 -56 -27 -7 -50 4 -13 -84 26 81 -2 8 29 -6 19 61 -31 -24 -24 3
4880 3 -45 70 62 85 15 135 -39 -7 -94 17 32 62 -51 -26 50 8 -46 -64 45 44 -20 12 -21 -120 27 -24 49 13
4908A3j7j3J17j96J06J1K5j1J1L1j8l9n7M6j23P6j18J58j7j0J29j56j1q2J07Q4
4934D6p4J00p6m4P5m0N7M1j59k0QK67k07k0J00J4l0l6N7K8p2O3o2Np0L3N4n3Q4
4963F9K6j68J66o7j91J37j5L9K5o6N1M4m1Jj19J18j0M7j23J29r7rQ3M3r6L9j3
4990BN3n7N6j47P9L2K8Nlp8k5J37r1L2l3J01l9p3M6N1j10l1J32O8k52N1J12j38
5018i2Q4O3Q8j08K3nN9m8r7R5Q5k39j38K69rQ6k04J59r1LK0J7K4k6q7P1p0J27
5046E9k8k8L5j08L5J29o0k5Q0p9L4r5K9o2J34O6p1j38R5M0J4o2J23j01jM0r0J63
5074A28k07K05j07K1M4j16J31j49K1P3M6r4oo7M9jk6J47m7k9o1J24j27N1O5k3
5100D5JL1j66K5K4Lj24J66L1p0J20M3j82R5k38J57J05j40J22p7L4M5k5q0l0L8
$$ plain form
4908 13 -4 -17 100 -96 10 21 46 35 46 77 59 20 -37 9 -114 -38 -156 2 -15 -25 104 -52 -63 -145 -38 46
4934 46 -28 72 -4 -48 27 -13 44 85 -74 -94 -86 181 -26 -46 54 68 38 2 59 87 15 78 16 21 -49 -16 38 -15 69
4963 69 95 -73 93 26 -165 -28 -43 -4 21 -45 6 50 9 10 -109 9 -1 46 -77 52 -45 -54 29 72 -24 15 2
4990 2 55 -2 54 -93 -14 18 46 51 48 -30 -55 82 -9 23 -10 91 52 -21 25 76 -34 -65 67 135 -117 -66 46 -92
5018 -92 -8 55 143 35 58 53 112 64 -33 62 147 -92 -230 39 30 116 -88 71 -20 -17 3 20 44 18 -69 2 -68 59
5046 59 31 3 38 -70 -35 94 34 9 89 10 44 -51 -22 -84 50 116 45 -93 2 42 56 -6 117 16 15 55 -35 128
5074 128 -79 126 19 40 84 -32 99 -50 -29 44 90 -4 -10 -77 -28 -29 -55 92 45 16 -45 79 -48 3 68 45
5100 45 46 77 -89 -64 -40 -37 -161 5 36 -34 86 129 -53 42 -196 -39 66 -74 48 -29 5 50 25 -55 -85 -47
5126d7j0J31pp8O4J2j15P3O3p2J2j05j4R5k1p5L7M9qq1R8Q7n4Lj07P8j4J6L0l7
5156CJ8j1j28K27j68nJ20q3O5Nj09J30j77N9Q0j5m6k1P7K3No4J1K7j5j01M3OK4
5185b0nOP2l7nn3L7j2J4j1j4j0%Q2r7N6j6P4p2n1N2k8J59j01o5P6j42R9J4O4o7
5216an9O9M7l7K2l1O1o8n2o8J21%q1M3N1p6J03j14P8j12J30o9l1O0%O1o3K7O2
5245G3o8K9K2rq6J33p7j1l5N4r0M1J06qOq5m2J48j64M1N4j21J67j41R1k6m5O7
5273B4L0j9k5J3m5qjM9rm0kJ2J8N0n7Ql8K9n5J6N5qN6q5J09j46P4l6M3L0l6NM7
5306E8p6j6L5j4k4P3J7o2L6OrPk1n1N1K6K4j22M6N4kp1J1K8N4m5Pj9J5n6L3j4
5338b1O7j42R2JJ9l7K6J9m6K9J7p0N0r3Q5Q7q7p1P2l3Kj9N1k0n8J7J32m5K8Nj15
$$ plain form
5126 -47 -57 74 67 -11 53 65 -50 23 86 14 26 -79 -93 2 -19 -94 -57 -8 -16 -97 1 88 34 37 -70 8 -6 10 40 3
5156 3 21 10 -118 109 -59 -64 56 -27 38 43 -66 64 -113 -54 26 11 -35 -56 21 44 49 -15 -4 23 8 -93 -50 -44 -20
5185 -20 -25 -19 53 16 11 -42 -5 -17 -3 -14 -28 -38 -38 44 -53 3 -13 61 -11 -62 -10 -38 121 20 -45 31 -111 -12 2 66 -1
5216 -1 -60 9 56 19 41 10 71 3 -49 -117 4 4 -77 -34 17 -59 44 -70 8 -104 26 -43 -74 -14 -14 47 -16 11 73
5245 73 5 34 56 47 -39 94 17 6 -29 25 -65 -24 82 74 80 -5 -47 101 -63 -22 32 -89 78 -63 28 2 -43 24
5273 24 54 35 10 23 -22 -30 -31 18 9 -31 -33 -21 -3 47 -10 -2 -40 -11 -66 -50 5 -3 53 -32 77 -69 5 -31 12 42 6 11 58
5306 58 -18 -34 1 -13 -37 36 53 -9 27 33 24 31 10 -41 10 36 60 -62 -16 38 36 -35 -24 4 58 13 20 1 16 -40 -7 -21
5338 -21 46 -96 -4 -3 16 -21 5 24 -22 7 24 -46 4 -89 -4 83 -4 -75 -3 -36 -34 -53 -2 -22 -80 -63 69 24 52 57 -58
5369e8J08pm5j6K0Ml0J62j38mL0M4p1l0PN5L3p4k2N9o2L8L0rK5j11O9J05q4m5
5399a7j1P9l8j9j5M1j9M5Pj63P6J8K0n7o3J35k4rK0L0j6l9J09j03M8r1M8m9N6
5428aN5j7j4j8n2N4jM5m8J7k5l9M7NJ1oj3Oj0j7O0n8K9lJ7o8L1l7J26p4m9P6L4
5461F3l7j29P9q4J60j00J25q6k7l1O9J5l7K7K5o1O4j8k5J1n7k6O1r2P3m8N0Q2
5489D6p3J0J08q5ko7J79j19l5P4p7j3M9N6p7n9J04nL4R6j81lP6MK0n9L5J0q9Q1
5519C8Qm6K8j44J39J5L7j00l3P8pn0J3J5M5o4O9o9j10J83p9j9L8R0jj00K4L9j36
5548i9J55m9p1l1J25r0K0L0O2m5O4j5j32rJ29rL0p5k3L8o7L5J8J43j67K4k1L3
5576CJ23j28N2rk1m8K9o7J8J41o7l8L4Nj16P3N0o2Q4n0n7P6N2q9n8J12m4lK3n4
$$ plain form
5369 -58 50 43 -2 -18 2 6 -24 138 0 -4 26 70 -1 -31 -24 31 64 -10 -32 27 -35 3 33 24 49 -62 7 112 28 -17
5399 -17 -28 51 13 -6 -21 20 1 46 53 -110 -34 -16 4 -53 -116 19 -5 -14 6 36 20 -19 90 -13 35 -56 -8 -57 -1
5428 -1 54 37 23 5 -47 7 6 51 3 20 -5 -44 3 8 19 13 0 6 -4 -21 39 -19 10 7 24 -44 -13 -50 76 2 -47 29 63
5461 63 26 -103 -24 -108 52 -48 77 -9 -36 -67 2 17 -20 7 32 -29 35 17 -8 3 -54 -80 -19 -111 -38 -86 -36 46
5489 46 -27 -17 91 6 4 -63 116 -3 -38 36 -41 -54 -5 51 -26 -85 19 14 48 144 -37 -40 36 40 60 1 36 46 -43 38
5519 38 46 0 28 -116 23 38 75 -25 -58 20 13 -37 -24 -9 36 -28 41 -28 -138 45 -34 -53 -15 75 74 -26 -2 37 -99
5548 -99 56 7 -64 -95 30 -60 -40 -10 52 7 71 56 -76 -85 44 35 65 -10 -33 5 -62 -27 -9 134 -33 -9 -30 3
5576 3 126 -2 50 41 20 -28 1 -66 -48 93 26 -12 22 27 -89 -16 34 -28 56 6 -51 25 77 -12 -70 42 -2 -5 18 -36
5606c6N0n1k4M8O0p9O9mr5P4j08O2R2p1J37j50K1N6j18J26J4no0O9q8N5nl6L7
5635D0l0jj3n1L8j08K48k3j53M7O6q6P1J9j07O8n8N9o9L6N2J0p3R7n3q9P6k0L4
5664B7m4Q5n8o5O6J3n8L7j9J1N1r6MQJ9M2n2JL3p9J58n8j3L0q2J45m7o2r4N9P2
5695C4l5N8Oj6Klm8o3J2R9Lm2Q9l9k4m8k4N8NoJ0q4L5Pl5P0m3j43O9N5Q7j14M4
5728b4M8Qj3j33M2P3k6O8n2N0j36J67o6J9m4J2N8j17L7K3L7l4j8J07k4Ql7r4J1
5757e0R9j30N7J2mN0mr2N4O7K1q3k4j7o2J06pj2k7J17j11k0O8L1L2o4J5j6m5M4
5787Eo4K8Q8k01J33kN3r2N9J7p0K7O1jj77J45K9l4J5N2j57J68L9p9r6LJ07j46
5815i0K5R3rr0J18K0r8l8J8P8L9j12Q6j57J34p0J29j67M4O3q5O1m6Q4K7Qo9n1
$$ plain form
5606 -36 14 -37 -61 -13 47 -32 37 33 -62 12 -96 -34 58 -13 124 -26 -5 51 -67 59 73 68 8 77 -11 44 39 3 40
5635 40 10 9 -4 -55 -17 -125 123 100 -53 -6 60 -26 45 64 -43 25 -33 26 -43 -7 45 55 -18 79 26 -63 13 -7 27
5664 27 -17 68 10 -55 11 24 -34 3 -16 -5 46 -50 -46 -38 -19 23 -29 -28 5 -74 84 26 13 43 -39 106 59 -3 -97 -38 34
5695 34 -1 57 63 47 49 46 -2 -65 -53 46 49 7 96 57 33 -15 -39 19 24 18 28 -56 -21 -14 -49 21 -22 -165 -96 -41 46 -68 -24
5728 -24 24 32 19 -114 -72 1 -25 43 -9 41 -95 72 6 25 -19 -7 51 -66 -29 -6 31 -3 -21 86 62 70 33 -61 -50
5757 -50 49 -81 -24 -12 -16 34 30 -62 -8 59 80 -3 -27 -44 -106 0 -7 -19 -46 71 -40 -60 8 39 71 7 22 6 -39 5
5787 5 -59 -31 57 -144 -11 -13 40 -52 7 24 -46 -19 42 41 -136 9 38 4 19 71 -86 82 121 42 -54 -51 56 -90
5815 -90 -65 28 19 -71 47 67 -31 -69 -51 27 66 -46 40 -117 17 -53 76 -91 -47 16 -69 -8 -54 30 57 65 -4 -55
5843e5J18j1j39K5Q5o4M7K5q9N3p3M5J5L0j23R6N9K1j71O6j1M5j4M5L2k3l0O1
5871F5m7Q6j38N6J6j11J28r7j1J7M5P6r1J1m8O4j2k9%m4O9O8n4n7j4J0J6P0Q6
5900A30q6p8P5n5P0l0R8r0j16RJ04j45J06j7Q8POn6o7J29r9J17o1KLl0j17J07
5928DK4o9LJ08o8l2K4n8j7O2N8J4j07J31j69OJ26N8L0j52R9J2j25J01k6m7O6m6
$$ plain form
5843 -55 63 52 -87 -62 23 -41 6 31 -58 -5 -78 -33 -18 12 -111 -15 44 65 -106 -40 -51 -6 -20 25 57 34 4 65
5871 65 18 104 -34 22 38 -73 55 -42 -53 -36 9 85 -6 5 -43 21 9 -20 -20 -64 5 73 19 -38 -52 -42 -26 44 130
5900 130 44 -34 41 -14 56 26 124 34 -82 -73 31 -114 -8 -25 63 70 76 20 -47 82 -17 100 39 41 44 14 -103 4
5928 4 28 -41 -38 70 2 -30 -6 -64 -81 -19 39 53 -54 77 -92 -86 40 98 128 -24 75 87 -38 63 37 -10 56 10
$$ [...]
8191A3
##END NTUPLES=NMR FID
##END=
