##TITLE=1H_AM-NVA508BuA
 CDCl3
 8 sc, 
 20.09.2022
##JCAMPDX= 6.0         $$ Bruker NMR JCAMP-DX V2.0
##DATA TYPE= NMR FID
##DATA CLASS= NTUPLES
##ORIGIN= UXNMR, Bruker Analytische Messtechnik GmbH
##OWNER= root
$$ XWIN-NMR		Version 3.5
$$ Tue Sep 20 13:29:25 2022 Russian Standard Time (UT+4h)  she@DPX200
##.OBSERVE FREQUENCY= 200.1313499994
##.OBSERVE NUCLEUS= ^1H
##.DELAY= (6, 6)
##.ACQUISITION MODE= SIMULTANEOUS
##.ACQUISITION SCHEME= undefined
##.AVERAGES= 8
##.DIGITISER RES= 18
##SPECTROMETER/DATA SYSTEM= spect
##.PULSE SEQUENCE= zg30
##.SOLVENT NAME= CDCl3
##.SHIFT REFERENCE= (INTERNAL, CDCl3, 0, 15.7039)
##AUDIT TRAIL= $$ (NUMBER, WHEN, WHO, WHERE, WHAT)
$$ ##TITLE= Audit trail, XWIN-NMR		Version 3.5
$$ ##JCAMPDX= 5.01
$$ ##ORIGIN= Bruker BioSpin GmbH
$$ ##OWNER= she
$$ F:/spectra/data/she/nmr/H-F/1/audita.txt
$$ ##AUDIT TRAIL=  $$ (NUMBER, WHEN, WHO, WHERE, WHAT)
(   1,<2022-09-20 13:28:14.21 +0400>,<she>,<DPX200>,
      <created by zg, POWCHK disabled, PULCHK disabled
       configuration hash MD5:
       00 E9 B6 7A A2 85 ED C7 34 08 36 98 17 FE 4E 26
       data hash MD5: 16K
       A6 19 DD 07 B5 5A 79 49 76 C3 0F C4 D3 DA C0 DA>)
$$ ##END=
$$ 
$$ hash MD5
$$ 86 6F 26 F0 4A AD FE 4C 37 5B 6D D1 10 C9 9B C1
##$RELAX= 
##$RELAX= 
##$RELAX= 
##$RELAX= 
##$RELAX= 
##$RELAX= 
$$ Bruker specific parameters
$$ --------------------------
##$DU= <F:/spectra>
##$EXPNO= 1
##$NAME= <H-F>
##$PROCNO= 1
##$TYPE= <nmr>
##$USER= <she>
##$AMP= (0..31)
100 100 100 100 100 100 100 100 100 100 100 100 100 100 100 100 100 100 
100 100 100 100 100 100 100 100 100 100 100 100 100 100 
##$AQSEQ= 0
##$AQ_mod= 1
##$AUNM= <au_zg>
##$AUTOPOS= <>
##$BF1= 200.13
##$BF2= 200.13
##$BF3= 200.13
##$BF4= 200.13
##$BF5= 200.13
##$BF6= 200.13
##$BF7= 200.13
##$BF8= 200.13
##$BYTORDA= 1
##$CFDGTYP= 0
##$CFRGTYP= 5
##$CHEMSTR= <none>
##$CNST= (0..31)
1 1 145 1 1 1 1 1 1 1 1 1 1 1 1 1 1 1 1 1 1 1 1 1 1 1 1 1 1 1 1 1 
##$CPDPRG= <>
##$CPDPRG1= <>
##$CPDPRG2= <>
##$CPDPRG3= <>
##$CPDPRG4= <mlev>
##$CPDPRG5= <mlev>
##$CPDPRG6= <mlev>
##$CPDPRG7= <mlev>
##$CPDPRG8= <mlev>
##$CPDPRGB= <>
##$CPDPRGT= <>
##$D= (0..31)
0 1.2 0 0 0 0 0 0 0 0.06 0 0.03 0 0 0 0 0.0002 0 0 0 0 0 0 0 0 0 0 0 0 
0 0 0 
##$DATE= 1663666093
##$DBL= (0..7)
120 120 120 120 120 120 120 120 
##$DBP= (0..7)
150 150 150 150 150 150 150 150 
##$DBP07= 0
##$DBPNAM0= <>
##$DBPNAM1= <>
##$DBPNAM2= <>
##$DBPNAM3= <>
##$DBPNAM4= <>
##$DBPNAM5= <>
##$DBPNAM6= <>
##$DBPNAM7= <>
##$DBPOAL= (0..7)
0.5 0.5 0.5 0.5 0.5 0.5 0.5 0.5 
##$DBPOFFS= (0..7)
0 0 0 0 0 0 0 0 
##$DE= 6
##$DECBNUC= <off>
##$DECIM= 32
##$DECNUC= <off>
##$DECSTAT= 4
##$DIGMOD= 1
##$DIGTYP= 9
##$DL= (0..7)
0 120 120 120 120 120 120 120 
##$DP= (0..7)
150 150 150 150 150 150 150 150 
##$DP07= 0
##$DPNAME0= <>
##$DPNAME1= <>
##$DPNAME2= <>
##$DPNAME3= <>
##$DPNAME4= <>
##$DPNAME5= <>
##$DPNAME6= <>
##$DPNAME7= <>
##$DPOAL= (0..7)
0.5 0.5 0.5 0.5 0.5 0.5 0.5 0.5 
##$DPOFFS= (0..7)
0 0 0 0 0 0 0 0 
##$DQDMODE= 0
##$DR= 18
##$DS= 0
$$ [...]
##$SUBNAM2= <"">
##$SUBNAM3= <"">
##$SUBNAM4= <"">
##$SUBNAM5= <"">
##$SUBNAM6= <"">
##$SUBNAM7= <"">
##$SUBNAM8= <"">
##$SUBNAM9= <"">
##$SW= 18.0517283424941
##$SWIBOX= (0..15)
0 0 2 0 0 0 0 0 0 0 0 0 0 0 0 0 
##$SW_h= 3612.71676300578
##$TD= 16384
##$TD0= 1
##$TE= 0
##$TE2= 300
##$TE3= 300
##$TEG= 300
##$TL= (0..7)
0 120 120 120 120 120 120 120 
##$TP= (0..7)
150 150 150 150 150 150 150 150 
##$TP07= 0
##$TPNAME0= <>
##$TPNAME1= <>
##$TPNAME2= <>
##$TPNAME3= <>
##$TPNAME4= <>
##$TPNAME5= <>
##$TPNAME6= <>
##$TPNAME7= <>
##$TPOAL= (0..7)
0.5 0.5 0.5 0.5 0.5 0.5 0.5 0.5 
##$TPOFFS= (0..7)
0 0 0 0 0 0 0 0 
##$TUNHIN= 0
##$TUNHOUT= 0
##$TUNXOUT= 0
##$USERA1= <user>
##$USERA2= <user>
##$USERA3= <user>
##$USERA4= <user>
##$USERA5= <user>
##$V9= 5
##$VALIST= <valist>
##$VCLIST= <CCCCCCCCCCCCCCC>
##$VD= 0
##$VDLIST= <DDDDDDDDDDDDDDD>
##$VPLIST= <PPPPPPPPPPPPPPP>
##$VTLIST= <TTTTTTTTTTTTTTT>
##$WBST= 1024
##$WBSW= 4
##$XGAIN= (0..3)
0 0 0 0 
##$XL= 0
##$YL= 0
##$YMAX_a= 183046
##$YMIN_a= -215710
##$ZGOPTNS= <>
##$ZL1= 120
##$ZL2= 120
##$ZL3= 120
##$ZL4= 120
##$ABSF1= 10
##$ABSF2= 0
##$ABSG= 5
##$ABSL= 3
##$ALPHA= 0
##$AQORDER= 0
##$ASSFAC= 0
##$ASSFACI= 0
##$ASSFACX= 0
##$ASSWID= 0
##$AUNMP= <proc_1d>
##$AZFE= 0.1
##$AZFW= 0.1
##$BCFW= 1
##$BC_mod= 2
##$BYTORDP= 1
##$COROFFS= 0
##$CY= 11.3945322036743
##$DATMOD= 1
##$DC= 2
##$DFILT= <>
##$DTYPP= 0
##$F1P= 2.36226072786647
##$F2P= -0.459571619588291
##$FCOR= 0.5
##$FTSIZE= 0
##$FT_mod= 4
##$GAMMA= 1
##$GB= 0.15
##$INTBC= 1
##$INTSCL= 1
##$ISEN= 128
##$LB= 0.24
##$LEV0= 0
##$LPBIN= 0
##$MAXI= 10000
##$MC2= 0
##$MEAN= 0
##$ME_mod= 0
##$MI= 1.114404
##$NCOEF= 0
##$NC_proc= 0
##$NLEV= 6
##$NOISF1= 3.799351
##$NOISF2= 2.8
##$NSP= 1
##$NTH_PI= 0
##$NZP= 0
##$OFFSET= 15.70392
##$PC= 1
##$PHC0= -18114.68
##$PHC1= 12.00069
##$PH_mod= 1
##$PKNL= yes
##$PPARMOD= 0
##$PSCAL= 0
##$PSIGN= 0
##$REVERSE= no
##$SF= 200.130013532006
##$SI= 16384
##$SIGF1= 3
##$SIGF2= 2
##$SINO= 400
##$SIOLD= 16384
##$SREGLST= <1H.CDCl3>
##$SSB= 0
##$STSI= 0
##$STSR= 0
##$SW_p= 3612.71676300578
##$SYMM= 0
##$S_DEV= 0
##$TDeff= 0
##$TDoff= 0
##$TI= <>
##$TILT= no
##$TM1= 0
##$TM2= 0
##$TOPLEV= 0
##$USERP1= <user>
##$USERP2= <user>
##$USERP3= <user>
##$USERP4= <user>
##$USERP5= <user>
##$WDW= 1
##$XDIM= 8192
##$YMAX_p= 0
##$YMIN_p= 0
$$ End of Bruker specific parameters
$$ ---------------------------------
##NTUPLES= NMR FID
##VAR_NAME=  TIME,          FID/REAL,        FID/IMAG
##SYMBOL=    X,             R,               I
##VAR_TYPE=  INDEPENDENT,   DEPENDENT,       DEPENDENT
##VAR_FORM=  AFFN,          ASDF,            ASDF
##VAR_DIM=   8192,          8192,            8192
##UNITS=     SECONDS,       ARBITRARY UNITS, ARBITRARY UNITS
##FACTOR=    0.0002768,     1,               1
##FIRST=     0,             0,               0
##LAST=      2.2672688,     0,               0
##MIN=       0,             -215710,         0
##MAX=       2.2672688,     183046,          0
$$ Real data points
##PAGE= N=1
##DATA TABLE= (X++(R..R)), XYDATA
0 0 0 0 0 0 0 0 0 0 0 0 0 0 0 0 0 0 8 -8 8 -8 8 -8 16 -16 16 -19 24 -24 32 -32 40 -44 48 -56 63 -68 77 -86
38 -86 97 -108 118 -132 146 -160 177 -194 215 -236 259 -286 315 -347 383 -424 470 -523 584 -655
58 -655 741 -844 974 -1138 1351 -1648 2079 -2751 3924 -6332 13094 -67656 -215710 71434
72 71434 103256 -9993 -6275 -71816 -17794 84194 16005 -29945 -32862 -18599 37850 48645
84 48645 -11518 -85391 -12601 121829 5049 -113220 3053 59002 20922 -2879 -59153
95 -59153 -26696 69989 40228 -44156 -46735 -4402 43952 58552 -38054 -92955 35264 78353
107 78353 -18398 -24653 -24550 -17386 61440 23007 -48976 -24568 2302 49361 23290 -67266 -17512
120 -17512 43331 25520 -5210 -63688 2233 84044 -23514 -50648 15742 -1751 26870 23131
132 23131 -51949 -20565 29792 29853 7844 -47014 -25160 37759 31091 1103 -45732 -33431 58317
145 58317 37460 -45375 -28021 10436 25498 21654 -29782 -35832 30463 33870 -21738 -23100 2181
158 2181 11335 22309 -5151 -37016 -798 30640 18484 -12153 -44953 -1848 57632 11760
170 11760 -43231 -28507 17267 46449 275 -44448 -11840 19686 29061 4366 -43239 -11010
182 -11010 34829 12603 -6183 -25488 -16997 40794 20641 -37435 -17658 13815 22502 11179
194 11179 -28446 -25182 20119 32600 2790 -38521 -26011 37153 38882 -21276 -41433 -4932
206 -4932 37072 28492 -26202 -38633 8668 33442 12357 -18151 -29832 -301 36186 18059
218 18059 -29246 -34260 14014 45895 1697 -46906 -15045 34322 27295 -13619 -36635 -5858
230 -5858 36192 19592 -21821 -28296 -857 31362 21500 -24459 -33712 6848 37562 14597 -33557
243 -33557 -29843 21015 34067 -1455 -29087 -18632 18680 31304 -5066 -32819 -10096 25299
255 25299 23300 -13319 -29866 -82 27356 13355 -17779 -23970 5430 27697 6769 -22002
267 -22002 -17611 9250 25272 5320 -26303 -17502 19238 25481 -6872 -27759 -5730 22860 15297
280 15297 -11762 -20681 -1272 20855 11930 -15122 -18337 5080 20263 5816 -17406 -14731 10286
293 10286 20403 -989 -21643 -7718 17707 14399 -9253 -18142 -950 17859 10301 -12878 -17171
306 -17171 4625 20242 4222 -18230 -11768 11198 16891 -1563 -18454 -7943 15398 15250 -8380
319 -8380 -19117 -609 18316 9512 -12784 -16555 4243 19962 5074 -18160 -13156 11515 18388
332 18388 -2009 -19032 -7822 14473 15922 -5954 -20295 -3862 19281 12467 -12613 -18180 2262
345 2262 19674 8532 -16105 -16855 7892 20842 2863 -19607 -12901 13214 19391 -2767 -20739
358 -20739 -9098 16958 18701 -8847 -22805 -2108 20448 13348 -12776 -21275 1945 22960 9704
371 9704 -17956 -19344 8134 23947 3615 -21767 -14354 13331 21463 -1359 -22982 -10441 18183
384 18183 18710 -7962 -21781 -4871 19636 16077 -12870 -21825 2444 21356 9462 -16254 -18367
397 -18367 8134 20574 2722 -16437 -14301 9350 21702 -1132 -21166 -8525 14141 17961
409 17961 -5277 -22403 -3158 18751 11381 -9610 -17903 200 18859 7182 -12393 -12828 1954
422 1954 16301 7470 -15203 -13306 8859 15860 362 -15588 -8810 12358 13869 -6234 -14854
435 -14854 -1806 12745 9283 -8841 -12955 3051 11507 4979 -7412 -12699 3651 15098 620
448 620 -10604 -7492 3980 14707 -53 -16125 -2398 10197 7287 -2686 -13197 -941 14313
461 14313 2366 -8941 -5934 2210 10710 1575 -11591 -3987 7098 7922 -1082 -11731 -3321 11185
475 11185 6724 -5470 -10376 -1978 12877 7625 -11387 -10368 5152 11286 3420 -11443 -9918 10255
489 10255 11353 -5548 -9062 -2647 7292 9758 -7016 -10493 3913 5747 4608 -1886 -13687 1052
503 1052 15555 1596 -9964 -9546 3545 17751 314 -18588 -4736 12275 11312 -5092 -14969
516 -14969 -78 10896 5588 -1949 -11811 -4963 13867 7792 -8100 -9997 -2211 13554 10172 -15514
530 -15514 -12536 11702 11327 -2221 -10034 -8290 9214 14318 -6156 -13812 -1530 9526 11709 -5250
544 -5250 -17970 1154 16093 5111 -8850 -12302 2064 14537 2996 -8585 -8916 -931 15015
557 15015 7268 -15825 -10016 8995 13369 -15 -17480 -4589 16992 5361 -9563 -6982 261
570 261 9491 4744 -7650 -5657 -961 6659 11392 -8401 -16698 6973 15146 240 -10604 -9951
584 -9951 6908 15505 -4100 -13430 -67 6214 5627 605 -9438 -4318 8494 6139 -3917 -7757
598 -7757 -418 7971 2700 -4809 -4796 -321 8011 3686 -9435 -4294 5613 5435 1882 -9242 -7285
613 -7285 12462 7547 -10268 -5446 2900 4931 3957 -5773 -5765 4447 3488 163 -1303 -5088 689 6862
629 6862 254 -5752 -3398 4695 7238 -4779 -8663 3691 7358 905 -5859 -6947 5726 9878
643 9878 -4648 -7962 90 4344 5948 -2145 -8392 433 5331 3080 -324 -7181 -2995 8018 4974
658 4974 -4583 -7725 -20 10596 2909 -10752 -4579 7362 6677 -2527 -8592 -1470 8114 4181 -4273
673 -4273 -5908 -1558 6405 6853 -4773 -9402 503 8673 5625 -6007 -10838 2799 11822 1181
687 1181 -8178 -6384 3115 10755 489 -10879 -3262 6628 6783 -1714 -9545 -1289 8425 3715 -3781
702 -3781 -6991 -812 8782 3660 -6035 -6468 76 9863 5025 -10725 -7645 6664 9321 52 -10391
717 -10391 -5320 8820 7641 -4059 -7913 -1482 6346 5340 -2729 -7107 -1689 6946 5110 -4493
731 -4493 -7089 449 8051 3317 -7169 -5693 3908 7313 355 -8011 -3447 6119 5203 -1636 -6587
746 -6587 -2749 6604 4815 -3599 -5377 -1373 5503 4818 -4123 -5439 226 4959 4160 -4406 -6049 2639
762 2639 5480 922 -4614 -4154 4032 5170 -2389 -4645 -456 4075 2750 -3125 -3584 906 3684 1884
778 1884 -3374 -3587 1927 4070 762 -4003 -3277 3300 4470 -1375 -4624 -1107 4323 2820 -3132 -3519
794 -3519 959 3908 1192 -3899 -2384 2808 2993 -552 -3522 -1657 3465 3059 -2027 -3882 -447 4182
810 4182 2711 -3263 -4216 860 4974 1968 -4745 -4028 2985 4942 16 -4903 -2943 3842 4690 -1542
826 -1542 -4996 -1440 4161 4019 -2261 -5245 -492 4990 3488 -3529 -5591 1105 5985 1938 -4777
841 -4777 -4852 2482 6388 355 -5848 -3349 3608 5707 -598 -6305 -2399 4818 4958 -1872 -6337 -1334
857 -1334 5854 4100 -3469 -5942 185 6355 2911 -4880 -5228 1986 6279 1336 -5626 -4181 3383
872 3383 5962 -355 -6000 -2665 4215 5106 -1370 -6172 -1413 5152 3797 -2384 -5571 -587 5839
887 5839 2764 -3843 -4313 537 5377 2121 -4881 -3394 2197 4134 1258 -4585 -3329 3582 3742 -644
903 -644 -3733 -2534 3542 3997 -2122 -3802 -714 3199 3286 -2409 -4144 698 3605 1779 -2619 -3573
919 -3573 1477 3935 207 -3082 -2080 1785 3388 -402 -3623 -834 2698 1869 -967 -2807 -738
934 -738 3407 1504 -2832 -1618 830 2161 1275 -3064 -1971 2871 1719 -902 -2007 -1195 2824 1872
950 1872 -2400 -1642 315 2130 1600 -2896 -1821 2128 1396 333 -1953 -2310 2906 2305 -2305 -1479 -179
967 -179 1549 2529 -2185 -3137 1764 2526 325 -1928 -2723 1669 3930 -837 -3612 -931 2461 2977 -1180
984 -1180 -3880 -191 2999 1935 -992 -3684 -765 4089 1855 -2400 -3024 -394 4410 2213 -4651
999 -4651 -2518 2608 2750 746 -3608 -2765 3815 2831 -1684 -2487 -1952 2881 4285 -2780 -4215 542
1015 542 3131 3146 -2338 -5499 1441 5114 854 -3035 -3936 1042 5622 502 -4699 -2306 2196 4160
1031 4160 25 -4684 -1309 3110 2419 -400 -3637 -1507 3943 2061 -2228 -2358 -836 3326 3112 -3982
1047 -3982 -3440 2640 2857 713 -2746 -3683 2852 4286 -1604 -2950 -1297 1452 3767 -510 -3825 -732
1063 -732 1851 2599 196 -3796 -1177 3054 1835 -893 -2855 -789 3664 1115 -3119 -1017 1331
1078 1331 1680 260 -2702 -669 2581 608 -802 -1259 -1348 2264 2195 -2010 -1962 -179 1912 2692 -2326
1095 -2326 -3353 1923 2188 37 -926 -2253 761 2776 -921 -1513 201 256 1102 -285 -1707 866
1111 866 1370 -670 -967 -389 1092 1306 -1081 -1360 29 907 1807 -498 -3026 10 2649 1151 -1218
1128 -1218 -2774 76 3725 170 -2977 -256 1106 937 276 -1662 -364 1372 125 43 -775 -1313
1144 -1313 1903 1652 -1984 -1799 514 2612 1333 -3420 -2343 2818 2646 -500 -2711 -2064 2322 3302
1160 3302 -843 -3031 -1463 1996 3282 -666 -3531 -854 2404 2373 -836 -3241 -434 2938 1506
1175 1506 -1665 -2633 138 3612 939 -3732 -1740 2533 2690 -582 -3608 -1145 3486 2102 -1687
1190 -1687 -2561 -1079 2552 3173 -1511 -3706 -745 3101 3225 -1987 -4373 519 3795 1281 -2278 -2714
1206 -2714 814 2981 321 -2072 -1325 821 2057 188 -2135 -949 1532 1739 -546 -2401 -486
1221 -486 2446 1467 -1555 -2386 -34 2940 1573 -2657 -2522 1343 2731 548 -2353 -2016 1540 2344
1237 2344 -319 -1658 -1016 666 1850 174 -1809 -904 1178 1556 -556 -2008 159 1995 304 -1646
1253 -1646 -1010 1195 1705 -649 -1920 -92 1521 1042 -685 -1758 -210 1821 1026 -1149 -1565 156
1269 156 1695 619 -1270 -1102 453 1336 280 -1382 -715 1142 943 -615 -1283 18 1691 490
1285 490 -1816 -918 1378 1325 -461 -1553 -565 1295 1374 -503 -1707 -591 1414 1591 -567 -2174 -497
1302 -497 2153 1415 -1540 -1959 575 2047 464 -1636 -1348 928 1946 -105 -1974 -782 1400 1713
1318 1713 -438 -2374 -579 2303 1551 -1364 -2374 -67 2662 1437 -2001 -2503 530 3068 1031
1333 1031 -2755 -2159 1457 2794 306 -2824 -1684 2048 2347 -510 -2443 -1180 2023 2281 -999 -2673
1349 -2673 -515 2491 1894 -1768 -2647 507 2697 1025 -2152 -2195 1101 2639 325 -2288 -1665 1283
1365 1283 2492 78 -2575 -1357 1879 2119 -563 -2336 -900 2009 1875 -1132 -2137 -219 1959
1380 1959 1503 -1468 -2091 545 1997 777 -1653 -1792 1167 1952 -200 -1477 -1162 963 2058 -484
1396 -484 -1925 -410 1162 1579 -483 -2238 -22 1901 713 -1030 -1523 277 1853 222 -1409 -770
1412 -770 617 1338 78 -1538 -505 1174 891 -451 -1279 -244 1485 680 -1261 -889 565 1101 318
1429 318 -1321 -847 1220 935 -512 -997 -500 1216 1071 -1218 -1047 475 915 638 -1100 -1258 1102
1446 1102 1101 -310 -831 -936 906 1623 -850 -1429 28 989 1218 -811 -1880 576 1578 285 -912
1463 -912 -1468 445 2035 -11 -1588 -826 631 1890 131 -2342 -584 1714 1205 -385 -1977 -712
1479 -712 2277 1231 -1488 -1523 -91 1915 1485 -1986 -2028 1148 1997 514 -1903 -1938 1631 2335 -622
1496 -622 -1913 -1081 1377 2415 -805 -2497 -290 1647 1871 -716 -2954 92 2711 745 -1372 -1931
1512 -1931 72 2741 622 -2283 -1073 723 1781 802 -2308 -1503 1834 1610 -297 -1792 -1233 1965
1528 1965 1857 -1340 -1683 -187 1467 1700 -1298 -2140 613 1644 872 -1079 -2203 771 2345 -135
1544 -135 -1424 -1057 504 2108 -55 -2023 -299 948 1104 202 -1873 -651 1825 762 -806 -1128
1560 -1128 -384 1681 955 -1677 -984 794 1118 436 -1434 -1085 1428 1057 -599 -886 -616 1019 1263
1577 1263 -981 -1027 223 633 963 -668 -1562 817 1241 -288 -704 -781 727 1430 -976 -1178 583 640
1595 640 466 -511 -1266 600 1194 -125 -643 -907 335 1672 -251 -1504 -191 746 1046 -160 -1617
1612 -1617 -68 1347 352 -442 -987 -369 1542 671 -1444 -811 626 1171 292 -1609 -782 1501 925
1629 925 -583 -1086 -584 1249 1303 -848 -1426 -312 1410 1609 -1283 -2163 706 1906 533 -1400 -1731
1646 -1731 963 2055 -348 -1425 -720 541 1776 68 -2051 -561 1403 1296 -389 -2028 -389
1661 -389 2143 957 -1351 -1516 155 1958 849 -1754 -1455 752 1822 605 -1902 -1534 1433 1795
1677 1795 -293 -1603 -997 1219 1710 -574 -1608 -419 1047 1464 -450 -1949 -113 1702 865 -1021
1693 -1021 -1573 396 1864 173 -1434 -788 599 1392 214 -1529 -760 970 1174 49 -1436 -947
1709 -947 1321 1343 -677 -1346 -321 1128 1111 -759 -1348 184 1153 575 -825 -1063 538 1142 -89 -897
1727 -897 -471 691 905 -488 -895 94 639 570 -351 -1123 115 1190 285 -862 -849 449 1272 -99
1745 -99 -1243 -256 871 652 -414 -863 36 775 307 -462 -622 102 864 231 -850 -525 585 824 -136
1764 -136 -1023 -349 1011 740 -607 -944 -63 1017 746 -815 -1095 308 1173 408 -1005 -945 647 1107
1782 1107 -33 -940 -648 685 1072 -271 -1067 -362 811 1080 -481 -1469 28 1396 606 -985 -1255
1799 -1255 446 1511 224 -1268 -922 669 1381 76 -1369 -819 885 1402 -133 -1563 -574 1271
1815 1271 1187 -596 -1447 -192 1383 914 -955 -1347 304 1412 468 -1141 -1137 678 1473 -36 -1354
1832 -1354 -697 889 1285 -256 -1417 -462 1065 1165 -461 -1551 -205 1391 859 -765 -1379 79
1848 79 1499 491 -1056 -909 310 1173 378 -1063 -825 588 1084 99 -1100 -661 850 1020 -308
1865 -308 -1118 -305 988 789 -582 -1024 -5 986 600 -726 -982 288 1083 209 -862 -662 469 935
1883 935 -64 -931 -289 616 599 -185 -816 -169 806 447 -523 -699 138 897 149 -852 -384 554 622 -157
1903 -157 -791 -150 730 377 -351 -588 -74 735 413 -633 -583 281 722 151 -765 -459 625 631 -284 -710
1923 -710 -181 680 544 -500 -731 112 753 383 -626 -773 382 907 57 -789 -559 510 919 -137
1941 -137 -930 -323 672 818 -276 -1075 -168 978 602 -545 -993 41 1139 399 -889 -753 326 1007
1959 1007 304 -1013 -750 666 996 -30 -1047 -647 880 1054 -440 -1145 -230 1000 834 -657 -1135
1976 -1135 116 1063 525 -760 -1029 342 1195 179 -935 -751 522 1139 -50 -1132 -419 752 884
1993 884 -201 -1126 -295 1005 693 -523 -945 -91 1034 577 -795 -825 277 887 347 -751 -757 440
2011 440 870 49 -739 -586 489 900 -152 -869 -279 619 685 -311 -869 -7 740 374 -415 -693 89 815
2031 815 192 -604 -447 228 714 97 -768 -305 540 477 -142 -622 -212 647 399 -417 -487 57 560 278 -526
2052 -526 -449 351 489 -21 -497 -287 469 447 -298 -477 -6 454 334 -411 -507 242 519 65 -440 -419 340
2073 340 591 -140 -554 -173 431 519 -256 -644 55 560 265 -348 -567 162 685 38 -541 -311 258 588
2093 588 24 -708 -249 542 480 -193 -690 -165 726 461 -496 -655 68 739 350 -619 -618 262 727 227 -653
2114 -653 -630 444 774 -40 -700 -428 524 764 -246 -787 -122 625 533 -315 -808 8 814 340 -548 -680
2134 -680 213 883 154 -788 -467 465 739 -22 -806 -381 629 635 -187 -736 -297 683 647 -384 -737 -31
2154 -31 683 431 -488 -632 197 638 185 -482 -498 298 615 -34 -509 -288 331 587 -137 -671 -74 521 360
2175 360 -214 -591 -70 643 300 -414 -484 69 579 226 -474 -416 235 503 58 -457 -233 310 337 -77 -349
2196 -349 -119 339 269 -246 -322 109 347 117 -322 -314 277 422 -123 -401 -128 319 366 -190 -451 1 360 242
2218 242 -229 -404 90 401 56 -243 -250 126 364 -48 -353 -40 242 213 -140 -381 51 432 91 -371 -304
2239 -304 240 475 -34 -459 -199 344 436 -110 -501 -139 416 377 -167 -472 -107 467 348 -310 -455 76 447
2260 447 187 -363 -394 225 462 -22 -420 -256 307 477 -155 -527 -106 434 419 -245 -602 -11 557 326 -323
2281 -323 -595 26 660 262 -448 -496 131 628 165 -540 -369 297 510 7 -499 -224 380 386 -145 -452 -101
2302 -101 429 319 -299 -446 61 481 203 -407 -415 212 519 44 -444 -316 267 479 -19 -460 -203 281 377
2323 377 -45 -419 -137 337 268 -121 -335 -55 344 164 -226 -233 81 297 67 -297 -154 224 239 -63 -300
2344 -300 -93 290 218 -162 -270 -16 282 201 -216 -292 62 277 111 -232 -257 107 271 -2 -225 -108 153
2365 153 196 -80 -207 23 210 100 -135 -198 103 257 -18 -216 -121 169 257 -64 -275 -47 236 199 -117 -294
2387 -294 10 300 115 -201 -222 77 285 35 -276 -126 174 195 -68 -261 -62 254 168 -164 -256 -9 305
2408 305 158 -257 -273 112 321 86 -298 -261 202 335 -15 -283 -199 220 346 -76 -333 -114 245 286 -106
2429 -106 -364 -26 316 176 -183 -318 31 380 114 -280 -259 121 370 50 -362 -204 241 332 -32 -370 -168
2450 -168 312 293 -120 -347 -89 316 268 -195 -335 9 323 193 -205 -300 101 339 60 -251 -191 134 314
2471 314 4 -283 -100 170 210 -36 -276 -75 237 160 -104 -237 -29 280 122 -178 -165 43 219 87 -196
2492 -196 -141 122 160 8 -173 -104 153 157 -64 -147 -23 141 133 -96 -145 44 157 54 -110 -120 91 171 -15 -148
2516 -148 -52 122 130 -64 -168 6 146 66 -70 -139 27 165 10 -140 -74 69 147 -10 -187 -33 150 104 -87
2539 -87 -163 14 201 47 -155 -106 76 185 24 -204 -85 156 150 -44 -190 -54 200 151 -106 -168 -1 192
2561 192 113 -160 -166 79 199 50 -180 -159 128 214 -31 -204 -101 150 192 -63 -227 -50 171 147 -85 -224
2583 -224 -26 239 137 -140 -200 25 247 98 -209 -180 92 225 37 -208 -152 162 213 -32 -208 -111 185 196
2605 196 -95 -219 -25 202 156 -140 -225 40 226 89 -164 -192 78 239 26 -208 -127 115 199 -23 -208 -74
2627 -74 151 153 -52 -185 -39 179 129 -106 -144 7 155 81 -132 -117 73 145 23 -135 -85 99 128 -43 -133 -47
2651 -47 108 108 -64 -119 16 104 66 -61 -115 26 116 24 -96 -82 38 100 -5 -109 -40 66 81 -33 -95 -8 86
2676 86 38 -58 -71 27 103 18 -94 -49 75 99 -18 -106 -22 131 81 -78 -109 7 119 62 -98 -100 52 122 4 -124
2702 -124 -75 84 108 -52 -117 -19 122 90 -95 -120 49 126 51 -99 -119 51 152 16 -144 -92 99 143 -5 -146
2726 -146 -69 135 131 -47 -141 -25 127 92 -67 -130 -13 145 82 -106 -120 37 135 39 -145 -121 84 150 -18 -153
2750 -153 -81 118 153 -45 -178 -44 146 133 -77 -171 -16 159 103 -97 -171 14 177 66 -129 -119 54 156
2772 156 32 -148 -96 103 148 -19 -142 -47 115 114 -59 -132 -11 126 83 -90 -123 24 141 48 -105 -118 54
2795 54 131 -2 -100 -70 52 121 -2 -116 -30 70 79 -17 -84 -13 76 51 -43 -58 14 85 20 -57 -41 37 83 11 -77 -36
2823 -36 72 57 -21 -76 -14 72 56 -58 -64 5 61 20 -51 -57 22 69 -11 -52 -31 55 66 -42 -72 12 71 37 -64 -64 42
2852 42 98 5 -78 -57 61 88 -25 -93 -25 81 71 -35 -107 -13 96 56 -53 -82 18 109 26 -78 -70 41 96 2
2878 2 -109 -48 81 88 -35 -97 -30 100 74 -61 -97 3 100 72 -70 -94 27 119 39 -76 -99 55 128 22 -84
2903 -84 -61 75 122 -10 -114 -46 87 99 -33 -128 -27 102 65 -56 -116 -2 112 45 -89 -98 27 125 39 -115
2927 -115 -81 74 110 6 -116 -58 91 109 -27 -103 -30 102 100 -43 -101 13 100 61 -52 -89 28 112 29 -79 -64
2952 -64 39 103 7 -95 -40 47 78 -8 -91 -37 72 47 -35 -69 -32 68 39 -47 -63 13 64 56 -53 -54 36 56 20 -54 -44
2981 -44 40 59 -10 -41 -14 33 57 -21 -44 16 52 23 -26 -49 27 56 4 -43 -21 30 51 -17 -62 4 44 25 -21 -50 -1 67
3011 67 3 -55 -25 24 55 5 -55 -4 55 42 -18 -54 -8 66 31 -33 -56 8 75 37 -56 -49 40 67 11 -57 -53 62 62 -16 -48
3042 -48 -26 53 83 -27 -68 4 73 58 -46 -92 20 80 16 -58 -63 23 88 15 -73 -48 35 84 11 -91 -35 73 76 -5 -79
3071 -79 -32 85 68 -32 -76 -12 78 71 -66 -95 17 80 42 -85 -93 43 99 12 -67 -47 42 95 2 -95 -29 62 71 -9 -98
3100 -98 -29 84 51 -35 -80 -3 89 42 -68 -50 19 73 38 -57 -49 45 69 17 -48 -51 51 61 -12 -52 -29 44 65 -16 -76 -8
3130 -8 48 45 -28 -64 18 67 20 -47 -37 15 72 15 -49 -19 19 45 16 -53 -19 47 28 -18 -45 -17 54 35 -36 -19 27 47 27
3161 27 -32 -21 39 42 -7 -21 -16 41 38 -41 -34 11 30 23 -32 -41 20 44 -3 -36 -32 44 62 -19 -53 -5 48 42 -27 -44 16 63 22 -18
3195 -18 -48 24 65 7 -52 -30 27 67 17 -65 -15 53 56 0 -47 -16 54 50 -22 -52 2 62 33 -39 -51 17 55 25 -51 -64 40
3226 40 69 10 -68 -49 41 79 0 -81 -19 71 76 -13 -82 -16 80 55 -38 -71 -6 84 47 -60 -63 14 77 26 -78 -52 47 73
3256 73 12 -69 -33 69 82 -20 -72 -35 73 73 -34 -88 -11 75 44 -56 -71 10 78 31 -50 -55 8 84 12 -73 -49 41 78
3285 78 14 -65 -28 62 65 -17 -65 -5 61 51 -32 -58 7 65 36 -47 -58 30 70 28 -45 -42 36 74 -7 -61 -27 29 56 -16 -73
3316 -73 -17 41 45 -20 -49 13 57 17 -34 -42 29 61 9 -55 -26 40 53 -16 -56 -4 71 33 -39 -42 7 59 21 -53 -41 30 52 4
3348 4 -48 -35 40 45 -18 -55 -27 54 35 -36 -60 19 59 29 -52 -54 34 70 -2 -58 -48 48 79 -1 -65 -24 77 65 -19 -76 -11
3379 -11 70 66 -37 -78 -6 85 39 -61 -73 14 81 22 -88 -60 42 84 -2 -81 -47 58 84 -20 -82 -22 84 77 -38
3406 -38 -87 2 93 62 -63 -81 20 97 41 -67 -77 42 103 23 -75 -57 51 88 2 -87 -34 82 69 -30 -89 -7 75
3433 75 72 -56 -78 3 86 40 -73 -86 20 87 15 -83 -61 49 87 4 -82 -43 70 84 -19 -84 -3 75 48 -35 -63 5
3461 5 76 26 -49 -52 20 76 7 -70 -40 45 61 6 -81 -17 63 59 -35 -73 -11 72 43 -42 -73 16 62 17 -57 -56 26 68 7 -69
3493 -69 -27 50 68 -19 -63 -4 63 44 -24 -62 19 73 30 -49 -48 27 82 15 -68 -34 39 61 -15 -65 -24 59 57 -30 -75 4 75
3524 75 37 -52 -71 20 68 15 -67 -58 41 84 -3 -85 -52 58 86 -30 -98 -12 72 69 -36 -88 2 88 59 -55 -79 29 100
3553 100 37 -76 -72 43 94 -1 -96 -60 56 89 -17 -97 -40 89 76 -44 -97 -10 94 66 -58 -96 2 101 43 -81
3579 -81 -75 41 111 20 -95 -59 58 98 -11 -91 -37 70 90 -36 -94 -5 99 67 -48 -93 7 92 46 -70 -85 27
3605 27 83 17 -89 -65 53 76 -6 -92 -49 57 70 -40 -81 -9 71 52 -38 -67 15 101 33 -67 -58 44 83 12 -73 -40
3633 -40 46 77 -10 -83 -30 74 65 -32 -73 12 76 42 -56 -60 23 78 30 -70 -53 39 65 -15 -83 -45 68 68 -35 -89 -14 79
3663 79 63 -42 -63 21 80 42 -66 -68 51 88 3 -79 -40 60 88 -17 -84 -20 73 64 -50 -89 9 87 34 -76 -75 25
3691 25 98 26 -98 -64 53 90 -3 -91 -54 67 78 -37 -105 -30 85 66 -54 -90 3 104 50 -67 -85 41 101 26
3717 26 -83 -79 56 116 7 -92 -50 85 98 -18 -109 -37 95 74 -60 -113 -9 105 54 -83 -101 30 108 37 -91
3742 -91 -71 47 104 7 -94 -68 66 97 -28 -98 -38 79 69 -46 -89 8 100 73 -61 -87 20 99 38 -79 -67 43
3768 43 109 14 -86 -43 72 84 -26 -99 -22 87 61 -48 -90 -9 93 46 -63 -77 22 87 19 -70 -57 49 84 1
3794 1 -80 -46 66 74 -35 -84 -9 78 60 -53 -74 10 81 42 -53 -53 36 101 17 -77 -34 53 79 -13 -91 -26 77 62 -46
3823 -46 -84 1 79 46 -65 -78 18 88 16 -75 -65 51 92 3 -88 -40 78 74 -30 -82 -17 85 63 -63 -93 7 95
3850 95 43 -75 -79 48 111 8 -73 -57 58 90 -6 -104 -39 75 79 -33 -104 -15 90 52 -63 -97 -7 84 25 -82 -80
3877 -80 28 93 7 -92 -67 58 102 -2 -88 -35 79 84 -30 -105 -9 98 82 -52 -103 13 101 48 -76 -96 29 96
3903 96 18 -89 -70 60 96 -11 -98 -44 69 85 -31 -105 -21 85 57 -57 -91 -1 88 42 -71 -79 34 90 26 -82
3929 -82 -47 57 88 -10 -77 -27 73 76 -26 -73 -4 86 52 -52 -72 25 77 23 -66 -65 41 86 -2 -83 -49 57 74 -32
3957 -32 -88 -27 66 56 -48 -85 -4 76 30 -65 -70 31 75 25 -77 -58 47 74 -7 -86 -37 72 78 -24 -75 -8 80 58
3985 58 -53 -71 23 83 27 -68 -70 38 85 -1 -89 -40 58 78 -30 -96 -20 72 60 -44 -85 8 85 41 -58 -77 24 82
4013 82 22 -85 -55 46 91 3 -90 -38 68 77 -8 -86 -30 85 61 -46 -76 -4 85 57 -71 -83 25 84 14 -83 -76 38
4041 38 85 -4 -98 -48 53 80 -36 -103 -37 80 66 -54 -101 -9 90 48 -60 -84 24 95 23 -94 -58 43 92 9
4067 9 -89 -47 72 85 -21 -84 -23 80 64 -42 -82 -1 81 39 -62 -79 25 81 9 -76 -63 45 79 -9 -87 -37 64
4094 64 66 -24 -88 -9 70 62 -38 -64 9 92 29 -60 -52 22 80 21 -63 -41 47 67 -11 -65 -17 49 59 -34 -69 -11 64 39 -45
4125 -45 -63 25 68 16 -65 -48 35 69 -6 -81 -33 58 55 -25 -71 -8 69 50 -45 -73 14 79 39 -60 -50 36 83 9 -85 -34 56
4156 56 67 -11 -63 -29 70 57 -32 -76 -1 69 37 -51 -72 19 75 28 -64 -63 32 63 8 -71 -45 53 68 -21 -75 -19 60 60 -39
4187 -39 -88 -4 85 51 -53 -69 16 75 40 -65 -51 35 90 27 -73 -37 47 72 -15 -75 -30 55 64 -41 -79 0 68 39 -54
4216 -54 -75 16 73 17 -62 -55 39 76 18 -75 -48 45 71 -15 -81 -20 67 56 -34 -80 -4 69 35 -53 -63 24 65 27 -55 -35 37
4247 37 70 -10 -75 -31 51 52 -19 -70 -15 45 38 -38 -70 -4 54 21 -60 -61 11 66 8 -48 -38 29 52 -3 -50 -18 51 49 -14 -54
4279 -54 6 49 46 -36 -44 20 67 32 -43 -48 23 55 8 -59 -24 44 54 -13 -52 -7 52 50 -45 -64 11 48 15 -48 -46 16 55 12 -53
4312 -53 -37 43 51 -3 -47 -7 62 50 -24 -50 0 61 32 -40 -48 13 66 26 -50 -47 31 71 6 -56 -37 46 57 -13 -66 -26 49 41
4344 41 -37 -64 -4 59 22 -44 -63 17 70 20 -47 -44 27 58 2 -54 -36 50 61 -16 -58 -15 59 49 -10 -50 3 69 36 -31 -53
4375 -53 12 66 29 -51 -42 25 50 9 -52 -39 34 50 -17 -50 -15 58 48 -31 -50 -2 59 32 -41 -54 17 65 13 -49 -36 30 57
4406 57 -4 -44 -19 36 49 1 -34 -9 51 35 -22 -33 8 56 18 -41 -40 14 37 5 -46 -39 27 37 1 -47 -24 22 41 -15 -45
4437 -45 -10 47 36 -30 -43 10 43 26 -27 -29 25 40 1 -38 -14 39 40 -10 -40 -10 48 37 -22 -39 18 59 26 -29 -34 18 56 10
4469 10 -47 -28 22 49 -7 -53 -12 37 28 -26 -42 -14 45 10 -24 -22 15 40 13 -50 -19 28 46 3 -35 -12 39 46 -13 -40 -4 40
4501 40 46 -17 -41 8 48 32 -21 -47 23 50 21 -33 -29 32 48 9 -51 -26 30 38 -13 -57 -17 50 30 -18 -46 0 59 26 -28 -36
4533 -36 21 59 25 -25 -32 38 47 11 -33 -14 42 59 4 -43 -3 44 40 -15 -42 3 42 24 -30 -28 32 48 8 -42 -30 19 40 3
4565 3 -51 -17 30 32 -6 -36 -12 40 26 -10 -40 11 44 28 -16 -21 20 41 24 -11 -20 30 47 20 -16 -8 37 40 -8 -26 1 26 24 -19
4599 -19 -30 9 37 20 -21 -30 24 38 3 -36 -14 22 28 -6 -37 4 35 19 -18 -36 18 43 22 -29 -17 21 51 16 -20 -4 32
4630 32 37 1 -25 -13 48 38 -10 -24 -8 38 28 -28 -30 8 31 12 -30 -34 17 32 -11 -36 -8 32 37 -9 -32 -1 40 37 -8 -34 6
4663 6 59 20 -22 -28 19 43 19 -29 -12 22 46 8 -29 -13 32 44 5 -32 -7 37 34 -19 -34 -5 42 18 -45 -40 17 45 18 -30
4695 -30 -36 19 43 1 -28 -15 32 44 -11 -38 -2 39 31 -7 -30 7 46 21 -17 -28 19 49 16 -21 -1 24 41 8 -22 -10 31
4726 31 29 -7 -23 -9 23 37 -13 -37 1 27 20 -16 -29 1 31 6 -26 -24 21 32 1 -20 -8 28 26 5 -17 -1 44 14 1 -15
4758 -15 9 36 12 -9 -15 19 35 18 -26 -11 25 37 -5 -24 -3 33 33 -6 -17 -3 27 19 -7 -30 7 28 2 -26 -29 18 36 0
4790 0 -32 -19 27 25 -7 -24 7 38 28 -5 -23 13 41 11 -6 -11 27 33 10 -23 -7 30 27 0 -17 -9 34 27 -22 -32 -5 38 21 -21
4824 -21 -22 12 28 18 -32 -32 14 33 7 -27 -26 21 40 1 -36 -17 33 47 -3 -31 6 37 32 -10 -23 8 57 30 -19 -24 13 44 11
4857 11 -35 -13 20 32 0 -40 -26 28 35 -4 -20 -7 32 25 -12 -22 0 33 10 -17 -23 17 26 7 -18 -16 30 41 16 -19 -9 32 27
4890 27 -8 -18 0 46 23 9 -10 7 26 19 -15 -17 19 27 4 -19 -13 25 19 6 -28 -14 19 13 -19 -32 4 27 17 -12 -15 12 31 28
4924 28 -12 -17 24 32 0 -13 -12 30 35 2 -13 14 20 23 -5 -16 11 42 14 -19 -15 14 27 15 -23 -15 26 23 -13 -34 -4 25 8 -12 -26
4959 -26 -7 30 15 -7 -21 17 32 14 -8 -11 25 32 16 -17 -1 33 39 3 -23 0 29 31 -8 -23 13 43 19 -16 -29 11 35 21
4991 21 -27 -25 16 37 -5 -31 -34 10 23 -9 -39 -14 25 18 -4 -28 8 33 21 -17 -19 17 31 19 -18 -13 33 46 22 -19 -3 33 40
5024 40 -2 -32 -4 28 22 -19 -26 0 35 10 -18 -33 0 32 14 -20 -16 13 29 1 -22 -9 15 21 -8 -24 -6 27 22 -1 -12 4 27
5057 27 30 -13 -12 18 36 17 -9 -17 26 36 5 -13 -17 21 27 0 -28 -9 23 17 -11 -24 -4 27 12 -23 -21 8 33 10 -27 -10 7 32
5091 32 3 -26 -9 26 14 -14 -16 1 34 27 -17 -13 14 37 14 -20 -13 23 27 11 -11 -1 29 20 -1 -34 3 31 17 -18 -29 4 22
5124 22 8 -22 -21 0 27 -2 -27 -9 24 26 -9 -30 -13 34 28 -1 -15 -3 33 24 -7 -16 15 37 24 -13 -20 25 41 9 -20 -10 22
5157 22 29 2 -25 -13 34 35 -1 -16 2 38 16 -15 -18 13 27 14 -25 -25 11 34 -1 -24 -16 27 40 1 -17 0 37 35 3 -22 9
5190 9 41 21 -18 -16 21 39 9 -12 -14 13 31 12 -17 -12 15 29 -1 -20 -2 23 18 -13 -11 -5 29 13 -19 -33 -1 33 18 -21 -20 18
5224 18 30 13 -6 -5 33 32 8 -17 -4 28 35 -2 -21 10 38 26 -17 -16 17 38 20 -25 -22 5 35 -5 -33 -15 22 14 -18 -28 2
5257 2 36 25 -20 -26 9 29 16 -10 -26 14 31 6 -18 -10 32 27 3 -9 2 41 39 3 -16 11 45 21 -10 -9 10 23 6 -25 -7
5290 -7 17 25 -1 -22 -16 12 27 -15 -42 -8 30 18 -22 -28 -2 20 16 -9 -27 4 37 17 -13 -11 25 50 6 -23 -15 36 30 -4 -23 -5
5324 -5 42 27 -16 -20 13 35 35 -25 -23 16 40 9 -33 -21 18 25 -7 -31 -16 23 25 -3 -39 -3 23 14 -11 -24 3 31 18 -14 -14 24
5358 24 32 20 -15 -8 16 29 6 -32 -18 34 27 7 -18 7 34 26 -16 -15 2 24 16 -12 -21 5 20 9 -25 -20 8 23 -12 -35 -21 25
5392 25 18 -14 -24 -11 26 14 -4 -26 14 49 14 -24 -12 23 51 18 -19 -7 28 31 5 -22 10 31 19 -10 -22 9 40 15 -13
5423 -13 -13 24 26 7 -24 -14 17 23 -2 -34 -12 21 18 -17 -23 -1 25 19 -16 -16 16 41 23 -14 2 23 40 11 -27 -1 35 43 6 -18
5457 -18 6 24 19 -7 -28 -1 36 13 -23 -31 7 28 10 -33 -15 18 32 -2 -28 -15 22 33 -5 -32 6 27 31 -19 -37 8 35 25
5489 25 -14 -19 28 37 8 -31 -13 14 45 1 -24 0 35 35 -9 -34 -2 26 9 -9 -32 -14 28 7 -31 -27 9 19 10 -34 -20 13 32
5522 32 1 -30 -5 28 28 -8 -17 5 18 34 -17 -12 16 33 6 -24 -19 14 32 19 -16 -16 20 35 12 -19 -18 23 16 -10 -28 -2 23 11
5556 11 -30 -34 6 21 4 -29 -15 16 26 -5 -30 -4 23 15 -9 -27 -2 44 20 -20 -20 6 32 9 -18 -20 19 28 1 -22 -11 26 24
5589 24 -10 -19 2 24 22 -26 -18 -4 25 3 -12 -27 10 28 -2 -18 -19 17 15 -12 -24 -8 21 31 -1 -20 -4 35 36 -12 -20 8 42 15
5623 15 -10 -18 18 40 5 -25 -11 27 32 4 -29 -11 14 30 -3 -32 -1 26 20 -15 -22 3 35 15 -25 -33 18 37 -1 -47 -18 15 36
5656 36 -7 -32 -9 35 44 -2 -30 -2 37 29 -7 -13 29 37 22 -17 -17 17 40 8 -28 -8 9 24 3 -32 -5 24 13 -21 -29 0 30
5689 30 17 -9 -17 5 31 13 -11 -25 18 33 10 -15 -11 33 34 -7 -18 -2 42 30 -13 -20 7 43 25 -9 -9 14 33 8 -26 -3 31
5722 31 32 -13 -31 -15 26 20 -16 -37 -7 16 14 -23 -26 2 24 7 -25 -14 28 30 12 -26 -2 22 29 -1 -26 11 35 14 -19 -16 5 25
5756 25 22 -9 -14 21 32 12 -5 -22 22 22 -5 -23 -13 19 11 -11 -34 -4 19 17 -17 -25 -1 29 6 -22 -21 7 32 9 -33 -5 25 29
5790 29 -4 -22 -12 30 28 -8 -29 -18 37 22 -24 -21 11 37 19 -20 -21 22 25 -1 -26 -14 24 34 -9 -30 -13 27 14 -11 -31 -11
5822 -11 34 11 -16 -32 1 33 4 -14 -29 13 43 4 -14 2 27 29 -1 -16 2 40 21 -12 -18 2 32 15 -16 -14 15 23 3 -28
5854 -28 -18 -1 17 -1 -41 -19 13 10 -17 -37 -7 21 15 -13 -36 1 18 8 -15 -21 9 29 5 -30 -4 26 34 11 -16 1 29 31 0
5887 0 -12 10 45 16 -19 -10 15 24 -1 -29 -22 10 14 -5 -38 -12 9 16 -14 -26 8 19 13 -18 -26 16 38 11 -32 -5 20 35 8 -17
5921 -17 2 24 31 -1 -29 13 30 22 -13 -19 7 34 30 -13 -12 7 25 20 -24 -24 5 18 -7 -42 -29 11 14 2 -28 -17 25 21 -18 -32 2
5956 2 35 15 -21 -25 12 31 11 -14 -15 17 43 3 -30 -12 27 19 -6 -16 -4 20 22 -16 -18 2 21 0 -22 -22 9 13 -13 -27 -24 13 14
5991 14 -10 -34 -6 19 18 -14 -26 -3 19 12 -20 -14 -1 21 13 -12 -12 11 29 17 -14 0 12 31 0 -16 -12 17 24 -8 -14 7 28 15
6025 15 -14 -14 0 17 -3 -19 -17 11 20 -7 -24 -20 11 11 -24 -22 -10 16 8 -20 -24 12 30 14 -4 -12 20 30 -3 -10 -4 27 23 -7 -28 -8
6061 -8 16 22 -3 -16 3 13 2 -18 -25 7 13 -4 -13 -12 0 15 -6 -22 -6 14 13 -9 -26 -2 16 -4 -18 -13 6 17 13 -26 -16 14 30
6096 30 10 -11 -2 24 38 8 1 -6 12 25 9 -12 4 27 14 -13 -26 -1 22 -3 -24 -32 8 15 3 -18 -17 13 19 -10 -21 -9 23 20
6130 20 -9 -20 8 28 17 -15 -24 20 24 -3 -15 -6 19 22 0 -8 -3 20 23 0 -20 7 18 9 -22 -12 -12 10 10 -13 -20 3 9 -5 -20 -11 -4
6167 -4 16 3 -21 -11 4 18 -10 -21 6 9 14 -11 -17 10 19 9 -20 -12 20 20 4 -8 10 23 18 -2 -8 4 21 8 -17 -17 7 12 -5 -23
6203 -23 -29 2 13 -11 -25 -9 11 18 -12 -26 -19 13 13 -8 -13 4 23 6 -17 -5 20 26 0 -12 1 18 5 -2 -16 6 13 19 -7 -15 6
6238 6 29 12 -2 -12 6 16 7 -13 -16 4 16 -1 -11 -7 15 5 -9 -15 -13 16 14 -9 -25 0 24 18 -1 -12 13 34 8 -8 -8 28 34
6273 34 16 -8 4 24 26 -4 -19 -1 18 13 -11 -17 0 13 -2 -30 -21 6 18 0 -26 -15 4 8 -6 -16 -17 18 13 -15 -16 1 22 16 -5
6308 -5 -5 11 15 15 3 3 15 27 13 -1 2 23 28 3 -15 -4 11 7 7 -16 0 2 -16 -23 -20 4 11 -7 -20 -15 11 11 2 -12 -12 12 11 -10 -18 8
6348 8 13 9 -3 -5 15 27 10 -8 -7 27 24 4 -6 0 22 26 12 -2 6 18 15 -14 -5 6 13 1 -17 -18 11 13 -7 -13 -22 18 11 -1 -20 2 20
6387 20 14 -12 -12 1 19 12 -8 -2 13 27 15 1 3 26 21 -3 -7 0 29 35 3 -8 10 30 24 1 -14 8 24 16 -17 -19 4 19 3 -20
6423 -20 -16 6 18 4 -28 -20 10 -1 -17 -15 -6 30 18 0 -17 12 43 21 -7 -4 16 31 3 -7 -7 9 23 -1 -10 5 18 10 -14 -13 2
6458 2 15 7 -17 -18 6 7 -8 -24 -20 -2 6 -8 -25 -17 8 2 -17 -19 -6 10 11 4 -1 -4 21 13 -2 5 14 17 3 -7 -9 12 26 4 -11 -1 9
6497 9 14 -13 -19 4 19 8 -8 -16 3 5 3 -13 -14 7 6 -12 -19 -10 9 9 -11 -17 -8 12 8 -4 2 8 20 10 -7 -5 27 22 9 -2 2 28 21 0
6537 0 -8 15 16 16 -7 -5 3 10 9 -24 -17 3 9 -6 -12 -13 7 10 -11 -12 -7 6 16 -12 -11 -4 9 15 -13 -4 10 21 12 3 -10 3 26 6 -11 6 23
6578 23 29 15 -18 -9 19 22 9 -14 -6 14 5 -14 -16 3 11 4 -20 -18 -5 17 7 -13 -11 12 13 6 -6 7 18 21 -7 1 21 22 22 -8 -10 14 21
6617 21 17 -10 -5 14 32 6 -19 0 19 10 13 -15 -6 11 12 -6 -19 -5 0 6 -16 -17 -3 -1 -11 -20 -6 0 18 -12 -14 -12 2 11 0 -8 -1 18 11
6656 11 8 -2 19 14 16 -4 -3 12 19 5 -5 -13 10 23 -5 -16 1 16 8 -12 -2 -3 8 -2 -17 -20 2 6 -8 -22 -19 5 13 -17 -19 -10 10
6693 10 11 -8 -21 7 29 7 0 3 28 25 8 -1 -5 12 36 -2 -10 2 26 15 0 -17 -4 12 11 -11 -13 -9 10 6 -12 -12 -3 9 -1 -19 -14
6730 -14 1 11 0 -22 -10 12 8 -3 -21 -2 13 16 5 -3 14 28 16 8 3 21 36 12 -1 -8 21 33 10 -7 -7 16 19 1 -21 -10
6764 -10 11 1 -16 -23 -1 10 9 -9 -2 9 16 -3 -14 -5 10 19 -7 -7 5 16 18 -9 -14 8 24 12 4 -5 5 22 8 -1 -2 11 21 -5 -14
6801 -14 -1 12 10 1 -21 -9 15 -6 -10 -18 -6 12 0 -15 -17 4 3 -6 -12 -3 8 23 3 -6 -6 6 26 3 -7 6 18 11 -10 -4 11 26 6
6838 6 -4 7 9 19 8 -6 0 19 10 -5 -18 0 10 2 -21 -15 -1 10 -3 -22 -16 -8 9 -4 -18 -11 11 15 1 -16 -6 21 17 -6 -6 8
6874 8 19 21 -2 -3 0 17 8 -15 1 18 13 4 -14 -14 17 10 -5 -14 -14 -1 -2 -16 -27 -4 6 6 -11 -26 -12 15 -5 -11 -5 -4 20 -4 -14 -11 8
6913 8 15 4 -5 -12 21 17 -7 1 13 29 18 3 -4 6 30 9 -13 -2 11 15 -10 -26 2 -4 3 -11 -18 -6 14 -6 -12 -17 -6 -2 -11 -2 -8 -6 3 -1
6953 -1 -8 -11 10 10 1 -7 3 18 12 5 7 15 12 17 -8 9 13 19 -2 -7 2 8 16 -3 -2 -19 1 5 -13 -21 -9 -1 -1 -11 -5 -8 13 -1 -11 -10 3 8 -4 -12
6997 -12 3 0 17 2 -5 2 21 11 -3 -10 -1 25 3 8 -3 13 19 6 -11 0 10 12 1 -11 -12 -5 17 -19 -24 -13 16 3 -16 -17 -7 4
7033 4 -1 -17 -9 1 14 -12 -9 -1 13 23 -4 -2 -1 11 13 2 -3 -6 17 16 -5 -9 -3 7 12 -7 -9 -2 16 5 -8 -1 -1 7 -1 -18 -16 -3 2 -15 -26
7074 -26 -12 0 -4 -15 -15 -2 10 5 -4 -8 -3 16 8 1 -3 13 24 15 3 -2 16 10 2 -11 -1 13 5 5 8 -4 19 6 0 -2 4 4 0 -5 -14 13 20 -2
7116 -2 0 -8 -2 3 -4 -11 -3 3 2 -6 -13 4 8 12 -5 -6 14 24 10 0 9 16 22 14 -4 3 13 15 4 -22 3 2 -4 -14 -21 4 4 -7 -14 -6 1 5 -4 -14 0
7161 0 17 14 5 -15 -3 3 17 -15 -14 0 17 9 4 4 11 29 17 8 7 19 23 5 1 15 25 13 2 1 5 20 12 -5 -8 -9 6 2 -5 -16 2 14
7201 14 -3 -10 0 13 20 2 -3 -8 14 12 -4 4 11 21 16 8 -2 4 21 13 1 5 9 16 12 1 6 27 24 -5 0 12 25 18 3 -10 -2 20 6 -19
7241 -19 -18 -10 2 1 -16 -13 1 13 -8 -15 -4 11 9 2 -5 7 15 8 -7 12 4 17 17 5 14 10 15 17 -3 -16 12 19 8 0 9 4 17 6 3 21 13
7282 13 11 0 -6 -7 12 1 -8 -7 7 5 5 -4 -13 7 4 3 -13 -3 19 21 -2 9 8 20 21 10 4 6 23 13 -10 4 8 7 7 -5 6 7 11 -6 -8
7323 -8 2 8 -1 -9 -24 -7 10 1 -18 -7 -4 6 -3 -17 -20 -2 3 1 -8 5 13 11 2 -2 7 22 8 8 1 18 25 14 -2 14 15 17 13 -7 6 11 6 -6
7365 -6 -5 0 4 7 -6 -19 3 10 12 -7 -10 -4 12 9 -15 -17 -2 13 6 -10 -9 10 12 2 -6 6 16 17 -3 0 6 15 20 -4 0 15 14 3 -11 -9 11 11
7407 11 -2 -1 -5 11 8 -18 -24 -13 2 -9 -12 -17 -8 14 0 -6 -2 1 12 -4 -10 -7 14 9 -2 -11 -9 19 9 13 -6 1 6 10 6 -3 7 27 20 5 -5
7448 -5 10 18 12 -11 -10 6 9 -7 -12 -5 -1 1 -20 -14 -4 8 -1 -18 -16 -8 29 7 -1 -5 -11 13 18 -2 -2 22 15 12 3 5 33 21 8 -10 2 16 17 -1
7490 -1 -9 15 19 8 -6 2 8 5 -5 -21 -28 2 2 -19 -15 -4 -4 9 -13 -26 0 -1 -9 -15 -17 10 13 10 -9 -5 12 24 23 3 8 16 15 4 -1 13 13 11
7532 11 -12 -11 12 8 2 -15 -9 2 10 6 -21 -7 1 0 -7 -11 -15 -1 9 -15 -17 -4 2 10 -5 -15 4 11 10 -7 -1 9 23 9 6 9 30 29 3 -2 3
7573 3 21 17 -7 2 4 18 15 -5 -7 1 10 5 -13 -15 -4 1 -2 -18 -15 15 1 -3 -3 -2 3 4 -3 -13 2 10 0 -7 -8 16 11 13 2 0 24 7 10 1 11 16
7617 16 5 3 -7 5 10 4 -16 -7 0 5 -7 -13 -15 2 3 -8 -17 -14 -3 8 -5 -6 2 10 2 -12 -14 -1 13 -4 -10 -11 3 10 1 -8 1 16 18 8 -9 -2
7659 -2 12 27 8 8 7 13 9 -6 -11 5 17 1 -13 0 -3 0 -19 -18 -26 4 3 -16 -14 -12 4 9 -10 -8 -3 4 8 6 3 15 20 18 -1 1 10 29 11 -9
7701 -9 3 8 14 6 1 -13 17 19 5 -7 7 7 4 -14 -12 8 -5 -2 -33 -20 -4 -7 -8 -6 -21 11 -5 -12 -11 0 5 2 -7 -8 3 12 12 -1 -1 14 21 4
7743 4 0 -5 13 15 -1 -10 -7 2 2 -12 -19 -8 10 2 -12 -3 1 3 -9 -19 -14 -7 -2 -22 -18 -15 5 -4 -10 -23 -10 1 10 -7 -13 2 17 11 7 -2 14 17 10 0
7787 0 6 8 7 -5 -13 -3 15 17 -6 -8 -15 6 -1 -10 -17 -10 -3 -1 -27 -13 -3 12 1 -21 -10 -5 5 -7 -11 -2 17 -1 -16 -7 4 14 6 -8 0 17
7827 17 33 9 1 1 11 14 -5 -8 6 13 15 -1 -18 -5 19 -2 -10 -16 -13 5 6 -14 -10 -7 6 -13 -19 -6 4 13 0 -4 -6 8 8 -6 -9 10 19 11
7867 11 -4 14 12 23 13 6 3 16 22 5 9 6 28 12 -4 -11 -1 22 9 -6 -13 0 -6 -14 -26 -25 -14 -2 -10 -23 -9 3 6 -2 -7 -7 8 6 3
7906 3 -10 4 19 5 2 -8 13 11 6 1 3 24 14 4 -7 5 19 1 7 -3 8 9 11 -6 -4 1 14 3 -11 -8 -6 3 2 -19 -12 9 10 -10 -13
7945 -13 -9 4 14 -1 -6 7 13 12 6 6 17 19 13 10 -7 18 12 1 -14 -5 11 4 -1 -8 -3 8 14 -6 -12 -3 7 -6 -14 -24 -6 -7 -8 -13 -17 6 4 -14
7987 -14 -12 -5 12 17 -3 -17 9 17 18 -2 7 11 21 12 5 4 20 19 0 1 4 18 18 0 -4 0 5 5 -14 -13 -5 0 -1 -11 -18 -8 12 2 -1 -9 0 5 -5 -9
8031 -9 -6 8 1 -7 -8 -15 8 18 -9 0 5 17 17 0 0 16 23 9 -3 1 10 13 6 -5 6 9 5 -2 -9 -12 3 0 -14 -24 -1 3 7 -10 -9 -1 18 13 -3
8074 -3 -10 11 19 8 3 8 14 14 0 0 1 17 10 1 -4 17 17 7 3 -3 12 14 6 -6 10 6 15 1 -6 3 3 -2 -17 -13 -6 -4 -7 -21 -11 1 10 2 -10 -7 8
8119 8 12 6 -9 3 18 10 9 2 20 13 14 -2 -4 12 21 12 -2 4 13 12 6 -4 -2 5 13 4 -9 -11 12 6 -6 -21 -4 7 -2 -17 -25 -16 -4 -3 -6 -14 3 5
8163 5 2 -5 -13 6 20 8 5 17 23 21 13 3 12 24 10 -3 1 9 15 -3 -7 -3 6 8 -4 -16 5 11
8191A1
$$ Imaginary data points
##PAGE= N=2
##DATA TABLE= (X++(I..I)), XYDATA
0 0 0 0 0 0 0 0 0 0 0 0 0 0 8 -8 8 -8 16 -16 24 -24 32 -32 40 -48 56 -68 80 -92 104 -120 139 -160 180 -204
34 -204 232 -260 292 -328 366 -408 454 -507 560 -620 686 -758 836 -923 1018 -1121 1234 -1360
52 -1360 1499 -1653 1828 -2020 2243 -2496 2790 -3134 3546 -4053 4683 -5500 6603 -8177 10625
67 10625 -14984 25056 -96169 40662 183046 -61982 -37340 -42427 -7818 84476 19689 -64342
79 -64342 -19691 -546 41959 32136 -25390 -66882 -2194 105108 13423 -125965 3109 88524
91 88524 5741 -29096 -40405 -15766 70133 33878 -60484 -44952 22032 46073 32268 -40899
103 -40899 -80176 36578 92712 -30326 -53428 -851 -730 47082 23779 -62277 -21343 26325
115 26325 34789 15589 -62340 -21998 60430 17052 -22227 -42856 -1848 79821 -13257 -73419
127 -73419 25527 22837 3854 17392 -45020 -22335 45843 22611 -9817 -39682 -19511 47156
139 47156 27816 -20152 -37176 -20371 54061 38735 -55618 -32731 29266 25471 7434 -27398
151 -27398 -31097 31129 36451 -27440 -29124 13161 16767 10161 -7567 -31998 2927 36368 7721
164 7721 -21729 -31851 4050 54461 6521 -53458 -19038 30068 38645 -6994 -48874 -5827
176 -5827 33826 19680 -5866 -37882 -9661 42508 11034 -21621 -17508 -7639 34295 20922 -42247
189 -42247 -18696 27165 18987 -288 -26428 -19573 26565 29157 -9730 -35904 -15303 39369 33946
202 33946 -31083 -41190 8745 40036 17898 -32481 -35546 18200 37762 1809 -26572 -22046
214 -22046 8996 34731 9353 -34197 -26433 22143 41007 -5894 -48100 -8632 42147 21244
226 21244 -24400 -32737 3237 38053 13426 -30658 -24517 10851 30761 12012 -29379 -28742 16753
239 16753 36624 4085 -36555 -23453 28386 33362 -11773 -32454 -9045 24385 26295 -12172
251 -12172 -33430 -2479 29915 17235 -19615 -27686 6683 29713 6846 -23178 -19245 11710
263 11710 26951 784 -26002 -12434 16205 22040 -1871 -26809 -11875 23708 22091 -13398
275 -13398 -27456 326 26230 10984 -17876 -18584 5154 21473 7065 -18708 -15697 10430 19871
288 19871 475 -19441 -10625 14311 18046 -5715 -21631 -3552 20353 11378 -13884 -16694 4207
301 4207 18605 5881 -15894 -14092 9019 19295 -100 -19894 -8228 15237 14697 -6536 -18213
314 -18213 -3365 17482 11924 -12287 -17731 3968 19321 5153 -16085 -13397 8714 18830 451
327 451 -19733 -9376 15344 16245 -6949 -19343 -2987 17391 12241 -10530 -18673 1060 20542
340 20542 8453 -16558 -15760 7706 19522 3274 -18550 -13140 12481 19458 -2632 -20901 -8176
353 -8176 17018 16726 -8362 -20736 -3218 19448 14407 -13374 -21572 3599 22391 7905 -17144
366 -17144 -17959 7608 22987 3931 -21232 -14973 13471 22424 -2326 -23739 -9271 18193 18501
379 18501 -7561 -22994 -4794 21371 15166 -13619 -20929 1625 21320 10971 -16772 -19756 8033
392 8033 22296 3591 -19242 -14568 12559 20408 -3001 -19093 -8674 13079 18874 -5391 -22464
405 -22464 -3536 18158 13517 -9712 -21125 989 21538 7290 -14531 -15093 4684 19296 3742
418 3742 -16443 -10191 7331 14977 3147 -16420 -10829 12622 14974 -4344 -16053 -4861 14378
431 14378 11873 -9616 -14831 2334 14100 5818 -10976 -11767 6233 12777 735 -9544 -9206 5435
445 5435 14807 -1762 -13538 -3717 7132 11435 -1602 -16448 -1066 13842 4441 -6148 -10461
458 -10461 323 14646 1607 -12205 -3760 5363 8483 81 -11874 -2699 9865 5735 -3973
471 -3973 -10120 -1345 12178 5017 -8815 -8550 1687 11960 5158 -12759 -9329 8784 10968 -913
485 -913 -11444 -7184 11154 11296 -8437 -10421 1695 7907 6749 -7158 -11064 6131 8445 -224
499 -224 -3397 -9641 1274 15765 -348 -13331 -5046 6454 14191 -1390 -19303 -2200 15977
512 15977 7952 -8424 -13924 2364 13939 2649 -6533 -8806 -2055 13743 6750 -11926 -8717
525 -8717 3081 11687 6837 -15043 -12034 14447 12108 -7471 -10569 -3289 9665 12096 -8193 -14815
539 -14815 2882 11847 6655 -7266 -15725 3326 18039 1645 -12747 -8898 5185 14413 537
552 537 -12447 -5734 3787 12259 4732 -16387 -8817 13179 11434 -4245 -15612 -2997 18155 5155
566 5155 -13973 -5887 4658 8390 2929 -9449 -5466 4032 5934 6421 -7628 -14986 8365 16618
580 16618 -4024 -12939 -5194 8551 13608 -5543 -15390 2282 10123 2823 -2471 -8009 -2855 9605
594 9605 5310 -6425 -6985 1502 8224 1753 -6822 -3616 2267 6366 2413 -9213 -4188 8249 4572
609 4572 -1991 -7094 -5177 11302 8025 -12197 -6488 6931 4884 999 -5399 -5571 5546 4863 -2473
624 -2473 -2206 -2876 853 6449 -460 -6512 -1579 5057 5426 -4687 -8365 4599 8236 -1810 -6441
639 -6441 -4020 5713 9054 -5530 -9399 2817 6104 3073 -3013 -7866 1419 7427 1081 -2792 -5284
654 -5284 -1612 8192 3992 -6702 -6217 2169 9315 1706 -11164 -3796 9411 5541 -4958 -7799
668 -7799 358 8773 2961 -6576 -5174 1461 6375 4440 -5886 -8550 2966 9413 2475 -7456 -8569
683 -8569 4461 12002 -951 -10435 -3677 5566 8915 -1092 -11475 -1831 9114 4928 -4002 -8478
697 -8478 -16 9580 2422 -6333 -5310 1273 8321 2395 -8007 -4955 3194 8226 2784 -10845 -6577
712 -6577 9272 8503 -3357 -10039 -3048 10030 6801 -6734 -7997 1186 7379 3679 -4751 -6450
726 -6450 499 7309 3600 -5998 -6254 2571 7730 1603 -7903 -4645 5808 6580 -1724 -7869 -2118
741 -2118 7472 4425 -4067 -5957 -787 6900 4065 -5513 -5195 1129 5500 3453 -5134 -5433 2418 5188
757 5188 2123 -4740 -5513 3781 5930 -1006 -4981 -2758 4371 4967 -3402 -4984 1050 4357 1797 -3708
773 -3708 -3322 2203 3691 535 -3600 -2914 2848 3941 -676 -4082 -2164 3774 4042 -2496 -4629 111
789 111 4535 2101 -3876 -3267 2123 3737 199 -4005 -1916 3538 2695 -1748 -3264 -637 3625 2449
805 2449 -2928 -3530 847 4148 1675 -3917 -3548 2224 4685 596 -5017 -3143 4075 4615 -1569 -5034
821 -5034 -1583 4527 4008 -2817 -5009 81 4722 2858 -3320 -4823 965 5284 2035 -4392 -4725 2413
837 2413 6011 362 -5570 -3497 3731 5848 -1110 -6390 -1894 4879 4668 -2146 -6279 -935 5815
852 5815 3769 -3441 -5830 252 6368 2812 -4828 -5157 1881 6384 1445 -5840 -4182 3570 5943
867 5943 -306 -6167 -2851 4672 5252 -1913 -6232 -1192 5292 3980 -2842 -5882 -79 5938 2658
882 2658 -3920 -4809 830 5960 1771 -5108 -3595 2240 4949 977 -5402 -2891 3775 3778 -408 -4457
898 -4457 -2528 4344 3675 -2286 -3734 -1073 3714 3526 -3038 -4017 812 3507 2172 -2858 -3943 1707
914 1707 3973 502 -3134 -2854 2089 3935 -706 -3624 -1172 2447 2856 -1104 -3664 -245 3285 1362
930 1362 -1888 -2354 29 3197 1241 -3317 -1565 1952 1785 329 -2641 -1820 3203 1876 -2043 -1721
946 -1721 -260 2453 1755 -2841 -1742 1494 1766 824 -2588 -1911 2787 1562 -1012 -1529 -1529 2515 2523 -2899
964 -2899 -1873 1203 1344 1495 -1892 -3085 2187 2891 -896 -2171 -1598 1790 3540 -1369 -3935 61
980 61 3086 2015 -1805 -3637 534 3669 1013 -2033 -2875 32 4134 1371 -3500 -2388 1014 3746
996 3746 1533 -4781 -2482 3910 2546 -920 -3145 -2041 3933 2988 -3066 -2605 -113 2605 3399 -3038
1012 -3038 -4511 1972 3677 1285 -2673 -4630 2014 5641 -479 -4151 -2425 1978 5093 -254 -5472
1027 -5472 -1342 3524 3307 -943 -4684 -743 4143 1849 -1776 -3060 -735 3987 1922 -3345 -2145
1042 -2145 756 2775 2226 -3801 -3501 3628 3142 -1100 -2709 -2438 2847 4314 -2467 -3740 263 2119
1058 2119 2744 -945 -4129 -24 2963 1631 -725 -3389 -823 3672 1485 -2025 -2302 -90 3379
1073 3379 1128 -3573 -1013 2310 1242 -405 -2231 -592 2874 617 -1839 -809 -349 1821 1969
1088 1969 -2399 -2131 1110 1841 1547 -2123 -3322 2309 2899 -1118 -1453 -1272 702 2774 -911 -2289
1104 -2289 688 770 455 -111 -1539 594 1605 -901 -1103 210 995 953 -1172 -1431 712 1162 887 -678
1122 -678 -2583 296 3045 485 -1965 -1959 549 3426 139 -3564 -158 2092 513 -258 -1368 -462
1138 -462 1683 182 -738 -319 -781 1369 1566 -2138 -1673 1397 2116 468 -3124 -1974 3364 2533 -1796
1155 -1796 -2685 -877 2628 2912 -1730 -3310 -259 2578 2536 -1355 -3613 -44 3086 1656 -1602 -2927
1171 -2927 162 3249 980 -2370 -2053 876 3184 446 -3833 -1363 3288 2184 -1599 -3203 -376
1186 -376 3744 1680 -2790 -2389 313 2638 2301 -2208 -3624 505 3512 2075 -2583 -4030 1305 4274
1202 4274 377 -3064 -2095 1523 3023 -201 -2613 -830 1442 1751 -263 -2186 -566 1907 1346 -1047
1218 -1047 -2127 28 2522 977 -2119 -1949 808 2721 842 -2936 -2157 2121 2702 -422 -2607 -1389
1234 -1389 1999 2336 -965 -2094 -380 1168 1536 -209 -1935 -547 1523 1236 -830 -1806 344 2057
1250 2057 67 -1841 -625 1439 1400 -936 -1888 326 1805 566 -1131 -1463 231 1903 644 -1552
1266 -1552 -1335 646 1678 274 -1544 -910 881 1225 -62 -1390 -546 1295 828 -912 -1087 314
1282 314 1505 254 -1824 -697 1676 1129 -940 -1470 -52 1523 1013 -949 -1594 -20 1650 1135
1298 1135 -1040 -1947 56 2248 985 -1899 -1739 1080 2054 -58 -1896 -948 1296 1690 -535 -2052
1314 -2052 -350 1744 1239 -951 -2105 -84 2448 1067 -1930 -2007 675 2615 779 -2444 -2007 1323
1330 1323 2871 295 -3016 -1659 2206 2559 -562 -2877 -1066 2554 2107 -1336 -2448 -372 2295
1345 2295 1826 -1579 -2566 270 2632 1258 -2205 -2376 1190 2741 255 -2505 -1699 1686 2516 -421
1361 -421 -2549 -1046 1845 2161 -618 -2624 -752 2317 1813 -1281 -2291 -187 2251 1489 -1632 -2078
1377 -2078 504 2098 926 -1747 -1885 1079 2111 102 -1823 -1358 1451 1985 -746 -1745 -469 1200
1393 1200 1710 -758 -2140 106 1567 993 -793 -2024 227 2167 318 -1503 -1141 608 1771 -24
1409 -24 -1737 -475 1014 1069 -226 -1502 -312 1424 713 -822 -1078 89 1419 508 -1414 -787 964
1426 964 998 -99 -1212 -632 1342 924 -933 -938 -2 1098 873 -1297 -1110 938 931 76 -984 -1057 1162
1445 1162 1240 -811 -930 -329 828 1398 -935 -1613 541 1177 602 -859 -1666 768 1831 -227 -1240
1462 -1240 -891 665 1894 -251 -1914 -340 1131 1381 -197 -2226 -351 2156 872 -1081 -1586 -241
1478 -241 2232 1041 -2029 -1376 744 1702 873 -2039 -1874 1697 2035 -373 -1957 -1326 1824 2270 -1256
1495 -1256 -2188 -207 1630 1868 -1119 -2614 356 2140 1075 -1152 -2549 403 3039 283 -2101
1510 -2101 -1302 672 2459 357 -2687 -834 1598 1412 126 -2108 -1259 2218 1582 -1154 -1695 -546
1526 -546 1918 1674 -1790 -1825 644 1530 1015 -1424 -2086 1058 1954 76 -1325 -1633 913 2438 -526
1543 -526 -1957 -398 912 1670 -210 -2227 -64 1583 672 -301 -1525 -499 1986 702 -1386 -896
1559 -896 171 1429 757 -1786 -998 1329 1016 -161 -1272 -866 1513 1116 -1115 -943 -33 915 1038
1576 1038 -1082 -1233 700 778 382 -594 -1396 784 1482 -656 -935 -230 643 1223 -877 -1391 899 877
1594 877 -98 -506 -965 580 1333 -463 -913 -363 444 1386 -305 -1700 97 1144 597 -408 -1419
1611 -1419 21 1588 156 -947 -651 -37 1309 567 -1602 -740 1090 944 -137 -1422 -606 1660
1627 1660 871 -1124 -976 -10 1202 1026 -1148 -1405 347 1430 1015 -1368 -2005 1108 2127 -132 -1635
1644 -1635 -1182 1175 2035 -714 -1818 -152 969 1295 -202 -2041 -309 1813 891 -911 -1724 -40
1660 -40 2183 661 -1850 -1235 753 1770 388 -1963 -1196 1329 1656 -67 -1905 -1158 1748 1767 -928
1677 -928 -1732 -373 1449 1473 -938 -1740 125 1349 976 -743 -1784 190 1903 470 -1379 -1244 699
1694 699 1809 -110 -1724 -474 1026 1113 -166 -1544 -515 1320 969 -487 -1323 -550 1433 1208 -1058
1711 -1058 -1376 189 1252 765 -971 -1298 503 1297 205 -984 -850 693 1174 -330 -1029 -184 797
1728 797 752 -582 -943 339 800 232 -473 -876 247 1225 43 -1037 -542 624 1089 -276 -1318 -87
1746 -87 1078 449 -639 -781 217 842 120 -626 -479 273 766 66 -879 -374 757 683 -364 -931 -98
1765 -98 1071 574 -846 -843 307 1011 422 -957 -955 610 1179 42 -1110 -715 860 1071 -370 -1044 -317
1784 -317 817 907 -515 -1132 -23 947 719 -663 -1337 266 1472 262 -1225 -955 729 1439 -121
1801 -121 -1443 -575 1002 1188 -305 -1430 -447 1184 1152 -516 -1532 -222 1484 912 -953 -1347 204
1818 204 1470 576 -1203 -1171 651 1422 75 -1306 -845 923 1351 -382 -1475 -349 1141 1005 -604
1835 -604 -1411 -107 1281 827 -781 -1423 119 1530 547 -1116 -1159 412 1502 222 -1330 -714 709
1852 709 1088 59 -1156 -619 877 984 -232 -1108 -409 1019 875 -602 -1090 7 1089 567 -818
1869 -818 -951 302 1027 296 -885 -833 494 1065 -54 -1011 -459 683 833 -263 -974 -121 794 450
1887 450 -389 -730 0 854 317 -677 -553 347 822 20 -896 -246 737 502 -339 -722 -6 801 275 -550
1907 -550 -478 136 673 245 -714 -505 478 641 -67 -761 -342 704 557 -485 -681 37 698 382 -617 -666
1927 -666 328 759 130 -698 -601 524 878 -168 -872 -305 677 775 -335 -958 -73 850 595 -469 -980
1946 -980 59 1084 384 -795 -804 297 1105 191 -1057 -592 643 893 -7 -1055 -559 879 883 -373
1964 -373 -1043 -349 996 881 -699 -1130 106 1075 557 -846 -1038 410 1152 201 -937 -812 577 1174
1982 1174 -77 -1096 -465 760 998 -278 -1185 -182 994 653 -481 -1029 -58 1119 503 -781 -827
1999 -827 208 1020 366 -946 -749 553 862 35 -841 -596 617 837 -222 -827 -340 613 773 -331
2017 -331 -911 -54 768 483 -453 -806 154 842 200 -571 -537 242 801 69 -731 -321 422 587 -53 -764
2037 -764 -223 681 381 -344 -557 -61 663 317 -561 -451 234 516 120 -562 -398 443 451 -198 -501 -144 492
2058 492 389 -400 -475 156 460 172 -428 -436 341 534 -98 -462 -243 407 538 -242 -585 17 506 354 -335
2079 -335 -612 166 637 90 -467 -417 249 661 -65 -652 -171 398 452 -121 -685 -137 645 341 -372 -600 -14
2100 -14 731 326 -632 -567 290 716 159 -693 -498 481 691 -21 -686 -437 593 739 -244 -744 -177 635
2120 635 634 -384 -800 72 712 332 -463 -707 164 837 156 -712 -524 368 804 -24 -895 -321 649 595 -253
2141 -253 -800 -200 760 516 -425 -699 -61 722 492 -546 -719 191 727 245 -594 -560 349 663 -1 -553
2161 -553 -353 400 585 -172 -581 -123 425 455 -234 -656 46 604 196 -366 -502 56 631 174 -556 -409
2181 -409 229 519 71 -548 -344 367 457 -85 -495 -167 385 291 -184 -338 -29 356 222 -284 -288 191 348
2202 348 9 -320 -211 312 389 -198 -410 10 363 254 -260 -436 104 422 100 -304 -356 147 409 -39 -344
2223 -344 -164 159 302 -98 -388 -3 302 111 -200 -302 107 410 0 -403 -199 314 407 -133 -485 -78
2243 -78 442 339 -221 -473 -11 495 269 -293 -425 20 492 238 -389 -414 207 460 53 -406 -313 306 436
2264 436 -149 -447 -117 354 357 -254 -534 22 493 257 -345 -543 117 612 155 -452 -470 177 656 122 -566
2285 -566 -378 301 598 33 -597 -277 445 452 -128 -514 -132 452 313 -269 -424 18 439 205 -391 -400 181
2306 181 453 50 -459 -341 305 475 -104 -514 -205 361 416 -150 -498 -94 395 300 -171 -408 -51 399 211
2327 211 -223 -301 34 361 119 -276 -204 158 274 0 -311 -120 272 191 -152 -271 -32 307 148 -253 -264
2348 -264 67 272 107 -271 -268 141 286 9 -259 -185 167 258 -70 -255 -66 191 166 -120 -212 66 212 32
2370 32 -160 -143 138 239 -55 -234 -43 207 199 -112 -278 6 271 116 -179 -242 53 309 45 -264 -170 135
2392 135 249 -20 -291 -101 226 146 -136 -243 -19 256 111 -221 -214 80 268 87 -280 -219 198 318 -8
2413 -8 -306 -177 275 318 -106 -299 -91 268 291 -139 -350 -9 288 208 -164 -342 28 342 90 -255 -280 88
2435 88 345 29 -353 -201 199 308 -43 -388 -144 317 277 -139 -366 -80 358 236 -222 -330 29 341 193
2456 193 -242 -304 126 348 102 -255 -245 168 341 -31 -299 -131 183 261 -63 -313 -55 231 153 -109 -273
2477 -273 -34 265 102 -198 -217 20 256 59 -250 -173 110 196 19 -232 -122 169 149 -69 -170 -61 170
2498 170 136 -116 -146 33 155 88 -110 -144 86 170 15 -117 -90 113 159 -45 -163 -19 131 95 -81 -165 32
2521 32 161 12 -129 -120 35 156 -9 -165 -49 107 111 -42 -176 -17 176 61 -122 -133 46 200 22 -177
2543 -177 -70 137 165 -5 -178 -42 189 124 -93 -166 -14 208 102 -159 -151 66 189 60 -178 -154 127 180
2565 180 -23 -193 -121 148 187 -84 -212 -50 172 151 -101 -233 16 225 96 -136 -195 22 245 74 -189
2586 -189 -159 105 247 55 -223 -130 173 217 -20 -219 -95 201 186 -97 -211 -40 211 168 -143 -210 29 204
2608 204 90 -178 -220 93 217 12 -204 -146 110 203 -38 -223 -88 154 167 -69 -218 -25 191 131 -93 -164
2630 -164 26 200 94 -128 -131 66 167 30 -139 -105 105 145 -26 -147 -56 111 106 -69 -139 -4 104 61 -97
2653 -97 -123 34 97 20 -101 -109 30 98 -10 -118 -55 46 93 -20 -114 -19 87 62 -46 -84 19 117 24 -71 -55 55
2679 55 100 -5 -102 -26 89 73 -45 -108 -8 109 54 -109 -104 39 102 9 -124 -86 70 95 -47 -120 -36 95 86 -83
2705 -83 -119 6 121 63 -108 -114 71 136 5 -116 -88 88 144 -23 -146 -41 122 136 -47 -152 -19 149 110
2728 110 -83 -147 11 156 74 -111 -129 23 134 41 -138 -117 68 123 -10 -150 -101 108 122 -51 -162 -33 145
2751 145 120 -79 -162 3 169 97 -103 -155 41 183 62 -120 -122 68 185 31 -145 -89 101 147 -7 -160 -56
2774 -56 137 126 -73 -146 -24 128 79 -103 -145 6 131 33 -132 -118 55 118 6 -138 -91 73 133 -33 -113 -41
2798 -41 88 111 -26 -108 1 113 69 -46 -79 19 102 29 -67 -55 38 75 7 -80 -42 41 67 -5 -76 -16 71 44 -53 -79
2826 -79 -9 58 26 -86 -76 28 48 11 -66 -49 41 52 -26 -62 -7 72 44 -37 -65 28 82 24 -51 -39 65 97 -7 -76
2854 -76 -9 74 89 -47 -94 -5 85 44 -74 -103 28 96 18 -88 -83 28 87 -1 -103 -61 53 75 -22 -123 -45 87
2880 87 70 -61 -101 -1 103 64 -79 -86 32 111 41 -88 -79 62 123 17 -95 -74 61 124 -25 -102 -56 75 104
2905 104 -33 -124 0 97 63 -62 -121 3 106 31 -89 -93 18 124 23 -118 -80 51 112 10 -122 -62 96
2928 96 104 -23 -121 -29 114 88 -48 -99 9 109 78 -60 -94 24 114 40 -84 -76 47 103 0 -93 -51 47 72 -23
2954 -23 -104 -31 79 44 -40 -106 -26 87 48 -55 -66 -10 75 47 -68 -58 26 52 28 -58 -44 42 71 2 -28 -16 64 69 -11
2983 -11 -38 9 41 43 -31 -46 21 43 12 -35 -40 21 45 -18 -56 -21 18 23 -38 -77 0 42 1 -38 -33 14 49 5 -64 -11 39 48 -3
3016 -3 -60 -6 65 35 -29 -43 16 68 36 -33 -38 33 76 13 -69 -35 55 63 -16 -69 -33 63 46 -47 -70 -8 48 45 -54 -94 7 65
3048 65 23 -65 -73 26 86 -9 -83 -50 42 97 -6 -81 -23 78 78 3 -85 -23 104 75 -22 -60 -11 89 71 -57 -80 8 75
3077 75 46 -76 -95 44 81 8 -94 -79 39 86 -29 -104 -45 43 71 -33 -110 -17 69 56 -41 -92 -4 86 40 -60 -65
3104 -65 22 98 40 -66 -43 43 72 25 -63 -47 59 73 -5 -57 -33 56 63 -43 -61 -7 43 41 -48 -81 -8 51 6 -46 -73 7
3134 7 69 -4 -59 -29 17 49 4 -48 -29 34 33 -2 -44 -19 58 42 -23 -24 19 67 33 -32 -24 36 36 14 -43 -20 47 33 -29 -39 -9
3167 -9 34 34 -42 -53 10 27 1 -47 -54 23 48 -29 -58 -19 37 46 -26 -52 -4 43 26 -27 -46 28 73 23 -34 -25 36 70 9 -56 -10
3200 -10 50 56 -15 -72 -15 57 30 -34 -51 -6 52 36 -60 -57 9 44 14 -68 -76 9 51 -14 -63 -47 42 52 -24 -76 -28 49 70 -24
3232 -24 -76 -9 87 67 -40 -76 19 81 40 -59 -78 27 87 24 -72 -55 32 80 6 -86 -51 55 63 -30 -72 -34 63 53 -58
3261 -58 -94 -11 67 33 -67 -84 9 82 22 -70 -73 30 72 9 -66 -37 44 91 2 -75 -16 61 70 0 -59 -17 68 47 -45 -58
3291 -58 -3 63 30 -54 -64 11 54 3 -64 -60 35 54 -16 -77 -41 36 51 -28 -68 -12 41 38 -23 -54 -12 67 20 -36 -43 28 53 13
3323 13 -43 -18 43 54 -5 -48 3 47 42 -22 -53 10 72 34 -60 -46 17 50 -3 -62 -37 28 44 -30 -65 -34 38 41 -41 -64 -9
3354 -9 58 29 -52 -41 19 53 13 -50 -32 54 75 -10 -53 -8 62 83 -13 -72 -3 81 59 -39 -64 8 68 51 -55 -75 18 78
3384 78 25 -70 -71 40 77 -3 -93 -58 61 65 -30 -82 -26 67 73 -55 -86 6 101 49 -55 -87 29 111 31 -61 -66 36 103
3413 103 20 -75 -51 61 97 -7 -88 -40 71 74 -26 -91 -12 76 37 -68 -94 2 81 38 -90 -88 23 86 7 -85 -70
3440 -70 43 88 -13 -92 -35 65 81 -23 -90 -4 82 66 -22 -73 5 82 43 -41 -50 40 73 21 -58 -43 39 67 -2 -70 -35
3469 -35 48 54 -27 -82 -16 51 38 -47 -71 5 55 24 -66 -63 18 68 10 -69 -45 45 70 -1 -60 -10 63 48 -17 -51 19 84 36
3500 36 -36 -42 37 90 26 -60 -40 47 67 -9 -75 -25 55 47 -32 -81 -9 67 46 -53 -78 10 72 22 -64 -68 32 78 -7 -79 -45
3531 -45 72 78 -19 -76 -18 85 76 -33 -72 7 102 66 -58 -69 24 100 34 -72 -59 50 99 5 -99 -59 56 87 -11
3558 -11 -106 -44 73 66 -67 -119 -26 91 46 -65 -102 3 88 39 -73 -85 46 109 16 -82 -51 67 112 -7 -88 -34
3584 -34 92 107 -26 -87 0 110 79 -38 -83 20 101 34 -80 -79 26 95 12 -83 -65 52 84 -14 -103 -43 73 73 -31
3611 -31 -93 -22 79 59 -45 -79 13 82 41 -56 -67 35 83 19 -65 -39 59 84 4 -63 -17 74 75 -32 -79 -5 71 46 -60
3640 -60 -73 11 88 18 -74 -60 42 75 -7 -89 -46 62 55 -25 -81 -31 73 56 -45 -74 12 80 40 -56 -45 41 95 24 -61
3669 -61 -29 67 89 -8 -75 -5 82 73 -38 -79 20 102 49 -67 -86 18 97 21 -80 -68 45 85 -9 -106 -57 65 80 -47
3697 -47 -103 -24 86 57 -53 -97 0 103 49 -65 -85 38 110 35 -80 -54 59 112 15 -93 -43 80 97 -21 -114
3722 -114 -20 89 70 -50 -114 -2 96 45 -81 -88 13 94 25 -107 -81 33 96 -7 -117 -75 60 92 -26 -100 -36
3747 -36 98 87 -42 -101 5 112 70 -63 -89 25 108 54 -72 -67 59 103 11 -82 -52 64 88 -29 -93 -28 78
3772 78 58 -47 -95 -15 82 48 -68 -87 11 82 27 -82 -81 41 92 11 -78 -50 67 85 -20 -83 -22 92 71 -52 -75
3799 -75 19 84 45 -54 -60 38 103 23 -78 -50 51 79 -10 -78 -29 68 57 -39 -101 -11 79 34 -60 -84 3 76 16 -85 -62
3828 -62 41 80 2 -86 -37 70 86 -26 -77 -11 101 61 -53 -74 22 102 45 -59 -63 48 101 19 -85 -40 57 93 -4
3855 -4 -96 -42 77 84 -45 -108 -11 85 46 -52 -89 1 90 28 -85 -80 21 97 17 -84 -56 63 91 -2 -89 -31 85 89 -31
3884 -31 -78 -18 110 76 -43 -82 13 113 55 -62 -78 41 106 22 -84 -76 58 96 -11 -105 -46 78 73 -34 -113 -22
3910 -22 70 63 -65 -103 -1 101 29 -82 -82 37 94 26 -80 -53 63 90 -10 -76 -26 91 87 -25 -75 4 93 66 -47
3937 -47 -83 14 83 29 -65 -77 27 78 13 -81 -52 49 91 -17 -92 -29 65 55 -46 -84 3 76 41 -56 -73 14 85 18
3965 18 -67 -54 50 80 -1 -75 -27 71 85 -21 -64 4 95 67 -49 -64 23 86 31 -74 -70 34 86 1 -89 -57 60 73
3993 73 -33 -92 -35 71 64 -47 -83 1 81 40 -67 -74 23 98 26 -69 -40 57 103 2 -83 -29 70 86 -3 -78 -8 94
4021 94 70 -40 -72 6 99 50 -59 -81 24 84 21 -78 -73 40 81 -9 -94 -51 40 77 -29 -104 -37 70 63 -40 -97 -1
4049 -1 97 54 -59 -69 28 113 29 -72 -53 59 106 6 -87 -26 88 93 -9 -76 -13 81 63 -52 -97 -6 85 38 -80
4076 -80 -79 10 73 19 -101 -77 36 70 -20 -85 -45 53 61 -35 -86 -20 71 62 -34 -77 10 90 38 -56 -55 37 87 26 -53 -39 50
4107 50 84 3 -71 -25 56 58 -30 -75 -13 66 41 -52 -69 8 57 14 -65 -67 17 59 -9 -84 -52 40 47 -13 -85 -12 70 43 -42 -70
4139 -70 8 77 34 -61 -53 36 82 21 -60 -29 49 80 -6 -74 -20 73 58 -40 -85 -8 62 41 -53 -83 7 63 10 -82 -69 27 62
4170 62 -11 -90 -47 41 74 -22 -78 -21 65 59 -39 -76 7 82 49 -48 -60 34 93 31 -57 -58 51 99 12 -65 -40 56 82 -21
4200 -21 -87 -25 59 52 -45 -84 -24 66 34 -55 -78 -2 65 11 -77 -67 32 75 -3 -79 -36 51 72 -11 -68 -8 70 60 -25 -65 4
4231 4 86 46 -44 -42 31 82 25 -58 -42 38 73 2 -63 -42 51 52 -19 -76 -24 54 28 -44 -78 -7 49 14 -56 -65 16 54 4 -55
4263 -55 -41 31 69 -3 -57 -23 46 54 -19 -50 5 60 35 -29 -52 21 66 32 -48 -42 34 59 5 -54 -43 39 39 -20 -64 -24 51 34
4295 34 -41 -67 -8 38 13 -59 -59 5 43 3 -63 -39 35 60 -20 -57 -1 57 58 -21 -43 5 62 35 -36 -49 20 69 25 -50 -44 21
4327 21 62 -7 -62 -38 35 45 -15 -68 -29 44 32 -31 -66 -14 41 22 -53 -62 7 49 21 -62 -57 27 59 2 -53 -21 47 62 -17
4358 -17 -51 -2 67 51 -17 -54 7 79 42 -31 -52 19 74 23 -58 -54 19 51 0 -69 -29 25 42 -22 -67 -27 43 37 -51 -64 -13
4389 -13 54 22 -51 -53 8 64 9 -46 -41 32 61 6 -49 -19 50 66 -3 -40 2 45 41 -19 -45 6 53 24 -41 -47 5 42 -3 -51
4421 -51 -43 21 29 -19 -58 -33 24 25 -21 -55 -24 34 32 -31 -40 9 46 18 -26 -30 29 51 14 -37 -20 36 47 -7 -35 -6 49 47 -26 -42
4455 -42 4 53 24 -19 -37 17 46 0 -50 -40 12 27 -11 -58 -19 29 22 -30 -57 -12 36 21 -37 -41 17 46 19 -36 -27 28 52 10
4487 10 -35 -10 48 49 -14 -24 1 54 50 -21 -26 13 50 34 -31 -37 15 54 6 -42 -35 4 36 -15 -62 -34 17 26 -22 -65 -26 30 20
4520 20 -35 -53 -11 51 33 -25 -35 14 56 28 -33 -26 23 53 16 -34 -17 46 52 -5 -36 -15 38 42 -19 -41 0 28 23 -44 -50 18 43
4553 43 -2 -45 -30 26 41 -25 -53 -32 33 30 -14 -50 -14 31 28 -13 -38 0 44 17 -31 -24 20 47 18 -16 -11 30 37 15 -20 -13 36
4586 36 40 -15 -31 -4 29 17 -26 -50 -2 20 10 -29 -37 6 30 -9 -40 -28 14 20 -19 -42 -13 20 22 -15 -35 -2 45 21 -27 -24 9
4619 9 40 21 -24 -14 25 44 3 -25 0 38 31 -13 -31 -5 33 19 -40 -36 13 30 -5 -43 -44 12 27 -5 -46 -32 15 33 -18 -43
4651 -43 -20 33 27 -24 -35 1 46 32 -12 -30 24 44 19 -29 -15 32 44 15 -31 -17 40 35 -6 -36 -13 35 25 -19 -45 -7 43
4682 43 15 -35 -38 -8 31 -2 -49 -34 8 35 -10 -42 -29 24 43 -11 -29 -3 47 35 -16 -34 -2 57 24 -19 -24 12 42 24 -19
4713 -19 -12 27 50 3 -28 -26 22 25 -14 -34 -22 20 21 -18 -46 -1 9 12 -37 -32 -3 25 1 -41 -30 6 26 8 -34 -16 23 28 -6 -30
4747 -30 8 34 22 -1 -19 7 43 25 -6 -18 19 44 26 -21 -18 14 27 -2 -40 -23 23 20 -18 -40 -17 22 9 -32 -43 -6 15
4778 15 -5 -31 -24 7 13 -6 -28 -7 26 31 -6 -25 8 29 29 -12 -16 23 40 19 -15 -22 22 41 10 -27 -16 16 23 -4 -44 -17 18 9
4812 9 -29 -36 -18 17 13 -31 -48 -11 20 -1 -38 -42 6 35 3 -26 -20 18 44 -1 -22 -11 41 50 4 -24 1 47 34 1 -26 3 39
4845 39 23 -17 -32 8 29 1 -42 -26 6 17 -6 -48 -23 19 18 -25 -39 -15 24 13 -30 -39 -1 19 5 -27 -26 15 44 6 -20 -12
4877 -12 25 32 3 -12 -2 35 40 6 -18 1 34 20 -20 -25 0 20 11 -30 -22 -11 17 0 -31 -30 -2 9 -17 -40 -19 6 10 -18 -36 -11
4911 -11 17 16 -11 -6 3 31 10 -13 -20 13 29 5 -13 -6 26 32 2 -7 9 19 9 -9 -16 3 24 3 -21 -18 7 16 -12 -28 -18 12 12 -21
4947 -21 -37 -27 17 -1 -23 -27 -24 25 9 -20 -19 13 27 15 -21 -13 21 35 9 -21 -1 33 39 -6 -9 20 26 32 -14 -25 4 32 6 -24
4981 -24 -26 -2 24 2 -27 -35 7 13 -13 -42 -37 21 14 -18 -33 -16 35 21 -17 -24 -3 34 24 -18 -20 13 38 24 -21 -9 40 42 13 -19
5015 -19 -11 33 40 -4 -25 -9 26 24 -24 -38 -27 16 2 -26 -34 -5 21 -3 -36 -35 -1 13 -11 -38 -26 14 19 0 -30 0 23 26 -3 -25
5049 -25 -1 26 15 -8 -17 7 33 15 -22 -10 14 25 15 -21 -7 5 35 -6 -29 -17 7 25 -22 -32 -19 6 1 -31 -30 6 19 -9
5081 -9 -31 -27 14 28 5 -38 -18 20 20 1 -19 1 28 25 -15 -7 16 32 16 -19 -7 22 38 5 -25 -14 19 22 -20 -32 -4 15 18 -30
5115 -30 -33 -13 16 -4 -37 -23 -2 16 -5 -30 -25 13 19 11 -26 -1 30 30 1 -12 7 38 36 -11 -10 18 39 19 -5 -17 24 36 19 -28
5149 -28 -17 17 24 -8 -41 -9 29 18 -21 -43 -17 14 10 -27 -52 -1 26 11 -38 -36 20 29 -2 -35 -24 34 38 1 -17 -5 39 27 -8
5182 -8 -21 8 45 26 -14 -16 16 43 18 -25 -21 15 24 -2 -35 -23 18 18 -9 -37 -20 25 8 -21 -39 -8 9 11 -22 -38 0 16 1
5215 1 -31 -20 15 33 13 -18 -11 33 32 2 -27 -10 29 25 -4 -19 5 37 25 -14 -12 9 22 -3 -36 -29 10 9 -15 -38 -26 17 17 -25
5249 -25 -36 -20 16 9 -23 -30 -11 23 4 -16 -24 15 33 8 -29 -8 28 24 8 -19 6 30 23 -9 -6 12 35 20 -13 -25 10 17 -5 -27
5283 -27 -23 11 12 -17 -43 -27 3 19 -22 -49 -27 8 7 -31 -43 -9 25 13 -27 -28 3 30 7 -29 -8 21 43 11 -35 -9 38 38 8
5316 8 -22 -11 43 39 -16 -26 -2 33 25 -25 -45 -5 18 -5 -40 -42 2 27 -21 -43 -17 16 26 -21 -45 -10 22 13 -27 -39 5 36 15
5349 15 -28 -22 15 38 21 -25 -13 23 37 6 -26 -4 27 20 -12 -24 -8 19 23 -14 -26 -10 20 -2 -40 -36 -4 19 -8 -39 -28 0
5381 0 11 -20 -43 -19 16 17 -14 -25 -6 19 18 -16 -19 8 36 15 -23 -17 13 32 1 -24 -9 22 19 -3 -38 -14 24 15 -24 -29 1 14
5415 14 -9 -25 -39 -6 16 -8 -34 -29 5 4 -16 -36 -25 8 14 -28 -32 -4 21 5 -11 -30 20 32 15 -14 -12 21 28 1 -15 -2 27
5448 27 37 0 -22 -1 28 6 -11 -46 -14 27 5 -36 -41 -7 6 -15 -38 -38 -1 21 -4 -44 -27 23 12 -20 -39 -10 30 26 -18 -27
5480 -27 4 26 26 -16 -24 21 38 18 -22 -15 31 37 3 -33 -6 25 30 -22 -43 -16 16 6 -23 -39 1 18 -4 -45 -37 -7 14 -14 -42
5513 -42 -26 13 22 -11 -35 -15 14 19 -3 -11 -6 23 25 -10 -20 -2 30 16 -20 -20 14 24 3 -21 -36 11 11 -8 -38 -23 17 9 -33 -42 -17
5548 -17 9 -1 -35 -47 -13 22 -15 -45 -32 -1 13 -8 -35 -16 13 19 -12 -31 -4 35 24 -18 -25 8 28 0 -16 -4 20 35 2
5579 2 -26 -16 4 17 -23 -36 -6 10 7 -29 -37 -14 9 6 -41 -37 -8 16 -1 -43 -27 7 13 -10 -46 -17 16 26 -3 -30 4 36 22
5612 22 -7 -20 9 31 13 -16 -22 14 35 13 -30 -17 17 27 -5 -43 -30 19 16 -31 -59 -19 20 13 -20 -52 -10 24 3 -39 -46 0
5644 0 20 -17 -33 -24 17 32 -16 -33 -7 28 23 -26 -35 6 40 22 -13 -17 7 38 14 -26 -19 20 20 8 -39 -22 15 17 -17 -42 -22 15
5678 15 5 -21 -40 -8 21 -4 -34 -42 -4 18 3 -29 -23 3 22 2 -17 -18 24 32 11 -31 -5 29 31 0 -14 -4 26 18 -26 -23 12 36
5712 36 4 -37 -33 20 15 -14 -43 -22 12 12 -26 -52 -12 18 -3 -40 -41 -10 17 -7 -36 -29 0 18 4 -28 -4 36 23 -2 -19 5 32
5745 32 31 -3 -19 14 27 12 -24 -16 15 30 6 -29 -20 8 9 -15 -33 -16 8 9 -27 -39 -24 11 4 -24 -39 -14 16 -8 -28 -30 6 29
5779 29 -1 -27 -13 23 25 1 -33 -3 35 34 -5 -19 13 28 23 -10 -16 -3 35 3 -33 -33 6 31 -6 -41 -29 3 29 -20 -46 -23 14
5812 14 8 -22 -39 -1 12 3 -36 -29 7 25 5 -26 -8 20 33 -4 -27 -8 23 26 -7 -26 0 36 32 -10 -40 -3 24 21 -30 -25 9 17
5846 17 -5 -34 -33 2 9 -24 -38 -24 8 3 -9 -34 -28 10 4 -23 -27 -8 24 11 -11 -17 2 36 9 -22 -16 23 22 4 -24 -3 31 19 -12
5881 -12 -24 2 25 17 -18 -27 -4 22 -14 -29 -27 6 16 -18 -38 -17 4 10 -29 -40 -14 17 8 -35 -31 2 22 3 -18 -17 21 28 9 -13
5915 -13 -6 28 32 3 -17 -2 25 17 -6 -24 15 28 13 -23 -26 -4 18 2 -38 -23 2 9 -6 -38 -34 10 2 -22 -50 -23 12 3 -19 -33
5949 -33 -13 20 10 -8 -19 16 20 18 -15 -16 18 30 -2 -32 -10 16 29 -2 -23 -4 27 27 -14 -29 0 20 -5 -31 -25 -13 11 -7 -35
5982 -35 -23 2 10 -21 -42 -28 3 3 -26 -29 -11 19 25 -30 -14 0 32 15 -8 -11 17 31 12 -7 -10 20 23 -2 -24 -7 8 19 -8 -17
6016 -17 -9 0 5 -39 -34 -8 9 -6 -38 -20 2 6 -22 -41 -18 9 -1 -11 -42 -16 18 6 -15 -17 1 18 18 -8 -21 8 29 8 -12 -3
6050 -3 27 22 -1 -9 1 14 9 -20 -29 -7 13 6 -26 -42 -9 3 -17 -45 -28 -1 -5 -26 -34 -18 -10 -3 -23 -29 -16 4 14 -15 -24 5 20 7
6086 7 -21 -19 14 28 6 -14 -5 18 31 2 -13 -5 18 20 -13 -19 5 13 12 -25 -35 -7 13 -13 -36 -34 7 10 -9 -31 -29 -4 9 -11 -42 -17
6122 -17 15 6 -17 -24 10 29 6 -10 -16 13 20 10 -11 -6 15 19 -1 -18 -2 31 7 -4 -13 -2 16 1 -24 -33 -1 5 8 -22 -32 -14 3
6157 3 -12 -36 -27 -1 -1 -19 -26 -21 -12 5 -16 -22 -4 14 9 -6 -14 12 24 10 -5 -2 3 19 6 -4 -3 15 18 -3 -14 -7 13 20 -16 -15 -2 10
6195 10 0 -34 -20 -5 8 -18 -36 -30 2 15 -19 -39 -8 9 4 -14 -19 3 20 0 -7 -10 21 21 11 -17 -8 13 12 3 -12 -1 21 12 -11
6230 -11 -25 -8 10 4 -25 -26 -14 1 -14 -26 -31 -2 3 -23 -34 -18 15 11 -14 -30 -17 10 14 -25 -27 4 18 17 -14 -12 8 29 19 -4 -9
6265 -9 17 13 1 -13 -7 8 19 2 -28 -14 15 -3 -22 -23 -8 15 -5 -33 -38 -12 6 -9 -33 -33 -5 0 -17 -33 -22 5 6 -13 -8 3 20
6300 20 17 -13 -12 6 25 3 -9 -9 10 19 -6 -13 -6 9 15 -10 -22 -14 1 5 -20 -25 -11 -9 -7 -27 -20 8 5 -14 -29 -24 -9 0 -16 -20 -15 6 -6
6339 -6 -14 -7 2 15 10 -14 -14 0 20 21 -7 -14 7 25 8 -13 -3 17 26 -1 -23 -2 17 6 -22 -28 -8 5 -9 -35 -28 -10 4 -12 -23 -20
6375 -20 -3 3 -14 -31 -17 6 -4 -22 -29 2 17 10 -13 0 9 22 11 -13 -13 18 13 -1 -8 -9 17 18 -4 -12 -14 9 13 -18 -17 -5 -2 -5 -29 -33
6413 -33 2 0 -21 -25 -19 -3 11 -26 -29 -6 2 2 -20 -30 -15 19 19 -4 -9 10 33 11 -10 -8 14 20 16 -15 -11 21 21 -6 -28 -10 12 9 -19
6450 -19 -34 -12 14 -13 -34 -29 -10 1 -18 -26 -19 -8 4 -6 -26 -17 3 2 -5 -19 -17 5 16 1 -9 10 17 8 7 10 20 22 7 -4 -5 5 12
6487 12 -3 -7 -15 8 8 -9 -15 -12 2 -2 -16 -33 -11 5 -3 -28 -13 -11 1 -5 -31 -15 -3 -2 -9 -18 -5 12 8 -10 -11 5 28 11 -5 -2 15 33
6525 33 2 -6 -8 25 13 0 -12 4 16 6 -8 -25 -8 8 -11 -17 -24 -6 2 -17 -24 -24 -2 18 -14 -24 -14 10 9 -15 -15 -7 12 6 -12 -8
6561 -8 9 17 16 7 2 8 25 14 -3 -14 7 14 0 -10 2 12 13 -3 -24 -10 6 -10 -13 -35 -12 7 -15 -28 -21 -15 5 0 -18 -28 -2 7 -6
6598 -6 -16 -13 17 15 1 -11 0 29 24 -7 -7 16 22 11 2 -8 11 24 -2 -10 -7 16 7 -12 -18 -1 10 -4 -23 -19 -13 -4 -4 -27 -26 3 8 -12 -31
6637 -31 -12 -1 0 -8 -12 -13 4 15 -14 -11 12 24 18 -8 5 4 28 9 -6 -5 4 19 1 -5 -4 3 16 -8 -20 -11 7 0 -14 -30 -21 -1 4 -23
6675 -23 -23 -6 6 -10 -30 -20 -3 8 -14 -30 -11 12 4 -8 -12 8 18 14 -2 -8 10 31 12 3 -2 17 12 -3 -15 -1 16 10 -6 -12 -11 11
6711 11 6 -16 -18 1 -2 1 -16 -17 0 7 1 -23 -17 -7 7 -14 -21 -5 5 14 -11 -11 8 12 21 4 -5 8 25 15 -6 -12 7 31 6 -19 -3 11
6749 11 16 -5 -20 -16 -3 0 -20 -26 -23 -12 -7 -30 -29 -6 15 -4 -28 -20 6 16 -1 -25 -11 6 20 -7 -14 0 28 17 -5 -12 6 14 12 -8
6785 -8 2 17 17 8 -8 -5 7 19 1 -6 -8 9 -6 -12 -20 -20 7 -9 -32 -26 -16 -9 -6 -31 -18 -3 -3 -14 -17 -19 4 12 -1 -9 -2 18 7 1 -1 15
6825 15 21 13 -1 -8 16 21 4 -12 -12 6 17 3 -19 -13 4 4 -22 -26 -4 8 -10 -15 -27 -8 7 -10 -16 -12 -13 7 4 -30 -16 19 6 -5 -16
6862 -16 -5 11 13 6 -2 3 29 13 -6 -3 9 21 7 -16 -4 9 10 -2 -18 -17 3 3 -16 -23 -20 5 5 -10 -29 -14 -1 0 -19 -21 -1 5 -2 -21
6900 -21 -17 -9 12 -11 -20 -4 16 19 3 -6 13 21 11 -9 -6 2 17 12 -11 2 4 6 1 -12 -14 12 -3 -7 -20 -26 -3 -14 -11 -35 -25 7 2 -21 -17
6939 -17 -11 13 -1 -14 -20 5 12 3 -11 -6 2 17 8 -1 1 13 6 2 -1 10 15 15 5 -5 0 12 -5 -12 -21 -2 -8 -7 -24 -18 -6 -1 -7 -29 -12 1 2 -16
6981 -16 -22 -6 5 0 -7 -9 -5 2 9 -6 -12 11 10 2 -3 6 24 21 15 -1 7 13 10 -8 -9 12 24 16 -14 -5 9 10 -3 -18 -19 0 1 -16 -22 -14 3 -4 -15
7024 -15 -23 -11 0 5 -12 -11 2 7 2 -3 -13 9 16 22 -1 5 21 25 13 2 5 20 16 -6 -8 0 10 12 -4 -8 -1 17 -9 -19 -16 -1 3 -12 -19 -10 -8
7065 -8 3 3 -24 -7 -1 20 9 -10 -4 12 11 1 -7 6 21 17 0 12 22 31 17 5 8 19 10 14 -1 4 31 14 4 -13 0 12 -2 -14
7101 -14 -26 -15 7 -8 -17 -14 -7 -3 -11 -19 -19 0 5 -11 -12 -1 4 3 -5 -6 13 9 9 8 -1 16 18 13 0 16 14 16 6 -8 3 3 4 -1 -4 -6 0 2 -4 -14 -8
7146 -8 5 -8 -16 -25 -12 -2 -12 -15 -8 16 9 -9 -15 -9 20 10 -10 0 8 11 14 -5 1 24 22 11 1 3 17 29 16 -4 9 21 21 1 -9 6
7184 6 13 -7 -7 -13 -9 1 -4 -17 -16 -3 -1 -6 -19 -10 2 1 -16 -16 -8 13 5 6 -2 12 17 6 12 4 22 21 13 4 8 19 6 3 -5 -8 10 8 6 5 -2 12 16 -5
7230 -5 -17 -3 -4 0 -15 -17 -5 10 4 -12 -21 -6 10 -12 -20 -5 0 7 -1 -14 1 20 15 4 -4 11 17 18 6 0 19 22 9 0 -4 16 5 1 -11 2
7270 2 9 13 -4 -19 -11 2 -4 -15 -16 -10 -1 -13 -19 -8 -9 2 -16 -10 -10 2 14 -1 -12 1 16 20 7 -8 13 23 14 2 -4 15 21 1 7 -10 4
7309 4 13 7 -16 -8 1 2 -11 -23 -12 -2 1 -17 -31 -14 -5 -8 -20 -18 3 -1 -9 -18 -7 2 -6 -3 -16 -7 11 15 0 -6 11 18 17 -1 -3 9 24 8 -3
7350 -3 -3 6 13 -4 -14 -3 5 5 -8 -16 -17 -7 8 -17 -18 -16 -2 -5 -16 -21 -6 9 0 -19 -15 7 4 -11 -15 -10 1 14 6 -11 9 16 15 3 -1 11 21
7391 21 15 -5 -3 13 20 9 -13 -12 4 7 -7 -20 -16 -9 1 -14 -22 -20 3 -2 -11 -23 -16 0 -2 -11 -18 7 9 8 -6 -1 6 15 -1 -2 -4 11 27 -2 -1 11
7433 11 13 3 0 -5 5 12 14 -12 -12 4 20 -5 -5 -13 -15 3 -3 -31 -16 -2 3 -18 -19 -9 2 1 -10 -21 -7 14 3 0 -8 8 18 12 -2 9
7471 9 28 23 9 -2 6 20 20 0 3 10 14 4 2 -1 5 10 -2 -15 -18 5 7 -16 -12 -15 -12 1 -17 -27 -6 3 -3 -18 -23 -2 7 6 -4 -16 8 20 -1
7512 -1 -2 3 16 22 10 2 4 20 15 0 -4 11 17 -7 -8 -7 1 12 -7 -15 -16 -1 -6 -16 -23 -19 -5 -12 -4 -23 -16 8 5 -13 -15 -5 11 -5 0 -14 5 18
7554 18 5 -7 0 14 16 13 -8 4 15 22 16 -14 4 18 10 -6 -15 -3 12 -6 -28 -20 -3 2 -15 -19 -25 -7 -3 -8 -18 -10 2 4 -11 -12 -4 -1 0 -11
7594 -11 -21 -1 6 9 1 -7 18 26 4 -10 8 6 25 5 2 3 12 23 -1 -1 -2 16 1 -8 -14 2 -2 -12 -20 -19 -3 3 -6 -4 -11 1 -1 -14 -17 4 6 6
7636 6 -8 -9 12 13 1 -5 -1 17 18 15 4 14 11 12 -1 -7 8 17 13 5 -2 8 17 7 -20 -1 1 15 -7 -14 -14 -6 -2 -1 -17 -21 8 6 -5 -14 -4 0 2
7679 2 -16 -6 6 15 19 -2 -8 22 27 10 8 16 19 12 3 -4 4 12 22 10 -6 7 7 14 4 -5 -4 11 1 -16 -13 -5 2 -6 -30 -5 -3 0 -10 -19 -7 6
7721 6 14 -5 -26 -5 22 5 -6 -1 18 20 10 4 5 17 23 12 -2 0 11 21 12 -9 -11 -2 2 -7 -9 -10 2 1 -16 -12 -6 2 -4 -15 -22 -9 -10 -15 -13 -9 8
7764 8 0 -10 -9 -5 3 15 8 -5 4 6 14 4 9 13 23 4 -5 9 22 21 11 -5 1 14 7 0 -17 -9 8 1 -16 -18 -10 5 -5 -13 -15 -1 7 -6 -11 -11 6
7807 6 2 -3 -7 -8 20 15 2 -7 12 17 13 13 -1 5 23 15 -5 3 22 18 11 -5 0 19 12 -3 -20 -14 7 -3 -10 -25 -15 -8 -11 -12 -15 -6 6 -6 -23 -8
7849 -8 9 5 2 -7 -12 2 -7 -5 -1 -7 17 10 5 -7 17 11 5 -1 4 8 16 8 -4 -11 7 6 -1 -8 -7 2 4 -18 -21 -5 3 -9 -20 -27 -7 -1 -11 -10 -17 3 5 -2 -19
7896 -19 -15 8 -6 4 -2 4 18 14 3 -3 6 18 16 2 -1 8 12 3 -9 -3 4 8 -6 -13 -6 7 -6 -16 -7 -10 -4 -2 -16 -27 -13 -2 -9 -19 -12 0 2 -6
7938 -6 -2 5 17 21 0 -16 -1 20 4 3 -6 15 11 22 2 -6 22 20 3 -10 1 13 7 -4 -12 -1 1 2 -17 -29 -14 2 -7 -15 -16 -16 8 -12 -6
7977 -6 -4 -2 1 -12 -8 4 10 7 3 -9 5 26 15 -1 4 26 17 16 -4 11 9 16 3 -4 10 6 19 4 -9 -9 9 -9 0 -10 -8 3 -5 -11 -14 -15 -6 4
8019 4 -20 -16 -2 7 -11 -23 -14 4 13 2 -13 11 15 15 7 -4 14 26 19 -4 4 8 18 7 -1 -5 8 11 11 -11 8 11 17 0 -18 -12 3 -4 -22 -21
8059 -21 -3 3 -14 -10 -18 -1 8 -8 -15 -8 10 6 -2 -3 -3 6 18 5 1 6 15 3 2 3 11 17 9 3 -1 10 23 1 -15 -8 7 3 -12 -7 -7 -2 -2 -4 -23 -7
8103 -7 -2 -4 -24 -22 -8 6 -13 -14 -16 10 18 -8 -9 0 2 17 7 -8 5 14 16 7 8 17 23 13 -13 -9 8 19 1 -18 -9 3 4 -4 -25 -4 4 1 -11
8144 -11 -15 -5 3 4 -17 -11 -3 6 -1 -6 -6 4 15 -3 -5 3 10 12 2 1 13 27 11 2 3 2 19 12 -1 -12 2 9 0 -7 -4 4 9 -1 -23 -7 -1 2 -20
8187 -20 -17 -12 -7 -1
8191a
##END NTUPLES=NMR FID
##END=
