##TITLE=1H_AM-NV77
 
 8 sc, 
 27.10.2023
##JCAMPDX= 6.0         $$ Bruker NMR JCAMP-DX V2.0
##DATA TYPE= NMR FID
##DATA CLASS= NTUPLES
##ORIGIN= UXNMR, Bruker Analytische Messtechnik GmbH
##OWNER= root
$$ XWIN-NMR		Version 3.5
$$ Fri Oct 27 15:03:29 2023 Russian Standard Time (UT+4h)  she@DPX200
##.OBSERVE FREQUENCY= 200.13135
##.OBSERVE NUCLEUS= ^1H
##.DELAY= (6, 6)
##.ACQUISITION MODE= SIMULTANEOUS
##.ACQUISITION SCHEME= undefined
##.AVERAGES= 8
##.DIGITISER RES= 18
##SPECTROMETER/DATA SYSTEM= spect
##.PULSE SEQUENCE= zg30
##.SOLVENT NAME= D2O
##.SHIFT REFERENCE= (INTERNAL, D2O, 0, 15.7039)
##AUDIT TRAIL= $$ (NUMBER, WHEN, WHO, WHERE, WHAT)
$$ ##TITLE= Audit trail, XWIN-NMR		Version 3.5
$$ ##JCAMPDX= 5.01
$$ ##ORIGIN= Bruker BioSpin GmbH
$$ ##OWNER= she
$$ F:/spectra/data/she/nmr/H-F/1/audita.txt
$$ ##AUDIT TRAIL=  $$ (NUMBER, WHEN, WHO, WHERE, WHAT)
(   1,<2023-10-27 15:02:39.46 +0400>,<she>,<DPX200>,
      <created by zg, POWCHK disabled, PULCHK disabled
       configuration hash MD5:
       00 E9 B6 7A A2 85 ED C7 34 08 36 98 17 FE 4E 26
       data hash MD5: 16K
       27 FC A4 34 17 D3 40 BD 8D 11 AD 55 C5 9F 3C 9A>)
$$ ##END=
$$ 
$$ hash MD5
$$ D5 FE 68 B7 98 52 F6 CC 7C AA 16 60 72 2F 1F D2
##$RELAX= 
##$RELAX= 
##$RELAX= 
##$RELAX= 
##$RELAX= 
##$RELAX= 
$$ Bruker specific parameters
$$ --------------------------
##$DU= <F:/spectra>
##$EXPNO= 1
##$NAME= <H-F>
##$PROCNO= 1
##$TYPE= <nmr>
##$USER= <she>
##$AMP= (0..31)
100 100 100 100 100 100 100 100 100 100 100 100 100 100 100 100 100 100 
100 100 100 100 100 100 100 100 100 100 100 100 100 100 
##$AQSEQ= 0
##$AQ_mod= 1
##$AUNM= <au_zg>
##$AUTOPOS= <>
##$BF1= 200.13
##$BF2= 200.13
##$BF3= 200.13
##$BF4= 200.13
##$BF5= 200.13
##$BF6= 200.13
##$BF7= 200.13
##$BF8= 200.13
##$BYTORDA= 1
##$CFDGTYP= 0
##$CFRGTYP= 5
##$CHEMSTR= <none>
##$CNST= (0..31)
1 1 145 1 1 1 1 1 1 1 1 1 1 1 1 1 1 1 1 1 1 1 1 1 1 1 1 1 1 1 1 1 
##$CPDPRG= <>
##$CPDPRG1= <>
##$CPDPRG2= <>
##$CPDPRG3= <>
##$CPDPRG4= <mlev>
##$CPDPRG5= <mlev>
##$CPDPRG6= <mlev>
##$CPDPRG7= <mlev>
##$CPDPRG8= <mlev>
##$CPDPRGB= <>
##$CPDPRGT= <>
##$D= (0..31)
0 1.2 0 0 0 0 0 0 0 0.06 0 0.03 0 0 0 0 0.0002 0 0 0 0 0 0 0 0 0 0 0 0 
0 0 0 
##$DATE= 1698404558
##$DBL= (0..7)
120 120 120 120 120 120 120 120 
##$DBP= (0..7)
150 150 150 150 150 150 150 150 
##$DBP07= 0
##$DBPNAM0= <>
##$DBPNAM1= <>
##$DBPNAM2= <>
##$DBPNAM3= <>
##$DBPNAM4= <>
##$DBPNAM5= <>
##$DBPNAM6= <>
##$DBPNAM7= <>
##$DBPOAL= (0..7)
0.5 0.5 0.5 0.5 0.5 0.5 0.5 0.5 
##$DBPOFFS= (0..7)
0 0 0 0 0 0 0 0 
##$DE= 6
##$DECBNUC= <off>
##$DECIM= 32
##$DECNUC= <off>
##$DECSTAT= 4
##$DIGMOD= 1
##$DIGTYP= 9
##$DL= (0..7)
0 120 120 120 120 120 120 120 
##$DP= (0..7)
150 150 150 150 150 150 150 150 
##$DP07= 0
##$DPNAME0= <>
##$DPNAME1= <>
##$DPNAME2= <>
##$DPNAME3= <>
##$DPNAME4= <>
##$DPNAME5= <>
##$DPNAME6= <>
##$DPNAME7= <>
##$DPOAL= (0..7)
0.5 0.5 0.5 0.5 0.5 0.5 0.5 0.5 
##$DPOFFS= (0..7)
0 0 0 0 0 0 0 0 
##$DQDMODE= 0
##$DR= 18
##$DS= 0
##$DSLIST= <SSSSSSSSSSSSSSS>
##$DSPFIRM= 0
$$ [...]
##$SUBNAM2= <"">
##$SUBNAM3= <"">
##$SUBNAM4= <"">
##$SUBNAM5= <"">
##$SUBNAM6= <"">
##$SUBNAM7= <"">
##$SUBNAM8= <"">
##$SUBNAM9= <"">
##$SW= 18.05172834244
##$SWIBOX= (0..15)
0 0 2 0 0 0 0 0 0 0 0 0 0 0 0 0 
##$SW_h= 3612.71676300578
##$TD= 16384
##$TD0= 1
##$TE= 0
##$TE2= 300
##$TE3= 300
##$TEG= 300
##$TL= (0..7)
0 120 120 120 120 120 120 120 
##$TP= (0..7)
150 150 150 150 150 150 150 150 
##$TP07= 0
##$TPNAME0= <>
##$TPNAME1= <>
##$TPNAME2= <>
##$TPNAME3= <>
##$TPNAME4= <>
##$TPNAME5= <>
##$TPNAME6= <>
##$TPNAME7= <>
##$TPOAL= (0..7)
0.5 0.5 0.5 0.5 0.5 0.5 0.5 0.5 
##$TPOFFS= (0..7)
0 0 0 0 0 0 0 0 
##$TUNHIN= 0
##$TUNHOUT= 0
##$TUNXOUT= 0
##$USERA1= <user>
##$USERA2= <user>
##$USERA3= <user>
##$USERA4= <user>
##$USERA5= <user>
##$V9= 5
##$VALIST= <valist>
##$VCLIST= <CCCCCCCCCCCCCCC>
##$VD= 0
##$VDLIST= <DDDDDDDDDDDDDDD>
##$VPLIST= <PPPPPPPPPPPPPPP>
##$VTLIST= <TTTTTTTTTTTTTTT>
##$WBST= 1024
##$WBSW= 4
##$XGAIN= (0..3)
0 0 0 0 
##$XL= 0
##$YL= 0
##$YMAX_a= 511647
##$YMIN_a= -598998
##$ZGOPTNS= <>
##$ZL1= 120
##$ZL2= 120
##$ZL3= 120
##$ZL4= 120
##$ABSF1= 10
##$ABSF2= 0
##$ABSG= 5
##$ABSL= 3
##$ALPHA= 0
##$AQORDER= 0
##$ASSFAC= 0
##$ASSFACI= 0
##$ASSFACX= 0
##$ASSWID= 0
##$AUNMP= <proc_1d>
##$AZFE= 0.1
##$AZFW= 0.1
##$BCFW= 1
##$BC_mod= 2
##$BYTORDP= 1
##$COROFFS= 0
##$CY= 11.3945322036743
##$DATMOD= 1
##$DC= 2
##$DFILT= <>
##$DTYPP= 0
##$F1P= 15.7292609196834
##$F2P= 12.9074282941183
##$FCOR= 0.5
##$FTSIZE= 0
##$FT_mod= 4
##$GAMMA= 1
##$GB= 0.15
##$INTBC= 1
##$INTSCL= 1
##$ISEN= 128
##$LB= 0.24
##$LEV0= 0
##$LPBIN= 0
##$MAXI= 10000
##$MC2= 0
##$MEAN= 0
##$ME_mod= 0
##$MI= 1.114404
##$NCOEF= 0
##$NC_proc= 0
##$NLEV= 6
##$NOISF1= 3.799351
##$NOISF2= 2.8
##$NSP= 1
##$NTH_PI= 0
##$NZP= 0
##$OFFSET= 15.70392
##$PC= 1
##$PHC0= -23417.79
##$PHC1= 8.05272
##$PH_mod= 1
##$PKNL= yes
##$PPARMOD= 0
##$PSCAL= 0
##$PSIGN= 0
##$REVERSE= no
##$SF= 200.130013532006
##$SI= 16384
##$SIGF1= 3
##$SIGF2= 2
##$SINO= 400
##$SIOLD= 16384
##$SREGLST= <1H.CDCl3>
##$SSB= 0
##$STSI= 0
##$STSR= 0
##$SW_p= 3612.71676300578
##$SYMM= 0
##$S_DEV= 0
##$TDeff= 0
##$TDoff= 0
##$TI= <>
##$TILT= no
##$TM1= 0
##$TM2= 0
##$TOPLEV= 0
##$USERP1= <user>
##$USERP2= <user>
##$USERP3= <user>
##$USERP4= <user>
##$USERP5= <user>
##$WDW= 1
##$XDIM= 8192
##$YMAX_p= 0
##$YMIN_p= 0
$$ End of Bruker specific parameters
$$ ---------------------------------
##NTUPLES= NMR FID
##VAR_NAME=  TIME,          FID/REAL,        FID/IMAG
##SYMBOL=    X,             R,               I
##VAR_TYPE=  INDEPENDENT,   DEPENDENT,       DEPENDENT
##VAR_FORM=  AFFN,          ASDF,            ASDF
##VAR_DIM=   8192,          8192,            8192
##UNITS=     SECONDS,       ARBITRARY UNITS, ARBITRARY UNITS
##FACTOR=    0.0002768,     1,               1
##FIRST=     0,             0,               0
##LAST=      2.2672688,     0,               0
##MIN=       0,             -598998,         0
##MAX=       2.2672688,     511647,          0
$$ Real data points
##PAGE= N=1
##DATA TABLE= (X++(R..R)), XYDATA
0@%%%%%%%Qj5J4j5J6k4L2m0N4o2P2q8J12j38J62j92K29k71L16l66M26m94N67o48
$$ 0 0 0 0 0 0 0 0 8 -7 7 -8 8 -16 16 -24 30 -32 40 -48 64 -74 88 -104 125 -146 170 -196 230 -264 303 -345
31c45P39q44R58j081J218j373J542j723J921k143K387k648K933l248L592l967
$$ -345 394 -450 508 -573 645 -728 814 -909 1012 -1131 1256 -1392 1541 -1707 1885 -2082
47b082M376m821N314n856O449p105P836q653R567j0602J1785j3154J4752j6647
$$ -2082 2294 -2527 2787 -3069 3380 -3725 4111 -4542 5025 -5577 6208 -6946 7806 -8841
61h841J8947k1802K5452l0305L7121m7452O5110j03162L21470l35674n19862Q56810
$$ -8841 10106 -11696 13756 -16549 20572 -26880 38230 -64932 256538 -79136 -598998 257812
73B57812J94882p17615j83509Q18667L744p90107J09031P61837k40057o78797
$$ 257812 452694 -264921 -448430 370237 373981 -416126 -307095 454742 214685 -464112
83d64112L16825O58149m74832n36557N46702M24192n79060l31640O08392K54498
$$ -464112 -147287 510862 36030 -500527 46175 470367 -108693 -440333 168059 422557
93D22557o80766j05560O83763k0896o58364J21766O25331k17478n81827L21919
$$ 422557 -258209 -363769 319994 299098 -359266 -237500 387831 170353 -411474 -89555
103h9555N04084l91685m43046M63188L72873n33118k66469N68367J48889n67757
$$ -89555 414529 22844 -420202 42986 415859 -117259 -383728 184639 333528 -234229
113b34229o0301N75608k9199n71793J26669N36761k13755m91910K97178M40298
$$ -234229 -294530 281078 251879 -319914 -193245 343516 129761 -362149 -64971 375327
123C75327l79853l59150M29450K70591m50037j99879M77917J23131n03275k6878
$$ 375327 -4526 -363676 65774 336365 -113672 -313551 164366 287497 -215778 -242656
133b42656M94032n7780m70200J30916M48341k13565m00783K82022L30000l16126
$$ -242656 251376 193596 -276604 -145688 302653 89088 -311695 -29673 300327 -15799
143a5799k76834L52892K27844m02097j49025M21072O6432m11147p217M13526o0400
$$ -15799 -292633 60259 288103 -113994 -263019 158053 224485 -186662 -193879 219647 159247
154A59247m11338J43653L71785k03357l22721K41779K89487k94742k39915L44430
$$ 159247 -252091 -108438 263347 59990 -262731 -20952 268535 -26207 -266122 78308
164G8308J64511l58942j01044L62831M9618l75790J9789L68801r0941l37752J39565
$$ 78308 242819 -116123 -217167 145664 195282 -180508 -160719 208082 117141 -220611 -81046
175h1046L11314j85077k83625K38823K31406k74877j73541K92133J28163l10484
$$ -81046 230268 45191 -238434 389 231795 -43082 -216623 75510 203673 -106811
185a06811p8162L23803J5487l16682L9858L03016q7385k89537J38721K59935j82507
$$ -106811 -184973 138830 154317 -162365 -122507 180509 93124 -196413 -57692 202243 19736
196A9736k18469K12280J82166k41373j43140K67987R1660k78385m0132K78520
$$ 19736 -198733 13547 195713 -45660 -188800 79187 170847 -107538 -147670 130850
206A30850o324k76402N4141K64152r8690k41892J35867K18342j73393j88771K09210
$$ 130850 124526 -151876 -97735 166417 67727 -174165 -38298 180044 6651 -182120 27090
217B7090J46962k30486j03446K40363O4841k51179k0271K54652k7803k42998O6347
$$ 27090 174052 -56434 -159880 80483 145324 -105855 -126126 128526 100723 -142275 -75928
228g5928K27702j01785k09775J40747J79158j70194j43809J85939J15979k03043
$$ -75928 151774 49989 -159786 -19039 160119 -10075 -153884 32055 148034 -55009
238e5009q3806K20225L8698k22467L153K15251l4530k10078O8893J97723j05935
$$ -55009 -138815 81410 120108 -102359 -99206 116045 81515 -128563 -59670 138053 32118
249C2118j72657J33774J47205j55861j23530J78247R0256j90995n2386J92407
$$ 32118 -140539 -6765 140440 -15421 -138951 39296 129552 -61443 -113829 78578
259G8578K2069j96028Q238J99066m5037j88800P8635J69047j04789j50128J30992
$$ 78578 100647 -95381 -87143 111923 66886 -121914 -43279 125768 20979 -129149 1843
270A843J27168j53289r7756J64742P0038j73335m1751J82972N929j82426K8132
$$ 1843 129011 -24278 -122034 42708 112746 -60589 -102340 80632 86561 -95865 -67733
281f7733J70979n2508j59668P6276J47380j03769j26829J25319J03287j39625
$$ -67733 103246 50738 -108930 -32654 114726 10957 -115872 9447 112734 -26891
291b6891q0954J53315N2729j61558k0628J60279n681j57441K9434J53987n7308
$$ -26891 -107845 45470 98199 -63359 -83987 76292 70611 -86830 -57396 96591 39283
302C9283j41576Q2540J23096j00831j06097J18220Q6561j33393o1441J40749L7274
$$ 39283 -102293 -19753 103343 2512 -103585 14635 101196 -32197 -93638 47111 84385
313H4385j45009j4030J49417j3951j46084M0939J34271o0477j22978P9451J10984
$$ 84385 -60624 -74654 74763 60812 -85272 -44333 89938 29461 -93517 -14066 96918
324I6918j00898r1071J15587O9006j23454m9740J31883K6704j36936l1J33047
$$ 96918 -3980 -95051 20536 89542 -33912 -83652 48231 74935 -62001 -62032 71015
335G1015k1607j26717L9898J21568o2040j10052Q2543R1852r5122p5460J06013
$$ 71015 49408 -77309 -37411 84157 22117 -87935 -5392 86460 -8662 -84122 21891
346B1891N8767j17416l6343J22125J3966j20925M293J20499k4512j16977M6522
$$ 21891 80658 -36758 -73101 49024 62990 -57935 -53642 66857 42345 -74632 -28110
357b8110J06258o3542r3877P7161Q2170r2273o5231J03878M4462j08273k6694
$$ -28110 78148 14606 -79271 -2110 80060 -12213 -77444 26434 70896 -37377 -64071
368f4071J11291R480j14070J1466J10742l1092j02905M6734R5413o3021q4807
$$ -64071 47220 56700 -57370 -45904 64838 33746 -69159 -22425 72988 9967 -74840
379g4840P8504O8993q8430n2714R4983L7783j02040j9915J05637M29j03499J6721
$$ -74840 3664 72657 -15773 -68487 26496 64279 -37761 -57676 47961 48390 -55109 -38388
391c8388R9110l2646r3743M9465Q4288o3876p1724P4074N9338q3528m5040R1511
$$ -38388 60722 28076 -65667 -16202 68086 4210 -67514 6560 65898 -17630 -62670 28841
403B8841K8250r5641j1275R5991m317r4416K0126R0169l5722q3105M9672P3951
$$ 28841 57091 -38550 -49825 46166 41849 -52567 -32441 57728 22006 -61099 -11427 62524
415F2524o1753o2940P1804N0096p9533l6045Q5223K0977q8278n714Q8333q898
$$ 62524 771 -62169 9635 59731 -19802 -55847 29376 50353 -37925 -43639 44694 35796
427C5796q5983K3108Q1851l7852p4200N0450O4376n9852n4330O8194M3164p5920
$$ 35796 -50187 -27079 54772 16920 -57280 -6830 57546 -2306 -56636 11558 54722 -21198
439b1198k9170Q0557J4428q1726j209Q1613j2408p9585K7127P3101l9050o5340
$$ -21198 -50368 30189 44617 -37109 -38318 43295 30887 -48698 -21571 51530 12480 -52860
451e2860M8564N7966n8378m8310O7574L4965p2401k1753P4279R931p5788K789
$$ -52860 -4296 53670 -4708 -53018 14556 49521 -22880 -44633 29646 39577 -36211 -33422
463c3422P5446j6355p1234K7842O5639l8213n9518M8911N0636n7859l9296O3095
$$ -33422 42024 25669 -45565 -17723 47916 9703 -49815 -904 49732 -8127 -47423 15672
475A5672K8277o6359j7948O9642N983p1006P182O8639j8639o4514K8703N9671
$$ 15672 43949 -22410 -40358 29284 35267 -35739 -28557 40082 21443 -43071 -14368 45303
487D5303l8966n2700M8352M3462n4885l4060O0098K4009o4308j2502O6135M58
$$ 45303 6337 -46363 1989 45451 -9434 -43494 16604 40613 -23695 -36197 29938 30396
499C0396o5122J0536O2440k0142n9282L0106N4040m0010m5877M7478L6995n2606
$$ 30396 -34726 -24190 38250 18108 -41174 -11068 42972 2962 -42915 4563 41558 -11048
511a1048k8670N7115J8963o0165p764O0642k766n9480J2161N7605k2068n3301
$$ -11048 -39718 17397 36360 -23805 -31569 29073 26307 -33173 -21012 36593 14525 -38776
523c8776L1573M6549l8891l9526M4604L2827n0370k3975N4432J3697n5800m196
$$ -38776 -7203 39346 455 -39071 5533 38360 -12010 -35985 18447 32144 -23656 -27852
535b7852N5963m821n5260J4360N2399k3530m7443L1082M1930l7817l5664M3951
$$ -27852 28111 23290 -31970 -17610 34789 11259 -36184 -5102 36828 -989 -36653 7298
547G298K7849m8438j9114N0960J0361n2227j582N2393p356n0913J6068M7422k3924
$$ 7298 35147 -13291 -32405 18555 28916 -23311 -24893 27500 20144 -30769 -14701 32721 8797
560H797m2536L0683L7235l6836l1119M2087K3485m5451j5227M7351P230m8601
$$ 8797 -33739 -3056 34179 -2657 -33776 8311 31796 -13655 -28882 18469 25699 -22902
572b2902J039M8318r480m5662J6966M1953k3546l8254L0237L3195l6033k6324
$$ -22902 -21863 26455 16975 -28687 -11721 30232 6686 -31568 -1331 31864 -4169 -30493
584c0493L9769J9183m2487j2076M4790M083m5227L934M3589j0855m1392J7512
$$ -30493 9276 28459 -14028 -26104 18686 22769 -22458 -18524 25065 14210 -27182 -9670
596i670L8611k4448l4051L0284K8277l4496k2392L7972J5913m0616q525M1654
$$ -9670 28941 4493 -29558 726 29003 -5493 -27885 10087 26000 -14616 -23141 18513
608A8513J242m1357N479M0221j2201l7880J8857L4084k4487k9649K9151K4694
$$ 18513 19755 -21602 -16123 24098 11897 -25983 -7126 26958 2471 -27178 1973 26667
620B6667l3089j8862L6083J2303l7846n697L8479p39l8055P230L6385j3417l3697
$$ 26667 -6422 -25284 10799 23102 -14744 -20441 18038 17299 -20756 -13526 22859 9442 -24255
633b4255J8905L0332k3819k6204K8253K1017l1662j5238L3824R451l5090l464
$$ -24255 -5350 24982 1163 -25041 3212 24229 -7433 -22671 11153 20604 -14486 -17950
645a7950L5348k640l4517Q461L2822j3875l0328J8997K6785k3478k2401K7036
$$ -17950 17398 14758 -19759 -11298 21524 7649 -22679 -3682 23103 -375 -22776 4260
657D260J7693k9923j2454L1877O789l2627j235L2552m256l1716R819K9671j4806
$$ 4260 21953 -7970 -20424 11453 18242 -14385 -15620 16932 12676 -19040 -9221 20450 5644
670E644k6749J8965K3524k2910j9561K6489J4463k8633r296K9628M457l0218P58
$$ 5644 -21105 -2140 21384 -1526 -21087 5402 19865 -8768 -18064 11564 16021 -14197 -13439
683a3439K9936o185k8339J0743K6334j4893k3914J9121K0314k2628j5864K4850
$$ -13439 16497 10312 -18027 -7284 19050 4157 -19757 -636 19678 -2950 -18814 6036
695F036J1531k6483p087K7649K100k7618K694K6709p003k5454J1278K3597j5560
$$ 6036 17567 -8916 -16003 11646 13746 -13872 -11178 15531 8528 -16926 -5648 17949 2389
708B389k0574J9052J6965k1707j3211K3940Q949k5355m380K5733M1k5531M162
$$ 2389 -18185 867 17832 -3875 -17086 6854 15803 -9552 -13932 11801 11842 -13689 -9527
721i527K4850q483k3363J2695K0809j6170j7771J8991J4486k1430j0602K3059
$$ -9527 15323 6840 -16523 -3828 16981 811 -16960 2031 16517 -4913 -15515 7544
733G544O373k3692k440K3958j565k3586N597K2413r437k0479J2803J8158j5851
$$ 7544 13917 -9775 -12215 11743 10178 -13408 -7811 14602 5165 -15314 -2511 15647 -204
746b04j5247J8364J1769j9994q254K1119M684k1836r11K1894k850k1325O509K0177
$$ -204 -15451 2913 14682 -5312 -13566 7553 12237 -9599 -10510 11384 8534 -12791 -6282 13895
760A3895j0126j8279J3366J5658j5849j2851J7915R780j9578o317K0544K722k0856
$$ 13895 3769 -14510 -1144 14514 -1335 -14186 3729 13509 -6069 -12386 8158 10880 -9976
773i976P51K0832m443k0029Q091J8300j1179j6144J3787J3794j6205j0791J7872
$$ -9976 -9225 11607 7164 -12865 -4774 13526 2347 -13797 -10 13784 -2421 -13212 4660
786D660P487j8686m437J9336J176j9523K291J8840n475j7572Q246J6159j1059
$$ 4660 12147 -6539 -10976 8360 9536 -9987 -7696 11144 5669 -11903 -3657 12502 1443
799A443j4120J3508J1442j5143q791J6418O059j7521k920J8000l56j7652L234
$$ 1443 -12677 831 12273 -2870 -11661 4757 10816 -6705 -9625 8375 8019 -9633 -6399
812f399J7056o078j6098R016J4396j1483j2315J3482J0077j5329p341J6626M314
$$ -6399 10657 4579 -11519 -2503 11893 410 -11905 1577 11654 -3675 -11016 5610 9924
825I924j7224j273J7253j613j6917M544J5993p273j4508R553J2819j1620j0846
$$ 9924 -7300 -8573 8680 7067 -9850 -5306 10687 3414 -11094 -1541 11278 -342 -11188
838a1188J3482Q436j4848n741J5552L035j5855l67J5828k429j5117M954J4057
$$ -11188 2294 10730 -4118 -9859 5693 8728 -7127 -7494 8334 5905 -9212 -4258 9799
851I799p181j2822R301J1184j1184r142J2658O925j3770m539J4600J870j4864
$$ 9799 2618 -10204 -903 10281 -903 -10045 2613 9538 -4232 -8771 5829 7699 -7165
864g165P15J4671l253j4026N678J3075p999j1609R955R794j1548p819J2940N514
$$ -7165 -6450 8221 4968 -9058 -3380 9695 1696 -9913 42 9836 -1712 -9531 3409 8923
878H923j3881l038J4302N53j4255J808J3967m327j3048O475J1818q371j0261J0048
$$ 8923 -4958 -7996 6306 6859 -7396 -5588 8379 4052 -8996 -2521 9297 926 -9335 713
892G13Q405j1395o348J2298M220j2772k144J3070j51j2951K427J2395m439j1586
$$ 713 9118 -2277 -8625 3673 7893 -4879 -7023 6047 5896 -7055 -4628 7767 3328 -8258
906h258O392J0435q236q867R680P128j0757n324J1640L363j2336j084J2398j022
$$ -8258 -1866 8569 333 -8534 1146 8274 -2483 -7807 3833 7196 -5140 -6224 6174 5152
920E152j2172L050J1720n163j0800P173R379q648p865R846O200j0983m182J1629
$$ 5152 -7020 -3970 7750 2587 -8213 -1040 8339 -309 -8174 1672 7872 -3111 -7293 4336
934D336K120j1799k06J1730j769j1345L704J0647n528r491O966Q250q278o844
$$ 4336 6456 -5343 -5549 6181 4412 -6933 -3229 7418 1890 -7601 -635 7615 -663 -7507
948g507R439N102j0078l399J0580J540j0737K01J0737k153j0104L718R502n373
$$ -7507 1932 7034 -3044 -6443 4137 5677 -5060 -4859 5878 3725 -6379 -2661 6841 1468
962A468q551O888P293q060n896Q973M343r744k613J0202Q06j0234R58R988k690
$$ 1468 -7083 -195 7098 -962 -6858 2115 6458 -3286 -5899 4303 5109 -5125 -4167 5821 3131
977C131r495M285Q783n833p671P082O372q057m988Q878L435r400j811R565J55
$$ 3131 -6364 -2079 6704 871 -6800 282 6654 -1403 -6391 2487 5922 -3478 -5289 4276 4431
992D431r431J422R130k936q510M292P727n595o722O717N528p538m177Q126K714
$$ 4431 -5000 -3578 5552 2616 -5894 -1602 6125 530 -6192 525 6053 -1485 -5662 2464 5178
1007E178q484j263Q685k36q584J642Q242l043p633M315O915n520n995O561M761
$$ 5178 -3306 -4569 4116 3880 -4704 -3062 5180 2137 -5496 -1181 5734 214 -5781 780 5541
1022E541p321l407P830K091q154o81Q172p37p916K023P584l325o994M517O090
$$ 5541 -1780 -5187 2643 4734 -3420 -4101 4071 3334 -4582 -2559 5025 1700 -5294 -777 5313
1037E313n474n093O287M014o934k809P362J506p516j99P463j083p185K176O853
$$ 5313 -161 -5254 1033 5047 -1887 -4696 2666 4172 -3344 -3543 3920 2837 -4348 -2172 4681
1052D681l390o109M374N309n241m453N976L393o482k202O801R85o912J65O839
$$ 4681 1291 -4818 -444 4865 -376 -4829 1147 4540 -1942 -4144 2657 3642 -3270 -3105 3734
1067C734j329o584K522O043l543n397M426M623n173l640N743K618o170j592O453
$$ 3734 2405 -4179 -1657 4386 843 -4554 -128 4495 -678 -4318 1425 4043 -2127 -3719 2734
1082B734M74o451P08O195j759n832K662N424l611m700M350L979n063l048N519
$$ 2734 3208 -3243 -2535 3660 1901 -3931 -1269 4155 544 -4156 194 4173 -890 -3938 1581
1097A581K059n892r94N971l3n848J003N746k059n392L005M778l700m165M459L286
$$ 1581 3640 -2252 -3246 2725 2692 -3156 -2153 3593 1534 -3858 -853 3925 225 -3940 519 3805
1113C805n001k410N434J397n521n67N598l65n539J445N136k254m774L062M254
$$ 3805 -1196 -3606 1828 3225 -2296 -2863 2735 2370 -3169 -1724 3412 1158 -3616 -554 3700
1128C700l750l597M371K794m830j949N185J088n315j66N205p05n103J555M859
$$ 3700 -50 -3647 724 3518 -1312 -3261 1924 3012 -2303 -2469 2736 2031 -3072 -1517 3342
1143C342k388m368L098L837l855l139M411K345m743j544N041O10n124K06N088
$$ 3342 954 -3414 -316 3521 -334 -3473 938 3283 -1460 -3004 2037 2647 -2477 -2271 2817
1158B817j094m797J935M466k754l983L412L338l903k712M442J925m733j196M974
$$ 2817 1723 -3074 -1139 3327 573 -3410 2 3340 -563 -3275 1167 3092 -1641 -2837 2137
1173B137K56m876N03M850j398m572K180M143k801l591L246L029l771k398M244
$$ 2137 2393 -2483 -1980 2870 1472 -3100 -920 3223 422 -3169 77 3106 -665 -3063 1181
1188A181J642m453r31M624J00m643P62M425j446m219K155L849k879l368L523K681
$$ 1181 2823 -1630 -2561 2063 2163 -2480 -1718 2707 1261 -2958 -803 3046 167 -3201 322 3003
1204C003l877k006M176J372m462o12M637k65m480R70M366j760m015K447L492k908
$$ 3003 -874 -2880 1296 2668 -1794 -2406 2231 1966 -2514 -1544 2822 1062 -2953 -506 2986 78
1220G8k981L398K387l840j759M121J040m217l56M230l81m102J064L820j571l680
$$ 78 -2903 495 2882 -958 -2717 1404 2444 -1773 -2129 2101 1720 -2382 -1318 2502 931 -2749
1236b749K222L303k858k632L242K149l538j577L814Q21l934k18M100n87l922J262
$$ -2749 -527 2776 -82 -2714 528 2677 -861 -2438 1376 2197 -1737 -1955 2145 1558 -2364 -1102
1252a102L678j920l267K416K910k999k372L325J882l701j100L888L22l870K54
$$ -1102 2576 656 -2611 -195 2715 -284 -2656 669 2551 -1150 -2250 1638 1960 -1910 -1656
1267a656L695p50l635J473L315j978l011K479K539k836j938L034J601l504r47
$$ -1656 2039 1289 -2346 -873 2442 464 -2547 -68 2471 -365 -2303 731 2332 -1172 -2119
1282b119L660K17l461J63L440p76l260J368L023j972k632K402K188k642j746L003
$$ -2119 1541 1758 -1703 -1540 1900 1124 -2136 -768 2255 283 -2349 53 2241 -401 -2147 856
1298H56J133l106p70L362J17l344M59L310j140l076J676K736k054k371K443J913
$$ 856 1989 -1117 -1887 1475 1592 -1752 -1293 2017 877 -2199 -523 2213 159 -2212 231 2144
1314B144k812j326L111P09l149k92L102j81l054P84K885j306k623J611K363j963
$$ 2144 -668 -1994 1117 1826 -1323 -1615 1487 1306 -1748 -964 1921 615 -2008 -397 1966 3
1330Ck011K399J545k596j000K657O76k894j61K926m68k757Q80K574j261k386J618
$$ 3 -2008 391 1936 -660 -1660 997 1673 -1221 -1382 1544 1076 -1681 -801 1773 512 -1874 -256
1347b56K071j923j813K332J359k560p86K618L18k679J53K686o30k589J113K313
$$ -256 1815 -108 -1921 411 1770 -790 -1576 1042 1360 -1319 -1166 1520 890 -1699 -586 1727
1363A727j443k095J857J756k155j478K456Q87k401n34K570N1k530K81K665q87
$$ 1727 284 -1811 46 1802 -353 -1831 625 1512 -889 -1423 1147 1198 -1332 -1051 1614 727
1379G27k378J181K117j469j829J757J531k080j121K174Q61k327n05K502p2k395
$$ 727 -1651 -470 1647 178 -1651 106 1637 -443 -1564 610 1471 -856 -1361 1141 1069 -1326
1395a326M59K302q13k137J116K005j547j694J894J360k184r13K297M58k327j53
$$ -1326 -867 1435 622 -1515 -399 1606 59 -1635 259 1619 -565 -1478 819 1277 -1050 -1203
1411a203K435k98k310O38K221j017k127J553J605j585j471J885J150k117q48K259
$$ -1203 1232 934 -1376 -738 1483 466 -1661 -108 1497 -88 -1559 326 1476 -641 -1489 770
1427G70L61k253P7K309l66k343R09J964j217j667J423J594j725j321J835J007
$$ 770 1131 -1122 -1045 1264 898 -1445 -536 1428 211 -1456 -33 1561 -164 -1485 350 1357
1443A357k027o15K189J53k124K04K075n66j924P86J882j181j687J491J395j698
$$ 1357 -670 -1285 904 1057 -1067 -863 1212 646 -1278 -492 1390 209 -1478 13 1408 -290
1459b90j030J792P96j967l69K013n8k007L55J960n33k017J033J687j312j361J394
$$ -290 -1320 472 1268 -699 -1068 945 887 -1120 -765 1195 662 -1355 -322 1365 53 -1308 86
1476H6J391j792j015J852O29j977j92K022j07j990M13J960q31j728J017J470j169
$$ 86 1477 -315 -1330 522 1151 -826 -1018 1004 897 -1093 -680 1280 449 -1279 -262 1208 39
1493C9j398J584J019j653q17J940L42j851j01J749j39j781M79J818q42j594J107
$$ 39 -1359 225 1244 -409 -1226 714 1056 -795 -896 853 714 -1067 -588 1230 388 -1206 -99
1510i9J508j517j117J663P55j636o50J641M30j750l0J781l13j715N54J669r45
$$ -99 1409 -108 -1225 438 1193 -443 -1093 548 978 -772 -802 979 666 -1049 -495 1174 229
1527B29j323J125J139j236j072J607N97j712l40J626J77j742L00J602n50j464
$$ 229 -1094 31 1170 -66 -1138 469 1066 -646 -986 640 817 -925 -625 977 427 -1037
1543a037O03J571r76j335J256J032j358q09J469N29j585k48J709q4j616K32J728
$$ -1037 -434 1137 161 -1174 82 1114 -244 -1053 416 945 -640 -888 821 737 -879 -647 1081
1560A081n62j603R79J095q36j206J189Q98j409o65J494M03j467j59J554p2j581
$$ 1081 519 -1084 -105 990 154 -1052 137 1035 -374 -1039 455 858 -609 -768 786 714 -867
1577h67N09J433p75j275P00J309j174r07J243P70j485m63J613J62j500oJ619l24
$$ -867 -358 1075 300 -975 -275 1034 -140 -1047 196 966 -519 -982 631 793 -707 -713 906 582
1595E82j462N36J287p37j140R31J036j177q21J319N91j333m87J394K88j422j37
$$ 582 -880 -344 943 206 -934 -3 1033 -144 -965 354 945 -388 -875 519 807 -615 -752
1612g52J571k58j514O96J191p44j125Q97R29j018q96J281O34j366l98J450J62
$$ -752 819 561 -953 -257 934 190 -935 -38 891 -127 -1023 258 892 -474 -872 578 740
1629G40j526K10J306l41j289O62J186r23j027J085R19j294n89J221M95j319k75
$$ 740 -786 -576 730 389 -900 -238 948 25 -1002 83 1002 -292 -881 340 835 -484 -759
1646g59J436o9j372L60J337n57j240O36J144p81j038R62Q57j158o80J292M83j400
$$ -759 677 608 -764 -404 933 376 -864 -228 916 135 -903 59 916 -242 -922 370 853 -547
1664e47j45J275m6j293K90J234m74j168O47J079q15r17R74Q31j142o12J256L13
$$ -547 -692 583 537 -756 -466 768 294 -874 -227 852 37 -880 94 925 -217 -829 427 740
1682G40j254j31J341j65j314L28J332n44j258P29J114r78r15J171O63j174m98
$$ 740 -514 -645 696 531 -783 -455 877 333 -925 -196 918 -60 -975 196 859 -315 -813
1699h13J280L03j321j43J436k08j295L58J181n89j105P54J031r15q10R38P66j187
$$ -813 467 770 -551 -694 742 534 -761 -403 778 189 -916 -162 869 -46 -856 82 848 -339
1717c39m13J250J88j271m7J258j13j162K47J142m95j084O80J061r21q14J053O39
$$ -339 -752 498 686 -585 -632 626 513 -649 -402 740 245 -839 -159 902 -19 -833 220 859
1735H59j186m21J261J63j242pJ239j44j283M46J165o94r96P97Q64r46p87J079
$$ 859 -327 -748 513 676 -566 -573 666 522 -761 -315 850 156 -840 -43 821 -125 -912 167
1753A67O16j126l85J157J50j180m1J293j64j253M37J135o01r55O07R89q94p75
$$ 167 783 -343 -728 429 579 -601 -642 651 487 -766 -329 806 205 -750 -143 846 -48 -823
1771h23J015O09j076m19J151J42j118n7J132p2j217M18J035n22j025P60R28j018
$$ -823 192 801 -275 -694 457 599 -519 -576 556 484 -733 -315 720 198 -827 -67 861 -157
1789a57o59J049M71j094l10J205J03j258O9J215k54j091M60R58n52q91P29P42
$$ -157 -816 233 704 -390 -700 505 608 -650 -581 634 380 -711 -251 707 155 -736 -7 735
1807G35q24o71R32N50j008l47J071J12j119Q8J132k75j041M33R58n64r01P31Q02
$$ 735 -89 -760 172 722 -286 -633 438 550 -569 -481 651 376 -665 -232 726 162 -739 -8 794
1826G94r17o26R82L93j041k04J028Q3j026Q3J066k75j072N17R13o43p71O91P17
$$ 794 -123 -749 233 626 -415 -619 409 492 -534 -451 615 340 -732 -215 698 55 -716 -25 692
1845F92q82n36J029L08r60j91J000K8j004J37J026l68r23M10R19o60p10P60O73
$$ 692 -190 -726 303 611 -349 -540 460 488 -516 -379 647 279 -644 -234 685 25 -685 75 748
1864G48q81n41R98K68r71k06J091j1j045J61R65k75j006M65R40o98p06Q07N46
$$ 748 -133 -674 324 592 -379 -585 506 495 -550 -389 576 301 -705 -240 700 2 -704 103 649
1883F49q54l75Q16L27r29j22R22p7q43J32R80l98q09N44P57p26o55P51N14q24
$$ 649 -205 -580 236 563 -366 -488 434 357 -486 -354 626 228 -581 -37 720 -6 -661 90 604 -220
1903b20l98R44K32r86l2R66q4j020K65R32l83q26N35P74p06o93Q20M89q12m38
$$ -220 -618 326 558 -428 -460 506 422 -598 -333 599 216 -610 -75 699 -7 -700 120 609 -203 -641
1923f41R69J68r19p3R68o6r51K56R35m93p68N08P48o64o00P79M62q17l23Q99J14
$$ -641 328 496 -423 -496 472 406 -545 -289 646 153 -615 -107 641 -23 -623 156 618 -199 -522 377 491
1944D91q90j23J052j90q85L56P67m16p62N50O75o65n28P56L91p90l77R25J25q96
$$ 491 -399 -522 530 340 -545 -189 578 162 -600 -50 625 -40 -568 188 579 -211 -588 337 462 -434
1964d34PQ49j17q30K83P86l90p54N60O28o36n07O51M99q86k26Q43O4q24N2Q13
$$ -434 -427 422 305 -525 -242 544 154 -600 -40 588 -48 -555 96 595 -291 -517 326 390 -434 -382 431
1985D31r9p99K43P56m30o24N45N16o19m54O67L89p43k43P86M7p93J7Q06j62o94
$$ 431 332 -467 -224 532 102 -522 23 539 -80 -534 133 522 -221 -464 322 369 -424 -407 399 237 -457
2006d57L71O36m19o15M43N30n76m29O35L82p61j25O98j4o74J11O65j23p32L55
$$ -457 -86 550 131 -484 -41 489 -87 -516 119 501 -260 -385 313 299 -375 -264 401 278 -454 -99
2026i9N63l77n31N00M23n23l68N63L14p29j17O40L7o69J37N61j10n97K53N33l13
$$ -99 464 87 -444 56 479 -44 -412 151 465 -264 -381 259 296 -373 -236 325 215 -382 -129 404 91
2047I1n12M62L78n87k81O07K03o11j47O35L0o27J34N51j84n04K42N35l87m54M81
$$ 91 -421 41 419 -168 -449 158 361 -250 -397 238 268 -359 -225 326 142 -362 -120 415 28 -426 55
2068E5K79m42k26N23J80o10j2M34Rm85J23N00k40m03L05L36l02m12M29K94m78
$$ 55 334 -108 -334 189 369 -241 -253 181 190 -295 -172 328 88 -315 -10 326 24 -388 41 335 -143
2089a43j48L66J40m56k8N74j24n60K87M19k81l74L24L00l22k91M56K01m99j18
$$ -143 -291 75 215 -241 -269 305 181 -379 -92 327 46 -328 -4 296 -26 -317 139 340 -159 -277
2109b77M99Mn19J63M00j31m45K10L72k17l45K79L50m08k71M18J72m30m6M25K1
$$ -277 222 226 -293 -130 270 139 -306 -96 276 59 -286 -7 343 -65 -336 82 254 -176 -222 203 224
2130B24m80R8L84j28m48K74L57k77k55K97K84m29k13M34J43m71o8N05q4m05J07
$$ 224 -256 -158 226 98 -350 -76 281 4 -251 46 330 -99 -312 122 265 -206 -274 231 147 -258 -151
2151a51M41j84l54K08L44l13k62L57K24m15j57L81Q4m02QM36p1m23J31L59j98
$$ -151 290 106 -248 -40 304 -9 -271 86 310 -105 -262 119 203 -199 -191 245 174 -249 -118 241 43
2172D3l12K38K97k88k25L22J50l35j41M29J0m06K0M38j19m16K04L29k04k72K46
$$ 43 -269 -31 266 -22 -247 75 225 -110 -251 178 188 -218 -198 240 121 -295 -91 238 34 -238 8
2193HK44k69k02L37Q0k77j49M14K9m09N1L52q0l09J27L47k82k47K54J64k24j45
$$ 8 252 -17 -219 118 198 -79 -228 186 215 -194 -143 209 129 -180 -53 294 12 -235 19 183 -41 -186
2215a86K31J22k79p5K79P6l28oL25r0l03J89K77k04k53K04K74l62j33L03K35l46
$$ -186 45 167 -112 -187 92 168 -160 -166 159 69 -234 -45 232 28 -225 -21 253 -109 -242 61 296 -50
2237e0j32L10Kk77J1K90m6l21J66K64j37k68J99J98k82r7K65R2k38j44L16l0k17
$$ -50 -182 128 130 -147 -136 154 108 -213 -47 217 80 -188 11 209 -73 -170 95 187 -51 -195 121 91 -126
2260a26m2L21o1k47O0K35j08k59K20J83k21j19K17P8k08j01L24L0l22P3K13o0
$$ -126 -168 153 92 -155 -95 140 32 -227 -7 176 -45 -164 53 131 -77 -178 146 176 -146 -73 140 80
2282H0k02M3K74j48j89J35J55j66j53J91K2p1j04J72mj59P1J22pj92L3J39q0q7
$$ 80 -122 -79 195 47 -142 -7 148 -18 -171 20 42 -29 -133 39 35 -124 -53 69 62 -130 -97 42 -38 -125
2306a25J83R0k33rJ63R4k02j28K52K6k25O1J84J9k75Q4J14k4j79J56J22j38j53
$$ -125 58 148 -85 -94 69 163 -39 -167 85 111 -114 -53 131 150 -125 -41 73 49 -130 26 148 10 -143
2329a43J46J08m3j56J80K5k00j0J88m7j74M0J92mk11J25M7n8j52J67J8o4n9J65
$$ -143 3 111 68 -88 92 117 -83 -93 95 48 -126 -86 106 102 -109 16 63 5 -147 20 38 -26 -85 80
2353H0k6q4j3J56o9k10J04K79j72j63J31O8j43n2O9J26r5j58K51J13k76j1J48
$$ 80 54 -30 -43 113 44 -166 -62 217 45 -118 13 81 -62 -114 -45 81 -14 -172 79 192 -84 -95 53
2376E3M7j91N5J43M4k82R4J24J5l14J84J26j30p6J07J55k71O4J69kk73N7J37O6
$$ 53 100 -91 -36 107 151 -131 -37 87 102 -212 -28 98 -32 -108 -1 154 -117 -53 116 114 -159 -102 35 101
2400A01k94J46J90j09k21K18O4r3k5P9Q2j29r9J62J94l73M6J87M4l93L5M28r9
$$ 101 -193 -47 143 34 -187 31 95 2 -23 56 138 9 -90 72 266 -107 -61 126 170 -223 -188 240 141
2423A41l31J48J98k00j01R1K21k12j19K91Lk39j0J79N3l43J90K17q9k41N6L49
$$ 141 -190 -42 156 -44 -145 -54 167 -45 -164 127 130 -109 -119 60 113 -230 -40 177 88 -153 -97 252
2445B52k10k19K77N7j95j27K99N1l06k9K76Q3l28l3L46j51k83K25K35l42m0J39
$$ 252 42 -177 100 157 -38 -165 134 185 -121 -150 126 209 -119 -152 194 43 -240 -15 220 -122 -162 -23
2467b3K23k35k12L76J55m54NL11N0m15J81K03j33k29J97K20j62k79K44K28k70
$$ -23 200 -35 -247 129 284 -170 -165 146 196 -219 -38 165 32 -197 0 220 58 -221 23 251 -19
2488a9k00L23R1l21k1L50J7l94R1L22j71k53J06L28k19k66J75K72l16p4K86L9
$$ -19 -219 104 195 -126 -147 203 220 -174 -83 239 68 -185 -79 249 30 -236 -61 211 -105 -179 107 146
2510A46k64r6L76ll89jL94q9l99K41L37k36l30K92M19m71k41M88J7l42n6M28l1
$$ 146 -118 -214 162 159 -230 -231 163 74 -325 -84 253 17 -313 -21 398 -73 -314 174 191 -151 -207 221 190
2533A90m37J05M20k05l49K57L25k39l38K91J91l74j33N09L3m37q3M58L0m90J70
$$ 190 -247 -142 278 73 -276 -19 306 67 -271 20 211 -163 -296 213 246 -191 -274 184 214 -276 -106
2554a06L08j15m30K89K77k12l28L40K35l31j94M55N3l98l0M30j27l71J32M03k91
$$ -106 202 87 -343 -54 223 11 -317 23 258 -73 -267 188 241 -157 -187 243 116 -255 -123 280 -11
2575a1k87K34M51l66k85L72J50l52j34N18r8l47l0M22m6n44K09M25k22l57L22
$$ -11 -298 -64 387 21 -264 108 258 -94 -228 290 192 -155 -185 237 191 -353 -144 281 59 -298 24
2596B4K84l58k47M05K12m82j00M05J11n09N7M21j23m36K33M50k76l14K14L48l94
$$ 24 308 -50 -297 108 320 -162 -262 143 254 -255 -198 223 100 -336 -103 347 71 -243 -29 319 -75
2617g5k11M42J48m49n4M96q7m83R6M12j63k65J94K76k23l61L19K62l74j64M09
$$ -75 -286 156 304 -145 -199 297 210 -273 -177 235 72 -193 1 277 54 -307 12 274 -100 -264 145
2638A45J03m59j4M69o3m55J45L85j60m06K18L75k81l10L56K08l59j82L70J35m34
$$ 145 248 -211 -225 244 181 -274 -129 256 96 -310 -92 283 2 -308 48 256 -103 -285 85 220 -214
2659b14J2M17l5m13J55L77k72k58K10K84k85k57L60J98m40l1L76K1l75j8M26j13
$$ -214 -202 215 180 -233 -78 299 27 -231 -21 263 -22 -279 81 279 -161 -192 184 205 -170 -188 238 125
2681A25m30K01L97k56l08L15K37l52j97L62J25l55j15M13J0m33J23M56k14l65
$$ 125 -305 -104 293 37 -271 44 281 -71 -268 94 219 -136 -251 162 172 -261 -138 318 104 -261
2701b61J92L69k69l48L62J76l06j22L50R0m38K5M37j13l60J13L75j95k91K40K52
$$ -261 -69 300 31 -317 45 221 -85 -207 143 233 -205 -180 257 144 -216 -103 272 77 -214 26 278
2722B78l03k57L27K55m55j92M88R1m59j00M94j5m07L8M95k09k89K14L25k26l59
$$ 278 -25 -282 45 300 -155 -347 141 232 -227 -327 167 152 -255 -217 278 69 -220 -6 319 93 -266
2743b66L66K16m39r5L61Q8l86J2L34k5l89J09L47k23l14K91K12k65j79L29J33
$$ -266 100 316 -123 -218 143 231 -155 -143 191 166 -223 -114 233 10 -304 -13 199 -66 -245 84 217
2764B17l58k8L91qm87Q1K63O0k94J00K53j47l20L80L1k87r4M03Jl38m6M94l3l67
$$ 217 -141 -169 222 214 -273 -192 71 131 -163 -63 190 43 -277 103 134 -153 -247 156 157 -181 -227 267 234 -133
2788a33NL74n4l53K03K52k16j83K17J78l91o9J99L1k68m6L71q6l03J76K11j6k95
$$ -133 -128 246 192 -161 42 294 78 -105 112 290 -101 -170 29 60 -208 -254 117 31 -272 -96 115 99 -196
2811a96J38L41k22l02K60K52l25k29K02J95j80k31M99n9m08J24M16k94k78L22
$$ -196 -58 283 61 -241 19 271 -54 -283 -81 114 -66 -297 202 143 -265 -141 275 -19 -297 25
2831B5L13l39k51L23K59m02m4L81l0k70k02L48P8k76l7K96Qm57K65K16j74l24
$$ 25 338 -1 -252 71 330 -72 -116 265 235 -35 -237 111 189 -87 -124 172 180 -277 -12 204 30 -294
2853b94L58K21l78j15L38L7l41J7K19Q6m20K03J71j75j86K57K78l73r1J90J75
$$ -294 64 285 -93 -208 130 167 -174 -157 62 148 -272 -69 102 -73 -259 -2 276 -97 -188 2 177
2874A77k54j42K58K49m32K1L08K0k62RL10j61l24J53K65j97j84K44J20k59k35
$$ 177 -77 -219 39 288 -144 -123 185 205 -57 -48 262 101 -223 -70 195 -2 -186 58 178 -81 -316
2895c16L47J73m49O4K88J2l08R0K82r9k14J49K47j81l09K31K62l97l7L52m1k10
$$ -316 31 204 -245 -181 107 119 -189 -99 183 84 -130 19 266 85 -224 7 269 -128 -165 187 146 -64
2917f4j72L60J09m57K12J78m2l64K27K44j98k50K62K36l01j95L80j3l39N9L58
$$ -64 -236 124 233 -224 -12 166 124 -240 -13 231 33 -217 45 281 -20 -215 165 152 -187 -128 230
2938B30J5m69O8L43o9l42K52K76k95k83K17K43k64k47N26ql63j01M45r4l89K26
$$ 230 245 -224 -156 187 118 -224 28 304 9 -274 -57 186 -78 -325 201 193 -170 -271 174 80 -309 -83
2960h3K15j00l48K90K23j93k74L44K48l82j85M19J17m84Q8L44j07m00J43L59k04
$$ -83 132 32 -316 -26 197 4 -270 74 322 -60 -245 174 291 -193 -105 239 132 -268 -125 234 30
2981C0l42L46K43k60k75L17K78m40j00K88M6l64M1L88l9l01m9M56k63k89K50L56
$$ 30 -312 34 277 17 -258 59 337 -103 -203 85 131 -233 -192 196 157 -144 -193 263 0 -289 -39 317
3003C17l67k38L77J28l57j11M08K5l57n3M21r5l67J59L46j56m05L29K51k94l02
$$ 317 -50 -288 89 217 -140 -251 157 182 -175 -228 193 98 -269 -110 236 80 -325 4 255 -39 -341
3024c41M80J13l80j75M79R0n37R3L79l8m77J94L39k22l07K72L86l61l45M84J45
$$ -341 139 252 -128 -303 176 266 -271 -178 201 163 -314 -120 219 -3 -310 -38 348 -13 -358 126 271
3045B71l74j14M51pm20lM77j80m26K78L39k39l80L56K68l48k71M20J61m34j28
$$ 271 -103 -217 234 227 -193 -196 281 101 -325 -47 292 53 -327 29 297 -51 -322 98 259 -175 -303
3066c03N20Qm72J6M43r5n03L26L75l08l72L66L63m62k19M67J00m97m7N53J3n68
$$ -303 217 225 -247 -231 212 117 -386 -60 315 7 -365 1 364 -98 -317 150 250 -247 -294 259 272 -296
3088b96J49M42j52n14K90M24l52k88M29J95m38j81M08K14n61l0N56j14m74R9N24
$$ -296 -147 295 143 -371 -81 343 -9 -297 132 327 -111 -292 116 330 -231 -261 295 181 -293 -194 330
3109C30j77n08L22L77m15k58M05K60m97k36N66J31n11j20N51m0n24J36O05l40
$$ 330 153 -355 -33 344 -71 -329 76 336 -161 -397 169 300 -211 -331 220 180 -344 -208 397 57
3129E7m72L93L56l82k49L78K49n28j59O30j1n03N3M70o9m78J57M89k97m64L89
$$ 57 -415 -22 334 -48 -297 81 330 -198 -357 273 262 -241 -188 282 213 -265 -108 381 84 -380 9
3150IL34m41j89M19J81n60n9N65o4o10K24N23j75n40L63M40m28l62M07L26n05
$$ 9 343 -98 -287 132 313 -247 -306 259 195 -415 -191 332 157 -383 -20 420 -8 -370 37 363 -142
3171a42k19N36J63n39n4N18j4n10P1N32k04n27L45M39l44l61L81L51n24l05N91
$$ -142 -361 175 338 -201 -255 263 249 -261 -190 342 138 -389 -44 395 51 -310 71 422 -102 -407 184
3192A84J15n94O5M86j7n38J78M02j66m48K47M43l88l47M52J62l77j36N09J8n09
$$ 184 299 -295 -230 256 239 -299 -121 281 115 -333 -86 357 -31 -378 74 236 -141 -277 232 250 -259
3213b59PN23o9n51J99M59j97m00K21L65l45k89M82J30m74j11N42J0n10N1M97k40
$$ -259 -252 271 202 -349 -150 309 112 -288 -67 298 -47 -336 146 276 -198 -309 233 243 -267 -216 281 41
3235D1l16J63M41k66l18K93L59m41k99N20J58n87j24N91q5m55P4O01j78n13J90
$$ 41 -275 -112 329 63 -255 38 397 -44 -343 177 335 -252 -376 215 130 -325 -251 350 172 -341 -151
3256a51L97k37l76M71J96m88r7M66J16m96l0M92m6m85J11M49k13l79K93L23l25
$$ -151 246 9 -367 104 300 -188 -285 181 297 -199 -229 263 217 -268 -157 292 79 -300 -7 316 -9
3277il43M01K17m17k07N33Q0n26P5M57p9n38K30M08j77m41K90L85l87k48M47K11
$$ -9 -352 49 266 -151 -358 175 255 -271 -196 261 182 -356 -126 282 105 -336 -46 339 -48 -296 151 362
3299C62m97j91N67Q0n83Q3L99j12l41K02L47l23l27L70K58l65k25L55J91m67p3
$$ 362 -135 -326 241 321 -262 -179 220 108 -233 -31 316 -7 -334 36 294 -71 -296 59 250 -217 -290
3320b90M78L9n51J12M35j03l96K16M37m33k65L27K53l61j82M00J48m51p4M97p8
$$ -290 188 227 -324 -212 223 120 -276 -60 377 -56 -321 6 259 -102 -284 116 264 -187 -261 236 158
3341A58m35J45M20k06m01K90M01m13k87L48K89l74k29N62o0l61n4M69l7n56K14
$$ 158 -277 -132 288 82 -319 -29 372 -41 -328 20 309 -65 -294 268 208 -153 -207 262 225 -331 -117
3362a17M39k28m27L47K43k98k80L17L49m66j04L67J43m65rM16q7m46J52M29k71
$$ -117 322 94 -333 14 257 -41 -321 -4 345 -121 -225 142 285 -180 -189 227 140 -306 -154 275 4
3383Dk75K32K79k67l57N13J11m17%M32j7m43oM84q3l81J00L97k30l80L30K81m07
$$ 4 -271 -39 240 -27 -384 129 240 -177 -177 255 238 -205 -211 273 190 -191 -91 306 76 -304 26 307 -100
3406a00k46N12J10m15p8M01Qm43Q0M78j45m68K69L22k54k87K33L27l83k59M45
$$ -100 -346 166 276 -139 -217 184 192 -251 -171 307 162 -306 -37 285 31 -256 -23 304 -79 -338 107
3427A07J80m49r8M04j5l32J6M67j33l42J17L19j78k84J57L38l43k30L67J56m06
$$ 107 287 -162 -260 144 129 -203 -187 280 147 -195 -78 241 63 -221 -64 274 -69 -299 68 224 -182
3448a82o1M34k2l58P1M80l41l09J85L69k47l13L62J48k68j37L20J94m92k7L80
$$ -182 -243 191 169 -189 -118 362 21 -288 -103 266 19 -294 68 216 -52 -189 131 325 -167 -194 186
3469A86ml83J13L89j43l83J72M15l36k60L08J35k11k54L91J06m69O7L20Ol91M4
$$ 186 182 -201 -88 301 158 -225 -53 362 26 -234 74 209 -2 -256 135 241 -228 -161 159 165 -226 -182
3491a82M51k14l50L11K46l09j80K73K63m41j26M23M8m11N7M01j59l65J42M17k10
$$ -182 269 55 -295 16 262 -47 -227 46 309 -132 -258 165 213 -198 -141 260 101 -264 -122 295 85
3512H5l65K77K34l02j77M26O1l33j76M39O0m39J21L19j15l26J20L13k07l32K88
$$ 85 -280 -3 231 -71 -248 178 239 -94 -270 169 229 -210 -89 230 115 -211 -91 222 15 -317 -29
3533b9L28l59k20L72K25m43r4M07j9l98O6L40q7l77K45K85k09k91K95J81l23j51
$$ -29 299 -60 -280 92 317 -126 -220 187 168 -230 -164 176 89 -288 -43 242 33 -258 37 218 -105 -256
3555b56L12J97m08NK90qk98O0L16p6l78K04K98k40k98L34K07l41j42L17J38l66
$$ -256 56 253 -155 -150 140 132 -166 -106 210 134 -244 -40 258 18 -280 54 261 -80 -222 95 233 -133
3577a33j02L99J3m06J56K79j40k85J88L08l28j65K40K78l52j54L11Q3m06M8L20
$$ -133 -235 164 177 -229 -73 206 66 -219 -31 277 -51 -216 24 302 -50 -204 107 190 -216 -168 152
3598A52K2m06J36L08j61k61J62L12k80k19K77J97k91j42M38j8m04K6L74q1l50
$$ 152 174 -232 -96 212 51 -210 -48 264 -16 -235 42 239 -52 -194 244 226 -178 -152 222 141 -209
3619b09J17L00j64l08K72K42l12j85L32J21l41r1L29J12m06K1L73r2l34J23L61
$$ -209 -92 208 44 -264 8 250 -62 -247 85 206 -135 -226 103 215 -191 -170 203 111 -223 -100 261
3640B61k00l00K41K46k64k01L21J03l06r2L20P7m13N5L91j63l25J83L15k32k94
$$ 261 61 -239 2 248 -16 -217 104 207 -99 -191 129 206 -207 -152 239 76 -249 -66 249 17 -277
3661b77K84K43l24j74L18J37l58n5L64J1m05Q8L70r5l66J75K98k19k83K92K48
$$ -277 7 250 -74 -248 70 207 -151 -206 158 169 -236 -148 222 127 -239 -64 234 15 -268 24 272
3682B72l39j69L76R4l92m9L96Ml67N3L61j14l66K00K97k21k57K74J89l76r7L46
$$ 272 -67 -236 140 234 -158 -207 189 193 -174 -121 240 126 -240 -40 257 36 -221 53 242 -134 -231 115
3704A15R4l75l8L76l7l35Q6L42j65l15K10K78k72k43L23K28l67j59L85Q3l62n4
$$ 115 209 -166 -204 172 135 -200 -114 228 63 -252 -42 236 -36 -279 44 272 -95 -254 131 214 -148 -202
3726b02M07n3l70J11L49j71l22K29K73k57k42L09J95l48j20L49P6l69j6L63n0
$$ -202 205 152 -218 -107 242 71 -251 -22 251 -6 -248 61 256 -92 -212 137 213 -156 -172 191 141
3747A41l23P6L29j70l07K25K77k86k28L14J88l41j37L74N7m20M7M03j08l48J40
$$ 141 -182 -106 223 53 -254 -29 248 -38 -266 48 236 -105 -242 132 189 -231 -184 219 111 -237 -97
3768i7L41j90l17K65K55k85k16L11J79l75r5L76M1l87M2L82r6l49J43L34k34k67
$$ -97 244 54 -263 2 257 -28 -244 67 246 -129 -224 152 193 -194 -152 230 134 -215 -72 262 28 -239
3790b39K49K35k97j96L27J35l59q3L92Kl71N0L59j06l28J55L11k32k50K73K18
$$ -239 10 245 -52 -248 79 214 -145 -228 164 166 -205 -155 204 98 -230 -75 236 4 -246 27 245
3811B45l09j62L47J06l69l2L57j6l59P2L82j65l48K18K78k48k49L00J94l11j57
$$ 245 -64 -226 121 227 -142 -174 183 167 -192 -120 262 97 -251 -33 245 -3 -252 48 242 -69 -226
3832b26L38Q0l59k5L65l6l62Q8L66j66l25K29K57k65k12K94J96l41j29L61O9l66
$$ -226 112 192 -167 -192 173 137 -225 -137 229 63 -262 -33 224 -41 -253 41 237 -104 -233 128 197 -169
3854a69j3L74n8l37J06L32j86k89K32K59k82k01K91J61l23j07L51M7l68K5L58
$$ -169 -182 192 134 -203 -97 235 49 -240 -8 251 -31 -232 59 220 -103 -210 141 188 -180 -155 203
3875B03q2l44J42L10k04k85K49K37k88j83L24J23l23q5L48Nl54O4L45j29k87J75
$$ 203 121 -223 -81 229 25 -260 -11 226 -62 -245 79 202 -121 -206 142 147 -207 -143 202 73 -214 -39
3897c9K74k13k59K58K13k95j56L36J24l75l5L60m2l57Q7L22j22l06J82K77k36
$$ -39 235 22 -237 21 234 -61 -217 119 243 -132 -167 193 151 -206 -119 203 81 -225 -43 234 -2
3918bk34K69J97l16j23L10Q6l48k7L62o4l20J08L10j78k83K23K31k36k08L04J61
$$ -2 -236 33 230 -86 -209 101 187 -161 -188 174 110 -210 -102 208 30 -253 -30 201 -35 -243 61 222
3940B22l21j03L34N1l44K0L37r5l16J44K87j77k62K26K28k73j80L08J22l29p6
$$ 222 -99 -202 132 183 -161 -141 196 101 -215 -71 216 39 -223 3 231 -42 -222 86 208 -121 -197
3961a97L35J9l40M1L19q7l21J65K66j98k46K45K06k71j62L21R4l29m5L39j4l30
$$ -197 138 157 -183 -142 177 90 -231 -66 200 2 -244 1 207 -64 -226 95 189 -140 -185 154 140 -190
3983a90R1L05j36k83J86K63k32k28K70J83l20j04L19O2l19l1L36n4l23R7K99j39
$$ -190 -99 206 70 -213 -27 236 4 -224 46 229 -91 -195 124 186 -133 -164 172 118 -205 -108 191 52
4005E2k88K17K27k37j97K59J53k86q9L01N2l29J0L26p1k98J16K93j80k45K15K16
$$ 52 -236 -19 208 -29 -226 33 186 -100 -189 112 164 -165 -155 171 100 -198 -82 211 31 -214 1 217
4027B17k57j75K80J40l09o9L00K8l03K4L17j02k93J44K84k05k36K15K08k57j62
$$ 217 -40 -215 65 205 -104 -173 127 155 -148 -124 193 91 -202 -58 226 21 -215 0 208 -49 -211
4048b11K89J13l28l1L10pl33O9K90j09k77J80K37j94k31K55J84k84j16K84P3k87
$$ -211 78 191 -137 -168 142 135 -198 -129 161 52 -225 -45 192 -2 -233 22 206 -78 -194 90 163 -124
4070a24j6L13l9l15R9K71j29k52J63K48k15j91K26J48k88r5L12K4l03J0L06l4
$$ -124 -140 173 134 -181 -82 189 60 -192 -29 219 4 -187 39 187 -101 -196 116 140 -163 -153 153 119
4092A19l24J28K59j58k52J92K20k35j66K72J17k72r4L12L9l05L3K83p7k81J39
$$ 119 -205 -77 182 24 -228 -36 184 -51 -217 55 172 -100 -194 118 157 -148 -115 168 91 -190 -51
4113e1K57j71k33K15J84k31j35K47R5k85n7K98Kk87O0K68r6k74J34K42j90j94
$$ -51 206 35 -198 17 201 -30 -165 82 177 -108 -165 133 135 -152 -92 176 80 -194 -60 182 -8 -202
4135b02K14J55k45j13K78N9k71k3K65Kk82O7K53r0k56J47K30j93j79K26J36k46
$$ -202 12 167 -78 -191 87 146 -125 -148 117 119 -163 -96 157 67 -189 -42 188 -5 -184 42 178 -68
4157f8j06K74N4k62j1K71k3k72P1K55j34k22J68J77j91j61K19J14k29r3K62M5
$$ -68 -174 100 154 -108 -119 152 129 -143 -72 183 49 -173 -5 172 -19 -180 39 153 -76 -169 93 138
4179A38k73J9K57o8k47R7K25j34j93J73J71j95j41K21J15k58m5K63J2k64L8K49
$$ 138 -135 -116 141 73 -174 -77 148 14 -179 -6 165 -30 -171 50 165 -93 -138 125 137 -127 -89 160
4201A60r9k04J17J96j29j91J82J43k03j25K50O3k56j4K39k8k43N9K26q6k24J35
$$ 160 61 -143 -26 170 41 -150 32 175 -28 -153 97 160 -96 -110 129 101 -142 -83 143 57 -167 -32
4223c2J83j61j54J73J43k14r3K42L5k36j7K53l7k28N9K39j12j86J36J60j75j12
$$ -32 151 -10 -164 9 152 -62 -155 87 122 -114 -131 122 85 -143 -84 155 43 -143 -7 153 -22 -134
4245a34J67J34k13p7K23K4k43K0K15k4k24P4J82j05j82J52J55j89j06J88P8k08
$$ -134 33 167 -46 -123 100 124 -119 -99 116 92 -132 -58 124 19 -163 -11 144 -45 -151 37 115 -93
4267i3m0K18L1k41J0K38p4j91Q8J82j04j76J61J43j84q5J87O1j88o0K25Kk27M4
$$ -93 -133 85 116 -125 -115 123 49 -142 -54 128 24 -152 9 152 -32 -117 70 131 -57 -117 108 110 -117 -73
4291g3K09p3j87J07J77j51j54J69J22j86r4K09N0k17k1K01%k27N4K07o7j98J15
$$ -73 136 63 -124 -17 160 9 -145 24 146 -40 -134 75 125 -92 -113 88 88 -139 -85 122 55 -143 -28
4314b8J59j37j43J66J03j66p8J94M0k03j2K31m2k03N9K10j05j86J36J62j50j35
$$ -28 131 -6 -149 17 120 -46 -124 70 110 -93 -105 126 84 -119 -60 150 45 -141 -5 157 7 -128
4336a28J84R2j89q9K22K0k06oK10l9k07O9J72q2j75J37J31j45j20J76J05k03n7
$$ -128 56 148 -41 -130 92 112 -94 -100 110 71 -136 -67 105 23 -152 -15 116 -29 -149 27 132 -71 -128
4359a28K00K1k05J6K16n2j94P8J89j13j69J57J19j47j28J81Q5k12k1J94K6k20
$$ -128 72 93 -112 -96 120 68 -126 -48 141 28 -141 16 135 -12 -140 41 126 -86 -107 87 113 -107
4381a07K4K18o5j82Q3J57j20j33J28J24j76q6J76P5k25j6K19j0k13L8K03p2j80
$$ -107 -83 135 70 -112 -29 128 8 -125 3 127 -49 -135 41 116 -109 -125 94 84 -129 -91 112 40 -140
4404a40J08J69j38j44J72J04j66q1J87N9k23pK00j7j85L9J95q5j79J21J52j42
$$ -140 -32 137 -1 -145 27 131 -35 -116 71 130 -93 -100 100 83 -102 -63 132 47 -132 -11 141 -1
4426aj39J77R6j88q5J92N4k12KJ87k7j93O7J93r6j74J13J65j75r2J55J11k07n4
$$ -1 -140 37 133 -55 -140 52 106 -106 -104 83 56 -137 -70 123 27 -147 -34 131 -44 -136 19 130 -77 -131
4450a31K15Nk14K6K19l1k08O8J88j24j51J41J48j64j31J87R7k16n4K17K6k19J1
$$ -131 84 89 -125 -99 120 89 -119 -51 137 13 -138 3 151 -13 -144 43 140 -76 -130 87 113 -106 -95
4473i5K01o2j94Q1J95j17j63J55J23j80r7J89Q7k14m8K22pj97K5K15p7k02J08
$$ -95 106 44 -150 -69 126 9 -154 1 124 -56 -153 36 123 -91 -139 83 76 -121 -96 119 42 -160 -52
4496e2J78j01j76J64J50j98j18K18P2k14l3K12J1k33N2J98p3k09J26J63j35j66
$$ -52 126 25 -151 13 163 -35 -153 65 137 -77 -110 102 113 -120 -68 130 57 -152 -26 137 2 -164
4518a64J77J22k05q4K10M8k21j3K23rk30O4K23j23j85J43J75j59j59K11R9k00
$$ -164 13 135 -70 -154 56 104 -117 -130 93 84 -146 -82 141 18 -167 -24 151 -8 -167 44 143 -57
4540e7q4K28L5k27LK28l2k30Q2K14j17k01J60J43j70j43J93J19k19o2K21L8k32
$$ -57 -141 87 122 -105 -102 126 94 -136 -54 160 43 -158 2 145 -25 -168 25 144 -75 -137 84 122 -110
4563a10qK30m5k25P9K28j46j67J65J31j63j35K18O6j99n3K33J3k44M9K20n9k26
$$ -110 -118 112 67 -158 -79 149 3 -164 1 132 -31 -166 52 118 -81 -134 99 112 -132 -83 137 78 -148
4586a48J03K13j56j74J80J48j96j16K13Q8k46m6K35Rk34M9K13p9k29J36J80j52
$$ -148 -45 168 12 -162 18 166 -30 -146 67 155 -91 -137 98 107 -127 -78 135 56 -173 -37 143 -9
4608ij73J79J52k09j13K27N9k09k9K30k2k13M6K30j03j96J24J74j67j32J96J09
$$ -9 -182 -3 149 -60 -173 54 113 -96 -125 105 83 -130 -84 146 43 -153 -29 145 -22 -154 42 151
4630A51k03r1K43J4k18oK33m4k23P4K26j26j95J50J70j78j54K06J10k37n6K31
$$ 151 -52 -143 100 114 -104 -110 123 79 -144 -70 156 30 -165 -15 155 -23 -177 29 139 -98 -154 77
4652G7K1k28K0K25n6k27R8K17j31j71J75J41j91j18K05Q0k13m5K12K4k23K3K25
$$ 77 98 -130 -110 115 59 -168 -70 147 16 -155 20 161 -30 -148 57 137 -76 -121 91 115 -108 -85 140
4675A40o5k07J03J94j52j70J80J20j82j01K03N4k18j0K07l1k03N7K03r6j90J28
$$ 140 75 -132 -29 165 13 -157 23 143 -39 -140 63 117 -101 -111 96 65 -138 -81 122 26 -164 -36
4697c6J66j52j36J58J35j98p4K16K5k04lK06l4j95P2J92q8j72J22J26j49j14J99
$$ -36 130 -22 -158 0 135 -63 -137 79 104 -100 -103 103 69 -126 -54 138 50 -122 0 126 -23 -137 62
4720F2P0j84p2J98L2k18L0J93p1j67Q3J73j23j65J55J17j64q9J78O8k01j4J82
$$ 62 132 -52 -124 74 106 -112 -82 111 40 -127 -44 129 6 -159 -4 113 -51 -140 38 106 -95 -109 73
4743G3j1j75L8J96q3j78J22J50j44j20J64R5j64p2J88L4k00J6J71k0j94O8J73
$$ 73 62 -113 -75 121 38 -140 -18 132 -12 -132 32 127 -37 -109 79 113 -87 -71 100 80 -114 -46 127
4766A27r1j67J17J44j56j05J59J02j90n5J80J2j91PK16o2j95Q9J80j10j55J39
$$ 127 36 -131 -14 130 -26 -131 28 130 -60 -115 65 77 -114 -107 109 47 -148 -59 121 11 -144 -5
4788eJ24j52q9J65P2j82l3J99kj92L8J95j01j62J16J56j42j43J65J01j67p7J83
$$ -5 119 -33 -122 43 115 -67 -100 99 97 -95 -57 138 37 -125 -9 147 5 -138 27 128 -39 -116 67
4811F7M0j94k2J95l5j86O4J72p6j54J16J40j57j09J55J04j91m9J98J1j87OJ91
$$ 67 107 -87 -109 86 51 -135 -71 101 25 -129 -13 127 -30 -139 16 120 -71 -120 78 89 -98 -92 99
4834I9m4j67P5J63j11j48J35J28j62q2J67N8j60l9J92j8j82L1J73o2j72Q9J41
$$ 99 55 -112 -37 126 15 -133 2 130 -32 -114 53 111 -49 -88 104 86 -96 -65 108 46 -126 -37 104
4857A04j12j26J36J12j74q1J88N2j79k2J75j0j78M5J67n9j62J07J33j14j30J44
$$ 104 -8 -134 2 114 -60 -141 47 99 -80 -102 73 63 -115 -70 97 38 -124 -17 116 2 -128 16
4879A6J20j74o6J62O4j96%J84l0j85P2J40p5j49J00J46j32j28J65R2j78m2J60
$$ 16 136 -38 -104 58 122 -74 -74 110 80 -105 -33 107 32 -117 -17 129 -3 -131 34 126 -52 -94 66
4902F6kj61J0J82m2j76Q1J39r2j42J31J08j13r5J30P4j66l0J80Pj67J9J63o6j21
$$ 66 64 -97 -87 95 53 -123 -42 97 5 -137 -6 102 -11 -106 24 98 -68 -98 82 89 -78 -59 104 38 -83
4927h3N4J64j03j39J30J12j59p2J65M1j63k1J42Nj72K3J49l4j57P8J49j18j30
$$ -83 -29 135 32 -107 23 135 -24 -96 69 110 -53 -74 68 73 -99 -76 73 39 -118 -40 109 -9 -139
4950a39J65P7j71n1J23P1j46J4J17mj62N4J09k6j14J43kp8j20J57P6j00l9J42
$$ -139 26 103 -68 -119 4 75 -71 -57 60 56 -106 -52 57 31 -83 60 58 -20 -140 17 93 -7 -46 96
4974I6m4j24m1K39q6j50K3J63n3j17P1J7n1l4R0R2j56q3J95K9j06q5K92j25j93
$$ 96 52 -72 -113 126 40 -110 -87 76 23 -94 -23 -6 -57 -91 -1 91 -65 -148 47 76 -30 -115 177 52 -141
4999a41j7K15q6p2J17J18j75QM3J09k20OJ71K9j22J0J65j44j54J75O1o2j43J75
$$ -141 -158 57 -29 -101 16 134 -41 -33 10 119 -101 -95 76 105 -17 -7 158 14 -140 35 96 34 -109 66
5023F6n0Pj54J82R5j53qJ02nj67O6J31j24p5Q3J11j08j10Q4J37j74k3J44l0o0
$$ 66 16 23 -131 51 146 -7 -15 87 82 -85 -19 112 -12 -87 -4 107 -1 -111 -27 110 -64 -87 57 27 -33
5048c3m0J14K7j39J4J69o9j16Q3M5o1j8O9N1j51j0P9L9j09L4N3m0o2M5N7m0p2
$$ -33 -73 41 68 -71 -57 112 43 -73 10 55 -6 -24 45 96 -55 -65 14 53 -56 -22 31 -9 -71 -26 31 -9 -81
5075h1N2R9j01j02J61L9r4n3J38j8r8kJ26n2j04P4R5q3p0O3O9r1l0Q5O6j21j5
$$ -81 -29 70 -31 -133 28 67 -27 -80 58 40 -58 -60 66 14 -90 -16 79 -4 -74 -11 58 -33 -63 22 88 -33 -48
5102d8J15j6j01LJ20l8r5K8J28q4j03R6O3r7n9J36J5j19k5J15j8q8N0R3o5j02
$$ -48 67 51 -50 -47 73 35 -60 -32 96 12 -91 5 68 -29 -88 48 63 -56 -81 34 16 -72 -22 71 6 -96
5128i6Q5P6r2o3R8O2j04k7J13K9j27j3J30k5j09O5P7m2j20Q5P6p7o3Q2O6j43m1
$$ -96 -11 65 -27 -90 8 70 -34 -61 52 81 -46 -59 71 46 -63 2 79 37 -83 2 78 1 -62 20 86 -57 -98
5155i8J34nj25L4J01rj30O6J16j02n7O4P5r7m6J13L9j43RJ04Nj10K7J10l5j10
$$ -98 36 31 -94 -60 41 32 -98 -32 84 -18 -75 -11 64 -33 -79 34 73 -70 -61 43 48 -62 -35 75 40 -70
5181g0P8R0q7q0Q3N7j10l9J40J2j21lJ14k6j20M2J09o1q3M7R7q5r2J13L8j00l2
$$ -70 8 98 11 -69 14 71 -39 -78 62 74 -47 -50 64 38 -82 -40 69 8 -75 -28 69 -16 -108 5 43 -57 -89
5208h9J08K5j30K3J12m1j00N5J01o7p2N5J13q3r4Q2N8j00pJ05K8j18oJ22j4j17
$$ -89 19 44 -86 -63 49 8 -92 -37 64 -3 -75 -20 93 10 -84 -2 56 -44 -51 54 82 -36 -42 80 66 -51
5234e1J5J26q5j00O4Q8m6j07J07M8j17m3J24N0j47K0J23l0q3J9Q5n7j01J21M8
$$ -51 -36 90 5 -95 -31 57 11 -96 11 59 -58 -101 23 73 -74 -54 69 39 -44 -25 60 3 -98 23 71
5259G1j01o4J47K3j19l0J28j1r2LJ09Qj26K8Q6%j14O2Q6j20o9J79K0j51pJ11q
$$ 71 -30 -94 53 76 -43 -73 55 44 -48 -45 64 72 -54 -26 60 60 -54 8 94 -26 -95 84 104 -47 -54 57 49
5286D9j33J04Q2j08k5nJ14m8j47J35M6q3m3J14lj04l6J65l0j09k2J38m4r1Q7R9
$$ 49 -84 20 102 -6 -31 -36 78 30 -117 18 64 -19 -62 52 49 -55 -91 74 44 -65 -87 51 7 -84 3 102
5312A02j23n6J16N5j26o3J34K1r8k2K02j00j13O7O8m2j24Q6Q9q1q7J00O4j26l3
$$ 102 -21 -77 39 94 -32 -95 39 60 -38 -60 142 42 -71 -4 64 22 -102 -16 73 -8 -95 5 69 -57 -90
5337i0J28Rj23J3J11j8j16J09L1p8p5J02J24j33o7J54J6j77J8J27Kr8lJ52r6p6
$$ -90 38 47 -76 -63 48 30 -86 23 54 -24 -99 3 127 -6 -73 81 97 -80 -62 65 67 -31 -34 118 22 -54
5363e4K9R6m7q9Q7M0j29m9J66%q8j3J15m6r8L2J23o7j33O4J24p3n3O6Q5r3m2Q6
$$ -54 -25 71 24 -65 22 62 -67 -116 50 50 -38 -51 64 18 -80 -48 75 8 -125 -61 63 -10 -63 3 88 -5 -47 39
5391C9kp6J6J04m3j10O8J15j04q1P3P6r9m6J39j5j06pJ15qj46L9J56o6j20Q3R4
$$ 39 37 -39 -23 81 38 -72 -4 111 7 -74 -1 75 -24 -70 69 54 -52 -59 56 48 -98 -59 97 31 -89 -6 88
5418H8q5j33J38M4q1qJ00l6p9%P1J2j48P8J05q7q4P8J32j07o2R6P8j19k6N5N3
$$ 88 3 -130 8 52 -29 -37 63 27 -52 -52 19 31 -117 -39 66 -21 -105 -27 105 -2 -64 32 110 -9 -35 20 73
5445G3j18K5N7J7j10K1J51j09o3O7R8j20o5J18K6j20n3J62k3j39N7J10l6j06M6
$$ 73 -45 -20 37 54 -56 -35 116 7 -56 11 109 -11 -76 42 68 -52 -105 57 34 -105 -48 62 26 -80 -34
5470c4J10q5j08J22R0j24j7P7N8j35MJ04M8j80LJ56m5j16L7J72j37m7M8P4p2p7
$$ -34 76 -9 -117 5 95 -29 -46 31 89 -46 -42 62 110 -70 -67 89 44 -72 -35 137 0 -47 1 75 3 -74
5496g4N6R6j17RN6L7j67rJ87n1j22O7J23j28l3Q7K7q8k9J16J9j08KJ34k3j31K9
$$ -74 -18 78 -39 -30 26 63 -104 -113 74 23 -99 -32 91 -37 -70 17 44 -44 -73 43 62 -46 -44 90 67 -64 -35
5523c5J29l1j21R7M8j01p0J39K4j25l5J02K9j29O8O1J7j82N4J38n0j08J01Q9j59
$$ -35 94 63 -58 39 87 -14 -84 55 79 -46 -81 21 50 -79 -11 50 67 -115 -61 77 27 -81 20 109 -50
5548e0k7P2Q2j10n1J54k7j66M8J35k3j11P5P0p3j23J42O1p7p4J75j4j33J0J28
$$ -50 -77 -5 77 -33 -84 70 43 -123 -75 60 37 -74 1 71 -2 -125 17 78 1 -73 102 88 -45 -35 93
5573I3k8j42L2Q5qr7P0M8p8p5J20M3p9m1J16k2j02O7M1Oj30N4R5p3r1R2P9j03
$$ 93 65 -77 -45 40 32 -65 5 53 -25 -100 20 63 -16 -57 59 37 -65 2 43 49 -81 -27 68 -5 -96 -4 75 -28
5601b8o3J17N9j58k5J34K1j32N3R5l2j12K4J43p6r4J14Q1j19o2J30j7j08j5J26
$$ -28 -91 26 85 -73 -98 36 57 -75 -22 73 41 -71 -47 96 20 -74 40 121 2 -60 70 53 -55 -70 56
5626E6rj20K9J04m2j13N9J16q1r5Q1O0r4LJ06K4j15l5R7J6j20Q7O5o5r5Q9J04
$$ 56 47 -73 -44 60 18 -95 -36 80 -1 -96 -15 45 -49 -46 60 84 -31 -66 31 47 -73 14 79 14 -81 8 112
5653A12j03j09J23N2j04k2P5K8n8n9J02ko7K6Q2p4n5O1M3n5p3R9k2p7J5R3l2l9
$$ 112 9 -100 23 75 -29 -51 24 52 -6 -65 37 35 -32 -6 76 2 -53 8 51 -4 -77 22 0 -77 -62 31 -1 -40
5681d0nQ6J4j48M6J13p6j03Q1J62j29j1N2M2j14j3J08pp4J4R3p3p2J22Pr0m2Q5
$$ -40 -45 41 55 -93 -47 66 -10 -113 -32 130 1 -10 42 84 -30 -43 65 58 -16 -2 91 18 -54 68 75 -15 -57 28
5709B8L2o5n7J16Jj17k2J45n8Ro9Q5o4M2l6J02p3J8k1L6o0k2P3j3o0P4M6l1r2
$$ 28 60 -5 -62 54 55 -62 -84 61 3 12 -57 28 -36 6 -30 72 -1 17 -4 32 -28 -50 23 10 -50 24 70 39 -53
5738e3J19K1o1m1J6Jj4j7L7N1k6q7J13Rn5p3Q0oo1L1P9o9p8P9O6r5l0Q4O0q8q
$$ -53 66 87 26 -15 1 2 -12 -29 8 59 33 -54 59 68 13 -60 20 14 -47 -16 63 -6 -84 -5 61 -34 -64 20 80 -8 -16
5769a6N7k7l9k3J02j5o8nN6J0m2J8O1m7m5N0J3l0l1N6Kq0J8O6j3n7J4K9k3j9K2
$$ -16 41 14 -25 -48 54 39 -29 -34 22 32 -10 8 69 22 -23 27 40 10 -21 35 37 -43 -25 41 28 -29 -15 14 -9 -28 -6
5800fL7m4m8N3J9m8QL6Mo0J5P4j7o9K8M4ro6M9M9l6l1M7K9o3j0P2k2n5K6M3j9
$$ -6 31 -13 -61 -8 11 -37 -29 7 11 -49 -34 40 23 -46 -18 26 17 -49 0 49 13 -18 29 58 -5 -15 57 35 -20 6 49 30
5832C0o0K9P1l1o0J9J2l2k5O9K5o8n0Q5ql5MM4j6n8L9M5l8l1L7Qlk5M4Rpm9O3
$$ 30 -30 -1 70 39 -21 -2 10 -22 -47 22 47 -21 -71 14 6 -29 -25 19 3 -55 -16 29 -9 -40 -3 5 2 -23 21 30 23 -26 37
5865C7l0lQM0j3n2K8K8m2m2M3K0j9l1N5k6k6JM1Kn2PM2rm7J0N5m1%rL7k7l9P8
$$ 37 7 4 12 52 39 -13 15 43 1 -41 2 22 3 -28 27 1 -25 -24 17 19 -33 -26 16 7 -40 -30 25 -16 -16 -25 12 -15 -54 24
5899B4rl2kL5ok6jM6on1L8L0j9l1K0J8l6lK3Ol1mL9ql8PM0k7m6L1L7l8j8L5lk0
$$ 24 15 -17 -19 16 10 -16 -17 29 23 -28 10 40 21 -10 10 28 -8 -11 12 18 -13 -17 22 14 -24 -17 23 -4 -50 -19 18 -20 -38 -3 -6 -26
5935b6j2N6j3j4k2N2k7j2J2N7n1j9L3Rj4k3L8Rl1l2O3j4j6nK9k4k7J4M2m5k0M8
$$ -26 -38 18 5 -9 -31 21 -6 -18 -6 51 0 -19 14 23 9 -14 24 33 2 -30 33 19 3 -2 27 3 -24 -10 32 -13 -33 15
5967A5Nk5k2M2rj7j4M2j4k6ML2k5j0J8Nj1j5J9K9l3j0M3ml9QM5j3k2ML3k3l5L2
$$ 15 20 -5 -27 15 6 -11 -25 17 3 -23 -19 13 -12 -22 -4 1 -10 -25 -6 23 -10 -20 23 19 -20 -12 33 20 -2 2 35 12 -23 9
6001IJ9k0k1K9J2m3j2M8j1k3jL6nn9J2N5j1n3K1K8j8m2N9J3l4mK1J5l7%L8kk5
$$ 9 28 8 -13 16 28 -15 -27 21 10 -13 -14 22 17 -42 -30 25 14 -39 -18 10 -8 -50 9 22 -12 -16 5 20 -17 -17 21 19 -6
6034fJ2K8l2k6L6K3k2l0M2mk5j4M6j0k7LK2j9k3J8J0k1KJ5Jk9MK8Ql6J5J6kl7
$$ -6 6 34 2 -24 12 35 13 -17 25 21 -4 -18 28 18 -9 -6 16 -3 -26 -8 2 -19 -17 -2 -1 -30 -26 2 10 -26 -11 5 3 -34
6068c4K5K8j2l0K9L0l6k2N1Jj5j1L2on1K0L7j7k9K4J4k9k2K9Lj6k5L5Kk0j0K9
$$ -34 -9 19 7 -23 6 36 0 -22 29 30 15 4 36 30 -21 -1 36 19 -10 14 28 -1 -23 6 9 -7 -32 3 5 -15 -25 4
6100Dkk8NK3qk3J1K5k0l2N5J3m5rL7J1j9rN9k9k8J6K2k0k2K2%l5J3OM5m8j3M5
$$ 4 2 -26 -21 2 -6 -29 -18 7 -13 -45 10 23 -22 -31 6 17 -2 -11 48 19 -9 7 29 9 -13 9 9 -26 -13 -7 38 -10 -23 22
6134B2l4mj6R2m8n0LN2k1ok8L8Jn8J02n2k6M8K2j7q5P4K7o4qJ3O6K4l0L6j6r2
$$ 22 -12 -16 -32 60 12 -38 -35 17 -4 -10 -38 0 1 -57 45 -7 -33 15 37 20 -65 9 36 -28 -36 -23 43 67 37 73 57 -35
6166c5M3lO1n0k6K1pn2M3M8m1j4oN6m9j9J8K6l6j9N0k0oj7M9l2jL6jl4K2m5P4
$$ -35 8 5 66 16 -10 11 4 -48 -5 43 2 -12 -18 38 -11 -30 -12 14 -22 -41 9 -11 -17 -34 15 -17 -18 18 17 -17 5 -40 34
6199C4o4J9L4L4m7k9K3o9Q6j7K9l6j1O9%o7kN4Kp5kM2Pk1l4O6j5j5l4N9n4NM7
$$ 34 -30 -11 23 57 10 -19 4 -65 21 4 33 -3 -14 55 55 -12 -14 40 42 -33 -35 7 14 -7 -41 25 10 -5 -39 20 -34 -29 18
6232A8lql1L1l5l9L3O5k6k9M7j5J1Rl1L8p2L3O7l3m8K1K0J7m4ML0n7J0L6j5m0
$$ 18 15 7 -24 7 -28 -67 -34 31 5 -24 23 8 19 28 -3 35 -37 -4 63 30 -18 3 23 40 -4 0 30 -27 -17 19 4 -36
6264c6K5M5l4J7j4L7k2l4%l3J8PJ8P0j12KP3P5j49J6M9J8n6J4J07n1n1O3K8j11
$$ -36 -11 34 0 17 3 40 18 -16 -16 -49 -31 -24 -6 64 -48 -46 27 102 -47 -31 18 36 -20 -6 101 50 -1 62 90 -21
6294b1l1J51q2rj1o0R1l2k1O5r0L1K2MK2j02R6o9L7n7M7O7r7L7L3Kj6k3P1jj45
$$ -21 -52 99 17 8 -3 -63 28 -4 -25 40 -50 -19 3 7 29 -73 23 -46 -9 -66 -19 48 -49 -12 21 23 7 -16 55 54 -91
6325i1P3M0K5o6QL5k1p8R7Ojm5L9J5jl4K2k5l2J8M1n1j5N3O0n7j18N2L0J1p7J31
$$ -91 -18 22 47 -19 -11 24 3 -75 22 28 27 -18 21 36 35 1 23 -2 -34 -16 25 -26 -41 12 72 15 -103 -51 -21 -10 -87 44
6357D4Mj20K3N2rm3J6R9r3k8M8O0m8l8M2K4k1o1Q9qq1Q2J3L3n2l1M7%r5N7R2q7
$$ 44 48 -72 -49 3 -6 -49 -33 66 -27 -55 -7 53 5 -33 9 33 12 -49 40 32 -49 33 46 79 27 -4 43 43 -52 5 97 10
6389A0%J9ko5L0N1J3q4l7Q8m7%l3O0k0L%N6%m5K4K8q7N2PN2r7L0N6o8MK8N6j45
$$ 10 10 29 27 -38 -8 43 56 -28 -65 23 -24 -24 -57 3 -17 -14 -14 42 42 -3 21 49 -38 14 21 73 -24 6 62 -6 -2 26 82 -63
6423f3K4K0K0o7K7J66j00mk9J3K4j20J62j9n7O5j35P8k0o9L7J25n4oN4j5r4J16
$$ -63 -39 -19 1 -66 -39 127 27 23 -6 7 31 -89 73 54 -3 62 -73 5 -15 -84 -47 78 24 18 72 57 -37 79
6451G9j05K2K8n2N8rm7Q7p7oj00J43k2r8R5J09l5p9J9N9n1L3M1r0J4q6M9K2om5
$$ 79 -26 -4 24 -28 30 21 -26 61 -16 -22 -122 21 -1 -99 -4 105 70 -9 10 69 18 51 92 2 16 -70 -21 1 -5 -50
6481e0Q4r1J00n9M1J8J7r1K6pl9j2J38o8p3Q3M3j56O9J42j08r9Q8N5j9j04K7Q1
$$ -50 34 -57 43 -16 25 43 60 -31 -5 -12 -51 -63 75 7 -66 17 60 -96 -27 115 7 -92 -4 51 32 -72 -45 36
6509C6o2%R6J4o2No2jJ6N7J9q0L4O7o6Pn7N7K7r4l6J36k7l1J1l4L8Ql2J3O3r8
$$ 36 -26 -26 70 84 22 27 -35 -36 -20 37 56 -24 10 77 11 18 -39 18 45 -49 -85 51 24 -7 4 -30 8 16 -16 -3 60 -38
6541c8J4L1K3j5l6L9o8Q8O9j11k5M5K3m5mRN8n2J9o8J06j03K7k6J9l6RM2L4j20
$$ -38 -24 7 30 15 -21 18 -50 38 107 -4 -29 16 39 -6 -10 -1 57 5 24 -44 62 -41 -14 -40 -21 -57 -48 -6 28 -92
6571i2P9pO6q4P6j2j1k5K1P1J7j05J3N0j10m6J38QJ7j26J09l1p2Q1m4K2j7P5l2
$$ -92 -13 -20 46 -38 38 26 15 -10 11 82 99 -6 7 57 -53 -99 39 47 64 -62 47 16 -56 25 -19 3 -14 61 29
6600B9n1M3k1m8J6oO6l8k8N0P7n3Ll5M0o0k0J9J2o2J1J15j3J3m9M4m1m4J5J41
$$ 29 -22 21 0 -48 -32 -38 28 -10 -38 12 89 36 39 4 44 -16 -36 -17 -5 -67 -56 59 46 59 10 54 13 -31 -16 125
6630A25j37qP0K2j00k8J15K3o2oM4k4p0jJ27r0m5mO1j1m6M8k8m3mP8l5qj1J26
$$ 125 -12 -20 50 72 -28 -56 59 82 20 14 58 34 -36 -37 90 0 -45 -49 12 1 -45 3 -25 -68 -72 6 -29 -37 -48 78
6660G8o7n6M0l0LK9L0K0r2O0M4j7m9p7J10Kn2L1M3k9l0k7Q7j9p7M8J9l5k3K2J2
$$ 78 11 -45 -5 -35 -32 -3 27 47 -45 15 59 42 -7 -84 26 28 -24 7 50 21 -9 -36 51 32 -45 3 22 -13 -36 -14 -2
6691bM2m9K8k6k4K7J3k9k9J9J1L7n5K1K5l7lM6lnl9R4k5l6oO2k9lm8P2n2k2N5
$$ -2 40 -9 19 -7 -31 -4 9 -20 -49 -30 -19 18 -37 -16 9 -28 -31 15 12 7 -32 62 37 1 -5 57 28 25 -23 49 -3 -25 30
6724C0k0Nj6rM5k8j7J9L1o5J2O9o1Mm5O0j9l4M3j1rk2N7J9q4M2M1mm9PN9l7j8
$$ 30 10 15 -1 -10 35 7 -10 9 40 -25 -13 56 -5 -1 -46 14 -5 -39 4 -7 -16 -38 19 38 -46 -4 37 33 -16 -9 50 13 -5
6757eJ0L2k0l0N9M7j00lK2nKj9L8J7q8PP4j3p7O6Ol1j4M9kk4J5J9j9k9k3O0k0
$$ -5 5 37 17 -13 46 93 -7 -10 12 7 9 -10 28 45 -43 -36 38 25 -52 14 20 -11 -25 24 22 -2 13 32 13 -16 -39 21 1
6790Am4N6Ol0rL9kJ9l4J6J9l7k3M4n0pK1L9L5p8O4J0l0l8oL0rj4L2ol0MN3k9l1
$$ 1 -43 13 19 -11 -20 19 17 36 2 18 37 0 -23 21 -29 -36 -15 24 59 -19 45 55 25 -13 -19 11 2 -12 20 14 -16 -12 41 12 -19
6825a9n8N2L6m2J8J8K7p9N3J2m0j6N4m2Ok4R2k9n8K9N2kp8K9N1l7j3L1m4MOL1
$$ -19 -77 -25 11 -31 -13 5 32 -47 6 18 -22 -38 16 -26 -20 -44 48 19 -39 -10 42 40 -38 -9 42 5 -8 23 -21 -17 -11 20
6857B0JqJ1l2L8m8k5N6Op3P8j6n2LL5ok9J3J6Nl6kL2K7Ml6N4k8l7J4O4l0l0N1
$$ 20 21 13 24 -8 30 -18 -43 13 19 -54 24 8 -44 -41 -6 -12 -41 -28 -12 -7 -43 -45 -13 14 18 -18 36 8 -29 -15 49 19 -11 40
6891D0j0nj7L5rm1kN0k2l4qP2m5j5j0O5l8n4M9Qm0j1L8M4q5KL9K2k5k5N7Kn5L1
$$ 40 30 25 8 43 34 -7 -9 41 19 -15 -23 49 4 -11 -21 44 6 -48 1 9 -31 -42 -4 40 -45 -43 -4 18 -7 -32 25 27 -28 3
6925CL0k0k8K5L7n3j2N2nl4oN5k1m7RN8l5m2K9J8j6m0M5J8m2k3O0km1rO3j7n7
$$ 3 33 13 -15 10 47 -6 -18 34 29 -5 -11 44 23 -24 -15 43 8 -34 -5 13 -3 -43 2 20 -22 -45 15 13 -28 -37 26 9 -48
6958d8K0O0l8k4K5L5j5m8M1K2l7j0M1kl5oP0j7m9MO1k3m9M8J4m6kK9K0n4j9O9
$$ -48 -28 32 -6 -30 -5 30 15 -33 8 30 -7 -17 24 22 -13 -19 51 34 -15 -11 50 27 -22 26 40 -6 -8 21 41 -13 -32 37
6990C7no4J7L7k3l8J8K9nm5L5M2p2j8N4K2n8ON1Mn5J8N4l5l2K0M2k9l3L5L0n0
$$ 37 32 -32 -15 22 -1 -39 -21 8 3 -42 -7 35 -37 -55 -1 21 -37 -31 20 24 -31 -13 41 6 -26 -6 36 7 -26 9 39 -11
7022a1j2N1Pn8NN7k4k9MO2m8l5J8M2m4k5K9L7o3jN5Kn5JN7j0n1K3M9l2l5L8M0
$$ -11 -23 28 35 -23 -18 39 15 -14 -10 52 4 -31 -13 29 -15 -40 -11 26 -37 -38 17 19 -36 -35 22 12 -39 -16 33 1 -34 4 44
7055D4m8k3O2K0o6oN8Lo7J0M9Qq2M0M2l0n0N3Om3l4N3L2o3oN9j2n2J7M8k6n9N8
$$ 44 -4 -27 35 55 -11 -17 41 44 -23 -13 36 44 -38 2 44 14 -36 17 23 -20 -54 -1 31 -32 -38 21 9 -43 -26 22 -4 -63 -5
7088eL8k8n2N5K5m9k6O1Lo2L6M1on9L1M6k6o6N6L6m3m1N3K7n8j9M8J2o0PO3l2
$$ -5 33 5 -47 8 33 -16 -42 19 22 -40 -4 37 31 -28 3 49 23 -43 13 49 6 -35 18 45 -13 -32 16 28 -32 -25 38 6
7120Fo5L8N6m2l1L8M1n5m7O8J9n6j2P2Mn5LN2Ro7J9N0m1k2K7M4n1k4N3Km2kM0
$$ 6 -59 -21 35 -7 -38 0 41 -14 -61 7 26 -30 -42 30 34 -21 -18 34 43 -24 -5 45 4 -18 9 53 2 -22 31 33 -9 -11 29
7153B9J0p6L6M1k9n0M3K2k9l6M2J4l3m3O7Qn7MN9jp4L4M6j6p0O1M2m1n1P8K2o6
$$ 29 39 -37 -1 40 11 -39 4 26 -3 -39 3 17 -16 -59 8 16 -41 -37 22 21 -53 -19 27 11 -59 2 44 3 -48 30 52 -14
7185a4j1M9J3m0JM9j8n1K0M6l0m2L8M6o1l4N5K8p2j1O2J1q8M2N4l1n5NO2l0l5
$$ -14 -25 24 37 -3 -2 47 29 -22 -2 44 14 -28 10 56 -5 -39 16 44 -28 -39 23 34 -54 -12 42 11 -44 -39 23 -7 -42
7216d2L8M7o2k1N7Qm9jO8j1o7J9P4k7m8K0N1m5l0M2K6m1k7O3No9j0P6l5k9RL6
$$ -42 -4 43 -19 -40 17 25 -24 -25 43 32 -35 -16 58 31 -17 3 54 9 -21 21 47 6 -21 42 47 -22 -32 44 9 -20 -11 25
7248B5k0m8K8L2l1l9N7K6o2k0M8K5m9j0P1j9n1K0O3k6l8L4K8n5nM5L9o3k1N7j1
$$ 25 5 -43 -15 17 -14 -53 4 30 -32 -52 -4 21 -28 -38 33 14 -37 -17 46 20 -18 16 44 -11 -16 29 68 5 -16 41 30
7279C0m8J3N2k1o7L9N6n2m1M7K7o7rN8J1n4j3N2Mp4K7M3j5m4L1O7n5l9N1K7k1
$$ 30 -18 -5 47 26 -41 -2 54 2 -39 8 35 -32 -41 17 28 -26 -39 13 17 -57 -30 13 -2 -46 -15 52 -3 -42 9 36 15
7310A5m8O7L6o4qO4m2o9M2O5l0o1K5N0m6k7L6K9l3m6M7K6n7QM9k1q5L2P4l3k6
$$ 15 -33 34 70 6 -2 62 20 -49 -7 58 28 -33 -8 42 -4 -31 5 34 1 -45 2 28 -29 -21 28 7 -78 -46 28 -5 -31
7341c1M4K6o1rL3O0p8j2N1Lm4L5J1J0o3K3L5k3k7M3L6q1J4K7Rm6J3L8nj12N6O0
$$ -31 13 39 -22 -31 2 62 -16 -28 23 26 -18 17 28 38 -25 -2 33 10 -17 26 62 -19 -5 22 31 -15 -2 36 31 -81 -25 35
7373C5l4l6J2N0l8m3L9L9m6l9J01k9n7J9M8J2q9N6N5o1k7lR4p4kK4Pn1NO4Kl1
$$ 35 1 -35 -23 27 -11 -54 -15 24 -22 -61 40 11 -46 -27 21 33 -56 0 55 -6 -33 -36 58 -16 -18 6 13 -38 -33 31 33 2
7405Bj4O3K5q4%N2k1m1OO3k7n7Q7p9pk1N6Po2j9J30r8m3Q2J9l1m2K8O3m4j8N4
$$ 2 -12 51 76 -8 -8 44 23 -18 -12 51 24 -33 54 -25 -32 -53 3 10 -52 -71 59 -39 -82 0 19 -12 -54 -26 37 -7 -25 29
7437B9j5l3l4P0Op7O6J8K4n5j4M9K5j18O3N5o5j5%N4n4l5P6J1j27Q8qKm5MN8n0
$$ 29 14 -19 -53 17 23 -54 12 30 54 -1 -15 34 59 -59 4 59 -6 -21 -21 33 -21 -56 20 31 -96 -8 -16 -14 -59 -55 3 -47
7469d7J3K8M1q3j4L1O3j01R3j1J7l7K1O0j18j0J19p4m4O2%M1o5OO5l6k7j9P4n5
$$ -47 -34 -6 35 -48 -62 -31 32 -69 24 13 30 -7 14 74 -44 -54 65 -9 -53 9 9 50 -15 -9 56 20 -7 -26 48 -7
7499gJk9R2K6q9J15o6n1j03J06P7j62LJ27j4k8P9On1o5k4J53o3k4k6M1l1k6O8
$$ -7 -6 -35 57 83 -6 109 43 -8 -111 -5 72 -90 -87 40 26 -2 77 83 32 -33 -57 96 33 9 -17 24 -7 -33 35
7528C5R1j70K7P2o5qj6N6L0m5k7J7K7K0J5k3n1j6Q4l5n7J9R8j26J2rQ9L4r0K7
$$ 35 126 -44 -17 55 -10 -18 -34 22 52 7 -20 -3 24 44 59 36 -15 -31 53 18 -39 -20 78 -48 -36 -45 44 78 -12 15
7558A5K6r4J7Q9m5K1n1K4J37j22m2PM2q0J59k0l9n3o5K37j54K8L9p5n3m7J06O5
$$ 15 41 -53 -36 53 8 29 -22 2 139 17 -25 -18 24 -56 103 83 44 -9 -74 163 9 37 76 1 -52 -99 7 72
7586G2j55J18M0m7n4j3J10k3j49J4J30p4l8P8M2j05r6J46mo3O5P4o9j08J58P5
$$ 72 -83 35 75 28 -26 -39 71 48 -101 -87 43 -31 -69 9 51 -54 -150 -4 -8 -71 -6 68 -1 -109 49 124
7612A24j78M0K6l4k4m9K5J27k5j30J92n8m9L7j0J8m3n5J01p3m9J28n7K4ROM4q7
$$ 124 -54 -14 12 -22 -46 -95 -70 57 32 -98 94 36 -13 24 14 32 -11 -66 35 -38 -87 41 -16 8 17 23 67 -20
7640b0qJ31j32m1K3J41p9j29R7Q5M8j86O6QK8q3O1k5LK9j8J16j13L2M7o0j55J86
$$ -20 -28 103 -29 -70 -47 94 15 -114 -17 68 116 -70 -4 4 32 -51 10 -15 -12 17 -1 115 2 34 81 21 -134 52
7668E2j2m7p5L9M6J1j1k7Q5j07O2pJ9k5k8Q0l9n7M0J24j99M6K5M3Q5j05N0p6j5
$$ 52 40 -7 -82 -43 3 14 3 -24 61 -46 16 9 28 3 -25 55 16 -41 -1 123 -76 -30 -5 38 123 18 68 -8 -23
7697b3M5m3M4m4j14K64q7j15J31o4N7j39P0M9k6k3Q9K4j25k7R6k4l5rJ13j72P3
$$ -23 22 -21 23 -21 -135 129 42 -73 58 -6 51 -88 -18 31 5 -18 71 95 -30 -57 39 15 -20 -29 84 -88 -15
7724a5j7N5n4m3M2O9l0k8M1Q7j23R9L0r7M5q7P3j08N9k3J03p2N4K5p7o9mJ59p4
$$ -15 -32 23 -31 -74 -32 37 7 -21 20 107 -16 83 113 16 61 -26 47 -61 -2 -25 78 6 60 85 8 -61 -65 94 20
7753B0l5j21K26m5n7N3J4j60J07k4J24j29N2N1j4j09KQ0o6k1J53q1NK6m7M2j37
$$ 20 -15 -136 90 45 -12 41 55 -105 2 -22 102 -27 25 76 62 -47 -45 35 -31 -52 101 20 25 51 4 46 -91
7780i1O6OK5m6L9L4R7p8q5J02Q1j41j04Q5j8m2M0K4O5j02K1N3l3n8L0J36j89P4
$$ -91 -25 -19 6 -40 -1 33 130 52 -33 69 150 9 -95 -10 -28 -70 -30 -6 59 -43 -22 31 -2 -60 -30 106 -83 -9
7808iJ6J4L4j13K9l4o6J02P7j01l5J38k6r9K1L5K6M1j27R6K4m5l4J62k2j68P4
$$ -9 7 21 55 -58 -29 -63 -129 -27 50 -51 -86 52 26 -73 -52 -17 9 50 -77 19 43 -2 -36 126 104 -64 10
7835A0%q0K4J02m6j45J20P3p2N4p0J03Pj86K5J00q9Q9K0P5j22%l7R5n8p5J24K4
$$ 10 10 -70 -46 56 10 -135 -15 58 -14 40 -30 73 80 -106 -81 19 -70 19 39 114 -8 -8 -45 50 -8 -83 41 65
7863F5j23k5K03k02P3r0K14j37jOM4r4L5N9J0p1r0K89j29qj7N1n3l1O1N1j13o5
$$ 65 -58 -83 120 -82 -9 -99 115 -22 -23 -17 27 -67 -32 27 37 -34 -124 165 36 28 11 62 9 -22 39 90 -23 -88
7891h8J69L5j35L8j02Q9q1J23J3l6j56J62R3j85OL3R7k9r3N2k2JN6J60j61j09
$$ -88 81 116 -19 19 -83 6 -75 48 61 25 -131 31 124 -61 -55 -22 75 46 -47 5 -17 -16 40 200 39 -70
7917g0J4J01J0j09N3Q6r5J8L6K0j02J7N2p3o1J08M4j69kMJ91r2j08Q4L1R7j31
$$ -70 -56 45 55 -54 -1 85 -10 8 44 64 -38 -21 31 -42 -103 5 49 -120 -122 -118 73 -19 -127 -43 -12 85 -46
7944d6J48K5j36o8K43j5j76%Ol2j09K03j8O4j83J87j7r3j71J44J02j15o4K07q9
$$ -46 102 127 -9 -77 166 151 -25 -25 -19 -51 -160 43 25 89 -94 93 76 -17 -188 -44 58 -57 -121 86 -3
7969crn3J36p5j17J15J06m2j18r5J27jj77J91J24m5k28J02Q2j62MJ71J20k12K5
$$ -3 -12 -65 71 -4 -121 -6 100 58 -60 -155 -28 -29 -206 -15 109 64 -164 -62 20 -142 -138 33 153 -59 -34
7994c4J37j73P4j6J48p4j12R3l8J6q2Q0J8J1j10N5o2Q6P0O2k96Q2P2L4R7k53J57
$$ -34 103 -70 4 -12 136 62 -50 43 5 21 -61 19 37 48 -62 -7 -69 17 87 149 -147 -65 7 41 138 -115 42
8021D2J2j29J1n1K67j83l7J28m3p7M8J62j53l3J05M5j18o3J25k6j20KK4R4l2J0
$$ 42 54 -75 -64 -115 152 -31 -68 60 17 -60 -12 150 -3 -36 69 114 -4 -67 58 32 -88 -86 -62 32 0 10
8047A0Ol3Kk6J72r3j66K19mj22J7pL1j23L8O3On3o8N4j5N3j2L8Mq6J48Pr8p8J43
$$ 10 16 -17 -15 -41 131 38 -128 91 87 -35 -18 -25 6 -117 -79 -16 -10 -63 -131 -77 -92 -39 -51 -13 -9 -95 53 60 -38 -116 27
8078B7m2K5q3O5ll9J39q0q5N4N3N1q4K9m9P6k7p0J1J5k3M0M0Rm9K0l7Rj24J55
$$ 27 -15 10 -73 -8 -11 -50 89 9 -76 -22 31 82 -2 27 -22 54 27 -43 -32 -17 -40 0 40 49 0 20 -17 -8 -132 23
8108B3J1n3r7J40P4j09m7J24p8l5O5J2Mj55J39N7Mj30J13j7p7n1J39k3q0P7m2
$$ 23 34 -19 -116 24 98 -11 -58 66 -12 -47 18 30 34 -121 18 75 79 -51 62 45 -32 -83 56 33 -47 30 -12
8135a2R5o6j5l8O9j32PK19k30OJ38M1j03o7R9J6p8J2O2N4j63J08Jk4j28J02R3
$$ -12 83 17 2 -36 33 -99 -92 127 -103 -97 41 82 -21 -88 11 27 -51 -39 23 77 -86 22 23 -1 -129 -27 66
8162F6l2q8M6L7n3Q2K0M5j73KJ09j36%KJ02j37O3K8J20j20k3kJ19m2j07N8K9n2
$$ 66 34 -54 -8 29 -24 58 78 123 -50 -48 61 -75 -75 -73 29 -108 -45 -17 103 -17 -40 -42 77 35 -72 -14 15 -37
8190c7k6
$$ -37 -63
8191f3
$$ Imaginary data points
##PAGE= N=2
##DATA TABLE= (X++(I..I)), XYDATA
0@%%%%%%%%%%%%%nJ3j6J6j6K4l2L2l7M5n6O5p2Q5r9J12j24J40j63J86k07K31k61
$$ 0 0 0 0 0 0 0 0 0 0 0 0 0 0 -5 8 -8 8 -8 16 -16 16 -21 24 -32 33 -39 46 -53 59 -65 75 -88 98 -109 122 -139
36a39K94l25L58l98M44m91N38n94O60p28Q01q81R70j070J175j292J428j579J748
$$ -139 155 -170 188 -210 234 -257 281 -313 347 -381 420 -461 509 -561 614 -678 750 -829 919
55I19j943K170k434K743l117L582m173M943n988P489r796J3724k1536M2268j88082
$$ 919 -1024 1146 -1288 1455 -1662 1920 -2253 2690 -3298 4191 -5605 8119 -13417 28851 -159231
70a59231m34595P88339L17134p65060j98713P69853R5313q09582N2362P85352
$$ -159231 -593826 194513 511647 -253413 -452126 317727 413040 -396542 -344180 441172
80D41172j83975p12619K71041O74023l96599o04906N20903M78125n67312l71855
$$ 441172 257197 -455422 -184381 489642 93043 -511863 9040 487165 -80147 -452002
90d52002N85967L00850o48611j82965O90343L7619o72994P3755O41297j66983
$$ -452002 133965 434815 -213796 -396761 293582 331201 -341793 -268038 373259 206276
100B06276o08213K72408N43621l59336m71673M26286M11757n00500l24510N57335
$$ 206276 -401937 -129529 414092 54756 -416917 9369 421126 -79374 -403884 153451
110A53451K04822n69021j01916N70309J7521n77052P7680N57729j72150n13940
$$ 153451 358273 -210748 -312664 257645 275166 -301886 -224206 333523 161373 -352567
120c52567K54592M68581l40234m03616M10675L12753m40722k33664M62179J64657
$$ -352567 -97975 370606 30372 -373244 37431 350184 -90538 -324202 137977 302634
130C02634m94210p5541N02798j8128m81584R3857M60505j71717m28844K52110
$$ 302634 -191576 -267117 235681 217553 -264031 -170174 290331 118614 -310230 -58120
140e8120L65434l01885l00349L31609K54813l78197j92085M17307J05432m17042
$$ -58120 307314 5429 -294920 36689 291502 -86695 -278780 138527 243959 -173083
150a73083l5065M09951k3036m16493J02463L95967j78224l45019K22190L05383
$$ -173083 -208148 201803 178767 -237726 -135263 260704 82480 -262539 -40349 265034
160B65034k65787k69185L22890K03279l55495j30038L59765P6459l69496j7501
$$ 265034 -753 -269938 52952 256231 -99264 -229302 130463 206922 -162574 -180075
170a80075L76205n7364l54420J17590L23034j60836k99516K12004K60620k60425
$$ -180075 196130 138766 -215654 -98064 224970 64134 -235382 -23378 237242 -23183
180b3183k00967K84322J49915l00708j05342L19465M7166l22246J3769L09535
$$ -23183 -224150 60172 210087 -90621 -195963 123502 170668 -151578 -137809 171726
190A71726o3656k97249J12840K77147j62410k39311J98350J99608k26361j64052
$$ 171726 108070 -189179 -76339 200808 38398 -200913 -2563 197045 -29316 -193368
200a93368K55931J18655k75503o5123K78976J6569k77952K9923K72166p7535k53784
$$ -193368 62563 181218 -94285 -159408 119568 136137 -141815 -111892 160274 82739 -171045
211a71045J18035K30063j53999k05291J92547J69210k22266j24518K35780Q4348
$$ -171045 -53010 177053 23054 -182237 10310 179520 -42746 -167264 68516 152864
221A52864k45978m3571K54837m347k50281M8354K35272q3665k19836J21454J96040
$$ 152864 -93114 -136685 118152 113805 -136476 -88122 147150 63485 -156351 -34897 161143
232A61143j57551j60867J78881J29354j93796j01703K12840O2162k23526j6267
$$ 161143 3592 -157275 21606 150960 -42836 -144539 68301 130463 -93063 -109330
242a09330K18988j9390k12470N0674K05768q8125j86068J21267J59215j44888
$$ -109330 109658 90268 -122202 -71528 134240 46115 -139953 -18686 140529 -4359
252d359j35914J67534J08029j86315p0801J92212L6479j93555p735J98466k6265
$$ -4359 -140273 27261 135290 -51025 -121826 70386 106865 -86690 -94425 104041 77776
263G7776j95717O2987J78946r2030j59460J17698J39698j43504j12624J60240
$$ 77776 -117941 -54954 123992 31962 -127498 -9800 129898 -13606 -126230 34010
273C4010Q3321j68713n6614J78593K4571j84550J2319J77336m1344j64891O3777
$$ 34010 117331 -51382 -107996 70597 95168 -89382 -77063 100273 58929 -105962 -42185
284d2185J54402r0209j38130J15904J14790j32909r2337J46584O7803j58654l6284
$$ -42185 112217 22008 -116122 -218 114572 -18337 -110674 35910 103713 -54941 -91225
295i1225J61734O592j58683J7167J56466m3103j49090P0727J32556r2205j14429
$$ -91225 70509 77101 -81582 -64415 92051 48948 -100142 -29415 103141 10936 -103493
306a03493J09402R7054j26563p4240J37942M8954j42818k6020J47564N50j49068
$$ -103493 5909 102963 -23600 -97840 40102 89056 -53762 -79782 67782 68332 -80736
317h0736K8231J40509n1403j28127O9500J17543r0385j01915J09550P9681j19757
$$ -80736 -52505 88004 36601 -91526 -22026 95517 5132 -96783 12767 92448 -27309
328b7309n9271J27313L9195j35470j3228J35925j1782j29545L0542J24385n0444
$$ -27309 -86580 40733 79928 -55542 -68770 67155 55373 -74172 -43630 80755 30311
339C0311j17081P3201J01213q9662q3229J00339O7655j12044m8184J20870K4624
$$ 30311 -86770 -13569 87644 -2018 -85247 15092 82747 -29297 -77481 43389 68013
350F8013j21684m559J20472j3801j19548L5717J12479n6058r9745P0345Q8160
$$ 68013 -53671 -58230 62242 48441 -71107 -35390 77089 21031 -78714 -8369 79791
361G9791q4540p4695R9083N4659j06583l5044J09543J8524j13140O78J13333k1870
$$ 79791 -4749 -79444 19639 74298 -32285 -67329 42214 60738 -52402 -51724 61609 39739
373C9739j06970L9204R9152n4654r0779P1154P7382q4301o0537R1828M5291r8540
$$ 39739 -67231 -28027 71125 16471 -74308 -3154 74228 -10073 -70610 21218 66509 -32031
385c2031k9317J04530J0100j05250Q555J01331k4539r6721M1150Q9450n7134p8179
$$ -32031 -61348 43182 53282 -51968 -43413 57918 33379 -63342 -22192 67258 10124 -68055
397f8055O9224O5655p8768n2644Q7838L6912r4209j9561R6087L524r5445J2081
$$ -68055 1169 66824 -11944 -64588 23250 60162 -34047 -53608 42479 46003 -49442 -37361
409c7361R2782k8170q7057M3126P8736n6021o8677O7049N6800p5917m3267Q2626
$$ -37361 55421 27251 -59806 -16680 62056 6035 -62642 4407 61207 -14710 -57977 24649
421B4649K8652q7133j3336Q8681j623q7488J5913Q4338l0435p8491M4478O9460
$$ 24649 53301 -33832 -47168 41513 39890 -47598 -31685 52653 22218 -56273 -11795 57665
433E7665n5591n9231O4036M9012p2209l6540P8804K1636q1335p845Q1892n416
$$ 57665 2074 -57157 6879 55891 -16318 -52858 25946 47582 -33753 -41598 40294 34878
445C4878q0944J9740P6819l3493o9258M3829O1729n3238n3724O3304M1975p0547
$$ 34878 -46066 -26326 50493 17000 -52258 -8429 53300 62 -53662 9642 51617 -18930
457a8930k8208P3390J5917p5023l848P5927r663p3570K2365O8504l2962o2804
$$ -18930 -47138 26252 42169 -32854 -36702 39225 29562 -44008 -21643 46861 13899 -48905
469d8905M3437N5585n3921m4996O0958L3624o4816k3360O8212J2225p0855P47
$$ -48905 -5468 50117 -3804 -48800 12158 45782 -19034 -42394 25818 38043 -32812 -32065
481c2065P0295j3348o6497K3740O2080l3847n6404M3929M8206n1979l8633N7637
$$ -32065 38230 24882 -41615 -17875 44205 10358 -46046 -2117 46089 -5890 -44523 13114
493A3114K9090o2321j8558O5621O504o6012N410O3675j5320o1042K5103N7059
$$ 13114 42204 -20117 -38675 26946 33450 -32562 -27152 36523 21203 -39839 -14736 42323
505D2323l5302n0161M4165M1377n0349l2814N4983K4033n8964j3387O0769K186
$$ 42323 7021 -43140 1025 42402 -7947 -40761 14222 38255 -20709 -34096 26673 28859
517B8859o0074P448N8789j6925n6075K7133N0101l5554m2954M1793L6264m7471
$$ 28859 -31215 -23767 35022 18097 -37978 -10845 39256 3702 -39252 2541 38805 -8666
529h666k8711N2686J8858n5430q739N5949l15n5751R560N4063j9080n0001K7425
$$ -8666 -37377 15309 34167 -21263 -30002 25947 25632 -30119 -20559 33504 14424 -35577 -8152
542h152M4758l4519l8979M1022L1957m6445k3539M9914J4715n1735n974N2474
$$ -8152 36606 2087 -36892 4130 36087 -10358 -33897 16017 30732 -21003 -26977 25497
554B5497k870n1938J1812M9394k0135m5079K7419L9936l3843l4333L9656K7474
$$ 25497 22627 -29311 -17499 31895 11760 -33319 -5900 34036 193 -34140 5516 32990
566C2990m4032j9356M6513J1181m8034l149M8720n307m7236J3365M3841k0281
$$ 32990 -11042 -30398 16115 27296 -20738 -23887 24833 19526 -27710 -14345 29496 9215
578I215m0188K6915L5989l3391k9867L8142K2689m1157j5700M3784Q158m5318
$$ 9215 -30973 -4058 31931 -1460 -31327 6815 29504 -11653 -27353 16431 24589 -20729
590b0729K0M4566p492m2522J4160M0191k1076l6539K7575L1241l2574k5346L6303
$$ -20729 -20709 23857 16365 -26157 -11997 28194 7118 -29421 -1846 29395 -3179 -28525 7778
603G778J9271l9450j2268M1347M794m1620K146M0903q790l9257J5570L6135k1809
$$ 7778 27049 -12401 -24669 16678 21472 -20148 -18002 22901 14111 -25146 -9576 26559 4750
616D750l1929K6952K7255l1206k1892L4695J5649l7125q992L8316K479l8416L981
$$ 4750 -27179 -227 27028 -4178 -26070 8625 24274 -12851 -21843 16473 18952 -19464 -15483
629a5483L7367j0377l5111J6220L2119k1429k8440K6145K3746l0123j8141L2894
$$ -15483 21884 11507 -23604 -7384 24735 3306 -25134 1011 24757 -5366 -23507 9387
641I387J2331l4559o501L5354L95l5056N604L3760j1209l1710J6511K8690k1355
$$ 9387 21718 -12841 -19342 16012 16407 -18649 -13045 20715 9506 -22204 -5693 22997 1642
654A642k4652K5362K0081k8551j5181L1052R682l2436l968L2662j497l2239P044
$$ 1642 -23010 2352 22433 -6118 -21299 9753 19435 -13001 -16969 15693 14196 -18043 -10999
667a0999L0842j2434k8258J6939K5207k0959k1682K4825J7100k7759j1832K9217
$$ -10999 19843 7409 -20849 -3910 21297 338 -21344 3481 20581 -7178 -19010 10207
679A0207O876k9994j929L0276l503k9285Q569K7359j2831k5201J7007K2295k1043
$$ 10207 17083 -12911 -14840 15436 11933 -17352 -8783 18576 5745 -19456 -2449 19846 -1197
692a197j8123K3878J3664k5716r375K7175M642k7798L87K7214m900k6106R087
$$ -1197 -19320 4558 18222 -7494 -16869 10306 14948 -12850 -12463 14751 9851 -16255 -7168
705g168K4672j3481k2199J7431J8802k0450j5098K2842J1172k4776o678K5669
$$ -7168 17504 4023 -18176 -745 18057 -2393 -17491 5351 16523 -8253 -14931 10738
717A0738K169k5673K051K5270o321k4250J0693K2161j4528j9346J7621J6221k0284
$$ 10738 12907 -12766 -10715 14555 8234 -16016 -5323 16838 2310 -17036 585 16806 -3478
730c478j2619K2350Q517k3482m395K3890M47k3893L628K3127p602k1499J1177
$$ -3478 -16097 6253 14770 -8712 -13107 10783 11230 -12663 -9035 14092 6490 -15009 -3832
743c832J9364j4407j6741J7207J3519j9281j0004K0631O495k1575k809K1991j007
$$ -3832 15532 1125 -15616 1591 15110 -4171 -14175 6456 12951 -8624 -11433 10558 9551
756I551k1701M677K0830q296j9332J1805J7075j4730j4279J6946J1390j8846q114
$$ 9551 -12150 -7473 13357 5061 -14271 -2466 14609 -121 -14400 2546 13936 -4910 -13024
769a3024K0212M467k0737r91K0881k563k0541O328J9219r703j7229J2482J5029
$$ -13024 7188 11655 -9082 -10073 10808 8245 -12296 -5968 13251 3548 -13681 -1199 13830
782A3830j5062j2310J7171R073j8336n931J9011K879j9555N74J9294l943j8258
$$ 13830 -1232 -13542 3629 12702 -5634 -11565 7446 10325 -9230 -8656 10638 6695 -11563
795a1563O878J6906r659j5233J2380J2820j4427j0119J5808P505j7008m584J7846
$$ -11563 -4685 12221 2562 -12671 -291 12529 -1898 -12017 3791 11296 -5712 -10296 7550
808G550J282j7890J836J7422m671j6676P586J5346j0314j3377J2468J1266j4420
$$ 7550 8832 -9058 -7222 10200 5529 -11147 -3561 11785 1471 -11906 562 11828 -2592
821b592q758J6032N814j6990k793J7282j59j7156L123J6542n989j5330Q532J3661
$$ -2592 -11350 4682 10496 -6494 -9287 7995 7836 -9320 -6197 10345 4356 -10974 -2442 11219
835A1219j0606j1901J2608R696j4257p082J5279M382j5804j672J5906j068j5573
$$ 11219 613 -11288 1320 11016 -3241 -10323 4956 9338 -6466 -8138 7768 6700 -8873
848h873L783J4635o083j3481Q258J2045j0316j0150J1948Q079j3260n793J4230
$$ -8873 -5090 9545 3462 -10019 -1761 10284 -32 -10182 1766 9845 -3415 -9208 5022
861E022L276j4790o38J4893k034j4408M469J3607o836j2415R017J0725j0803q790
$$ 5022 8298 -6492 -7130 7763 5729 -8679 -4210 9397 2561 -9854 -837 9888 -915 -9705
875i705J2290O661j3455m285J4130J813j4346O25J4210l090j3557N464J2394p450
$$ -9705 2585 9246 -4209 -8494 5636 7449 -6897 -6272 7938 4848 -8709 -3245 9149 1699
889A699j1006R174R407j0768p399J1904N225j2501l226J2974J048j3154J304J2768
$$ 1699 -9307 -133 9274 -1494 -8893 3011 8236 -4265 -7491 5483 6531 -6623 -5319 7449
903G449l454j2048N420J1099p366r720R035Q017j0256o228J1199M353j1984k261
$$ 7449 3995 -8053 -2633 8466 1100 -8620 415 8432 -1824 -8052 3147 7500 -4484 -6745
917f745J2455Pj2328K025J1979m120j1298O164J0184p944q661R294P018j0428
$$ -6745 5710 5717 -6611 -4586 7393 3273 -8025 -1861 8323 379 -8282 1012 8030 -2398
931b398n232J1366L200j1821j143J1814p95j1592K759J1099m653j0164O298Q852
$$ -2398 -7630 3736 6936 -4885 -6028 5786 4991 -6601 -3842 7257 2604 -7560 -1262 7590
945G590p596p573Q877N996r791m304J0387K512j0645p62J0820j221j0477K971
$$ 7590 -6 -7579 1298 7294 -2497 -6801 3586 6098 -4547 -5309 5511 4290 -6187 -3216
959c216R850m543r068O121P985p493o612Q559N062r390l464J0009J727j0274P2
$$ -3216 6634 2091 -6977 -856 7129 -364 -6976 1583 6645 -2745 -6209 3800 5527 -4747 -4675
974d675J0198j802r846L510R193n136q224O461P037p580n670Q495M222r155k619
$$ -4675 5523 3721 -6125 -2615 6578 1442 -6782 -321 6716 -864 -6534 1961 6183 -2972 -5591
989e591R485R25r465O33R325k197q913L658Q184m971p239O149O150p156m868P878
$$ -5591 3894 4819 -4646 -4013 5312 3115 -5798 -2140 6044 1073 -6166 -17 6133 -1023 -5891 1987
1005A987L493q383k022Q638N37q709R45Q474k359p980L698P351n019o440O064
$$ 1987 5480 -2903 -4925 3713 4250 -4459 -3514 4960 2601 -5379 -1681 5670 651 -5789 275
1020B75N372o916m128P623K720q002j361Q151k9q072J385P812k697p329L971O528
$$ 275 5647 -1269 -5397 2226 4946 -3056 -4417 3734 3705 -4367 -2982 4830 2133 -5196 -1225 5303
1036E303n023n604N917M605o663l462P180K186p454q53P524m36p377J649P029
$$ 5303 280 -5324 593 5198 -1465 -4927 2253 4439 -3015 -3868 3656 3220 -4157 -2508 4521
1051D521k841o446L861N790m816m952N688L824o215k769O688J554o870m24O942
$$ 4521 1680 -4766 -905 4885 69 -4883 805 4629 -1586 -4355 2333 3887 -2983 -3407 3535
1066C535p94o681J924O305l025n756L931N090m807m130N478L172o031k149O334
$$ 3535 2741 -3940 -2016 4289 1264 -4492 -561 4529 -278 -4408 1070 4242 -1789 -3938 2396
1081B396J057o449J17O335j198o126K288N607l114n096L964M361m752l433N248
$$ 2396 3453 -2996 -2879 3456 2258 -3868 -1580 4027 913 -4183 -219 4142 -610 -4043 1205
1096A205K581n676j567N961M84o000N32N778j398n535K438N101l395m470M122
$$ 1205 3786 -1890 -3457 2504 2988 -3012 -2480 3298 1900 -3635 -1197 3904 509 -3961 161
1111A61L752m699k946N221J909n496r86N711N4n633R32N379j886n074K736M511
$$ 161 3913 -786 -3732 1489 3398 -2098 -3084 2627 2681 -2952 -2020 3359 1473 -3601 -865 3646
1127C646l438l916M093L194m618k384N021J534n254n72N271l63n100J194M924
$$ 3646 208 -3708 385 3579 -1039 -3423 1598 3132 -2122 -2694 2577 2214 -2886 -1692 3232
1142C232j983m689K829M088l458l476M116K745m664j899M951J050n100j72N107
$$ 3232 1249 -3440 -611 3477 19 -3457 659 3404 -1260 -3159 1792 2842 -2258 -2430 2677
1157B677p06m932J539M697k379m268L133L683l713l041M133K353m621j473M738
$$ 2677 1971 -2961 -1422 3275 896 -3372 -239 3444 -269 -3310 823 3176 -1445 -2918 1820
1172A820P84m925Q7M892r97m621J751M348k426l846K992L312l531k709L969K047
$$ 1820 2604 -2321 -2234 2658 1661 -2960 -1209 3139 713 -3133 -141 3171 -360 -3069 900 2947
1188B947m331j210M418N52m602K76M555j096m326J784M019k533l609L231L082
$$ 2947 -1384 -2594 1824 2376 -2226 -1950 2605 1509 -2817 -1033 2986 453 -3156 75 3157
1203C157l767k341M046J628m339q89M536R0m518O72M365j347m196K144L641k578
$$ 3157 -610 -2951 1095 2723 -1616 -2505 2031 2121 -2397 -1725 2640 1293 -2903 -759 2882 304
1219C04l301L200K701l564k103L973J339m139p02M272K5m309P44M081j379l819
$$ 304 -2997 203 2904 -660 -2763 1210 2549 -1590 -2292 1980 2005 -2304 -1560 2521 1142 -2677
1235b677K057L446k652k972L143K363l380j886L663J232l930n08M041j69l983
$$ -2677 -620 2826 174 -2798 345 2708 -672 -2558 1105 2337 -1593 -2101 1940 1771 -2212
1250b212R02L827j598l521K154L151k706k648L141K014l472j376L663Q05l857
$$ -2212 -1310 2517 919 -2602 -448 2703 -3 -2651 490 2504 -968 -2344 1319 2124 -1733
1265a733m5L809n47l674J092L527j730l269K278K834k745k275L027J735l229j237
$$ -1733 -1778 2031 1484 -2190 -1098 2429 699 -2570 -292 2542 -203 -2478 549 2284 -945 -2182
1281b182L477O47l574LL445n05l393J155L171j725k794K129K437k584j953K829
$$ -2182 1295 1942 -1632 -1629 1816 1311 -2082 -927 2244 519 -2275 -146 2291 -293 -2246 583
1297E83J592l204r24L332L05l328K48L240q44l015J340K860j916k433K266K034
$$ 583 2175 -1029 -1953 1379 1684 -1644 -1396 1844 1000 -2015 -675 2185 269 -2164 102 2136
1313B136k618j594K977J104l191m52L026P8l068L62L049r49k840J492K521j883
$$ 2136 -482 -2076 901 2005 -1186 -1638 1388 1466 -1602 -1240 1809 860 -1980 -488 2033 150
1329A50k156K162J847k431j470K741Q72k801m57K888j32k800N51K720j022k521
$$ 150 -2006 156 2003 -428 -1898 843 1715 -1086 -1543 1345 1213 -1587 -1036 1684 662 -1859
1345a859J421K343j779k013K193J502k383j056K585O30k781j30K790l37k804Q98
$$ -1859 -438 1905 126 -1887 306 1808 -575 -1631 954 1584 -1197 -1327 1463 1126 -1678 -780
1361g80K542j272k336J674J928k069j537K381J143k473p50K579K92k510L9K684
$$ -780 1762 490 -1846 -172 1756 -313 -1850 531 1674 -799 -1549 1030 1322 -1188 -1149 1535
1377A535o98k490J127K171j340k001J745J632k010j384K232R65k306o61K588J55
$$ 1535 837 -1653 -526 1645 305 -1696 49 1681 -329 -1713 519 1484 -822 -1483 1105 1260
1393A260k507L32K270o33k153R84K053j396j862J702J608k030j071K037Q27k315
$$ 1260 -1247 -915 1355 722 -1431 -447 1606 210 -1652 50 1658 -372 -1443 594 1421 -894
1409h94k36K319j66k350N11K193p52k130J198J843j543j596J816J261j945q74
$$ -894 -1130 1189 1023 -1327 -816 1377 625 -1505 -307 1536 -7 -1603 213 1474 -471 -1345
1425a345J989O41k255j56K300k41k264O67K087j010j927J251J724j524j452J864
$$ -1345 644 1285 -970 -1126 1174 933 -1331 -664 1423 413 -1514 -263 1461 -63 -1515 349
1441C49J024j978o81K123L15k105O6J981l24k026O88J921r92j763J255J617j544
$$ 349 1373 -605 -1286 837 1152 -953 -887 1094 770 -1256 -568 1353 361 -1402 -147 1470 -74
1458g4j324J729R32j836n66J936K30j988J27K005m86k062R04J781j090j634J420
$$ -74 -1398 331 1263 -573 -1139 797 1027 -961 -834 1171 685 -1377 -473 1308 218 -1416 4
1475DJ312j615j072J794Q21j919n14K137l5k008L02K016p11j725Q75J568j099
$$ 4 1316 -299 -1371 423 1244 -675 -1189 948 913 -1095 -793 1223 512 -1213 -338 1230 131
1492A31j466J478J190j730q74J812N28j815k71J917p2j846K85J881p32j643R87
$$ 131 -1335 143 1333 -397 -1271 541 1069 -746 -1017 900 828 -1018 -733 1148 416 -1227 -240
1509b40J494j224j283J431R94j471q08J590N83j820j50J840j84j752N32J552q74
$$ -240 1254 30 -1253 178 1172 -299 -1107 483 1066 -754 -904 936 752 -1000 -468 1084 210
1526B10j427J148J358j371j104J423R85j718n83J787K27j801J25J784m93j678
$$ 210 -1217 -69 1289 -82 -1186 237 1222 -496 -1079 708 935 -866 -741 1043 550 -1128
1542a128P16J480r00j363J180J195j446r01J563N42j600j88J604rj559J55J551
$$ -1128 -412 1068 168 -1195 -15 1180 -266 -1167 396 938 -662 -850 754 745 -814 -659 892
1559H92l47j535M31J624r18j313J251J032j336q01J349O54j582l01J626r6j457
$$ 892 545 -990 -559 1065 147 -1166 85 1117 -219 -1020 329 983 -599 -900 726 630 -827
1576h27L03J473n30j330O91J308j037j184J193R88j317o76J476K83j475j47J578
$$ -827 -524 949 419 -911 -220 1088 51 -1133 60 1048 -269 -945 531 814 -661 -808 770
1593G70j52j579O07J339o13j450R37J238j247r04J258P76j302n32J251M28j474
$$ 770 618 -961 -354 985 372 -1078 -141 1097 -150 -1054 204 980 -322 -854 397 825 -649
1610f49j77J572j24j434M05J366o37j359R49J107j123q53J157Q54j403m82J391
$$ -649 -826 746 622 -812 -407 959 322 -1037 -88 1019 -104 -957 200 1054 -349 -831 560
1627E60K14j464J19J381k80j444N56J242p03j100Q83J029j145p30J261M56j301
$$ 560 774 -690 -571 810 530 -914 -358 884 181 -919 -36 993 -152 -882 379 835 -466
1644d66l41J379P6j422K18J379l88j293N46J189o69j103R03R48j124p13J194N30
$$ -466 -807 572 648 -774 -556 823 435 -858 -312 877 208 -895 8 956 -168 -881 313 843
1662H43j267l01J238J25j276J30J282l29j282N37J194p20j099R66Q76j144o56
$$ 843 -424 -725 513 638 -638 -508 774 445 -837 -300 894 174 -925 41 917 -227 -883
1679h83J195M16j232k25J262K0j261K42J303n01j260P71J032q57r02R69P71j137
$$ -883 312 728 -504 -729 533 553 -708 -466 837 336 -924 -153 879 22 -880 89 860 -277
1697b77n71J195M25j305j16J310j50j276L19J325m95j241P22R66p80q83Q64Q46
$$ -277 -848 347 772 -533 -649 661 511 -765 -446 879 384 -857 -135 831 51 -832 32 878
1715H78j083o47J175M30j171k32J241n4j210K04J217l77j193O78J021q67q61R81
$$ 878 -205 -852 323 753 -418 -650 591 537 -673 -469 748 371 -822 -144 877 10 -851 130
1733A30O71j046o32J235L19j266k2J312j95j223L06J206n14j137P33R69q30q18
$$ 130 801 -245 -877 358 677 -589 -611 701 506 -717 -411 795 281 -856 -123 846 16 -802
1751h02R68P08j100n17J145K53j141j23J217r8j189K62J173m81j042N84R67p39
$$ -802 166 874 -226 -743 402 655 -486 -609 608 510 -679 -417 756 275 -767 -183 784 45
1769D5q45Q61P39j108m03J042L25j096j25J125n1j194L00J156n70j005O47R57
$$ 45 -800 61 800 -308 -711 331 656 -440 -565 560 509 -685 -385 771 201 -804 -157 800
1787H00q13p66R39N78r84n19J197J75j141PJ114j64j133M02J074o09r91P74Q90
$$ 800 -13 -779 160 738 -246 -765 432 607 -534 -527 587 423 -710 -308 766 157 -834 -60 830
1806H30q50p40R65N30j012m08J066L08j177j4J120k04j055L29J035n16r40O27
$$ 830 -20 -760 205 735 -277 -685 381 689 -488 -502 618 414 -641 -312 723 207 -733 -106
1824a06Q87q99o26R43N12j020l34J080J12j054L6J074j81j105L66J044n87q76
$$ -106 781 -118 -744 199 711 -309 -643 437 549 -505 -469 605 424 -681 -315 729 142 -734
1842g34P03P46q75n44R16M57r88k90R68J96j060P8R94k70r52L65R20n30q10O58
$$ -734 -31 715 -160 -704 212 669 -319 -609 359 555 -505 -427 567 297 -655 -290 630 100 -710 -52
1862e2Q17r11n18Q66M29q96l21J006R9r92K1R74j84r76L69R60n85p94P28O40q17
$$ -52 765 -146 -664 202 631 -265 -586 420 519 -473 -452 522 338 -638 -269 691 106 -688 40 680 -137
1883a37n15Q90L54r05k28J002Qr62M4J108m16q61M08Q64n49q08P16O38p85m80
$$ -137 -652 238 592 -313 -541 461 469 -493 -449 659 243 -618 -210 654 105 -703 13 651 -134 -614
1903f14Q19L92r57j66R77L6j019J48R09k96q27M53Q06n97p24P35N63q01m48Q55
$$ -614 205 597 -360 -526 451 487 -532 -384 525 229 -598 -145 661 64 -660 75 638 -163 -611 244
1923B44L30r73j06R67l6r22J28R09k83q83M78P78o07o92P53N48q39l79Q65J94
$$ 244 574 -399 -505 462 426 -496 -368 541 258 -625 -147 631 24 -668 85 633 -206 -585 280 474
1943D74q46r2R29p9q66J60Q93l85p49M15P38n36o77P09M99q19l95R28K02r11q0
$$ 474 -372 -464 465 386 -480 -320 573 188 -561 -146 592 56 -621 88 587 -232 -627 301 503 -408 -488
1964d88R36l3r22J98Q50m14p38N01P16o30n31O54M22p39l30P95K01q47Q9P31m1
$$ -488 448 415 -507 -309 541 127 -611 -110 606 -24 -555 99 521 -218 -548 247 448 -399 -310 421 380
1985C80q76K36Q34m34p08N06O48n85n38O49M31p79j90O84J64p58p5Q67j14q14
$$ 380 -496 -260 574 140 -568 -62 586 1 -537 112 543 -236 -426 258 422 -336 -411 456 342 -472
2005d72K21P15l53o60M89O12o33l88O10K83o77j37N87J25o62KP19j62o32K67N80
$$ -472 -251 464 111 -549 -60 552 -81 -469 141 424 -253 -390 197 322 -340 -338 381 219 -413 -146 434
2026D34l28o05M74M57n28l32N38K20n12j82O20Q0p02P5O18o9o26K35N15k64o13
$$ 434 106 -499 -25 432 -96 -428 110 330 -182 -364 256 336 -366 -291 327 258 -368 -133 382 118 -495
2047d95N07M23m39m57N66L16o22j48O24Rn85M4N86j87n04K60N31m08m55M64L03
$$ -495 12 435 -4 -461 105 421 -201 -349 275 284 -301 -257 329 142 -362 -102 429 21 -434 30 333
2068C33n07j89N08J80n62j6N31n6m85N5N58j93n37L49M22l40m03L76L69m47l14
$$ 333 -174 -363 145 325 -237 -253 278 222 -263 -208 350 157 -380 -31 391 51 -352 24 393 -54 -368
2089c68N57R0m69p7M81m1m70J34M84k26m30K52M28m33k10L73K45m26j95L90J80
$$ -368 189 279 -190 -267 214 173 -297 -163 321 95 -335 -83 345 -88 -298 75 320 -106 -301 89 269
2110B69n09RN16q6n16J57N01k99l74L34K98l79k30L86J84l79j91N10N8m70R8L61
$$ 269 -240 -231 285 199 -317 -160 341 42 -332 2 300 -79 -309 77 261 -118 -309 201 259 -211 -113 248
2132B48j29l81J91L59k30l89L11K96l17k70M23J42l72j43M36L6m93J18M69k02
$$ 248 119 -262 -71 288 58 -331 -20 276 -41 -311 112 254 -118 -261 175 211 -282 -164 305 103
2152A03m02K51K75k17l17L62K38k85k67L45J40m03n5L98j9m42J22M54k46l28J93
$$ 103 -299 -48 227 10 -307 55 293 8 -259 86 226 -177 -232 166 147 -295 -173 281 35 -293 -100
2173a00L45k22k71L25K28l95j35L61N1l14o4M23q9l92J73L05j59l41K88K13k94
$$ -100 245 23 -248 77 305 -90 -225 136 187 -127 -191 232 143 -249 -76 229 70 -271 17 230 -64
2194f4j68K78K09l98q0L34Q6l89L9K86m8k88J72K74j77l23K51K38l03j37K65J30
$$ -64 -232 46 255 -143 -223 111 197 -192 -153 133 85 -203 -31 243 66 -257 -6 232 -71 -208 57 187
2216A87k39j53L74N4m21Q1L01j08l03J50K70j08l16J82K46k53o9J92R9k16j15
$$ 187 -52 -205 169 223 -198 -117 184 76 -227 -77 193 85 -231 -49 197 -56 -125 67 166 -50 -165
2237a65L10o5k67M1L18o1k54J36J85j54k31J80K11j68k13L42K9k36p1J83R6k63
$$ -165 145 80 -187 -146 172 111 -143 -7 178 24 -207 -27 184 16 -197 145 174 -62 -133 50 146 -117
2259a17J2K23Mk53O8J97n6k44J35J84j01j90K07Q1k42l2K41j3k15k7K42Pl13Q8
$$ -117 -105 118 122 -131 -63 134 78 -166 -31 153 52 -138 69 150 -92 -124 117 104 -111 -138 104 111 -202 -114
2283a14K51j04j63J80O7r6j78K73O6k40j03K79l1j58j23K47L4k14J03P3jj48M2
$$ -114 137 33 -130 50 117 21 -157 116 182 -58 -161 118 87 -71 -194 53 87 -127 -24 49 48 -100 -58
2306e8K16j14j74J12J29j79l3J84R6k61n1K17l7j18K5J64m1k16P8K08j70j17R3
$$ -58 158 44 -130 -18 111 -68 -101 83 179 -82 -133 84 47 -71 -46 118 77 -139 -61 147 -23 -140 -47
2329d7J83j97r9K09O0k18nJ36J17k40L9K17n5j86L0K24j33j39J06L4n4j21J67
$$ -47 136 -61 -160 49 109 -109 -114 22 139 -101 -62 155 100 -86 -56 168 35 -104 2 36 -18 -139 28
2352B8J26j73n9J21l3j06qK45m5k23Q8J34m9j64J24J22j96nJ30J5r2n1J37O1k88
$$ 28 154 -19 -78 43 10 -96 -104 141 96 -127 -39 95 46 -118 6 128 -68 -73 57 72 -20 -71 66 127 -161
2377a61M7K42p8j63M6K02p8j66N5J59j49r4K48j6r7j85J59J37k64K9K09Mk34M4
$$ -161 -114 128 50 -113 -67 135 57 -109 -54 105 -44 -138 110 94 -3 -188 -29 108 -156 -127 82 86 -148 -104
2401a04K71j35p6j5J78j21j69J35J32o4j47J45J53k04j25K46Nk18O6Q9lk38J59
$$ -104 167 32 -44 -59 119 -2 -171 -36 96 32 -115 30 183 -21 -146 100 105 -113 -47 42 39 -199 -40
2424d0J82j77k44L08J91k98j75L11O9j73j03K55J17l84O4K13j32j30M3K61Jl50
$$ -40 142 -35 -279 29 220 -78 -253 58 127 -46 -149 106 223 -161 -97 116 -16 -146 -103 158 159 -191
2446a91J31K80k08j67J70J64l32o6K77Q6l73M7K11j2j32RL13j83l19L07K90l73
$$ -191 -60 220 12 -155 15 179 -153 -219 58 144 -229 -182 29 17 -115 -106 207 24 -295 12 302 -71
2468g1j64K57J54l16NK27R0l32q4M37o6l68K43L19l12k51J89L39l10j91K14J95
$$ -71 -235 22 176 -140 -135 92 182 -150 -234 203 137 -231 12 331 19 -232 -43 296 -14 -205 9 204
2490B04k86j44M38k3l69J2K97J0l93J95K31j45l07J66K62j62k08L37Q5k91p3L28
$$ 204 -82 -226 212 189 -180 -168 129 139 -254 -59 172 27 -280 -114 148 -14 -222 115 200 -91 -164 164
2512A64N5m42k2M88j64k69J16L40k57k66K05L06k38l18M47J79m66j24M58M9m96
$$ 164 219 -223 -245 243 79 -190 -74 266 9 -257 -52 254 16 -302 145 324 -142 -266 192 241 -255
2533b55M6N34k33l62J67L60k72l06K89K46l02j52L31R3l04j21M16P0n16J51L64
$$ -255 -209 325 92 -270 -103 257 -15 -321 -32 214 -88 -240 91 184 -120 -241 175 245 -271 -120 244
2554B44j64l62K11M24l91k32K43K35k02k69L38J53l81p3M24pm45J27L88j53l89
$$ 244 80 -282 -71 353 -38 -270 -27 208 6 -263 75 228 -153 -226 198 191 -254 -127 261 108 -281
2575b81K32K74k48k59L10K36m08j38M35P7m60L4M87j20l95M1M55j96l97K99L41
$$ -281 -49 225 -23 -282 28 264 -144 -282 153 230 -230 -196 291 171 -224 -183 272 76 -321 -22 319
2596C19l34k68L37K22l95j48L99R4m46L8M61p1m83K52L40k69l18K80K83l54k29
$$ 319 -15 -283 54 276 -119 -267 132 226 -220 -182 279 208 -275 -23 317 48 -270 10 293 -61 -290
2617b90L99J49l51j85M24O0m29K2M48r0m28K37L29k84l52L13K92l64j88M30J41
$$ -290 109 258 -93 -278 146 206 -223 -201 247 157 -271 -34 295 11 -341 -28 264 -100 -288 142 283
2638B83m34n7L95Lm02M2M45j65m07K11L34k26k89L30K18l71j24L77P4m33k1M80
$$ 283 -151 -208 187 190 -212 -170 275 110 -297 -86 248 22 -267 63 281 -90 -214 163 237 -196 -217 263
2660B63j58l80R6M37j46l86K49K89l27j65L05K28l96j70M73K8m64L2M32j33l59
$$ 263 105 -275 -179 258 112 -274 -25 264 -63 -228 77 305 -91 -261 212 240 -224 -192 240 107 -252
2681b52J12M02k23l42K92K93l15k77L83J44l89p1M33M6m13j2M65k19l77K28L28
$$ -252 -140 262 39 -303 -11 282 -33 -310 73 217 -172 -243 190 236 -177 -189 276 57 -320 -92 236
2702B36k32k97L39K34l60k00L64J82m22n6L49J2l82J17M40j97m16J73L96k69k62
$$ 236 4 -293 46 280 -80 -280 84 266 -156 -212 137 149 -233 -116 324 127 -289 -116 280 11 -251
2723b51K00L22l59q7L20K3k94k05N54j62l23J05L95k06l04K53K54k04k67J76K94
$$ -251 -51 271 -88 -175 145 168 -126 -331 223 61 -262 -157 238 32 -272 -19 235 31 -236 -60 234
2744B34k80k03K75J88m15o8M69q1m02K19K46j54l72K70L12k47l23L29K11l00j72
$$ 234 -46 -249 26 214 -201 -269 200 119 -283 -64 182 28 -344 -74 238 -9 -332 -3 208 -92 -264
2765b64M46N4m22n6M62r1k99R9J74K6l67K67K55l62k43M15L7j39j76L66N2m45
$$ -264 182 236 -186 -242 220 129 -170 -71 103 129 -238 29 284 -78 -321 94 131 -8 -184 182 234 -211
2787b11J9K97o6l03K44L13l03k93K36L56l78j44K97K30m34JK12J30m36N3L69j98
$$ -211 -192 105 39 -264 -20 293 -10 -303 -67 289 -89 -233 64 294 -140 -139 73 203 -233 -180 189 -9
2809ij98O4L36j61k00J43K90k45k64M56Mk85j46L44J30l18q6K49J5l47J46K85
$$ -9 -207 -143 193 32 -168 -25 265 20 -244 212 216 -69 -215 129 259 -59 -145 104 119 -228 -82 203
2831B03j48j93J38K96k87k13K77K14l23k08L82N1l41J09K24k1l36J26J53n7j51
$$ 203 55 -138 0 296 9 -204 73 287 -36 -244 138 189 -152 -43 181 160 -176 -50 103 46 -105
2852a05J57K20l29j37L50J00l70j00M60j7n03J42L24Rl90J18L20k32j77R4J75
$$ -105 52 272 -57 -194 156 256 -114 -214 246 229 -274 -132 192 201 -189 -71 249 17 -160 -66 109
2873A09j04k55L06O6k97k9L91p8l90J93K60j35k72K11K53k26k37L21L3j70j52
$$ 109 5 -250 56 122 -175 -204 187 109 -281 -88 172 37 -235 -24 229 3 -234 87 120 -50 -202
2894b02K71R0k90l5K60P0l76J09K95q0l39J33L48k33k08K19J83l40k30M14Q1l41
$$ -202 69 159 -131 -166 94 164 -212 -103 192 112 -227 -94 254 21 -187 32 215 -125 -355 59 140 -201
2916b01k3L67L7k66j3L29j64k61J12L64k03l39K67J75k97j62L80J40m14l7L96
$$ -201 -224 143 180 -86 -99 230 66 -195 -83 281 78 -261 6 181 -116 -278 102 242 -172 -209 187
2937A87Rm07P2L87j80l47K79L09l03k62L61J64l21j27L17R4l76j12M94q3m03J58
$$ 187 196 -211 -139 248 68 -279 0 309 6 -256 105 269 -52 -179 138 232 -144 -256 238 155 -248 -90
2959i0K75j00k65Q7M60l60l42L47K01l35j85M00J13k98r4L71j29k59j5O10l08
$$ -90 185 85 -180 -93 367 7 -335 12 213 -122 -307 93 206 -92 -186 185 56 -203 -218 392 84
2980H4l87L14K23j90l69M40J59l76j83L44J24l87oL75J2m33L8N05k05l08K76K13
$$ 84 -303 11 234 44 -325 115 274 -102 -285 59 183 -204 -210 165 177 -256 -218 287 82 -226 50 263
3002B63k57k51L16J13l28q0L28J88n21P7L36o2l56P1M57j75l86J86L68k95k17
$$ 263 6 -245 71 184 -144 -224 104 292 -229 -152 184 122 -234 -163 294 119 -267 -81 287 -8 -225
3023b25J96K97l94j29M01R4m05M5L73j15m42J06M89j96m32K85L28l11k93L60L01
$$ -225 -29 268 -126 -255 146 240 -165 -120 253 138 -304 -198 291 95 -337 -52 276 -35 -328 32 333
$$ [...]
8191G8
##END NTUPLES=NMR FID
##END=
