##TITLE=1H_AM-NV76
 
 8 sc, 
 27.10.2023
##JCAMPDX= 6.0         $$ Bruker NMR JCAMP-DX V2.0
##DATA TYPE= NMR FID
##DATA CLASS= NTUPLES
##ORIGIN= UXNMR, Bruker Analytische Messtechnik GmbH
##OWNER= root
$$ XWIN-NMR		Version 3.5
$$ Fri Oct 27 15:07:43 2023 Russian Standard Time (UT+4h)  she@DPX200
##.OBSERVE FREQUENCY= 200.13135
##.OBSERVE NUCLEUS= ^1H
##.DELAY= (6, 6)
##.ACQUISITION MODE= SIMULTANEOUS
##.ACQUISITION SCHEME= undefined
##.AVERAGES= 8
##.DIGITISER RES= 18
##SPECTROMETER/DATA SYSTEM= spect
##.PULSE SEQUENCE= zg30
##.SOLVENT NAME= D2O
##.SHIFT REFERENCE= (INTERNAL, D2O, 0, 15.7039)
##AUDIT TRAIL= $$ (NUMBER, WHEN, WHO, WHERE, WHAT)
$$ ##TITLE= Audit trail, XWIN-NMR		Version 3.5
$$ ##JCAMPDX= 5.01
$$ ##ORIGIN= Bruker BioSpin GmbH
$$ ##OWNER= she
$$ F:/spectra/data/she/nmr/H-F/1/audita.txt
$$ ##AUDIT TRAIL=  $$ (NUMBER, WHEN, WHO, WHERE, WHAT)
(   1,<2023-10-27 15:06:57.00 +0400>,<she>,<DPX200>,
      <created by zg, POWCHK disabled, PULCHK disabled
       configuration hash MD5:
       00 E9 B6 7A A2 85 ED C7 34 08 36 98 17 FE 4E 26
       data hash MD5: 16K
       FA 44 A5 52 A0 75 7B 57 34 15 BE E9 47 E1 37 32>)
$$ ##END=
$$ 
$$ hash MD5
$$ 2A 04 6C EF C3 F3 BA B8 6D 5B 21 55 71 DE EF 09
##$RELAX= 
##$RELAX= 
##$RELAX= 
##$RELAX= 
##$RELAX= 
##$RELAX= 
$$ Bruker specific parameters
$$ --------------------------
##$DU= <F:/spectra>
##$EXPNO= 1
##$NAME= <H-F>
##$PROCNO= 1
##$TYPE= <nmr>
##$USER= <she>
##$AMP= (0..31)
100 100 100 100 100 100 100 100 100 100 100 100 100 100 100 100 100 100 
100 100 100 100 100 100 100 100 100 100 100 100 100 100 
##$AQSEQ= 0
##$AQ_mod= 1
##$AUNM= <au_zg>
##$AUTOPOS= <>
##$BF1= 200.13
##$BF2= 200.13
##$BF3= 200.13
##$BF4= 200.13
##$BF5= 200.13
##$BF6= 200.13
##$BF7= 200.13
##$BF8= 200.13
##$BYTORDA= 1
##$CFDGTYP= 0
##$CFRGTYP= 5
##$CHEMSTR= <none>
##$CNST= (0..31)
1 1 145 1 1 1 1 1 1 1 1 1 1 1 1 1 1 1 1 1 1 1 1 1 1 1 1 1 1 1 1 1 
##$CPDPRG= <>
##$CPDPRG1= <>
##$CPDPRG2= <>
##$CPDPRG3= <>
##$CPDPRG4= <mlev>
##$CPDPRG5= <mlev>
##$CPDPRG6= <mlev>
##$CPDPRG7= <mlev>
##$CPDPRG8= <mlev>
##$CPDPRGB= <>
##$CPDPRGT= <>
##$D= (0..31)
0 1.2 0 0 0 0 0 0 0 0.06 0 0.03 0 0 0 0 0.0002 0 0 0 0 0 0 0 0 0 0 0 0 
0 0 0 
##$DATE= 1698404816
##$DBL= (0..7)
120 120 120 120 120 120 120 120 
##$DBP= (0..7)
150 150 150 150 150 150 150 150 
##$DBP07= 0
##$DBPNAM0= <>
##$DBPNAM1= <>
##$DBPNAM2= <>
##$DBPNAM3= <>
##$DBPNAM4= <>
##$DBPNAM5= <>
##$DBPNAM6= <>
##$DBPNAM7= <>
##$DBPOAL= (0..7)
0.5 0.5 0.5 0.5 0.5 0.5 0.5 0.5 
##$DBPOFFS= (0..7)
0 0 0 0 0 0 0 0 
##$DE= 6
##$DECBNUC= <off>
##$DECIM= 32
##$DECNUC= <off>
##$DECSTAT= 4
##$DIGMOD= 1
##$DIGTYP= 9
##$DL= (0..7)
0 120 120 120 120 120 120 120 
##$DP= (0..7)
150 150 150 150 150 150 150 150 
##$DP07= 0
##$DPNAME0= <>
##$DPNAME1= <>
##$DPNAME2= <>
##$DPNAME3= <>
##$DPNAME4= <>
##$DPNAME5= <>
##$DPNAME6= <>
##$DPNAME7= <>
##$DPOAL= (0..7)
0.5 0.5 0.5 0.5 0.5 0.5 0.5 0.5 
##$DPOFFS= (0..7)
0 0 0 0 0 0 0 0 
##$DQDMODE= 0
##$DR= 18
##$DS= 0
##$DSLIST= <SSSSSSSSSSSSSSS>
##$DSPFIRM= 0
$$ [...]
##$SUBNAM2= <"">
##$SUBNAM3= <"">
##$SUBNAM4= <"">
##$SUBNAM5= <"">
##$SUBNAM6= <"">
##$SUBNAM7= <"">
##$SUBNAM8= <"">
##$SUBNAM9= <"">
##$SW= 18.05172834244
##$SWIBOX= (0..15)
0 0 2 0 0 0 0 0 0 0 0 0 0 0 0 0 
##$SW_h= 3612.71676300578
##$TD= 16384
##$TD0= 1
##$TE= 0
##$TE2= 300
##$TE3= 300
##$TEG= 300
##$TL= (0..7)
0 120 120 120 120 120 120 120 
##$TP= (0..7)
150 150 150 150 150 150 150 150 
##$TP07= 0
##$TPNAME0= <>
##$TPNAME1= <>
##$TPNAME2= <>
##$TPNAME3= <>
##$TPNAME4= <>
##$TPNAME5= <>
##$TPNAME6= <>
##$TPNAME7= <>
##$TPOAL= (0..7)
0.5 0.5 0.5 0.5 0.5 0.5 0.5 0.5 
##$TPOFFS= (0..7)
0 0 0 0 0 0 0 0 
##$TUNHIN= 0
##$TUNHOUT= 0
##$TUNXOUT= 0
##$USERA1= <user>
##$USERA2= <user>
##$USERA3= <user>
##$USERA4= <user>
##$USERA5= <user>
##$V9= 5
##$VALIST= <valist>
##$VCLIST= <CCCCCCCCCCCCCCC>
##$VD= 0
##$VDLIST= <DDDDDDDDDDDDDDD>
##$VPLIST= <PPPPPPPPPPPPPPP>
##$VTLIST= <TTTTTTTTTTTTTTT>
##$WBST= 1024
##$WBSW= 4
##$XGAIN= (0..3)
0 0 0 0 
##$XL= 0
##$YL= 0
##$YMAX_a= 561231
##$YMIN_a= -609297
##$ZGOPTNS= <>
##$ZL1= 120
##$ZL2= 120
##$ZL3= 120
##$ZL4= 120
##$ABSF1= 10
##$ABSF2= 0
##$ABSG= 5
##$ABSL= 3
##$ALPHA= 0
##$AQORDER= 0
##$ASSFAC= 0
##$ASSFACI= 0
##$ASSFACX= 0
##$ASSWID= 0
##$AUNMP= <proc_1d>
##$AZFE= 0.1
##$AZFW= 0.1
##$BCFW= 1
##$BC_mod= 2
##$BYTORDP= 1
##$COROFFS= 0
##$CY= 11.3945322036743
##$DATMOD= 1
##$DC= 2
##$DFILT= <>
##$DTYPP= 0
##$F1P= 15.7292609196834
##$F2P= 12.9074282941183
##$FCOR= 0.5
##$FTSIZE= 0
##$FT_mod= 4
##$GAMMA= 1
##$GB= 0.15
##$INTBC= 1
##$INTSCL= 1
##$ISEN= 128
##$LB= 0.24
##$LEV0= 0
##$LPBIN= 0
##$MAXI= 10000
##$MC2= 0
##$MEAN= 0
##$ME_mod= 0
##$MI= 1.114404
##$NCOEF= 0
##$NC_proc= 0
##$NLEV= 6
##$NOISF1= 3.799351
##$NOISF2= 2.8
##$NSP= 1
##$NTH_PI= 0
##$NZP= 0
##$OFFSET= 15.70392
##$PC= 1
##$PHC0= -23420.56
##$PHC1= 8.05272
##$PH_mod= 1
##$PKNL= yes
##$PPARMOD= 0
##$PSCAL= 0
##$PSIGN= 0
##$REVERSE= no
##$SF= 200.130013532006
##$SI= 16384
##$SIGF1= 3
##$SIGF2= 2
##$SINO= 400
##$SIOLD= 16384
##$SREGLST= <1H.CDCl3>
##$SSB= 0
##$STSI= 0
##$STSR= 0
##$SW_p= 3612.71676300578
##$SYMM= 0
##$S_DEV= 0
##$TDeff= 0
##$TDoff= 0
##$TI= <>
##$TILT= no
##$TM1= 0
##$TM2= 0
##$TOPLEV= 0
##$USERP1= <user>
##$USERP2= <user>
##$USERP3= <user>
##$USERP4= <user>
##$USERP5= <user>
##$WDW= 1
##$XDIM= 8192
##$YMAX_p= 0
##$YMIN_p= 0
$$ End of Bruker specific parameters
$$ ---------------------------------
##NTUPLES= NMR FID
##VAR_NAME=  TIME,          FID/REAL,        FID/IMAG
##SYMBOL=    X,             R,               I
##VAR_TYPE=  INDEPENDENT,   DEPENDENT,       DEPENDENT
##VAR_FORM=  AFFN,          ASDF,            ASDF
##VAR_DIM=   8192,          8192,            8192
##UNITS=     SECONDS,       ARBITRARY UNITS, ARBITRARY UNITS
##FACTOR=    0.0002768,     1,               1
##FIRST=     0,             0,               0
##LAST=      2.2672688,     0,               0
##MIN=       0,             -609297,         0
##MAX=       2.2672688,     561231,          0
$$ Real data points
##PAGE= N=1
##DATA TABLE= (X++(R..R)), XYDATA
0@%%%%%%%Qj6J6j6K2l0L2m0N6p1Q0r5J18j44J74k05K43k89L39l90M50n23O03o89
31c67P86q97J020j150J294j459J640j834K045k280K539k819L122l455L821m220
47b214M653n126N651o227O858p556Q332r201J0173j1272J2530j3982J5677j7687
61i391K0123k3143K6995l2111L9277n0090O8471j07707L29092l85490m76750R18571
73C17847J21411p35805j61004Q73160m0367q72614K35973P96810l94899o56992
83e16480M32121O45590o00022n13708P16359L23712p27854j77818O95158J20218
93C97276p63110L5561P74910k24090o90182L47068N85447m06138n38052N14113
103C2803M48524o17812l05382O59725J66848o56506o5092O67838n1296o67699
$$ y = [0, 0, 0, 0, 0, 0, 0, 0, 8, -8, 8, -8, 14, -16, 16, -24, 32, -39, 41, -54, 64, -80, 94, -111, 132, -157, 182, -208, 242, -281, 322, -367, 419, -478, 542, -608, 686, -773, 867, -967, 1078, -1202, 1337, -1482, 1640, -1815, 2006, -2214, 2439, -2687, 2964, -3263, 3595, -3961, 4371, -4830, 5343, -5929, 6601, -7381, 8296, -9391, 10732, -12411, 14584, -17527, 21750, -28340, 40131, -67576, 261516, -123974, -600724, 317847, 439258, -296547, -457551, 415609, 375242, -497372, -261399, 535411, 140512, -516480, -84359, 561231, -38791, -552499, 163860, 487572, -240282, -418100, 277058, 397276, -365834, -330273, 444637, 220547, -469635, -122567, 462880, 56742, -481310, 32803, 481327, -136485, -441867, 217858, 384706, -271800, -336892, 330946, 279650, -388049]
113c88049J86207O26134l08904n50374M00531M68183m78580l77227N46602K67696
123C92219n88424j49659N96147M7803n97735N3242N98189j79490n55920K97398
133h6230M67609l64969l86210M10049L24299m71912k38891N24724J24595n34555
143b31491k0570N24800p2840n08120J71951M63977k55206m04529L15077L52728
153C35777l78508k89198M44347J92648m77147r0007M74572R353m71311P0685M64046
164B85257j63899m27149K44424L71726l05181l13842L60984K44653m06121j61708
174b70856M27314Q1414m35103l052M34958q2981m11254J61092L68851k20655l25186
185b75458K74330K76157l26665k12395L67746J36335l88337n7567L89731j6889
$$ y = [-388049, -201842, 424292, 115388, -434986, -34455, 433728, -44852, -422079, 124523, 392219, -196205, -345864, 250283, 298086, -299649, -246407, 351782, 172292, -383628, -86230, 381379, 16410, -369800, 40249, 364548, -107364, -346255, 178469, 303064, -231491, -252061, 272739, 199899, -308221, -136270, 327707, 72501, -332028, -16951, 335777, -42731, -331929, 112418, 305066, -172081, -262088, 212484, 221837, -249474, -178789, 285257, 121358, -305791, -61367, 310359, 5178, -308664, 52320, 296973, -109148, -270856, 156458, 237872, -197231, -200283, 234675, 151694, -259560, -98468, 270383, 49728, -275458, -1128, 275029, -51636, -264031, 103715, 240050, -148287, -205854, 183877, 166988]
195A66988l75635Q0922L56201j39703l35528K04504K99139k68360k39062L11778
205F1244J70512l33193j09344L48424M7639l56224J7876L51079q1801l36906J46881
216g3813L10119k11259k62314K59285K03787k85856j52028L07703J01066l30665
226a33975l7165L39106l2805l24984R3317K99601j44029k72032J93941K34775
236B15750k38203j85115K68137J32189k87579p9398L01507K1573l02984L5485
246a18638K92254q7787k73848J37299K49027j87073k10414K27641J60739k50594
256f1394j13001K63819P0520k79640k0310K89774m0838k79014R7149K52052j39507
267C9610k23416J77251J91497k13065j50414K39014J05515k55731o0374K69109
$$ y = [166988, -208647, -127725, 228476, 88773, -246755, -42251, 256888, -11472, -250534, 61244, 231756, -101437, -210781, 137643, 185282, -170942, -153066, 198013, 116212, -220694, -73813, 236306, 25047, -237267, 22018, 225805, -60051, -212079, 95624, 196690, -133975, -171140, 167966, 135161, -189823, -96506, 203095, 59066, -212966, -19025, 215750, -22453, -207568, 60569, 192758, -94821, -174219, 127288, 148861, -154123, -118638, 173616, 85829, -188019, -50720, 198307, 11234, -199180, 28461, 189200, -61394, -174395, 89424, 159944, -119696, -140006, 149768, 108930, -170084, -72935, 179117, 39610, -183806, -6555, 184942, -28123, -178537, 60477, 165992, -89739, -150113, 118996]
277A18996P210k70785N0645K51838r4631k27104J27348K07755j65496j80265K05227
288C0738J34925k28307q6802K36397M6140k43146l122K45767m6609k33555R0744
299e6830K12116j26278j88931J60686J59445j93012j18864K12749P6648k21649
309h3920l8922K29400k858k31802N1199K18725r4193j94364J24798J71250j52825
320c512j46988J83701J10982k06923o5982K14135K5393k13684J0140K13089n0350
331G0001k04162R1545J82370j23570j56902J49270J30968j75065r6220J93234
341F1469N5341j97840k0016J98463j2356j99902N2144J90313r2370j66401J20456
352a0699J41017j41262j17877J63608Q8197j82140n0997J89747J4437j89969K0005
$$ y = [118996, 126206, -144579, -93934, 157904, 63273, -163831, -36483, 171272, 5776, -174489, 30738, 165663, -62644, -149446, 86951, 133091, -110055, -113177, 132590, 85981, -147574, -56830, 155286, 29008, -159923, 763, 160208, -32804, -151668, 61081, 137729, -83920, -122842, 106558, 103700, -128102, -76903, 141822, 47629, -146735, -21937, 149313, -3512, -150500, 33201, 144183, -62740, -128722, 85413, 110806, -102878, -92738, 120351, 70001, -134161, -42616, 139754, 16184, -140718, 8552, 139520, -35545, -131765, 61469, 116810, -81030, -101046, 97417, 85061, -114841, -62697, 127616, 35246, -131155, -10699, 130318, -10944, -128821, 34787, 122984, -59156, -110153, 79594, 94031, -95938, -75933]
363g5933J85826n5363j73639Q7757J54768j14470j33449J38213J08411j59237
373c7116p7167J73101M3060j79212r302J79242k4014j73118N5419J62072q4811
384B8154j46337J12867J23915j36337r5764J51718O6852j61519l8840J69942O255
395H0906j71686K8900J62628n8308j49359Q3223J35177j08857j14868J32197Q6773
406A06726j45949n9082J54521L2331j62077n76J62096l2607j51698N9008J38915
417A01608q1466j26617J07154J05826j29113p7351J40400N0554j46555k6263J53205
428G1382l083j53299L4461J43544o0076j30964Q2452J16958j05210r6175J23347
439B3337P0839j34103m6576J42073K1168j47300P945J44857l6277j35259N9766
$$ y = [-75933, 109893, 54530, -119109, -31352, 123416, 8946, -124503, 13710, 122121, -37116, -114283, 58818, 101878, -77334, -86636, 92606, 68592, -104526, -49107, 112965, 28154, -118183, -5316, 118599, -17738, -113502, 38216, 105068, -56451, -95291, 74651, 80906, -90780, -61880, 100748, 42440, -106919, -23696, 111481, 2624, -112244, 19953, 106726, -39223, -98305, 56216, 88547, -73530, -74106, 87990, 55383, -96315, -37307, 101608, 20142, -106475, 679, 106505, -22608, -99959, 40441, 90995, -55560, -81823, 71382, 68299, -85000, -50539, 93005, 32929, -98035, -15583, 101375, -3835, -100010, 23337, 94176, -39927, -86503, 55570, 76738, -70562, -62617, 82240, 45963, -89296, -29530]
450b9530J23595q1526j08982J02043Q9353j18416o6321J29744M2016j37011j5941
461g0976J38740j0224j34898L4188J28017n7318j17470P9809J01099r7976q1728
472h8737J11610O1529j22910l8534J30316J2718j30873J1539J27144l3754j21342
483h1294N6579J10570p7938r4095R4185P5978j06887n7303J18465L4572j25235
494e2403r237J24705j3750j20488L4543J14618n5871j04342P6256Q8527r1895
505i337p0569J03770N1477j13342k9809J18510O586j17754J4934J13539l4858
516C3147j07277N4918R6864p3473q1782Q8070O4377r8978m5613J06617K5851j11288
528d8567m790J11576j6241j07234L5512J00246n3781r0406P1075P6331q5097n9334
$$ y = [-29530, 94065, 12539, -96443, 5600, 94953, -23463, -89784, 39960, 81976, -55035, -70976, 67764, 57540, -77358, -43170, 84847, 27529, -89941, -10132, 90967, -7009, -88737, 22873, 84402, -38508, -77042, 53274, 65992, -64881, -53342, 73802, 40048, -81294, -24715, 85855, 7917, -86178, 8007, 83985, -22902, -80205, 38260, 72832, -52403, -61640, 63065, 49315, -71173, -36630, 77988, 22117, -82225, -5969, 82558, -9337, -79906, 23864, 75341, -38001, -67810, 50700, 57286, -60468, -45534, 68005, 33147, -74130, -19212, 77652, 4179, -77603, 10467, 74844, -24134, -69747, 36870, 62721, -48567, -53357, 58219, 41978, -65256, -29744, 70502, 16721, -73685, -2610, 73721, -11376, -70710]
540g0710R4842M1825j02241k2854J06773J987j05947J7552J01635l5437r5387
551f7962N3543Q5098p0078p0471Q2052N4838r0956l8645R8471J9373j01510N06
563d5741R9583j7918r5783L4758Q9939n2372p9423O7725O4775p8080n0243Q6307
575B3527L5100r3549j6792R6437k443r3996J8904Q9957l4396q4730N1359P4443
587F3821o6100n9859P5507M5899q2951l1804Q9995J3957r2356M706Q9436k0301
599B9950q5287L5021Q0047n1355o9441O4857N5337p3319m1952Q0134K8020q6170
611c4158j1011Q7932o489q4728K0995Q0750l5279p5167N0563O4601o2787n1111
623e5889P0421L8554p7124k4851Q2510Q346q3273P680Q0264k1322p6573L5404
$$ y = [-70710, 24132, 65957, -36284, -59138, 47635, 49622, -56325, -38773, 62862, 27425, -67962, -14419, 70679, 601, -69870, 12182, 67020, -23936, -62581, 35890, 55263, -46247, -45741, 53842, 35924, -59859, -25101, 64838, 12466, -66957, 768, 65543, -12537, -62780, 23527, 58627, -34922, -51714, 44723, 42280, -51716, -32812, 57145, 22749, -61981, -10622, 63821, -2279, -62138, 13369, 59268, -23683, -55487, 34508, 48465, -43891, -39185, 50251, 29950, -55337, -20316, 59731, 8376, -61065, 3792, 59129, -14190, -56142, 23992, 52012, -34158, -45169, 42763, 36274, -48454, -27459, 53291, 18012, -57155, -6592, 58009, -4778, -55889, 14532, 53086, -24038, -48889, 33621, 41967, -41306, -33626, 46638, 25316, -51257, -15853]
635a5853P0357m9471n9887O0101M7704o7407l5833P3935K2261p8479o713P8851
647C9566q118p6227K1379P2488l4869o6080M7900N5867n7604m4542O4789L3169
659D7718p1066k0035P5168N144p5331R023P2714k1864o8646L4665O2064m6586
671B968n2562N5860M1887o3096l0235O8505J7289p1458l588P1490r808o9065K2489
684a9324O4310l4062n7739M4532M9306n3651l8717O0440K6911o4544j5159O6979
696B9282K757o7334J0220O4711k2182n9867L2715N3722m2604m5678N1319L5453
708D2514n7560k4340O1626J2997o4001r29O4082j1376o1507K2850N6774l3207
720G923n0500M2780M2197n0641l2220N6183K1520n9759j0519O1767j393o1043
$$ y = [-15853, 54504, 5033, -54854, 5247, 52951, -14456, -50289, 23646, 45907, -32572, -39285, 39566, 31448, -44779, -23400, 49088, 14219, -51861, -3961, 51906, -5698, -50240, 14549, 47718, -23348, -43383, 31785, 36929, -38402, -29379, 43335, 21471, -47175, -12510, 49554, 2968, -49594, 6266, 48153, -14943, -45178, 23327, 40616, -30842, -34430, 37060, 27252, -41813, -19324, 44986, 10924, -46815, -2283, 47023, -6628, -45345, 15095, 42006, -22538, -37697, 29282, 32039, -35295, -25075, 39636, 17454, -42413, -9698, 44024, 1420, -44258, 7061, 42514, -15046, -39386, 22240, 35237, -28764, -29693, 34389, 23013, -38494, -15644, 41130, 7923, -42577, 203, 42400, -8241, -40461, 15722, 37242, -22517, -33036, 28731, 27338, -33705]
732c3705J3055N7644k3149n3210L2921M6960m2008l8081M8287K8560n2295j9650
744c4671N6241Q860n7840K891N5972j3007n2723K1842M9122l1311m3094L9890
756B172L4571m5456k6124M9689J7556n3753o911N5349m536n3275J3894N0437k2732
769A0881m6911L2201M0558m0287l1937M5294K3645m9268j4805N2631M386n3378
781b6990O121N1222j5200m7925K3680M3528l1949l7075L8601K9262m3245k1141
793c1111M6537J2898m9041l369M9206o161m7230J4739M3917k2306l9706K9570
805b057L4053l6225k6652M0722J9084m4063j1047M6388K109m6933P244M5027j5580
818A2070m1807K3025L7793l0380l1959L6615K4602m0862j7026M3786R089m5788
$$ y = [-33705, -20650, 36994, 13845, -39365, -6444, 40516, -1492, -39573, 8714, 37274, -15021, -34671, 21570, 30430, -27410, -24519, 31453, 18446, -34277, -12435, 36687, 5376, -37718, 2172, 36743, -8713, -34837, 14852, 32408, -21345, -28256, 27093, 22557, -30718, -16824, 33613, 10881, -36030, -3829, 36729, -3558, -35495, 9799, 33444, -15824, -30629, 22002, 26388, -26990, -20869, 30353, 15153, -32772, -9092, 34436, 2487, -34588, 4013, 33275, -9970, -31111, 15426, 28324, -20717, -24086, 25120, 18959, -28271, -13532, 30385, 8079, -31627, -2057, 31996, -4229, -30881, 9841, 28925, -15138, -26185, 20203, 22312, -24621, -17377, 27650, 12070, -29737, -6712, 31081, 701, -31258, 5357, 29959, -10903, -27929, 15857, 24946, -20842]
830b0842k3M5582q869m3103J6596L9537k3312l5395K9867K9528l5101k2510L8650
843A0605J5133m0786p947M2484o37m1446Q269L9097j4895l6324K1263L2720k7744
856b08k7034L2710K0235l5757j3956L8612O656m0213J615L9321q878l7347J5356
869h888L4898k2032l0976K8573K4904l2997j8469L6082J2015l8619m725L9649
881A9415l271l8236J0115L5932j6236l3067K2253K8880k7746k3118L1672J6787
893B3380l4005j0594L5454M384l6291K524L5449r102l3164J4928L0224k0413k6371
906b3597K5309K1578k9454j5625L1898R607l3294l700L4253k867l4029R756L1907
919B1742j5735k8726K1007K4792k5651k0113K9666J4270l2156q224L3525J934
$$ y = [-20842, -20865, 24717, 15848, -27255, -10659, 28878, 5566, -29829, 38, 29566, -5535, -28045, 10605, 25738, -15048, -22995, 19489, 18852, -22594, -14325, 24772, 9877, -26447, -5184, 27536, -208, -27242, 5468, 25703, -10054, -24010, 14602, 21258, -18955, -17340, 21981, 13103, -24244, -8888, 26010, 3978, -26998, 1575, 26479, -6518, -24987, 11095, 23110, -15509, -20234, 19415, 16144, -22092, -11977, 23955, 7719, -25348, -3095, 25785, -1961, -25079, 6593, 23380, -10625, -21219, 14235, 18619, -17672, -15148, 20301, 11199, -21965, -7037, 23187, 2774, -23597, 1712, 23290, -6164, -21789, 10109, 19716, -13578, -17278, 16975, 14108, -19921, -10165, 21742, 6007, -22719, -1712, 23080, -2571, -22684, 6982, 21252, -10904, -19128, 14397, 16331]
931A6331l3772M429L2884j0790l0420J6091K7413k0971k3423K5170J8335k8150
943f873j2943L0043P714l1476j788L1752m396l0198R683K8054j4542k5530J9332
956a168K1816k3546j6892K6252J2045k8232p111K9978J162l0318N056K8729j0019
969G752k6761J4658K4599j9790k0880K4043J5979k6867j0725K8475N716k9764
981a3565q4K9861n883k8234J0916K5896j5216k3316J9626J9673k3544j4827K5950
994G253R809k7184n046K7920Q8k7971N242K6709j0217k4414J4395K1847j8393
1007C8j8428K1981J4094k4692r099K5962M321k6478K38K6781n419k5931J0601
1020f031K3786j5161k0583J8633J7309k1957j3284K4721Q222k6006l142K6085
$$ y = [16331, -17441, -13012, 19872, 9082, -21338, -5247, 22166, 1195, -22228, 2942, 21277, -6873, -19816, 10227, 17941, -13535, -15323, 16429, 12033, -18165, -8482, 19572, 5030, -20500, -1168, 20648, -2898, -19790, 6462, 18507, -9725, -16836, 13142, 14304, -16014, -10958, 17771, 7752, -19009, -4351, 20248, 458, -20422, 3621, 19600, -7267, -17992, 10483, 16199, -13565, -13649, 16212, 10329, -17905, -6989, 18907, 3691, -19625, 1, 19674, -3870, -18697, 7253, 17062, -10122, -15168, 12752, 12840, -15131, -9889, 16820, 6603, -17811, -3416, 18431, 38, -18390, 3591, 17685, -7007, -16106, 9856, 14177, -12301, -12063, 14718, 9299, -16632, -6031, 17755, 2594, -17989, 644, 17953, -4004, -17288, 7433, 15655, -10351, -13493, 12592]
1032A2592j288k5962N908K5249j1063k2854J5427J9426j8480j6071K1168J2503
1044A6555k3806p785K5136K798k5057J386K4771n678k4067J0577K1884j4890j8476
1057a6652J7786J5188k0278j1797K2759P437k4265k561K4380j977k3774O063K2954
1070A5263j0535k0943J4713J7753j7714j4342J9962J1002k2102o900K3494K260
1082A1911k3715K329K2864o324k1669J0226J9837j4028j7014J7115J3712j9554
1094d310j0108K1331O142k2461j846K2805k417k2336O633K0906j0474j8740J3768
1107a107J6276j6799j3266J9497R357k1209n179K1807J237k1779K438K1647o727
1120F193k0390J0853J7716j3546j5333J6172J2626j8754q927K0483M666k0710
$$ y = [12592, 11304, -14658, -8750, 16499, 5436, -17418, -1991, 17435, -1045, -17116, 4052, 16555, -7251, -15036, 10100, 12898, -12159, -10773, 13998, 8320, -15747, -5170, 16714, 1824, -16652, 1134, 16322, -3956, -15753, 7006, 14443, -9822, -12383, 11997, 10020, -13754, -7691, 15263, 4728, -16215, -1502, 16251, -1463, -15805, 4157, 15159, -6943, -13843, 9651, 11911, -11804, -9475, 13389, 7065, -14604, -4378, 15459, 1431, -15583, 1532, 15244, -4310, -14418, 6913, 13055, -9406, -11252, 11553, 9136, -13200, -6567, 14339, 3865, -14875, -1107, 15169, -1630, -14896, 4601, 13958, -7251, -12430, 9377, 10614, -11165, -8727, 12920, 6193, -14197, -3344, 14372, 826, -14507, 1665, 14291, -4463, -13390, 7093, 11759, -8951]
1132h951j066K0665k343k0589O385J9448j0362j6908J3123J4366j5521j1854J7873
1145D266Q538j9806m271K0271M72k0108K974J9793o728j8727J0517J6617j3676
1158A32j3674J5736J1008j7930p673J9593L740k0131J39J9687l471j9004O787
1171e061J7912j0224j5841J3192J3076j5234j0334J6874P433j8241m065J8945
1183H432M04j8817L089J7956o113j6924R268J5213j2225j2724J4561R728j6075
1196d227p007J7599L731j8580Q6J8388l635j7477O808J6236r724j4729J2853J2044
1210A2366j5031r164J6534O191j7666k796J8225q54j7680L795J6956o702j5820
1223a1646R736J3786j2022j1518J3864Q973j5326o195J6323L230j6795k33J6742
$$ y = [-8951, -10017, 10648, 8305, -12284, -5899, 13549, 3187, -13721, -598, 13768, -1753, -13607, 4266, 12804, -7002, -11273, 8998, 9470, -10638, -7664, 12129, 5401, -13326, -2809, 13808, 132, -13542, 2194, 13202, -4728, -12401, 7192, 10932, -9199, -9060, 10627, 7156, -11848, -5061, 12851, 2627, -13214, -22, 13054, -2180, -12514, 4360, 11793, -6448, -10513, 8432, 8836, -9981, -6892, 11064, 4951, -11973, -2705, 12508, 283, -12441, 2120, 11848, -4227, -11234, 6365, 10096, -8484, -8398, 9990, 6355, -11122, -4314, 11922, 2198, -12531, 322, 12366, -2665, -11829, 4705, 10896, -6770, -9566, 8659, 7805, -9875, -6080, 10876, 4174, -11646, -1910, 11876, -146, -11664, 2200, 11173, -4153, -10348, 5975, 9205, -7590, -7823, 8919]
1236H919k954j6059N973J4850q634j3207J1109J0972j3018q605J4764N819j5949
1249f020k647J6403n34j6234L595J5589o740j4238R365J2415j1614j0238J3653
1262B755P651j5085m700J5821J706j5981J203J5677l995j4924O658J3609r096
1275A299j1763J1002R817j2615p633J4002M895j4747k091J4952n49j4698K993
1288e136J4214n801j2941Q144J1419j0171r564J2006P144j3363m425J4246J607
1301G379j4594J230J4336m009j3400O387J2318q857j0697J1007Q535j2506o157
1314i028J3606L527j4347o55J4331j988j3732M229J3034o466j2018Q799J0145
1327I437j0419q111J1679O089j2805l706J3403J201j3522J247J3106l485j2498
$$ y = [8919, 5965, -10094, -4121, 10729, 2095, -11112, -3, 10969, -2049, -10654, 4110, 9929, -6020, -8667, 7736, 7202, -9032, -5437, 10152, 3412, -10826, -1461, 10954, -660, -10898, 2755, 10406, -4679, -9379, 6442, 8148, -7833, -6630, 9047, 5052, -9872, -3214, 10395, 1299, -10464, 538, 10355, -2260, -9893, 4109, 9004, -5743, -7834, 7118, 6569, -8129, -5136, 9078, 3277, -9664, -1520, 9899, -272, -9836, 2170, 9314, -4049, -8474, 5772, 7379, -7215, -5985, 8351, 4342, -9058, -2671, 9647, 790, -9907, 1100, 9635, -2871, -9028, 4578, 8105, -6242, -6897, 7434, 5446, -8286, -4057, 8977, 2511, -9507, -708, 9437, -982, -9093, 2586, 8675, -4130, -7836, 5567, 6768, -6754, -5507, 7599, 4114, -8384]
1340h384N713J1651q078r871R916P634j0916n799J2079L556j3059r31J3346j841
1354E016j2649M056J1957o226j1102Q594R293j0384o964J1373M969j2296k832
1367g195J3026K79j3120K337J2344m440j1383O313J0406q349q978J0194O794j1078
1381b850m654J1533K839j2054q37J2402j562j2104M016J1074n919r821P383Q801
1395H247r373o937J0773M610j1247k602J1582O96j2087J728J1945m376j0827O414
1409a454R247p683q094R225O684j0934m250J1637J773j1391K9J1495k076j1305
1423g097M312J0585o476r051P655P784q974o420J0512M278j1339j787J1169j93
1437D958j0758J606J0951l770j0539O142R008p704p173Q458N952r678m364J0857
$$ y = [-8384, -2671, 8980, 902, -8969, 947, 8581, -2335, -8134, 3945, 7501, -5558, -6489, 6857, 5016, -7633, -3577, 8380, 2154, -8948, -354, 8939, -1445, -8409, 2964, 7933, -4363, -7195, 5831, 6110, -7010, -4673, 7671, 3231, -8152, -1839, 8567, 218, -8760, 1434, 8228, -2850, -7504, 4029, 6868, -5186, -6023, 6379, 4817, -7287, -3271, 7803, 1884, -7937, -554, 8247, -1126, -8063, 2710, 7320, -3927, -6529, 5053, 5749, -6338, -4610, 7335, 2959, -7868, -1454, 7793, 110, -7984, 1241, 7925, -3009, -7259, 4378, 6151, -5240, -5211, 6284, 4208, -7097, -2785, 7800, 1324, -7727, -72, 7712, -1262, -7682, 2830, 7108, -4231, -6018, 5151, 4958, -5800, -4194, 6757, 2987, -7552, -1410, 7598, -106, -7279, 1179, 7131, -2547, -6911, 3946]
1451C946K020j0899L2J0571j719j0448L614J0126n941q694P530O923q236n751
1465f926R431M213j0634j868J0838m89j0276K155R976l909r560N946Q343p467
1479b27o727Q331N390r488l484J0245J439j0449M33J0111k031r872L931R205n808
1494I99p999P187O622q237n127R154L395r690j644R890R7j0048J802R679l725
1509B355q980N528P716o695o534P793N236q729l690R548J706r750J30R675j980
1524C329r303L878Q387n381p364O678O271p900m880Q930L173r697r95R567p11
1539C982r227K119Q981l796q393N450P399o867n911P672M614q459l137R083J440
1554D950r246J30R074j633q884L306Q492n147p160O111N988o949m918P895L642
$$ y = [3946, 5966, -4933, -4901, 5670, 3951, -6497, -2883, 7243, 1302, -7392, 138, 7061, -1175, -6926, 2505, 6718, -3916, -5784, 5054, 4565, -5711, -3556, 6420, 2511, -7049, -1103, 7240, -227, -6954, 1377, 6767, -2721, -6205, 4040, 5479, -4970, -4537, 5574, 3543, -6329, -2398, 6807, 999, -7000, 187, 6809, -1428, -6555, 2599, 5994, -3696, -5340, 4550, 4647, -5401, -3599, 6080, 2355, -6625, -1097, 6619, -76, -6610, 1183, 6419, -2310, -6000, 3548, 5254, -4496, -4366, 5309, 3329, -5974, -2096, 6291, 910, -6454, 224, 6495, -1405, -6285, 2645, 5818, -3879, -4874, 4693, 3982, -5245, -3126, 5855, 2059, -6334, -884, 6515, -352, -6263, 1409, 6023, -2436, -5573, 3510, 4950, -4296, -4166, 4908, 3275, -5609, -2303, 6189, 1042, -6118, -7, 5981, -968, -5886, 2009, 5651]
1569E651q919j606R086j20q891J461Q861l448q048N170O765o257n625P172M590
1584E842q473k699Q971P98q790P84Q485j963q536L873P648n413o338O147N417
1599E753o888m552Q113K805q700q97Q165l3q305J287Q540l121p714M518O755n493
1615B33o026O608M825p551l232Q159J565q278j33Q258j350q187L224P332m651
1630G96o354N900N056o710m026P687K483q298o68Q335r12q059K282P699l809o796
1646e394M967N876n930m862O719L909p680k313P952P83p727K70P804j495p853
1661d974L114P041m296o137N223N419o356m389P444K697p617j300P738O0q036
1676d369J737P657l526o732M723N609n461m829O755L452p631j641P622K50p465
$$ y = [5651, -3268, -4874, 4212, 4092, -4799, -3338, 5523, 2075, -5973, -803, 5962, -295, -5920, 1252, 5842, -2631, -5330, 3641, 4439, -4351, -3567, 4918, 2955, -5581, -1708, 5940, 527, -5811, 336, 5753, -1135, -5687, 2426, 5231, -3469, -4366, 3799, 3766, -4539, -3252, 5288, 2167, -5547, -1029, 5726, 233, -5793, 815, 5640, -1911, -5143, 3016, 4581, -3697, -3830, 4428, 3078, -5109, -1885, 5447, 796, -5558, 342, 5398, -1312, -5338, 2349, 4832, -3466, -4134, 4201, 3289, -4770, -2488, 5211, 1402, -5394, -427, 5449, -481, -5343, 1376, 5285, -2395, -4708, 3244, 4027, -3700, -3430, 4374, 2879, -4974, -1860, 5181, 885, -5252, -29, 5390, -966, -5355, 2089, 4786, -2831, -4131, 3607, 3667, -4369, -2632, 5025, 1499, -5233, -510, 5099, -362, -5191, 1564, 5016, -2615, -4256, 3366, 3616, -3849]
1691c849Q17P751k586p199M088O124n031n165N493M698o712l259P485J579p487
1706c253m61P346l90p599J788P430l370o429M245N865n187n044O164L833o974
1721b036k268O997J295p576K39P656j977p006L324O283m562n467N637M403o643
1736a701k838P042J501p154k38P317j285p160K723O534l961n620M817M997n926
1751i52l933O670K597o857j537P126M37p397R35P202k199o674L273O103m228n448
1767d882N317M491o295l227O825J891o966q17P317p86p038K217O524l502n741
1782d672M442N048n752l694O466K335o835r34O779j09o918J500O699k901o043
1797d589L951N175m668m550N586L627o318k310O672R90o551j76O800j105o778
$$ y = [-3849, -3032, 4719, 2133, -5066, -978, 5146, 115, -5050, 443, 5141, -1571, -4830, 2655, 4234, -3253, -3714, 3632, 3242, -4357, -2569, 4861, 1491, -4938, -693, 5172, -15, -5059, 1105, 4938, -2036, -4304, 2693, 3988, -3588, -3349, 4307, 2330, -4676, -1352, 4931, 369, -5098, 539, 4942, -1701, -4539, 2503, 4004, -3150, -3388, 3929, 2644, -4516, -1793, 4741, 780, -4840, -23, 4974, -952, -4885, 1785, 4382, -2475, -4012, 3114, 3551, -3846, -2911, 4291, 2092, -4582, -1309, 4794, 566, -4882, 435, 4926, -1369, -4596, 2229, 4120, -2846, -3663, 3654, 2868, -4170, -1953, 4571, 1069, -4672, -230, 4818, -934, -4628, 1838, 4173, -2662, -3596, 3183, 3074, -3844, -2344, 4355, 1454, -4589, -638, 4537, -131, -4681, 905, 4532, -1786, -4096, 2576, 3566, -2985, -3161, 3639, 2534, -4244]
1812d244K479O109l364n421M164N012n331l943O196K476o270j587O536M92o819
1827c515R84O614k345n994L346N334m472m509N544L290o193j852O247Q07o354
1842c068L33O472j691o127K845N392l729m584M379M071n388k942N954J748o170
1857b505p12O200k18o329J477O094k719n480L520M923m275m267N125L286n885
1872a765j898N930J020o131rO279j294n908K471N311l425m649M332L769n193k650
1888c810N631J629n934m91N898n96n906J871N515k881m934L674M285m402l476
1903c927N093K522n648j290N738L65n826O08N778j722n429K704M858l402m515
1918d093M349L637n008k526N382J615n648n82N778m83n839J595N362k549m768
$$ y = [-4244, -1765, 4344, 980, -4441, -277, 4735, -596, -4539, 1657, 4133, -2137, -3724, 2812, 3304, -3515, -2531, 4083, 1738, -4256, -910, 4424, -48, -4557, 987, 4277, -1916, -3768, 2479, 3286, -3068, -2735, 3737, 2046, -4081, -1236, 4156, 427, -4157, 222, 4293, -1095, -4037, 1917, 3665, -2505, -3217, 2983, 2765, -3564, -2087, 4007, 1288, -4192, -672, 4251, -24, -4291, 834, 4120, -1765, -3663, 2267, 3287, -2844, -2853, 3426, 2132, -3776, -1305, 4006, 581, -4068, 264, 4033, -1160, -3810, 1821, 3450, -2484, -2975, 2923, 2327, -3579, -1708, 3807, 926, -4008, -334, 3951, -451, -3927, 1166, 3688, -1960, -3250, 2488, 2853, -2973, -2365, 3413, 1691, -3738, -1034, 3824, 422, -4093, 256, 3893, -1115, -3641, 1741, 3356, -2292, -2874, 2904, 2421, -3418, -1823, 3539, 990, -3778]
1933c778L497M084m219l424N092K213n234j312N524J92n602P09N618j935m972
1948c547K773M470l611l823M305L028m818k060N093J256n409k70N479q88n195
1963c217J831M822k583m417L317M030m501k830M742K072m967j342N381K74n502
1978b890R80N139j913m559K418M422l358l987M510K612m696j770M812J171n136
1993b245l44N486j076m960K038M314k423m220L284L880m518k462M657J519m628
2008a698j081M990L19n427J171M854k137m102K409M086l306l625M272K563m703
2023a415j425M622Q69m861k16N318j323m679K126M134k701l811L354L336m093
2038g65k438M671J274m603o03M727p1m923J184M579k058m110K642L658l364l215
$$ y = [-3778, -281, 3803, -416, -3840, 1252, 3465, -1769, -3081, 2443, 2635, -2967, -2258, 3360, 1425, -3547, -774, 3696, 85, -3738, 567, 3595, -1223, -3283, 1810, 3066, -2343, -2613, 2866, 1978, -3217, -1386, 3436, 853, -3564, -247, 3783, -718, -3548, 1194, 3266, -1701, -3043, 2338, 2612, -2890, -1910, 3229, 1316, -3243, -825, 3597, 239, -3748, 762, 3374, -1322, -3092, 1720, 2891, -2245, -2589, 2897, 1821, -3139, -1101, 3213, 790, -3430, -146, 3734, -784, -3246, 1411, 2930, -1698, -2779, 2211, 2530, -2897, -1726, 3128, 991, -3111, -702, 3384, 78, -3547, 725, 3288, -1415, -2840, 1782, 2651, -2210, -2426, 2892, 1569, -3110, -984, 3150, 449, -3362, -8, 3328, -765, -3203, 1468, 2742, -1861, -2464, 2263, 2192, -2731, -1547, 3032, 974, -3136, -494, 3164, -200, -3415]
2054c415M207K298m516j349M658N24m758M12M576j280m353K124M022k925l397
2069c172L437K841l896k078M354J110m521l46M554l19m640J349M317k172l828
2084c010K736L451l533k663L850K115m380j213M546L05m526N50M425j271m251
2099b869K027L922k843l282L430K588l819j953M236J160m576j51M472n75m303
2114b536J280M126k132l779K956L106l517k411L832J790m151j116M573J06m516
2129b389Q19M126j308m076K065L813l029k957L466K267l643j862M188R65m495
2144b050J5M311p34m067J321L977k085l705L077K801l414k237L670J838m147j001
2160b430M384Qm243P70M008j372l864K125L538k953k781L374K159l700j623M100
$$ y = [-3415, 792, 3090, -1426, -2775, 1883, 2407, -2351, -1939, 2637, 1357, -2996, -872, 3150, 225, -3172, 265, 3106, -790, -2868, 1486, 2596, -1925, -2271, 2283, 1964, -2676, -1327, 2990, 818, -3010, -274, 3177, -356, -3019, 831, 2946, -1434, -2647, 1899, 2204, -2322, -1772, 2653, 1382, -2869, -842, 3080, 237, -3045, 385, 2973, -846, -2799, 1437, 2597, -1979, -2130, 2342, 1767, -2536, -1256, 2870, 738, -3041, -85, 3021, -496, -2907, 925, 2715, -1436, -2552, 2021, 2127, -2389, -1570, 2556, 1248, -2828, -763, 3050, 21, -2936, 530, 2797, -846, -2708, 1480, 2445, -2050, -2035, 2276, 1542, -2525, -1204, 2773, 688, -3017, 60, 2861, -553, -2790, 880, 2718, -1429, -2430, 1954, 1962, -2281, -1511, 2497, 1125, -2739, -614, 2924, -29, -2810, 564, 2723, -977, -2600, 1500]
2176A500Q17m252K4M209q50l934J424L786k124l455K885K786l355k155L750J415
2192B471l910p74M064k1m001P73L830j434l690K190L264k828k620L200K060l546
2208i72j458L899O79l977J4M031q13l855J464L633k152l202K729K627l168j991
2224b512L575J272l792o20L945j45l845P49L648j331l454K149K963k746k389L098
2240E65J859l424j292L768M69l773K22L711r50l448J446L280k166k758K653K311
2256B473l121j694L419J141l722l93L759l26l622Q53L565j517l262K190K760k620
2272a17k373L134J742l393j154L607M14l611J98L604q17l588J694L107k207k649
2288b409K633K130k949j726L456R07l523j99L500m85l373J008L305j756k876K251
$$ y = [1500, 2317, -1935, -1911, 2298, 1448, -2486, -1062, 2724, 600, -2855, 30, 2816, -539, -2694, 1056, 2471, -1439, -2213, 1851, 1830, -2171, -1398, 2432, 998, -2692, -502, 2762, -66, -2686, 514, 2574, -972, -2430, 1469, 2148, -1829, -1815, 2216, 1403, -2452, -988, 2645, 493, -2709, 20, 2647, -521, -2512, 1063, 2335, -1457, -2077, 1868, 1723, -2122, -1373, 2275, 944, -2510, -361, 2602, -144, -2533, 565, 2424, -1000, -2292, 1476, 1945, -1828, -1606, 2105, 1155, -2293, -847, 2433, 267, -2491, 162, 2473, -648, -2342, 1077, 2218, -1504, -1897, 1862, 1536, -2086, -1233, 2332, 815, -2447, -257, 2503, -117, -2490, 644, 2386, -1007, -2161, 1446, 1860, -1751, -1553, 2051, 1234, -2354, -660, 2447, 240, -2409, 224, 2354, -595, -2321, 1135, 2042, -1481, -1680, 1820, 1335, -2038, -1030, 2275, 519, -2357, -106]
2304a06K355k549k028L039J518l401p98L398K38l386L04L442r66l323J604L067
2320B408k215k564K652K050k922j632L259J085l548m03L637l48l503R66L295j539
2336F78l050K149K570k612j955K916J443l283p33L417ol268N48L070j021k981
2352b118J622K769k274k203K636J618k796j206L060O92l290j07L371n25l234J118
2368h67L047j597k874K205K316k558j883K887J448l140r32L413J60l336M02L271
2384A962r91l113J588K753k118k339K562J873k930j140L021N47l134R0L019n99
2400A051k937J179K706j756k264K148J842k433j525K857R14k963l25K934l6l082
2416a690O27K984j225k770J770K368k031k177K500J821k993j058L009N68l100
$$ y = [-106, 2249, -300, -2328, 711, 2229, -1172, -1970, 1428, 1666, -1720, -1416, 2026, 1060, -2263, -659, 2408, 193, -2371, 281, 2331, -591, -2223, 1036, 2121, -1427, -1830, 1807, 1459, -2044, -1078, 2217, 678, -2372, -223, 2347, -265, -2220, 696, 2139, -1144, -1877, 1540, 1534, -1734, -1186, 1884, 863, -2118, -496, 2273, -1, -2204, 432, 2050, -746, -1952, 1108, 1800, -1490, -1597, 1774, 1249, -1985, -867, 2180, 583, -2291, -86, 2230, -328, -2211, 676, 2124, -1016, -1948, 1465, 1625, -1711, -1309, 1962, 971, -2142, -554, 2199, 81, -2258, 304, 2177, -753, -1893, 1128, 1675, -1459, -1369, 1650, 1051, -1886, -707, 1999, 243, -2021, 127, 1969, -464, -1989, 868, 1782, -1181, -1506, 1428, 1392, -1690, -1063, 1921, 696, -2074, -304, 2064, 33, -2144, 356, 2177, -816, -1874, 1135, 1703, -1397]
2431a397r0L175m90l115J178K824j801k429K167K074k570j546K871Q82k992j80
2447a439K896k69k811O86K839j496k322J850J896k058j598K349J225k693p00K943
2463A298M0k818L44K796q27k710J303K509j703k214K121J879k485j521K847R18
2479A777l023l06L008j56k955O77K939j385k604J910K098k190j737K431J351k770
2495i35o57K823M1k700M38K590r17k441J413K153j851j707K065J387k325r86K603
2512I94L98k692P6K598l98k623Q89K580j425k295J857J934k064j778K557J172
2528A780k742o38K773K55k822K30K876r27k603J386K213j618j993K118J546k451
2544f17j032K552N28k552m3K529m45k504R84K280j456j833J653J611j974j315
$$ y = [-1397, -1487, 1688, 1198, -1917, -739, 2085, 284, -2145, 22, 2096, -474, -2020, 851, 1733, -1259, -1439, 1457, 1188, -1623, -937, 1902, 406, -1916, -66, 1830, -228, -1826, 523, 1748, -945, -1645, 1298, 1338, -1480, -1136, 1660, 833, -1877, -574, 1935, 232, -1982, 139, 2018, -467, -1988, 859, 1777, -1246, -1552, 1456, 1300, -1655, -978, 1961, 576, -2028, -118, 1980, -210, -1947, 484, 1835, -935, -1592, 1231, 1272, -1428, -990, 1600, 683, -1758, -345, 1808, -43, -1750, 315, 1702, -623, -1609, 994, 1392, -1300, -1224, 1374, 976, -1647, -758, 1822, 397, -1898, -41, 1893, -171, -1949, 608, 1780, -962, -1600, 1173, 1428, -1394, -1164, 1712, 785, -1818, -432, 1781, 163, -1830, 288, 1834, -617, -1649, 903, 1431, -1121, -1164, 1365, 920, -1584, -600, 1680, 224, -1609, 44, 1655, -319, -1634]
2560a634K284Q37k402l81K449J6k525M52K469r39k293J314K094j706j797K015
2576B53J455k295j044K534N49k596q5K563l26k595Q86K390j308k121J667J810
2592A737k016j404K300Q90k408l86K359Kk422N06K316r28k110J351J767j589j565
2609a600J979J128k161p31K272L26k308P5K304m35k309R25K115j296j884J598
2625bJ664j952j301K182Q95k338m99K455N4k476M41K351q61k194J239J983j660
2642a9j600J951J201k147p65K184M29k278RK316n01k165Q64K013j223j824J553
2659bJ528j898j080K046P37k158l17K213n8k284N23K148q75j984J222J797j582
2676b4j557J898J175k098p64K196M09k304j1K356m63k245R15K004j231j807J554
$$ y = [-1634, 650, 1487, -915, -1296, 1153, 1169, -1356, -904, 1565, 626, -1667, -353, 1741, 35, -1762, 253, 1708, -587, -1631, 903, 1452, -1144, -1229, 1334, 1008, -1587, -701, 1689, 381, -1740, -73, 1737, -279, -1683, 617, 1507, -901, -1287, 1072, 1074, -1348, -842, 1474, 546, -1564, -213, 1554, -35, -1600, 379, 1507, -654, -1385, 887, 1213, -1095, -1020, 1284, 849, -1460, -535, 1580, 284, -1600, -2, 1662, -290, -1591, 591, 1486, -852, -1351, 1104, 1158, -1318, -877, 1474, 613, -1581, -342, 1641, -19, -1619, 332, 1533, -614, -1379, 805, 1234, -1044, -1035, 1281, 780, -1385, -521, 1492, 269, -1555, -2, 1526, -372, -1452, 594, 1331, -827, -1144, 1069, 1011, -1273, -750, 1398, 523, -1461, -239, 1558, -24, -1581, 317, 1492, -606, -1370, 826, 1235, -1069, -1080, 1276, 813, -1432, -517, 1487, 256, -1551, 3]
2693CJ515j855j131K071P30k171l23K231p3k194M53K122q91j903J239J659j518
2710c6j432J811J101k050o84K146K77k176Q4K175m70k115Q83J960j266j706J574
2727G6J407j802j118K036P23k170l02K215j47k140N12K065q89j954J304J655j576
2744a05j317J787J054k033o76K155K53k181J66K100n23j973Q69J868j265j632
2760a453J600J304j810j004J931P04k133k63K240k35k110N73J959q62j846J199
2776b06J663j564j288J808R35j947o19K030L04k187K18K081o18j904Q76J777j213
2793A46j561J585J197j766q83J926N61k017k47K130k21k066N68J970r04j827J208
2810b01J698j641j260J785R24j926n86K053K40k202K83K056o22j882Q99J744j256
$$ y = [3, 1518, -337, -1468, 603, 1333, -838, -1161, 1070, 997, -1197, -744, 1378, 487, -1416, -177, 1482, -36, -1468, 343, 1444, -606, -1290, 856, 1133, -1043, -959, 1216, 746, -1369, -486, 1474, 208, -1498, 76, 1483, -319, -1437, 599, 1322, -848, -1150, 1065, 918, -1222, -710, 1355, 466, -1488, -184, 1471, -105, -1422, 365, 1419, -614, -1290, 865, 1118, -1063, -897, 1203, 680, -1293, -424, 1444, 179, -1453, 147, 1451, -359, -1363, 568, 1272, -861, -1124, 1116, 881, -1229, -656, 1303, 441, -1405, -206, 1457, -107, -1395, 413, 1348, -599, -1218, 812, 1116, -1071, -853, 1228, 610, -1294, -418, 1359, 146, -1415, 170, 1367, -399, -1282, 644, 1205, -812, -1059, 1071, 850, -1216, -648, 1322, 418, -1409, -201, 1497, -144, -1404, 381, 1305, -621, -1207, 846, 1086, -1116, -833, 1223, 601, -1281, -382, 1362, 106]
2827A06j500J541J201j695r37J898N24j950j72J974k02j929O21J858r87j657J191
2844a15J467j507j173J756Q39j879n50J985K07k052K37K049n91j961R37J756j262
2861A43j494J491J351j893r34J968N83k111j37K032k33j963N51K000r51j748J224
2878a21J442j429j276J775P86j848l80J856K24k028K74J840n26j708P93J636j226
2895H4j409J432J160j717p39J777N73j971k23K051k15j966N51J972r04j801J310
2912c5J432j491j278J807Q79j924o69K077K97k101J05K098n75j894R62J629j202
2929A17j457J447J261j742q04J711N28j810j96J813q3j893N71J741q57j575J105
2946a23J407j347j261J689Q52j802m41J825J61j869J10J942n81j842R17J715j230
$$ y = [106, -1394, 147, 1348, -347, -1284, 614, 1138, -812, -984, 990, 788, -1141, -520, 1338, 351, -1306, -115, 1352, -155, -1328, 428, 1267, -612, -1162, 823, 1030, -1022, -785, 1264, 673, -1288, -351, 1405, 143, -1351, 140, 1491, -402, -1336, 632, 1215, -896, -1033, 999, 766, -1197, -646, 1354, 403, -1345, -121, 1321, -108, -1384, 391, 1177, -671, -1051, 805, 1029, -999, -725, 1115, 589, -1119, -326, 1310, 84, -1325, 107, 1267, -450, -1189, 588, 1161, -810, -1033, 1018, 803, -1163, -612, 1360, 456, -1345, -35, 1397, -94, -1372, 435, 1314, -610, -1279, 798, 1095, -1006, -901, 1197, 622, -1272, -310, 1319, 117, -1340, 107, 1368, -374, -1178, 533, 1061, -749, -945, 868, 785, -1108, -537, 1204, 347, -1228, -123, 1284, -63, -1324, 365, 1217, -585, -1026, 799, 960, -909, -799, 1143, 562, -1280, -363, 1352, 122]
2963A22j535J482J312j671r83J910N20j895k40J953j78j895M83J803q37j588J070
2980a67J420j307j226J596Q92j703o13J806K21j755M6J836m42j728P01J660j051
2997A86j468J297J187j473r25J719O23j873k28J852j47j817M93J793q53j641J147
3014a28J462j408j207J614R39j785o53J966J79j899R5J884l90j869P83J654j110
3031A27j381J361J134j529r10J702N50j746k39J788n7j823M40J668p20j551J036
3048a50J356j285j130J460R42j709n43J747K40j829J34J744l90j660O44J618j033
3065A56j374J331J138j506r68J749N47j802k38J855o3j789L33J850q59j634J135
3082a39J383j347j132J520R03j692n95J801K06j745J08J705m23j667P41J522j019
$$ y = [122, -1413, 69, 1381, -290, -1273, 637, 1157, -738, -978, 975, 797, -1098, -615, 1188, 351, -1237, -167, 1253, -54, -1280, 316, 1208, -495, -1108, 698, 919, -836, -790, 1046, 604, -1124, -423, 1237, 186, -1282, 15, 1202, -271, -1196, 523, 1146, -727, -955, 897, 750, -1067, -574, 1219, 366, -1275, -128, 1334, -74, -1281, 333, 1272, -513, -1166, 800, 979, -920, -825, 1059, 669, -1200, -417, 1237, 127, -1254, 107, 1241, -288, -1198, 504, 1054, -692, -931, 857, 800, -1023, -583, 1085, 365, -1186, -150, 1206, -79, -1209, 251, 1193, -516, -1059, 688, 928, -901, -767, 977, 587, -1073, -429, 1189, 156, -1218, 113, 1251, -255, -1223, 526, 1073, -729, -967, 888, 825, -964, -631, 1219, 360, -1274, -139, 1244, -103, -1235, 285, 1188, -504, -1099, 702, 908, -837, -729, 976, 553, -1114, -373, 1149, 130]
3099A30j300J302J127j579p47J609M65j727j82J814j24j779M38J636p06j605J109
3116a19J322j305j117J464Q67j617n97J834J96j873K34J673l45j761Q45J550j127
3133A24j295J283J125j543q61J656N47j727j98J783j53j751M19J679p37j508J048
3150a09J280j207j076J382Q21j606m75J641J86j656Q2J695m09j648P05J549r77
3167A78j420J299J115j476p46J579M85j710j82J786k32j679M38J673q17j436J022
3184a23J277j250j140J574P98j662n03J771J46j796J90J737m95j670P98J490j030
3201A12j296J266J032j366q26J609M73j698j59J720j57j706M67J603p38j517J071
3218a10J271j287r81J422Q23j686m45J686K22j716J25J743n50j628P80J554j160
$$ y = [130, -1170, 132, 1259, -320, -1067, 542, 1007, -720, -902, 912, 788, -991, -553, 1083, 377, -1228, -119, 1203, -102, -1219, 245, 1112, -505, -1102, 732, 928, -945, -711, 962, 617, -1144, -299, 1251, 124, -1171, 112, 1237, -306, -1167, 489, 1036, -691, -889, 894, 741, -1010, -591, 1088, 351, -1157, -109, 1171, -36, -1112, 270, 1091, -515, -990, 651, 837, -819, -737, 958, 549, -1099, -394, 1155, 178, -1242, 57, 1172, -304, -1050, 529, 1014, -696, -878, 908, 676, -1003, -565, 1108, 291, -1145, -123, 1154, -96, -1236, 338, 1136, -526, -1029, 742, 888, -908, -718, 1019, 524, -1146, -348, 1142, 112, -1184, 82, 1114, -252, -1078, 531, 1004, -694, -853, 867, 710, -996, -529, 1074, 336, -1181, -110, 1161, -126, -1107, 315, 1138, -548, -993, 693, 915, -801, -676, 1067, 517, -1111, -331, 1223, 63]
3235F3j281J351J037j553p36J646N00j799j54J814k17j707N02J684q29j470J039
3252a10J275j296j112J556Q04j701m09J748J24j702J39J715n30j595Q10J395r44
3269A67j333J222J105j486p77J646M18j659j96J770j69j734N06J671q65j607J226
3286i5J319j312j090J565P38j721l93J786M9j805K29J754n20j663Q48J504j128
3303F5j216J331J051j586q01J736N17j815p8J683j48j736M84J649q40j492J093
3320a03J290j334j040J560Q27j750m34J754Lj737L00J838o94j691J036J394j163
3337E6j377J528J079j678p61J797M53j876m0J922m45j756N93J780j063j447J240
3354EJ209j412j017J709O35j703m73J795R9j849K41J834n65j697Q67J523j182
$$ y = [63, -1218, 133, 1170, -383, -1119, 527, 1027, -772, -926, 888, 671, -1036, -534, 1150, 321, -1149, -110, 1165, -131, -1243, 313, 1117, -584, -993, 755, 879, -823, -684, 1031, 501, -1094, -284, 1111, 167, -1166, 56, 1161, -325, -1102, 544, 962, -697, -893, 877, 708, -1026, -520, 1151, 286, -1321, -95, 1224, -88, -1178, 387, 1125, -596, -989, 797, 846, -959, -730, 1024, 504, -1159, -311, 1193, 65, -1151, 180, 1231, -355, -1156, 580, 1097, -718, -796, 887, 739, -997, -513, 1136, 296, -1196, -103, 1187, -147, -1187, 373, 1200, -550, -984, 770, 773, -964, -664, 1174, 480, -1211, -175, 1219, 56, -1321, 207, 1286, -392, -1153, 644, 1097, -779, -819, 1103, 658, -1098, -505, 1275, 212, -1235, 5, 1214, -198, -1215, 494, 1129, -574, -1047, 748, 847, -1002, -761, 1073, 508, -1189, -322, 1201, 19]
3371A9j233J290J212j828n91J815L38j850r9J974l69j858P36J703j066j445J232
3388b0J343j603q96J658O53j741l56J888j21j850M12J753o45j575R59J371j222
3405Hj286J473J016j754m58J591L70j844J37J730m08j738Q03J637j152j299J118
3422e6J319j485j004J680O29j810k11J836l6j926M72J643o74j574J065J427j378
3439h3j239J698Q44j764n85J830K40j874M6J956n01j772P48J739j108j457J332
3456E0J211j480r71J757N03j704l07J877k05j746L73J840q42j585J153J361j382
3473i7j112J577P97j638n67J839J29j893J54J964o20j678Q46J558j138j353J361
3490A29J095j635p59J723M66j754k03J971l16j742N20J760r28j595J205J288j350
$$ y = [19, -1214, 76, 1288, -540, -1131, 684, 1022, -828, -927, 1047, 678, -1180, -444, 1259, 193, -1252, -20, 1323, -280, -1176, 482, 1135, -606, -962, 926, 805, -1045, -633, 1120, 475, -1100, -141, 1230, 8, -1278, 195, 1211, -543, -1001, 590, 960, -884, -747, 983, 575, -1163, -360, 1277, 125, -1174, -56, 1263, -222, -1226, 454, 1083, -727, -938, 898, 862, -1064, -592, 1051, 377, -1197, -132, 1295, -83, -1322, 376, 1220, -544, -1129, 701, 941, -933, -887, 1069, 568, -1204, -456, 1283, 175, -1282, 50, 1261, -219, -1190, 567, 1070, -634, -941, 936, 731, -1015, -642, 1198, 356, -1229, -76, 1285, -97, -1209, 368, 1165, -473, -1040, 799, 928, -965, -811, 1153, 533, -1145, -299, 1259, 121, -1232, 129, 1224, -411, -1170, 553, 1019, -735, -938, 1033, 717, -1025, -505, 1255, 327, -1268, -63, 1225, -125]
3507a25j077J659O63j705m68J848J57j927J98J897n54j712Q62J487j156j338J463
3524A72J049j588p66J718M47j873m3J837k03j823N16J728q93j533J202J283j445
3541b15r81J622O73j685m26J789J07j910M09J715o09j681R68J450j144j294J369
3558A57J051j646o68J744L54j756j01J858k69j812N83J681r64j441J166J278j482
3575b67r31J621O91j755l49J824K6j874L45J797o91j621J011J461j285j174J409
3592B38R48j677n65J713K92j768l2J853k27j935P62J565r62j411J180J244j437
3609b19r53J606O11j720k57J742k2j758K95J728o50j611R52J360j149j155J450
3626B50Q40j614n16J682L09j772K5J829m00j796P26J645j062j368J185J246j518
$$ y = [-125, -1202, 457, 1120, -585, -1053, 795, 952, -975, -777, 1120, 566, -1146, -284, 1203, 47, -1291, 172, 1221, -367, -1133, 585, 1032, -841, -884, 953, 750, -1073, -557, 1171, 278, -1255, -53, 1230, -215, -1196, 426, 1099, -586, -1012, 777, 884, -1026, -617, 1098, 489, -1192, -224, 1226, 82, -1212, 157, 1208, -438, -1106, 638, 992, -764, -865, 993, 724, -1088, -505, 1176, 212, -1229, -63, 1215, -267, -1198, 423, 1114, -641, -990, 834, 860, -1014, -669, 1128, 437, -1184, -173, 1288, 3, -1171, 238, 1186, -491, -1056, 657, 949, -819, -851, 1002, 775, -1160, -398, 1167, 205, -1206, -26, 1218, -219, -1172, 434, 1045, -675, -932, 810, 788, -970, -675, 1053, 403, -1208, -256, 1104, -45, -1200, 250, 1090, -524, -1040, 642, 951, -821, -796, 1033, 633, -1163, -437, 1208, 146, -1222, -37, 1209, -309]
3643c09q65J651O44j820k94J784pj701K95J661o53j565J022J289j202j103J473
3660C00Q53j581o27J777J26j656R7J708n06j561O97J529r87j311J212J047j424
3677c07q25J682N72j843k23J824j31j723M75J618q12j516J052J359j308j081J462
3694B75P90j591m60J622K45j748J24J732m84j615O99J549j016j356J305J102j438
3711b65q47J620M89j691j31J688j10j718M12J692q12j537J042J255j273j003J538
3728C49P38j623m46J785O7j782J72J771o34j512Q35J381j019j233J292R37j406
3745c28o39J471M48j617k26J799l05j579N26J575q12j450J152J100j300q74J439
3762C80O68j570l16J518J00j615K33J612n62j503Q51J368j149j170J337R14j565
$$ y = [-309, -1174, 477, 1121, -699, -993, 791, 784, -917, -622, 1039, 386, -1179, -157, 1132, -70, -1173, 300, 1153, -428, -1055, 722, 848, -808, -711, 997, 491, -1070, -373, 1156, 169, -1142, 70, 1117, -307, -1132, 550, 1122, -721, -944, 880, 749, -974, -499, 1119, 307, -1209, -157, 1202, -106, -1187, 275, 1065, -526, -986, 636, 881, -867, -743, 989, 505, -1110, -411, 1138, 122, -1234, 71, 1173, -265, -1112, 508, 997, -694, -825, 863, 753, -965, -553, 1139, 327, -1210, -168, 1087, -186, -1189, 349, 1087, -536, -982, 803, 870, -912, -740, 1031, 397, -1115, -280, 1101, 82, -1151, 141, 1078, -328, -967, 504, 952, -665, -891, 908, 603, -976, -450, 1125, 313, -1137, 15, 1115, -185, -1059, 380, 1048, -522, -838, 680, 780, -835, -602, 1010, 448, -1055, -204, 1164, 15, -1155, 182, 1096, -469]
3779d69n70J660L29j763N1J699l14j741P41J546r09j412J185J080j302r00J464
3796C75O68j613k43J579M0j676K90J584o20j497R60J268j154j085J363Q63j544
3813d42n23J603K46j717J25J614l55j603P11J470r22j385J249J106j502q21J643
3830D97M46j543k83J629j7j679L39J686p41j506J076J254j275r77J376P43j509
3847d84m94J715J26j667N4J697m83j588P77J497j055j162J226R51j414p63J541
3864D74N08j670j74J710j44j706N28J573p81j408R89J288j329j009J485P64j631
3881e33m60J675J54j788L10J600m80j499P60J387j110j183J335R42j492o67J633
3898E84L97j672m9J654k40j724O01J522q23j376J045J305j377r98J477O97j566
$$ y = [-469, -1039, 621, 950, -813, -762, 937, 623, -1118, -377, 1169, 260, -1152, 33, 1113, -189, -1089, 375, 1043, -570, -813, 766, 806, -870, -580, 1004, 384, -1113, -153, 1115, -39, -1124, 239, 1102, -442, -965, 638, 884, -833, -708, 906, 551, -1052, -341, 1129, 207, -1178, 71, 1177, -325, -1146, 497, 943, -600, -883, 746, 729, -950, -611, 1075, 334, -1172, -96, 1158, -117, -1094, 282, 1025, -484, -978, 737, 863, -804, -750, 947, 464, -1124, -347, 1150, 95, -1067, 159, 1110, -304, -1067, 474, 982, -688, -862, 848, 704, -1002, -474, 1099, 318, -1090, -101, 1187, -142, -1151, 334, 1098, -533, -993, 682, 836, -952, -642, 958, 478, -1021, -261, 1126, 16, -1167, 168, 1110, -382, -1049, 584, 981, -691, -740, 914, 674, -1050, -449, 1073, 250, -1126, -81, 1224, -153, -1151, 326, 1023, -543]
3915e43l54J666N3j740L08J675n92j652R37J387j125j146J333Q89j517o13J564
3932E30L75j682M1J658l84j607O32J543r57j242J057J180j365r23J565N68j571
3949e82l03J679k2j730L82J607o74j452R66J224j156j006J310Q52j524n88J679
3966F62K74j709K8J655l66j602P19J484j019j254J228J032j395p95J548M92j606
3983f24l11J685l7j673L89J625o66j543J029J277j220j096J480P55j526n22J770
4000G92Q4j736J51J722m65j630P55J513j031j319J253J043j481o34J552M42j786
4017g75n4J723k77j604M70J595o93j499J081J183j243j020J402P31j555m13J646
4034F98J11j733L38J544m68j598Q58J335j087j178J335R32j425p63J734L53j776
$$ y = [-543, -897, 769, 822, -918, -610, 1065, 473, -1179, -242, 1145, 20, -1126, 207, 1096, -421, -1034, 530, 905, -777, -736, 922, 538, -1069, -437, 1106, 149, -1093, -36, 1144, -221, -1144, 421, 989, -582, -885, 794, 772, -958, -576, 1031, 357, -1095, -129, 1095, -61, -1067, 243, 1095, -429, -1017, 662, 936, -773, -745, 910, 544, -1058, -339, 1145, 126, -1128, 100, 1132, -263, -1058, 490, 982, -624, -935, 750, 713, -960, -571, 1054, 388, -1155, -126, 1151, -69, -1165, 315, 1070, -456, -978, 792, 876, -860, -709, 1013, 548, -1082, -327, 1186, 155, -1164, 89, 1132, -349, -983, 569, 1011, -775, -829, 894, 617, -987, -517, 1078, 385, -1114, -33, 1150, -93, -1113, 289, 1020, -535, -948, 698, 809, -924, -586, 958, 490, -1108, -250, 1085, -2, -1180, 155, 1087, -338, -1101, 633, 986, -790]
4051g90m6J749l14j658O62J521q02j482J151J193j333r96J579O40j658l39J758
4068H35lj781K67J800o94j522R49J237j035j192J387P89j390p16J641L26j677
4085g79J03J578k97j665P05J417q11j427J158J186j387q53J600N26j703k74J679
4102G56o6j641M03J679p88j476J019J311j266j083J505P33j574n63J712K67j862
4119i34J71J748m71j627P43J397q79j314J255J080j553o28J481L85j475l30J747
4136G96p8j686M44J608q05j431J076J195j182j002J339O79j399n77J685J42j614
4153h10J06J698m62j688J000J259j019j212J318R87j590o32J532M30j586j15J722
4170I38l39j545O27J361q05j311J148J077j271r03J295P67j580l70J638J20j766
$$ y = [-790, -836, 913, 599, -1059, -397, 1124, 322, -1160, -9, 1184, -149, -1145, 434, 1074, -584, -923, 835, 832, -949, -682, 1118, 424, -1098, -149, 1088, 53, -1139, 248, 1037, -353, -1069, 572, 898, -779, -676, 902, 605, -1060, -355, 1062, 251, -1176, -18, 1168, -219, -1072, 528, 1054, -649, -923, 756, 690, -951, -548, 1131, 343, -1133, -114, 1197, -69, -1152, 353, 1086, -488, -1051, 661, 928, -934, -763, 985, 514, -1113, -370, 1027, 148, -1166, 89, 1169, -384, -1012, 469, 854, -621, -951, 796, 718, -968, -524, 1084, 279, -1152, -76, 1119, -63, -1065, 274, 953, -446, -1023, 662, 804, -810, -704, 994, 532, -1156, -156, 1103, 84, -1128, 190, 1177, -413, -1045, 487, 917, -669, -784, 938, 599, -946, -319, 1042, 237, -1074, 74, 1151, -120, -1023, 272, 1039, -541, -911, 727, 847, -919]
4187i19L80J429m64j438P84J383j122j185J335Q26j361p12J716K16j659m0J671
4204H40j25j665N72J436q56j352J246R82j251q47J446N28j639j72J575Q0j680
4221h82L56J464n70j449Q64J319j039j233J498P82j483n50J460L47j649N8J557
4238H50k23j623N41J501r22j175R94J123j368p39J427O35j575l83J778r7j726
4255i82L91J672o34j502R92J214j031j185J304Q17j512n61J596L14j725J81J544
4272H93l39j524O21J408p50j411J220R63j365p19J612L16j495k45J601l8j663
4289i15L77J557o66j421J018J159j172j076J478P31j566m44J587J74j623R8J656
4306I52l96j580O59J449j023j199J208J022j361p93J567M55j588o2J522j61j623
$$ y = [-919, -539, 890, 426, -1012, -228, 1155, 33, -1152, 183, 1009, -352, -1064, 652, 868, -791, -831, 840, 715, -950, -378, 1058, 202, -1150, 96, 1078, -173, -1020, 426, 954, -685, -857, 718, 798, -882, -526, 938, 368, -1081, -217, 1102, 63, -1170, 328, 1110, -373, -923, 537, 884, -765, -707, 850, 627, -996, -455, 1046, 124, -1051, -57, 1066, -302, -1041, 386, 1021, -554, -937, 841, 744, -982, -591, 1081, 447, -1055, -63, 1151, 120, -1065, 239, 1056, -456, -1017, 579, 893, -832, -651, 893, 554, -970, -349, 1059, 309, -1102, 118, 1081, -284, -1003, 609, 925, -570, -815, 786, 748, -915, -538, 1019, 353, -1068, -50, 1109, -63, -1139, 339, 1070, -496, -940, 647, 821, -802, -704, 952, 556, -1024, -365, 1084, 61, -1138, 70, 1092, -269, -1062, 505, 960, -628, -690, 832, 671, -952]
4323i52M96J471o89j396J013J189j268r63J415P11j502m56J634Q1j602J28J609
4340I19m43j539P74J366j008j149J209R53j384o78J454M72j579j91J672k05j628
4357i85M91J586q46j383J095J154j263r41J447O44j516l72J625K7j675L22J573
4374I83n35j528Q79J277j018j183J345R17j496o49J551L92j665m0J724l27j581
4391i54N19J460p32j355J057J107j288r29J500O15j550l74J709nj700L62J528
4408I70n48j501Q45J388j143j149J342Q79j457o08J595K16j579N6J596l09j585
4425i92N66J496q73j335J114J116j313q23J504N30j581k98J632k4j579L68J446
4442I54o01j448R87J207j198r92J324Q58j536n06J600K62j734J59J611m20j566
$$ y = [-952, -456, 1015, 326, -1070, -57, 1132, -136, -1099, 316, 1027, -475, -931, 703, 784, -818, -690, 919, 476, -1063, -289, 1077, 69, -1080, 129, 1082, -302, -980, 474, 946, -633, -824, 848, 643, -985, -494, 1092, 246, -1137, -42, 1112, -151, -1092, 355, 999, -517, -889, 736, 763, -912, -590, 983, 448, -1080, -201, 1076, 58, -1125, 220, 1137, -359, -1008, 543, 935, -730, -770, 954, 627, -954, -435, 1025, 293, -1062, -5, 1102, -186, -1115, 385, 1000, -550, -924, 785, 780, -920, -558, 970, 422, -1079, -234, 1154, 11, -1138, 204, 1083, -374, -982, 613, 829, -750, -694, 902, 593, -992, -426, 1070, 197, -1138, -24, 1092, -221, -1044, 460, 990, -591, -889, 743, 719, -860, -492, 954, 353, -1095, -108, 1099, -99, -1091, 233, 1091, -445, -951, 649, 911, -823, -664, 947, 527, -1039]
4459a039O67J487r75j225J172J016j337p96J559L85j608j73J653n9j641L76J563
4476A025p10j443J035J201j269r45J416P59j614m29J690J04j618J16J668m93j552
4493a059P75J366j003j205J252R68j381o99J447M31j645m6J628k40j639N99J510
4510A059q55j242R70J164j236r76J435O60j525l58J664N0j705L15J564n40j428
4527i84P37J352j060j170J316Q67j493n82J639K49j616k2J625k79j573N97J521
4544A124r67j275J092J152j300q96J479O23j672k07J565j3j651L74J582o23j460
4561a073Q55J356j173j056J323P72j460n12J552K63j607J1J577k63j557O92J313
4578A013q76j160J094J047j379p68J459M92j584k00J649p2j695L86J564o26j423
$$ y = [-1039, -372, 1115, 140, -1085, 87, 1103, -234, -1030, 529, 914, -694, -867, 786, 727, -914, -538, 1025, 315, -1128, -93, 1108, -161, -1106, 310, 1069, -545, -974, 716, 820, -798, -682, 986, 493, -1059, -284, 1082, 79, -1126, 126, 1094, -287, -986, 461, 892, -753, -799, 829, 589, -1050, -451, 1059, 204, -1038, -68, 1096, -140, -1116, 319, 979, -546, -904, 760, 810, -895, -580, 984, 444, -984, -247, 1105, 45, -1125, 191, 1058, -435, -1017, 622, 871, -745, -767, 858, 579, -994, -397, 1124, 157, -1118, -26, 1126, -174, -1070, 409, 1032, -640, -847, 718, 705, -946, -572, 1010, 387, -1073, -218, 1138, -35, -1091, 232, 1004, -456, -968, 584, 847, -760, -749, 828, 565, -992, -300, 1013, 137, -1023, 71, 1118, -261, -1029, 430, 922, -662, -862, 787, 715, -980, -594, 970, 344, -1079]
4595a079R52J189j141j034J369Q11j592m61J673J43j663J50J536l56j475O47J392
4612A061j010j143J263R52j391p81J496M38j539j97J639j14j640M77J412o10j472
4629a159J109J078j147r19J301P57j671k55J641J14j719K83J514n59j462Q28J343
4646A077j002j201J286Q97j397o51J553L30j562p8J584k32j567N04J482q30j233
4663a040J012J153j268q63J370O58j606l07J582J87j722L03J530n75j407P61J290
4680A058j107j028J258R04j451o31J538L35j642P2J535l26j545O69J386q49j259
4697a083J089J127j377p92J424N17j436l83J700o1j628K71J673n96j463P75J339
4714A096j041j114J315P80j464m80J543K32j561l5J587l53j508O88J354r44j223
$$ y = [-1079, -127, 1062, -79, -1113, 256, 1067, -525, -986, 687, 830, -833, -683, 853, 497, -978, -331, 1061, 51, -1092, 171, 1123, -268, -1049, 447, 885, -654, -851, 788, 674, -966, -489, 923, 313, -1159, -50, 1028, -119, -1038, 263, 1020, -651, -906, 735, 849, -870, -587, 927, 368, -1094, -266, 1077, 75, -1126, 160, 1057, -340, -991, 562, 892, -670, -748, 836, 604, -963, -459, 1023, 193, -1040, -28, 1125, -143, -1006, 364, 1022, -584, -891, 691, 878, -844, -541, 989, 414, -993, -232, 1058, -49, -1077, 181, 1085, -366, -997, 541, 876, -766, -694, 841, 515, -1030, -361, 1025, 176, -1083, 6, 1133, -244, -1036, 388, 905, -531, -914, 786, 725, -903, -632, 1041, 445, -1018, -243, 1096, 55, -1059, 256, 1036, -428, -908, 635, 867, -694, -729, 858, 505, -1003, -315, 1039, 95, -1128]
4731a128J190R71j282p30J459M75j608j24J666k98j511M12J536o43j436R28J151
4748A028j075r25J272P04j409m68J537J43j561J09J530m44j496Q16J316r17j317
4765a157J231R76j376o50J457M62j605oJ430j64j586N60J418p64j214R52J077
4782A041j212q72J307O83j457l32J439J37j548K31J449n24j313P14J239r01j102
4799a021J136R11j409n17J444L29j593k3J537k08j497N25J349p59j259J071J009
4816A025j199q15J373N24j418l86J510J46j600K66J498n28j444R98J011r53j105
4833a097J338P34j371m81J451J85j427N3J446l44j479O28J292q86j059J015R81
4850I79j224p78J445L80j439k20J525kj491L12J434o39j231Q35J089j068r68J310
$$ y = [-1128, 62, 1033, -249, -979, 480, 955, -653, -777, 889, 591, -920, -508, 1028, 385, -1051, -123, 1028, -47, -972, 300, 1004, -405, -873, 664, 807, -754, -645, 885, 441, -1055, -239, 1077, 160, -1157, 74, 1050, -326, -976, 481, 943, -662, -668, 762, 598, -988, -428, 990, 226, -988, -36, 1041, -171, -1043, 264, 947, -510, -842, 597, 734, -814, -583, 866, 342, -971, -257, 982, 81, -1021, 115, 1026, -383, -900, 544, 873, -720, -743, 794, 586, -911, -386, 963, 204, -1055, 16, 1025, -174, -989, 384, 908, -510, -896, 614, 760, -840, -574, 924, 396, -1048, -50, 961, 8, -1097, 241, 975, -396, -877, 574, 759, -668, -615, 831, 487, -992, -364, 928, 42, -1017, -2, 979, -245, -1023, 422, 802, -637, -857, 668, 666, -825, -513, 921, 282, -949, -114, 975, -93, -1061, 249]
4868B49O83j455l68J436K13j459J71J330l24j339O00J282r35j095J032R36j167
4885b10p40J469L37j486j57J589k52j404M53J300o24j193P34J164j069r18J304
4902B97O11j314m22J397J08j430Q9J557m85j236O48J127q81j118J123Q35j217
4919c11m93J296L90j428j02J387j91j430N73J238p08j179R38R47j048q19J298
4936C58N93j477k77J389J22j504L12J335m33j310O39J209r90r53J119P97j261
4953c32n52J473K21j478O9J370k32j402N32J220p10j121R95R61j175p39J264M60
4971H24j342j60J374r0j322K30J258m38j301P73J133r09j028J215O74j235n90
4988i34J398L06j491L0J459k67j401O59J158p64j071R02R35j197n92J262M23j429
$$ y = [249, 932, -523, -891, 545, 758, -701, -530, 800, 476, -863, -263, 1019, 84, -1011, 21, 957, -210, -950, 519, 856, -630, -787, 802, 550, -854, -401, 899, 275, -918, -184, 980, -89, -1007, 297, 908, -406, -828, 569, 677, -753, -664, 893, 408, -828, -180, 947, 66, -1052, 71, 906, -311, -804, 492, 882, -546, -648, 739, 548, -882, -309, 929, 221, -958, -20, 927, -121, -940, 358, 951, -526, -803, 586, 708, -796, -484, 851, 418, -892, -253, 956, -34, -987, 132, 929, -332, -884, 589, 810, -668, -599, 771, 539, -863, -331, 889, 179, -942, 53, 1014, -161, -900, 364, 824, -518, -678, 696, 606, -716, -486, 772, 334, -967, -194, 939, 30, -998, 217, 891, -344, -934, 464, 770, -721, -691, 768, 501, -900, -241, 917, 153, -918, -16, 919, -278, -870, 392, 815, -614]
5006f14j14J460j17j391L72J350o63j209Q16J112j086q61J116Q36j421m45J431
5023E72J14j471J40J505n18j333P18J142p98j050J061Q51j229n75J252M41j375
5040e53j52J379j22j381L50J389n68j189P39J147j188p70J202N88j327l25J396
5057F15K8j435K01J523n05j300O68J104q74r25J096P16j200o11J354M22j479Q
5075e94J324j60j456M79J306p71j085Q78J055j191o92J244M42j310j53J372p4
5092F14j394K51J407m82j324P61J057p90j059J154O75j208m83J389J89j427l2
5109g02J493l37j348N78J248p67j148R74R04j142o44J345L72j253k57J403j24
5126E95j397K57J446n87j217P68J062j007q56J193O34j247m50J409Q6j375J17
$$ y = [-614, -728, 732, 615, -776, -404, 946, 283, -926, -110, 1002, -84, -945, 171, 1007, -414, -859, 572, 686, -785, -645, 860, 342, -991, -273, 869, 71, -979, 82, 933, -296, -871, 381, 822, -553, -705, 674, 552, -829, -479, 910, 342, -847, -108, 1039, -149, -919, 283, 871, -456, -781, 615, 643, -792, -591, 932, 427, -873, -205, 899, 25, -900, 196, 912, -288, -899, 455, 877, -602, -594, 730, 570, -886, -407, 899, 128, -957, -79, 976, -215, -907, 337, 779, -531, -684, 688, 614, -780, -529, 878, 396, -928, -167, 890, 100, -959, 195, 870, -338, -821, 568, 757, -670, -702, 791, 454, -894, -316, 932, 165, -983, -9, 895, -247, -891, 454, 826, -427, -684, 719, 595, -802, -545, 901, 314, -903, -135, 927, -80, -936, 257, 891, -356, -806, 603, 689, -686, -569]
5143e69J425l72j382O94J161p82j156J005Q82j141o28J234M72j398j35J466k42
5160E34j365M02J402o94j184Q04J090j080q51J218O21j347k83J379N6j478J86
5177e90J465n33j209O76J137r48r58J047Q09j227n67J278M27j412k3J353k54j307
5195h36N00J283p69j148R69R54j118p52J249N12j336k36J301O8j395J01J514n94
5213B67j140P98J089r98r50J151P03j266m28J288J92j389J37J257k46j290N50
5230b75J114o74j002Q51R20j136o88J270M58j383j74J327o1j281L32J286n78j227
5248i21Q28R69r69p85J100O36j272l82J366R3j295Q5J357m62j181N57J185q10
5266I9j034J009Q96j203p30J356M16j294j22J264j4j421L85J213n78j169Q42R74
$$ y = [-569, 856, 484, -898, -204, 957, 175, -981, 24, 906, -235, -863, 371, 843, -555, -690, 776, 534, -831, -429, 973, 279, -905, -101, 989, -91, -942, 276, 897, -450, -733, 646, 702, -776, -590, 875, 342, -867, -191, 946, -2, -960, 87, 896, -331, -898, 380, 807, -605, -628, 725, 471, -836, -336, 947, 178, -970, -1, 953, -165, -917, 332, 844, -492, -728, 573, 641, -754, -653, 861, 267, -873, -75, 1014, 16, -934, 217, 920, -346, -774, 514, 706, -683, -546, 711, 465, -825, -275, 839, 165, -837, 14, 934, -202, -890, 380, 838, -545, -719, 608, 547, -734, -402, 884, 306, -921, -93, 876, -93, -878, 222, 858, -414, -796, 570, 663, -632, -547, 810, 348, -833, -276, 909, 99, -935, 74, 970, -233, -963, 393, 809, -485, -607, 657, 643, -778, -393, 820, 242, -927, -85, 889]
5284H89r24q31J124N94j244l94J333J31j344J95J261m57j181O26J075q66q94J064
5302A57P61j245m73J231L45j315j37J325j83j273M00J218o19j190R18R78r40q46
5320h88J170N85j394k11J317R6j346L15J135m54j131N54J202r62q69J107O01j151
5338c24n01J318J86j343J07J234k23j273N36J117o90j063R97Q48j065q10J354
5355D05L21j210k10J291l9j161K84J129n30j131P12R96r62q00J155N72j161m12
5373g51J231K32j377Q5J384m13j230N09J209p83r70Q72Q28j090m90J103L29j151
5391d73j17J260j47j258L79J113n44j027P95P80q15q24J176N01j303k57J286J51
5409F76j263M9J284l28j213N91R78p01r02R09P51j134n09J170L33j286p1J319
$$ y = [889, -35, -866, 258, 852, -392, -786, 547, 678, -666, -471, 790, 333, -848, -222, 853, -13, -907, 157, 918, -327, -800, 431, 776, -539, -676, 649, 466, -807, -407, 811, 192, -998, -80, 898, -42, -888, 282, 867, -527, -738, 579, 675, -671, -356, 779, 325, -806, -252, 950, -12, -881, 226, 827, -324, -825, 493, 679, -664, -557, 677, 454, -819, -283, 834, 144, -919, 78, 926, -139, -949, 405, 726, -484, -694, 597, 558, -603, -319, 810, 280, -851, -139, 857, -105, -905, 250, 822, -339, -751, 480, 712, -665, -580, 804, 391, -839, -330, 879, 96, -874, -2, 826, -264, -754, 349, 678, -473, -590, 670, 523, -735, -356, 757, 213, -814, -19, 761, -54, -878, 298, 799, -504, -761, 525, 676, -587, -538, 746, 418, -795, -204, 774, 73, -829, 80, 831, -303, -812, 358, 691, -595, -666, 653]
5427F53k00j183M16J155o45j059P79Q94r18o68J033M64j099k83J279J7j269J86
5445d48J136l27j119N39J016p17r03R84O44j104m50J090L60j324k3J301j93j153
5463f91L81J049o36r14Q40P73q44p27J069M65j230k83J346l2j182J86J144l81
5481C33j165P05J010r14q00J010N42r75m66J188K27j279jJ254k64j113M27J048
5499G67o63r23Q98P34r47o67J117L53j072k48J247j24j217L09J229o20r85P50
5517f2Q74q68p36J062M80j085l51J123J27j133O0J283m29j059M92R55o65q75Q63
5536E6P21r81n98J086M39j227o3J094k7j175L39J097n31j061P69Q88r01o98J002
5555B29M51j038k76J141J18j244K10J113l67j082N53J026q18q58J028N78r90m63
$$ y = [653, 453, -730, -314, 841, 196, -863, -84, 810, -108, -776, 257, 721, -378, -661, 618, 635, -634, -448, 688, 361, -758, -219, 797, 80, -823, 161, 805, -299, -749, 341, 701, -623, -646, 655, 462, -691, -310, 739, 103, -811, 29, 802, -42, -769, 300, 765, -465, -748, 598, 566, -616, -430, 714, 333, -832, -127, 883, -31, -831, 179, 721, -254, -720, 468, 695, -584, -585, 669, 405, -708, -281, 767, 104, -819, 79, 813, -134, -801, 316, 669, -403, -651, 596, 472, -745, -436, 793, 173, -812, -62, 812, -56, -792, 270, 750, -335, -686, 437, 564, -569, -509, 774, 345, -714, -222, 733, 68, -807, 56, 777, -204, -802, 284, 723, -504, -567, 527, 500, -675, -336, 761, 230, -831, -62, 826, -75, -773, 229, 680, -358, -634, 507, 625, -619, -409, 704, 337, -745, -192, 834, 16, -842, 186, 764, -226, -689]
5573f89J051K72j172r2J162o3j158L54J064o22q53P61O78q67n96R71N37j102k85
5592f49J195M4j256K04J134m28j014O34R88q91q28R33P64j150l91J101K30j183
5610e63k4J254k67j247N09J205p35q88Q12O82r65n11J071L98j167k04J217m1j224
5629f88L58J082o05q55N35J007r07p16J002N27j028l43J038K11j200R3J172k60
5647D23j128L87J070o23r16R23O39r39n55R92L58j063j73J179j44j064K36J134
5665G36m77j043O99Q74r00o43R78M95j099k32J047J37j204J48J195l77j081N36
5683b11R88p12q20Q12P12j044m32J022L57j170n3J122p7j194M17R82n03r11O63
5702e2Q09q39o35R09N53j067k82J006J44j111J25J052l15j019N30R62p63p58Q67
$$ y = [-689, 362, 634, -538, -630, 532, 469, -689, -335, 729, 107, -746, 15, 693, -174, -770, 201, 738, -364, -649, 546, 590, -666, -462, 672, 244, -770, -136, 852, -39, -867, 66, 830, -320, -711, 390, 620, -563, -587, 667, 400, -847, -338, 867, 132, -756, 56, 738, -227, -738, 333, 731, -436, -640, 577, 536, -688, -330, 752, 147, -708, -173, 834, -73, -789, 213, 740, -288, -631, 407, 618, -582, -489, 683, 423, -705, -318, 752, 129, -787, 136, 775, -164, -719, 273, 631, -432, -605, 574, 430, -634, -398, 736, 259, -784, -85, 789, -111, -754, 224, 719, -380, -612, 435, 572, -632, -484, 711, 334, -747, -211, 777, 65, -755, 57, 769, -275, -707, 315, 672, -498, -551, 571, 494, -700, -283, 699, 196, -715, -52, 757, -82, -717, 192, 745, -322, -604, 402, 546, -565, -440, 612, 297, -722, -192, 770, 7, -751, 116]
5721A16O50j061l66J113J82j138o0J257l01j106N20R53n66r86P18Q67r22o22J026
5740B74L93j027k78J154j4j142K93J036m27r64N71Q40o90p08Q81N60j014l38J000
5759D00J61j099R9R84k10q95K97R55n08r12P48Q05r63o78J053M65j107j11R34
5778D18N0j084L95R13m55j011P11P72p76p10R19N05r72l17J022J47r95MJ080l45
5798B71q16L60J025p20q60Q23O09p47n89Q87K74r25j14J009o7j060L74Q79l96
5817B17r09N70R23q93o16R08M24r68k43J044M4j055J74R42k99r47N21R55p98p20
5837g26Q56N27r09l93R69L32j097o0J023j76r18K95R79n53p95O74P25q36n49R15
5857B83M10j090j58R96j0r12J50J039m22r46M98Q55n77p85Q27N29r13m06J038
$$ y = [116, 766, -295, -661, 452, 634, -504, -564, 693, 392, -714, -194, 759, 193, -793, -75, 792, -130, -752, 274, 667, -360, -638, 516, 502, -640, -347, 689, 262, -702, -131, 709, 19, -689, 192, 752, -262, -600, 400, 561, -538, -439, 545, 335, -560, -263, 692, 184, -728, 20, 825, -138, -816, 237, 702, -405, -516, 418, 468, -616, -221, 692, 237, -774, -63, 709, -67, -777, 142, 647, -325, -642, 380, 527, -468, -464, 616, 271, -545, -185, 840, 120, -740, 83, 692, -55, -644, 243, 517, -408, -522, 487, 420, -640, -266, 613, 217, -692, -122, 801, -92, -708, 200, 624, -344, -587, 457, 501, -554, -380, 562, 263, -684, -163, 792, -6, -726, 130, 657, -252, -645, 324, 656, -441, -501, 522, 346, -572, -277, 702, 149, -646, 28, 753, -83, -632, 283, 693, -397, -555, 441, 431, -481, -331, 708, 286, -660, -162, 693, 116, -669, 158, 687, -226, -632, 406]
5876D06J35r05j97J067q5j040L57R08m50q84O76Q02j008m46Q35L85r33j89J042
5895D76m9r62J67R66l16q82M77Q29p59n14O56N37q49l71R47J92r98P0R45j84r84
5916f06L61R12n97o92O70N77q07m33Q78K42q28k08J006j02r22K91R45m95q34N70
5936g2P88q53n54Q83M98r85k33Q97J22r41K5R62k32q09L83Q30p06n69N85N84p68
5957a65m44R32J90r64m4J079k26r54L48Q02l77r27O92O29o55n67Q15M20q98k85
5977e99J016R3j088K31Q60j95q88M03P32m77p51P12O02p49m33Q99K01j066L3Q88
5997D24n4r50K51R67m84p50O15N68o82n12Q51K96q59j38Q64N5r73J66Q34k73q39
6018f23M77O77n97n80P18N32q80k34Q30J66q63m0R05k47p93L14P97m69p10O41
$$ y = [406, 541, -364, -561, 506, 421, -619, -262, 646, 196, -688, -12, 790, -218, -664, 171, 556, -377, -566, 476, 427, -535, -368, 598, 282, -600, -123, 706, -53, -567, 89, 626, -223, -594, 353, 545, -453, -383, 562, 378, -606, -245, 667, 70, -622, 48, 625, -182, -615, 263, 505, -323, -531, 475, 373, -549, -258, 687, 192, -642, -72, 716, -137, -691, 192, 690, -295, -528, 369, 491, -450, -425, 537, 305, -504, -121, 709, 3, -566, 19, 603, -165, -609, 323, 513, -451, -495, 584, 358, -596, -248, 554, 177, -750, -58, 571, -84, -651, 164, 584, -314, -599, 417, 510, -578, -347, 513, 318, -570, -167, 565, 88, -663, 49, 651, -98, -531, 368, 569, -497, -464, 424, 370, -580, -329, 638, 154, -596, 19, 587, -95, -607, 244, 540, -319, -457, 407, 462, -511, -345, 489, 216, -623, -146, 531, -66, -646, 72, 604, -276, -510, 320, 486, -377, -417, 488, 241, -552, -238, 559, 90, -620, 21]
6038B1N25o68m55P34M59r13k36Q68M8q40J50Q85l81p76N51O34o34o29P59M01p45
6059b42k43Q51J42r56J8R50k02q41K99P91n25o41N81O91p67m31P62L17q74j18
6079d38Q13k2q30J53Q87m49o45M43O36n91n44O81M52p94k85R45Q8r67O9Q47j83
6100B66q24L77P93n21o70O95M73p21m08P93K21q01o9Q28n4q81K19Q42l57p70M83
6121h6P00p13l97O30L63p63j69Q41P8q68K7Q88l05p89M10O74m64n83O67L76o97
6142a80l25P34K08q16o5Q72j23q16K72P62l51p77N61O08o19m78O55L63p76j59
6162d50P36O5q23J46P95k07q12M19O85n61m90N59M16o55l59Q87Q0p13q0Q21j84
6183B75p93L57O44m31o18N71M82o18m49P83K78p28j80Q12L2q51J32Q74l99o55
$$ y = [21, 546, -122, -577, 157, 616, -297, -533, 335, 383, -457, -307, 578, 197, -579, -28, 606, -28, -657, 102, 503, -242, -485, 366, 508, -448, -430, 520, 318, -523, -224, 567, 42, -599, -18, 673, -94, -525, 237, 554, -320, -438, 375, 353, -477, -324, 563, 114, -531, -88, 548, -43, -587, 94, 546, -248, -533, 412, 500, -467, -398, 449, 266, -558, -181, 612, 91, -579, 116, 589, -132, -540, 253, 474, -327, -396, 432, 378, -503, -284, 558, 201, -569, -86, 614, -99, -496, 134, 497, -266, -435, 406, 484, -384, -357, 531, 226, -563, -153, 521, 57, -526, 141, 517, -180, -505, 229, 437, -379, -444, 428, 305, -511, -239, 523, 172, -605, -44, 564, -55, -533, 122, 485, -291, -450, 286, 351, -472, -326, 469, 262, -550, -131, 554, -7, -497, 62, 478, -177, -536, 351, 431, -282, -362, 459, 275, -518, -161, 483, 52, -566, 5, 487, -131, -580, 203, 481, -247, -427, 385, 417, -434, -302, 572, 173, -482]
6203d82M23O34n85n11O29M19p04k79P45J01p65J2Q04j39q03K62P17m40o29N58
6223c3N95o47m03O95K31p83q3P97%q21J77P59l29p22N06N85n38n38O96L79p50
6244b27k25P96K1q25J18P67k19p36L81O69m70o22O64N02p13l40P01J62p44m2P26
6265C44J8p88K13P37l25o89N16M87n55m55O33L29o90k24P52J25q19R7P73k32p55
6286e08L34O90m99n25N97L87o55k69O85K13p42j06Q01j18p84L01O91l78o09M65
6306b9N46n79m69O64L65p59j86Q20pp69J06P70k75p02M14O49n80n28N83M97o58
6327a27l33P95K8p42lP07m5o64K21O43m70n33M70N64n93m17O82K78p61r2P16L7
6349C61p69J51O77k44o42L44O50n18m95N88L28o52k43P68J16o95n2O51j62n89
$$ y = [-482, -59, 575, -10, -521, 108, 527, -177, -456, 289, 390, -375, -363, 441, 302, -501, -239, 478, 38, -591, -33, 562, -85, -488, 207, 438, -345, -428, 369, 369, -452, -275, 484, 155, -567, -61, 524, -14, -552, 144, 523, -227, -452, 344, 365, -460, -342, 425, 206, -530, -149, 520, 50, -572, 92, 594, -119, -459, 242, 404, -340, -382, 344, 362, -426, -213, 524, 199, -490, 26, 513, -42, -497, 136, 465, -225, -449, 303, 428, -391, -294, 479, 247, -508, -174, 516, 17, -508, 89, 476, -179, -448, 237, 450, -292, -398, 403, 285, -499, -198, 493, 115, -494, -29, 517, -62, -531, 133, 498, -261, -447, 373, 366, -403, -297, 473, 198, -504, -90, 559, -21, -549, 34, 531, -127, -460, 335, 363, -379, -382, 325, 280, -384, -163, 480, 10, -523, -53, 511, -82, -499, 183, 461, -300, -392, 324, 361, -408, -257, 420, 176, -466, -122, 528, 10, -485, 103, 431, -221, -464, 304, 420, -275, -327, 324, 162, -427]
6369d27K50O53l61o01M90N02n73l73O70J78p10r1Q17j64o79K27O13k22o43M19
6389b5M76n14l26N42L64p34k29P35J93p88K5P24j87p33L71O45n29n11O49L72n74
6410e4l88O74J89o59j79P34o7o45K03O05k84o16M89M73m89m72O63K53o64j62O60
6431B64O7p20R4P58k81o57L69N64m64n20O16M40o87k64O75R3o36l5P17j68o39
6452d14K37O13l18n84N16M20n74l75O08K98o95j49Q01op49J28O36k23o61L96N70
6473D75m49m90N77L75o47k83P13L4o30PP16j37o77K62O34l85n52M62M68n86l36
6494d49O39J94o46p4O67op49K01O41k61n93L76N35m69m56N66L19o07k31O51J02
6515C50o87N2O58j56o41K79N85l77n29M96M20n49l17O15J85o58o4O49l7o41J62
$$ y = [-427, -177, 476, 115, -486, 4, 506, -67, -440, 230, 408, -302, -393, 424, 260, -419, -192, 421, 199, -444, -25, 451, -63, -389, 153, 517, -217, -446, 289, 482, -306, -281, 443, 256, -477, -106, 539, 10, -501, 148, 520, -54, -442, 232, 421, -238, -417, 317, 250, -395, -192, 413, 129, -487, 2, 475, -14, -486, 177, 430, -234, -396, 264, 331, -389, -295, 463, 182, -475, -106, 458, -6, -526, 90, 530, -157, -421, 254, 347, -289, -324, 393, 225, -414, -177, 436, 118, -466, 50, 470, -104, -479, 129, 427, -268, -417, 384, 378, -371, -243, 393, 170, -491, -95, 475, 26, -464, 113, 488, -159, -442, 271, 305, -325, -318, 398, 261, -416, -154, 480, 95, -457, 5, 473, -113, -449, 190, 384, -262, -336, 331, 325, -424, -223, 418, 157, -436, -60, 475, 6, -450, 116, 435, -172, -403, 248, 350, -337, -285, 373, 217, -424, -145, 440, 63, -466, 30, 450, -99, -416, 199, 384, -274, -338, 311, 274, -367, -205]
6536b05O20k93n61M06M73m73m06N64K97o37j65O60M2o64M9O68j61o24K91N58m05
6557C4n24N50L54n68k66O29J50o15o7O50p6o43K11N91l10n31L95M87n06l89N98
6578A54K51o09j60O55K1o45Q7O35j99o06L19N36m29m42N03L44n57k68O19J33o27
6599b85j4O32j07o27K26N81l32n09M38M32n10l33N59K20n93j32O47ko27J04O28
6620C96k19n93L49N07m27m41M85L56n61k28O10J07o34K2O19j26o01K53N38l41
6640G1m86M10M30n04l37N85K05o09j15O39k1o14J51N81k45n39L39M79m43l98N43
6661A22K86n77j91O08P5o18K4O31j51n94K57N42l53m76M44L76m98l10N88J82n96
6682b29r2O17l8o08J65N69k63n37L53M92m67l85N32K89n79j91O27N5o20P2N90
$$ y = [-205, 415, 122, -439, -33, 440, -33, -439, 125, 422, -215, -380, 280, 322, -342, -293, 375, 214, -410, -119, 439, 34, -490, 60, 414, -154, -420, 209, 359, -256, -323, 327, 251, -392, -181, 410, 100, -431, -36, 451, -55, -444, 154, 405, -204, -364, 291, 312, -333, -246, 389, 190, -416, -97, 439, 10, -432, 71, 415, -142, -410, 209, 342, -285, -299, 333, 226, -401, -175, 406, 74, -435, 3, 435, -75, -408, 151, 371, -222, -354, 293, 291, -336, -232, 396, 177, -416, -67, 440, 13, -428, 57, 413, -148, -376, 234, 341, -293, -271, 348, 222, -379, -126, 412, 71, -415, -5, 425, -79, -416, 169, 374, -235, -350, 289, 268, -346, -195, 386, 141, -398, -59, 420, -23, -421, 122, 408, -169, -360, 248, 323, -295, -271, 360, 209, -385, -128, 414, 61, -415, 29, 405, -93, -403, 185, 367, -229, -321, 296, 258, -350, -185, 384, 121, -416, -63, 429, -38, -423, 109, 398, -181, -372, 255, 310, -310, -238, 352]
6703C52j73n61K70N34l78m68M60L83n39k68N78J75o26m1O19o9o10J74N90k98n19
6724d15L95M37m86l42N27K66n76j60O05M9o41R6N97j83n73K94N31m09m42M84L55
6745D09n47k53N91J54o31k0O25q0o10K00N65l08n17M15M19m99l21N43K42n95j25
6766c43O13K2o20Q9O12k16n56L03M86l75m46N00L31n39k48N91J33o23lO28j14
6787B25n98K30N49l31m97M32M05m99l14N60K02n77j25O46k7o20J17N92k24n58
6807d12L31M97m29l97M96L04n47k23O15R4o17PO22j29o13K63N32l47m75M55L76
6828D03n19k90N69K14o30n9O15j4o29J34N87k46n46L68M56m48l68N02K79n48j96
6849c66O15O5o38N0O25j64n72K48N24l57m53M60L74n29k74N85J49n99m9O29q7
$$ y = [352, 179, -382, -112, 422, 44, -424, 36, 419, -120, -388, 190, 365, -261, -302, 317, 248, -362, -188, 402, 104, -415, -20, 417, -69, -411, 116, 382, -194, -354, 251, 300, -341, -245, 352, 169, -404, -110, 421, 12, -430, 54, 409, -138, -391, 200, 354, -277, -297, 328, 248, -362, -162, 403, 95, -422, -7, 412, -87, -408, 135, 377, -218, -343, 270, 292, -328, -239, 373, 157, -399, -96, 390, 15, -431, 69, 400, -139, -387, 204, 337, -286, -289, 339, 225, -373, -143, 406, 75, -422, 10, 415, -84, -398, 162, 364, -213, -338, 308, 281, -339, -222, 370, 146, -412, -81, 416, -13, -410, 86, 390, -157, -380, 235, 329, -288, -281, 341, 212, -401, -138, 394, 47, -428, 27, 403, -116, -406, 163, 377, -253, -312, 303, 289, -340, -206, 381, 135, -411, -43, 413, -35, -403, 99, 378, -170, -366, 249, 314, -324, -274, 351, 187, -385, -137, 387, 30, -423, 37, 411, -118, -392, 193, 342, -257, -306, 323, 236]
6870B36n99J69N82k86n02L77M40m62l54N14K76n86j55O03M6o20O6O03j77n57K79
6891a07N26m00m23M58L43n35k42N76J31n91l0N97q7n82J95N50k91m97L87M30m74
6912f6l37N26K43n58j40O02J0o14J21N80k23n43L41M60m22l96M96L13n30k29N75
6933B09J22o22K8N85j13n95K50N49l56m64M19L84m83l02N46J90n76j08O17j3o09
6954c42J28N83k31n36L36M62m18m03N15K95n60j88N84P4n81L3N86j44n64K59N06
6975C94l55m47M35L62m97k78N58J69n86n1N81n1n75J62N45k42n07L55M38m37l76
6996d03M91K90n56j65N84N6n92L8O13j81n47K68N02l60m32M59L47n08k70N46J54
7017C34n78m6N96q6n57J56N51k77m92L70M06m37l21N08K29n54j21N81J5n91P6
$$ y = [236, -363, -194, 388, 102, -400, -23, 417, -45, -399, 115, 391, -195, -350, 253, 299, -321, -255, 348, 171, -386, -107, 419, 19, -404, 54, 397, -138, -380, 196, 327, -264, -294, 303, 216, -366, -171, 379, 88, -409, -22, 408, -66, -403, 123, 366, -192, -332, 270, 280, -334, -213, 367, 144, -399, -58, 402, -20, -416, 80, 393, -137, -366, 209, 331, -291, -263, 322, 209, -386, -136, 413, 57, -407, 12, 396, -87, -389, 157, 347, -229, -337, 280, 267, -342, -214, 369, 138, -398, -62, 400, -18, -421, 94, 389, -171, -359, 225, 299, -282, -249, 337, 193, -371, -112, 394, 39, -408, 27, 389, -108, -386, 172, 341, -245, -296, 285, 234, -341, -179, 366, 124, -383, -28, 410, -27, -403, 88, 378, -178, -343, 241, 297, -295, -257, 356, 175, -372, -104, 398, 38, -394, 65, 412, -96, -366, 180, 334, -244, -290, 306, 220, -337, -181, 370, 93, -399, -29, 377, -60, -381, 127, 356, -198, -319, 262, 277, -314, -238]
7038b38N81j98n24K99M66l82m04M62L14m96k29N49J28n92rN75q7n49J74N41k86
7059I5m87L89L99m51l17N17K14n59j20N74Pn85J10N72k26n07K97M52l80l60M34
7080F8L03n32j26N45P1n34m6N88j69n10K14M86k98m44L92L71m55k80M98K02n57
7101b13q2N54k2n53J15N44k34m83L06M58m17l68M82K76n14j88N62N2n58M0N63
7122C20j53n12K08N06l25m31M30L32m91k40N26J53n57m1N97j15n30J58N31k14
7142A52n49L80L73l30l28L80K88n53j32N34N4n58N8N38j37n10K18M44k87m54M53
7163C4L46m63k41N27P5n07m1N29m2n17J62M97k86m09K90M35m60k52M40J92m94
7184a85q0N22j6m93Q5M60j36n05K52M93l89l75M14L05m80k22N16J30n34l2N44
$$ y = [-238, 343, 145, -379, -80, 386, 4, -400, 62, 376, -120, -349, 200, 328, -264, -273, 302, 215, -334, -160, 381, 95, -392, -3, 396, -55, -372, 145, 359, -200, -320, 254, 261, -324, -214, 358, 132, -375, -78, 374, -6, -366, 68, 371, -161, -287, 258, 329, -205, -251, 337, 168, -342, -128, 358, 60, -384, 8, 379, -76, -356, 142, 344, -213, -295, 259, 237, -316, -201, 343, 109, -374, -68, 390, -27, -395, 87, 363, -151, -339, 223, 275, -283, -243, 320, 167, -345, -137, 369, 44, -387, 43, 375, -116, -356, 170, 323, -234, -275, 322, 207, -323, -165, 366, 152, -397, -17, 356, 26, -302, 78, 366, -187, -319, 215, 269, -289, -231, 307, 170, -340, -122, 322, 35, -419, 34, 380, -83, -324, 203, 278, -229, -270, 259, 217, -300, -138, 359, 73, -336, -46, 389, -71, -323, 117, 309, -185, -265, 257, 241, -252, -167, 293, 157, -348, -96, 397, 8, -367, 47, 352, -128, -350, 166, 296, -238, -270, 274]
7205B74q1n19J78M78k49m47L46L80m17k86M69K00n10j09N39Mn39R3N15j89m71
7226c41K82M23l53l86M51K69m79j94N07R5n13jN10j03m78J85M62k83m04L38L49
7247C36m21k61M80J61n03o9N18j2n21R8N21k04m77K87M20l68l25M38K48m66j68
7268b88M78Q2n14K1N17j26m79K05M30k65m16L70L21m27k56M82J56m88p4N01pn36
7290c13J35M93k04m70L05L89l73l20M56K24m68j53N03N0n10L8N12j31m82K33M22
7311C36k96l98L88L02m04k59M84J45n00p3N36n4n03J19M93k39m27L11L72l77l00
7332c44M32K35m74j43M99L4n09O6M97j54m76K45M15l14l51L95K75m34k00M71J25
7353B90n07k8N07n6m93J37M61k37m25L32L54l92k77M39J96m75j16N08Pm97P6M82
$$ y = [274, 193, -326, -148, 330, 81, -366, -20, 360, -57, -343, 126, 326, -184, -293, 246, 250, -289, -196, 319, 130, -341, -59, 364, 11, -375, 76, 345, -134, -328, 179, 274, -239, -240, 270, 167, -311, -126, 336, 53, -351, -13, 336, -85, -346, 134, 295, -208, -277, 241, 229, -292, -194, 327, 123, -354, -67, 353, -15, -340, 98, 346, -120, -288, 190, 272, -242, -221, 296, 170, -309, -104, 326, 61, -355, 15, 336, -91, -347, 135, 291, -197, -271, 230, 223, -313, -178, 315, 111, -359, -54, 335, -38, -358, 98, 322, -146, -299, 204, 254, -256, -218, 294, 163, -319, -86, 336, 40, -358, 30, 332, -72, -331, 153, 298, -202, -275, 261, 207, -296, -177, 316, 77, -350, -39, 333, -44, -344, 88, 323, -151, -294, 205, 239, -270, -204, 293, 139, -337, -92, 323, 9, -342, 53, 328, -106, -306, 165, 290, -217, -245, 262, 206, -287, -150, 311, 74, -351, -19, 335, -57, -334, 105, 301, -174, -290, 218, 225, -272, -196, 286]
7375B86j55m61K68L88l16l38L95K58m46j83M75J02m98MM83p7m86J67M59k69l78
7396c22L31L19l94k55M51J60m74q4N03l0m80R7M84j98m29K55L95l52l28L97K62
7417C08m40j67M87O1m96K9M91j17m73K10M29k72m04L60L30m16k31M52J53m89o4
7438b59M94k1m78J06M49j82m32K88L75l53l17M21K11m44j49M66M8m74M8M75j20
7459A52m58K08M19l00l61L69L09m43k12M62J38m89l9M97n8m78J33M67k32m04L00
7480b0L60l71l01M33J87m42j33N02L6n06N8M71j53m24K03M03k94l50L96K49m13
7501a09k01M50J14m68m4N02o7m74J60M32k28l97L22L28l93k45M27J85m59r6M62
7522B01K2m84R5M66j84m25K49L80l29l16L81K43m43j50M54Q4m78PM75r5m51J73
$$ y = [286, 131, -330, -62, 326, 10, -328, 67, 325, -121, -304, 171, 273, -225, -221, 262, 185, -301, -134, 325, 56, -322, 9, 328, -66, -321, 130, 290, -184, -268, 235, 205, -275, -178, 306, 108, -321, -66, 329, -23, -351, 46, 308, -132, -299, 188, 249, -247, -218, 273, 156, -317, -107, 322, 50, -354, 6, 336, -80, -311, 141, 294, -195, -259, 235, 214, -264, -158, 291, 109, -323, -35, 340, -13, -330, 91, 302, -142, -291, 175, 223, -251, -203, 272, 152, -306, -98, 321, 21, -340, 29, 338, -105, -317, 145, 283, -206, -245, 252, 194, -284, -151, 316, 84, -320, -20, 340, -31, -332, 101, 288, -154, -287, 215, 251, -255, -197, 274, 121, -303, -100, 303, 9, -341, 55, 304, -109, -310, 140, 254, -214, -258, 244, 177, -297, -137, 295, 67, -330, -8, 320, -73, -318, 109, 294, -165, -261, 201, 223, -261, -166, 300, 116, -309, -60, 320, -9, -325, 56, 299, -144, -294, 160, 244, -234, -227, 248, 153, -298, -125]
7544a25M34k53l87L26L04l61k46M24J55m60o7M70j3m69J13M36j80m17K74L66l52
7565b8k72L70K28m30j57M74N0m70L9M71j23m47K03M04k89l30L21K96m05j97M23
7586A31J18m49m0M64m5m42R9M48j95l92K74L36l48k62L82K06m37j19M63K9m56
7607b35N8M40j33m27K20L80k94l35L69K71l99k17M51J02m46k3M37n4m56J58M14
7628B81k32l60K87L14l53k37M09J72m32r7M41J1m46Q5M26j53m10K52L30k89k85
7649b86L38K54m13j46M06R9m54kM52j06m03J60L99k45l50K86K95l36k29L82J46
7670B47m23m3M26k1m44J15M13j58l95K63L07l13k58L87K03m39q5L41J02m71J36
7691a10L28p2m58K02M53l16k52K38K74l82k23M21K22m59o8M07l5l75QM75k09l87
$$ y = [-125, 309, 56, -331, -5, 299, -62, -308, 116, 271, -189, -256, 214, 201, -268, -155, 281, 101, -316, -42, 324, -28, -300, 70, 298, -132, -289, 185, 235, -235, -196, 275, 152, -295, -92, 312, 23, -307, 14, 310, -95, -292, 131, 249, -200, -240, 224, 179, -263, -164, 284, 89, -303, -29, 307, -41, -303, 79, 285, -152, -271, 192, 221, -235, -177, 263, 130, -297, -77, 303, 9, -326, 43, 314, -85, -302, 149, 251, -195, -218, 219, 165, -291, -133, 281, 49, -311, -24, 290, -63, -300, 109, 281, -151, -248, 193, 204, -242, -157, 269, 116, -294, -42, 288, -1, -286, 52, 306, -107, -253, 153, 252, -202, -204, 248, 142, -261, -101, 298, 53, -297, -11, 284, -52, -281, 101, 247, -176, -219, 207, 186, -258, -143, 270, 112, -283, -20, 287, -26, -284, 103, 306, -133, -218, 123, 225, -246, -110, 218, 146, -312, -110, 343, 27, -225, 13, 287, -95, -318, 103, 325, -134, -202, 205, 170, -205, -197, 278, 69, -318]
7713c18K57L13l45j73L90J07l18j06L61Nl55j7N01j97l98J98L71k30l39K90K76
7734B73m01j04L65J03l71n6M29o5m28J70L26j75l52K47L05l03k71M34J02l46r8
7755b16M18lm08P8L80r3m40K07L36k82l03L75K59m32j29M55L0m64L9M15j02k87
7777a67L0L75k13l06K72L40l41k57L59J47l90q8M32l4l64QM29j17l80K19K84j83
7799E5l76L48J36k93j10L70J15m32K5L62l6l61J08L17k08k66K73K09l48j23L29
7820I4J99m54j4M11p9l88J03L81j85l51K50K93k65k27L06J85l82j09M23K7m21
7841b03mM03j24l28J80L58k25l19L71J38k79k29L30J66l76r4M33K7m74J11M28
7862B90k26l51K80L09l36k04L04J77m51j9M07L8m63J10K61l1l74K29L64l10l48
$$ y = [-318, -61, 252, -93, -266, 124, 231, -87, -193, 168, 173, -182, -199, 302, 105, -293, -95, 276, 46, -293, -3, 273, -128, -232, 133, 236, -135, -191, 238, 173, -255, -85, 241, 66, -286, -39, 266, -37, -308, 126, 228, -118, -216, 202, 199, -209, -131, 249, 156, -284, -77, 259, -23, -326, 49, 308, -124, -253, 202, 232, -232, -193, 222, 120, -167, -137, 238, 25, -281, -9, 331, -10, -267, 92, 239, -151, -239, 193, 159, -205, -197, 232, 115, -265, -46, 238, 55, -321, 27, 163, -130, -240, 130, 245, -187, -162, 200, 164, -197, -89, 228, 20, -246, 27, 236, -112, -235, 94, 293, -161, -175, 236, 157, -231, -128, 253, 68, -283, -33, 260, -5, -232, 74, 259, -123, -232, 191, 218, -203, -207, 196, 72, -256, -76, 282, 57, -262, 109, 247, -32, -261, 69, 235, -141, -235, 198, 225, -249, -138, 290, 64, -287, -7, 302, -34, -238, 66, 243, -208, -227, 180, 218, -245, -135, 126, 95, -279, -50, 314, 4, -344]
7883c44L67K68l41j79L66M0m08N6M22j10m12J71L35j40k92J60L24l34k77M61J49
7904B82l49r8M14m4l77J24L17j55k51P0L12k52l18M49J66m07j41L28J06l87N5
7925a56L32J1l99J55K84j12m27L36K76l60k69M47J24m14kM11J0l97J1L78k21k63
7947b45J74L79k59k40K35K03k96j89L89K7l22p4M58j00l34P1L57j57l27K88K28
7968B66k79k19L02J91l75j07L35J37n00P1M92k83l74K51L30k63k71L35J97l43
7988a07j37M02K1l48o6M68p7l24O3M26k35l23K46K17l53j40M40N3l53J0L54j2
8010B25m40R6L28k05k38K56K48l14j79K82K10l96j93M36J25l80l8L94r5l87K28
8031c7K89j73l97M28J70k50k22L80l4k93p9M70r0l50R1L35j71l15K30L21l00k63
$$ y = [-344, 23, 291, -50, -229, 137, 177, -231, -175, 247, 137, -275, -104, 231, 91, -201, -41, 283, -51, -328, 133, 282, -67, -165, 249, 205, -172, -48, 269, 114, -137, -67, 245, -7, -325, 124, 290, -117, -258, 70, 176, -211, -156, 176, 187, -212, -57, 227, 115, -312, 24, 300, -60, -329, 118, 242, -172, -174, 237, 247, -150, -139, 239, 18, -245, -71, 308, 49, -191, 44, 247, -49, -238, 151, 178, -144, -218, 240, 140, -194, -123, 234, 77, -250, 38, 266, -13, -232, 70, 261, -114, -221, 114, 251, -249, -178, 314, 31, -343, -92, 238, -25, -296, 39, 236, -107, -244, 158, 179, -169, -235, 233, 156, -168, -105, 321, 86, -237, 9, 226, -127, -267, 173, 226, -127, -117, 237, 225, -215, -119, 209, 4, -234, 22, 270, -44, -223, 59, 269, -127, -320, 116, 241, -139, -177, 217, 122, -265, -37, 252, 79, -318, 110, 280, 30, -192, 188, 154, -139, -218, 252, 162, -188, -97, 238, 67, -248, -18, 303, 3, -260]
8053b60M32Q4m04K7K51P4l80K1L70p6l31J44L42l89j49L33J28l03j47M27kl09
8075a17JL27o1l96K09K72j37l22K59K37k26k91K36K93l33j02K80M2k99l2M68k18
8097I0l67K44K45k59j68L21J14l10j03L70Ql30j7L85j25l06J90K81j71l49L29
8118G2J80l22j51L21L8k60j03L50Ml03k9L99o8l65K60J83k23k12K95J85k56j76
8140a81L54lm18J42K70m0l08J36L34l21k00L23K16l66j47L46R4l54j31M62q2l80
8162b54J01L56q3l21K11K21k38j69K98J44m48k2M67j9n10O4M15q5l65J83L00l26
8184h0k09K73K52l76o2L23J42
$$ y = [-260, 172, 256, -148, -121, 130, 204, -176, -155, 215, 139, -192, -48, 294, -95, -244, 89, 217, -86, -233, 194, 192, -117, -116, 211, 150, -246, -37, 235, 98, -224, 35, 272, 46, -245, -9, 284, -49, -151, 129, 171, -128, -160, 308, 90, -277, -33, 212, -47, -215, 106, 220, -90, -193, 177, 185, -145, -162, 223, 98, -208, -18, 263, 92, -257, 72, 252, -70, -221, 100, 138, -122, -225, 125, 129, -174, -203, 196, 128, -237, 23, 206, -17, -229, 66, 251, -5, -181, 173, 170, -248, -106, 164, 124, -184, -48, 286, -35, -235, 88, 304, -62, -209, 137, 231, -123, -254, 208, 126, -254, -153, 203, 120, -201, 10, 231, -7, -176, 122, 266, -182, -204, 263, 244, -266, -202, 213, 128, -237, -54, 246, -80, -289, -16, 236, -140, -202, 121, 263]
8191B63
$$ Imaginary data points
##PAGE= N=2
##DATA TABLE= (X++(I..I)), XYDATA
0@%%%%%%%%%%Qj6QqJ6j6J6k0K8l7M5m8N6p2Q0q8J04j20J36j53J76k03K29k56K86
35A51l24L64m03M48m97N53o14O76p47Q27r11J001j100J214j339J473j622J790
53I40j980K192k433K712l040L425l887M458n179O116p378R177j1924J6547k5617
68a5871M9256k11433m31249Q67186K40918p97348j50103P98455P4765q86154J37102
79c24476Q53260l38475p10945M05633O52520n08291n95494O70800M21419p37440
89b11489k34104P00367J52327p23668n5265P82940j32893p43342K99154O30550
99D64577l75152n59758M54162N01967n70976l80666O47671K31119o58663j13963
109c59682O60383R976o71759J18221O52556k50979n90730L58079N09633m40600
$$ y = [0, 0, 0, 0, 0, 0, 0, 0, 0, 0, 0, 8, -8, 0, -8, 8, -8, 8, -12, 16, -21, 24, -24, 32, -40, 40, -48, 56, -64, 72, -81, 95, -108, 121, -135, 151, -173, 191, -212, 236, -261, 292, -322, 354, -393, 434, -477, 524, -576, 638, -701, 772, -850, 940, -1040, 1152, -1281, 1431, -1609, 1816, -2071, 2387, -2792, 3324, -4054, 5123, -6801, 9746, -15871, 33385, -178048, -609297, 257889, 498807, -298541, -448644, 349811, 424576, -461578, -324476, 528784, 190309, -520636, -115003, 537517, 29226, -566268, 104532, 525951, -211489, -445593, 254774, 407101, -316567, -371832, 411108, 278215, -465127, -165973, 464577, 89425, -470333, -16171, 485796, -85180, -465846, 181825, 412944, -245719, -359682, 300701, 310677, -361082, -242861, 409695, 158716, -432014, -73935, 435698, -4902]
119d902m24699N14374L24878n72337k07519N95286R6434n96029Q61N99529j13441
130B12435n84463K43573N14390l37891m22526L86167L55160m39169k86261N02571
140A43986J82804n34156p0363N30877k6038n19186J22767M89767k16975m34198
150c30715K86659L77970l45100l24772M13371K43960m66401j39097M78001M7503
160B41379m71573K8264M70314j17016m48877K06672M00284k76622l43043L33110
170B2892K82072l86084k04182M19538J20545m31740m3104M36865l9664m26160
180b49022J24057L91552j93022l47044K47660L01915l00884k46495L49510J75045
190B53272l80551r6391L90934J9430l83985N0377L65587j10024l46595J71308
$$ y = [-4902, -429601, 84773, 409651, -162686, -370205, 225081, 321515, -274514, -273653, 325876, 212435, -372028, -128455, 385935, 48044, -374482, 11685, 366845, -72324, -358585, 143986, 326790, -207366, -277729, 253148, 227110, -292076, -169309, 320458, 103483, -330715, -44056, 333914, -11186, -335958, 77413, 321373, -145028, -284125, 193876, 241379, -230194, -201930, 268384, 151368, -297509, -90837, 309447, 32825, -310218, 22892, 304964, -81120, -285302, 134236, 254781, -176959, -220063, 216802, 177138, -249022, -124965, 266587, 73565, -273479, -25819, 276096, -24788, -271283, 78227, 253272, -127279, -223670, 167264, 186694, -197291, -146914, 218673, 108649, -237946, -66638]
200f6638L19965k37736k71623K93237K04358l23689j39412L41269P9331l53686
210a54624j5320L55043m9880l45107J13934L25892j80142k88655K38433K32906
220B32480k74384j76879K96417J27681l19876p1141L38184J346l34335O5132L12560
231A97185j19323k86584J69431K54960k17776k11087K55308J58408k78476j06170
241a84124K95628N1092l04119P619K98806o2595k83507J12485K62438j62356k31703
252b00336K09478J86282k41054j36333K57319R2061k71536m7241K86626r768k87035
263a61537P0780K66373j19752k37567J58172K08625j95539j72254K27392J28198
273A72891k47892q3724K62952L5210k72390K2305K63488p4931k39033J11440K16868
$$ y = [-66638, 253327, 15591, -256032, 37205, 241563, -82126, -221538, 119731, 199062, -154624, -169944, 185099, 135219, -209888, -95954, 229938, 49796, -238859, -426, 232480, -41904, -218783, 77634, 205315, -114561, -185702, 152482, 153828, -180507, -115375, 197185, 77862, -208722, -39291, 215669, -2107, -213194, 42114, 200522, -77954, -184124, 111504, 162596, -141523, -133904, 164902, 102307, -181200, -68715, 193723, 31367, -200336, 9142, 195424, -45630, -181963, 75356, 167417, -104119, -151360, 135266, 125498, -161537, -90757, 175616, 55864, -181703, -23531, 185094, -10445, -182699, 44693, 172891, -75001, -158725, 104227, 139437, -132953, -110648, 152840, 77909, -161124, -49684, 167184]
284A67184j44904j96043J86266J59338k19775j09983K33364O5660k39408k5630
294a23931K45939k1480k41637O9749K23419j09127k00866J43415J75520j77898
304a6897j40092K04503R7342k17777n7576K25622J8937k31925K6646K27433p4142
315F2074k06894J10465J82370j38407j60115J68349J30867j97286q8589K12211
325G5045M4529k14010p466K13553k9461k10417P1726J94514j09100j69305J36444
336c948J44633j62546j14990J86149P5646j97141l6605J97951M315j99649L1328
347g4857J96946p2948j79410J07930J53143j31105j29326J52192J04172j74098
357d7361o9721J87101L2297j90509K852J88743l7817j80711P2172J64714j01622
$$ y = [167184, 22280, -173763, 12503, 171841, -47934, -157917, 75447, 141107, -98301, -123931, 122008, 100528, -141109, -71360, 152059, 42932, -157934, -14519, 161001, -16897, -156989, 47514, 144856, -72921, -130497, 95125, 114062, -117863, -91217, 136216, 62074, -144820, -34355, 148015, 9608, -150507, 17842, 148709, -48577, -137166, 75045, 119574, -94436, -101902, 111651, 82190, -128227, -56501, 138013, 28913, -140392, -3948, 140685, -21861, -136851, 49298, 124944, -72197, -108802, 89149, 93464, -106185, -74857, 122089, 49141, -130269, -22339, 130804, -301, -129627, 22565, 126737, -47361, -117082, 70019, 102316, -88193, -85341, 103402, 65585, -115126, -42954, 121760, 20138]
368B0138j44542J26692J21489j49224r3408J67226O0122j76994k5977J79877p542
379G7857j76878L9937J68150p0258j54725R8848J36071j25471j10109J44976Q1019
390A09417j56770n3137J66021K3174j72149J1613J68409m4748j55928P1006J42645
401A09553r6070j26257J21528J01380j40160p2485J50349M5931j58695j6961J63284
412H1397j6601j57644M6743J44988p0010j33086R4025J17630j19416r1858J35965
423C2133O3374j43450l8777J50123J2277j54334J9054J49268m8068j37373P1319
434b4454J24518r4102j07354J15284Q3580j29457n8525J38295L4192j45181p147
445g0351J47369k2656j40606M8618J29586p0797j16737R1974R9884j10927p8094
$$ y = [20138, -124404, 2288, 123777, -25447, -118855, 48371, 108493, -68501, -94478, 85399, 77857, -99021, -59084, 109066, 38808, -115917, -17069, 119002, -6469, -116578, 28398, 109417, -47353, -100490, 65531, 88705, -83444, -71831, 96578, 51830, -104098, -33092, 109553, 13483, -112774, 8754, 110134, -30026, -102511, 47838, 93769, -64926, -81887, 81397, 64796, -92848, -46105, 98883, 28873, -104213, -10188, 107442, -11974, -103832, 32133, 95507, -47943, -86720, 63403, 75680, -78654, -59600, 89668, 41600, -95773, -24454, 100064, 5962, -101392, 13892, 97472, -31985, -90510, 47785, 81977, -63204, -70351, 77018, 54362, -86244, -37626, 91960, 21163, -95574, -3600, 96284, -14643, -92737]
456i2737J24595N4398j33957k9122J38698K486j37286K2524J31825m5951j23382
467h7909O9061J09858q9628r1480J05185P1757j17494n0533J27315K5769j31399
478e9498k15J29267k2771j24464M5054J16736o7833j02711Q6674Q4983j00622
489a5400o6915J12841M6528j22731k1917J25879k778j22849K4241J17766m5141
500B9524j10143O6512R6937q4699p9579R8122O1221j08908m0934J16648J8088
511F2789j18750M467J15885k4962j10656M4784J02737o4600q9828Q1343P3318
522G6527r3965n5124J03215L5852j09447j5375J11959n799j09785K5970J04038
533F8066m4773r5662O2656Q3950p8777o7958R0413N0599r8729l2665J05037J2568
$$ y = [-92737, 31858, 86256, -47701, -76823, 61875, 64361, -72925, -50401, 81424, 35473, -87909, -18848, 91010, 1382, -90098, 15087, 86844, -30650, -81183, 46132, 71901, -59498, -59713, 69554, 46783, -77681, -32627, 84109, 16276, -86435, 239, 85222, -15400, -82315, 30526, 77054, -45677, -67594, 58285, 55507, -67342, -43101, 74665, 29524, -80619, -14107, 82830, -1869, -81448, 16674, 77895, -31013, -71947, 44701, 62789, -55961, -51494, 64391, 39429, -71227, -26443, 76294, 11694, -78134, 3209, 76527, -17438, -72562, 30653, 66505, -42942, -58317, 53642, 47843, -61942, -35972, 68066, 23293, -72369, -9713, 74237, -4540, -72498, 17915, 68514, -30215, -62880, 42157, 54725]
545E4725j07060Q041J04131k6582r8725M4337R0865o2302p8203P6783O2602q6732
557a8120m6965R5046K9286j00641r313J01046r548r7758K6191R3236m3383q5471
569f6394O0655P2279p3463n7318Q2202M3000r0143k6483R5738P066r5659J1033
581c7487R1968k6426q7764M2826Q0267n9367o7299P1358N2761p9328l9179Q6780
593B9110K3293r1921m338R1198j2856q7235K7423Q3072m3139p5486N8665O2551
605F0337o9573m8437P6659L5357q3453k0008Q7950J943q6614J4007Q2766k8020
617B2914p8459M3006P0572n7349n7794O6940M4689p3769l2043Q0256J6830q3542
629c7749j73Q2045j4614p8569K8251P3916m2531o5644N5343N3739o4008m1736
$$ y = [54725, -52335, -44294, 59837, 33255, -65470, -21133, 69732, 7430, -70773, 6010, 68612, -18120, -65085, 29961, 59247, -41394, -50707, 50339, 40791, -56967, -30776, 62460, 19077, -66394, -5739, 66540, -6923, -64241, 17961, 60961, -29182, -55665, 40073, 47139, -48520, -37487, 54481, 28055, -59709, -16883, 63384, 4017, -63282, 8076, 60837, -18491, -57670, 29110, 52403, -39518, -43856, 47342, 34486, -52749, -25326, 57746, 14607, -60879, -2214, 60337, -9236, -57673, 18986, 54343, -29110, -49118, 38832, 40775, -45839, -31832, 50934, 22914, -55545, -12539, 58033, 684, -57110, 9830, 54519, -19250, -51293, 28963, 45793, -37749, -37922, 44123, 29509, -49060, -20809, 53107, 10576, -55068, 275, 54014, -9994, -51730]
641e1730P0729K9365p6653j4603P9224r31p7724J4802P4533k8027o9745M1644
653i116O1267n3210n0124O1413L8939o8157k6795P3547J2637p5755K154P4202
665D1002j5522p0877K8222O5809m0833n7602N1503M7390n9684l6301O6085K3854
677D3046p0231j0481P1783l175p0577J6254O6923k8371o1192L9299N3804m9169
689b087m4366N7350L2927o2705k1033O5859R027o7448L724O6424j6397o2402K7572
702a3555N6932l7738n0030M7315M0721n4832k9905N9821J8641o2947o980O4323
714C1766n195o3172J7226N9363k8150n3898L8166M6550m6927l7430N3790K6902
726C8991n8087j6137O0922M742o1838P300N9593j8174n5616K8065N0325l7578
$$ y = [-51730, 18999, 48364, -28289, -42892, 36332, 35401, -42323, -27521, 47012, 18985, -50760, -9116, 52151, -1059, -51183, 10230, 49169, -18988, -45783, 27764, 40401, -35354, -33200, 41002, 25480, -45397, -17175, 48634, 7801, -49801, 1702, 49092, -10592, -46893, 19192, 43046, -27185, -37666, 34117, 30942, -39635, -23381, 43542, 15171, -46021, -6722, 47082, -2087, -46453, 10897, 43824, -18881, -39914, 25945, 34972, -32476, -28752, 37672, 21275, -41127, -13555, 43377, 5639, -44391, 2924, 43645, -11187, -41092, 18729, 37370, -25577, -32557, 31766, 26571, -36601, -19375, 39988, 11838, -42060, -3894, 42656, -4271, -41701, 12089, 38991, -19096, -35233, 25689, 30431, -31407, -24107, 35486, 17312, -38304, -10239, 40086, 2508]
738B508m2758M5481L3188n0363k4115N4306J4587n7458l033N7313q133n4403J7339
751a5541N1013k6379m6554L5899L9019m3118l0169M7563K2067n1806j2665N5001
763B4330J173n4625R453N1928j8345m8804K7432M4191l6643l6416M3097K7697
775C4468m7338j9442N1173R784n3323J079N2444j0849m9685J9604M5933k7961
787E887m0657L5583L3324m1229k5149M4967J7131m7860q418M9501j491m8381J0579
800a6213M5527j8468m1897K6009L7017l3176l0352L8690K2788m2463j5141M5391
812A7712O685m6992K569M6329j1544m3553J9370L9937k6758l5120L3679K8448
824C0762l8897k0848M2412J3124m4981m686M6031m444m4628J2819M1374j9845
$$ y = [2508, -40250, 5231, 38419, -11944, -36059, 18247, 32834, -24624, -27657, 29656, 21523, -32880, -15541, 35472, 9093, -37461, -1562, 37457, -5661, -35830, 11733, 33800, -18006, -30671, 24330, 25503, -29122, -19669, 32259, 13914, -34890, -7458, 36733, 90, -36326, 6771, 34468, -12870, -32312, 18861, 28645, -24678, -23599, 28845, 17996, -31689, -12085, 33848, 5887, -34770, 813, 34137, -7092, -32241, 12726, 29857, -18003, -26421, 23080, 21589, -26792, -16213, 29314, 10846, -31051, -5042, 31975, -1201, -31553, 7137, 29925, -12538, -27679, 17712, 24397, -22595, -20026, 26303, 14759, -28794, -9424, 30513, 3755, -31365, 2314, 30762, -8135, -28983, 13429, 26553, -18428, -23114, 22917, 18473, -26155, -13336, 28038, 8193]
836H193l7598K6673L2532l2644k5974L7028J8803l9905j1689M1904L673m2228
848b1232M579M0427j1816l7574J8031L4664k4663k9997L0469K3560l4353j7022
860b4927L7127J0571l9659k516M0024n425l8336J2204L6017j8503l3312K5523
872a212K8223l1170k1542L4512J5381l7504q460L9293P98l9186O842L7120j3188
885I907l4517J9180L1058k5030k6220L0014J9821l2925j3636L4878P441l5968
897a5997r05L5922n859l4290J2034L1684j7610k8421K2872K4106k7636j8443L0765
910H222J2636l2737o754L4009M34l4310O274L3029j2691l0422J8403K6967k3361
923c01k2740K7818J7414l1235j1193L2920N175l3815J257L3432p602l1693J3317
$$ y = [8193, -29405, -2732, 29800, -2844, -28818, 8210, 27013, -12892, -24581, 17323, 20996, -21232, -16653, 23774, 11958, -25616, -7585, 27079, 2416, -27581, 2888, 26448, -7905, -24927, 12200, 22771, -16888, -19404, 20620, 15195, -23141, -10937, 25080, 6577, -26735, -1212, 27011, -4159, -25701, 8811, 24192, -13312, -21772, 17521, 18319, -20867, -14025, 23095, 9907, -24610, -5430, 25628, 598, -25622, 4392, 24213, -8712, -22348, 12530, 19971, -15997, -16902, 19020, 13161, -21129, -9095, 22589, 4979, -23442, -570, 23536, -4100, -22543, 8222, 20858, -11879, -18633, 15376, 15810, -18500, -12226, 20803, 8112, -22310, -3907, 23060, -301, -23041, 4777, 22191, -9044, -20237, 12683, 17858, -15957, -14700, 18732, 11130, -20563, -7246]
936g246K8994j8582k5429K3295K0902k6906j5732K9260J0432l0976m764L1782
948A5030j328l1074P097K9223j2118k6910J6929K3829k1538j9498K5056J4575
960A9273k7416r588K9190M300l0513K011K9714p696k7809J2477K5816j7377k2882
973b0500K2160J8468k5719j3240K7642Q404k9299k972L0018k949k9188Q540K7100
986A8465j3148k4591J7362K1646k1679j7366K4962J2259k6692p365K7515K626
998A3994k8028K643K7503p830k5600J2307K3177j6368k0309K0278J6472k3562
1010e323j1631K5443O697k6291k093K6738k729k6508Q024K4894j2978k2152J6938
1023i71J9010k0354j5403K3461J0813k5530n660K6098R69k6019L401K5733q339
$$ y = [-7246, 21748, 3166, -22263, 1032, 21934, -4972, -20704, 8556, 18988, -11988, -16752, 15030, 13702, -17372, -10275, 18948, 6830, -20080, -3151, 20678, -860, -20358, 4698, 19273, -8143, -17731, 11459, 15759, -14754, -12743, 16971, 9275, -18534, -6057, 19759, 2382, -20500, 1660, 20128, -5591, -18831, 8811, 17215, -12084, -15056, 14962, 12013, -17175, -8635, 18465, 5317, -19274, -1912, 19734, -1945, -19311, 5651, 17910, -8782, -16147, 11368, 13994, -14034, -11391, 16112, 8282, -17318, -5011, 18166, 1798, -18511, 1767, 18239, -5323, -16954, 8489, 15186, -11105, -13198, 13540, 10811, -15697, -7673, 17221, 4243, -17909, -971, 18039, -2315, -17718, 5743, 16556, -8974, -14634, 11464, 12433, -13586, -10185, 15548, 7209]
1036G209k4240J3384K1167j7082j7710J9817J4370k2564j0268K4689N244k5140
1048a1124o68K4874l515k4515Q169K3164j2962k0166J6527J6713j9037j3554K1513
1061E419R776k3779m828K4444J69k4144M059K3384q243k2104J2723J9374j6226
1074B4j6003J8785J2635k0942r070K2935M596k3822J38K3353m274k2422Q272K0912
1088A5117j2195j8487J5624J5523j8492j2003K0613Q168k2056m077K2785k64k2625
1101a2369M480K1756q632j9944J2200J7557j5290j4868J8219J1389k0456p302
1113a3260K1650L097k1801N44K1836m561k1148Q877J9138j2423j6419J4908J3977
1126A4415j7497j0933J9870O705k0717k749K0688n13k0773M317K0261q599j8197
$$ y = [7209, -17031, -3647, 17520, 438, -17272, 2545, 16915, -5649, -15917, 8772, 14016, -11124, -11792, 13082, 9567, -14948, -6779, 16385, 3423, -16743, -216, 16497, -2540, -16094, 5419, 15195, -8584, -13412, 11032, 11201, -12943, -8884, 14500, 6257, -15847, -3124, 16250, 24, -15979, 2806, 15441, -5501, -14571, 8364, 12960, -10862, -10724, 12629, 8355, -14067, -5795, 15117, 2922, -15565, 59, 15582, -2910, -14913, 5700, 13868, -8188, -12265, 10520, 10256, -12369, -7889, 13867, 5235, -14709, -2509, 15048, -242, -15110, 3109, 14498, -5958, -13260, 8390, 11487, -10314, -9770, 12066, 7505, -13643, -4766, 14372, 1949, -14470, 438, 14415, -3082, -14015, 5855, 12560, -8157, -10906, 9782, 9269, -11504, -7187, 13074, 4475, -13722]
$$ [...]
8191a44
##END NTUPLES=NMR FID
##END=
