##TITLE=1H_AM-NV52.1
 CDCl3
 8 sc, 
 14.6.2023
##JCAMPDX= 6.0         $$ Bruker NMR JCAMP-DX V2.0
##DATA TYPE= NMR FID
##DATA CLASS= NTUPLES
##ORIGIN= UXNMR, Bruker Analytische Messtechnik GmbH
##OWNER= root
$$ XWIN-NMR		Version 3.5
$$ Wed Jun 14 14:42:18 2023 Russian Standard Time (UT+4h)  she@DPX200
##.OBSERVE FREQUENCY= 200.13135
##.OBSERVE NUCLEUS= ^1H
##.DELAY= (6, 6)
##.ACQUISITION MODE= SIMULTANEOUS
##.ACQUISITION SCHEME= undefined
##.AVERAGES= 8
##.DIGITISER RES= 18
##SPECTROMETER/DATA SYSTEM= spect
##.PULSE SEQUENCE= zg30
##.SOLVENT NAME= CDCl3
##.SHIFT REFERENCE= (INTERNAL, CDCl3, 0, 15.7039)
##AUDIT TRAIL= $$ (NUMBER, WHEN, WHO, WHERE, WHAT)
$$ ##TITLE= Audit trail, XWIN-NMR		Version 3.5
$$ ##JCAMPDX= 5.01
$$ ##ORIGIN= Bruker BioSpin GmbH
$$ ##OWNER= she
$$ F:/spectra/data/she/nmr/H-F/1/audita.txt
$$ ##AUDIT TRAIL=  $$ (NUMBER, WHEN, WHO, WHERE, WHAT)
(   1,<2023-06-14 14:40:55.56 +0400>,<she>,<DPX200>,
      <created by zg, POWCHK disabled, PULCHK disabled
       configuration hash MD5:
       00 E9 B6 7A A2 85 ED C7 34 08 36 98 17 FE 4E 26
       data hash MD5: 16K
       3C 64 CA C7 54 E7 43 74 9B 21 9E D6 AA 13 60 91>)
$$ ##END=
$$ 
$$ hash MD5
$$ E6 E4 99 64 20 77 F8 26 32 ED 8C 8E 57 E0 38 B8
##$RELAX= 
##$RELAX= 
##$RELAX= 
##$RELAX= 
##$RELAX= 
##$RELAX= 
$$ Bruker specific parameters
$$ --------------------------
##$DU= <F:/spectra>
##$EXPNO= 1
##$NAME= <H-F>
##$PROCNO= 1
##$TYPE= <nmr>
##$USER= <she>
##$AMP= (0..31)
100 100 100 100 100 100 100 100 100 100 100 100 100 100 100 100 100 100 
100 100 100 100 100 100 100 100 100 100 100 100 100 100 
##$AQSEQ= 0
##$AQ_mod= 1
##$AUNM= <au_zg>
##$AUTOPOS= <>
##$BF1= 200.13
##$BF2= 200.13
##$BF3= 200.13
##$BF4= 200.13
##$BF5= 200.13
##$BF6= 200.13
##$BF7= 200.13
##$BF8= 200.13
##$BYTORDA= 1
##$CFDGTYP= 0
##$CFRGTYP= 5
##$CHEMSTR= <none>
##$CNST= (0..31)
1 1 145 1 1 1 1 1 1 1 1 1 1 1 1 1 1 1 1 1 1 1 1 1 1 1 1 1 1 1 1 1 
##$CPDPRG= <>
##$CPDPRG1= <>
##$CPDPRG2= <>
##$CPDPRG3= <>
##$CPDPRG4= <mlev>
##$CPDPRG5= <mlev>
##$CPDPRG6= <mlev>
##$CPDPRG7= <mlev>
##$CPDPRG8= <mlev>
##$CPDPRGB= <>
##$CPDPRGT= <>
##$D= (0..31)
0 1.2 0 0 0 0 0 0 0 0.06 0 0.03 0 0 0 0 0.0002 0 0 0 0 0 0 0 0 0 0 0 0 
0 0 0 
##$DATE= 1686739255
##$DBL= (0..7)
120 120 120 120 120 120 120 120 
##$DBP= (0..7)
150 150 150 150 150 150 150 150 
##$DBP07= 0
##$DBPNAM0= <>
##$DBPNAM1= <>
##$DBPNAM2= <>
##$DBPNAM3= <>
##$DBPNAM4= <>
##$DBPNAM5= <>
##$DBPNAM6= <>
##$DBPNAM7= <>
##$DBPOAL= (0..7)
0.5 0.5 0.5 0.5 0.5 0.5 0.5 0.5 
##$DBPOFFS= (0..7)
0 0 0 0 0 0 0 0 
##$DE= 6
##$DECBNUC= <off>
##$DECIM= 32
##$DECNUC= <off>
##$DECSTAT= 4
##$DIGMOD= 1
##$DIGTYP= 9
##$DL= (0..7)
0 120 120 120 120 120 120 120 
##$DP= (0..7)
150 150 150 150 150 150 150 150 
##$DP07= 0
##$DPNAME0= <>
##$DPNAME1= <>
##$DPNAME2= <>
##$DPNAME3= <>
##$DPNAME4= <>
##$DPNAME5= <>
##$DPNAME6= <>
##$DPNAME7= <>
##$DPOAL= (0..7)
0.5 0.5 0.5 0.5 0.5 0.5 0.5 0.5 
##$DPOFFS= (0..7)
0 0 0 0 0 0 0 0 
##$DQDMODE= 0
##$DR= 18
##$DS= 0
##$DSLIST= <SSSSSSSSSSSSSSS>
$$ [...]
##$SUBNAM2= <"">
##$SUBNAM3= <"">
##$SUBNAM4= <"">
##$SUBNAM5= <"">
##$SUBNAM6= <"">
##$SUBNAM7= <"">
##$SUBNAM8= <"">
##$SUBNAM9= <"">
##$SW= 18.05172834244
##$SWIBOX= (0..15)
0 0 2 0 0 0 0 0 0 0 0 0 0 0 0 0 
##$SW_h= 3612.71676300578
##$TD= 16384
##$TD0= 1
##$TE= 0
##$TE2= 300
##$TE3= 300
##$TEG= 300
##$TL= (0..7)
0 120 120 120 120 120 120 120 
##$TP= (0..7)
150 150 150 150 150 150 150 150 
##$TP07= 0
##$TPNAME0= <>
##$TPNAME1= <>
##$TPNAME2= <>
##$TPNAME3= <>
##$TPNAME4= <>
##$TPNAME5= <>
##$TPNAME6= <>
##$TPNAME7= <>
##$TPOAL= (0..7)
0.5 0.5 0.5 0.5 0.5 0.5 0.5 0.5 
##$TPOFFS= (0..7)
0 0 0 0 0 0 0 0 
##$TUNHIN= 0
##$TUNHOUT= 0
##$TUNXOUT= 0
##$USERA1= <user>
##$USERA2= <user>
##$USERA3= <user>
##$USERA4= <user>
##$USERA5= <user>
##$V9= 5
##$VALIST= <valist>
##$VCLIST= <CCCCCCCCCCCCCCC>
##$VD= 0
##$VDLIST= <DDDDDDDDDDDDDDD>
##$VPLIST= <PPPPPPPPPPPPPPP>
##$VTLIST= <TTTTTTTTTTTTTTT>
##$WBST= 1024
##$WBSW= 4
##$XGAIN= (0..3)
0 0 0 0 
##$XL= 0
##$YL= 0
##$YMAX_a= 322954
##$YMIN_a= -351996
##$ZGOPTNS= <>
##$ZL1= 120
##$ZL2= 120
##$ZL3= 120
##$ZL4= 120
##$ABSF1= 10
##$ABSF2= 0
##$ABSG= 5
##$ABSL= 3
##$ALPHA= 0
##$AQORDER= 0
##$ASSFAC= 0
##$ASSFACI= 0
##$ASSFACX= 0
##$ASSWID= 0
##$AUNMP= <proc_1d>
##$AZFE= 0.1
##$AZFW= 0.1
##$BCFW= 1
##$BC_mod= 2
##$BYTORDP= 1
##$COROFFS= 0
##$CY= 11.3945322036743
##$DATMOD= 1
##$DC= 2
##$DFILT= <>
##$DTYPP= 0
##$F1P= 15.7292609196834
##$F2P= 12.9074282941183
##$FCOR= 0.5
##$FTSIZE= 0
##$FT_mod= 4
##$GAMMA= 1
##$GB= 0.15
##$INTBC= 1
##$INTSCL= 1
##$ISEN= 128
##$LB= 0.24
##$LEV0= 0
##$LPBIN= 0
##$MAXI= 10000
##$MC2= 0
##$MEAN= 0
##$ME_mod= 0
##$MI= 1.114404
##$NCOEF= 0
##$NC_proc= 0
##$NLEV= 6
##$NOISF1= 3.799351
##$NOISF2= 2.8
##$NSP= 1
##$NTH_PI= 0
##$NZP= 0
##$OFFSET= 15.70392
##$PC= 1
##$PHC0= -20428.79
##$PHC1= 17.45272
##$PH_mod= 1
##$PKNL= yes
##$PPARMOD= 0
##$PSCAL= 0
##$PSIGN= 0
##$REVERSE= no
##$SF= 200.130013532006
##$SI= 16384
##$SIGF1= 3
##$SIGF2= 2
##$SINO= 400
##$SIOLD= 16384
##$SREGLST= <1H.CDCl3>
##$SSB= 0
##$STSI= 0
##$STSR= 0
##$SW_p= 3612.71676300578
##$SYMM= 0
##$S_DEV= 0
##$TDeff= 0
##$TDoff= 0
##$TI= <>
##$TILT= no
##$TM1= 0
##$TM2= 0
##$TOPLEV= 0
##$USERP1= <user>
##$USERP2= <user>
##$USERP3= <user>
##$USERP4= <user>
##$USERP5= <user>
##$WDW= 1
##$XDIM= 8192
##$YMAX_p= 0
##$YMIN_p= 0
$$ End of Bruker specific parameters
$$ ---------------------------------
##NTUPLES= NMR FID
##VAR_NAME=  TIME,          FID/REAL,        FID/IMAG
##SYMBOL=    X,             R,               I
##VAR_TYPE=  INDEPENDENT,   DEPENDENT,       DEPENDENT
##VAR_FORM=  AFFN,          ASDF,            ASDF
##VAR_DIM=   8192,          8192,            8192
##UNITS=     SECONDS,       ARBITRARY UNITS, ARBITRARY UNITS
##FACTOR=    0.0002768,     1,               1
##FIRST=     0,             0,               0
##LAST=      2.2672688,     0,               0
##MIN=       0,             -351996,         0
##MAX=       2.2672688,     322954,          0
$$ Real data points
##PAGE= N=1
##DATA TABLE= (X++(R..R)), XYDATA
0 0 0 0 0 0 0 0 0 0 0 0 0 0 0 0 0 -1 6 -8 8 -8 8 -12 16 -17 24 -24 30 -35 41 -49 54 -63 71 -81 94 -104 118
37 118 -131 148 -168 188 -206 231 -257 284 -314 348 -385 425 -467 514 -566 623 -686 757 -833
56 -833 919 -1018 1128 -1255 1401 -1570 1772 -2010 2296 -2633 3005 -3246 2209 13623 322954
71 322954 3890 -305086 114075 173500 -133695 -43842 73694 -71109 50024 95239 -179975
82 -179975 -43856 272567 -65935 -282727 172076 215966 -233572 -97942 219143 -6537
92 -6537 -126774 68703 306 -50024 114378 -32006 -172593 148078 158680 -241856 -82093
103 -82093 277726 -22437 -245466 98645 152164 -122094 -44368 75094 -39498 16488 60776
114 60776 -122694 -22862 193892 -58130 -204818 144894 158368 -193127 -72271 186889
124 186889 -9503 -121774 59017 32506 -48315 54831 -7376 -101367 86627 94685 -155338
135 -155338 -44776 183531 -24722 -164770 77339 102998 -97155 -33481 66929 -23913
145 -23913 -7465 41698 -61211 -19177 109696 -31880 -121272 88237 96480 -121140 -43458
156 -43458 123412 -6649 -87024 39914 34095 -37377 19424 7324 -49212 40320 48333 -83499
168 -83499 -21939 101975 -20092 -94759 51991 60052 -65897 -19776 50113 -15727 -17637 27355
180 27355 -22543 -16096 52862 -11087 -61191 43759 50062 -63258 -21488 67322 -5013 -48648
192 -48648 24827 22543 -24381 5489 9752 -22150 13473 22798 -35849 -10796 45697 -10620 -44438
205 -44438 25842 27667 -35032 -9485 28426 -7807 -14387 14752 -3991 -11112 18568 -22 -22949
218 -22949 15528 20424 -23962 -7712 27850 -2877 -20276 12418 10168 -12561 2163 7374 -9519
231 -9519 1832 9493 -12073 -5898 15773 -3357 -16857 8821 10100 -13665 -4042 11316 -3176
244 -3176 -7199 5968 1050 -4624 4584 1924 -5478 3765 5803 -5305 -1013 7547 -1055 -4758 4633
259 4633 2524 -4398 833 2912 -3126 -1086 2724 -2245 -3042 2073 -169 -3874 301 1464 -2554
274 -2554 -1280 1582 -333 -1175 676 619 -180 753 863 262 932 1061 207 733 1442 208 66 738 354
293 354 -417 -198 245 -365 -884 -559 -254 -915 -1023 -488 -443 -1049 -742 -64 -258 -652 -78 397 186 167 637
314 637 730 394 547 1000 793 504 668 731 289 335 589 -93 -340 125 -259 -855 -378 -198 -1128 -848 -240
335 -240 -1046 -1088 93 -546 -1240 559 482 -1275 37 1938 -282 -791 1737 1292 -682 793 1488 40
353 40 446 1108 -511 219 1688 -1005 -1711 1836 538 -3228 -387 1977 -1749 -2345 867 -117 -1744
370 -1744 219 -214 -1485 1119 892 -2391 307 3602 -921 -2467 3000 2640 -2057 -269 2650 632
386 632 -170 409 -500 1119 1782 -2324 -2230 3363 906 -5117 -896 3920 -1478 -4433 799 1975 -1575
403 -1575 -1833 -338 592 1354 -825 -2509 1815 3595 -1860 -2676 3595 3495 -2309 -1483 3292 2304 -1407
420 -1407 -1494 902 2444 -45 -3199 -605 3353 -231 -4541 -822 3508 -265 -4919 -982 3525 249
436 249 -4319 -1171 3823 1096 -3717 -928 3822 1746 -2283 -1085 2717 3009 -917 -2734 2164 4759
452 4759 -1659 -4330 2954 4329 -3224 -3514 2616 1731 -2324 -1704 -445 584 1276 -2674 -3571 3489
468 3489 3155 -5837 -2457 6559 695 -6022 1411 4757 -1595 -1091 1800 -237 1600 2659 -3363 -1116
484 -1116 6695 -260 -7046 3487 6066 -5593 -3575 5309 -565 -4232 2120 -402 -3598 3350 640
499 640 -7014 2260 6679 -6392 -4599 8270 965 -7513 3336 4807 -4458 927 4605 -4072 56
514 56 7259 -3839 -5258 8540 2106 -9523 2613 7497 -6343 -3445 6467 -2625 -4728 5460
528 5460 -1303 -7081 5755 3422 -10150 745 9855 -6012 -6691 8966 1732 -7531 3916 4128
542 4128 -5474 2717 5555 -6719 -100 10097 -4604 -8015 9760 3996 -10852 1614 8375 -6026
556 -6026 -3589 6022 -3273 -4092 6351 -2634 -8283 7576 4349 -12048 406 11417 -5999 -7727
570 -7727 8838 2473 -7230 3418 3635 -5112 3364 4870 -7568 408 10689 -5123 -8591 9936
584 9936 4446 -11171 879 8413 -5063 -4132 5092 -2487 -3327 5332 -2798 -6961 7037 3602 -11080
599 -11080 600 10788 -5236 -7549 7844 3067 -6543 2243 3634 -3717 2497 3610 -6056 702
613 702 8751 -4784 -7061 8775 3697 -9797 468 7630 -4293 -4125 4225 -1334 -3028 3463
627 3463 -1781 -4931 5177 2444 -8229 795 8184 -4145 -5720 6276 2634 -5276 1524 3509
641 3509 -2313 1026 2745 -3532 446 5698 -3010 -4727 5740 2341 -6946 204 5344 -2973 -3528
656 -3528 2751 -252 -2414 1526 -856 -2847 2743 1123 -4803 598 4925 -2527 -3370 4279 1923
671 1923 -3404 910 2836 -1224 96 1873 -1202 49 2834 -1319 -2357 2931 1252 -3673 -150
686 -150 2668 -1791 -2211 1334 7 -1676 273 -168 -1393 955 619 -2062 307 2393 -1014 -1458
702 -1458 2360 1389 -1546 418 1744 -187 -225 1046 21 -36 875 -197 -672 767 251 -1288 -161
719 -161 506 -970 -961 321 -277 -915 -26 -33 -779 92 215 -606 -74 800 119 -267 762 744 -74 270 814
740 814 305 111 375 366 33 -5 -78 -96 -78 -318 -407 -185 -220 -563 -382 -230 -368 -481 -249 -95 -349 -146 145
763 145 -55 -97 203 391 182 116 498 498 291 238 361 302 32 181 262 54 -102 -50 -54 -349 -421 -322 -306 -529 -419
788 -419 -228 -342 -392 -208 -8 -198 -193 99 233 148 154 458 331 265 384 570 330 310 338 157 251 116 0 38
812 38 -161 -262 -201 -142 -372 -534 -383 -306 -392 -345 -139 -280 -358 43 -16 -244 73 478 65 -39 714 610 27
835 27 353 685 150 218 440 195 57 356 -350 -356 463 -40 -1077 -59 441 -1050 -897 470 -174 -1067
855 -1067 -49 98 -718 87 323 -730 98 1232 -431 -749 1426 851 -1130 471 1753 -358 -409
872 -409 1115 0 -552 808 -219 -1175 1016 535 -2306 -387 2069 -1535 -2208 1582 640 -2217 -9
889 -9 1194 -1050 -218 1185 -1189 -273 2569 -649 -2063 2688 1905 -2840 274 3384 -1166 -1681 2367
906 2367 188 -1840 1540 362 -2580 1366 1796 -3487 -867 3786 -1649 -3924 2734 1688 -3722
921 -3722 53 2547 -1815 -639 2461 -1564 -1250 3865 -397 -3771 3353 3191 -4346 -359 4984 -1412
937 -1412 -3120 3366 580 -3133 2032 1259 -3842 1285 3300 -4444 -2006 5129 -1430 -5532 3264
952 3264 2642 -4675 -116 3570 -2784 -1098 3760 -2045 -2380 4986 303 -5403 3437 4817 -5152 -1444
968 -1444 6067 -1272 -3969 3699 1215 -3842 2268 1710 -4745 956 4592 -4767 -3239 6043 -449
983 -449 -6551 2880 3843 -4817 -569 3966 -2443 -1374 4285 -2017 -3288 5515 1090 -6348 2691 5992
999 5992 -4776 -2875 6116 -147 -4363 3066 1359 -3686 2165 2050 -5048 719 5168 -4549 -4239
1014 -4239 6232 813 -6840 1837 4558 -3879 -1578 3671 -1608 -1275 3667 -1565 -3076 5047 1871
1029 1871 -6249 1718 6414 -3755 -3813 5322 1275 -4305 1302 1844 -2465 1071 1468 -3952 347 4581
1045 4581 -3752 -4344 5115 1688 -6246 368 4684 -2398 -2427 2514 -96 -1285 2295 -895 -2347 3926
1061 3926 1707 -4808 802 5590 -2451 -3876 3806 2196 -3590 -149 1979 -1130 -73 645 -2340
1076 -2340 150 3022 -2536 -3483 3465 1934 -4597 -864 4073 -720 -2765 1404 1295 -713 461
1091 461 10 -752 2068 1111 -2805 369 3809 -997 -3248 2270 2431 -2347 -1351 1790 91 -980
1107 -980 45 -703 -243 1109 -1190 -2098 1703 1431 -2696 -1076 2681 181 -2377 314 1883 -305
1123 -305 -432 514 342 774 581 -947 -7 1960 -74 -1987 743 1825 -1192 -1602 1180 731 -1269
1140 -1269 -535 435 -213 -277 -278 -634 207 773 -1022 -948 1186 670 -1341 -83 1417 32 -706 519 831
1159 831 2 205 236 -72 540 334 -618 -70 903 -299 -1149 446 624 -961 -659 477 -187 -777 -12
1178 -12 -116 -328 162 -3 -531 288 652 -405 -215 830 311 -375 492 795 -193 -8 542 41 -215 373
1198 373 16 -285 307 103 -585 -67 307 -527 -455 22 -248 -600 -194 73 -229 -154 247 -137 -61 409 125
1219 125 -10 371 320 44 317 480 -40 153 305 27 -124 84 173 -275 -34 93 -289 -324 -112 -248 -339
1240 -339 -98 -36 -398 -164 -82 -141 -79 -73 11 -13 204 159 51 341 255 157 226 142 111 127 235 8 -11 88 74 -172
1266 -172 -130 -94 -312 -278 -109 -39 -256 -109 -127 -198 -84 32 -195 16 240 -111 117 320 207 2 432 374
1288 374 -29 284 415 -164 -9 653 -94 -375 367 199 -539 -74 221 -575 -279 169 -460 -631 314 -150
1308 -150 -675 332 363 -718 -68 881 -302 -447 977 339 -470 596 780 -527 329 1027 -596 -266
1326 -266 1143 -234 -1172 865 594 -1448 -27 929 -1063 -782 841 -687 -1197 977 -93 -1566
1342 -1566 760 1146 -1587 -288 2012 -548 -1399 1602 708 -1465 934 1196 -1244 285 1673 -1235
1358 -1235 -801 2110 -324 -2183 1371 1396 -2390 -275 1832 -1422 -1237 1619 -641 -1804 1614 406
1374 406 -2577 1132 2094 -2542 -857 3180 -600 -2284 2265 1165 -2174 903 1741 -1971 223 2570
1390 2570 -1986 -1449 3305 -191 -3466 1837 2202 -3122 -594 2778 -1609 -1736 2213 -793 -2242 2402
1406 2402 546 -3597 1341 3176 -3137 -1547 4015 -296 -3073 2200 1571 -2377 1048 1878 -2330
1421 -2330 377 3139 -2419 -2222 4133 203 -4488 1830 3122 -3363 -1359 2925 -1314 -1816 2197
1436 2197 -1004 -2394 2910 652 -4303 1521 4126 -3510 -2347 4701 423 -3561 1891 2036 -2101
1451 -2101 909 1737 -2544 664 3443 -3019 -2568 4713 425 -5197 1327 3967 -3201 -2045 2784
1466 2784 -665 -1558 1697 -1012 -1978 3125 541 -4676 1606 4530 -3499 -2929 4711 1124 -3874 1041
1482 1041 2391 -1314 365 1088 -2171 1031 3083 -3103 -2446 4771 729 -5450 970 4161 -2577
1497 -2577 -2694 2438 222 -1469 721 -901 -1196 2929 53 -4235 1703 4380 -3342 -3148 4426 1709
1513 1709 -3627 238 2494 -636 -288 364 -1168 1183 2218 -2881 -1947 4186 452 -4959 542 4132
1529 4132 -1997 -3033 1812 1062 -1218 -37 -465 -343 2030 -398 -3122 1567 3504 -2564 -2671 3591
1545 3591 1829 -3063 -325 2427 141 -924 55 -291 967 979 -2180 -1092 3115 268 -3840 486
1561 486 3242 -1516 -2677 1315 1367 -1134 -795 -59 146 970 -545 -1782 1259 2292 -1716 -1770 2616
1578 2616 1438 -2228 -465 2119 366 -1070 -52 357 626 62 -1184 -491 1728 -52 -2376 91
1594 91 2002 -892 -2027 752 1095 -803 -847 369 313 148 -319 -528 809 1026 -872 -820 1528 934
1612 934 -1277 -243 1528 305 -979 -31 622 283 -379 -548 -7 530 -235 -1001 60 846 -493 -1095
1630 -1095 346 699 -600 -715 497 434 -120 -160 78 411 283 -169 -89 581 460 -408 -99 745 223 -501
1650 -501 -1 514 -70 -276 -133 126 -206 -172 -282 -101 188 -153 -480 -62 289 -254 -299 130 224 -229 -128
1671 -128 349 113 44 124 2 141 196 -22 42 203 88 -132 -46 133 -185 -291 68 9 -345 -279 -93 -154 -204
1694 -204 -51 -148 -155 15 -50 -114 79 171 70 20 243 106 211 123 80 90 103 82 85 42 193 -19 -34 35 -77 -201
1720 -201 -119 -41 -113 -52 -178 -220 -298 -110 -43 -187 -68 31 7 82 130 74 76 128 187 66 132 170 144 206 118 -68 29
1747 29 217 -31 -61 93 -59 -122 -16 27 -324 -88 0 -229 -128 112 -60 -187 130 80 -178 58 281 31
1769 31 112 183 79 -111 490 72 -153 209 344 -268 -111 289 -109 -233 185 -76 -413 42 2 -590 39
1790 39 380 -609 -465 485 -3 -629 278 452 -304 31 365 -120 117 533 -240 -325 886 298 -806 470
1810 470 880 -585 -504 752 -29 -698 248 142 -559 200 232 -909 54 907 -907 -950 1141 349 -1300
1829 -1300 250 1045 -650 -324 792 -97 -88 794 -270 -600 1354 431 -1649 402 1760 -1111 -1266
1846 -1266 1363 343 -1314 205 542 -819 120 453 -1145 167 1480 -1194 -1523 1801 780 -2163
1862 -2163 134 2057 -818 -979 1204 186 -615 867 -160 -1009 1507 761 -2177 192 2509 -1225
1878 -1225 -2212 1926 1052 -2038 -41 1257 -906 -278 658 -1088 -234 1841 -1136 -2029 2230 1302 -3000
1895 -3000 -66 2816 -888 -1884 1580 766 -1017 689 233 -1202 1221 1062 -2369 -149 3086 -1063
1911 -1063 -2843 2076 1752 -2763 -645 1932 -675 -936 933 -759 -543 1791 -670 -2245 2033 1861
1927 1861 -3167 -670 3432 -487 -2486 1562 1423 -1402 246 949 -1104 833 1397 -2027 -640 3069
1943 3069 -743 -3285 1797 2235 -2745 -1182 2330 -414 -1588 881 -152 -1012 1352 -118 -2342
1958 -2342 1565 2314 -2585 -1109 3316 154 -2774 1241 1953 -1503 -392 1299 -818 -73 1488 -1419
1974 -1419 -1178 2466 31 -3208 1178 2574 -2337 -1813 2336 102 -1975 821 589 -1206 724 569
1990 569 -1887 456 2338 -1706 -1629 2884 772 -2713 554 2274 -1123 -963 1432 -233 -671 1252
2006 1252 -537 -1433 1695 706 -2585 264 2612 -1454 -1998 1899 751 -2022 152 1116 -1089 163
2022 163 958 -1257 -215 1965 -925 -1890 1973 1315 -2284 -118 2381 -646 -1306 1398 253 -1022
2038 -1022 788 119 -1417 965 1134 -2055 -433 2271 -814 -1991 1350 1074 -1805 -175 1303 -760
2054 -760 -401 957 -593 -688 1561 -141 -1576 1207 1405 -1792 -388 2033 -254 -1394 996 608
2070 608 -951 397 508 -1010 269 945 -1186 -691 1486 -151 -1814 657 1094 -1387 -484 1195
2086 1195 -434 -689 854 8 -641 923 348 -1107 562 1327 -1084 -474 1348 151 -1068 620
2102 620 624 -885 69 626 -618 -174 736 -559 -674 918 42 -1237 294 785 -834 -517 816 -185
2120 -185 -583 546 301 -513 415 311 -585 200 975 -399 -290 804 193 -712 394 563 -585 -188
2138 -188 531 -322 -350 316 -183 -509 413 181 -592 -58 487 -385 -303 489 33 -357 275 397 -216 130 408
2159 408 -132 0 388 37 -222 306 273 -357 92 307 -342 -166 171 -100 -324 255 115 -321 -52 127
2179 127 -253 -102 253 -68 -232 249 129 -249 125 137 -83 121 290 93 -60 204 95 -150 158 126 -154
2200 -154 40 144 -182 -121 40 -32 -214 15 24 -299 -31 95 -182 -76 177 -81 -97 194 105 -170 173 261
2222 261 -125 61 245 -74 -143 400 126 -241 191 25 -223 92 174 -158 -76 147 -177 -402 163 36 -442
2243 -442 103 205 -401 -121 302 -117 -282 468 -27 -389 413 339 -434 57 601 -253 -232 555 100 -471 287
2264 287 283 -407 99 307 -533 -148 578 -372 -674 605 274 -796 43 549 -462 -286 684 -158 -302 615
2284 615 -86 -625 561 674 -902 -21 1297 -367 -795 783 297 -818 142 384 -579 124 520 -909
2302 -909 -344 1086 -434 -1185 879 790 -1306 -275 1131 -368 -699 739 -100 -540 922 16 -1028
2319 -1028 972 968 -1454 -201 1865 -319 -1422 1058 669 -1077 154 605 -710 131 661 -1238 -418
2336 -418 1631 -610 -1812 1140 1372 -1835 -658 1751 -333 -1034 719 13 -483 900 -36 -1227
2352 -1227 1089 1406 -2000 -507 2421 -316 -1946 1002 1418 -1201 -395 829 -408 3 667 -1226
2368 -1226 -481 1754 -678 -2362 1327 1765 -2176 -1077 2093 153 -1465 540 443 -348 702 -122
2384 -122 -1271 1303 1533 -2247 -715 2750 142 -2481 800 1885 -1168 -869 694 -104 -132 431 -1138
2401 -1138 -469 1951 -380 -2430 1243 2133 -2033 -1485 2344 608 -1805 103 852 -226 311 -122
2417 -122 -1046 1080 1387 -1926 -930 2694 263 -2726 518 2247 -1102 -1336 957 436 -324 89 -707
2434 -707 -390 1558 -191 -2171 970 2291 -1821 -1734 2088 977 -1897 -212 1321 5 -168 -84 -628
2451 -628 797 1172 -1510 -988 2200 491 -2544 112 2332 -771 -1706 817 827 -506 -223 -344 -226
2468 -226 989 -118 -1863 578 1920 -1236 -1796 1718 1342 -1896 -612 1365 96 -669 140 -43
2484 -43 434 781 -895 -831 1636 692 -2122 -189 2101 -424 -1733 711 968 -771 -601 125 -31 469
2502 469 -26 -1200 206 1573 -731 -1569 1319 1302 -1411 -690 1409 285 -772 239 326 134 430
2519 430 -334 -566 1034 661 -1416 -392 1622 -114 -1508 484 1009 -771 -671 367 26 -33 -11 -606
2537 -606 -29 959 -254 -1165 789 1078 -999 -739 1212 311 -901 61 549 -70 114 -7 -417 349
2555 349 584 -775 -483 982 -103 -1152 143 893 -596 -645 562 113 -401 66 -1 -85 624 136 -745
2574 -745 386 806 -555 -632 854 299 -740 84 618 -92 -178 307 -127 44 378 -251 -324 626 99 -765
2594 -765 8 656 -288 -555 399 113 -420 107 225 -99 207 261 -159 51 465 -240 -307 549 212 -385 113
2615 113 398 -161 -230 296 -72 -71 189 24 -198 249 137 -520 10 298 -237 -449 149 40 -219 25 121
2636 121 -90 -124 292 35 -61 174 124 -173 222 235 -206 125 294 -13 -133 366 -19 -264 -17 47 -245 -8
2658 -8 124 -143 -151 145 -95 -248 182 31 -158 17 82 -138 -53 192 40 -32 231 61 -83 -8 145 6 -12
2681 -12 214 -17 -52 111 26 -139 214 148 -122 -83 50 -194 -264 139 77 -162 -79 167 -135 -11 111 -192 80
2704 80 225 -7 -153 168 102 -227 45 235 -156 54 218 -32 -107 178 -175 -121 226 231 -356 -106 289 -202
2726 -202 -201 39 -19 -268 112 -23 -249 288 289 -278 -55 583 -20 -355 413 345 -318 131 376 -109 47 278
2748 278 -98 -175 394 -104 -622 450 343 -657 -153 481 -221 -423 187 -2 -263 239 -5 -444 376 475
2768 475 -683 -119 918 -173 -673 504 495 -404 -35 382 -114 31 252 -454 -72 794 -220 -993 708
2787 708 681 -951 -435 803 39 -651 285 189 -243 233 -15 -556 551 663 -1009 -240 1321 -51 -1080
2806 -1080 475 862 -456 -363 540 -31 90 310 -569 -113 1064 -266 -1353 774 1176 -1299 -658 1132
2824 1132 232 -1001 49 395 -158 176 -67 -627 748 781 -1187 -361 1585 12 -1545 638 1289
2841 1289 -668 -527 594 220 -114 124 -615 -86 1157 -388 -1294 834 1353 -1297 -1093 1515 371
2858 371 -1375 -48 784 -65 63 -155 -455 745 713 -1219 -344 1850 -31 -1662 573 1638 -658
2875 -658 -983 633 394 -166 20 -408 131 984 -461 -1431 909 1207 -1408 -973 1447 544 -1375 -208
2893 -208 891 -28 -214 -351 -232 730 407 -1122 -257 1646 -13 -1704 402 1585 -549 -1135 762
2910 762 514 -321 -334 -148 215 630 -457 -1082 718 1103 -1201 -936 1419 535 -1334 -426 918 128
2928 128 -561 -188 43 539 211 -808 -164 1365 114 -1365 362 1431 -550 -1034 537 716 -338
2945 -338 -293 16 326 298 -483 -711 493 660 -1029 -749 1081 534 -1084 -340 935 61 -505 -165 378
2964 378 400 -19 -556 28 874 -27 -1003 284 1052 -446 -890 389 536 -260 -390 167 224 162 -369 -444
2984 -444 458 361 -561 -404 683 217 -703 -245 698 231 -458 -163 353 202 -148 -225 153 513 -88 -551
3004 -551 126 545 -151 -545 267 437 -327 -382 107 279 -63 -335 -109 288 124 -369 -190 225 92 -476
3024 -476 -148 399 69 -211 -12 315 72 -161 -183 194 286 -33 -246 69 218 -83 -287 131 306 -237 -121
3045 -121 24 21 72 -260 44 88 -68 -193 25 60 95 -120 -43 264 122 -202 -59 174 91 -191 -12 102 237
3068 237 -71 -9 217 38 -132 -219 187 23 -155 -144 -53 29 -25 -150 -18 77 -59 -178 -10 50 -36 -47 43 213
3092 213 -22 71 40 91 45 -58 -8 30 122 -75 -11 70 -14 -30 -13 -1 118 -10 -176 34 -55 -34 -74 22 95 -28
3118 -28 -71 56 163 33 177 37 51 -2 36 65 40 56 5 106 -1 89 8 87 43 -15 -19 29 3 -28 -42 72 -17
3145 -17 -49 -59 -120 -55 -116 -5 58 6 -42 -48 123 8 -60 10 28 21 42 52 146 40 26 27 129 32 57 23 -79 118
3173 118 -6 -66 -27 96 -53 -63 -52 -43 -62 -60 29 7 33 124 -56 10 132 39 3 94 -91 -99 9 -7 33 -96 57
3200 57 99 -47 -44 10 -18 0 -34 -36 -18 62 -92 -44 75 99 -20 -108 76 -15 -6 -31 24 125 81 -34 -5 214 92
3227 92 -149 -3 131 44 -91 -94 86 42 -17 -84 12 139 -47 -206 74 179 -193 -285 165 175 -153 -58 113 196
3251 196 20 -31 -131 215 120 -210 -242 260 155 -298 -56 315 110 -244 22 146 -2 22 -180 60 322
3272 322 -75 -402 38 250 -163 -447 170 298 -204 -233 59 65 2 -111 -242 145 276 -215 -273 503 247 -345
3294 -345 -109 513 54 -401 -12 219 162 -140 -236 -53 460 88 -652 -40 635 -235 -693 206 556 -294 -352
3315 -352 186 232 11 -111 -172 198 404 -418 -479 575 355 -672 -380 642 51 -648 108 271 74 -15
3335 -15 -197 -101 496 29 -759 10 771 -146 -810 402 688 -389 -412 345 307 -56 -100 -232 192 514 -374
3356 -374 -540 618 533 -855 -434 838 148 -712 5 454 25 -136 -189 -74 436 85 -760 -94 1066
3375 1066 -177 -831 462 817 -594 -636 417 366 -153 -189 -125 138 446 -436 -518 750 582 -923 -373
3394 -373 913 62 -838 63 624 -37 -296 -196 4 520 163 -712 19 954 -264 -1042 491 879 -628
3413 -628 -589 627 357 -250 -102 -29 140 411 -307 -571 632 588 -785 -452 952 187 -803 84 538 -132
3433 -132 -359 78 -23 244 113 -525 31 716 -122 -777 469 785 -632 -474 674 164 -429 -4 215
3452 215 -10 286 -191 -460 553 438 -643 -306 842 58 -767 105 565 -271 -325 15 82 10 7 -343 62
3473 62 586 -238 -640 472 578 -480 -477 519 238 -356 98 160 111 58 1 -283 287 279 -440 -165 610 33
3495 33 -609 206 385 -244 -280 225 -31 -175 73 -197 -66 272 -131 -407 253 352 -313 -222 405 250 -194
3516 -194 95 216 -13 30 -4 -38 168 199 -377 -182 408 -66 -409 103 315 -67 -207 188 -37 -53 30 -19
3538 -19 78 132 -101 -173 119 187 -298 -126 362 124 -230 9 101 6 110 -21 71 -43 140 -79 -8 203 -85
3561 -85 -222 38 133 -171 -182 188 23 -150 28 148 -54 130 69 -95 73 163 -92 -56 92 47 -74 -11 152
3584 152 -56 -30 44 -38 -104 40 -90 -43 4 -22 90 17 136 -75 -65 79 -65 -65 -27 115 -46 44 38 -50 49 46
3610 46 61 -64 162 -5 -49 -56 -7 -74 6 46 19 -14 -2 -24 -64 29 52 25 -45 15 -19 19 29 -95 93 78 -83 -20
3638 -20 -19 134 -8 -31 63 55 -91 48 54 13 56 -9 24 53 145 -140 -39 49 -30 -33 23 -148 -140 -5 16 -60 -44 110
3666 110 -41 -43 58 -23 -195 132 119 10 -119 11 2 5 -30 5 99 40 111 -76 111 147 -164 -61 91 97 -114
3691 -114 2 103 -68 26 -88 -26 -31 102 -197 -127 92 12 -94 -52 130 -24 -105 54 71 -32 -13 -50 34 138
3715 138 -61 -84 162 44 -102 -288 138 -3 -115 -11 74 -14 12 51 -80 80 53 2 -157 97 69 -103 -23
3738 -23 222 -68 -300 173 142 -144 -67 56 -93 192 96 -101 102 273 -81 -266 166 181 -188 -190 185 43
3760 43 -8 -6 -111 22 79 -82 -181 173 184 -198 -101 304 72 -195 -54 264 25 11 88 11 -14 43 -119 -103 350
3785 350 63 -295 171 255 -197 -214 151 120 -158 -107 153 -12 64 -54 -283 166 220 -223 -234 348 124 -445
3807 -445 -57 327 -89 -84 88 6 -48 -3 21 13 274 91 -332 20 308 -67 -256 261 171 -310 -26 130 -22
3830 -22 31 49 -116 -4 235 -82 -242 351 138 -383 -229 476 49 -321 129 137 -150 95 -43 -197 134 173
3852 173 -276 -119 397 -29 -332 301 245 -318 -61 299 -38 -174 167 -90 -175 231 -25 -353 199 385 -340
3873 -340 -109 556 -11 -338 140 139 -182 -32 116 -90 39 251 -212 -66 428 -23 -456 66 318 -193 -226
3894 -226 304 26 -259 202 37 -150 281 27 -397 132 352 -348 -168 401 47 -376 139 335 -226 23
3914 23 232 -52 -11 298 -93 -296 384 135 -405 104 393 -221 -65 270 -33 -344 238 90 -192 160 171
3935 171 -369 19 456 -108 -218 395 55 -466 138 181 -207 -94 187 -75 -35 153 4 -268 223 196 -348
3956 -348 -83 223 -167 -292 277 125 -251 179 92 -264 43 169 -282 -83 357 -145 -211 196 172 -338 129
3977 129 303 -174 -131 290 -159 -295 260 37 -297 174 162 -204 -45 312 -88 -169 170 34 -147 125 168
3998 168 -142 -106 240 -138 -152 259 95 -246 181 245 -163 -46 159 -164 -71 190 -16 -159 138 10 -157
4019 -157 18 119 16 -96 224 -1 -119 104 57 -178 -32 159 -166 -35 50 -10 -203 97 37 -165 97
4040 97 128 -150 -64 109 -50 -143 159 51 -46 62 149 -142 -47 122 -106 -155 180 -84 -286 211 142 -123 -6
4063 -6 165 -75 -60 92 -117 -32 110 43 -40 157 145 -33 -18 72 -31 -72 60 -25 -61 1 113 -61 -55 28 3 -39
4089 -39 104 9 -101 5 -36 -88 -39 85 -151 -71 175 57 -90 -23 19 -109 72 138 -4 -147 29 5 -130
4112 -130 41 50 -30 -17 103 -67 17 178 -17 -75 49 29 -111 51 138 -87 -9 78 -30 -55 67 78 -187 34
4136 34 56 -7 -41 39 13 9 100 -113 9 85 -2 -78 -76 129 -57 -215 71 26 -32 -30 29 -166 82 -17 -188 97 172
4163 172 -35 -196 170 83 -52 99 133 -144 -187 32 8 -76 96 -158 -95 101 104 -125 -52 96 -54 -165 102
4186 102 102 -63 -93 -82 78 115 -11 -140 -63 203 -86 -142 63 117 -216 -71 211 32 -77 96 -25 -119 75
4209 75 -178 -192 150 71 -153 5 264 -39 -209 46 82 -77 74 126 -43 78 -1 -221 -12 229 -154 -157 175
4232 175 165 -225 -140 252 49 -71 84 15 72 45 -73 -163 207 46 -257 -45 416 -128 -277 103 114 -76
4254 -76 31 78 -53 107 -38 -184 30 139 -83 -202 272 240 -367 -120 207 -1 -106 129 -39 62 145
4275 145 -135 -167 96 189 -355 -48 331 -26 -278 227 297 -168 -133 149 3 143 61 -195 67 303 -113 -288
4297 -288 183 237 -363 -12 355 6 -199 -23 108 -152 67 -20 -119 295 135 -368 -88 428 132 -430 163
4318 163 330 -187 -197 158 50 5 15 -249 26 244 -206 -249 278 327 -330 -83 300 110 -215 -18 86 4
4340 4 -84 -30 -70 151 128 -294 -74 371 -22 -372 186 295 -115 -111 129 18 -48 -67 36 21 171 -135 -333 254
4364 254 244 -294 -117 271 105 -355 -36 219 -34 -120 -4 55 90 153 -239 -42 289 28 -434 194 284 -200
4386 -200 -270 138 114 -136 -60 45 8 110 -43 -141 120 149 -190 -200 412 124 -320 74 298 -91 -167 74 -59
4409 -59 -7 -23 -184 -26 176 -41 -340 124 444 -220 -311 304 182 -104 -82 106 27 62 -17 -112 152 137 -169
4432 -169 -120 224 102 -270 -16 291 -125 -99 7 76 -17 -75 -93 -32 193 -92 -175 -6 147 -39 -138 49 142
4455 142 -189 -178 82 59 -35 7 -77 134 73 -98 -96 228 149 -252 8 249 -70 2 50 -5 -62 -8 -29 125 89
4480 89 -36 -241 137 201 -106 -156 72 1 -80 -22 177 -2 -65 59 -47 -78 72 -54 -91 1 57 -38 -36 214 -44
4505 -44 -110 5 81 -19 -127 98 73 44 -9 -88 -26 148 -28 -72 67 90 -94 -132 53 42 -16 -26 117 -25 -67
4530 -67 0 -89 -30 4 27 -32 32 -103 -120 -71 -9 2 47 14 -20 82 66 -46 -27 -12 61 10 -5 42 -76 -13 -22 148
4558 148 12 21 -59 -8 -66 26 -102 -49 90 10 -16 59 62 -51 120 3 1 1 -18 -107 -99 -5 -78 -72 84 -15 -23 -46 -17 -54
4588 -54 -65 207 116 53 14 -3 15 -52 166 65 -6 89 10 -58 -46 16 -14 123 -36 -16 -15 85 -34 -73 22 42 -115
4615 -115 -38 142 -37 -100 -47 90 -11 -46 -187 -22 158 -49 -145 133 185 -31 -78 4 99 -34 -79 11 48 119
4639 119 35 67 23 -10 -103 -47 102 -5 -82 50 213 -8 -13 1 93 72 15 -56 19 142 51 -165 92 207 -10
4664 -10 -113 67 69 -152 -41 81 108 -23 -105 -90 131 123 -154 -62 68 53 -156 -50 197 39 -117 13 114
4687 114 26 -78 -18 14 220 -59 -236 75 152 -15 -300 84 79 -196 -57 120 63 35 -22 -42 44 45 -164 -192 150
4712 150 72 -270 -65 253 -12 -171 45 68 2 -93 -85 -52 130 53 -231 -15 178 18 -286 117 303 -60 -87
4735 -87 127 56 -14 -96 94 60 116 -101 -197 238 73 -277 -132 290 -23 -262 -72 221 65 -248 14 74 45
4758 45 -10 -182 21 323 24 -264 61 321 -126 -216 93 199 -137 48 72 33 20 -169 -170 196 132 -222 -148
4781 -148 289 112 -175 47 264 -78 -206 -18 -11 -10 -10 -106 -173 308 -115 -286 168 380 -189 -366 239 70 -195
4804 -195 -84 67 15 -72 -126 -170 285 300 -279 -151 239 147 -367 -52 269 -19 -147 48 39 -35 87 -125 -6
4827 -6 336 18 -434 119 357 -188 -276 372 260 -230 -62 161 -72 28 -47 -139 19 246 -211 -246 233 83
4849 83 -349 -88 306 -30 -221 75 4 54 -93 -31 -39 187 -8 -179 49 318 -170 -305 190 283 -63 -117 124
4872 124 25 -52 -47 -45 23 189 -148 -92 212 236 -289 51 333 -2 -201 -4 114 -142 50 -23 5 197 37 -264
4896 -264 38 260 -112 -285 108 169 -175 -205 116 -37 -93 -7 -123 -6 73 -72 -168 233 160 -272 -99 231
4918 231 -28 -272 -10 113 -29 -111 -82 -30 72 -50 -140 8 181 -116 -152 109 126 -190 -259 14 53 -79 -59
4941 -59 12 77 131 -84 -52 153 159 -9 -95 298 33 -188 18 180 -51 -73 16 0 174 -16 -74 -41 146 -70
4965 -70 -174 72 47 -141 -130 50 -35 94 69 69 9 37 -118 -84 168 84 -241 4 101 61 -25 -40 202 -93 -150
4990 -150 82 -29 88 101 -37 43 31 -75 -69 -6 -45 -179 -98 121 -2 -89 0 -1 8 39 25 13 118 37 -9 -71 20
5017 20 -48 -3 42 141 2 28 58 -65 -92 75 -56 -84 -30 -24 112 -3 7 -37 -22 12 64 -60 -114 80 10 -23 70
5044 70 12 53 -15 54 54 20 -27 -13 97 77 -24 -19 20 -46 -45 -66 -10 17 -44 50 -18 -37 -100 -51 10 -150 -94 72 -2 -31
5074 -31 -161 41 67 -46 -68 55 -19 -35 -153 -183 52 65 -87 -83 176 84 -94 -45 58 42 -61 -59 -10 -14 -35 -56
5100 -56 21 120 -87 -84 -27 172 -17 -87 29 186 90 -104 51 52 107 -75 -20 58 -4 -75 -116 2 72 -154 -53 305
5126 305 -74 -154 -44 74 -3 -34 -68 72 104 -24 -130 66 147 -51 -163 17 152 4 -91 21 134 -83
5148 -83 -116 44 114 124 -34 -9 282 53 -9 64 143 41 -143 -188 133 47 -53 -46 77 96 -137 -119 86 114 54
5173 54 -106 -30 169 -21 -180 46 189 -140 -116 -77 159 27 -197 18 120 -4 -102 -130 183 191 -182 -121 219
5196 219 -2 -107 -19 122 55 -42 -119 122 201 29 -105 61 154 -105 -130 82 143 -110 -177 110 245 5 -88
5219 -88 -29 192 87 -317 -103 218 54 -248 -56 54 40 -211 -144 129 154 -111 -131 36 78 -107 -244 195
5241 195 246 -26 -183 35 194 -82 -162 109 179 -63 -149 -71 182 127 -266 -182 212 52 -284 23 194 -45
5263 -45 -222 -186 383 -43 -199 5 198 200 -175 -19 133 176 -94 -191 227 126 -122 -200 83 265 -61 -214
5285 -214 69 244 50 -68 -67 206 -9 -246 -109 326 -34 -308 18 323 49 -182 -9 42 43 -195 -25 162
5307 162 155 -195 -192 133 184 -25 -219 146 221 -79 -188 72 169 -55 -168 33 320 -67 -166 -41 241 -2 -201
5330 -201 -43 252 93 -197 -78 182 79 -102 -155 130 76 -47 -182 168 257 -223 -164 62 165 -166 -38
5351 -38 39 140 -65 -69 87 182 -19 -238 23 127 -46 -145 -73 307 35 -181 16 172 154 -30 -28 147 158 23
5375 23 -106 -40 82 -166 -141 251 218 -165 -100 21 139 76 -132 54 98 -9 -179 -24 139 27 19 -12 115
5398 115 -74 -256 -44 135 88 -74 -93 47 125 -146 -60 65 115 -102 -117 87 152 -46 -97 88 126 -109 -146
5421 -146 50 182 3 -46 -78 114 23 -88 15 100 -100 -106 10 26 -51 -131 -74 -1 81 -88 -51 87 24 -101 94
5446 94 58 84 -136 -66 71 154 -70 16 45 58 2 -85 23 31 -97 -119 58 102 128 -29 -13 4 70 85 44 85 -10
5473 -10 -20 17 77 9 59 91 -13 131 -126 -116 60 -31 -65 -12 24 22 91 -42 52 -41 6 73 -1 88 -44 63 -14
5500 -14 58 65 -35 -3 7 95 -34 -14 99 87 25 -30 38 -77 39 -64 1 57 -18 -54 11 -76 -83 110 82 43 -32 1
5528 1 -71 28 17 -27 -75 56 33 111 68 -31 -21 -11 26 -117 2 -20 105 21 -94 -7 74 19 -2 40 78 26 -65 -27
5556 -27 -12 -17 -72 -29 118 -45 -113 122 -1 11 -20 69 45 -41 3 -25 96 -31 59 -114 57 9 -13 33 -4 50 -86
5583 -86 -27 103 -50 -25 -58 -5 -11 -20 -48 -63 180 93 -71 134 139 -45 -12 104 89 144 -2 -48 23 60 -176 4 49
5610 49 70 -1 0 95 -1 -162 -71 101 65 -11 -103 69 -28 72 13 -131 93 -1 -76 63 68 -50 -6 187 74 -25
5636 -25 35 -56 40 -3 60 -36 86 143 -108 -87 46 84 -48 -129 34 -50 -16 3 -12 141 39 -63 76 141 -37
5661 -37 -154 95 99 -85 -106 24 122 -46 -98 -28 60 66 -77 -19 102 130 -78 -98 94 125 -134 72 99 12 -178
5686 -178 -45 2 4 -12 -81 32 236 4 -68 32 161 8 -210 72 28 -55 -84 60 23 30 -52 -19 105 64 -114
5711 -114 -25 103 111 -122 -86 138 67 -50 62 82 131 -6 -131 91 68 97 -166 147 158 21 -98 -42 95 -8
5735 -8 -172 66 21 9 -93 -83 127 106 -225 -115 103 37 -141 -58 96 -23 -27 -101 39 -67 -121 -27 33 147 -51
5760 -51 -191 21 246 -21 -237 178 155 -52 3 79 132 -35 -35 15 41 38 -125 -52 159 126 -158 -90 154 58 -61
5785 -61 3 256 1 -33 -114 97 84 -37 -142 31 193 -30 -182 45 78 -54 -33 121 113 -7 -1 -70 59 131
5809 131 -56 -143 19 114 -121 -123 183 4 -208 -75 73 29 -79 -115 87 70 -18 -154 -21 151 -75 -176 53
5832 53 140 -122 -157 -36 103 -45 -136 -10 191 -40 -141 -18 135 170 -54 -36 166 112 -162 18 188 76
5854 76 -108 -45 73 25 35 -114 96 77 -94 -152 18 95 -66 -159 7 96 14 -73 -39 28 91 -220 25 72 41
5879 41 -166 8 201 99 -117 20 58 35 -45 33 99 6 45 -37 16 75 20 -81 0 91 22 -165 29 31 -65 -106
5905 -106 -51 73 161 11 -18 74 134 71 -96 -16 59 -97 -145 28 -125 35 22 88 81 -109 -69 41 131 17 -78
5930 -78 91 61 51 -125 -47 27 -1 -117 52 60 -19 1 -9 -19 -60 35 -98 -6 -55 32 -63 158 -40 -147 -51 -15 52
5957 52 21 16 60 -62 -9 -98 -121 -53 6 -37 -35 -74 -98 47 67 10 -49 21 2 -68 -7 37 46 42 -7 1 41 20 -62 -36 23 -32
5989 -32 10 -49 41 15 25 13 29 -59 -29 80 67 -84 -2 -37 81 59 33 39 18 73 -10 79 44 134 103 15 -36 -49 -34
6018 -34 -12 -36 104 -42 56 16 96 29 -66 -80 15 -31 -9 -12 9 -17 -138 -34 -63 124 -72 -18 126 33 -53 14 106
6045 106 58 -53 -82 52 12 -110 -51 44 93 -3 -135 3 92 -75 -143 37 153 -57 -90 130 16 -143 -75 46
6069 46 -12 -6 -85 -94 -1 69 -67 -65 63 -37 -126 -62 149 -72 -44 -79 85 34 -53 31 65 59 -106 8 40 -3 -46 -111
6097 -111 87 131 -94 -14 -23 63 -131 -139 115 139 7 -68 24 -31 2 -93 89 179 12 -8 -58 61 14 45 -93 93
6123 93 9 -117 -49 102 -38 -116 -123 9 -35 -70 -48 124 -11 -44 -77 14 38 -6 -50 23 123 -63 -90 100 137 40
6149 40 -50 -24 -14 -91 31 -44 33 96 -82 -43 57 94 -164 10 54 6 -119 -46 -72 8 -30 -59 -73 114 31 -84
6175 -84 -40 123 -44 -102 96 -20 12 -93 -30 94 -107 -72 96 132 80 -58 -16 185 62 -132 2 122 102
6198 102 -132 -68 54 25 -64 2 35 -50 -35 -34 36 16 46 11 29 44 -99 -98 195 86 -34 -91 19 81 -93 15
6224 15 67 35 -2 -37 18 150 -16 -125 -20 -39 -46 -18 21 56 10 -4 -63 138 29 -7 -68 -87 155 -23 -142 21
6250 21 198 -129 -60 55 6 4 6 -16 110 18 -79 -60 49 -59 -198 32 61 -48 -51 -8 95 57 45 34 80 73 0
6277 0 -120 -17 8 50 -14 51 116 120 -24 -81 29 -6 28 -71 83 106 -78 -8 90 -81 -116 -23 13 -48 -74 -6 54 -89
6305 -89 -74 56 -28 5 26 -34 -16 112 64 -58 -31 28 -19 59 65 23 32 36 -41 -40 13 -31 86 34 -12 -43 -54 92 -26
6334 -26 -27 -40 -11 -21 56 5 112 46 -44 -147 -38 -11 31 41 79 15 8 -92 -28 10 107 -181 34 -40 -25 -45 22 -24
6362 -24 30 0 -72 -12 16 21 -57 33 -11 43 -92 -37 19 -7 12 -53 -14 15 -39 -88 0 55 -60 64 84 11 -30 58 64 16
6392 16 -29 -102 0 -25 -63 69 43 13 -40 31 43 8 83 -20 9 16 119 -19 23 -6 150 62 59 -14 7 31 77 67
6420 67 -61 -28 38 -100 -82 71 -112 -95 34 20 55 -74 -28 -49 14 9 45 -72 34 77 -39 -68 -46 -7 -69 -36
6446 -36 66 24 17 -75 71 100 -47 6 -97 -39 -30 33 6 -68 16 -64 -82 24 45 34 -31 -29 182 -3 -81 -8 110 72
6474 72 63 173 79 -56 84 2 -4 42 1 -10 44 -50 -17 -122 33 -55 6 49 3 -76 -45 41 -28 29 73 22 1 93 -31
6503 -31 -61 1 87 14 17 45 24 -96 8 -18 -93 31 -44 -62 12 -8 -58 -37 81 178 -170 8 67 44 -36 -25 -82 -42
6531 -42 27 -104 -74 27 44 24 -85 -18 -14 17 19 6 35 -30 -103 6 -150 24 5 3 57 -34 13 70 -31 5 0 -108
6559 -108 -16 73 105 -95 -15 90 32 -69 11 79 -58 -166 -57 37 -21 52 56 -115 78 89 -112 67 -15 -55 -99
6584 -99 -14 24 59 1 61 2 6 39 -65 -104 -7 -27 -103 114 55 -21 -43 26 -118 10 46 103 30 113 64 41 41 -32 -5
6613 -5 -78 38 -61 -39 -8 -63 -43 74 66 36 19 21 63 2 -24 -12 97 -38 0 -44 95 -10 -75 61 158 -22 -71 54
6641 54 73 -105 -160 177 7 -22 -30 14 -71 21 59 6 42 79 -60 -133 69 55 -44 110 -32 80 90 62 14 92 18
6668 18 -180 45 49 -58 -85 112 21 40 -60 56 -30 -151 -71 -15 -33 -47 -31 16 35 -26 -85 21 132 -32 -139
6693 -139 102 23 -76 77 71 46 -62 -13 -72 -7 57 0 -99 4 43 -67 5 105 58 11 -59 5 -92 31 -59 18 -106
6720 -106 106 -113 -89 105 5 -111 119 95 -123 -105 -68 21 -102 -105 -1 55 81 51 25 23 -23 -77 -139 75 127 -60
6746 -60 -28 67 128 -23 8 7 12 -10 24 -6 32 -17 -112 102 123 7 -110 52 58 -58 13 50 -30 -4 -62 -95 -21 30 -168
6775 -168 -55 128 86 -171 26 61 11 -119 -71 54 -47 -4 -105 -4 63 -1 -69 -2 148 22 -23 135 -3
6798 -3 28 108 50 3 6 -66 -129 -52 139 5 -97 70 135 -40 -59 -53 -55 -122 -11 -25 -7 127 99 -43 -5 49 -60 59
6826 59 73 -21 -56 121 113 22 -73 74 35 -24 -3 -19 38 27 71 -89 22 164 -45 -43 -5 -52 -42 -43 75 1 -35 48
6854 48 -25 64 94 -83 -80 83 32 -87 17 -8 60 -48 27 42 56 132 -96 81 56 65 -95 -40 31 -43 -85 72 20
6881 20 -121 59 19 -9 -2 -11 123 42 116 2 -20 -1 6 -85 23 57 -61 6 -6 -86 -22 21 -94 -23 -15 -42 -63 -81 105
6910 105 -60 46 -49 -54 -77 -79 75 93 105 96 -26 50 99 -110 -9 -79 40 -54 116 102 -51 -29 6 83 -106 0
6936 0 -54 7 -27 -44 38 -146 8 34 16 -59 -4 -108 -32 35 -39 -44 42 -84 9 46 10 3 -26 71 62 121 107 -40 44 42
6966 42 -38 1 19 42 4 -79 32 -5 -29 13 28 -61 11 -78 92 47 -87 -49 -78 100 -50 -145 30 52 -107 11
6992 11 33 5 -3 -16 -42 -11 -4 4 -140 10 -56 -98 -120 75 79 -149 -3 121 63 -21 -1 -48 108 -42 20 -3 67 43
7020 43 -7 96 -49 -93 -24 44 32 55 119 81 -82 3 -17 -72 57 57 -107 -78 90 28 -58 -7 58 1 -67 29 39 99
7048 99 20 -31 11 117 -4 -86 26 41 -23 -81 19 -10 -38 -36 15 58 55 -119 -1 14 -3 -54 24 78 -102 -30 152
7075 152 -9 -53 -27 185 -128 13 36 21 36 69 -8 -78 52 65 -44 -170 11 -30 -91 65 5 11 29 34 53 23
7101 23 -11 7 -35 59 39 -121 -96 89 -126 -40 -46 40 136 -3 10 20 104 -8 43 91 68 -176 -78 32 -14 0 38
7128 38 69 -14 -147 -161 -36 -90 -10 -19 -53 53 86 -10 -14 78 -55 -138 -24 -73 -112 -8 128 -16 57 -86 37 -7
7154 -7 97 -33 8 -13 -42 12 41 71 -7 105 80 89 14 -36 -130 122 81 -48 -155 88 87 -132 0 117 40 -34 -42
7181 -42 4 161 82 8 -95 25 109 -36 76 47 -16 -62 29 83 49 -76 62 107 1 -155 -79 -96 14 -104 -108
7206 -108 26 87 -67 45 34 44 -32 -58 -21 45 -31 41 -64 58 17 -38 -22 12 17 -113 16 117 -26 39 8 -31
7232 -31 67 -171 17 53 68 -50 -88 -133 32 -78 -85 -27 75 30 11 -27 3 24 -11 -19 57 111 44 41 42 13 -126 -34 -15
7261 -15 37 106 19 -5 -7 -25 83 97 -2 27 -140 -9 114 -86 -79 -43 104 30 -47 69 123 14 -7 8 10 -4 -87 -79
7289 -79 151 20 -12 23 85 -62 -57 -42 35 -4 21 -98 -61 34 74 -81 -130 59 48 -51 -45 -3 83 1 16 32 11 64
7317 64 -62 12 13 -32 -180 21 44 -17 -4 -33 -6 64 -54 -43 55 -97 67 20 191 1 -52 -16 47 3 -32 -20 20
7344 20 -77 -147 -161 50 -33 -2 -115 10 6 15 51 -36 145 60 -63 -54 110 60 -48 30 65 -20 34 -78 87 -66 -62
7371 -62 -33 -26 69 81 -5 -44 -24 57 78 43 -115 -75 -69 35 -16 -85 -46 21 108 -125 51 -26 -12 -51 3 -48 61 -77
7399 -77 -15 66 -101 37 -7 -24 -41 -22 34 -114 16 83 -84 -20 16 -29 -107 -54 -129 -108 89 -59 -31 -116 -18 8 1
7426 1 -42 -73 -77 -19 -32 -36 43 -13 -81 -19 96 -15 26 46 -185 -49 27 75 -22 -33 45 42 -4 30 -80 -51 -4 26 -87
7455 -87 -26 35 28 19 14 -26 -2 18 -85 -14 -49 99 -7 -121 -71 47 -139 -32 104 -26 -24 20 -30 20 93 12 113
7482 113 35 -15 -135 0 52 -40 51 144 77 -145 61 28 14 -23 -17 19 48 -66 -60 2 99 -143 -95 27 89 -47 -93
7509 -93 -109 -102 -25 90 -27 -78 -28 -21 1 9 46 -153 -39 127 148 -66 5 43 26 -17 -57 90 64 -12 -25 8 111 -25
7537 -25 -32 119 166 -1 -70 13 24 -80 -87 -36 29 -57 -68 -35 113 -43 -49 13 -48 -6 -196 29 143 9 -213 92
7563 92 65 -10 13 96 -36 41 13 -124 -18 99 -56 9 159 169 -62 -5 54 78 -107 -106 -18 64 31 -27 41 147
7589 147 3 -74 52 68 52 -122 -79 43 55 -78 -34 64 81 -73 -68 14 166 21 -89 157 50 -70 2 143
7613 143 47 -112 -88 76 66 -26 -194 20 93 -77 -210 78 88 -122 -88 109 171 -45 -90 45 -6 47 -59 -50
7637 -50 63 108 -12 -69 169 3 -31 -54 110 155 -5 67 164 57 -19 64 23 -1 -75 -53 210 137 -56 -93 143
7662 143 109 -86 -47 69 55 24 -88 -71 122 44 -100 -46 64 65 -158 -52 35 -33 -126 -86 28 71 -4 -16 48 100
7688 100 -15 -84 -6 154 -86 -126 137 28 -55 -17 77 65 56 15 132 76 71 -106 59 94 -42 -107 9 130 96
7713 96 -68 17 109 -44 50 -53 25 78 46 -81 55 96 -49 -199 -16 88 -47 -107 73 -7 -27 -18 -75 111 70
7738 70 -64 98 102 -43 -35 -55 56 -17 -39 -92 44 0 -118 149 -109 -1 4 -95 -66 62 -21 -45 22 22 -102 9
7764 9 5 94 -54 -19 -82 -109 36 -52 -55 -11 59 -46 49 74 40 -178 -91 4 -72 -14 -12 -2 59 -82 -56 -53 85 -10 -153
7793 -153 18 122 -66 -72 84 121 -119 -18 -60 -41 83 8 -70 43 14 -63 -98 -4 13 -13 -18 24 -39 -23 0 -90 -33
7820 -33 5 43 -113 141 -29 -83 0 215 30 -19 -80 -18 16 59 157 15 67 -51 -63 42 22 -24 -66 -10 -27 -65
7846 -65 22 41 0 -68 31 -23 -165 -52 66 -33 -89 -69 -89 -11 24 -110 -54 26 -35 -82 13 -16 101 75 -101 -2 -23
7873 -23 57 -26 -105 -46 -13 -1 -87 45 -59 -19 65 -51 -157 25 41 -88 39 -18 -8 -51 0 37 58 -17 34 -72
7899 -72 78 76 -68 -16 99 -23 -2 17 -24 31 37 -35 90 -5 22 36 -19 85 30 -11 -6 36 17 63 -25 128 -49 -6
7927 -6 -65 18 -15 32 -53 -16 -8 -10 23 21 -76 -2 3 -1 41 -20 -18 -16 46 -3 -34 -78 25 14 -59 16 175 -4 -19 18 -99 51
7959 51 -128 -21 164 68 -34 42 61 -16 -24 -43 -39 -17 -116 -6 136 -61 -68 10 -6 62 -1 9 -118 -57 -65 125 -18
7986 -18 10 -127 76 -12 76 57 18 -3 1 -10 5 -8 -75 11 38 24 -6 67 20 23 33 -45 -37 -10 28 -12 42 23 18 -22 -142
8017 -142 -61 -131 -40 -115 -52 139 -5 -33 -125 -54 91 9 -65 21 0 -104 -71 10 -27 -17 -94 45 120 -5 -55 19 -18
8044 -18 6 -18 11 24 27 -20 -69 6 -53 -139 23 84 85 -18 -108 17 52 36 41 35 59 -130 7 -6 -35 -47 8 -81 -40 -54
8074 -54 -24 -10 25 -61 -92 -49 48 39 -51 -15 97 -49 -19 -8 78 42 -97 27 122 160 -121 108 12 109 -45 -52 86
8101 86 -22 -69 -12 -45 -38 -60 -25 -55 77 -80 -75 20 -1 -25 -162 7 77 -39 -73 97 -55 59 -30 89 -20 -21
8127 -21 -104 32 -11 56 -109 36 132 -15 -98 103 29 -81 -42 -58 13 97 -63 -127 -19 1 -94 -63 45 -8 -38 -66
8153 -66 62 -121 -54 -62 -68 40 49 20 -69 80 -51 -32 85 -56 -40 -35 52 4 29 109 -8 -39 0 29 -26 113 90 -40
8181 -40 -26 120 71 -41 -6 140 -48 65 68 55
8191E5
$$ Imaginary data points
##PAGE= N=2
##DATA TABLE= (X++(I..I)), XYDATA
0 0 0 0 0 0 0 0 0 0 0 0 -8 8 -8 8 -16 16 -19 24 -32 35 -42 51 -65 73 -84 99 -116 136 -155 179 -204 230 -263
33 -263 296 -335 376 -424 475 -532 591 -660 733 -812 898 -995 1098 -1211 1337 -1472 1621
50 1621 -1785 1967 -2171 2395 -2646 2930 -3254 3627 -4060 4572 -5186 5946 -6903 8157 -9873
65 -9873 12377 -16376 23764 -41834 175463 92704 -351996 80883 232970 -124370 -115982 120765
77 120765 -27711 -12118 88612 -114081 -83782 235952 -12701 -288246 117913 258887
87 258887 -214131 -158579 234184 42354 -182314 47354 64471 -67388 61584 17663 -151268
98 -151268 92178 176150 -198143 -125533 270083 30830 -268513 67101 204988 -118869
108 -118869 -97643 105739 -4036 -34276 57312 -72818 -50428 163025 -15691 -208614 102063
119 102063 186422 -176736 -118502 197423 28782 -159752 40819 79120 -59932 15388 26450
130 26450 -83092 47527 105906 -122851 -72294 176996 11277 -179674 54917 137495 -92841
141 -92841 -67968 86973 156 -40838 37015 -29022 -36524 87780 -5729 -121826 60259
152 60259 112457 -108958 -72301 126402 16746 -108847 27584 62478 -42062 -4909 26659
163 26659 -36628 17131 53885 -62744 -36857 97035 2065 -101151 38507 79582 -62685
174 -62685 -40548 60685 -681 -36536 23537 -3990 -25659 38833 2821 -61027 26968 57076
186 57076 -56134 -36848 68029 7851 -59729 17240 37145 -26115 -6731 20018 -14531 2486
198 2486 25556 -24344 -16963 43032 688 -46685 19077 37201 -32028 -19077 32500 -1029
210 -1029 -23457 11678 4024 -15343 11018 5193 -22818 7365 22343 -20856 -14869 26919 2382
223 2382 -24516 9071 16407 -12572 -2871 11753 -5510 -1960 11315 -6431 -7720 15054 1906
236 1906 -16747 6341 13479 -12491 -7616 12376 -674 -10443 3985 3044 -6664 1049 2707 -6185
250 -6185 321 5495 -4956 -3508 7098 315 -5979 3541 4523 -3805 261 4771 -1246 -1176 3787
265 3787 70 -2491 2691 1557 -3080 190 2574 -1921 -2240 1321 -447 -2369 -145 72 -1521 -669
281 -669 -88 -878 -343 242 -530 -254 773 369 -8 1014 993 290 531 1138 667 296 626 762 159 -90
301 -90 327 347 -382 -580 -223 -395 -993 -755 -427 -929 -1025 -430 -371 -640 -592 -34 34 -140 224 583 265 311 838
324 838 667 396 933 841 253 608 918 15 -26 669 -41 -751 221 -222 -1363 -151 128 -1843 -1150 765
344 765 -901 -2092 464 689 -1476 -379 1189 -407 -402 1147 101 131 2014 239 -1014 2239 2050
361 2050 -1788 -56 3185 -376 -2172 1497 942 -1792 -360 144 -1650 -15 505 -2672 -1182 2331
377 2331 -1399 -3766 1574 2151 -2953 -1475 2616 684 -1004 521 466 836 1997 -868 -1366 3600
393 3600 2381 -3714 -451 4999 -171 -4219 1146 2946 -1522 -2439 115 418 131 -1362 -2730 535
409 535 2540 -2494 -3813 2431 2935 -3153 -2498 3103 2150 -1805 -1322 1769 2659 169 -2065 426 3939
426 3939 689 -3522 124 4308 289 -4254 -527 3887 240 -4399 -1316 3473 459 -4430 -1730
441 -1730 3041 754 -3616 -1839 2313 1957 -1872 -2711 1892 4118 -1378 -4062 2873 5086 -2556 -3273
457 -3273 3843 3180 -2198 -1147 1338 1115 935 -1656 -2885 2602 3144 -5376 -3673 5665 920 -7203
473 -7203 -249 5043 -2147 -3455 1655 253 -335 1784 -2077 -1758 5711 1095 -6510 2458 7474 -3943
489 -3943 -4361 6269 1997 -4683 1951 2162 -2983 1925 2118 -5794 227 6720 -5043 -6626 7048
504 7048 2167 -8832 819 5922 -4822 -2407 4773 -2756 -2499 6157 -1711 -6279 6916 4548 -8782
519 -8782 802 9661 -4207 -5163 7391 892 -5659 4506 1838 -6767 3610 5340 -8715 -1787
533 -1787 9829 -4130 -9221 7100 3640 -9266 800 5808 -5442 -927 5881 -4981 -2993
546 -2993 9179 -1838 -9215 8127 6916 -10252 -532 10772 -3574 -5848 6874 464 -5236
559 -5236 5413 903 -7966 5047 6319 -10500 -2591 11637 -3891 -10544 7116 4699 -8920
572 -8920 317 5384 -4900 -169 5342 -5612 -2248 9871 -2416 -9499 8363 7386 -10368 -1196
586 -1196 10824 -2740 -6025 5770 1014 -4414 4356 341 -6791 4714 5290 -9771 -2197 10704
600 10704 -3596 -10010 6361 4741 -8112 -456 5009 -3486 -774 4035 -4354 -1480 8225 -2298
614 -2298 -7858 7521 6152 -9186 -950 9609 -2183 -5697 4885 1671 -3841 2529 614 -4702
628 -4702 3303 3671 -7541 -1409 8041 -3111 -7659 4973 3726 -6432 -707 4262 -2284 -1239
642 -1239 2840 -2315 -1014 5146 -1265 -5005 5153 4278 -6052 -559 6634 -1236 -4244 3291 1852
657 1852 -2652 954 726 -2652 1433 1752 -4455 -884 4590 -2233 -4857 3246 2356 -4444 -737 3215
673 3215 -1325 -1348 1796 -516 -764 2551 -140 -2227 2708 2445 -2841 -24 3682 -651 -2347 1725
689 1725 1117 -1627 75 570 -1287 168 620 -2134 -729 1750 -1270 -2410 1313 1068 -2110 -557
705 -557 1680 -381 -903 963 489 -279 921 348 -332 1021 974 -682 145 1288 -193 -770 798 244
723 244 -765 -87 110 -623 -419 -43 -876 -680 111 -410 -918 -81 70 -656 -309 440 213 -217 307 406
743 406 155 313 479 463 597 361 183 438 243 152 6 226 -38 -357 -116 -160 -338 -527 -322 -272 -648 -449
765 -449 -262 -365 -427 -108 68 -159 -66 116 305 118 361 406 351 265 499 561 288 218 386 290 91 44 25 -94
789 -94 -517 -267 -178 -393 -547 -257 -227 -516 -462 -222 -222 -306 -146 161 65 -68 271 262 284 135 189 441 387 335 298
814 298 525 292 92 172 194 -144 -202 42 -178 -377 -197 -305 -649 -428 20 -467 -614 51 11 -509 -123 285
836 285 36 -44 391 284 128 575 216 137 844 623 -374 302 987 -317 -743 759 256 -963 -138 263
856 263 -551 -428 145 -799 -593 464 -676 -1392 747 607 -1557 -225 1601 -223 -911 1165 600 -497
874 -497 798 646 -783 1060 1371 -1339 -241 2404 -529 -2181 1443 1416 -2278 -472 1407 -1080
890 -1080 -1083 818 -924 -1273 1594 -483 -2675 1513 1909 -2932 -727 3364 -685 -2481 2113 1326 -1735
907 -1735 1099 1551 -1838 745 2599 -2207 -1325 4001 -345 -4006 2197 2645 -3558 -1025 3044 -1501
923 -1501 -1935 1932 -888 -2425 2453 168 -4106 1740 3611 -3921 -1852 5020 -477 -3887 2892
938 2892 2326 -3037 1180 2583 -2863 379 4104 -2701 -2668 5180 289 -5597 2347 4057 -4465 -1625
954 -1625 4109 -1866 -2884 3133 -903 -3579 3419 1312 -5678 1469 5299 -4371 -3111 6023 370
969 370 -5000 2910 2935 -3553 1081 3490 -3352 -112 5095 -2764 -4061 5588 1403 -6717 1562 5193
985 5193 -4466 -2584 4270 -1472 -3210 3396 -629 -4314 3616 2238 -6357 728 6558 -3868 -4333
1000 -4333 5951 1564 -5213 2168 3385 -3237 776 3442 -3526 -431 5578 -2570 -4910 5645
1014 5645 2607 -7031 421 5708 -3411 -3517 3713 -494 -3021 2456 -460 -3985 3330 2471 -5940
1029 -5940 -7 6645 -2756 -5086 4974 2942 -4552 532 3572 -1875 -16 2522 -2466 -432 4680
1044 4680 -1993 -4599 4559 3043 -6006 -842 5401 -1892 -4002 2332 794 -2387 1080 -83 -2593
1059 -2593 2238 2074 -4530 -402 5580 -1499 -4720 3516 3399 -3625 -819 3284 -343 -710 1287 -932
1075 -932 -220 3004 -1254 -3474 2930 2720 -4396 -1536 4247 -364 -3873 928 1889 -1519 -550 230
1091 230 -848 958 1029 -2566 -328 3665 -380 -3383 2069 3244 -2028 -1520 2412 952 -1263 195
1107 195 302 2 858 -493 -1838 1198 1640 -2441 -1690 2404 401 -2961 -131 1666 -709 -1422 271
1124 271 192 81 204 -739 -133 1683 243 -1694 759 2346 -753 -1328 1572 1400 -1153 -443 955
1141 955 298 -337 -128 -423 58 536 -905 -1035 803 582 -1657 -726 1210 -106 -1498 131 797 -379
1159 -379 -289 243 23 228 392 -388 -9 1254 137 -785 803 1158 -475 -601 858 347 -719 -24
1177 -24 161 -374 -156 -151 -663 -217 373 -560 -637 381 117 -799 -5 673 -338 -332 438 272 -65 478 203
1198 203 -193 436 477 -193 188 626 3 -150 442 119 -380 -136 77 -455 -374 109 -314 -447 -40 -157 -310
1219 -310 -81 -15 -293 -21 220 -64 -10 371 325 125 340 367 98 186 382 154 145 194 126 -179 10 101 -121
1242 -121 -142 6 -312 -287 -239 -226 -321 -137 -144 -230 -114 -74 39 -22 95 111 -16 316 188 76 359 369 145 183
1266 183 426 174 -45 185 194 -69 103 -139 -218 -170 14 -323 -337 -221 -361 -422 -16 -289 -460 63 149 -423
1288 -423 -118 340 -38 -6 579 214 -297 454 344 -291 156 678 -179 -178 603 41 -383 290 156 -629 -13
1309 -13 456 -772 -546 609 -492 -942 460 309 -925 47 689 -603 -137 1014 -328 -490 1240
1326 1240 318 -1021 773 1120 -1068 -74 1483 -419 -820 1109 98 -1140 702 416 -1524 150
1342 150 1262 -1618 -957 1763 -384 -1962 1110 958 -1691 145 1476 -1081 -440 1815 -628 -1256
1358 -1256 2032 543 -2126 1127 2063 -1866 -649 2362 -464 -1583 1623 352 -1850 1221 932
1373 932 -2423 137 2118 -2158 -1862 2588 -98 -3064 1277 1770 -2472 -38 2136 -1568 -717 2645
1389 2645 -814 -1966 3021 944 -3267 1207 3062 -2516 -1289 3265 -483 -2358 2008 386 -2525
1404 -2525 1480 1281 -3348 88 3331 -2566 -2794 3503 437 -3820 1094 2355 -2531 -368 2353
1419 2353 -1618 -737 3028 -1211 -2523 3706 1503 -4207 1072 4143 -2540 -2155 3334 -89 -2564
1434 -2564 1886 398 -2719 1823 1453 -3986 126 4235 -2738 -3516 4017 1243 -4421 675 2887
1449 2887 -2238 -479 2108 -1794 -373 3334 -1610 -2896 4155 1805 -5045 748 4949 -2213 -2993
1464 -2993 3244 621 -2518 1284 241 -2196 1994 1207 -4355 454 4624 -2855 -4122 4096 1998
1479 1998 -4530 -15 3275 -1401 -936 1675 -1252 -13 3002 -1818 -2715 4325 1838 -5049 309
1494 309 5157 -1820 -3471 2670 1348 -2089 365 176 -1345 1748 517 -3947 620 4256 -2890
1509 -2890 -4062 3892 2254 -4234 -644 3250 -483 -1304 764 -371 469 1982 -1849 -1955 3784 1591
1525 1591 -4525 83 4675 -1248 -3565 1983 1977 -1854 -516 290 -505 1055 -68 -2848 755 3173
1541 3173 -2331 -3297 3110 2039 -3471 -991 2954 80 -1546 201 346 623 961 -1387 -1002 2889
1557 2889 896 -3377 258 3648 -824 -2921 1418 1929 -1428 -1147 496 195 257 -528 -1654 687
1573 687 1816 -1788 -2238 2181 1602 -2471 -940 2372 425 -1533 -96 1011 530 154 -791 -189 1787
1590 1787 349 -2016 171 2394 -467 -2094 857 1558 -1045 -1156 471 456 -281 -635 -645 408 763
1607 763 -940 -1080 1175 843 -1325 -530 1422 488 -1125 49 996 338 -253 -136 224 830 81 -874
1625 -874 148 1074 -250 -1109 424 773 -621 -756 298 300 -513 -473 90 282 -45 -428 -361 291 359 -574
1645 -574 -205 745 293 -412 47 720 141 -306 233 394 164 -14 -76 220 253 -65 -322 -75 209 -332 -602
1666 -602 65 124 -483 -313 49 -60 -222 -151 21 43 33 -29 75 204 174 -51 100 448 137 -55 251 247 51
1689 51 -25 205 -1 -130 136 -115 -70 58 -97 -289 -102 -62 -222 -170 -31 -22 -120 -12 83 -56 9 128 100 70
1713 70 230 132 104 210 148 30 132 173 1 -14 110 -100 -153 71 -162 -187 -65 0 -189 -148 -82 -81 -171 -126 2
1738 2 -147 68 118 -52 134 144 -36 62 150 102 39 123 163 -17 198 159 100 26 62 -154 -46 30 -184 -217 -61
1763 -61 -163 -351 -171 -31 -285 -169 16 -72 -204 203 178 -204 209 424 -49 -46 526 198 -195 282 340 -212
1785 -212 141 305 -331 -2 468 -290 -552 370 129 -664 -24 346 -428 -309 206 -225 -233 303 -121 -449 532
1806 532 338 -754 225 1057 -531 -551 1013 311 -559 246 502 -396 148 462 -558 -60 947 -558
1824 -558 -1099 1061 503 -1540 -3 1065 -678 -901 599 30 -571 557 3 -729 898 688 -1406
1841 -1406 161 1774 -672 -1364 1534 990 -1389 -7 1239 -513 -130 757 -657 -273 1403 -678
1857 -678 -1644 1377 1005 -2200 -474 2061 -595 -1758 980 515 -1124 418 291 -907 928 1104
1873 1104 -1836 -174 2760 -575 -2308 1740 1752 -1955 -418 1820 -452 -807 939 -502 -606 1526
1889 1526 -600 -2171 1715 1709 -2767 -874 2866 -560 -2592 1234 1364 -1503 43 785 -891 468
1905 468 1349 -1898 -443 2983 -354 -2834 1838 2502 -2284 -1061 2429 11 -1544 1105 69 -880
1921 -880 1306 -98 -2285 1307 1985 -2682 -1460 3186 -6 -3134 1016 2027 -1640 -640 1299
1936 1299 -741 -158 1612 -1278 -1035 2678 211 -3172 1396 2961 -2351 -1577 2769 299 -2144 842
1952 842 634 -1062 766 471 -2134 567 2371 -2282 -2063 2856 623 -3321 636 2389 -1502 -1054
1968 -1054 1579 -181 -546 1292 -503 -1348 2156 738 -2859 690 3046 -1709 -2227 2471 894 -2160
1984 -2160 358 1256 -1081 -12 975 -1628 -244 2046 -1348 -2244 2158 1339 -2964 -135 2732 -1039
2000 -1039 -1669 1505 380 -905 911 308 -1364 1319 1467 -2250 -220 2837 -839 -2427 1777 1330
2016 1330 -2090 -283 1463 -892 -608 958 -899 -818 1704 -500 -2221 1378 1635 -2267 -712 2391
2032 2391 -289 -1699 1165 911 -1039 443 775 -1059 565 1419 -1401 -741 2290 -144 -2342 1144
2048 1144 1578 -1741 -609 1604 -493 -1035 804 -338 -967 1037 227 -1696 600 1551 -1589 -902
2064 -902 1964 113 -1668 654 1025 -922 49 942 -678 -25 1188 -690 -926 1532 387 -1794
2080 -1794 406 1455 -1175 -888 1143 -100 -1094 470 152 -966 442 536 -1232 -10 1195 -756
2096 -756 -923 1353 426 -1245 291 1077 -601 -146 903 -230 -324 793 -96 -728 703 479 -1175
2113 -1175 78 948 -659 -753 802 50 -793 209 508 -656 -34 454 -563 -273 730 -176 -539 735
2131 735 387 -744 282 790 -348 -212 627 129 -268 487 165 -455 227 382 -613 -144 513 -288 -540
2150 -540 287 134 -513 -21 211 -401 -211 236 -246 -184 186 31 -323 315 267 -304 139 507 -18 -146 373
2171 373 97 -156 185 63 -146 -25 204 -282 -209 155 -138 -391 65 42 -301 -103 118 -197 -274 142 -64
2192 -64 -268 83 211 -127 150 270 4 34 239 -19 -80 245 183 -283 156 228 -258 21 288 -29 -202 76
2214 76 -44 -169 33 57 -308 -40 86 -176 32 131 11 -142 224 183 -190 170 364 -148 -57 289 8 -38
2236 -38 303 -11 -317 161 152 -315 -71 272 -196 -284 151 -58 -331 125 -132 -381 176 200 -447 -137 551 -156
2258 -156 -409 534 365 -424 128 474 -320 74 557 -295 -212 571 -56 -771 464 477 -726 -92 606 -398
2278 -398 -507 419 -154 -579 399 91 -806 268 557 -792 -317 1120 -131 -836 669 668 -740 173 780
2297 780 -273 59 711 -428 -367 1108 70 -1247 621 1011 -1271 -527 1231 -229 -1107 521 134
2314 134 -651 243 101 -1167 438 1041 -1319 -607 1756 -38 -1682 771 1165 -1013 -219 1045 -385
2331 -385 -121 826 -628 -559 1588 69 -1775 804 1639 -1634 -922 1718 90 -1388 434 557 -756
2348 -756 343 143 -1187 613 1378 -1584 -907 2271 262 -2209 633 1878 -1129 -830 1106 -81
2364 -81 -220 714 -546 -606 1673 -17 -2212 950 2087 -1864 -1605 1964 484 -1856 137 923 -565
2381 -565 70 70 -1010 686 1451 -1594 -1236 2549 603 -2684 551 2444 -1069 -1265 1178 470 -480
2398 -480 360 -482 -425 1542 29 -2310 822 2400 -1810 -1962 2121 897 -2055 -349 1353 -375
2414 -375 -424 89 -639 638 1250 -1409 -1185 2391 661 -2719 228 2641 -751 -1777 1113 1087 -582
2431 -582 7 -67 -269 1092 56 -2044 646 2309 -1492 -2108 1924 1320 -2169 -739 1526 25 -758
2448 -758 -7 -372 413 953 -1099 -1170 2021 817 -2463 -120 2636 -375 -1964 930 1276 -680 -471
2465 -471 231 -17 663 20 -1540 169 1820 -972 -2074 1544 1439 -1845 -1084 1675 312 -1017 -86
2482 -86 289 190 542 -603 -882 1423 862 -1811 -337 2194 -17 -1911 668 1412 -617 -857 435
2499 435 191 178 71 -755 104 1431 -514 -1746 1028 1438 -1420 -1075 1463 403 -1166 -88 654
2516 654 -12 141 -135 -537 737 798 -1182 -579 1666 163 -1489 318 1504 -547 -823 496 214
2533 214 -317 17 -362 -308 656 -170 -1200 400 1142 -1035 -1009 1165 534 -992 -70 778 -131 -103 103
2552 103 -110 158 560 -434 -421 1032 343 -1179 110 1179 -304 -797 469 364 -503 58 101 -278 272
2571 272 35 -624 76 783 -374 -752 684 355 -791 -178 738 -151 -195 272 -19 -25 344 -213 -299 454
2591 454 401 -650 4 666 -137 -548 400 264 -496 -168 180 -152 -40 72 -198 -188 429 -230 -467 490
2611 490 308 -493 -158 486 -141 -322 300 207 -183 60 96 -177 187 258 -196 -29 355 -55 -373 224 119
2632 119 -346 -124 299 -142 -207 182 -37 -176 130 67 -261 149 273 -244 -20 361 -12 -170 179 122 -244
2653 -244 118 226 0 -59 119 -8 -7 177 -106 -168 19 50 -185 -257 166 -51 -228 127 -17 -196 128 95
2675 95 -130 47 207 45 -167 184 40 -130 121 52 -101 105 234 -27 -85 256 -8 -204 84 24 -261
2696 -261 -35 -26 -189 -60 74 -191 -88 131 -146 -233 69 160 -260 -48 220 -66 -90 187 -11 -54 270 56
2718 56 -328 151 278 -251 -95 344 1 -191 238 124 -224 -46 159 -233 -88 243 -399 -136 407 -25
2738 -25 -491 220 266 -362 -145 327 -94 -117 301 -55 -113 458 -11 -458 343 488 -582 -313 607 7 -490
2759 -490 218 205 -311 92 45 -436 125 391 -527 -338 911 -23 -931 316 751 -512 -213 441 46 -154
2779 -154 368 -270 -202 676 -51 -852 454 850 -782 -585 972 106 -841 111 403 -289 -114 100 -604
2798 -604 265 684 -876 -667 1136 235 -1438 256 1194 -572 -550 680 168 -225 299 -239 -254 1004
2816 1004 -79 -1127 488 1223 -1015 -927 1219 439 -1143 -62 674 -253 -109 -17 -486 433 657 -1115
2834 -1115 -721 1410 164 -1642 292 1475 -694 -871 702 398 -417 141 -158 -140 985 -110 -1176
2851 -1176 632 1498 -1174 -1166 1481 645 -1313 -319 993 -50 -434 -128 -319 436 738 -1114 -588 1630
2869 1630 293 -1955 163 1809 -669 -1231 737 712 -488 -156 57 164 789 -292 -1245 704 1418
2886 1418 -1217 -1287 1367 838 -1548 -513 1061 7 -647 -148 -35 423 298 -1019 -545 1388 290
2903 290 -1736 248 1605 -477 -1378 846 831 -459 -398 110 332 446 -293 -962 565 1281 -1029 -1036 1325
2922 1325 798 -1355 -463 1103 109 -743 -201 351 335 2 -697 -128 1097 191 -1271 164 1346 -327
2940 -327 -1256 580 908 -515 -449 286 410 216 -297 -492 560 892 -777 -859 982 570 -1071 -445 890
2959 890 160 -645 -66 354 230 -274 -514 43 589 -52 -946 -4 1039 -285 -848 502 770 -323 -400
2978 -400 275 411 -6 -283 -150 366 336 -517 -418 657 393 -781 -313 544 13 -614 -166 329 54 -316
2998 -316 -183 224 414 -99 -525 191 492 -233 -546 201 539 -239 -351 171 283 -104 -330 17 244 105
3018 105 -328 -236 406 183 -427 -287 374 44 -299 -146 197 52 -207 -150 52 127 -57 -165 141 343 -141
3039 -141 -299 108 241 -142 -156 168 182 -127 -241 94 140 -24 -250 -65 144 -164 -260 -91 199 47 -224
3060 -224 -105 286 1 -134 -14 159 97 3 22 61 153 -32 -150 79 31 11 -110 156 136 -36 -29 50 11 -51
3084 -51 -168 0 46 -159 -103 -82 -32 52 -90 -37 71 92 -111 -70 33 144 -82 -63 91 80 14 -17 102 18 36
3109 36 -121 -48 -83 -51 -85 67 117 -10 -17 -53 -24 -65 -84 -4 35 -73 27 -99 41 56 -16 -57 66 8 -6 46 -119
3136 -119 13 -27 140 14 48 58 25 -49 76 -90 -67 -106 -69 -62 12 -142 70 -48 -90 -8 -48 18 24 32 45 33 48
3163 48 2 -72 94 103 -43 -50 16 -29 75 40 -31 3 37 -72 21 46 -38 -66 -110 24 -65 -37 -126 -16 -31 17 -96 -10
3191 -10 150 -133 -90 84 89 -54 -151 85 162 -4 -115 84 103 221 -14 -76 0 146 -69 -71 112 70 -92 -95 34
3216 34 -9 -62 -60 19 15 88 -133 3 157 -10 -230 -106 161 20 -95 -12 199 -7 106 -106 -8 172 36 -266
3240 -266 71 270 -99 -304 172 167 -172 -216 -17 112 -35 -76 -26 98 128 -142 -205 210 61 -397 -112 409
3262 409 107 -353 55 161 26 10 -104 -109 147 45 -463 86 392 -225 -432 168 354 -252 -325 87 247
3283 247 -136 -195 -81 76 212 -310 -386 256 267 -452 -201 500 268 -478 27 267 131 -159 -172 104 346
3304 346 80 -425 -65 645 -168 -695 190 557 -348 -510 138 328 -92 -178 -128 184 258 -273 -434 468 546
3325 546 -629 -389 734 217 -603 -182 458 42 -206 -185 2 406 94 -654 -147 793 -1 -952 265
3344 265 775 -483 -613 279 400 -272 -186 -96 125 443 -339 -671 566 634 -806 -524 869 323 -943
3363 -943 -82 630 65 -327 -181 -2 369 174 -598 -105 965 -188 -954 243 971 -594 -738 482
3381 482 514 -276 -141 32 90 357 -281 -554 512 638 -774 -573 1015 269 -904 -70 656 -50 -431
3400 -431 31 20 227 88 -630 -110 856 -143 -1016 304 968 -572 -655 547 363 -495 -143 312 164 178
3420 178 -255 -515 420 599 -629 -439 1061 232 -843 -14 710 -107 -407 118 198 182 20 -403 -291 682
3440 682 -116 -862 297 836 -488 -613 664 369 -502 -129 235 12 53 -139 -332 312 415 -692 -307
3459 -307 667 230 -806 78 643 -103 -484 319 157 14 133 -321 -68 358 -76 -638 213 611 -404
3478 -404 -582 484 205 -432 -77 198 -36 -85 -83 -72 127 341 -482 -261 533 105 -525 100 500 -142 -319
3499 -319 202 214 -132 23 -60 -151 193 -80 -426 197 482 -277 -278 349 216 -317 30 268 -44 -107 157 -143
3521 -143 115 122 -196 -233 370 63 -399 30 360 -117 -274 49 81 -257 -113 109 -77 71 5 -139 133 201
3543 201 -192 -166 214 121 -233 -78 170 -165 -54 36 -101 -74 25 -41 -63 175 119 -220 63 206 -138 -178 56
3566 56 57 -119 -25 -74 12 29 39 -79 -11 -33 -149 -191 127 50 -211 164 62 -51 -34 -4 -14 -8 28 92 97 -2 81 -12
3594 -12 127 109 9 21 115 108 -87 -86 25 -102 -80 6 -54 -63 -78 -12 -48 123 19 -113 10 0 41 -41 62 -8 -35
3621 -35 74 -14 10 28 81 -27 -14 91 -60 -99 120 -80 -5 186 78 -55 3 86 -56 -96 43 -3 -82 -63 16
3646 16 -16 -7 19 -47 39 -24 -108 -146 6 122 39 72 36 -50 -13 76 -81 -67 51 -55 -85 43 -11 -153 -44 58
3672 58 10 -147 205 34 53 30 -83 41 42 -60 -63 24 77 -126 -130 110 53 -57 -40 83 -60 -124 -11 -41 25 -27
3698 -27 -82 -86 106 25 -236 -112 204 -80 -106 5 -38 -13 -35 35 -8 -4 101 -8 64 195 30 -183 111 170 -124
3723 -124 -70 157 81 -152 40 2 7 -29 -67 -136 25 197 -262 -99 243 0 -217 8 287 -116 -147 -126 -111 63
3747 63 41 -125 -27 278 -99 -288 139 300 -135 -218 174 85 -124 -18 58 126 -6 -113 -58 119 238 -90 -136
3770 -136 195 34 -313 -51 260 78 -126 83 101 -8 -116 23 -27 182 87 -412 57 279 -138 -310 92
3791 92 152 -187 -178 84 88 8 -23 -86 109 114 -182 -192 137 185 -306 -20 387 41 -330 44 96 -133 -40 -7 -59 223
3817 223 224 -279 71 390 -62 -338 179 380 -259 -331 203 19 19 156 -9 -75 232 -85 -362 215 225 -299
3839 -299 -45 510 82 -306 233 125 -150 29 35 -277 49 121 -240 -131 394 -70 -393 137 536 -278 -269 290
3861 290 -13 -200 163 -27 -137 251 131 -326 63 370 -320 -488 423 73 -495 151 267 -226 -148 209
3881 209 -97 -80 248 -188 -156 410 -2 -431 49 412 -291 -331 291 8 -323 151 50 -220 -10 233 -220
3902 -220 49 332 -248 -349 368 115 -511 89 319 -203 -129 280 -163 -106 357 26 -424 173 110 -441 51
3923 51 444 -174 -246 288 148 -223 5 304 -279 83 209 -328 -168 330 -85 -365 184 215 -320 -64 385
3944 385 -74 -219 259 -4 -183 208 -15 -381 133 158 -311 -97 359 -57 -328 192 10 -325 -19 -10 -209
3965 -209 -125 245 -261 -134 294 -75 -329 179 246 -322 -88 207 -113 -174 281 -11 -91 73 187 -279 83
3986 83 225 -69 -91 189 -73 -384 170 167 -239 -16 119 -120 -131 189 -60 -137 262 105 -226 -19 164 -225
4008 -225 -141 247 -42 -209 103 102 -214 20 115 -155 48 92 -56 -127 166 27 -223 39 123 -35 -24 26 -42
4031 -42 -112 177 23 -116 56 15 -103 -123 142 -84 -41 170 -24 -169 76 121 -182 103 38 -171 24 147
4053 147 -27 -65 75 -3 -138 46 284 -67 -84 110 -12 -63 139 58 -195 133 107 -107 -54 108 -43 -164
4075 -164 215 76 -153 44 32 -167 -19 109 -15 -194 80 -32 -38 23 91 -112 -50 69 -81 -59 184 -9
4097 -9 -88 17 -57 -18 58 143 17 27 30 26 -11 70 -44 -87 126 18 -158 40 75 59 -110 22 21 -135 -105 81 -137
4124 -137 -51 -4 -37 -23 4 10 -13 65 3 -150 -17 76 -81 -25 25 -11 -92 -25 -22 -70 69 100 -128 6 -13 -32 -112 113
4152 113 97 22 -51 149 53 10 181 -71 -66 218 -55 -173 153 77 -247 -46 149 -19 -38 -39 -11 -48 78 -17 -204
4177 -204 90 55 -218 78 161 -77 -114 58 39 -121 -37 105 -58 83 58 -122 -16 57 -132 -220 262 202 -189
4200 -189 -36 225 -56 -224 39 -31 -154 60 15 -90 151 112 -175 -32 304 -60 -248 47 139 -106 -32 102
4222 102 -73 -45 -13 -37 -55 286 -2 -334 203 199 -262 -25 151 -58 -98 83 83 -15 27 -41 -100 213 155 -321 -109
4247 -109 353 12 -260 248 288 -175 -145 199 55 -68 68 -74 42 269 -65 -286 175 346 -331 -245 235
4268 235 -5 -249 -35 108 -148 68 -109 -249 168 112 -200 -57 413 106 -326 186 277 -96 -183 298 -6
4289 -6 -43 57 -149 53 317 -30 -363 257 326 -236 -229 242 99 -305 -79 106 -135 -86 -15 -139 148 121 -271
4312 -271 -18 411 -57 -378 87 319 -182 -259 170 89 -40 49 -56 45 257 -109 -287 208 348 -244 -239 381
4334 381 81 -393 -58 239 -58 -56 -47 -45 -12 -60 -269 -80 297 69 -386 84 292 -250 -208 225 151 -218 -160 -18
4358 -18 62 122 27 -252 237 242 -220 -153 376 218 -423 -16 364 84 -185 59 3 -49 19 -182 -44 269 -4
4381 -4 -376 169 264 -251 -260 147 199 -148 -89 87 -86 118 -74 -243 59 148 -200 -207 327 107 -425 -43 358
4404 358 -51 -217 19 11 44 82 -47 -133 286 -68 -272 38 240 -127 -414 218 207 -298 -16 108 -24 56
4426 56 -101 -47 -1 169 -209 -181 211 -6 -352 21 269 -19 -181 -50 63 -124 -12 -61 -8 179 150 -163
4448 -163 60 200 -105 -171 154 102 -202 -159 130 26 -49 -21 -80 73 126 -81 -86 112 104 -209 -26 195 -105 -133
4472 -133 97 172 -25 -130 -95 71 -2 18 -41 46 142 11 -173 46 84 -76 -85 168 49 -110 -64 -29 -35 78 -11
4497 -11 -21 122 123 -191 -28 134 18 -100 13 124 -57 89 14 50 -119 79 -69 13 48 -70 -107 33 191
4520 191 -218 -17 99 45 -58 41 60 -25 -20 59 52 72 -84 43 -25 103 11 22 92 86 -107 -19 101 -36 -59 57
4546 57 129 108 60 34 41 93 -42 -82 -4 63 7 -105 60 55 25 42 -25 -36 30 176 -12 18 -117 81 -2 65 5 -1
4574 -1 -46 -24 16 29 112 6 -172 -46 -25 56 59 50 -73 -42 58 -46 45 22 -10 -21 129 101 -14 -68 11 93 -57
4601 -57 3 64 -34 62 -39 -26 -51 65 -17 -68 156 26 -91 25 -49 83 -152 76 74 27 5 -52 -19 -12 -42 -28 -17
4628 -17 138 -73 -152 48 64 -22 -71 93 12 -15 -32 -39 118 114 -195 -32 150 36 -105 -150 158 -124 -150 39 34
4653 34 -32 -107 14 -46 151 -87 -132 -90 121 26 -174 38 79 -42 10 133 -17 -53 -22 113 120 130 -96 -139 234
4678 234 118 -163 -157 117 93 -149 -87 31 -86 -74 -56 -38 -3 69 -121 82 103 -23 -182 43 279 -70 -186
4701 -186 90 82 -49 3 27 167 -33 -52 17 203 142 -136 -78 246 16 -309 17 84 -7 -197 58 11 32 33 -105
4726 -105 -51 187 -22 -181 107 132 -192 -232 122 196 -30 -68 145 26 -9 -140 -147 62 176 -191 -117 279 87
4749 87 -266 -22 208 76 -156 17 62 1 97 -156 -53 148 59 -245 68 486 -107 -312 132 136 -112 -130 134
4772 134 77 57 -126 -165 134 169 -182 -153 313 72 -325 -122 245 -41 -191 -4 66 -41 49 -112 -38 163 9
4795 9 -276 121 412 -79 -281 374 216 -219 -81 208 -1 -37 10 -179 25 169 -202 -217 278 239 -401 -142
4817 -142 303 34 -273 -14 134 -28 -36 -102 -123 182 61 -319 27 291 -134 -326 199 225 -178 -150 102 -23
4839 -23 -46 -57 -127 -16 229 -213 -274 227 220 -322 -25 342 -86 -320 23 139 -116 43 29 41 170 110 -274
4862 -274 89 372 -159 -355 187 336 -190 -218 79 7 -3 62 -100 93 234 -84 -222 137 135 -358 -45 315
4884 315 17 -336 40 239 -29 -72 73 34 89 23 -142 110 229 1 -118 23 234 -76 -160 74 16 -77
4906 -77 -152 -61 54 49 -179 -135 144 27 -263 -37 258 122 -74 6 93 -53 -89 85 -6 99 104 -94 -10 147
4930 147 -61 -179 156 339 -20 -118 130 43 -45 -4 87 82 -19 -112 -154 125 120 -157 -204 144 1 -183 7 86
4954 86 107 -79 -60 21 -4 -78 -70 1 165 -69 -175 44 220 -82 -45 176 94 -145 -7 107 2 28 -37 -61 -82
4979 -82 154 -33 -16 36 -29 -126 -4 95 -7 -80 24 -37 111 4 -86 -2 35 26 -99 0 73 -73 -129 152 144 -36
5005 -36 -10 -9 121 -87 18 -48 -36 121 -58 -58 122 -38 -67 -48 76 -83 -98 -2 135 -95 -21 66 47 9 78 89
5031 89 26 -11 -95 15 -19 -68 -82 3 -125 -143 -20 79 23 -45 -65 -24 -46 52 -83 -51 44 -71 -142 33 63 -33 -5
5058 -5 64 51 -39 4 128 4 -1 27 -66 41 44 -67 -15 3 -14 -184 -146 36 -70 -95 -79 -4 96 -130 80 27 41
5085 41 30 -38 -62 143 -44 -109 125 43 -14 43 126 -16 -53 87 49 38 1 -31 -7 41 -2 -133 -47 44 -81 -204
5111 -204 88 131 24 -127 -152 -13 95 -106 -187 27 73 -32 -93 33 80 -78 -80 53 59 -141 -151 55 137 -113
5135 -113 -206 7 121 21 -188 17 149 12 -132 73 254 -11 -84 3 107 25 -286 -17 29 148 -206 -104
5157 -104 141 28 -118 -5 33 59 -161 -9 7 96 -96 -50 54 23 -104 -231 -58 121 -146 -161 34 197
5179 197 -71 -146 55 43 -45 -183 -16 120 109 -149 -65 295 25 -177 -66 150 151 -194 -104 140 111 -86 -131
5202 -131 -10 55 -188 -271 -4 116 -167 -212 45 198 -120 -285 92 25 26 -206 -107 140 59 -194 41 203 -5
5225 -5 -183 29 275 92 -138 -111 227 122 -144 -109 101 192 -134 -163 174 163 -144 -291 46 208 -34 -268
5247 -268 142 171 -166 -237 17 212 -77 -257 -62 161 -60 -271 -49 269 59 -309 -77 191 13 -107 -16
5268 -16 173 244 -140 -161 124 123 -76 -231 125 209 -86 -139 69 264 -42 -198 209 58 -68 -220 -46 199
5290 199 -118 -351 -91 308 23 -267 -62 179 14 -232 -93 3 144 -96 -193 72 245 -117 -107 100 254
5311 254 -104 -155 82 105 6 -164 126 106 -65 -222 73 259 -2 -182 23 227 101 -203 54 237 26
5332 26 -124 -95 154 22 -155 -98 195 -15 -110 -54 137 192 -75 -89 159 268 -133 -231 87 167 -75 -80 -42 180
5356 180 24 -113 -5 89 57 -92 52 203 -83 -231 -28 207 79 -78 -80 -5 126 -112 -156 95 172 -75
5378 -75 -212 215 214 -136 -45 162 193 -23 -98 34 58 -8 -125 -34 69 82 -121 44 73 -18 -145 -79 178 63
5402 63 -158 -65 145 213 -115 31 15 97 43 -161 122 142 -96 3 94 35 27 -48 -80 22 -145 -89 40 40 -54 -169
5428 -169 -86 47 16 -212 -2 -34 -1 -102 -44 65 90 -125 -49 19 23 -11 36 148 21 -90 -166 110 107 23 -22 123
5454 123 113 -75 -15 -12 28 -118 -106 -53 -39 -54 -117 -5 10 26 -90 -52 38 -49 -113 8 -9 -24 -113 55 -37 13 -30
5481 -30 35 168 2 -85 -42 -39 -61 22 2 -27 11 -58 64 -100 -21 -3 -63 0 87 -41 -14 -73 -45 42 -2 169 -40
5508 -40 -62 -53 -21 41 -97 9 -16 -30 20 -23 42 31 15 -3 18 53 -48 -39 117 -101 -42 22 -45 -23 39 -58 97 93 -125
5537 -125 69 11 -88 73 -60 139 51 -101 -20 22 -13 -20 -69 8 5 -59 -24 -63 120 -4 -136 -84 -27 -41 -72 -127 158
5564 158 -58 -32 -14 138 70 10 -72 90 57 -81 -18 95 57 -59 -43 100 20 25 -51 -12 47 -110 -69 73 107 10
5590 10 -142 2 57 -84 -60 23 45 74 -190 -30 57 -85 -30 -92 83 -46 32 -23 90 10 -124 -85 104 120 2
5615 2 -42 60 -15 -53 -59 11 104 -2 -125 28 66 2 -37 23 111 74 -42 44 46 56 -40 92 -24 -29 -63 -216 -50 53
5643 53 -96 -102 3 -11 5 -178 106 -16 -124 10 113 156 14 -19 -36 88 -94 -77 14 84 -103 6 84 109
5667 109 45 52 83 52 -13 -86 -78 103 166 -84 -161 57 157 -147 -86 49 137 -58 -7 -73 67 -23 -84 -41 114 -22
5693 -22 -101 -15 159 -103 -153 38 132 -97 -75 -115 37 -5 -22 39 64 20 -75 -87 59 108 -122 -76 71 82 -72 -150
5719 -150 33 15 -83 -77 -91 117 -80 -245 -83 220 -104 -158 148 206 52 -76 79 161 -41 -23 92 115 158 -5
5743 -5 -103 180 102 -115 -53 209 -40 -85 151 12 40 -67 -77 -40 49 -68 -159 -8 197 -35 -146 139 115 -138
5767 -138 -136 111 27 -93 -182 24 102 34 -194 -156 58 28 -150 -98 158 21 -283 114 31 -98 -55 -29 59 151 -36
5792 -36 -98 17 113 -16 -169 11 42 -25 -62 78 157 -52 -159 -72 180 8 -149 -107 101 90 -83 -2 110 86
5816 86 -105 -28 52 113 -179 -101 29 112 -87 -178 38 182 -76 -69 -21 75 -26 20 68 72 -34 37 64 24 11 -47 33
5843 33 37 -20 -145 -147 88 78 -168 -51 49 24 -100 -79 -36 49 9 -57 8 63 8 19 -6 120 -10 -298 101 321
5869 321 -76 34 9 28 -99 -14 93 37 108 16 -126 83 64 -129 43 188 66 48 -38 47 17 -5 -124 -81
5893 -81 42 -45 103 -118 87 -69 -115 31 55 49 -61 -29 29 -72 -74 -18 -45 34 -32 -89 32 28 -48 55 142 164 -42
5920 -42 -31 116 140 -106 -108 -16 73 -82 -26 -22 74 -9 -36 90 133 -97 -60 80 -29 11 50 126 -11 14 -44 -52 34 69
5948 69 -71 -65 -30 28 55 -72 132 -91 -58 43 58 -40 -15 -99 30 54 -39 103 59 -14 -22 -80 149 96 75 -59 33
5975 33 -56 -89 -77 -4 -54 -73 -64 -76 -65 28 -19 -33 -62 -32 41 131 0 10 33 77 50 -54 45 7 -24 59 43 -10 121
6004 121 -11 -87 5 17 -1 24 17 -10 -136 -75 33 24 -32 111 -26 3 95 16 -45 10 -31 -53 69 39 -53 -93 28
6031 28 40 -125 -62 -101 50 -50 -60 -18 24 70 -58 43 26 -138 -88 -34 50 77 -228 -101 1 33 -71 43 -47
6056 -47 54 46 -43 -45 92 -57 -127 -28 91 -90 -21 49 31 -72 -117 -36 66 -2 -121 -120 13 17 5 -108 59 47 -144
6083 -144 -9 95 -54 -30 -13 110 139 -27 -64 54 111 -38 -103 164 177 6 -26 57 58 97 -50 90 210 -34
6107 -34 11 5 118 -42 -33 -44 79 -47 -108 -49 113 -104 -57 -29 104 5 -101 24 -33 62 -67 -164 167 48 -42
6132 -42 -30 20 -5 -89 15 55 91 13 -4 -17 190 -113 -62 48 79 -80 45 92 -35 23 34 5 77 21 -92 -127
6158 -127 128 33 -105 15 129 -17 -57 -3 14 24 -3 -153 -14 70 -42 -93 -3 147 6 -39 45 54 -45 -96 4
6183 4 124 -58 47 -106 -26 24 -78 12 17 49 16 -55 194 -43 -167 -7 23 -79 -139 -38 41 7 -20 -72 79
6208 79 36 -143 -74 -21 94 -108 -93 68 36 25 8 142 91 102 9 -37 102 156 -95 12 48 94 34 37 67 -21 -119
6235 -119 -17 43 29 -26 -6 -49 -22 67 -53 39 25 -36 -66 59 -7 -7 -11 21 52 53 15 -123 112 -23 -24 16 36 7 -84
6264 -84 20 78 -39 -32 -37 119 -7 22 32 85 82 -1 -98 87 -22 -12 -49 -62 156 -54 -97 43 21 -5 -43 8 28
6291 28 36 20 -84 146 -29 -129 -47 1 28 19 -14 -4 10 -15 -104 -11 -65 -48 -108 21 148 13 -101 71 173 -75
6317 -75 -54 53 72 49 -46 -8 -46 -11 -20 -68 43 -15 -6 -100 2 -41 -28 5 -83 -37 -87 -132 121 13 -47 -7 68 46 -38
6346 -38 -112 -64 83 -33 -17 -47 -16 -80 12 83 -43 47 54 59 66 70 4 -8 49 42 82 -89 -78 -46 11 -6 72 -27 -53 72
6376 72 27 -39 12 14 102 85 -30 -50 -2 -58 -5 4 4 8 -62 45 -44 33 12 88 -107 78 -81 -44 -137 23 2 -84 -26
6405 -26 -8 -27 -19 -57 -11 -3 -74 -4 -78 16 24 -11 -82 37 -51 21 -121 40 -17 -21 22 -72 -103 -3 -46 -31 -54 34 -111 85
6435 85 -27 8 24 35 5 60 41 47 64 74 81 -1 -24 -47 34 -35 121 11 -60 65 17 53 14 -47 -41 -12 -5 -109 132
6464 132 17 53 -71 -26 -84 -49 -46 -61 -20 62 -23 -61 -53 18 3 -50 121 49 -92 -3 19 -23 -62 51 15 -8 70 40
6492 40 -102 -6 -4 -18 31 27 -6 -71 -9 67 0 -35 36 -32 -21 13 28 -128 71 85 20 89 32 29 24 81 -47 -7 66 -10
6522 -10 54 70 27 -32 -3 -84 64 -5 45 61 -106 -32 64 36 -60 75 78 -152 66 30 -86 -16 57 -38 47 11 -19 16
6550 16 35 46 -95 -13 14 -48 -37 42 -23 -26 100 21 -31 62 -41 -26 -4 43 -44 -21 57 48 -71 -24 58 63 -67 38 -5
6579 -5 19 92 29 -73 -29 62 -50 242 -61 -2 -12 206 33 -156 -31 22 -45 117 -36 -109 -18 23 -7 -56 -21 46
6605 46 -85 -25 12 41 -53 21 43 -19 -73 -71 19 71 57 -129 25 172 -88 -19 9 121 -137 40 28 -93 1 109
6631 109 47 -103 0 -29 95 6 -95 -146 -108 30 -62 65 65 102 -84 -46 -5 76 -11 83 -11 14 54 -91 73 86
6657 86 43 -87 37 49 -56 6 10 -31 -12 -56 -72 -55 53 72 25 23 24 -92 -106 -37 104 -44 -89 -21 -27 14 -133 -55
6685 -55 -20 63 -7 100 70 95 -75 -14 73 27 3 -15 66 -13 -50 -51 96 119 -86 27 120 273 -73 -93 70 195
6711 195 -18 -6 128 25 34 -62 20 -19 -10 -160 -39 58 -11 -191 -49 66 -1 -5 44 112 -1 -90 -16 14 28 -19 23
6738 23 116 63 -39 16 56 150 -118 -78 70 -21 61 -79 -88 135 42 -88 69 -16 -43 -112 104 132 8 -158 -25
6763 -25 172 -113 -26 41 72 -26 -134 97 34 101 -103 -98 138 235 -79 45 44 -38 24 -9 81 4 27 -27 -10 7 58
6790 58 -168 -59 102 -27 3 38 1 -37 -128 77 29 -3 -75 -110 16 63 23 -35 37 131 -108 -53 73 -11 -60 -118
6816 -118 45 -24 50 -112 -26 104 -33 -129 -68 -5 21 -1 -5 96 -46 7 95 63 -8 -4 -53 -24 45 -60 -60 175 -19
6843 -19 23 -132 16 87 -101 25 121 -27 -58 -38 -89 145 -57 -27 -50 97 132 -65 42 29 -49 3 79 -57 20
6868 20 -18 23 53 43 36 38 140 62 -34 -107 3 -30 -55 26 43 29 -83 -19 -4 -3 25 21 -70 43 123 -116 -81 26 -15
6897 -15 4 -30 127 -18 3 0 -137 -48 -65 70 -131 123 90 -103 4 35 -27 28 56 -17 -17 -22 -53 -115 -71 31 -90
6924 -90 68 23 -88 51 80 20 74 -4 -13 -32 53 -8 -36 1 -24 92 2 -4 112 -31 -9 53 -79 31 -8 32 -46
6951 -46 49 41 -16 55 114 -115 15 77 30 -62 62 17 -74 136 38 -68 -7 91 -97 -1 208 38 -58 12 161 32
6977 32 34 11 13 -39 21 -78 -44 78 6 -186 -19 49 -51 -24 57 36 -77 -65 -87 55 -26 38 41 37 34 -97 -60 169 -42
7006 -42 -93 49 13 57 56 164 34 -135 -14 -30 -6 74 -24 -89 -106 91 -32 -24 90 79 -10 23 102 -40 24 -20 18
7033 18 -70 -16 -117 36 68 -158 -70 68 84 -54 20 16 -14 43 2 -40 -49 65 -1 55 123 20 -173 -70 85 59
7059 59 -41 26 -39 -1 24 -32 129 33 63 -93 -72 -60 -11 -117 93 -33 2 50 30 27 -58 76 -26 -28 -18 -64 -70 -27
7087 -27 -10 -26 -34 101 32 -45 -27 68 -10 -18 11 83 -22 5 -68 49 131 -142 -101 17 -30 -64 85 18 12 -31 -78 -42 -9
7116 -9 -37 31 -20 -44 40 -45 -73 26 34 59 92 111 66 121 -14 -35 28 -69 -221 46 5 20 -91 39 3 -159 14 16
7144 16 2 -83 2 -3 7 -44 -74 38 -7 -22 31 90 51 89 -52 27 12 -63 4 -48 -59 99 -25 -27 30 117 -55 2 -115
7173 -115 25 -22 -58 -89 76 2 -183 17 2 -34 -63 -1 21 -4 -35 61 3 -75 -64 7 30 -1 -76 -68 -1 20 -63 -119
7201 -119 65 123 -3 -105 -63 82 -1 -26 10 31 -9 -187 21 47 -59 -101 5 41 -12 -35 -15 142 144 4 -38
7226 -38 12 -24 -70 -92 77 42 40 -150 28 -36 39 -66 11 109 -133 -183 65 50 -185 -207 -38 -104 -44 -15 -22 147 52
7253 52 -94 23 70 -14 -48 -156 144 128 -21 14 57 73 39 -41 25 159 -66 -141 15 40 -7 -68 -12 57 -31 -58
7279 -58 -97 21 34 56 24 -77 -17 36 -24 45 4 -7 -95 66 -32 -92 73 108 31 34 -91 90 42 -14 -54 -34 -40 44
7307 44 -24 25 59 -13 -73 -48 61 23 -5 -28 52 -34 1 -16 62 79 26 -99 82 41 73 43 -5 -23 -64 -48 41 164
7335 164 -10 -115 -16 -26 6 53 -39 -70 35 -15 -68 131 36 -36 4 122 62 -44 35 -55 81 -73 10 -10 48 -41
7361 -41 28 55 -60 75 -68 -12 -81 -14 15 -20 34 43 -96 -78 99 -38 -53 -10 -30 107 90 14 50 -88 0 27 4
7388 4 6 45 -9 46 85 -33 -45 25 61 -15 -19 -20 -79 5 15 53 90 106 -49 3 -88 -99 -4 -5 73 -117 -84 1 10 -70 74
7419 74 139 29 35 46 66 43 8 116 42 58 24 84 100 7 -35 -66 35 63 -115 2 150 -23 -44 9 65 -116 2
7446 2 -7 -102 0 66 -22 19 12 -97 28 11 49 -54 -20 64 -189 -18 29 22 -38 -65 -49 -95 -13 30 -43 -57 137 8
7474 8 -73 87 112 32 65 -40 7 61 -123 -57 9 51 -59 65 -65 136 -19 -7 90 -7 -26 -76 -14 -34 -1 -185
7500 -185 -155 61 -98 -82 5 139 -44 -138 95 -101 -73 -35 -111 31 77 -86 -117 64 99 -69 42 162 -59
7523 -59 -22 3 172 -57 -54 -52 -27 3 -13 -151 17 76 -48 -54 105 66 -20 34 67 112 -101 -70 108 152 22 -137 -22
7550 -22 51 -37 -72 20 62 -63 -96 43 5 -73 -106 -3 144 35 -96 -139 95 49 -20 -67 138 2 -111 -61 128
7575 128 79 -42 -69 129 139 -64 -10 3 88 16 -128 -74 129 -64 -83 6 114 4 -34 -17 59 -167 -37 128
7599 128 74 104 67 -33 75 123 -62 -50 123 113 -72 -32 114 -21 -96 -99 -101 -45 -126 -6 -12 -15 46 -131 144 -12
7625 -12 -48 -121 36 190 -29 -194 21 -140 -77 40 -62 49 72 -191 25 130 31 -127 -20 73 36 -51 -4
7648 -4 43 9 -51 -95 -6 -17 25 -168 159 79 -51 -133 36 36 -193 -106 70 -31 -26 -50 -50 -44 19 -130 -25 113 69 -138
7676 -138 -45 154 -33 -80 3 106 76 -46 -87 -28 -65 -32 -93 30 60 -53 -75 132 67 -47 -108 32 4 -25 52
7701 52 38 118 52 -43 -16 109 1 -32 -55 17 -54 -84 20 170 -8 -96 -31 3 66 -35 -16 8 211 -94 -29 17
7727 17 72 -74 -29 19 53 -5 74 39 101 67 -90 -56 22 72 -28 -4 102 23 -77 -14 11 -34 -8 -79 -151 -37 -88
7754 -88 -98 -106 -28 -40 -125 -2 88 -176 24 43 -1 31 114 83 32 -40 -91 -62 116 95 -27 18 78 5 23 72 -15 -53
7782 -53 -6 -33 24 19 43 -50 98 28 -42 -152 75 -7 -55 -62 15 -40 -42 74 -64 -47 -105 -47 -39 -11 13 -68 110 55 66
7811 66 9 60 124 17 -58 -59 41 -56 16 212 -44 -10 56 -62 -44 30 -48 -53 24 12 -12 4 -64 -119 -69 70 50 137
7839 137 29 52 -59 42 90 -86 25 34 -31 27 -53 -95 72 -36 -85 -60 -26 35 -13 -29 96 75 38 42 -23 37 -18
7866 -18 49 46 -45 64 74 -23 15 -60 26 20 -30 18 39 -1 -41 -33 9 -20 -45 19 -101 9 2 28 -68 -2 129 5 63 0
7896 0 55 37 29 46 -36 -67 -16 7 -4 -19 90 13 -33 -72 -52 131 122 -19 86 50 -57 -58 -7 122 -10 37 97 -67
7924 -67 -157 56 -34 41 71 82 -76 8 122 -22 -19 -27 -28 -82 -40 -146 -110 94 19 22 50 -70 -42 73 85 27 -59 -20
7952 -20 -23 -143 14 72 177 -8 127 21 35 127 -62 -88 -13 -5 -3 -13 4 4 -54 20 76 -35 38 36 -26 -2 -12 -5 -21
7981 -21 2 18 5 8 -14 -26 -176 -100 -13 67 -3 -69 -34 63 20 17 41 76 22 -73 7 11 -41 -25 -39 47 50 -78 65 22 -185
8012 -185 -92 5 -56 -76 52 4 -91 -64 -133 -153 -52 -129 -29 -64 138 -125 12 16 -75 34 48 54 57 90 9 57 146 51
8040 51 -86 -17 81 -53 -75 58 41 -45 -81 -106 -5 37 -121 -46 38 -9 -149 -108 -23 -65 14 39 76 -2 -126 19
8066 19 6 3 -103 -20 58 11 -73 -142 -51 151 15 -115 33 55 -23 -39 9 112 -4 -41 48 27 -14 -93 -9 17 60
8093 60 -39 -80 -52 137 -82 -49 93 42 -103 -78 36 -70 27 -52 111 55 55 50 -161 32 69 21 51 51 82 -124 -91
8120 -91 136 -44 -12 -72 -75 -21 27 14 153 39 -24 -86 97 20 -61 -13 -7 17 -3 -125 -49 -85 -67 -32 -74 87 -101
8147 -101 -31 -16 0 61 -62 52 -107 4 10 46 19 47 2 -32 71 46 -125 5 64 15 65 -42 -95 -41 -29 79
8173 79 41 38 -103 -118 20 49 -31 -134 80 81 -54 -97 47 10 -38 -118 -36 -44
8191d4
##END NTUPLES=NMR FID
##END=
