##TITLE=1H_AM-NV37.1
 
 8 sc, 
 14.4.2023
##JCAMPDX= 6.0         $$ Bruker NMR JCAMP-DX V2.0
##DATA TYPE= NMR FID
##DATA CLASS= NTUPLES
##ORIGIN= UXNMR, Bruker Analytische Messtechnik GmbH
##OWNER= root
$$ XWIN-NMR		Version 3.5
$$ Fri Apr 14 16:24:45 2023 Russian Standard Time (UT+4h)  she@DPX200
##.OBSERVE FREQUENCY= 200.13135
##.OBSERVE NUCLEUS= ^1H
##.DELAY= (6, 6)
##.ACQUISITION MODE= SIMULTANEOUS
##.ACQUISITION SCHEME= undefined
##.AVERAGES= 8
##.DIGITISER RES= 18
##SPECTROMETER/DATA SYSTEM= spect
##.PULSE SEQUENCE= zg30
##.SOLVENT NAME= CDCl3
##.SHIFT REFERENCE= (INTERNAL, CDCl3, 0, 15.7039)
##AUDIT TRAIL= $$ (NUMBER, WHEN, WHO, WHERE, WHAT)
$$ ##TITLE= Audit trail, XWIN-NMR		Version 3.5
$$ ##JCAMPDX= 5.01
$$ ##ORIGIN= Bruker BioSpin GmbH
$$ ##OWNER= she
$$ F:/spectra/data/she/nmr/H-F/1/audita.txt
$$ ##AUDIT TRAIL=  $$ (NUMBER, WHEN, WHO, WHERE, WHAT)
(   1,<2023-04-14 16:23:12.53 +0400>,<she>,<DPX200>,
      <created by zg, POWCHK disabled, PULCHK disabled
       configuration hash MD5:
       00 E9 B6 7A A2 85 ED C7 34 08 36 98 17 FE 4E 26
       data hash MD5: 16K
       E6 77 C1 B4 79 E1 58 F8 42 8F FD E3 88 E6 22 DE>)
$$ ##END=
$$ 
$$ hash MD5
$$ A5 34 E2 A8 C5 5F F1 4B A6 5C 4C 4B 84 5B B9 2B
##$RELAX= 
##$RELAX= 
##$RELAX= 
##$RELAX= 
##$RELAX= 
##$RELAX= 
$$ Bruker specific parameters
$$ --------------------------
##$DU= <F:/spectra>
##$EXPNO= 1
##$NAME= <H-F>
##$PROCNO= 1
##$TYPE= <nmr>
##$USER= <she>
##$AMP= (0..31)
100 100 100 100 100 100 100 100 100 100 100 100 100 100 100 100 100 100 
100 100 100 100 100 100 100 100 100 100 100 100 100 100 
##$AQSEQ= 0
##$AQ_mod= 1
##$AUNM= <au_zg>
##$AUTOPOS= <>
##$BF1= 200.13
##$BF2= 200.13
##$BF3= 200.13
##$BF4= 200.13
##$BF5= 200.13
##$BF6= 200.13
##$BF7= 200.13
##$BF8= 200.13
##$BYTORDA= 1
##$CFDGTYP= 0
##$CFRGTYP= 5
##$CHEMSTR= <none>
##$CNST= (0..31)
1 1 145 1 1 1 1 1 1 1 1 1 1 1 1 1 1 1 1 1 1 1 1 1 1 1 1 1 1 1 1 1 
##$CPDPRG= <>
##$CPDPRG1= <>
##$CPDPRG2= <>
##$CPDPRG3= <>
##$CPDPRG4= <mlev>
##$CPDPRG5= <mlev>
##$CPDPRG6= <mlev>
##$CPDPRG7= <mlev>
##$CPDPRG8= <mlev>
##$CPDPRGB= <>
##$CPDPRGT= <>
##$D= (0..31)
0 1.2 0 0 0 0 0 0 0 0.06 0 0.03 0 0 0 0 0.0002 0 0 0 0 0 0 0 0 0 0 0 0 
0 0 0 
##$DATE= 1681474991
##$DBL= (0..7)
120 120 120 120 120 120 120 120 
##$DBP= (0..7)
150 150 150 150 150 150 150 150 
##$DBP07= 0
##$DBPNAM0= <>
##$DBPNAM1= <>
##$DBPNAM2= <>
##$DBPNAM3= <>
##$DBPNAM4= <>
##$DBPNAM5= <>
##$DBPNAM6= <>
##$DBPNAM7= <>
##$DBPOAL= (0..7)
0.5 0.5 0.5 0.5 0.5 0.5 0.5 0.5 
##$DBPOFFS= (0..7)
0 0 0 0 0 0 0 0 
##$DE= 6
##$DECBNUC= <off>
##$DECIM= 32
##$DECNUC= <off>
##$DECSTAT= 4
##$DIGMOD= 1
##$DIGTYP= 9
##$DL= (0..7)
0 120 120 120 120 120 120 120 
##$DP= (0..7)
150 150 150 150 150 150 150 150 
##$DP07= 0
##$DPNAME0= <>
##$DPNAME1= <>
##$DPNAME2= <>
##$DPNAME3= <>
##$DPNAME4= <>
##$DPNAME5= <>
##$DPNAME6= <>
##$DPNAME7= <>
##$DPOAL= (0..7)
0.5 0.5 0.5 0.5 0.5 0.5 0.5 0.5 
##$DPOFFS= (0..7)
0 0 0 0 0 0 0 0 
##$DQDMODE= 0
##$DR= 18
##$DS= 0
##$DSLIST= <SSSSSSSSSSSSSSS>
$$ [...]
##$SUBNAM2= <"">
##$SUBNAM3= <"">
##$SUBNAM4= <"">
##$SUBNAM5= <"">
##$SUBNAM6= <"">
##$SUBNAM7= <"">
##$SUBNAM8= <"">
##$SUBNAM9= <"">
##$SW= 18.05172834244
##$SWIBOX= (0..15)
0 0 2 0 0 0 0 0 0 0 0 0 0 0 0 0 
##$SW_h= 3612.71676300578
##$TD= 16384
##$TD0= 1
##$TE= 0
##$TE2= 300
##$TE3= 300
##$TEG= 300
##$TL= (0..7)
0 120 120 120 120 120 120 120 
##$TP= (0..7)
150 150 150 150 150 150 150 150 
##$TP07= 0
##$TPNAME0= <>
##$TPNAME1= <>
##$TPNAME2= <>
##$TPNAME3= <>
##$TPNAME4= <>
##$TPNAME5= <>
##$TPNAME6= <>
##$TPNAME7= <>
##$TPOAL= (0..7)
0.5 0.5 0.5 0.5 0.5 0.5 0.5 0.5 
##$TPOFFS= (0..7)
0 0 0 0 0 0 0 0 
##$TUNHIN= 0
##$TUNHOUT= 0
##$TUNXOUT= 0
##$USERA1= <user>
##$USERA2= <user>
##$USERA3= <user>
##$USERA4= <user>
##$USERA5= <user>
##$V9= 5
##$VALIST= <valist>
##$VCLIST= <CCCCCCCCCCCCCCC>
##$VD= 0
##$VDLIST= <DDDDDDDDDDDDDDD>
##$VPLIST= <PPPPPPPPPPPPPPP>
##$VTLIST= <TTTTTTTTTTTTTTT>
##$WBST= 1024
##$WBSW= 4
##$XGAIN= (0..3)
0 0 0 0 
##$XL= 0
##$YL= 0
##$YMAX_a= 280953
##$YMIN_a= -282539
##$ZGOPTNS= <>
##$ZL1= 120
##$ZL2= 120
##$ZL3= 120
##$ZL4= 120
##$ABSF1= 10
##$ABSF2= 0
##$ABSG= 5
##$ABSL= 3
##$ALPHA= 0
##$AQORDER= 0
##$ASSFAC= 0
##$ASSFACI= 0
##$ASSFACX= 0
##$ASSWID= 0
##$AUNMP= <proc_1d>
##$AZFE= 0.1
##$AZFW= 0.1
##$BCFW= 1
##$BC_mod= 2
##$BYTORDP= 1
##$COROFFS= 0
##$CY= 11.3945322036743
##$DATMOD= 1
##$DC= 2
##$DFILT= <>
##$DTYPP= 0
##$F1P= 15.7292609196834
##$F2P= 12.9074282941183
##$FCOR= 0.5
##$FTSIZE= 0
##$FT_mod= 4
##$GAMMA= 1
##$GB= 0.15
##$INTBC= 1
##$INTSCL= 1
##$ISEN= 128
##$LB= 0.24
##$LEV0= 0
##$LPBIN= 0
##$MAXI= 10000
##$MC2= 0
##$MEAN= 0
##$ME_mod= 0
##$MI= 1.114404
##$NCOEF= 0
##$NC_proc= 0
##$NLEV= 6
##$NOISF1= 3.799351
##$NOISF2= 2.8
##$NSP= 1
##$NTH_PI= 0
##$NZP= 0
##$OFFSET= 15.70392
##$PC= 1
##$PHC0= -19910.54
##$PHC1= 14.00081
##$PH_mod= 1
##$PKNL= yes
##$PPARMOD= 0
##$PSCAL= 0
##$PSIGN= 0
##$REVERSE= no
##$SF= 200.130013532006
##$SI= 16384
##$SIGF1= 3
##$SIGF2= 2
##$SINO= 400
##$SIOLD= 16384
##$SREGLST= <1H.CDCl3>
##$SSB= 0
##$STSI= 0
##$STSR= 0
##$SW_p= 3612.71676300578
##$SYMM= 0
##$S_DEV= 0
##$TDeff= 0
##$TDoff= 0
##$TI= <>
##$TILT= no
##$TM1= 0
##$TM2= 0
##$TOPLEV= 0
##$USERP1= <user>
##$USERP2= <user>
##$USERP3= <user>
##$USERP4= <user>
##$USERP5= <user>
##$WDW= 1
##$XDIM= 8192
##$YMAX_p= 0
##$YMIN_p= 0
$$ End of Bruker specific parameters
$$ ---------------------------------
##NTUPLES= NMR FID
##VAR_NAME=  TIME,          FID/REAL,        FID/IMAG
##SYMBOL=    X,             R,               I
##VAR_TYPE=  INDEPENDENT,   DEPENDENT,       DEPENDENT
##VAR_FORM=  AFFN,          ASDF,            ASDF
##VAR_DIM=   8192,          8192,            8192
##UNITS=     SECONDS,       ARBITRARY UNITS, ARBITRARY UNITS
##FACTOR=    0.0002768,     1,               1
##FIRST=     0,             0,               0
##LAST=      2.2672688,     0,               0
##MIN=       0,             -282539,         0
##MAX=       2.2672688,     280953,          0
$$ Real data points
##PAGE= N=1
##DATA TABLE= (X++(R..R)), XYDATA
0 0 0 0 0 0 0 0 0 0 0 0 0 0 0 0 0 0 0 -4 8 -8 8 -8 8 -16 16 -16 16 -24 24 -27 32 -36 40 -44 49 -55 60 -68 76
39 76 -84 92 -102 112 -124 136 -150 166 -182 201 -221 243 -267 296 -327 365 -406 454 -515 583 -669
60 -669 776 -919 1107 -1372 1766 -2398 3543 -5979 13156 -73285 -282539 104853 233110 -133192
74 -133192 -203085 160492 187518 -215266 -133778 244131 68142 -238707 -27542 243946 -20454
85 -20454 -248234 86669 216719 -131080 -173278 148463 148961 -177257 -118553 213234 63183
96 63183 -222569 -9300 210453 -27426 -202211 66191 191700 -111566 -163859 146176
106 146176 126808 -165692 -91313 180422 54625 -191715 -13373 193700 -28632 -183865
116 -183865 66364 165470 -98505 -142812 127342 114594 -150750 -79652 162560 44873 -166511
127 -166511 -12958 169568 -23954 -164409 62984 143698 -90285 -118809 107562 98059 -126732
138 -126732 -72368 143518 38391 -148155 -6077 144917 -22676 -138815 52489 124922
148 124922 -78332 -104629 95779 85540 -111880 -64021 127786 33676 -133532 -2315 128748
159 128748 -22381 -122433 46086 113520 -71138 -96206 90534 74841 -103214 -53544 113666
170 113666 29186 -119041 -2535 116590 -21125 -110057 42982 100322 -64566 -84347 81306
181 81306 64701 -91503 -45799 98892 25834 -104042 -3057 103782 -19961 -97722 40505
192 40505 86599 -57653 -71910 70204 56466 -79975 -41259 89072 22748 -94578 -697
203 -697 92568 -19863 -85518 36640 77046 -51563 -66166 64569 52241 -74406 -36623
214 -36623 82280 18892 -86773 1073 84699 -19098 -77645 33354 70057 -46889 -60991
225 -60991 60493 47512 -70276 -31171 74716 14991 -76168 765 75403 -16617 -71339
236 -71339 31302 63571 -43973 -53171 54432 40780 -62504 -27198 67361 13056 -69008
247 -69008 1098 68064 -15482 -64552 29797 57531 -42028 -47243 50447 36154 -56376 -25133
259 -25133 62067 12201 -65652 2960 64077 -16872 -58554 28069 52093 -38455 -44075 47828
271 47828 33578 -54082 -22261 58021 10315 -60489 3547 59025 -16903 -53354 26575 47039
283 47039 -34655 -40723 43707 31231 -50996 -18959 53723 7456 -53799 2974 52919 -14117
295 -14117 -49633 24871 43555 -33381 -36291 40300 27953 -46218 -17655 49696 6447 -50067
307 -50067 3741 48593 -13180 -45964 22929 40961 -32057 -33213 38527 24527 -42497 -16192
319 -16192 45601 6933 -47504 3914 46083 -14094 -41758 21886 36876 -28836 -31184 35726
331 35726 23052 -40400 -13817 42215 5346 -42970 3438 42303 -13025 -38527 20965 33104
343 33104 -26688 -27984 32352 21491 -37486 -12547 39512 3621 -39038 3820 38050 -11403
355 -11403 -35846 19276 31212 -25745 -25246 30520 18827 -34257 -11459 36338 3516 -36409
367 -36409 3963 35267 -11112 -32895 18082 28737 -24010 -23197 28513 16989 -31746 -10190
379 -10190 33498 3161 -33710 3694 32815 -10628 -30402 17279 26103 -22436 -20945 26103
391 26103 15687 -29254 -9540 31370 2437 -31346 4184 29824 -9933 -27757 15679 24386
403 24386 -21047 -19372 24715 13903 -27030 -8551 28764 2392 -29242 4155 27674 -9792
415 -9792 -25193 14509 22362 -19269 -18188 23312 12610 -25454 -7099 26312 2033 -26748 3545
428 3545 26073 -9363 -23599 14244 20244 -18058 -16519 21446 11912 -23911 -6529 24853 1370
441 1370 -24831 3578 24196 -8779 -22184 13615 18800 -17279 -14972 20036 10918 -22292 -6189
454 -6189 23498 1031 -23397 3853 22311 -8413 -20401 12609 17530 -16127 -13985 18867 9953
467 9953 -20840 -5460 21785 807 -21649 3667 20711 -7923 -18942 11893 16266 -15161
479 -15161 -12922 17693 9179 -19536 -4986 20462 598 -20293 3598 19362 -7531 -17771
491 -17771 11301 15310 -14532 -12016 16852 8332 -18337 -4506 19192 503 -19251 3576 18298
504 18298 -7381 -16505 10734 14146 -13607 -11191 15876 7737 -17253 -4036 17833 342 -17791
517 -17791 3392 17042 -7012 -15358 10166 12958 -12647 -10221 14659 7157 -16166 -3690 16802
530 16802 87 -16552 3310 15718 -6594 -14305 9618 12116 -12039 -9470 13786 6569 -15114
543 -15114 -3337 15814 -92 -15565 3281 14723 -6231 -13349 9085 11303 -11427 -8722 13030
556 13030 6032 -14100 -3091 14719 -135 -14504 3215 13613 -5872 -12338 8331 10541 -10600
569 -10600 -8098 12181 5387 -13064 -2781 13541 -3 -13516 2968 12656 -5638 -11286 7801
582 7801 9682 -9743 -7637 11380 5061 -12296 -2357 12578 -156 -12493 2724 11937 -5304
595 -5304 -10595 7533 8831 -9176 -6936 10584 4759 -11590 -2156 11868 -430 -11554 2705
608 2705 10966 -4966 -9940 7109 8227 -8751 -6231 9835 4245 -10723 -2006 11141 -495
621 -495 -10814 2753 10059 -4723 -9106 6650 7648 -8277 -5698 9290 3725 -9914 -1724 10327
635 10327 -492 -10134 2740 9355 -4571 -8316 6240 7032 -7742 -5277 8806 3322 -9306
648 -9306 -1415 9527 -547 -9424 2617 8758 -4448 -7677 5960 6414 -7262 -4889 8314 3044
662 3044 -8868 -1108 8950 -722 -8733 2537 8193 -4285 -7205 5763 5931 -6929 -4420 7851
676 7851 2734 -8354 -905 8455 -858 -8166 2567 7544 -4089 -6622 5433 5479 -6559 -4034
690 -4034 7380 2393 -7765 -747 7810 -853 -7599 2460 6999 -3934 -6052 5126 4960 -6125
704 -6125 -3709 6917 2173 -7331 -534 7340 -980 -7089 2452 6592 -3861 -5679 5046 4574 -5904
719 -5904 -3338 6634 1934 -7043 -361 7026 -1113 -6711 2476 6187 -3801 -5317 4881 4197 -5649
734 -5649 -3031 6217 1712 -6609 -258 6537 -1109 -6197 2299 5712 -3505 -4931 4565 3829 -5240
749 -5240 -2712 5696 1590 -6048 -270 6096 -1075 -5749 2220 5252 -3271 -4596 4307 3641 -5067
764 -5067 -2472 5486 1357 -5742 -197 5835 -1101 -5566 2303 4960 -3294 -4284 4130 3420 -4888 -2329
780 -2329 5321 1136 -5478 -39 5425 -1091 -5177 2159 4635 -3118 -3909 3829 3080 -4428 -2156 4851
796 4851 1086 -5024 -6 4927 -989 -4659 1923 4228 -2808 -3608 3574 2794 -4104 -1925 4469 1004
812 1004 -4704 14 4684 -1036 -4402 1938 3967 -2747 -3421 3489 2619 -4065 -1738 4346 824 -4505
828 -4505 77 4495 -1074 -4206 1972 3713 -2658 -3154 3271 2478 -3791 -1631 4082 763 -4134 64
844 64 4102 -902 -3874 1741 3421 -2408 -2870 2920 2292 -3391 -1581 3748 719 -3831 64 3762
860 3762 -817 -3622 1612 3252 -2345 -2726 2862 2113 -3286 -1466 3634 652 -3768 193 3668 -937
876 -937 -3461 1638 3147 -2324 -2613 2865 1966 -3198 -1307 3457 605 -3574 173 3507 -916 -3237
892 -3237 1556 2867 -2101 -2423 2580 1872 -2951 -1224 3158 558 -3241 103 3197 -785 -3018 1428
908 1428 2674 -1989 -2243 2423 1731 -2790 -1146 3049 477 -3152 227 3076 -864 -2876 1476 2584
924 2584 -2030 -2135 2465 1603 -2772 -1006 2998 383 -3052 286 2965 -889 -2741 1434 2423 -1938
940 -1938 -1986 2328 1482 -2588 -949 2758 364 -2838 242 2740 -810 -2534 1304 2238 -1765 -1865
956 -1865 2146 1379 -2427 -875 2570 341 -2665 238 2615 -808 -2403 1324 2105 -1726 -1765 2103
972 2103 1315 -2399 -763 2553 217 -2566 298 2506 -829 -2328 1329 2014 -1735 -1615 2019 1196
988 1196 -2284 -732 2417 193 -2440 306 2297 -785 -2141 1186 1871 -1579 -1535 1879 1106 -2085
1004 -2085 -679 2193 226 -2238 251 2173 -723 -1987 1124 1717 -1457 -1425 1768 1065 -1994 -615
1020 -615 2106 152 -2110 273 2036 -697 -1911 1101 1637 -1456 -1310 1670 967 -1878 -593 1992
1036 1992 121 -2025 288 1884 -663 -1758 997 1553 -1341 -1245 1595 883 -1726 -534 1840 175
1052 175 -1879 240 1791 -621 -1619 949 1417 -1204 -1170 1473 839 -1649 -475 1706 111 -1727
1068 -1727 229 1666 -600 -1544 916 1317 -1186 -1059 1370 773 -1550 -454 1636 84 -1625 248
1084 248 1537 -563 -1429 844 1235 -1110 -1000 1313 719 -1445 -395 1523 73 -1532 243 1461
1100 1461 -564 -1336 832 1140 -1067 -931 1244 659 -1400 -373 1460 21 -1461 274 1371 -551
1116 -551 -1269 795 1081 -1054 -861 1206 588 -1313 -322 1377 42 -1380 269 1302 -544 -1153 758
1133 758 1009 -943 -825 1147 557 -1253 -265 1277 21 -1276 238 1247 -527 -1135 763 935 -949
1150 -949 -742 1086 527 -1224 -253 1276 -54 -1255 286 1171 -533 -1086 774 900 -965 -684 1070
1167 1070 460 -1157 -228 1207 -30 -1208 285 1125 -508 -990 690 856 -866 -668 1007 445 -1094
1184 -1094 -214 1112 -19 -1095 242 1050 -475 -939 666 795 -828 -638 939 422 -1067 -199 1081
1201 1081 -71 -1066 262 999 -485 -922 683 757 -832 -569 941 379 -1023 -154 1055 -65 -1023
1218 -1023 281 965 -456 -862 625 724 -774 -546 877 350 -939 -169 949 -23 -958 191 877
1235 877 -397 -814 548 663 -706 -544 786 344 -867 -177 886 -37 -894 219 829 -402 -753
1252 -753 552 618 -701 -474 805 313 -846 -125 875 -65 -867 259 805 -404 -703 555 593 -665
1270 -665 -453 734 274 -801 -119 804 -44 -795 191 732 -356 -669 465 551 -588 -443 655 280
1288 280 -721 -134 731 -28 -729 167 680 -313 -624 444 516 -557 -393 648 256 -700 -112 717 -44
1307 -44 -700 200 652 -353 -598 470 486 -569 -373 634 209 -681 -85 672 -44 -686 180 614 -337
1326 -337 -552 431 436 -516 -356 565 222 -626 -103 624 -37 -625 154 579 -275 -517 400 422 -478 -311 532
1347 532 215 -582 -92 618 -61 -608 190 533 -307 -482 393 411 -501 -302 547 160 -591 -65 583 -83
1367 -83 -599 193 529 -328 -460 398 359 -479 -298 523 174 -573 -42 561 -73 -531 170 505 -272 -451 375
1388 375 365 -454 -270 482 155 -523 -57 535 -69 -528 164 467 -269 -435 351 349 -461 -266 481 124 -522
1409 -522 -38 501 -69 -530 168 479 -301 -414 361 318 -431 -236 468 137 -517 -27 500 -81 -473 161
1429 161 456 -273 -413 356 313 -405 -232 432 148 -456 -63 480 -60 -492 147 408 -249 -370 291 298 -381
1450 -381 -247 405 135 -453 -56 443 -36 -448 141 411 -235 -354 288 292 -337 -235 400 137 -444 -40 421
1471 421 -47 -413 118 389 -216 -357 287 280 -339 -211 369 127 -408 -44 408 -40 -398 97 361 -191 -338
1492 -338 262 266 -319 -220 353 120 -376 -55 372 -31 -375 91 351 -162 -322 238 269 -282 -190 321 124 -330
1514 -330 -64 358 -19 -358 88 332 -155 -292 218 254 -273 -182 311 118 -327 -64 336 -20 -354 102 310
1535 310 -179 -287 211 223 -263 -188 285 120 -317 -51 338 -27 -318 87 297 -134 -263 199 233 -232 -175
1556 -175 270 136 -289 -67 315 -9 -299 63 267 -115 -256 161 224 -230 -170 247 106 -273 -61 280 -16
1577 -16 -270 70 257 -116 -234 173 209 -225 -161 263 82 -262 -31 277 -17 -262 75 248 -133 -215 170
1598 170 180 -203 -150 236 91 -249 -47 239 -2 -265 42 240 -103 -222 132 181 -180 -174 203 93 -235 -74
1620 -74 235 -4 -245 24 237 -92 -222 136 176 -190 -141 210 89 -237 -54 249 -11 -253 61 231 -108
1641 -108 -196 155 176 -193 -142 202 81 -232 -63 231 -3 -240 39 215 -88 -213 110 182 -160 -164 185 109
1663 109 -221 -93 217 33 -237 21 221 -66 -197 104 190 -145 -170 183 118 -212 -58 221 13 -220 28
1684 28 221 -84 -197 120 158 -167 -134 172 99 -219 -52 210 -5 -221 26 202 -82 -210 113 154 -165 -142
1706 -142 155 105 -200 -82 203 21 -223 18 197 -58 -200 85 181 -131 -143 158 117 -177 -76 200 32
1727 32 -213 26 202 -61 -183 94 152 -140 -132 161 76 -186 -44 190 -2 -207 33 184 -88 -170 110 129
1749 129 -138 -123 154 80 -177 -52 173 8 -182 28 172 -70 -165 85 156 -128 -120 143 85 -171 -57 182
1771 182 16 -180 17 162 -55 -165 92 120 -135 -110 133 71 -176 -40 159 -17 -177 31 148 -83 -141
1792 -141 104 117 -145 -81 150 55 -153 -17 169 -18 -167 50 152 -82 -136 106 100 -126 -90 151 51 -152
1814 -152 -27 159 -10 -171 32 144 -82 -120 97 111 -127 -92 133 43 -162 -20 154 -17 -157 46 147
1835 147 -89 -128 115 87 -128 -67 155 51 -164 11 165 -28 -144 64 140 -84 -112 125 91 -140 -54 154
1857 154 33 -161 -7 148 -41 -149 65 134 -89 -127 116 104 -138 -69 158 41 -157 -13 147 -26 -147
1878 -147 48 137 -87 -107 123 97 -124 -63 151 34 -154 8 155 -41 -147 65 131 -94 -109 119 75 -137
1900 -137 -62 152 18 -168 -4 143 -41 -158 58 128 -96 -119 109 76 -124 -55 144 28 -160 -13 157 -26
1922 -26 -134 68 132 -81 -105 111 100 -117 -52 144 32 -137 7 158 -33 -138 60 124 -87 -106 109 77 -126
1945 -126 -70 140 24 -148 -4 139 -50 -146 49 122 -87 -107 100 77 -129 -65 144 36 -142 -14 133 -26
1967 -26 -137 56 126 -73 -105 102 89 -106 -68 127 40 -139 -6 124 -21 -131 38 119 -79 -109 92 76 -114
1990 -114 -67 109 25 -133 -11 126 -29 -126 37 105 -71 -103 87 78 -106 -56 118 36 -116 -14 129 -15 -128
2013 -128 60 115 -61 -84 76 75 -103 -50 107 22 -116 -9 114 -20 -121 40 107 -72 -97 76 69 -102 -73 100
2037 100 26 -125 -11 106 -12 -117 31 93 -73 -100 82 70 -95 -64 98 44 -111 -9 117 -16 -102 24
2059 24 105 -52 -87 75 70 -90 -62 100 40 -120 -19 94 -9 -108 31 95 -57 -89 58 67 -89 -59 92 18 -108
2084 -108 -26 100 -16 -105 27 87 -51 -79 73 70 -91 -53 102 43 -100 -12 107 -2 -110 28 97 -54 -89 60
2108 60 68 -97 -65 89 33 -105 -24 88 -2 -110 20 72 -52 -91 45 61 -89 -59 88 41 -96 -8 89 -9 -103
2133 -103 28 88 -44 -82 53 69 -69 -55 82 31 -92 -29 80 3 -101 18 90 -36 -90 55 70 -74 -51 63
2157 63 28 -95 -20 91 -14 -87 18 84 -34 -93 42 65 -77 -61 63 39 -80 -23 87 8 -81 23 84 -23
2181 -23 -78 41 75 -57 -54 74 41 -73 -25 78 2 -81 -3 73 -31 -83 35 55 -54 -63 58 43 -70 -26 69 13
2207 13 -81 -9 64 -14 -70 35 60 -41 -58 49 42 -63 -24 83 17 -71 4 74 -10 -71 26 71 -54 -52 49 44 -59 -35
2235 -35 65 20 -73 -5 72 -23 -73 21 52 -41 -53 49 44 -60 -38 54 -2 -70 3 73 -17 -57 33 69 -36 -43 52 48 -48 -17
2265 -17 72 21 -70 -5 72 -19 -67 19 56 -38 -52 50 43 -67 -33 72 8 -77 -9 65 -19 -73 18 65 -51 -55 42 38 -54 -21
2295 -21 64 20 -62 0 66 -17 -59 29 62 -28 -43 57 51 -57 -32 75 26 -78 -9 67 -22 -66 32 60 -44 -62 48 41
2323 41 -73 -43 54 10 -74 -11 62 -11 -74 23 62 -26 -54 42 45 -57 -29 62 15 -71 -4 69 -13 -69 16 74 -32 -50 50
2352 50 45 -48 -41 55 33 -70 -17 57 -4 -76 8 58 -48 -63 37 55 -57 -56 51 27 -69 -31 60 12 -68 -5 78 -16 -70
2381 -70 42 66 -51 -48 58 42 -62 -34 76 31 -62 2 72 -5 -69 24 64 -34 -61 40 50 -56 -36 56 9 -71 -11
2408 -11 68 -6 -80 13 67 -32 -68 38 50 -51 -44 61 30 -70 -24 77 7 -70 5 63 -19 -63 32 56 -52 -59 55 38
2436 38 -64 -26 80 18 -67 -12 66 -24 -64 12 57 -41 -67 52 40 -68 -40 65 12 -77 -13 64 -22 -74 29 58 -37
2463 -37 -58 52 43 -61 -31 71 24 -69 -1 74 -5 -75 27 65 -49 -72 54 46 -68 -42 68 21 -77 -6 66 -20 -85
2490 -85 22 59 -43 -64 48 45 -69 -44 64 21 -89 -10 80 -17 -71 22 67 -34 -55 47 41 -60 -27 74 22 -74
2516 -74 -13 79 -12 -70 33 64 -41 -63 61 37 -64 -34 54 9 -90 -4 67 -25 -84 31 56 -53 -51 54 26 -81 -30
2543 -30 70 11 -82 6 68 -19 -82 31 59 -39 -50 69 45 -68 -27 77 16 -70 0 76 -19 -72 45 60 -50 -49 62
2570 62 27 -80 -29 72 -9 -73 13 65 -31 -68 45 62 -64 -50 60 22 -73 -11 76 2 -76 13 70 -25 -49 49 53 -62
2598 -62 -41 66 28 -73 -5 67 -4 -64 16 70 -15 -57 41 48 -50 -45 55 19 -76 -24 66 -7 -80 8 55 -26 -64 40 43 -50
2628 -50 -36 54 18 -64 -11 68 -1 -58 16 63 -24 -46 50 43 -43 -32 58 25 -52 -26 69 -9 -62 11 52 -25 -58 30 32 -49 -40 32
2660 32 18 -64 -21 46 -8 -64 11 35 -31 -46 38 39 -40 -35 40 24 -49 -15 42 10 -48 7 50 -18 -45 33 48 -41 -33 52 19 -44
2692 -44 -17 44 -9 -51 12 52 -18 -59 23 30 -36 -44 30 12 -50 -14 41 -8 -48 12 49 -25 -31 37 34 -27 -24 44 23 -32 1 47 8
2725 8 -40 22 42 -16 -33 32 28 -35 -15 31 17 -39 -4 31 -3 -43 8 37 -28 -34 17 26 -36 -23 35 11 -47 6 47 5 -44 8
2757 8 45 -26 -31 34 31 -27 -24 40 15 -33 -3 38 0 -42 19 37 -24 -40 25 21 -34 -16 40 12 -49 -1 37 -8 -48 15 36 -39 -54
2790 -54 29 20 -47 -32 37 17 -49 1 55 2 -30 25 45 -22 -29 39 25 -29 -10 43 19 -42 -2 45 -3 -45 21 30 -27 -46 27 21
2822 21 -35 -13 34 0 -47 -9 37 -17 -50 12 30 -23 -34 24 31 -39 -21 45 11 -34 -1 41 -6 -43 23 42 -17 -29 39 28 -34
2853 -34 -11 37 23 -39 -2 43 -12 -44 16 37 -25 -36 22 23 -40 -31 17 -14 -45 -17 27 -18 -39 9 23 -22 -39 19 27 -25 -22 36
2885 36 10 -19 -6 44 -10 -30 7 39 -20 -28 27 33 -33 -21 31 12 -34 -9 31 -8 -33 -7 17 -13 -28 20 24 -32 -20 24 8 -38
2917 -38 -5 20 4 -28 8 29 -16 -31 18 31 -28 -15 36 17 -20 -6 23 -11 -17 11 18 -13 -22 2 13 -22 -25 3 1 -26 -18 12 -4
2950 -4 -35 -1 10 -16 -20 7 17 -20 -25 21 24 -24 -17 42 2 -27 -2 21 2 -8 12 25 -14 -17 28 19 -15 -3 25 7 -21 4 17 -9
2984 -9 -25 2 11 -16 -18 12 5 -21 -8 14 7 -29 -9 1 -9 -20 12 7 -18 -14 9 14 -15 -4 28 -3 -20 6 36 9 -23 6 14 -5 -16
3019 -16 19 24 -23 -11 25 7 -25 2 30 -5 -35 -1 21 -18 -18 6 11 -23 -22 14 9 -21 -11 26 -5 -27 11 27 -15 -27 -1 17 -13
3052 -13 -5 24 25 -17 1 17 9 -21 7 28 -3 -24 15 19 -21 -14 25 12 -29 -13 29 -6 -33 -2 34 -8 -30 7 19 -32 -25 16 0
3085 0 -30 -21 27 2 -28 -4 16 -10 -18 7 16 -10 -14 24 11 -33 -10 32 0 -31 14 23 -18 -35 0 23 -17 -16 12 1 -28 -18 19 4
3119 4 -39 1 12 -22 -32 11 15 -26 -25 16 14 -27 -15 17 6 -34 2 21 -6 -23 10 27 -5 -16 28 10 -23 -1 21 -7 -33 -1
3151 -1 12 -12 -34 5 5 -34 -16 7 4 -35 -7 3 -8 -21 -9 9 -10 -11 6 12 -28 -7 17 9 -19 -6 15 -9 -12 1 6 -6 -16 9
3185 9 13 -3 0 13 -4 -18 -9 9 8 -23 -5 14 -8 -18 1 11 -15 -17 2 2 -13 -12 10 -10 -20 -7 7 -4 -11 -4 -10 3 -5 7 4 -12 -1
3222 -1 9 -6 -1 -5 19 -2 -1 0 3 -4 -12 -1 4 -4 -13 6 -8 -1 -2 -2 -9 -8 -6 0 0 -3 1 -4 -5 -6 0 -10 -4 -5 5 11 -2 2 7 -6 4 9 13 10 3 9 9 -1
3270 -1 7 15 -4 -2 -10 -15 -6 -2 -5 -3 -7 -9 -16 0 -4 -11 -1 -2 -10 3 -6 -8 -14 -4 3 -2 -8 -3 2 2 -12 -7 10 7 6 13 10 -3 2 14 7 -7 -3 10 4 -5 -2 9 -13
3319 -13 -8 -2 -4 -22 -11 6 -7 -19 -14 -2 -7 -10 -7 18 3 -5 7 1 4 -12 23 17 -10 -4 12 16 -9 8 23 7 -4 8 26 -1 -14 20 14
3356 14 -17 -2 16 8 -15 10 28 -1 -22 7 8 -13 -16 0 5 -20 -11 19 0 -25 -3 25 -2 -26 9 26 -5 -8 15 21 -11 -3 30 14
3390 14 -18 10 26 7 -15 16 28 -8 -19 13 15 -32 -10 16 0 -24 -9 14 1 -29 -3 18 -9 -30 18 19 -25 -19 13 8 -27 -6
3422 -6 27 9 -23 12 30 -5 -11 21 19 -12 -12 28 17 -22 2 27 -2 -22 1 17 -20 -22 14 15 -19 -19 31 -3 -34 -2 18 -6 -29 3
3456 3 18 -22 -21 6 26 -19 -25 31 0 -22 -2 28 5 -23 10 25 -5 -18 18 28 -18 -1 33 16 -29 1 33 -1 -25 8 38 -9
3488 -9 -23 23 21 -31 -20 21 8 -44 -19 23 8 -38 11 19 -20 -23 11 18 -22 -22 28 23 -24 -1 40 5 -30 15 37 -3 -28 19 26 -17
3522 -17 -16 16 10 -24 -15 30 9 -36 7 31 -16 -35 -1 22 -25 -34 20 11 -30 -2 36 0 -32 5 31 -18 -42 19 24 -25 -10 28 17
3555 17 -31 -7 39 8 -27 11 47 -17 -25 22 48 -18 -30 25 12 -31 -26 37 2 -40 -3 38 -11 -35 19 19 -21 -40 17 10 -33 -28 35
3588 35 4 -44 2 36 -5 -33 17 37 -21 -19 37 28 -31 -8 39 6 -41 3 36 1 -35 23 38 -16 -29 20 25 -32 -23 35 5 -41
3620 -41 -4 35 0 -55 10 33 -23 -33 17 29 -32 -19 34 14 -41 -1 39 7 -25 17 54 -13 -17 34 35 -28 -13 40 28 -35 2
3651 2 34 5 -32 18 23 -16 -30 19 23 -36 -31 28 9 -40 -16 40 1 -46 13 33 -10 -27 31 30 -24 -18 41 18 -32 -4 42 7 -37
3684 -37 9 45 -13 -33 28 33 -21 -20 28 9 -47 -6 35 -11 -39 17 34 -24 -31 13 23 -26 -22 21 9 -30 -4 32 -4 -33 9 25
3716 25 -9 -21 16 29 -18 -7 29 14 -36 3 34 -2 -31 16 30 -21 -15 21 23 -27 -13 38 4 -42 -7 21 -19 -36 9 24 -18
3747 -18 -30 18 18 -31 -22 20 0 -39 -3 26 -4 -39 13 32 -13 -20 19 22 -12 -5 39 16 -23 3 43 -3 -33 12 29 -22 -33 17 14
3780 14 -16 -7 34 7 -32 -11 29 -15 -35 2 21 -22 -22 22 19 -20 -11 29 12 -36 3 36 0 -20 8 38 -5 -9 26 23 -21 3 26
3813 26 15 -25 1 43 5 -19 11 22 -12 -28 21 13 -33 -16 28 0 -39 -10 16 -10 -40 -3 22 -21 -29 19 22 -28 -10 26 1 -29
3845 -29 -8 34 -1 -31 19 38 -23 -28 30 22 -27 -5 27 11 -25 9 25 -8 -31 14 33 -15 -19 13 12 -26 -25 13 8 -36 -11 33 -12
3878 -12 -41 11 32 -14 -10 29 22 -21 -11 33 14 -33 7 46 3 -28 20 37 -17 -26 12 26 -34 -25 22 8 -27 -1 30 1 -29 1
3910 1 30 -18 -29 11 16 -23 -16 11 9 -37 -6 28 -2 -28 15 29 -8 -31 15 28 -17 -19 23 6 -21 2 38 2 -25 10 23 -13 -32
3943 -32 18 11 -20 -22 18 8 -27 -26 15 -5 -34 -1 9 -8 -27 14 17 -27 -18 15 7 -27 -4 25 -6 -24 1 17 -11 -23 13 26 -22
3976 -22 -12 27 17 -23 9 31 -5 -18 3 18 -9 -21 11 13 -24 -21 13 6 -29 -13 16 -4 -32 -5 18 -11 -30 5 19 -16 -20 14
4008 14 15 -22 7 29 14 -20 5 18 -9 -20 16 25 -13 -24 14 24 -23 -12 14 -6 -32 -2 23 1 -26 0 16 -19 -25 5 1 -30
4040 -30 -15 17 -8 -29 -2 16 -5 -22 15 17 -25 -15 21 10 -11 -1 33 -1 -14 12 16 -2 -17 9 23 -9 -16 19 4 -25 -7 18
4072 18 -3 -32 -4 15 -14 -17 7 7 -29 -11 12 10 -28 -6 12 4 -24 11 25 -13 -17 9 15 -12 -6 21 9 -14 -8 33 7 -19 1 26
4106 26 -14 -23 7 10 -22 -23 2 -4 -13 -9 16 -8 -32 -18 16 -15 -28 0 5 -17 -26 12 4 -17 -10 18 -2 -20 8 17 -4 -16 -1 14 -18 -15
4142 -15 21 3 -11 -2 13 6 -21 5 14 -4 -23 -3 3 -19 -12 5 -4 -30 -8 6 -12 -17 -12 -4 -8 -9 0 2 -13 -6 0 10 -10 -1 10 11 -5 1 21
4181 21 -7 -14 9 23 -7 3 17 6 -7 -1 9 -4 -20 -5 11 -6 -20 6 -11 -17 -15 -11 -3 -13 -14 -9 -6 -27 -8 -1 -12 -11 0 6 -11 0
4217 0 4 -9 -5 -6 9 7 -2 4 11 -3 4 21 11 2 -12 3 9 -7 -3 5 -4 2 -14 -6 -12 -16 -1 3 -21 -18 7 -4 -15 -7 3 -1 -19 0 12 -3 -4 2
4259 2 1 -9 4 3 5 -17 1 24 -4 1 12 7 1 -8 13 8 -4 12 1 -6 -7 -1 7 -1 -7 4 2 -16 -18 -1 -8 -15 -9 1 -10 -13 -11 8 -9 -10 -1 9
4301 9 -8 1 -4 4 -14 -16 12 -4 -10 2 18 7 -10 13 13 -9 -8 10 6 -27 -3 1 -4 -18 0 8 -15 -17 -3 2 -14 -19 7 -4 -2 -9 5 -9 -14
4340 -14 5 8 -8 -14 1 13 -10 -6 16 10 -9 0 11 16 -5 11 16 -11 -12 9 6 -10 -3 9 12 -24 -4 9 -15 -22 4 8 -5 -10 3 8 -22 -7
4378 -7 6 -4 -26 -8 17 -6 -13 9 22 -8 -17 13 18 -10 -5 28 18 -9 -1 25 4 -9 13 24 -14 -10 16 8 -20 -17 3 -7 -20 -16 9
4413 9 -8 -19 -9 12 -16 -13 7 2 -19 -9 20 7 -13 -5 16 4 -12 6 19 2 -11 24 24 -12 -11 12 8 -9 1 19 13 -16 -5 15
4447 15 0 -15 3 9 -19 -21 3 -4 -19 -14 4 -6 -22 -9 11 -9 -20 7 7 0 -8 19 7 -7 -6 26 21 -13 0 14 14 -19 11 14 -8 -9
4483 -9 0 9 -17 -14 6 5 -11 -8 5 -4 -16 -3 8 -18 -9 -6 10 -24 -14 4 -3 -19 -6 -1 -9 -10 -2 10 1 -7 8 17 -10 -2 9 14 -7 -8 24 6
4523 6 -16 0 11 -9 -3 2 14 -10 -21 9 5 -13 -11 -10 -3 -22 -9 7 -7 -19 -15 8 -18 -12 4 3 -15 -14 12 -3 -9 -10 7 6 -15 -11 -1 -7
4561 -7 -13 6 14 -8 -7 11 0 -11 -11 -2 -4 -10 -11 10 -13 -16 -5 0 -17 -14 -3 4 -15 -18 -1 -10 -26 -13 13 -8 -11 2 7 -6 -7 7 6 -6 -7 18
4601 18 16 -10 1 9 -4 -5 3 4 -11 -16 0 2 -7 -1 11 -6 -4 -13 4 -9 -23 -10 -9 -15 -19 -16 -1 -23 -7 2 2 -4 -5 9 -2 -3 5 21 6 -14 5
4642 5 13 -1 -3 14 15 -4 3 8 -4 -10 2 9 3 -8 -3 -3 -13 -15 0 2 -19 -13 -7 2 -13 -5 1 -6 -17 -3 15 0 -2 5 2 -2 2 6 5 -6 -2 13 0 -7
4686 -7 8 12 10 -7 7 5 6 -1 -3 2 -12 -13 -3 3 -14 -10 -4 -15 -19 -3 -4 -12 -10 2 -11 -17 -23 -1 2 -10 -10 1 -1 -6 2 1 2 0 2 5 5 -5 8 4 -7
4731 -7 -6 2 4 -9 -1 -3 0 -5 0 -8 0 -2 -7 -2 -20 -8 -11 -7 -11 -6 -5 -31 -13 -8 -2 -1 -17 -7 -3 -9 3 8 1 5 5 14 5 1 6 -2 -13 8 3 8 -5 -7 1 -6 -8 -3
4781 -3 -7 -2 -6 -7 -15 -11 -8 -13 -5 -10 -9 -5 -15 -11 -5 -9 -18 -5 -4 -4 -1 -5 -4 -5 -5 6 2 -12 -9 -4 1 -7 6 5 0 -1 -2 -10 -8 -16 -7 -6 -14 -8 -7 -13 -21 -14 -12 1 -15 -9 -8 -12
4835 -12 -12 -5 -9 -4 -4 -18 -15 -4 5 -5 -3 -13 -2 -8 -6 -2 0 7 -6 5 -7 -2 -9 -2 -5 -10 -4 -5 -5 -4 -4 -7 -7 -12 -17 -8 0 -15 -12 -6 -15 0 -9 -5 -12 -6 -5 -2 1 7
4885 7 10 -6 3 11 3 -4 10 -9 8 -1 2 4 9 0 -5 0 -4 0 -7 -11 -2 -5 -10 -6 -19 -7 2 -14 -8 -11 -12 -25 -23 -5 2 -7 -5 2 -5 -2 -8 -1 4 5 -10 -12 0 -3 4 -1
4935 -1 2 -1 6 3 5 8 -2 4 2 0 -2 4 3 -1 1 -9 -11 -3 -12 -5 -6 -2 -12 -8 -5 -11 -10 -12 6 1 -11 2 -11 -9 -14 -3 0 -10 6 7 5 -3 -9 -8 9 5 6 2 2 -15
4985 -15 1 13 -8 -8 -2 -8 -10 -15 -2 -4 -8 1 -2 -13 -8 -3 -11 -11 -19 2 -7 -5 -10 0 1 0 4 8 -1 0 2 15 0 0 5 9 -5 2 9 4 4 11 9 -6 -7 3 4 -14
5033 -14 -9 -3 -6 -12 -18 -15 -5 -22 -11 2 0 -3 -9 2 -13 -15 6 7 2 0 13 -4 1 -4 0 1 -8 0 9 -1 -2 5 2 -1 6 6 -9 -3 0 5 -4 -8 -4 -3 -11 -28 -6
5080 -6 -10 -10 -16 -14 -8 -13 -16 -8 -6 -3 2 2 -13 -14 9 -2 -4 -2 10 1 -4 -3 8 -4 -10 9 0 -6 -6 -5 -5 -8 -5 0 -2 -8 -6 -8 -11 -23 -3 -8 -3 -7 -9 -3 -21 -20 -9 -2
5130 -2 -22 -12 -6 -16 -23 -2 9 -6 -12 0 2 -9 -3 11 5 -7 -2 5 4 -9 11 14 -4 -5 0 4 -11 -13 5 -6 -15 -7 -3 -11 -21 -6 -4 -18 -19 -1 -5
5171 -5 -12 -8 1 8 -18 -6 5 0 -3 0 3 0 -9 16 12 3 -1 6 5 -11 5 17 -4 -16 2 -2 -5 -16 -4 -4 -6 -10 -13 1 -16 -11 -3 -8 -20 -7 -3 -2 -17 -1
5215 -1 3 -11 -12 1 5 -12 5 19 -6 -4 7 6 2 -2 0 2 -3 3 3 -4 -10 2 8 -5 -4 1 12 -12 -3 -3 1 1 -11 -12 -8 -2 -15 3 -11 -13 -6 -1 -5 -9 -2 0
5261 0 -10 -3 6 7 -10 -4 11 -4 0 -6 15 3 -3 -3 7 3 -13 0 4 0 1 -8 -6 -10 -2 -6 -10 -14 -5 -9 -19 -7 -7 -4 -18 -14 8 -5 8 -13 0 -14 -10
5304 -10 -3 4 -7 6 14 3 7 -1 19 5 -2 12 4 -2 0 3 4 0 -4 5 -3 -2 0 1 0 -10 -6 -13 -3 -11 9 -15 -25 -10 4 -9 -16 3 -3 -5 -8 -6 11 -16
5348 -16 -11 7 5 -4 9 10 2 -13 4 8 -11 -21 8 7 -13 -16 -2 6 -11 -4 -8 -3 -12 8 -3 -12 -6 -14 1 -18 -8 6 3 -9 -2 3 -2 -18 -1 12
5388 12 -1 -3 2 9 -7 -12 10 5 -9 -3 12 9 -17 1 3 -5 -16 2 -1 -8 -16 2 3 -14 -13 3 -4 -30 -6 2 -19 -7 -6 3 -8 -9 5 0 -12 -6 17
5429 17 -2 -12 4 1 4 -13 6 15 -8 -13 7 10 -15 0 14 5 -13 -6 13 -2 -23 -1 2 -17 -16 -6 8 -16 -20 -7 -5 -21 -10 6 -3 -10 1
5466 1 0 -17 -16 10 10 -17 -6 12 15 -1 -3 18 1 -4 8 16 0 2 5 16 -14 -20 5 -4 -13 -9 0 -7 -13 -6 0 -11 -18 -9 3 -20 -20 9 -6 -20 -8
5507 -8 4 -8 -15 5 10 -7 -12 16 14 -3 -11 3 5 -20 -4 10 5 -9 -4 14 -7 -4 0 3 -5 -15 4 -2 -17 -9 2 -5 -13 -13 4 -19 -12 -3 -7 -23 -16
5548 -16 1 -9 -15 -9 10 1 -10 -3 12 -1 -2 6 13 4 0 17 17 -2 1 19 -4 0 -1 2 -6 -13 5 -5 -18 -16 -2 -8 -19 1 5 -14 -14 -9 4 -4 -18
5589 -18 -4 -9 -17 -13 1 0 -9 -8 4 2 2 7 19 3 -9 15 0 -14 -1 10 2 -18 -3 10 0 -18 1 4 -23 -17 -7 -6 -14 -9 -6 -11 -22 -15 2
5628 2 -1 -7 -4 -5 -14 -9 -1 -4 -8 -12 4 -2 -8 14 13 -2 -12 4 3 -11 -1 0 8 -11 -5 1 -4 -15 -12 7 -10 -11 -2 0 -14 -14 4 -12 -10 -16 -7 -9 -25 -5 3
5673 3 -7 -11 -2 1 -1 -13 -1 -5 -13 -15 6 -1 -14 -3 -3 -4 -5 -4 4 -6 -14 5 -3 -1 -12 1 -1 -4 -9 2 -3 -13 -3 -5 -20 -8 -4 4 -14 -11 -4 -9 -16 -3
5717 -3 -3 -4 -8 -8 8 1 -12 2 11 -7 -15 -3 -6 1 1 4 4 5 10 -3 -10 -4 -12 -3 -13 -7 -4 -7 -14 -13 -10 -17 -24 -6 -13 -19 -11 -9 -1 -10 0 -7 0 -4 1 7 -8 3 9 15
5767 15 11 -8 9 13 -4 1 6 6 5 3 4 -5 -3 0 -2 -13 -7 -7 -8 -12 -1 -8 2 -10 -8 -9 -11 -13 5 -4 -10 -14 -6 -3 -1 0 2 -1 -2 -5 2 -3 -3 12 15 -3 -4 7 -5
5816 -5 1 5 0 6 -3 -4 6 -8 -2 4 -9 -6 -7 -7 -4 -8 -10 -12 -7 -15 -12 -6 -12 -18 -7 -7 -3 -3 -5 -1 8 -10 -4 -5 -12 -4 6 -5 -3 14 6 1 -1 14 -1 1 -7 17 7
5865 7 -2 -5 2 -7 -11 -1 -6 -1 -16 -7 -9 -11 -10 -4 0 -5 3 9 6 9 -1 -2 -1 3 0 7 -5 -7 8 -7 -4 -9 3 5 3 3 -1 -5 1 0 -9 -1 -13 1 -8 -8 -8 -2 -2 0 -3 -7
5917 -7 -10 -14 -7 -1 -5 -4 -12 -1 -13 -9 5 -11 0 -5 2 8 -5 8 14 0 4 -5 2 2 1 16 0 0 6 2 -4 -7 -2 3 -16 -8 -14 -5 -15 -10 -6 -13 -17 -8 6 -2 -5 -12
5965 -12 0 -10 1 -5 9 -12 -1 7 5 -8 -11 -2 3 -12 10 13 7 4 4 1 -14 2 5 6 -2 0 14 -2 -6 -4 -5 -1 -14 -8 1 0 -6 -11 1 -18 -11 -4 1 -12
6009 -12 -7 -4 1 1 9 4 -2 3 5 9 1 0 1 7 4 10 16 0 8 0 4 0 -6 -1 0 -6 10 2 -16 -15 -9 -3 -16 -8 -7 -5 0 -6 -8 -13 0 -8 -1 4 -1 10 7 6 2 16 3 -8
6061 -8 -4 8 -2 -4 9 21 8 1 -1 -3 -1 3 7 7 -8 -9 -7 -2 -5 -6 -6 -11 -10 -11 -2 -12 -15 -5 -3 -9 -1 -9 6 5 5 2 0 -7 -5 11 -1 0 3 17 1 1 0 -4
6109 -4 -9 2 3 2 -1 -2 -3 0 1 -4 -8 -16 -6 -8 -17 -2 -18 -8 -5 -11 -2 -12 -10 -9 0 -10 7 -3 -4 -1 -6 9 -4 -9 -8 9 1 2 -1 -1 11 -8 -5 5 3 -5
6155 -5 -6 -3 -6 -11 -12 1 -19 -14 -7 -8 -7 -12 -8 -14 -21 -12 -5 -9 -12 7 -3 -6 -2 0 9 -1 3 -6 -7 4 8 3 -6 5 7 10 -2 4 3 4 -3 2 -9 -6 2 -12 -2 -8 -20
6204 -20 -10 -9 -4 7 -10 -5 -1 -15 -5 2 -16 -13 0 2 4 4 -4 8 -4 -3 -1 0 13 4 8 1 3 6 1 -2 5 9 1 -5 -1 -5 0 4 -1 -9 5 -14 -7 -6 -16 -15 2
6251 2 4 -11 -4 -8 -6 -7 -5 -1 -2 -6 -2 -8 -5 8 5 4 22 13 7 6 11 -1 4 12 4 12 -1 6 6 -7 6 -8 5 -1 3 -10 -9 -12 -6 -2 0 4 -8 1 -6 1 -5 1 -2 -13
6301 -13 -2 5 5 -4 2 14 9 13 10 15 1 12 4 6 -6 -5 21 4 0 4 8 0 -6 -5 -8 4 -7 -7 1 -3 -8 -2 -2 -7 4 2 -8 -19 -5 -2 -5 4 -5 1 -3 0 3
6348 3 3 0 2 11 -6 4 5 3 3 -9 0 4 -1 0 13 9 -7 2 -7 -10 -4 -8 9 -7 -8 -3 -10 -6 -15 -15 -12 -2 -12 -4 -10 -3 -10 -5 -6 6 2 -2 9 1 3 11 12 4 2 12
6398 12 4 6 0 2 5 7 8 -1 -4 16 7 5 -12 -11 -7 -4 -13 -14 -6 -14 -10 -14 -9 9 -5 -9 -8 5 -2 -2 -6 3 0 -5 -1 -7 -9 3 -1 4 3 2 3 3 2 -6 -3 1 -11 -8 3 4
6450 4 2 -10 -10 4 -9 -6 2 -12 2 -12 -5 -4 -6 -10 -9 -8 -7 -1 2 -9 1 0 12 7 2 3 -3 -6 -5 -1 7 2 0 1 2 3 -8 12 7 -4 6 -4 -2 4 3 6 -9
6497 -9 -5 -11 -10 -9 -4 -7 -14 -4 -13 -3 -2 1 -6 -3 1 0 11 -10 3 -1 9 -2 -1 3 4 3 3 4 7 10 6 -5 14 8 -2 3 3 2 -14 -9 -6 -5 -11 -9 -11 -11 -14 -17 -10 -8
6547 -8 -4 -6 -6 -1 -12 -4 -15 -7 -3 13 2 -1 7 -2 1 0 8 -4 1 9 8 4 -1 2 -1 -8 -1 -6 -10 -12 -13 -2 -4 -6 -7 -8 -17 -1 -11 -9 -5 -14 3 -8 -10 -7 -6 6 -6
6596 -6 -6 0 -9 4 -4 -2 11 7 6 6 -1 -5 8 13 10 -6 -4 5 7 6 -7 -10 2 4 -4 -7 -2 -10 -5 -4 -6 -4 -9 3 0 0 -1 -6 -2 -12 -5 1 -10 -7 -14 7 7 9 5 6 8
6647 8 3 6 3 12 8 -6 8 2 -2 -4 5 -8 -8 -2 -6 -10 -6 -12 -5 -7 -9 -6 -5 -3 -3 -4 0 -10 -1 -7 -3 2 -4 6 -7 -1 5 1 7 3 5 -4 -11 3 11 -3 10 4 1 -2 1 -2
6699 -2 2 -7 1 2 -12 1 -11 -2 -13 -3 -12 1 -13 -4 -3 -10 -20 1 3 -9 -2 -4 6 1 0 8 -1 5 -2 4 20 8 1 11 -1 -3 13 8 0 4 -1 1 -4 -1 8
6744 8 6 -8 -2 4 -11 -7 -9 4 -6 -19 -1 2 -7 -9 -5 -9 -11 -4 10 -7 -10 7 4 2 -4 0 15 3 4 10 12 3 4 6 -4 1 -8 4 -4 1 1 0 -2 -2 -7 -8 -6 -24
6792 -24 -6 -9 -10 -8 -6 -1 -2 -7 -8 -9 -3 1 -5 -5 -3 7 -4 -4 4 16 5 11 0 3 5 4 13 7 4 -1 7 2 -1 -3 -2 4 4 -3 -7 3 -5 -11 -1 -7 -2 -5 -1 -8 -1 -2 -6 -10
6844 -10 -12 0 -7 5 0 -5 -1 2 3 5 1 8 7 14 2 -1 9 12 9 7 11 -4 0 9 4 -5 8 2 0 -11 -3 -2 -4 -5 -10 -9 -20 -4 -14 -8 1 -2 2 1 -11 1 -4 8
6892 8 10 2 12 5 -5 0 5 -1 1 15 13 -2 -9 2 -6 -6 9 0 2 2 -4 -7 -3 -5 3 0 -12 -19 -14 -16 -7 -7 4 -6 -14 4 -2 -17 6 4 4 -3 5 3 7 3 6 6 5
6941 5 -2 5 8 -4 3 14 7 -5 6 -3 -8 -9 -5 3 -13 -8 -4 -4 -4 -5 -1 -9 -11 -1 -10 -8 -3 -6 -6 -7 2 -11 2 -3 7 0 -6 2 11 9 -6 10 8 11 0 -10 12
6988 12 16 -7 -3 4 2 -5 1 -3 -3 -9 -6 -6 -11 -9 6 -3 -5 -7 -1 0 -12 -15 3 -3 -10 5 10 1 -1 -3 1 -7 -8 3 8 2 4 4 -8 2 7 2 0 -8 -7 1 -6 -6 -15 -7 -10 1
7040 1 0 0 -11 -12 -6 -5 -8 -6 -11 -12 -13 -4 -8 -13 -4 5 -11 6 8 1 1 -3 5 7 5 -2 1 7 11 11 13 1 0 5 -3 -4 -2 2 -5 -6 2 0 -7 -12 3 -13 -6 -22 -14 -4 -13 -9 -4
7093 -4 -3 -1 -9 14 1 -2 -1 4 -1 3 8 -3 7 -4 10 8 -6 7 4 2 -1 1 15 -1 13 0 5 -1 -8 -10 1 -13 -6 -11 5 -19 -17 -3 -12 -3 -10 7 -12
7136 -12 1 -4 -1 2 6 -6 4 3 2 9 5 4 1 8 5 10 4 8 -12 5 12 -1 -5 -10 0 -9 1 10 -2 -2 0 -5 2 -9 -11 -8 -5 -7 -7 -2 -7 -8 6 1 -8 4 17
7183 17 8 6 11 4 -7 1 8 13 9 17 16 14 -2 6 -1 4 -1 0 2 4 -10 5 -6 -5 -7 -4 -8 -20 -8 -5 -2 -8 -5 -7 -1 -2 2 -15 -1 4 4 2 -4 0 1 3 3 8 5 5 -4
7234 -4 4 8 3 7 6 9 -3 -4 1 1 -1 -2 1 -13 -15 -12 -5 -23 -14 -14 -17 -15 -6 5 -5 -4 -8 4 -11 -3 1 -4 -2 3 -5 5 5 6 7 5 -10 1 -2 8 5 2 5 2 -1 7
7284 7 -10 -7 -8 -3 -4 -9 -6 -15 -14 -20 -7 -4 -16 -15 -12 -13 -13 -15 -7 -6 -11 -4 -2 -3 7 8 7 -1 -2 7 2 2 3 -5 4 8 -3 0 -4 1 -2 -11 -4 -13 -10 -8 -19 -9 -5 -15 -12 -16 -12
7337 -12 -1 -19 -18 -13 -17 -13 -14 -2 -9 -5 1 -6 11 7 0 1 -5 5 8 7 0 6 22 3 1 11 4 3 5 -9 5 -6 -1 -1 -8 2 -2 -2 -7 -14 -7 5 -8 -4 -9 -9
7383 -9 -15 -12 -10 -1 -6 -4 -3 -5 -13 0 0 -5 0 -5 4 2 6 10 14 15 6 2 7 11 17 5 6 -12 -7 4 -5 4 1 -1 -7 -14 -8 -11 -10 -12 -4 -13 -9 -3 -10 -9 1 5 3 1 8 6 -1 6 5 11
7439 11 -6 6 -2 10 -3 4 8 7 -3 5 -8 -8 -8 -3 -3 -19 -3 0 -5 -14 -12 -12 -1 -3 -9 -8 -19 -6 -11 3 -1 -12 0 -3 4 4 16 0 4 6 5 4 2 12
7483 12 5 6 4 4 14 6 4 10 -6 -11 12 3 -3 -6 -4 7 0 -20 -16 -5 -1 -9 -5 -7 -16 -4 -11 -18 -7 -2 -13 0 -6 -2 1 7 -4 4 7 0 10 9 -2 3 3 6 1
7530 1 3 0 -8 0 -2 -10 -9 -17 -13 -4 -11 -3 -15 -7 -11 -8 -5 -12 -10 -15 -14 -17 -7 2 -5 -11 -10 -5 8 10 4 9 -2 -3 -5 6 3 12 5 7 -5 4 2 1 -7 -4 -5 -2 -4 -3 -3 -8 -3 -8 -4
7585 -4 -8 -10 -7 -3 -18 1 -2 -8 -4 -10 -1 5 3 2 6 2 -8 -2 -8 -9 0 2 10 11 5 15 15 3 7 4 0 5 16 -6 -9 -8 -9 -9 -11 -16 -11 -18 4 -16 -10 -14 1 -5 -15 -4
7635 -4 -11 0 -9 0 -4 -4 -2 -1 1 11 5 3 9 2 9 1 4 10 2 9 -3 0 1 -4 -2 -5 -4 -6 4 -8 -8 -5 -2 -4 -2 -11 -1 -10 -3 -9 -3 2 -12 1 0 5 4 -5 -3 6 10 4 7
7688 7 -1 11 8 -2 2 7 11 6 7 8 7 1 -5 -6 -4 1 -5 -14 -14 -4 0 -7 -16 -5 -9 -7 -3 -17 -7 -13 -7 -3 -2 -9 8 3 4 1 9 0 12 16 6 7 0 -1 8 9 3 5 6 1
7740 1 0 9 11 -5 -2 7 -10 -5 -8 -7 -6 -11 -6 -2 -12 -4 -9 -16 -12 -3 -14 -4 1 -6 -3 5 0 13 6 3 14 4 -1 -1 10 3 14 9 14 15 2 8 8 -4 -3 -2 -3 3 -4
7789 -4 -1 1 -15 -14 -8 -7 -5 -4 -10 2 -20 0 -10 -1 -8 -3 -3 -3 0 -4 3 7 0 6 0 5 -4 10 4 14 3 5 11 9 5 7 2 -7 3 4 0 -4 -4 -4 -5 1 -10 -13 -15 -10 -1
7840 -1 -2 -2 0 -5 8 -4 5 6 -3 7 2 9 -3 0 6 8 -3 -1 -2 -1 7 -1 3 -8 3 -2 -7 -5 -8 -2 -4 3 -6 3 -9 -11 -16 -7 -7 -12 -5 -7 -11 -11 -6 -7 -9 4 2 3 -12
7891 -12 -1 0 -2 -2 -8 3 4 6 6 -1 6 11 3 -5 6 0 -7 3 5 0 -1 -7 -1 -8 -7 -5 -4 -3 -11 -3 -9 -5 -21 -12 -10 -4 -1 -10 -2 1 2 -5 3 4 5 0 6 4 -2 -3 8 2 -3 1
7945 1 -1 5 -4 2 11 7 -2 2 -11 0 -2 -7 -19 -4 -6 -9 -16 -16 -2 -8 -8 -8 -2 -5 -9 -4 -6 -3 3 -10 3 -9 -2 5 5 11 -1 -4 9 5 20 6 6 -7 0 4 5 8
7993 8 1 0 -2 -2 -6 -7 -8 -4 -10 -10 0 -1 -12 -16 -8 -12 -15 -8 -15 -6 -9 -1 -13 -1 -6 -3 -4 -5 -8 1 4 5 -1 17 -3 -3 4 5 3 -11 -6 2 0 -6 -9 -16 -7 -19 -5 -12 -20 -25
8045 -25 -9 -3 -18 -12 -13 -11 -10 -14 -10 -12 -8 -2 -3 -7 -4 11 -3 -6 2 4 0 -7 -1 6 1 -3 -2 -6 -4 -2 -4 -2 -7 -13 -8 -8 -12 -7 -11 -4 -12 -20 -3 -18 -1 -6 -12 -8 -15 -13 -12 -3 -1
8098 -1 -4 -6 -1 3 -5 -8 -9 -2 -8 0 3 0 11 2 6 7 14 6 1 6 -2 -9 -7 -5 -8 -10 -1 -12 -6 -1 -6 -2 -5 -2 -8 -3 -9 -8 -12 -11 -8 -6 -6 -1 -3 9 -2 -5 8 8 14 -5 5 3
8152 3 1 2 1 8 -2 2 0 1 -1 7 -5 0 -4 -10 -11 -8 -16 -3 -6 -12 -8 -8 -1 -14 -9 -14 -9 -16 0 -6 -4 4 -1 3 -7 -5 8 0 3
8191C
$$ Imaginary data points
##PAGE= N=2
##DATA TABLE= (X++(I..I)), XYDATA
0 0 0 0 0 0 0 0 0 0 0 0 0 -8 8 -8 8 -16 16 -24 24 -32 40 -46 50 -64 72 -88 97 -113 134 -152 174 -199 225
33 225 -257 289 -321 365 -409 456 -509 566 -631 697 -775 855 -945 1041 -1151 1266 -1397
50 -1397 1537 -1696 1866 -2059 2276 -2521 2794 -3112 3481 -3913 4431 -5065 5860 -6892 8289
65 8289 -10297 13442 -19090 32317 -126285 40055 280953 -138405 -201883 133839 205076
76 205076 -193227 -160586 231298 102530 -246170 -42530 236011 9437 -251553 55530
86 55530 235068 -111990 -194884 142091 158024 -158938 -137928 197766 92151 -221365 -34686
97 -34686 217860 -10882 -204871 44981 199028 -89424 -179604 130806 145733 -157424 -108603
108 -108603 173069 73646 -187001 -34343 194075 -7821 -190247 48303 175326 -82988
118 -82988 -154655 113285 129597 -140169 -97720 158197 61720 -164867 -29014 168251 -4573
129 -4573 -168858 44142 155635 -78571 -130792 99287 108245 -116685 -86501 136277 55863
140 55863 -147403 -21514 146943 -8326 -142424 37526 133098 -66458 -114997 87835
150 87835 94838 -103513 -75715 120449 49795 -132377 -17310 131858 -10715 -125489 33898
161 33898 118823 -58819 -105867 81890 85549 -97355 -64303 108700 41917 -117359 -15766
172 -15766 118636 -9782 -113594 32040 105808 -54029 -93141 73850 74586 -87026 -55145
183 -55145 95340 36168 -101964 -14705 104705 -8654 -101429 30611 92743 -49595 -79542
194 -79542 64501 64117 -75204 -49008 84675 32636 -92602 -11876 94529 -10045 -89322
205 -89322 28637 81460 -44236 -72029 58439 59508 -69821 -44601 78558 28127 -85199
216 -85199 -8994 86619 -10609 -81477 26548 73819 -40027 -65971 53883 54805 -66109 -39471
228 -39471 73053 22973 -75693 -7126 76131 -8742 -73854 24200 67865 -37920 -58634 49475
240 49475 47187 -58805 -34096 65369 20155 -68547 -5982 68838 -8237 -66679 22751 61536
252 61536 -36339 -52667 46727 41660 -53523 -30720 59259 19054 -64389 -4714 65564 -10294
264 -10294 -61573 22693 55385 -33265 -48406 43426 39066 -51378 -27928 56218 16479 -59544
276 -59544 -3584 60397 -10577 -56524 22187 50086 -30547 -44079 39127 36506 -47866 -25197
288 -25197 52904 12973 -53911 -2244 53531 -8458 -51682 19691 46862 -29408 -40006 36950
300 36950 32325 -43444 -23038 48370 12021 -50215 -1171 49463 -8456 -47477 18016 43842
312 43842 -27703 -37345 35697 28861 -40709 -20343 44095 11798 -46842 -1613 47273 -9276
324 -9276 -44127 18239 39337 -25340 -34282 32384 27413 -38483 -18406 41547 9484 -42674 -1127
337 -1127 42950 -8278 -40804 17324 35816 -23975 -30554 29437 25070 -35159 -17220 38948 7908
350 7908 -39415 227 38575 -7515 -37228 15406 33808 -22765 -28294 28290 22124 -32514 -15268
363 -15268 35564 7489 -36598 307 35960 -7543 -34285 14672 31037 -21231 -26092 26413
375 26413 20173 -30289 -13660 32819 6664 -33768 273 33397 -7139 -31855 14053 28448
387 28448 -20097 -23552 24369 18347 -27720 -12783 30535 6039 -31636 1010 30674 -7107
399 -7107 -28875 12773 26308 -18519 -22024 23126 16612 -25967 -11266 27970 5605 -29240 905
412 905 28653 -7137 -26475 12181 23866 -16886 -20498 21492 15500 -24620 -9770 25953 4561
425 4561 -26589 654 26632 -6508 -25041 11970 21966 -16229 -18443 19815 14352 -22853 -9248
438 -9248 24558 3891 -24910 1091 24630 -6159 -23385 11309 20600 -15608 -16908 18714 13003
451 13003 -21254 -8649 23057 3611 -23598 1457 22950 -6158 -21473 10573 19084 -14472
463 -14472 -15807 17594 12033 -19964 -7759 21456 3127 -21831 1458 21278 -5803 -19946
475 -19946 9962 17721 -13619 -14645 16505 11108 -18711 -7140 20137 2796 -20496 1546 19907
488 19907 -5575 -18660 9446 16663 -13021 -13759 15805 10189 -17679 -6437 18860 2526 -19346
501 -19346 1557 18890 -5548 -17486 9105 15389 -12225 -12740 14836 9513 -16673 -5888 17633
514 17633 2181 -17894 1524 17522 -5230 -16322 8673 14222 -11482 -11610 13706 8732 -15493
527 -15493 -5458 16618 1878 -16765 1653 16198 -4959 -15085 8168 13302 -10925 -10821 12983
540 12983 8058 -14506 -4999 15575 1609 -15801 1729 15215 -4769 -14100 7686 12416 -10355
553 -10355 -10059 12307 7389 -13619 -4610 14490 1502 -14715 1731 14113 -4597 -13017 7112
566 7112 11540 -9516 -9389 11501 6747 -12688 -4089 13360 1432 -13621 1493 13198 -4369
579 -4369 -12005 6775 10512 -8786 -8737 10627 6411 -11943 -3679 12492 1074 -12570 1420 12303
593 12303 -4029 -11340 6490 9737 -8398 -7911 9908 5898 -11154 -3488 11826 830 -11738
606 -11738 1600 11281 -3818 -10536 6081 9157 -8015 -7231 9337 5246 -10311 -3170 11021
619 11021 764 -11058 1674 10461 -3752 -9612 5697 8465 -7529 -6703 8866 4704 -9613
632 -9613 -2753 10173 644 -10324 1642 9798 -3689 -8866 5407 7721 -7028 -6220 8339 4316
646 4316 -9109 -2350 9443 452 -9520 1580 9170 -3569 -8257 5246 7064 -6610 -5691 7831
660 7831 4004 -8660 -2060 8948 188 -8870 1632 8515 -3427 -7739 5054 6585 -6380 -5213
674 -5213 7447 3606 -8158 -1838 8448 15 -8348 1729 7887 -3352 -7109 4783 6077 -6033
688 -6033 -4793 7015 3234 -7623 -1559 7828 -62 -7744 1677 7354 -3231 -6555 4567 5527
702 5527 -5627 -4363 6552 2956 -7189 -1344 7374 -236 -7249 1720 6867 -3182 -6188 4481
716 4481 5140 -5513 -3964 6295 2653 -6878 -1149 7080 -394 -6898 1794 6485 -3155 -5801 4385
731 4385 4772 -5296 -3608 5953 2411 -6457 -981 6623 -454 -6382 1718 5982 -2901 -5372 4075
746 4075 4405 -4938 -3269 5479 2168 -5900 -954 6124 -420 -5958 1684 5509 -2745 -4976 3799
761 3799 4165 -4742 -3062 5313 1902 -5626 -782 5819 -434 -5750 1729 5298 -2809 -4624 3723
776 3723 3884 -4536 -2894 5152 1737 -5431 -566 5478 -520 -5337 1631 4950 -2660 -4285 3498
791 3498 3504 -4155 -2628 4660 1640 -4976 -555 5002 -500 -4804 1469 4475 -2367 -3946 3213 3219 -3868
808 -3868 -2367 4305 1479 -4615 -509 4742 -541 -4561 1521 4194 -2343 -3703 3140 3047 -3798 -2186
824 -2186 4238 1289 -4445 -386 4538 -570 -4382 1548 3981 -2322 -3435 2978 2841 -3553 -2064
839 -2064 3964 1189 -4118 -342 4128 -465 -4014 1338 3672 -2097 -3154 2666 2590 -3166 -1965 3602
855 3602 1150 -3807 -319 3808 -440 -3707 1219 3473 -2004 -3000 2619 2411 -3064 -1807 3492 1078
871 1078 -3743 -243 3750 -580 -3569 1283 3317 -1987 -2900 2623 2293 -3069 -1650 3336 962 -3543
887 -3543 -231 3563 -559 -3391 1249 3056 -1847 -2660 2347 2160 -2789 -1558 3076 885 -3228 -231
903 -231 3230 -458 -3130 1115 2855 -1728 -2461 2218 1977 -2620 -1453 2940 821 -3115 -115 3129
919 3129 -552 -2988 1164 2756 -1755 -2382 2268 1861 -2647 -1309 2890 687 -3045 -56 3022 -600
935 -600 -2864 1179 2604 -1707 -2224 2155 1748 -2474 -1213 2686 661 -2822 -65 2813 -523 -2631
951 -2631 1058 2393 -1531 -2066 1972 1638 -2298 -1117 2498 612 -2627 -65 2652 -526 -2513 1077
967 1077 2263 -1530 -1940 1923 1540 -2270 -1044 2495 473 -2573 34 2548 -563 -2442 1089 2183
983 2183 -1560 -1820 1887 1409 -2158 -970 2370 472 -2444 70 2377 -562 -2230 984 2022 -1391
999 -1391 -1709 1745 1316 -1987 -895 2145 452 -2239 11 2218 -500 -2091 923 1856 -1302 -1586
1015 -1586 1609 1233 -1901 -856 2060 369 -2119 71 2077 -479 -1987 907 1791 -1284 -1476 1573
1031 1573 1142 -1779 -791 1959 371 -2030 92 1957 -478 -1820 845 1678 -1174 -1406 1476 1058
1047 1058 -1674 -706 1776 341 -1862 41 1838 -450 -1713 792 1516 -1081 -1302 1342 1022 -1576
1063 -1576 -648 1694 299 -1710 57 1713 -411 -1606 766 1435 -1052 -1181 1280 925 -1466 -620
1079 -620 1602 272 -1639 101 1599 -410 -1488 711 1344 -994 -1130 1211 857 -1380 -556 1497
1095 1497 238 -1543 94 1506 -407 -1417 701 1249 -964 -1029 1158 794 -1330 -513 1447 191
1111 191 -1467 129 1420 -411 -1322 685 1191 -927 -980 1130 730 -1268 -446 1346 189 -1379 103
1128 103 1355 -410 -1244 635 1069 -858 -925 1048 696 -1213 -415 1274 131 -1293 107 1275 -389
1145 -389 -1210 665 1034 -865 -834 1019 641 -1155 -394 1265 113 -1261 163 1219 -400 -1142 652
1162 652 993 -865 -801 1030 571 -1118 -346 1191 102 -1218 156 1156 -406 -1067 611 921 -780
1179 -780 -767 935 563 -1062 -322 1097 99 -1103 129 1082 -344 -997 574 880 -746 -710 897 532
1197 532 -1007 -308 1094 70 -1084 171 1038 -372 -958 581 837 -770 -671 901 474 -997 -267
1214 -267 1041 60 -1041 167 985 -368 -910 545 793 -712 -628 828 449 -909 -268 951 72
1231 72 -945 126 914 -311 -850 481 743 -624 -602 757 442 -822 -252 883 76 -898 125 878
1249 878 -308 -800 479 681 -626 -543 757 386 -823 -227 864 43 -882 174 832 -333 -746 480
1267 480 654 -603 -523 710 364 -785 -192 813 32 -799 118 771 -276 -702 424 611 -532 -498
1285 -498 624 373 -697 -215 739 47 -742 99 698 -248 -667 381 575 -512 -462 606 310 -683 -190
1304 -190 706 30 -722 123 685 -270 -624 401 541 -530 -434 597 285 -661 -149 682 16 -684 117
1323 117 656 -260 -594 372 502 -480 -405 539 300 -612 -161 620 21 -622 93 593 -226 -566 334 475
1343 475 -445 -377 504 261 -559 -168 612 11 -618 126 561 -246 -522 337 448 -449 -349 533 236 -579
1363 -579 -112 582 -11 -597 149 561 -264 -498 359 416 -433 -329 507 233 -575 -103 567 -27 -551 109
1383 109 509 -225 -496 320 403 -418 -330 462 200 -504 -113 521 4 -550 119 505 -232 -443 315 395 -410
1404 -410 -315 479 203 -516 -79 514 -14 -521 116 514 -244 -450 330 360 -399 -283 449 189 -505 -92 510
1425 510 -37 -503 112 464 -223 -437 302 360 -380 -280 416 179 -449 -100 481 9 -496 104 455 -209
1445 -209 -386 275 338 -328 -284 393 191 -435 -92 439 14 -444 87 433 -192 -385 264 310 -306 -263 368
1466 368 185 -429 -94 435 -15 -421 79 400 -163 -364 249 310 -315 -245 356 170 -393 -90 415 -11 -404
1487 -404 75 373 -150 -363 222 304 -290 -245 331 163 -371 -93 372 5 -377 52 370 -135 -352 203 296
1508 296 -271 -225 310 152 -331 -106 344 26 -361 51 348 -128 -319 196 273 -253 -222 283 163 -326 -85
1529 -85 344 26 -336 66 339 -138 -292 202 264 -230 -192 273 150 -310 -92 335 18 -314 57 296 -115
1550 -115 -282 162 247 -216 -199 251 149 -283 -103 300 18 -313 31 274 -92 -259 138 244 -198 -204 246
1571 246 132 -270 -96 277 37 -293 47 271 -105 -245 146 224 -205 -177 247 117 -259 -45 265 6 -269
1592 -269 45 260 -98 -240 149 190 -189 -175 232 114 -248 -62 247 27 -246 26 253 -80 -225 130 193
1613 193 -161 -169 188 139 -211 -86 245 37 -242 12 243 -65 -229 117 193 -165 -152 186 122 -218 -78 242
1635 242 20 -254 36 245 -85 -212 128 191 -167 -148 189 110 -217 -75 240 28 -245 26 233 -69 -212
1656 -212 98 196 -128 -175 179 139 -192 -87 218 52 -220 -20 229 -40 -220 97 195 -122 -174 165 137 -205
1678 -205 -98 221 29 -212 8 217 -55 -216 100 180 -136 -142 172 122 -199 -65 224 16 -208 24 212
1699 212 -55 -194 106 184 -130 -138 150 113 -170 -102 193 57 -201 1 209 -45 -197 79 193 -110 -159 147
1721 147 119 -172 -91 187 39 -206 -13 207 -52 -184 83 172 -122 -143 149 110 -173 -57 185 29 -192 29
1743 29 188 -66 -170 100 152 -123 -129 157 99 -175 -66 178 21 -190 8 167 -40 -178 87 159 -98 -129
1765 -129 133 95 -160 -73 169 23 -172 4 169 -29 -167 80 138 -107 -129 137 87 -145 -61 161 5 -183
1787 -183 25 160 -57 -146 99 123 -123 -97 152 59 -156 -30 176 -7 -167 30 153 -76 -144 98 123 -114
1809 -114 -104 116 70 -155 -49 150 12 -162 22 163 -57 -136 86 116 -115 -107 135 72 -158 -29 159 -5
1831 -5 -148 39 141 -61 -132 105 97 -135 -83 137 44 -163 -22 157 -19 -150 54 139 -83 -133 111 101 -129
1854 -129 -72 141 43 -149 -24 149 -11 -155 45 140 -76 -128 96 117 -128 -84 138 47 -156 -21 144 -23
1876 -23 -155 49 148 -79 -122 115 90 -131 -79 133 38 -161 -17 143 -20 -147 52 146 -95 -120 102 100 -127
1899 -127 -64 137 27 -159 -4 154 -20 -148 63 137 -75 -127 93 102 -128 -66 132 44 -152 -1 154 -15
1921 -15 -155 47 130 -74 -124 105 100 -129 -85 136 30 -154 -18 130 -21 -152 48 128 -72 -108 102 98 -121
1944 -121 -70 137 37 -147 0 141 -18 -138 51 134 -78 -117 90 99 -114 -77 126 43 -138 -8 133 -10
1966 -10 -144 42 121 -75 -122 89 93 -108 -80 114 52 -129 -7 133 -13 -135 43 122 -59 -106 94 88 -104 -75
1990 -75 121 59 -118 -17 142 -9 -128 34 119 -55 -112 82 90 -105 -66 114 42 -120 -34 124 -1 -130 41
2013 41 109 -56 -111 69 88 -98 -75 108 54 -116 -24 123 2 -113 33 114 -49 -102 75 84 -78 -76 95 42 -125
2038 -125 -15 124 -7 -121 21 112 -53 -102 64 80 -94 -69 97 47 -111 -22 111 -5 -100 16 103 -50 -94
2061 -94 54 82 -88 -71 97 49 -104 -15 101 -8 -95 21 113 -45 -93 60 83 -75 -56 95 45 -97 -20 101
2085 101 0 -109 27 99 -40 -102 48 84 -85 -70 91 47 -99 -36 102 0 -110 15 95 -36 -93 51 75
2108 75 -77 -64 86 45 -86 -24 102 -2 -107 16 94 -37 -89 55 71 -58 -67 84 41 -86 -26 83 5 -103
2132 -103 15 92 -41 -96 34 77 -67 -63 77 48 -101 -38 88 11 -90 11 81 -28 -86 53 77 -70 -57 75
2156 75 51 -84 -32 97 9 -95 15 90 -15 -84 33 73 -50 -59 67 39 -79 -46 87 8 -94 -2 78 -32 -83
2181 -83 27 79 -50 -62 58 41 -83 -42 77 16 -78 -7 77 -8 -70 36 74 -45 -61 57 41 -68 -33 65 19 -83
2207 -83 -6 78 -17 -77 28 63 -30 -67 50 56 -69 -41 72 18 -77 -11 68 -24 -79 12 52 -34 -57 45 46 -61 -48 65
2235 65 26 -66 3 59 -13 -67 10 66 -30 -58 46 48 -49 -32 61 21 -60 -16 68 -7 -70 22 79 -25 -58 37 40 -56 -34 60
2265 60 30 -71 -7 63 -9 -60 16 59 -31 -62 40 56 -48 -31 52 21 -59 -7 67 -14 -64 16 69 -31 -57 48 40 -62
2293 -62 -33 65 22 -68 -8 64 -4 -73 18 50 -40 -70 30 46 -54 -49 59 24 -63 -6 69 -2 -64 17 65 -29 -76 49 50
2322 50 -47 -37 57 31 -61 -11 69 -6 -71 30 70 -39 -60 34 55 -65 -43 64 31 -70 -18 72 -5 -76 12 59 -29 -63
2350 -63 30 42 -43 -56 64 33 -57 -9 64 7 -63 6 72 -13 -58 42 71 -38 -54 60 42 -67 -25 68 7 -71 8 68
2378 68 -26 -69 31 52 -55 -57 34 49 -54 -41 61 22 -65 -15 66 -8 -79 13 59 -36 -64 38 57 -51 -43 45 30 -62
2406 -62 -13 63 8 -67 2 65 -19 -56 28 58 -51 -46 59 28 -67 -26 68 8 -75 -10 60 -22 -76 25 60 -51 -59 57 40
2435 40 -55 -29 61 17 -75 -11 66 -8 -74 20 66 -41 -61 51 46 -51 -43 66 23 -71 -5 79 6 -76 25 65 -39 -67 33
2464 33 50 -53 -47 58 30 -74 -12 74 -6 -77 15 69 -34 -67 47 57 -58 -50 67 42 -77 -14 69 -7 -77 20 82
2491 82 -31 -61 48 54 -60 -39 65 39 -68 -10 75 -1 -75 14 70 -39 -63 46 53 -55 -48 71 21 -75 -16 73 -2
2518 -2 -77 6 68 -41 -66 46 45 -63 -39 66 29 -65 0 83 2 -70 25 77 -33 -55 60 49 -52 -30 78 15 -78
2545 -78 -6 72 -22 -78 24 55 -43 -57 50 49 -66 -24 75 15 -69 -11 60 -18 -71 21 61 -52 -50 57 45 -65 -24 75
2573 75 9 -69 7 74 -20 -64 39 67 -48 -56 47 47 -69 -27 79 17 -67 5 71 -39 -71 32 47 -50 -47 52 33 -62
2601 -62 -30 66 2 -71 0 59 -29 -73 33 69 -39 -35 61 20 -57 -17 78 10 -62 21 73 -22 -63 42 48 -49 -33 64 27 -63
2631 -63 -18 65 9 -69 8 45 -21 -59 38 59 -51 -36 57 34 -53 -16 61 17 -65 6 59 -11 -56 37 48 -32 -41 54 43 -58
2661 -58 -4 59 4 -51 3 54 -4 -42 39 32 -38 -43 53 23 -53 -8 45 10 -70 -1 49 -14 -41 27 38 -39 -35 40 36 -42 -14 50
2693 50 7 -45 18 48 -12 -45 30 40 -16 -21 35 26 -38 -10 58 8 -42 14 40 -19 -38 19 29 -38 -42 24 20 -34 -10 48 -6 -43
2725 -43 7 44 -20 -43 22 28 -32 -21 41 22 -53 -7 48 -7 -40 15 39 -16 -36 23 32 -34 -24 49 18 -47 -11 47 1 -39 13
2756 13 35 -21 -31 21 30 -26 -32 36 20 -37 -15 37 -7 -40 8 40 -12 -29 26 21 -30 -28 43 13 -32 -9 39 2 -40 16 41 -20
2788 -20 -28 34 30 -36 -29 37 11 -40 0 34 -8 -50 13 39 -33 -35 28 30 -35 -30 27 20 -61 -11 47 5 -43 13 35 -20 -31 27 34 -35
2822 -35 -20 33 12 -42 -6 33 2 -35 5 42 -23 -31 20 37 -37 -17 42 26 -41 -18 41 -3 -44 10 36 -22 -41 24 30 -29 -17
2853 -17 33 7 -36 -17 35 -8 -41 19 37 -18 -22 36 41 -27 -18 38 11 -34 -10 44 2 -44 16 37 -14 -32 17 26 -24 -15 32 15 -38
2886 -38 -12 28 1 -45 6 27 -12 -25 23 26 -30 -31 24 16 -32 0 29 3 -21 7 43 -11 -31 25 24 -22 -18 20 21 -24 -3 31 4
2919 4 -35 4 36 -8 -37 11 22 -33 -25 29 11 -29 -21 12 3 -24 -1 24 -17 -19 11 19 -14 -26 24 10 -11 0 32 5 -19 -4 24
2952 24 -7 -18 4 24 -12 -9 11 20 -13 -8 24 9 -18 1 16 -9 -19 3 17 -11 -14 8 21 -25 -7 13 5 -27 -6 18 -4 -18 17
2985 17 26 -6 -8 20 18 -19 -7 24 -1 -14 -9 22 7 -13 12 15 -19 -5 13 13 -7 -11 29 1 -31 -11 23 -2 -15 10 24 -9 -32 3
3019 3 25 -20 -12 31 7 -24 -9 22 -4 -22 8 26 -5 -16 25 20 -17 -20 26 14 -7 -3 33 3 -19 -2 32 -8 -27 3 15 -19 -16
3052 -16 13 4 -33 3 20 -2 -37 -6 27 1 -24 17 18 -20 -14 24 9 -23 -8 23 -4 -24 3 27 -5 -18 10 28 -15 -17 22 8
3084 8 -27 -10 33 6 -32 -11 30 -9 -28 7 22 -15 -23 20 7 -21 -20 28 -8 -32 -3 17 -5 -7 12 14 -12 -16 14 31 -10 -18 31 8
3118 8 -28 -1 27 1 -24 7 20 -18 -5 9 3 -29 -17 11 -1 -32 -6 17 -11 -24 -9 10 -15 -21 13 0 -19 -12 12 -7 -19 -2
3150 -2 17 -5 -16 15 27 -7 -8 18 12 -18 -10 18 12 -19 -9 15 -2 -18 7 14 -24 -20 5 13 -11 -13 17 4 -20 1 21 -10 -18 12 3 -18
3186 -18 -15 4 -5 -18 -3 8 11 -22 -1 9 -10 -6 1 5 -7 0 6 0 -9 4 10 2 -5 7 5 1 -7 5 5 -9 -10 7 -1 -10 -4 0 -8 -18 -4 1 -3 -12 12
3229 12 7 -11 -20 7 -2 -11 0 9 10 1 2 6 -4 -6 4 5 -4 3 11 6 0 0 8 -4 -1 2 9 -9 -5 2 6 -12 -8 -7 -1 -11 -19 -9 8 -9 -12 -7 8 -19 1
3274 1 10 -4 -14 7 9 1 -3 0 10 -13 -6 7 10 -4 4 -1 12 3 -5 11 4 -4 -4 1 4 -12 4 8 5 -13 -15 3 -11 -13 6 3 -14 -8 2 2 -13 1
3316 1 14 5 0 0 4 -12 -4 18 10 -3 5 24 -3 -18 -2 21 1 -17 0 22 7 0 5 4 -14 -14 11 5 -18 -4 10 -5 -20 5 9 -12 -10 16
3354 16 10 -7 -7 7 3 -18 -10 22 0 -6 3 24 -7 -15 12 17 -12 -17 27 9 -18 -7 13 10 -9 6 21 -17 -18 13 12 -22 -12 21 7 -22
3390 -22 -12 6 -7 -23 8 29 -6 -23 14 13 -16 -12 20 7 -14 -2 21 7 -16 8 27 -7 -10 15 21 -22 -12 14 8 -30 -16 26 6
3423 6 -19 -1 18 -16 -23 5 18 -22 -29 6 15 -42 -12 25 -1 -20 0 24 -18 -24 11 25 -24 -22 20 8 -21 -5 31 10 -21 9 26
3456 26 -4 -28 7 19 -30 -24 28 6 -37 -15 28 2 -30 3 27 -14 -36 9 16 -26 -27 16 14 -39 -11 26 -3 -28 -3 22 -13 -30
3488 -30 17 22 -22 -18 27 14 -34 -16 27 2 -21 13 38 -9 -27 12 16 -38 -36 26 20 -41 -6 30 5 -31 4 33 -16 -33 14 24 -36
3521 -36 -27 17 18 -44 -6 22 1 -30 2 37 -3 -26 15 28 -16 -27 31 27 -22 -10 29 11 -31 -4 25 -15 -42 27 28 -15 -28 30
3553 30 20 -37 -17 43 -1 -44 -5 29 -9 -36 13 27 -39 -33 26 17 -25 -30 41 9 -30 0 37 2 -37 7 23 -18 -31 26 32 -37
3585 -37 -23 37 16 -33 -3 36 -10 -41 14 30 -22 -39 22 24 -42 -23 31 15 -42 -20 25 -7 -44 15 43 -20 -31 22 30 -31 -15
3616 -15 34 12 -41 -14 41 -4 -50 5 51 -14 -29 18 28 -27 -25 28 13 -45 -24 34 -4 -45 2 32 -19 -34 20 26 -37 -33 32 11
3648 11 -31 -12 44 0 -48 -7 41 -16 -33 15 37 -23 -21 35 27 -33 -11 43 3 -33 8 35 -11 -31 19 22 -19 -35 23 7 -47 -19
3680 -19 34 -2 -33 3 33 -10 -32 26 37 -27 -26 27 15 -31 -13 42 8 -35 0 26 -6 -31 23 27 -18 -16 22 14 -27 -1 40 7
3712 7 -26 9 38 -5 -32 13 26 -24 -14 24 8 -35 -12 37 5 -35 -2 35 -5 -30 17 29 -29 -18 31 19 -25 3 34 12 -28
3743 -28 17 28 -11 -14 26 27 -20 -16 31 11 -35 -8 37 3 -32 3 28 -18 -25 8 18 -31 -14 26 13 -23 -17 16 -15 -41 4 28 -11
3776 -11 -32 12 22 -27 -16 21 7 -27 3 30 -3 -32 11 20 -18 -22 24 10 -22 -17 19 2 -35 -1 29 -5 -39 15 19 -19 -16 12 14
3809 14 -33 -16 29 16 -30 8 36 0 -23 0 28 -16 -25 18 19 -26 -21 25 16 -27 -8 31 2 -22 14 32 -24 -26 7 20 -21 -18 31
3842 31 13 -39 -9 26 -8 -33 5 25 -23 -35 14 20 -24 -18 29 21 -28 2 26 1 -38 10 36 -17 -30 25 27 -23 -7 34 22 -29
3874 -29 14 36 7 -26 3 36 -16 -23 20 24 -24 -18 30 5 -35 2 24 -1 -32 -3 28 -24 -38 14 10 -25 -20 24 15 -27 -6 15 -6
3907 -6 -27 6 30 -8 -19 19 17 -9 -12 33 17 -24 -8 35 7 -29 6 23 -15 -13 23 26 -19 -17 23 13 -26 -12 27 -3 -28 1 28
3940 28 -7 -30 15 22 -9 -5 25 18 -21 -10 37 12 -22 17 32 1 -22 21 21 -23 -18 22 15 -16 -11 19 1 -30 4 28 -9 -25 7 10
3974 10 -19 -25 14 10 -19 -12 21 0 -32 -4 14 -6 -24 12 15 -18 -16 19 22 -20 -10 16 14 -21 7 31 1 -16 15 23 -7 -9 19 15 -14
4009 -14 -7 17 4 -22 -6 23 -9 -16 12 20 -16 -25 19 14 -15 -11 27 11 -19 8 28 1 -12 11 26 -8 -19 14 23 -16 -11 25 -5 -26
4043 -26 8 30 3 -24 12 29 -17 -22 10 8 -24 -15 32 -5 -25 3 21 -10 -32 3 16 -19 -20 27 17 -10 -9 30 7 -15 15 27 5
4076 5 -12 10 19 -4 -9 26 18 -18 -15 23 -2 -16 0 15 -1 -25 -6 14 -19 -19 14 10 -23 -25 20 -3 -27 -1 25 -3 -17 5 22 -14
4110 -14 -13 21 12 -18 1 31 8 -7 4 13 -3 -8 10 12 -13 -13 12 11 -4 -8 22 2 -20 -5 8 -8 -26 0 24 -5 -25 1 -2 -14 -5
4145 -5 19 4 -13 -2 17 -6 -20 12 14 -13 -9 9 0 -1 -6 25 15 -2 2 24 -7 -15 9 18 -8 -5 17 17 -15 -9 14 -5 -7 4 7 -3 -21
4182 -21 -3 -4 -7 -14 1 2 1 -4 13 6 -17 9 16 -6 -13 9 10 -8 -6 1 2 -7 11 13 -4 -11 -3 1 -2 -13 2 6 -10 -14 6 2 -13 -8 0 -6 -14 -1 11
4225 11 -5 -21 -14 -4 -10 -2 3 -5 -9 -8 4 1 -4 4 17 9 -6 12 8 -1 1 6 -3 -2 -5 18 0 -11 -4 7 1 -11 3 9 -13 -4 13 -6 -11 0 4 -8
4267 -8 -10 -4 0 -8 -17 2 8 -5 -1 19 4 -9 2 12 2 -5 6 5 6 0 7 7 5 -3 12 14 0 0 14 14 -12 10 7 -5 -6 3 2 -12 -13 4 4 -20 4
4310 4 1 -9 -11 5 1 -14 -7 9 8 -6 -11 22 15 -15 14 19 6 -10 0 9 1 -3 19 3 -12 -6 23 3 -3 10 12 -8 -2 16 23 -8 -9 11 11 -15
4350 -15 0 8 4 -14 5 8 2 -7 0 12 -9 8 17 -6 -8 -2 18 16 -16 17 24 -7 1 5 16 2 -4 14 8 -8 5 13 -10 -11 5 28 2 -16 2
4389 2 9 -12 -11 10 10 -17 -12 5 8 -16 -3 16 0 -20 3 22 -11 -11 27 11 -4 -5 17 13 -13 13 20 -4 -12 15 11 1 -2 16 10 -16 1
4426 1 7 4 -18 2 3 -2 -8 5 14 -10 -6 7 0 -5 2 17 6 -19 1 19 -2 -14 1 21 9 -3 8 12 -9 -4 9 10 -11 0 20 6 -13
4463 -13 5 25 -4 -18 17 9 -14 -12 19 8 -9 -11 10 8 -9 15 19 14 -11 10 14 -15 -10 26 13 -12 -3 18 2 -17 0 9 4 0 15 10 3
4500 3 -3 13 15 -4 0 20 15 -22 9 9 -7 -9 5 9 -11 -23 0 6 -24 -17 10 5 -25 0 13 4 -2 -3 6 -6 -15 12 8 -14 -6 14 9 -13 3 22
4540 22 0 -6 -1 19 4 -12 6 12 -1 -4 0 20 -9 -12 16 -6 -3 2 15 -5 -10 3 13 -2 -23 18 7 -14 -11 9 -1 -13 -16 7 -3 -15
4576 -15 10 19 4 -10 21 14 -6 -5 1 6 -20 -6 2 5 -11 5 8 4 -6 9 9 -7 -8 2 -5 -12 -10 7 -8 -17 5 13 2 -20 2 9 -8 -5 14
4615 14 -2 -11 -13 13 3 -8 4 7 -2 -12 6 7 -6 0 0 -9 -4 -6 0 1 -4 -2 3 -8 -7 -3 7 -17 -15 -3 -6 -10 -11 6 1 -9 2 13 -4 -14 8
4656 8 9 -1 0 4 3 1 -1 0 6 -1 7 7 2 -4 4 4 1 -10 7 -4 -4 -8 6 -4 -7 -12 0 -9 -20 6 -3 -14 -1 -2 8 1 -12 4 -4 -2 3 17 8 10 8 5
4702 5 7 -8 -3 19 1 -5 4 4 10 0 5 7 5 3 -7 -8 7 -12 -3 7 -3 11 4 -4 -12 1 4 -9 -3 1 -2 -4 -9 4 1 -5 1 12 -2 -8 0 -7 -8 -7 9
4747 9 -5 3 4 10 4 -4 -3 5 -3 -9 4 -7 3 -3 -10 -3 -10 -10 8 3 -4 5 -3 0 5 1 0 -15 1 6 3 -4 4 1 10 10 3 9 0 -6 1 5 1 5 1 1 0 5 9 6 2 -1 -4 -13
4801 -13 -9 5 9 1 -3 -2 -11 -4 1 6 0 -8 2 3 -6 -4 1 0 0 3 0 -6 -9 3 13 6 3 2 9 7 2 -3 1 -3 1 0 4 15 6 -2 5 -2 -2 7 -2 -5 2 -8 -10 4 -7 -9
4853 -9 -7 2 -7 -11 3 4 5 -11 1 3 16 9 -1 9 1 11 4 3 6 9 -1 -6 0 12 -7 4 -2 4 2 -7 1 6 0 -7 3 -3 -2 -11 -3 -6 -8 -6 -3 -10 -6 6 2 -9
4901 -9 -6 5 -7 -6 -5 -2 15 -4 -4 3 -7 0 5 12 -5 -5 9 6 -5 6 11 5 -1 -5 3 6 -6 4 -4 -1 -6 8 -4 -12 -12 -3 -5 -14 -5 7 -6 -2 0 5 -7
4946 -7 2 0 -9 0 -1 -7 -2 -1 10 1 7 0 7 6 -9 -8 12 1 -1 6 -2 -7 -13 0 2 -2 1 -1 -4 -11 -12 -4 -11 -16 -16 0 -10 -15 -8 -10 -8 -4 3 6 -18 -1 5 12 8 -8 8
4997 8 -1 0 -2 -2 -6 -6 1 -1 -11 -7 4 -2 -7 -3 -1 -6 -7 -7 -2 -12 6 -6 3 -13 2 -12 -3 -6 -7 -1 -6 -4 4 4 -4 -1 -2 -3 -12 1 3 -5 -6 -4 11 9 -7 -1 8 10
5047 10 -11 4 -1 -11 -3 8 -3 -11 -8 6 -3 2 9 0 -7 -11 -1 -4 -3 -9 2 5 -9 4 4 6 0 5 8 -3 -2 9 20 5 2 15 9 0 12 25 -1 -4
5089 -4 7 5 1 -2 14 2 -4 -15 6 3 -8 1 12 1 -4 5 16 -4 -9 11 -3 2 5 9 10 -3 -3 16 -4 1 4 12 1 -1 7 14 -2 -6 5 12 -1 7
5131 7 14 15 -14 -3 9 2 4 -3 6 1 -6 11 -7 -9 0 8 -5 -4 4 17 10 -8 -6 9 1 4 14 12 2 5 21 10 -6 -2 2 13 2 14 15 -3 16 19
5173 19 9 7 -7 7 11 -9 2 9 1 -2 2 7 -1 -10 10 17 -13 -4 10 5 -10 7 15 -3 -10 17 26 1 5 11 8 3 6 19 2 6 2 19 9 -10 11
5214 11 18 -2 -5 3 -4 -8 -6 1 9 -2 -4 3 7 6 -7 -1 -2 -5 10 3 -10 1 6 0 -4 3 18 7 -4 12 5 5 3 21 19 4 7 14 6 -4 13 15 3 2 2
5259 2 4 -6 5 3 6 -4 -3 4 -4 -8 4 9 -8 2 9 1 -4 2 4 5 0 13 12 -2 -9 2 9 0 5 13 15 2 2 9 2 -13 9 5 -2 -10 1 5 -5 1 10 6 -6
5306 -6 3 7 6 1 9 10 -4 -11 2 2 -6 2 13 12 -11 1 10 0 1 13 14 1 -3 7 9 -1 10 18 10 2 -2 14 -6 -2 2 6 2 -11 0 6 -6 -13 12 8
5350 8 -10 3 1 5 -6 0 5 3 -7 1 10 2 -3 7 3 -16 4 26 -1 -14 12 21 -3 -6 16 10 -10 -11 3 5 -1 -6 16 7 -2 7 10 1 -5 12 13 -3 -11
5393 -11 5 13 -17 -5 12 0 -11 5 12 5 -6 12 17 -4 -10 9 2 -5 2 19 5 -4 -4 12 -3 -6 13 18 2 2 7 14 -12 -6 1 7 -13 5 14 -11
5433 -11 -17 7 12 -2 -16 3 7 -13 -17 22 9 -12 2 14 -3 -11 8 9 -3 3 11 2 -11 -1 13 6 1 2 19 4 0 1 10 -7 -9 6 2 -18 -17
5472 -17 4 4 -9 -5 14 8 -16 -5 10 -4 -16 10 7 -10 -9 15 0 -23 1 16 0 -8 13 12 -4 -5 9 15 -11 -8 8 7 -8 -1 5 10 -7
5509 -7 3 5 -6 -17 -1 5 -8 -4 -4 -6 -15 -10 10 8 -14 -4 7 -6 -15 6 8 -14 -5 14 9 -4 -1 12 7 -2 8 13 -3 -1 11 3 -3 -6 12 14 -9
5550 -9 -8 12 -2 -9 -8 -6 -10 -12 -1 -14 -10 -8 8 14 -10 -8 5 -8 -10 -4 5 -11 -4 12 13 -7 -11 19 7 -5 0 24 5 1 12 13 -2 -15 5 12 -9
5591 -9 -7 2 14 -5 1 0 -8 -11 3 1 -5 -11 9 9 -20 -1 2 4 -10 7 2 1 -12 -11 8 -4 -15 4 10 -2 0 10 7 8 6 5 -10 2 10 2 8 -7 3
5634 3 7 -4 2 2 4 -13 -3 -2 -2 -6 -10 -4 2 -7 0 -2 -11 -7 -3 3 -13 9 13 0 -2 9 -2 -1 -8 13 9 -2 -3 1 1 -2 6 13 14 -4 1 -2 -7 -10 6 -1 -4 -5 4
5683 4 5 -5 -14 1 2 -3 -2 5 -11 -13 -9 -1 -5 -5 14 8 -11 -4 9 0 4 4 20 5 4 18 3 2 -1 10 3 -3 2 8 9 -1 12 14 -8 -8 2 -1 -2 -8 5
5728 5 3 0 -2 0 4 3 17 9 1 5 0 9 -1 1 14 -1 2 -4 0 9 0 13 12 8 3 5 6 -5 9 6 -4 -12 -12 -1 3 -6 0 -6 0 -7 -3 -3 0 -9 -6 -11 -11 4 -6 2
5778 2 2 3 8 -1 -4 0 1 -5 -2 15 1 0 6 15 -3 -11 0 -5 4 0 10 4 -6 -16 -2 2 -6 2 9 -9 -3 -1 2 -4 -8 2 -5 -6 1 5 1 0 -4 0 8 2 4 8 -8 4
5828 4 12 5 0 -8 7 11 -2 5 9 8 3 5 16 -4 11 8 -2 -6 -2 5 1 -8 -9 6 4 -11 7 4 -2 -9 15 0 -6 1 0 5 -4 7 -9 6 -5 4 -1 1 -6 8
5874 8 6 -8 -1 -4 8 1 3 16 4 -12 2 10 -11 0 -5 -1 -7 0 4 1 -5 5 5 -1 -5 -8 2 -1 2 -5 8 -3 -5 7 10 -8 -9 15 9 -4 5 -4 -3 5 4
5919 4 10 -4 -1 8 -9 -7 -2 8 0 -5 -9 -4 -10 -3 -3 -9 -9 -8 1 4 -10 -7 -2 -3 -1 0 -1 3 -3 1 4 14 -8 17 15 5 1 4 -8 -7 13 4 9 -8 4 3 4 -17
5967 -17 9 3 -7 -9 -7 -1 -7 1 -4 0 -9 -5 -5 -8 -9 -4 1 -6 -5 3 3 -10 -9 4 -3 0 4 -3 -5 10 14 12 -5 -4 -3 4 -4 -8 1 3 3 -4 -1 -17 -8 -6 -6 -8 -7 2 -3 -7 -15
6020 -15 -12 -5 -6 -1 -4 -10 -4 -5 4 -10 -7 -2 -6 -9 2 -4 8 -1 1 2 5 -5 6 -5 -3 8 1 -4 -1 -9 1 -2 -12 0 -2 -2 -7 -2 6 -6 -7 0 1 -8 -10 9 -13
6067 -13 -5 -5 9 -4 1 2 8 -3 10 2 3 -4 1 4 0 -8 -1 -2 6 7 1 2 -4 -1 3 -1 -6 1 -17 -17 -5 -3 -3 1 -3 -2 -3 -8 -14 -5 -4 0 -6 -3 0 4 -1 -10 -3 -11 -1 1 -8
6120 -8 0 15 7 3 9 1 -3 -8 -4 18 9 4 -1 -6 -3 -14 2 -5 2 -1 -2 2 7 0 -6 -11 -13 -4 -3 -10 4 8 -7 4 -2 1 -6 8 2 6 2 7 0 1 -4 5 3 2 7 9 5 8 -2
6173 -2 6 -1 0 -1 -13 1 2 0 2 0 4 4 3 -2 -10 1 0 -8 -2 7 -1 -4 6 17 7 6 3 3 4 2 7 -7 1 5 -2 11 1 -4 3 0 -7 -1 6 4 1 2 8 -7 -11 -8 -2
6224 -2 -4 -6 -4 6 -5 -11 -11 -7 0 -5 1 -5 -4 -6 -7 1 -1 -1 -11 6 -1 2 2 3 4 3 -6 -5 -1 -4 8 6 3 -10 -5 -5 1 -3 -4 -3 -7 -10 -8 -9 6 -4 -3 0 -7 -2 2 3 -10
6277 -10 -4 -6 6 4 -6 10 1 -6 -2 -1 3 9 -1 -2 4 -11 8 1 1 4 -11 2 -5 -8 -1 -1 -7 -5 1 1 -4 -11 -7 2 -13 -8 0 -8 -10 -5 0 -8 -7 -4 2 12 -8 -7 -4
6326 -4 -2 2 -6 6 -10 9 2 -9 10 -8 -1 2 -7 -4 -2 -2 2 2 1 -13 -7 -9 -7 0 0 -4 -6 -8 6 -7 -2 7 -4 -7 -13 -4 -2 1 -9 5 -1 -1 0 3 -9 -3 -5 6
6374 6 7 1 4 4 -6 -1 11 -6 -6 -3 2 -4 -8 0 -8 4 -6 2 -8 -22 -1 -3 -14 -19 -7 -6 -7 -1 -1 -5 -18 -5 -7 -11 1 4 -2 9 0 -2 3 8 -4 -5 3 0
6420 0 0 -3 -5 -4 -4 -1 0 -2 -5 -5 2 0 -10 -8 3 -12 -2 -10 -4 -16 -2 1 -9 -13 -4 0 -5 4 -2 7 -2 0 3 8 -4 0 0 -5 3 3 6 2 8 6 -11 5 2 -7 -3 -5 2
6471 2 3 4 -5 -3 6 -5 0 -1 -8 -8 -13 -10 -8 -7 7 2 5 4 -1 0 -7 1 4 -10 1 -7 -3 -14 -7 -1 8 2 1 -4 1 0 -10 1 -7 -9 2 -7 -4 -10 -14 -13 -7 -9 -11 0 2 0
6523 0 -10 0 -9 -5 6 -5 -7 -6 -3 2 8 13 10 1 -5 -2 9 3 2 5 4 3 0 -2 7 2 -17 7 3 -7 -4 0 3 -14 -7 -7 -15 -4 -3 7 -2 0 1 -3 1 -10 7 -6
6571 -6 -6 7 5 2 -8 0 1 4 1 -5 6 -5 2 7 3 1 2 3 -6 -3 2 6 -7 -2 -8 -7 4 -6 -3 -2 -12 3 -6 -1 1 -2 10 -3 2 -11 0 2 3 -3 2 6 -4
6618 -4 4 -2 -6 -8 5 3 1 4 3 -4 2 6 5 3 4 2 0 0 1 -7 -1 -7 -7 -3 11 1 -12 -1 4 5 -5 -3 -2 -8 2 -8 -10 -5 5 5 -8 -9 2 9 2 8 8 2 -3 10
6668 10 7 2 12 6 4 -12 3 4 4 -4 -1 -1 -6 7 -3 -7 -1 -4 -8 -1 3 -2 -3 -2 -13 3 -4 0 -8 -2 5 -5 2 4 12 -3 10 -2 3 8 -6 3 -4 -8 5 -4 0
6715 0 0 -1 1 -4 -14 -4 -3 -11 -3 4 -6 -7 1 -5 -11 -5 8 5 -9 -4 -10 -9 1 -5 5 -9 -8 16 2 0 -1 8 14 4 -11 13 -2 7 6 4 -1 -12 -3 5 -7
6760 -7 -7 0 6 -1 -1 -7 -6 -8 -7 4 -5 1 -3 -3 -4 -11 -5 -8 -9 4 2 6 3 7 5 -1 -6 -2 4 -1 -1 -2 -4 -2 7 4 5 -6 10 4 -8 11 8 -1 -10 -3 2 -13 -10 5 -9 7
6812 7 -5 1 -1 7 -8 -2 -3 -5 9 -2 -2 8 -4 -6 -8 -4 -2 -6 -1 1 7 8 4 -6 15 -2 -8 -4 3 3 7 -4 -3 3 -3 -4 -6 -20 -15 2 -4 -3 -2 -8 -9 -8 10 8
6860 8 -9 1 9 -3 -5 -4 10 4 -1 1 6 3 4 8 12 6 6 5 9 -4 8 -4 3 2 0 3 -10 -11 4 3 -16 -7 -4 -2 4 -6 -6 7 -1 4 -1 -17 -9 1 0 2 0
6907 0 4 -4 9 -5 0 5 2 -2 11 0 2 12 7 -8 1 1 2 -4 9 -6 9 -12 -9 -4 2 -7 1 4 -4 -5 2 1 -7 3 -9 -6 6 6 -1 -3 -2 3 17 -4 -12 2
6953 2 3 9 4 6 6 -3 1 14 1 -6 -8 10 -5 -5 -2 8 -13 -11 5 -1 -15 -6 -8 -4 -1 -4 2 -3 -1 -1 -1 0 -1 -3 -4 -5 0 8 2 -1 4 11 -3 -3 6 2 -1 4 7 8 6 -2
7005 -2 12 -3 -9 14 -1 2 -3 9 1 -5 -1 -5 -5 -1 3 7 -3 -2 -10 6 -3 -2 7 11 0 -7 -1 2 -2 -1 2 3 7 6 8 -2 10 0 11 7 5 8 18 5 12 8 3
7052 3 5 2 7 0 5 -2 3 -7 -8 5 1 -7 -1 -9 -8 -8 10 2 -3 -1 3 10 5 -4 6 -3 -5 7 2 1 6 6 4 5 3 8 5 4 2 -3 5 1 -5 6 -7 1 -3 8 0 -15 -2
7103 -2 -5 -5 -9 -7 11 11 -9 -3 -7 -3 -2 5 -1 1 -1 11 -7 3 3 11 0 -1 12 -4 5 2 3 5 2 11 7 3 -8 11 3 -9 -2 -1 0 1 -4 6 0 7 -3 13 4
7150 4 -3 0 3 -2 8 5 -4 0 -7 -1 -2 -11 7 14 1 -7 0 6 -7 0 3 -5 -6 4 7 0 -13 -5 3 3 4 4 7 2 -2 1 -2 1 3 7 -6 1 -5 7 4 0 1 2 -1 -4 3 6 -1
7203 -1 1 12 1 6 14 10 2 8 10 5 -14 0 11 0 3 1 11 -10 -9 3 7 5 5 9 0 -2 2 6 6 -6 5 1 -1 9 11 2 5 10 5 3 3 -9 17 3 3 1
7249 1 12 3 2 7 7 1 -4 8 14 -3 1 2 -1 -9 2 -3 -15 4 7 -2 4 1 5 -2 -9 -3 4 5 -16 9 12 -3 1 7 0 -6 3 16 4 -2 5 5 6 -10 8 7 1 5
7297 5 8 8 4 16 10 3 6 -2 -11 8 3 2 17 8 -11 -9 -2 3 -2 2 -2 -1 16 3 0 5 10 8 11 1 1 8 -7 9 12 5 -5 -1 12 5 -4 11 18 3 2 7 4 -2
7345 -2 2 6 -4 3 -7 7 -9 4 -5 1 0 -4 -1 -7 0 0 0 5 2 -1 8 -4 -4 4 3 -9 12 20 -3 5 8 3 2 -4 4 3 11 9 2 9 3 -4 5 3 -4 -8 5 -14 3
7394 3 -8 4 6 -3 11 -4 1 5 10 7 3 -1 -3 3 2 3 3 3 5 14 11 8 -4 5 11 9 9 17 4 -11 -10 2 -5 0 2 6 0 -3 4 1 0 5 8 -2 0 0 6 0 -4 -3 -1 1
7446 1 5 1 -4 0 -2 4 1 2 9 -3 8 -1 7 5 -4 1 8 -2 1 4 -1 -3 -1 -2 6 -16 -3 4 -5 2 -4 -3 1 -8 -2 -2 -1 -4 5 5 -6 -6 1 4 0 4 8 -6 -2 13 19 4
7498 4 -9 12 6 3 7 2 5 -5 5 7 2 0 -1 4 -4 7 5 0 -10 2 0 -1 -2 -15 -7 -9 -2 -5 1 -2 -5 0 1 1 -4 16 0 0 1 11 10 7 18 19 8 4 11 0
7546 0 4 3 6 0 -3 -4 4 -1 8 0 2 12 3 4 -1 3 -1 2 10 2 1 7 0 11 -2 4 -2 -1 3 5 -4 -4 11 7 9 4 0 2 10 4 3 9 2 -1 15 5 5 3 -4 3 4 5 6 0 -2
7601 -2 -5 -7 -2 4 -14 7 -2 2 5 8 2 6 -11 1 8 6 4 -2 4 10 -2 -4 5 0 0 -3 14 18 8 3 -1 -2 2 5 -1 -5 2 1 1 -9 -6 -1 12 17 -5 1 -3 1 4 -2 2
7652 2 1 0 -3 2 12 -5 5 9 19 12 6 3 4 -1 4 2 11 9 10 6 17 3 0 8 5 14 6 1 -1 4 1 9 -5 4 1 12 -1 -1 -8 8 3 -4 -6 0 0 0 0 5 -2 -7 5
7703 5 -1 4 2 8 7 0 -4 9 -2 -1 3 5 -1 9 -2 -1 4 -2 2 -6 8 9 -1 2 -6 -6 -1 0 -9 10 5 1 -4 -10 -3 -2 -9 -4 -7 5 -6 -8 -4 7 -5 1 1 -6 -2 -1
7753 -1 -4 6 10 8 1 7 13 -3 1 1 -7 1 -8 -10 9 -2 -7 -9 2 -5 -7 4 -7 -2 -7 -3 -1 -2 1 0 -5 -1 -1 -19 8 1 -3 -4 4 5 9 2 0 -5 4 -5 -9 3 -1 14
7803 14 -8 9 -1 -4 1 -6 -9 -10 -8 -4 -5 7 -2 4 1 -4 7 -3 -7 -5 -10 -13 -2 -3 0 -5 -5 6 2 -2 4 -1 2 1 5 -5 -5 -2 0 0 -3 -2 5 -2 3 -4 -1 -1 0 -8 -3
7854 -3 -11 -10 3 -4 -3 -3 2 -2 -4 12 -2 1 -1 7 -4 -4 -1 3 4 -1 9 6 -3 12 0 5 -2 7 -9 -1 3 -1 -2 -5 -8 -6 -1 1 8 -8 -1 0 0 0 -1 -9 2 17 1
7903 1 -1 -2 -9 -7 4 0 4 4 3 3 -3 -1 5 1 6 0 6 -2 -3 7 1 3 12 6 -1 -1 -3 7 6 4 1 2 2 -9 4 -1 -4 5 -7 -2 -1 -9 4 3 -3 -1 7 4 5 4 5 1 4 0
7957 0 8 2 -8 9 -2 8 1 -4 0 -10 4 0 -4 0 -9 1 13 -3 -4 1 1 -7 2 -5 -1 -4 -9 8 -3 -10 8 -4 -4 -2 -2 -6 -1 7 13 4 -3 7 10 -3 3 -5
8003 -5 7 6 -3 4 1 2 -7 4 4 -13 9 0 -2 -8 -7 -1 -6 -8 -12 -2 -13 1 -3 -9 0 -9 -4 10 -10 -2 5 1 -1 5 10 0 -3 -4 1 -8 -8 -9 -4 -3 3 -11 1 3 -3
8052 -3 -5 3 0 -2 5 -15 -4 -10 -3 0 -6 -7 -6 -5 -14 -5 -4 0 -3 -1 2 -5 -5 -2 4 0 8 -7 8 -12 -5 4 0 1 10 -7 4 11 5 4 4 5 1 -13 -8 -1 -6 -2 -9 -8 -6 4
8104 4 0 -7 -3 -10 6 -3 2 7 5 11 9 -15 3 3 8 -8 2 0 -8 -6 3 -5 -3 6 -6 -2 -9 5 -4 -14 -10 2 -9 -7 0 3 0 -6 -10 -7 1 -6 -12 -4 -8 -6 1 2 -3 6 -3
8155 -3 -13 2 -7 0 0 -2 2 2 -8 2 -2 -2 4 1 -5 -9 5 -8 -17 -9 6 0 2 -1 -6 -6 2 -15 -6 -12 -9 -4 -14 -11 -7 -4
8191d
##END NTUPLES=NMR FID
##END=
