##TITLE=1H_AM-NV29
 CDCl3
 8 sc, 
 23.11.2022
##JCAMPDX= 6.0         $$ Bruker NMR JCAMP-DX V2.0
##DATA TYPE= NMR FID
##DATA CLASS= NTUPLES
##ORIGIN= UXNMR, Bruker Analytische Messtechnik GmbH
##OWNER= root
$$ XWIN-NMR		Version 3.5
$$ Wed Nov 23 14:31:41 2022 Russian Standard Time (UT+4h)  she@DPX200
##.OBSERVE FREQUENCY= 200.1313499994
##.OBSERVE NUCLEUS= ^1H
##.DELAY= (6, 6)
##.ACQUISITION MODE= SIMULTANEOUS
##.ACQUISITION SCHEME= undefined
##.AVERAGES= 8
##.DIGITISER RES= 18
##SPECTROMETER/DATA SYSTEM= spect
##.PULSE SEQUENCE= zg30
##.SOLVENT NAME= CDCl3
##.SHIFT REFERENCE= (INTERNAL, CDCl3, 0, 15.7039)
##AUDIT TRAIL= $$ (NUMBER, WHEN, WHO, WHERE, WHAT)
$$ ##TITLE= Audit trail, XWIN-NMR		Version 3.5
$$ ##JCAMPDX= 5.01
$$ ##ORIGIN= Bruker BioSpin GmbH
$$ ##OWNER= she
$$ F:/spectra/data/she/nmr/H-F/1/audita.txt
$$ ##AUDIT TRAIL=  $$ (NUMBER, WHEN, WHO, WHERE, WHAT)
(   1,<2022-11-23 14:30:04.87 +0400>,<she>,<DPX200>,
      <created by zg, POWCHK disabled, PULCHK disabled
       configuration hash MD5:
       00 E9 B6 7A A2 85 ED C7 34 08 36 98 17 FE 4E 26
       data hash MD5: 16K
       76 95 66 45 A0 DA 3B A4 96 D4 86 B7 D2 BE 54 EE>)
$$ ##END=
$$ 
$$ hash MD5
$$ 3E F5 1E 9B 20 3C C9 CD 97 EC 4A C5 25 1E 4E 80
##$RELAX= 
##$RELAX= 
##$RELAX= 
##$RELAX= 
##$RELAX= 
##$RELAX= 
$$ Bruker specific parameters
$$ --------------------------
##$DU= <F:/spectra>
##$EXPNO= 1
##$NAME= <H-F>
##$PROCNO= 1
##$TYPE= <nmr>
##$USER= <she>
##$AMP= (0..31)
100 100 100 100 100 100 100 100 100 100 100 100 100 100 100 100 100 100 
100 100 100 100 100 100 100 100 100 100 100 100 100 100 
##$AQSEQ= 0
##$AQ_mod= 1
##$AUNM= <au_zg>
##$AUTOPOS= <>
##$BF1= 200.13
##$BF2= 200.13
##$BF3= 200.13
##$BF4= 200.13
##$BF5= 200.13
##$BF6= 200.13
##$BF7= 200.13
##$BF8= 200.13
##$BYTORDA= 1
##$CFDGTYP= 0
##$CFRGTYP= 5
##$CHEMSTR= <none>
##$CNST= (0..31)
1 1 145 1 1 1 1 1 1 1 1 1 1 1 1 1 1 1 1 1 1 1 1 1 1 1 1 1 1 1 1 1 
##$CPDPRG= <>
##$CPDPRG1= <>
##$CPDPRG2= <>
##$CPDPRG3= <>
##$CPDPRG4= <mlev>
##$CPDPRG5= <mlev>
##$CPDPRG6= <mlev>
##$CPDPRG7= <mlev>
##$CPDPRG8= <mlev>
##$CPDPRGB= <>
##$CPDPRGT= <>
##$D= (0..31)
0 1.2 0 0 0 0 0 0 0 0.06 0 0.03 0 0 0 0 0.0002 0 0 0 0 0 0 0 0 0 0 0 0 
0 0 0 
##$DATE= 1669199404
##$DBL= (0..7)
120 120 120 120 120 120 120 120 
##$DBP= (0..7)
150 150 150 150 150 150 150 150 
##$DBP07= 0
##$DBPNAM0= <>
##$DBPNAM1= <>
##$DBPNAM2= <>
##$DBPNAM3= <>
##$DBPNAM4= <>
##$DBPNAM5= <>
##$DBPNAM6= <>
##$DBPNAM7= <>
##$DBPOAL= (0..7)
0.5 0.5 0.5 0.5 0.5 0.5 0.5 0.5 
##$DBPOFFS= (0..7)
0 0 0 0 0 0 0 0 
##$DE= 6
##$DECBNUC= <off>
##$DECIM= 32
##$DECNUC= <off>
##$DECSTAT= 4
##$DIGMOD= 1
##$DIGTYP= 9
##$DL= (0..7)
0 120 120 120 120 120 120 120 
##$DP= (0..7)
150 150 150 150 150 150 150 150 
##$DP07= 0
##$DPNAME0= <>
##$DPNAME1= <>
##$DPNAME2= <>
##$DPNAME3= <>
##$DPNAME4= <>
##$DPNAME5= <>
##$DPNAME6= <>
##$DPNAME7= <>
##$DPOAL= (0..7)
0.5 0.5 0.5 0.5 0.5 0.5 0.5 0.5 
##$DPOFFS= (0..7)
0 0 0 0 0 0 0 0 
##$DQDMODE= 0
##$DR= 18
##$DS= 0
##$DSLIST= <SSSSSSSSSSSSSSS>
$$ [...]
##$SUBNAM2= <"">
##$SUBNAM3= <"">
##$SUBNAM4= <"">
##$SUBNAM5= <"">
##$SUBNAM6= <"">
##$SUBNAM7= <"">
##$SUBNAM8= <"">
##$SUBNAM9= <"">
##$SW= 18.0517283424941
##$SWIBOX= (0..15)
0 0 2 0 0 0 0 0 0 0 0 0 0 0 0 0 
##$SW_h= 3612.71676300578
##$TD= 16384
##$TD0= 1
##$TE= 0
##$TE2= 300
##$TE3= 300
##$TEG= 300
##$TL= (0..7)
0 120 120 120 120 120 120 120 
##$TP= (0..7)
150 150 150 150 150 150 150 150 
##$TP07= 0
##$TPNAME0= <>
##$TPNAME1= <>
##$TPNAME2= <>
##$TPNAME3= <>
##$TPNAME4= <>
##$TPNAME5= <>
##$TPNAME6= <>
##$TPNAME7= <>
##$TPOAL= (0..7)
0.5 0.5 0.5 0.5 0.5 0.5 0.5 0.5 
##$TPOFFS= (0..7)
0 0 0 0 0 0 0 0 
##$TUNHIN= 0
##$TUNHOUT= 0
##$TUNXOUT= 0
##$USERA1= <user>
##$USERA2= <user>
##$USERA3= <user>
##$USERA4= <user>
##$USERA5= <user>
##$V9= 5
##$VALIST= <valist>
##$VCLIST= <CCCCCCCCCCCCCCC>
##$VD= 0
##$VDLIST= <DDDDDDDDDDDDDDD>
##$VPLIST= <PPPPPPPPPPPPPPP>
##$VTLIST= <TTTTTTTTTTTTTTT>
##$WBST= 1024
##$WBSW= 4
##$XGAIN= (0..3)
0 0 0 0 
##$XL= 0
##$YL= 0
##$YMAX_a= 461442
##$YMIN_a= -364818
##$ZGOPTNS= <>
##$ZL1= 120
##$ZL2= 120
##$ZL3= 120
##$ZL4= 120
##$ABSF1= 10
##$ABSF2= 0
##$ABSG= 5
##$ABSL= 3
##$ALPHA= 0
##$AQORDER= 0
##$ASSFAC= 0
##$ASSFACI= 0
##$ASSFACX= 0
##$ASSWID= 0
##$AUNMP= <proc_1d>
##$AZFE= 0.1
##$AZFW= 0.1
##$BCFW= 1
##$BC_mod= 2
##$BYTORDP= 1
##$COROFFS= 0
##$CY= 11.3945322036743
##$DATMOD= 1
##$DC= 2
##$DFILT= <>
##$DTYPP= 0
##$F1P= 2.36226072786647
##$F2P= -0.459571619588291
##$FCOR= 0.5
##$FTSIZE= 0
##$FT_mod= 4
##$GAMMA= 1
##$GB= 0.15
##$INTBC= 1
##$INTSCL= 1
##$ISEN= 128
##$LB= 0.24
##$LEV0= 0
##$LPBIN= 0
##$MAXI= 10000
##$MC2= 0
##$MEAN= 0
##$ME_mod= 0
##$MI= 1.114404
##$NCOEF= 0
##$NC_proc= 0
##$NLEV= 6
##$NOISF1= 3.799351
##$NOISF2= 2.8
##$NSP= 1
##$NTH_PI= 0
##$NZP= 0
##$OFFSET= 15.70392
##$PC= 1
##$PHC0= -18187.03
##$PHC1= 7.20072
##$PH_mod= 1
##$PKNL= yes
##$PPARMOD= 0
##$PSCAL= 0
##$PSIGN= 0
##$REVERSE= no
##$SF= 200.130013532006
##$SI= 16384
##$SIGF1= 3
##$SIGF2= 2
##$SINO= 400
##$SIOLD= 16384
##$SREGLST= <1H.CDCl3>
##$SSB= 0
##$STSI= 0
##$STSR= 0
##$SW_p= 3612.71676300578
##$SYMM= 0
##$S_DEV= 0
##$TDeff= 0
##$TDoff= 0
##$TI= <>
##$TILT= no
##$TM1= 0
##$TM2= 0
##$TOPLEV= 0
##$USERP1= <user>
##$USERP2= <user>
##$USERP3= <user>
##$USERP4= <user>
##$USERP5= <user>
##$WDW= 1
##$XDIM= 8192
##$YMAX_p= 0
##$YMIN_p= 0
$$ End of Bruker specific parameters
$$ ---------------------------------
##NTUPLES= NMR FID
##VAR_NAME=  TIME,          FID/REAL,        FID/IMAG
##SYMBOL=    X,             R,               I
##VAR_TYPE=  INDEPENDENT,   DEPENDENT,       DEPENDENT
##VAR_FORM=  AFFN,          ASDF,            ASDF
##VAR_DIM=   8192,          8192,            8192
##UNITS=     SECONDS,       ARBITRARY UNITS, ARBITRARY UNITS
##FACTOR=    0.0002768,     1,               1
##FIRST=     0,             0,               0
##LAST=      2.2672688,     0,               0
##MIN=       0,             -364818,         0
##MAX=       2.2672688,     461442,          0
$$ Real data points
##PAGE= N=1
##DATA TABLE= (X++(R..R)), XYDATA
0@%%%%%%%%%qJ6j6J6k4L2m0M8n6P2q8J04j21J45j76K08k41K81l28L77m33M96n65
$$ 0 0 0 0 0 0 0 0 0 0 -8 8 -8 8 -16 16 -24 24 -32 40 -48 56 -65 80 -96 112 -129 152 -176 201 -232 264 -301
32c01O42p26Q21r27J042j168J308j459J624j808K007k223K462k722L004l315L654
$$ -301 341 -385 436 -491 551 -617 691 -768 856 -952 1055 -1168 1294 -1428 1576 -1739 1915
49A915m025M433m884N385n940O558p253Q043q947R990j1211J2667j4434J6634
$$ 1915 -2110 2323 -2561 2824 -3116 3442 -3811 4232 -4715 5275 -5936 6731 -7703 8931
63H931j9465K3255k8620L6862n1253Q3453k81490P8665N51564k22715k34542j47667
$$ 8931 -10534 12721 -15899 20963 -30290 53163 -228327 -149662 401902 179187 -55355 -203022
75b03022M6378K16602J37985j21445j08278j15127K8037J48448J33548K3472k40491
$$ -203022 -156644 59958 197943 76498 -31780 -146907 -118870 29578 163126 186598 -53893
86e3893l10925K82279M20066j67664k94078j9412J2305J75637J88765j53358k18855
$$ -53893 -364818 -82539 337527 169863 -124215 -143627 -131322 44315 233080 79722 -139133
97a39133r971R5968J71621N1982j56402j58605k6746J93206K23202j68779k50002
$$ -139133 -149104 -53136 118485 170467 14065 -144540 -171286 21920 245122 76343 -173659
108a73659Q7781R2203J0641J11152o2466j90579J6349J07406R2364M9139j57275
$$ -173659 -85878 6325 16966 128118 65652 -124927 -108578 -1172 91192 140331 -16944
119a6944j60241R3190J83044O8285j47060k00077R2313J93833l0901o5802l1615
$$ -16944 -177185 -83995 99049 167334 20274 -179803 -87490 106343 75442 9640 -21975
130b1975o6859O6333R8242m3242k7057k3373o4257O8013J00869l3370p5817o3697
$$ -21975 -88834 -22501 75741 32499 5442 -17931 -82188 -14175 86694 53324 -22493 -86190
142h6190K9379J40937J0815j25404m6463K6321P8926P8906q3614j16253L3997
$$ -86190 -56811 84126 94941 -30463 -76926 -50605 28321 107227 23613 -92640 -58643
153e8643P6772N2794q394j13310l8684R0724M7205L347k8136r2217o042R9791
$$ -58643 18129 70923 62529 -50781 -89465 1259 48464 51811 23675 -68542 -74584 25207
165B5207M3931j9579o4659q1367L9489J23415L6969p8669j21426j3621J44230
$$ 25207 69138 49559 -15100 -96467 -56978 66437 103406 24737 -96689 -110310 33920
176C3920Q8437o9394j01047o0520N1194J50860K7197j31631q5881J8674Q5995
$$ 33920 122357 52963 -48084 -108604 -57410 93450 120647 -10984 -96865 -78191 7804
187G804R8894k1274j33075p1147O5518J24727M2490r0574j05189k0082P7119J30391
$$ 7804 106698 85424 -47651 -118798 -53280 71447 113937 23363 -81826 -101908 -24789 105602
199A05602J8351j53919j11414O4264J35690P8685p1366j71590m1232J50268J28329
$$ 105602 123953 -29966 -141380 -77116 58574 137259 65893 -105697 -146929 3339 131668
210A31668l7943j28532p5187M0098J05136P4383l6470j28718p0692P7612J28967
$$ 131668 93725 -34807 -109994 -69896 35240 109623 73153 -55565 -126257 -48645 80322
221H0322M5898r1337j53047j8144J65436J21973p5724j47406m9195P7548J19452
$$ 80322 126220 34883 -118164 -136308 29128 151101 75377 -72029 -121224 -43676 75776
232G5776L6641r1061j13269m675R8637Q9972n429r9749r7037K9903J35414O5142
$$ 75776 112417 21356 -91913 -96588 2049 92021 86592 -13157 -110194 -80291 55123 120265
244A20265q4371j13415j5935P9631R2820J1154r5317r2548K8485J05098N5165
$$ 120265 35894 -77521 -93456 -13825 78995 90149 -5168 -97716 -69231 35867 91032
255I1032m1398r5947n2449O8751J10033J813r5049o3323K4110P2324M9407k5133
$$ 91032 49634 -46313 -98762 -30011 80022 81835 -13214 -76537 -52427 19897 69304 44171
267D4171p6444m0918M5666P6246J4752n3678o1701j0038O7212P0224l2642q5759
$$ 44171 -32273 -73191 -27525 48721 63473 9795 -51906 -61944 5268 75492 42850 -42909
279d2909j6285M9879M8339R242m5730n2154J2853N5548K6137k5305m3922j5528
$$ -42909 -59194 -9315 39024 48266 2536 -49618 -36765 18783 44920 19615 -24307 -39835
291c9835K7330M2986J1944m5361m6573K4271N2328Q592k5522l5549j5949M0929
$$ -39835 -12505 30481 42425 -2936 -49509 -25238 27090 35682 10160 -25389 -41338 -409
303d09M6742j9413m9174j6204K3431M1869J6089l7021m8061K825N4466L6604k9565
$$ -409 46333 26920 -22254 -38458 -15027 26842 42931 5910 -42151 -39326 15140 51744 22179
316B2179n1404j4832K8226N1518J8069n4762n5335J8781N5951L2685j7323o1890
$$ 22179 -29225 -44057 -15831 35687 53756 -1006 -56341 -37560 18391 51076 33753 -28137
328b8137l6718M5140P0372O667n9201n4606Q418O1178M9740j9470p4867l9726
$$ -28137 -64855 -19715 50657 57324 -1877 -56483 -48065 13113 62853 43383 -31484 -71210
340g1210M8313P1594J2991n0241o5300j0874O9995O8173k3065p9498m1013L4005
$$ -71210 -22897 48697 61688 11447 -53853 -64727 5268 73441 50376 -29122 -70135 -36130
352c6130P3858L7229n0319q4009j2871P1891O7785q987p2131n9557K0991Q4107
$$ -36130 37728 74957 24638 -59371 -72242 -351 67434 58447 -13684 -73241 -52250 31857
364C1857M8857m7440q4900k1724N8614P2113J2967o7399p7441J3259Q7029M9318
$$ 31857 80714 33274 -51626 -73350 -14736 57377 70344 2945 -74496 -61237 25792 75110
376G5110l4150p4331m1705M4187Q4448J8222o4708o6951L65O5069N8595j2996
$$ 75110 40960 -33371 -75076 -30889 53559 71781 7073 -59878 -59513 5556 64151 51155
388E1155p0305n2301L0324Q2381K8105n3869o2569j2654N1701O8134p353p1822
$$ 51155 -19150 -71451 -41127 41254 69359 15490 -47079 -59733 -8032 60102 52749 -19073
400a9073l7052K4271N0712L5694k4360o1970k3442L8258N9223J2587n5831n1077
$$ -19073 -56125 -31854 18858 54552 30192 -31778 -55220 -16962 42261 54848 -983 -52060
412e2060J2930N2687M0489k3246o6551j2593M7113L0887P24k4185l9166K56L9692
$$ -52060 -39130 13557 54046 30800 -35751 -48344 -1231 29656 30380 6195 -32971 -32715 6977
425F977K5011o415l5573l1028K3149M4550P693k9160l8214K705M7183J5206k6804
$$ 6977 31988 25573 -10000 -41028 -17879 26671 34364 5204 -33010 -30305 16878 32084 5280
438E280j7277q088R108L0843K374k5171j3755k041K1409K7496j8890l3938K243
$$ 5280 -11997 -20085 -10977 19866 22240 -2931 -16686 -18727 2682 30178 11288 -22650 -20407
451b0407K1695K0919m932l3631n342K3594P730K458m777k2935k812J9170J6225
$$ -20407 1288 22207 17275 -16356 -21698 1896 9626 12084 7307 -15628 -18440 730 16955
464A6955P287k8775l5900K7144M6365l668l3047l0320P545M9416J4413l6628k2810
$$ 16955 24242 -4533 -40433 -13289 33076 29408 -3639 -33959 -26414 23002 37415 787 -22023
477b2023J345J5657K5714K792k0398k3547j3276L2441M5483j8449m7890j5576
$$ -22023 -20678 -5021 20693 23485 3087 -20460 -33736 -1295 44188 25739 -22151 -37727
489c7727J7293M7520K3755n0744m6886J8204L9278K7039q308m7718k6127K5735
$$ -37727 -20434 27086 50841 97 -46789 -28585 10693 37732 29424 -18294 -44421 -18686
501a8686M5400K0301l8823m9956R671L6913K4903Q009m0629m7739K3128N0046
$$ -18686 26714 47015 8192 -41764 -32093 4820 29723 37732 -2897 -50636 -27508 22538
513B2538J6903j3941m7596l4345M0227O2395L314n5006m9258K0300N8601J9584
$$ 22538 39441 25500 -22096 -56441 -16214 46181 49495 -5511 -54769 -34469 24132 43716
525D3716k2302m1564l0195L4719N6479n391l6448k4566j0970L1680M7279q133
$$ 43716 21414 -20150 -50345 -15626 40853 35462 -986 -25552 -36522 -4842 42437 34304
537C4304m6277k7970J2213M4676K7973k2404m8289k6788L8884O6623r200o7121
$$ 34304 -11973 -39943 -27730 16946 44919 22515 -25774 -52562 -13678 52945 43745 -23376
549b3376k2206K9244L7805J5882l0901l4713R604J8438P096J3320j909l1931k5438
$$ -23376 -45582 -16338 21467 37349 6448 -28265 -18661 -223 6873 20193 18284 -13647 -39085
562c9085K3376N6014N034o4244l3730M0139M7349J658m2409l2422K4925L4555
$$ -39085 -15709 40305 45339 -18905 -52635 -12496 34853 36511 -5898 -38320 -13395 21160
574B1160p139j3422n20r425o591J5581K2242l291l3779j5228K9787K6667j1271
$$ 21160 14021 599 79 -9346 -15937 -356 21886 18595 -15184 -30412 -625 26042 14771
587A4771k5753r442J6290J7788m959r101j762q430P92K1956Q298k3306k1497J3561
$$ 14771 -10982 -20424 -4134 13654 8695 -406 -2168 -10598 -9806 12150 20448 -2858 -24355 -10794
601a0794L2404Q51l4941j3973K7906K2365j6193k4697O948K0905m959j4415Q856
$$ -10794 21610 22461 -12480 -26453 1453 23818 7625 -17072 -10124 10781 5822 -8593 263
614B63J1607j4210j7282J4385K9604m841l9978j3854L9071L4589k4081m5795K088
$$ 263 11870 -2340 -19622 -5237 24367 19526 -20452 -34306 4765 39354 15273 -30522 -28434
627b8434L9616J5260j8701j8588k989P967J0622P440L11j4542j9891N565L0730
$$ -28434 11182 26442 7741 -10847 -13836 -5869 4753 12193 12504 -2038 -21929 -16364 14366
640A4366J5575k3098l4121J474L4023J8384j1874k2414j8249P146L3694J7593
$$ 14366 29941 6843 -27278 -25804 8219 26603 14729 -7685 -25934 -18788 14906 32499
652C2499k1448l5033j0564L2548L8824r716m2884j9085K2397L3794M815k3127
$$ 32499 11051 -23982 -34546 -1998 36826 27110 -15774 -34859 -12462 21332 26147 3020
664C020j6724m781N212K6592J9463k1687l7728r807L4695M4703j0236n5907k1719
$$ 3020 -13704 -18485 -13273 13319 32782 11095 -26633 -36440 -1745 42958 32722 -23185 -44904
677d4904L4086M1605L605l7025k8683J1091K4760J7492N80k6899k4368R354K8056
$$ -44904 -10818 30787 34392 -2633 -31316 -20225 4535 22027 22607 -4292 -28660 -19306 8750
690H750K1299r756l8967j5841K7040L0973O718k5431l5801K560L7387K3504j1291
$$ 8750 30049 20293 -18674 -34515 -7475 23498 30216 4785 -31016 -28456 8931 32435 21144
703B1144l6286k1424K7005L6634k071k6682k1018L918K4745J2106o923j0648j6943
$$ 21144 -15142 -36566 -9561 27073 25002 -1680 -22698 -18780 5965 18071 11148 500 -16443
716a6443m599K5648K1278j0207k7866j7926K0378L7331k905l4110j5061J3700
$$ -16443 -21042 4606 25884 15677 -12189 -30115 -9737 27594 24689 -9421 -24482 -10782
728a0782K3563O498j7508j2592J598M716J1968O835j2948j2167O40Q891J4289
$$ -10782 12781 19279 1771 -10821 -9223 -4507 7461 14296 1348 -10819 -10179 -1288 13001
741A3001j587j9483m811J0902P770L188o508j1373J129Q868O931j79j3404o829
$$ 13001 11414 -8069 -12880 -1978 5792 8980 2472 -8901 -7772 1096 8027 7848 -5556 -12385
755a2385J3714R222o536q978l680Q916J0671q255j0558M689N314O09K80l171k644
$$ -12385 1329 10551 4015 -4963 -8643 273 10944 2689 -7869 -3180 2134 2743 3023 -148 -2792
770b792p29N16Q395M537j2200j0549O028J4712P601j3436j9322N180K0039O993
$$ -2792 -3521 -3005 5390 9927 -2273 -12822 -6794 7918 15519 2083 -17239 -12059 7980 14973
784A4973q562j5260o964J2736J5695M26j1966j4100j319J6876J4569m899j8140
$$ 14973 6411 -8849 -15813 -3077 12618 13044 1078 -13022 -14341 2535 17104 12205 -5935
797e935j3179Q732K2467Q011j4516k0208o229J8056K4235j754k5554j8072Q458
$$ -5935 -19114 -10382 12085 20096 5580 -14628 -20857 -2801 21434 19680 -5874 -23946 -15488
810a5488K6448J4879j6303k7238n728J9741K2990K056k1645k1517K183K3707K1071
$$ -15488 10960 25839 9536 -17702 -23430 -3689 19301 21357 -288 -21805 -19622 4085 25156
823B5156o617k9491j7054J5792K9603J0345k1054k9660k456K7346K3396n236k6281
$$ 25156 18539 -10952 -28006 -12214 17389 27734 6680 -22980 -25436 1910 25306 20070 -6211
836f211k0254R329K9358J4789j5711k7988j0119K0487K7977K079k4333k2804K576
$$ -6211 -26465 -17136 12222 27011 11300 -16688 -26807 -6320 21657 23736 -597 -23401 -20825
849b0825K6568K0051j0160k6211j4188J2206K8233J0852k1383k5304j463K1456
$$ -20825 5743 25794 15634 -10577 -24765 -12559 15674 26526 5143 -20161 -21624 -168
861a68K2787l343k6411j5373J0031K1588J2746j2094k3640o239J4926K0140N103
$$ -168 22619 19276 -7135 -22508 -12477 9111 21857 9763 -13877 -20116 -5190 14950 20053
874B0053j9879k0213N489J9418J2927n332k1588j0286J4515J6331K944j0586j6565
$$ 20053 174 -20039 -14550 4868 17795 12463 -9125 -19411 -4896 11435 14379 3793 -12772
887a2772j242J6007J0929k675j2886j1614P002J5180L014o785j0828n454J1473
$$ -12772 -14014 1993 12922 10247 -2639 -14253 -7251 7929 10943 4158 -6670 -12124 -651
900f51J1216m403p985n756P31J1166M403q129n427n83M519P591l320p604J062
$$ -651 10565 6162 -1823 -7579 -6848 4318 8721 592 -4835 -5418 -899 6692 3372 -4232 -3170
915c170K485K867K743o340m101N742K774K16j732p270J126R508J174m672o091
$$ -3170 -685 2182 4925 -1415 -5516 226 3000 3216 1484 -5786 -4660 4848 6022 1350 -4741
930d741l547R652R022o840q588k521L177J1187L425j0639p950j97P953J2844k434
$$ -4741 -8288 1364 10386 3546 -5042 -7563 -4386 6801 10226 -413 -8363 -8560 -607 12237 9803
945I803j6152o890O619J4810Q584j4432j7510L958J3782R952o78j5634j1936O807
$$ 9803 -6349 -13239 -6620 8190 16774 2342 -15168 -11210 2572 12524 11846 -3788 -15724 -8917
959h917J5063J0685o636k2114q308J6487J9945L190k0536k1775Q551K4457Q337
$$ -8917 6146 16831 10195 -11919 -20227 -3740 16205 19395 -1141 -22916 -14365 10092 18429
972A8429r263j7930j1450J1941K1747O138j4047k2147n230K2126K1930m142k4270
$$ 18429 9166 -8764 -20214 -8273 13474 19612 5565 -16582 -21812 314 22244 18102 -6168
985f168j8576J1259K8036P739j6171j9246p779J4592K5180L014k2692k1125K797
$$ -6168 -24744 -13485 14551 22290 6119 -13127 -20906 -6314 18866 21880 -812 -21937 -19140
998a9140K5556J8894j2048k6597j0169J6038K4008L550j8727j6854j775J4388
$$ -19140 6416 25310 13262 -13335 -23504 -7466 16542 20092 1365 -15489 -17264 -2876
1010b876K1357J909k4437j9739Q419K6243J4378j6010k7204l982K1830J9812l903
$$ -2876 18481 20390 -4047 -23786 -15367 10876 25254 9244 -17960 -21942 -112 19700 15797
1023A5797k0746j2099O722J4927J0708l876j8352j1403J0186J9008O808j3128
$$ 15797 -4949 -17048 -10326 4601 15309 11433 -6919 -18322 -8136 10872 17680 4552
1035D552j9700j982J8941J5927n835j9325r408J0406J6395L881j1361j3372j41
$$ 4552 -15148 -17130 1811 17738 11903 -7422 -16830 -6424 9971 13852 2491 -10881 -11022
1048a1022J2340R231l142r704o374K519R106O192l816r993m846O384J0416J696
$$ -11022 1318 10549 7407 -2297 -8671 -6152 2954 9146 5330 -4663 -9509 -3125 7291 8987
1062H987r775q883M025J1095K657p850o969J899P530K987m688m930K85M104L501
$$ 8987 -788 -9671 -5646 5449 8106 256 -6713 -4814 2716 5703 1015 -3915 -3630 474 3975
1077C975j259m732k252K866N262J045n969m478L319N071J724k198n702k479M476
$$ 3975 2716 -2016 -4268 -1402 3860 4905 -1064 -5542 -2223 2848 4572 2374 -3328 -5807 -1331
1092a331O133K087n679j0108k60J3153R530q010j6876k909J6938J2515q392j4453
$$ -1331 4802 6889 1210 -8898 -9158 3995 13525 5515 -11361 -14270 2668 15183 6791 -7662
1106g662l623Q124J0494J426o796o357m603K365J3813Q838j1561j9728k320K1715
$$ -7662 -11285 -3161 7333 8759 1963 -4394 -8997 -6632 7181 16019 4458 -15270 -17590 4125
1120D125J8356j1538k4567n678J6109J8453P88j7746j3618L521J3409J3045o70
$$ 4125 22481 10943 -13624 -19302 -3193 15260 16048 -1698 -15316 -11795 1614 14659 13989
1133A3989j8771j4882Q257K2007J0418j5021k2415j314J7784J5523K65j6884j7417
$$ 13989 -4782 -19664 -11407 10600 21018 5997 -16418 -17732 52 15575 15840 -1044 -18461
1146a8461L464K0422J5594o526k6214j4179J9734K7205j18k4503j8363R201K2134
$$ -18461 -14997 5425 21019 14493 -11721 -25900 -6166 21039 20921 -3582 -21945 -12744 9390
1159I390O726r277j2333q829M147J6463J1444p117k2094j2398J8771K7585k297
$$ 9390 16116 6839 -5494 -14323 -10176 6287 17731 10614 -11480 -23878 -5107 22478 20181
1172B0181k7413j6692J3006K5156N116j7503j4741J76J1051J3205J519j2609j2878
$$ 20181 -7232 -23924 -10918 14238 19354 1851 -12890 -12714 -1663 11542 13061 452 -12426
1185a2426n10J4602J4971n482j9399p887J0438J5885M238j2455j3828k39J2042
$$ -12426 -12936 1666 16637 11155 -8244 -16131 -5693 10192 14430 1975 -11853 -12092 -50
1198e0J3200j180j7309j0707R964J6340K920j3123j2156M725J2200K938m869n182
$$ -50 13150 11970 -5339 -16046 -6082 10258 13178 55 -12101 -7376 4824 7762 2893 -2289
1212b289k635J079M755N646k31j0139p240Q772J2622j819j3348o643R297J1879
$$ -2289 -4924 -3845 910 6556 6325 -3814 -11054 -2282 10340 8521 -4827 -11470 -2173 9706
1226I706k775j1547l292O498O285j69n058l845M07L857M925k72p130m744M659
$$ 9706 6931 -4616 -7908 -1410 4875 4706 -352 -4197 -3790 67 4992 4720 -2410 -7154 -2495
1241b495Q153J175p282o674K285P823M036l124p337m716M139J0648M260r894j2960
$$ -2495 5658 6833 -449 -7123 -4838 2985 7021 3897 -3440 -8156 -4017 6631 10891 997 -11963
1256a1963J719J5842R128j0197j5805r57J3608J0089l749j1054o318L285Q651
$$ -11963 -10244 5598 14726 4529 -11276 -12233 1375 11464 7715 -3339 -9657 -6372 2279
1269B279P665j154j2637j0904O778J8246P050j4539j9058J216K0141J3022q678
$$ 2279 9944 8790 -3847 -14751 -7973 10273 17323 2784 -16274 -15058 5083 18105 9427
1282I427j8453p471J1263J6432L365j1740j4884k904J4508J6103k288j7724j2908
$$ 9427 -9026 -16497 -5234 11198 14563 2823 -12061 -14965 -457 15646 13358 -4366 -17274
1295a7274O443J9469R208j1565j7853n167J3046J8323J749j7395j5932K933J9391
$$ -17274 -10831 8638 17846 6281 -11572 -16739 -3693 14630 16379 -1016 -16948 -14015 5376
1308E376J4537r628k1960o724J4302J8010K055j6200j4671K669J4650J2341l000
$$ 5376 19913 10285 -11675 -18399 -4097 13913 15968 -232 -14903 -12234 2416 14757 11757
1321A1757j7215j1317P973J7479Q657j1442k0098k565J7799J4994l628j7556j1435
$$ 11757 -5458 -16775 -8802 8677 17334 5892 -14206 -16771 1028 16022 12394 -5162 -16597
1334a6597Q632J6770N521r514j4754l826J2833J2934j166j1867j1424K408J5310
$$ -16597 -7965 8805 14326 4812 -9942 -13768 -935 11999 10833 -1034 -12458 -10050 5260
1347E260Q305p777j2988n284Q962J3759P54j1862r971J838J2861Q299p728j1691
$$ 5260 13565 5788 -7200 -12484 -3522 10237 10991 -871 -10842 -9004 3857 12156 4428 -7263
1361g263j980P287R715P68j0291o736L643P715N046l749r538k205O665P387P62
$$ -7263 -9243 -1956 7759 8527 -1764 -8500 -4857 2858 7904 4155 -5383 -7588 -923 6464 7226
1376G226q684p363M978Q891K057n249q278q25R299N717m067p385l840M861Q856
$$ 7226 -1458 -8821 -3843 5048 7105 1856 -6422 -7247 2052 7769 3702 -3683 -7523 -2662 6194
1391F194O56p479o322O76Q886O565n708r150k030N689R290J412j0105p858L240
$$ 6194 6850 -629 -6951 -6275 2611 9176 3468 -5682 -7712 -2023 7267 8679 -1426 -9284 -6044
1406f044R559O851n214j2366l211Q897J0420J397j1494j0828M414J2587O488n478
$$ -6044 3515 10366 5152 -7214 -10425 -1528 8892 10289 -1205 -12033 -7619 4968 11456 5978
1420E978j3337n573J0334J2749J166j1101j2683J626J4999R642n771j4890q178
$$ 5978 -7359 -12932 -2598 10151 11317 216 -12467 -10841 4158 13800 8029 -6861 -15039
1433a5039R978J6466K322j2764j3444r0J4946J2800n362j5907q960P677J6902
$$ -15039 -5061 11405 13727 963 -12481 -12571 2375 15175 9813 -6094 -15054 -7377 9525
1446I525N949j2128j5374k071J3780J4877k302j6662j0857N957J6150R128r595
$$ 9525 15474 3346 -12028 -14099 -319 14558 12256 -4406 -15263 -9306 6844 15972 6377
1459F377j7336m137J2894J5265N54j5465j2939M395J5680R733p264j6267n970
$$ 6377 -10959 -15096 -2202 13063 13617 -1848 -14787 -10392 5288 15021 7757 -8510 -14480
1472a4480J0591J4458K940j2297j4240J086J5243J0870n652j5211p261Q999J4200
$$ -14480 -3889 10569 13509 1212 -13028 -11942 3301 14171 8519 -6692 -13953 -4954 9246
1485I246L133j0719j2352p8J2060J0172k801j2537q454N871J3671M879r568j1937
$$ 9246 12379 1660 -10692 -10770 1290 11462 8661 -3876 -12330 -6459 7212 12091 2523 -9414
1499i414l25J0752R013k722j0625o229M788R704L962n761r437k477Q020R237j056
$$ -9414 -9739 1013 10026 7304 -3321 -9550 -4762 4942 8904 3143 -6294 -8771 -751 8486 7430
1514G430j0264o718N235J0175K372p530p891P86Q277N352l561p023l041L704P237
$$ 7430 -2834 -9552 -4317 5858 8230 700 -7191 -6405 1872 7224 3663 -3360 -6401 -2697 4540
1529D540K397o153p388O44P997O003l827r186k786O580Q127j47q536o206L593
$$ 4540 6937 784 -6604 -5960 2037 8040 4213 -4973 -7759 -1179 6948 6801 -1735 -7941 -4348
1544d348P997L853m171q888k947P684Q645n98r135p488L654J0809M532o702j0036
$$ -4348 3649 7502 3331 -5557 -8504 -820 7825 7227 -1908 -9396 -5742 5067 9599 2897 -7139
1559g139k032Q973R022j400r064p577J924J1457P429o680j2425l868R368J2629
$$ -7139 -9171 -198 8824 7424 -1640 -9217 -7293 4164 11593 4913 -7512 -11380 -2012 10617
1573A0617J51j3049j0030M389J3471P019p892j2795l050Q674J1564K134j1302
$$ 10617 10768 -2281 -12311 -7922 5549 12568 4676 -8119 -11169 -2495 9069 11203 -99
1586i9j1601K137J2612R396m277j4448p488Q891J4451L513j1461j3682P77J3724
$$ -99 -11700 -9563 3049 12445 8168 -6280 -13768 -4877 9574 13087 1626 -12056 -11279 2445
1600B445J0471l898j4333q457Q158J4239L440r501j2017j833J1036J1254j311
$$ 2445 12916 9018 -5315 -13772 -5614 8625 12065 2564 -9453 -11286 -250 11004 9693
1613I693j2027r742L694J3714P599p551j3712m451J0807J3202p07j2761r166L664
$$ 9693 -2334 -12076 -8382 5332 12931 5380 -8332 -12783 -1976 11226 10519 -2242 -11408 -7744
1627g744J2285P232o614j2065l667Q198J0896J086j0000r051K036J0041O924l979
$$ -7744 4541 11773 5159 -6906 -10573 -2375 8521 9607 -393 -9444 -7408 2633 9557 5578
1641E578j0229m539N487R401L522p204j0370m69J0416Q305l928j1195m412P685
$$ 5578 -4651 -9190 -3703 5698 9220 2016 -8354 -8823 1593 9898 5970 -5225 -9637 -1952
1655a952R247n30p896n382K442O116L164j856m971l975K068P062L554n379q051
$$ -1952 7295 6765 -1131 -6513 -4071 2045 5209 3353 -1618 -5593 -3525 3537 7091 1712 -6339
1670f339k14Q508O162m587r067j465P251O166k011o800l494L186N982K247l949
$$ -6339 -6553 1955 8117 3530 -5537 -7002 249 6415 4404 -2396 -5890 -2704 3278 5525 1576
1685A576o101j165N889N976j640o949m131L721P249J912n381o054o20N718O608
$$ 1576 -4525 -5690 199 6175 4535 -2414 -6545 -2824 4425 6337 956 -5098 -5718 0 6608
1700F608o34q200o153L737J0168L982q295r938J295R986O339m185r464l252N614
$$ 6608 5974 -2226 -8379 -4642 5526 9508 1213 -8725 -7430 2556 8895 4710 -4754 -8006 -2392
1715b392P188K249m716q201k375P386R053K03j0267r042M552J2582M664p838j1155
$$ -2392 4796 7045 2329 -5872 -8247 -861 8192 8395 -1872 -10914 -6362 6220 10884 3046 -8109
1730h109j912J0225R652k090j0061p640L200J1594N915o797j0905l222Q279J0645
$$ -8109 -10021 204 9856 7766 -2295 -9935 -6735 4859 10774 3977 -6928 -10150 -1871 8774
1744H774j29r607p703R12R430Q615l363j1523o397N655J2806M729j0879j2144
$$ 8774 8645 -962 -8665 -7753 1677 10292 6929 -4594 -10991 -5336 7470 12199 1320 -10824
1758a0824J564J2032Q334m880j1723l755O203P974L436n225r563k188P273Q956
$$ -10824 -9260 2772 11106 6226 -5497 -9252 -3049 4925 8361 3136 -6427 -8615 -1342 7614
1772G614J312r897r731L983J1825M907o562j0755j575R007P302j114p166p026
$$ 7614 8926 -971 -10702 -6719 5106 10013 3451 -7304 -8879 128 7430 6316 -850 -7876
1786g876K085R348M335m490p721l399O055Q294n48o960n070J254O664M118k928
$$ -7876 -5791 3557 7892 3402 -4319 -7718 -1663 6631 6083 -877 -5947 -4693 1971 6089 3161
1801C161n571l400K414P869K411o949o105J329O777M794m272p330N4N404L440
$$ 3161 -2410 -5810 -3396 4473 6884 -65 -6170 -4841 1936 6730 2458 -4872 -4818 586 4026
1816D026j065m276k145J832K447K244k85m830k563L882M522J70m515m783K559
$$ 4026 2961 -1315 -3460 -1628 819 3063 2778 -2052 -4615 -733 3789 3959 -556 -5339 -2780
1831b780O665R51m895m288P69N265K911k914m050j704K370N314R76n082m007R20
$$ -2780 3885 4836 -59 -4347 -3578 1687 4598 1684 -2366 -4070 -1700 3614 4590 -492 -4499 -3579
1847c579M775M215k541o359j695L995N290J132n181n347Q47N629M963j648q024
$$ -3579 1196 5411 2870 -3489 -5184 -1189 4101 5233 52 -5295 -4448 1181 6144 4496 -3528
1862c528l865N489P320J040o273p007J225P945M444l021p002l745M139P338K222
$$ -3528 -7393 -1904 5416 6456 183 -6824 -5599 2346 6790 3769 -3233 -6978 -2839 4499 6721
1877F721m963p526j649P669P528j832q562n728L769R604L553o583q322j112P293
$$ 6721 1758 -5768 -7417 252 7780 5948 -2614 -8342 -4573 5031 8584 2001 -6321 -7433 -140
1892a40P612j054q186n963K462Q478N098m581q828k776N763Q265J477p538p661
$$ -140 7472 6418 -1768 -7731 -5269 3209 8307 3726 -5102 -7878 -2115 6150 7627 89 -7572
1907g572J072Q263O385l043q994m356N183Q531K184o478p768O2P464O032j780
$$ -7572 -6500 1763 8148 5105 -3889 -8245 -3062 5469 7653 1175 -6593 -6531 933 6965 5185
1922E185p403m824L126P678L295m662p308j725O022O653m26o793n379K277P160
$$ 5185 -2218 -7042 -3916 3762 7057 2395 -4913 -6638 -616 6037 5611 -1182 -6561 -4284 2876
1937B876L481l965o426j540M502N513M08n149m622J105N361L409k078n354k366
$$ 2876 6357 2392 -4034 -5574 -1072 4441 4849 -300 -4922 -3817 1544 4953 2875 -2479 -4845
1952d845L369M875J015m118m327P57M432K762j561m199k071K771L920L10l109
$$ -4845 -1476 3399 4414 296 -4031 -3274 1158 3920 2359 -1840 -3911 -1140 2780 3090 -19
1967a9k939M38L504K092j833k997j074K225L046k05k912j797Q86K862J500k206
$$ -19 -2958 -2520 984 3076 1243 -1754 -2828 -603 2443 2238 -674 -2471 -1585 1277 2777 571
1983E71k919J51K634K163o94l387j475K324K938L99k815l019R74L662J592j809
$$ 571 -2348 -2197 437 2600 1906 -1481 -2956 -632 2306 2705 -110 -3129 -2155 1507 3099 1290
1999A290l437j347L070L562l62l268k959O32M396K556k398m186j862L197N013
$$ 1290 -2147 -3494 -424 3138 2776 -492 -3451 -2819 1577 4133 1735 -2451 -4313 -1116 3897
2014C897L18m769l903J101N088L455k901n379j581L437M904J112m689m719N66
$$ 3897 4215 -554 -4457 -3356 1732 5187 2286 -3093 -4674 -1237 3667 4779 90 -4629 -4063
2029d063M896M417j470o407l268L656N956J941m674o060Q3N681M565r91n911m193
$$ -4063 833 5250 3780 -2627 -5895 -2239 3717 5658 984 -5076 -4993 688 5253 4262 -1649 -5842
2045e842K700O061K862l306o519j991N335N998k56n592n163J440O452L565k744
$$ -5842 -3142 2919 5781 2475 -4044 -6035 -700 5298 5042 -550 -5713 -4273 2179 5744 3000
2060C000n881k998L761O222J417m707n710m80N976N352j985o277l432K969O156
$$ 3000 -2881 -5879 -2118 4104 5521 814 -4896 -5376 600 5952 3967 -2310 -5742 -2773 3383
2075C383K121m242n222p48M291M951j93n107m083J296N509L471l006n762j478
$$ 3383 5504 1262 -3960 -4708 -417 4534 4341 -766 -4849 -3553 1956 5427 2421 -3341 -4819
2090d819L871M730M09m393l971R16M255L040j467m491k323K555M404J169l374
$$ -4819 -948 3782 4191 -202 -4173 -3257 998 4038 2571 -1920 -4243 -1688 2716 3885 511
2105E11l970L24L828K634j106l472j826J561L299J090k013k880o64K588K723l83
$$ 511 -3459 -3135 693 3327 2221 -1251 -3077 -1516 1783 2873 860 -2020 -2684 -96 2627 2244
2121B244l109j879J510K905O39k181k066K78K147J350q55j954p09J271J549J78
$$ 2244 -865 -2744 -1234 1671 2310 129 -1937 -1659 488 1838 983 -971 -1680 -409 1140 1318
2137A318j307j461K90J809R84j055j694m44J529J721k68k098j288J064K437O12
$$ 1318 11 -1450 -1160 649 1633 578 -1116 -1560 -31 1690 1422 -676 -1964 -900 1537 2149
2153B149k245k054N55K411J537j301k661n67J864J989L17j856k345R7K568K183
$$ 2149 -96 -2150 -1595 816 2353 1052 -1609 -2176 -312 1677 1994 138 -2207 -2110 458 2641
2169B641o62l238k068K120L614P60k824l346O1L761K702j307l577k200J844M170
$$ 2641 1979 -1259 -3327 -1207 2407 3167 343 -3003 -2942 819 3521 2214 -1363 -3563 -1719 2451
2185B451J274k996l740n93L717L689r95l988k568J296M133K445k404m294j532
$$ 2451 3725 729 -3011 -3604 113 3802 2807 -1181 -3749 -2453 1680 4125 1721 -2573 -4105
2200d105K764M832R03m586m251Q98M978L556k519n294j534L252M126J018l425
$$ -4105 -1341 3491 4394 -192 -4443 -3545 1433 4989 2470 -2824 -4358 -1106 3020 4038 613
2215F13m085k0L547L722n6m719l776K047M961K544k911n444j031M498M110m36
$$ 613 -3472 -3492 55 3777 3721 -998 -4774 -2727 2234 4778 1867 -3577 -4608 -110 4000 3564
2231C564m206l696J440M712K295k135m267j861L098M188L48l183l560m5M012K996
$$ 3564 -642 -4338 -2898 1814 4109 1974 -2293 -4154 -1056 3132 3480 297 -3263 -3308 704 3700
2247C700j234l607k592J510M580J718l207l916l66L664L320j238l670j759J525
$$ 3700 2466 -1141 -3733 -2223 2357 4075 868 -3048 -3414 250 3570 2332 -1338 -3097 -1572
2262a572L076J360k082k658n63J690K798O04k797k561P86K869J919j577l136n97
$$ -1572 1504 2864 782 -1876 -2439 -749 2049 2653 -144 -2705 -1919 950 2869 1292 -1844 -2441
2278b441K166K257M8k384j933J072K280Q39j165k099n38J987J598o15j679q80
$$ -2441 -275 1982 2030 -354 -2287 -1215 1065 1904 739 -1360 -1898 89 1687 1072 -607 -1487
2294a487Q70J476L78q91j222n33J239J780l11j848j313R00K529N77k424j965J112
$$ -1487 -617 859 1237 346 -876 -1409 -170 1610 1299 -549 -1862 -962 1567 2144 -280 -2245 -1133
2311a133K431P94j768j930K13J602J232j55j560j490M08K040J450r08k756j100
$$ -1133 1298 2092 324 -1606 -1393 209 1441 1286 -274 -1764 -1356 684 2134 1226 -1530 -2630
2327b630K221K817q6k956k259J322L042J346j789l004p69K374K928P6l002k661
$$ -2630 -409 2408 2322 -634 -2893 -1571 1471 2817 1028 -1976 -2745 -371 2557 2633 -369 -3030
2343c030Q35L481K043j849l518j134K495L158L73k615l079j08L309L103p93m156
$$ -3030 -2195 1286 3329 1480 -2038 -3172 -677 2481 2854 239 -2840 -2948 361 3464 2671 -1485
2359a485k600K250M552J124l303l863%L860K987j184l438k163J202L642K057j907
$$ -1485 -4085 -1835 2717 3841 538 -3325 -3325 535 3522 2338 -1100 -3263 -2061 1581 3638 1731
2375A731l890j647K871M283K17m037l302J000M165K649k242m149j179K549L557
$$ 1731 -2159 -3806 -935 3348 3565 -472 -3774 -2774 1391 4040 1798 -2351 -3530 -981 2576
2390B576Q10l162l463L09L485K907r36m026k019K063L461J369k441l621l89L206
$$ 2576 3386 224 -3239 -2930 555 3462 2526 -1500 -3519 -1456 2005 3374 933 -2688 -3077 129
2406A29K821k41l394k757J486L712J475k122l508o39L138K538o16k474k136P00
$$ 129 2950 2709 -685 -3442 -1956 1756 3231 1109 -2399 -3038 100 2638 2022 -452 -2588 -1888
2422a888L001J443j432k481j218J862K938R6k629k042N71K840J559j872k405k28
$$ -1888 1113 2556 1124 -1357 -2575 -713 2225 2321 -308 -2350 -1779 1061 2620 748 -1657 -1885
2438a885J634K014m0k239j339Q52J726J138j160k143k57J730J449m1k011j433
$$ -1885 -251 1763 1723 -516 -1855 -1003 723 1861 701 -1442 -1699 31 1480 1439 -572 -2005
2454b005J225J805N08j061j912k54J991J425n55j901j288J269K393J54j845j669
$$ -2005 -780 1025 1533 472 -1440 -1694 297 1722 1167 -734 -2022 -753 1640 1794 -51 -1720
2470a720J82K166J593j317k056n59J028K102O43j951k079J63K174K134j046k956
$$ -1720 -1538 628 2221 904 -1152 -1711 -683 1419 2062 111 -1968 -1805 369 2503 1457 -1499
2486a499j119J899K679O33k695k570Q66K678J636r38k808j584J876K867Q10k179
$$ -1499 -2618 -719 1960 2593 -102 -2672 -1806 872 2508 1570 -1238 -2822 -946 1921 2731 552
2502E52l031k10L177K468p82l255k255J825L692Q63k315l099o61K997L150o51
$$ 552 -2479 -2689 488 2956 2174 -1081 -3336 -1511 2181 3044 729 -2370 -3031 -34 3116 2465
2518B465l357k313J179L665J724k207l392r51K628L437N0l402k591P61L316K473
$$ 2465 -892 -3205 -2026 1639 3363 1156 -2236 -3187 -559 2878 2928 -474 -3065 -2304 1012 3485
2534C485j637l839j339K490L342N84l085l082N57L278K440j252l572j525K126
$$ 3485 1848 -1991 -3330 -840 2502 3086 1 -3081 -2524 754 3194 1942 -1630 -3155 -1029
2549a029L058Q53k364l031j20L011K360o73k947k082J382L220J333k098l101m04
$$ -1029 2029 2882 518 -2513 -2633 378 2738 2065 -882 -2964 -1582 1638 2971 873 -2228 -2632
2565b632K746K479n55k736j814R97K850J127j675k452n06J809K314L3k326j904
$$ -2632 114 2593 2038 -698 -2512 -1515 1335 2462 787 -1665 -2171 -362 1952 1985 -341 -2245
2581b245P00K537J230j365k427m49J915J959k20k157j382Q56J969Q12j076j954
$$ -2245 -1545 992 2222 857 -1570 -2019 -104 1855 1635 -522 -1904 -1048 921 1733 657 -1297
2597a297m32J706J701l20j856j317Q83K046O58j434j727j05J628J559n31j845
$$ -1297 -1729 -23 1678 1358 -498 -1815 -932 1114 1772 338 -1389 -1494 134 1693 1162 -683
2613f83j030Q63J908P71j560k032J67J942J594p24k299q96J452K002L26j760j800
$$ -683 -1713 -850 1058 1829 269 -1763 -1596 346 1940 1216 -1083 -1979 -527 1475 1801 41 -1759
2630a759K69J991J464o81k190j392J477K469N08j948k328J29K602J851j148k532
$$ -1759 -1490 501 1965 1284 -906 -2298 -821 1648 2156 208 -2120 -1991 611 2462 1314 -1218
2646a218j212J551K704M82k115k313m1K494K208p74k885j503J345L020R55k241
$$ -1218 -2430 -879 1825 2307 192 -2121 -2162 332 2540 1766 -1119 -2622 -1277 1743 2698 457
2662D57k663j17K454K374l73k946j919J209K891J471j803l160n92K569K641k15
$$ 457 -2206 -2323 131 2505 2132 -814 -2733 -1524 1367 2838 1035 -2125 -2717 -148 2493 2278
2678B278k848k255J064K984J521j490k997r62K191K676K52k472k478M59K921J912
$$ 2278 -570 -2825 -1761 1223 2744 1254 -1743 -2705 -514 2162 2414 -58 -2536 -2077 844 2756
2694B756j324k762j319J721K917N44k341k530J27K693K084j015k679j376J434
$$ 2756 1432 -1330 -2649 -928 1989 2533 192 -2338 -2211 482 2566 1551 -1128 -2504 -1070
2709a070K661P98k040k320q9K154K037m28k431j570J042K574R52j690k365j56
$$ -1070 1591 2389 349 -1971 -2060 94 2131 1703 -728 -2298 -1256 1318 2270 580 -1785 -1941
2725a941K063J838l02k313j409J065K150P35j358j985k30J725J668m20j842j212
$$ -1941 122 1960 1658 -655 -2064 -999 1151 1886 528 -1457 -1687 38 1706 1286 -556 -1768
2741a768Q99J863O14j301j657j32J601J425m72j700j037R36J815N09j416j645
$$ -1768 -869 994 1608 307 -1350 -1482 119 1544 1072 -628 -1665 -729 1086 1595 179 -1466
2757a466J60J705J254p52j774o29J082J666K21j434j452K11J600J197o56j817
$$ -1466 -1306 399 1653 901 -873 -1502 -420 1246 1467 33 -1419 -1208 392 1589 933 -884
2773h84q18J158J973J93j706j636L56K028J194r32k085o76J467J890J76j789j770
$$ -884 -1702 -544 1429 1622 -84 -1720 -1364 664 1858 926 -1159 -1835 -368 1522 1698 -91 -1861
2790a861M94K073J288r51k207q14J438J990M77j881j919J78K220J615q10k395
$$ -1861 -1367 706 1994 1043 -1164 -1978 -540 1450 1927 46 -1873 -1695 525 2140 1330 -1065
2806a065j264J463K563M65j923k300J25K404J805p75k418j343J188K508Q51j761
$$ -1065 -2329 -866 1697 2162 239 -2061 -1936 468 2273 1498 -920 -2263 -1075 1433 2284 523
2822E23k257m49K122K311l96k519j697J013K548J225j674k500m74K011K323j42
$$ 523 -1734 -2183 -61 2250 1854 -665 -2362 -1349 1199 2424 750 -1750 -2224 -213 2110 1968
2838A968k458j765Q31K332J451j353k547n78J755K038K65k002k021M28K328J446
$$ 1968 -490 -2255 -1424 908 2359 1006 -1541 -2119 -364 1674 1939 -63 -2084 -1656 672 2118
2854B118q63k425j064J685K160L81j829k132L39K305J264q80j941j011J232J912
$$ 2118 1255 -1170 -2234 -549 1611 1992 163 -1969 -1630 675 1939 1059 -882 -1893 -661 1251
2870A251M20j492j657j21J818J559o37j838j031Q90K016M98j606j431R7J515J245
$$ 1251 1671 179 -1478 -1599 219 1778 1141 -697 -1728 -838 1178 1676 70 -1361 -1264 251 1496
2887A496n09j696p46R44J534L70j338j315K47J350R36m23j552o61J009J213L17
$$ 1496 987 -709 -1455 -511 1023 1393 55 -1260 -1013 337 1273 850 -702 -1363 -354 859 1176
2904A176j119j278J28J532R01o54j490o41J233J420n2j263j178K95J618P64q78
$$ 1176 57 -1221 -1093 439 1340 686 -804 -1445 -212 1208 1156 -107 -1285 -990 628 1392 514
2921E14j375m19J075J439mj421j162L52J593J004r69j729m04J336J561k6j805
$$ 514 -861 -1280 -205 1234 1230 -191 -1353 -1001 592 1596 627 -1102 -1506 -170 1391 1365 -440
2938d40j210O21J731R03r46j887m42J485J667Kj732j526O04J955J009r36k011
$$ -440 -1650 -1029 702 1605 659 -1228 -1670 -185 1482 1484 -248 -1774 -1170 785 1794 858 -1153
2955a153o67J467J826J86j660j825L10K164J349r40k193r92J569K119K32j818
$$ -1153 -1820 -353 1473 1659 -1 -1826 -1516 648 1997 1057 -1136 -2128 -559 1560 1792 -26
2971b6j731K24J956J421o47j994j147J052K188P57j672k050o3J917J788n61k189
$$ -26 -1757 -1533 423 1844 1197 -797 -1944 -892 1296 2053 381 -1669 -1732 185 1973 1412 -777
2988g77j198J058K065P21j494j786k34J567J808k48j984j349P56K002Q93j206
$$ -777 -1975 -917 1148 1869 375 -1411 -1645 -78 1730 1482 -502 -1851 -1095 907 1800 594
3004E94j904l74J504J660n9j688j313M79J703J125r37j858n93J391J632J2j573
$$ 594 -1310 -1684 -180 1480 1421 -267 -1580 -1101 602 1727 790 -1068 -1661 -270 1362 1374 -199
3021a99j335N19J596Q96q52j464m96J021J355J22j143j250J20J560R47o91j490
$$ -199 -1534 -1015 581 1477 625 -839 -1335 -314 1041 1163 20 -1230 -1110 450 1397 706 -784
3038g84n19J070J326p9j240r37M24J315N23p38j033k97P93J059O0j169q58M44
$$ -784 -1303 -233 1093 1014 -226 -1163 -739 576 1099 361 -672 -969 -176 883 943 -226 -1084 -640
3056f40J156N36o83j249r7R96J023k02j232p52O70J142M11q36j149j22J213R49
$$ -640 516 1052 369 -880 -977 19 1042 840 -392 -1144 -474 668 1079 243 -906 -1028 185 1134
3074A134l20j206q57P41J321L75j009j203p2J372R87m52j301p89O55J586M06j229
$$ 1134 814 -392 -1249 -508 813 1188 179 -1024 -1096 276 1263 811 -490 -1279 -624 962 1368 139
3092A39j285q4J428J200m26j645p47Q09J542M59j133j529M0J396J177k51j562
$$ 139 -1146 -1230 198 1398 972 -673 -1420 -611 931 1390 257 -1272 -1232 164 1341 1090 -472
3109d72j032P67J571P02j024j696l23J549J367j50j625j229P13J657P44r40j641
$$ -472 -1504 -737 834 1536 512 -1184 -1507 42 1409 1259 -366 -1595 -882 775 1519 579 -1062
3126a062n04J381J526l8j434j347L66J684J011p82j688o54J156J602J71j408j369
$$ -1062 -1566 -185 1341 1303 -131 -1478 -1112 572 1583 801 -887 -1541 -385 1217 1388 -20 -1389
3143a389K73J580J043o68j558o66Q78J512M28j330j378J51J392J065m44j465p78
$$ -1389 -1116 464 1507 839 -719 -1385 -507 1005 1433 103 -1275 -1124 268 1333 889 -576 -1354
3160a354P83J413M01r69j265p4J158J043j92j375q51O90J348L94r09j247j05J211
$$ -1354 -571 842 1243 274 -991 -1065 93 1136 944 -431 -1282 -592 756 1150 241 -1006 -1111 100
3178A00R49k57j129o86N27J103L97p27j013j73R69Q59k37j056o25N32J124K53
$$ 100 1049 792 -337 -1023 -496 607 1004 277 -736 -909 60 919 682 -374 -999 -467 657 910
3196I10p90q75J0R77N81k74r10m34N01Q76K00p46p87J26R39M49l01q89l89O52
$$ 910 120 -755 -745 232 813 539 -371 -805 -304 572 772 26 -761 -635 304 753 452 -437 -826 -174
3216a74Q87Kq32p31J86R32N52m26j006k67O81R57J5r60p51L06J052N60o32r63
$$ -174 713 715 -117 -848 -662 270 822 396 -610 -877 -196 761 776 -184 -935 -629 423 983 351 -612
3236f12l73Q87R30jr25q53L06J053O30n44j158m23R22J064O9j065r84K94J199
$$ -612 -985 -98 832 831 -94 -947 -641 412 1042 498 -660 -1083 -161 903 972 -93 -1077 -783 416
3255D16P29o30j159n01Q77J173J17j061r89J46J218Q22m54j262o31P59J282K96
$$ 416 1145 515 -644 -1145 -268 905 1022 -39 -1028 -882 336 1158 704 -558 -1189 -430 852 1148
3273A148r87j211M1J197J030l91j342o31O35J216N06r94j179q4J122J003j86j212
$$ 1148 161 -1050 -1009 188 1218 827 -515 -1146 -511 705 1211 217 -962 -1046 76 1079 893 -319
3291c19q70N89J196N21p38j178k93J042J031r1j035r31L50J235N72o96j069l28
$$ -319 -1189 -600 596 1117 379 -799 -1092 -50 981 890 -145 -1076 -726 509 1081 385 -684 -1012
3309a012Q64J022n1r60q40L10J086N24m97r76l54O34R97M9q73p10J27R27O37m42
$$ -1012 -148 874 823 -137 -977 -667 419 943 446 -530 -884 -250 747 796 -77 -787 -660 267 904 462
3329D62j007k71O16Q53L8p20o29J51P74M11l13p48k62N46N97Q9o05o12K38O51
$$ 462 -545 -816 -200 653 691 -29 -658 -507 267 678 365 -383 -645 -99 498 587 -18 -630 -392 259
3349B59L84l75o60k31N74N21j3n61m98K23O74L05m35n54k07N80O01j18o37m70
$$ 259 643 268 -392 -623 -49 472 459 -102 -600 -377 297 602 167 -387 -594 -14 587 469 -168 -638
3369f38L80O19K54m69n95q0N52N49j37o66m44L56P86K29n54p08n1O93O62l05p52
$$ -638 -258 361 615 146 -449 -529 23 572 435 -231 -675 -319 467 696 142 -566 -617 76 738 433 -319
3390c19m15M39Q04J58n14p63l8P09O79k03p88n25L49Q54L96o13q84n8P58P50j88
$$ -319 -734 -295 509 667 153 -610 -648 61 740 537 -251 -776 -427 427 823 210 -674 -732 26 776 588
3411E88q31n71L55R00M24n55r65j57P17Q56p8q39o59L00Q92M08m56q76l24O60
$$ 588 -243 -814 -459 441 865 310 -655 -812 -95 761 683 -156 -815 -515 377 785 329 -547 -871 -211
3431b11Q77J14q08p88J33J028N61m79q99l63O16Q52J63p54o84K6Q00N98l75o95
$$ -211 666 780 -28 -816 -683 345 906 427 -472 -835 -219 633 796 42 -642 -616 184 782 407 -288
3451b88m12L68P29L28n95p93L2O57O53j97p29m31L48P15K98n17o62m2O41M60n9
$$ -288 -700 -332 397 725 130 -663 -631 26 679 482 -247 -678 -330 385 683 166 -496 -538 103 563 504
3472E04o18n06K64O42K47l25o00j62M59O50n5n65m77K18O49J92l64m84j31M06
$$ 504 -114 -620 -356 286 533 208 -392 -554 -95 555 500 -65 -542 -324 325 517 153 -331 -462 -56
3492e6N54p9m92l87K18M52K42l54m28n6L80L98q1l93l41K48L82K04k60m99o9M36
$$ -56 498 419 -73 -460 -242 210 452 98 -330 -386 -6 392 311 -82 -423 -175 207 411 151 -348 -417 19
3514A9L71j02m77k08K50M85R5m39l81L5M80K42k01l12k73K57M02J57l42m42l8
$$ 19 390 288 -189 -397 -147 338 433 -6 -387 -352 128 370 169 -143 -416 -159 243 400 58 -384 -422
3535d22M72L99j45n37l10M11N14L3m54l98L6N10L36j21n78j82L11M74J46m26n02
$$ -422 50 449 304 -233 -543 -132 382 415 -39 -437 -401 109 445 324 -254 -436 -125 349 495 69 -433
3556d33OM69N21k49n56k59K68N47J92l75n80n2N56M22p6n66l99K18P01K07m43
$$ -433 -427 42 563 314 -242 -501 -233 314 506 131 -449 -501 55 477 401 -165 -564 -346 355 562 119
3577A19n80k9M89N02n0n12m81J18O18M12l71n84k51M42O46J9n39n27J83N58L86
$$ 119 -461 -490 -1 501 451 -61 -542 -424 194 606 235 -349 -600 -158 488 507 -32 -559 -376 182 568
3598E68k81n32k47K70N37J92m32n28J2M07N49j09o47k87L11N21J70m06n10J2M79
$$ 568 287 -245 -492 -222 315 507 75 -453 -441 -34 515 406 -241 -528 -217 304 474 68 -442 -430 49
3619D9L76j00m56l53K36N13J92l44m68j07N20L29m6l98k95J21M29J87k33m38o8
$$ 49 425 325 -131 -484 -248 265 457 113 -355 -462 58 387 341 -57 -352 -231 198 385 152 -286 -354
3640c54K74M05N4m54k74O6M52K02k56l90KJ91L86o1l69j52J36K78J39j34l68j26
$$ -354 -80 325 379 -75 -349 -283 169 371 115 -275 -273 -82 304 243 -126 -278 -142 136 275 141 -227 -353
3662c53L50K58n8k33k93J70K94J30j88l64L1L15K27q0k83k20J78L00J71l16k61
$$ -353 -3 255 197 -36 -329 -159 135 265 77 -287 -256 59 286 206 -77 -297 -119 181 352 36 -225
3683b25j08L57K73n2k98k82J99L59K06l93m01L7L95L19j13l91k87K11M36P9k65
$$ -225 -333 24 297 245 -53 -335 -136 223 429 36 -365 -328 67 386 273 -118 -405 -194 242 321 56
3704E6l38l6L75L11m8m16l05K29L35K54k70m25p9L07L78J2m72k72J41N31K38l08
$$ 56 -282 -318 57 368 320 -96 -401 -172 163 417 147 -278 -357 -50 328 340 -132 -404 -263 268 506 198
3726A98m79j92M26M68k9n00k86J48M29K57k06n33j25L01M74O0m24l88j1N57L20
$$ 198 -281 -473 -47 421 392 -108 -394 -246 183 440 234 -299 -424 -123 351 411 -13 -401 -412 145 465
3747D65j86n15k54L35M84J02l70m44j9M64L00j08l97l03K06N07K24l65m47m2L47
$$ 465 279 -236 -490 -155 329 431 61 -383 -402 62 362 254 -143 -446 -240 267 491 126 -321 -363 -16
3768a6L94k9m65k64J44M54K03k88m79m9L94L97q5m51k30J13M59J96k45l88j44
$$ -16 378 349 -116 -380 -236 218 421 133 -346 -395 -1 396 311 -140 -370 -257 202 398 153 -235 -379
3789c79L59L11M1l66l07P9M42K17k46l73j44L64L20l0l39k63J07L40K06k22l32
$$ -379 -20 291 332 -34 -341 -262 180 397 151 -222 -366 -2 318 288 -51 -314 -207 133 339 117 -215
3810b15j05K98K66L2l33k26O3L76J94k49l30p0K83L69r9k53l18J50M23J03k50
$$ -215 -320 -22 244 276 -57 -283 -220 156 350 101 -229 -299 -16 353 254 1 -317 -167 256 359 109
3831A09l30q5L13K97j08l23k05J43L29K17k98k93n5L03L44j12l60k47J69M00K18
$$ 109 -221 -306 7 304 196 -127 -332 -189 140 357 59 -234 -289 14 358 246 -114 -361 -192 208 426
3852D26l34l85o1L90K84o9l57k71J92L37K24k45m35p2L90L62m0m90k47J18M67
$$ 426 92 -293 -354 36 320 251 -106 -377 -185 152 376 131 -304 -376 14 376 336 -154 -401 -283 184
3873A84J77k25m23j36L85M42j5m37m41J32N76K28k63m99j11L95M28j8m14l45O4
$$ 184 361 136 -287 -423 -38 404 389 -48 -489 -357 219 447 184 -315 -426 -31 397 379 -35 -380 -316
3894c16M29L30k41m71j88L08M61R9l76m39O9L87L46j13m64k44K99M06J03l63l80
$$ -316 113 443 202 -269 -457 -149 312 411 35 -404 -335 52 398 285 -179 -423 -124 282 385 22 -358
3915c58M7L89K93o0m28k71J77N17J26k81m55p0M21M06j17m72k69J37N39J10l02
$$ -358 -311 78 371 311 -117 -388 -211 306 432 151 -304 -374 47 453 336 -136 -405 -268 271 381 79
3936G9l99j5L60L91j66m19j71J38L89J96k82l77k9K93L45j6m34k78K92L49J02
$$ 79 -320 -335 25 416 250 -169 -340 -202 187 383 101 -276 -305 -12 333 317 -117 -395 -103 246 348
3957C48k56l54j9L10L16r4m26j91K10L06K27k90l45k7L09K97j02l35k78K64L81
$$ 348 92 -262 -281 29 345 251 -175 -366 -156 150 377 87 -258 -285 24 321 219 -116 -394 -130 251
3978B51J9k30k87p4L87K58r7l22l06K78L92Q9l27l71L7L73K71q3m02k60L08L70
$$ 251 270 40 -247 -321 66 324 227 -95 -401 -123 269 358 31 -340 -303 70 341 258 -144 -404 -96 274
4000B74J09l19l82K9L52L07r6m65k73K81M32J17l71l75J5M38L59j33m94k38K83
$$ 274 383 64 -318 -289 63 370 274 -191 -464 -183 249 366 -5 -380 -365 73 432 299 -195 -433 -150
4021a50M36J70l58m42n0M79L11o6n04l11K64M91K08m26m47o5M58N05j22n63k58
$$ -150 286 456 98 -344 -394 85 396 330 -174 -485 -221 270 478 52 -395 -460 -2 503 381 -182 -440
4042d40J89N34J98l41m67j01L93M74p3m20l52J21N03K53k90m65j78M11M72l1m66
$$ -440 -251 283 481 140 -327 -428 -35 439 366 -54 -406 -285 218 471 181 -284 -462 -51 421 390 -76
4063g6l34J18N78J84k73n40p2L33M56Lm22l23J39M09L28l15m15j55K32M37J11
$$ -76 -410 -292 286 470 197 -343 -415 -82 374 377 -45 -368 -229 180 508 193 -222 -377 -145 292 403
4084D03m03m48J38M22L16k24m76j47L91L46K7l50l39L9M50J82j28l71k18K28M81
$$ 403 0 -448 -310 112 428 204 -272 -419 -28 318 345 -5 -344 -305 145 327 199 -172 -390 -162 319
4105C19mk69m29J45L59K16j47m07q3K05L27M8l28l03Q3L56K46k32l44j40L83L12
$$ 319 315 46 -383 -238 121 337 190 -217 -300 -95 232 280 -48 -351 -268 88 334 102 -242 -382 1 313
4127C13Jl73k68P2M10K13k01m01r9K39L88L6m01l22J94L63K04k38m10n8L27L65
$$ 313 314 -59 -327 -255 155 368 167 -234 -333 -94 294 330 -71 -393 -199 164 368 130 -280 -338 -11 354
4149C54m6m09l10J68L72L18l30l83q6L46L07O9m44l37J48M41K16k52m28o1L12
$$ 354 308 -101 -411 -243 129 447 117 -266 -352 -6 301 370 -74 -411 -263 178 394 142 -286 -347 -35
4170c5L99j6m57l38K08M62J92k49m75j17L46M53n2m23l22J70L82L26j84n16k22
$$ -35 364 348 -109 -447 -239 223 415 166 -309 -426 -80 373 321 -102 -424 -254 128 454 270 -246 -468
4191d68L46M86P7m03n21J53M99K86k63m48j90K91M83N7l54m61J17M36L21j74n10
$$ -468 -122 364 441 38 -483 -330 169 455 192 -256 -446 -155 328 385 31 -430 -313 123 444 270 -240
4212b40j34J79N68O0l71m32lM35L64j66l90l25L00N12P8m17m06P9L42L94j30m10
$$ -240 -374 -195 373 433 62 -370 -373 62 426 260 -130 -455 -155 357 435 18 -388 -309 33 427 297 -113
4234a13k87K65M44O7k88m00o5M29L44j04m87k13K30M74R9l40l72qL84L20j47l43
$$ -113 -400 -135 309 376 88 -312 -377 52 396 292 -195 -408 -178 296 395 55 -317 -325 59 379 232 -111
4256a11k65J98L57K06k66m12PL01L48j38l64k18J57M23J21k72l37k5L48L28k02
$$ -111 -376 -178 179 385 119 -293 -286 15 363 225 -139 -357 -200 223 344 72 -265 -290 58 386 184
4277A84l31k10J95M56R4l50l51O5L17K30r9l32k31K35L33J35l85k58oL61K96j97
$$ 184 -147 -357 -162 294 388 38 -313 -248 69 299 200 -132 -363 -128 205 340 -45 -303 -309 52 348 151
4299A51l16k01K61M46k0l30l47N3L86L16k29l62j97K82L57J04l19l46N3L76K49
$$ 151 -165 -366 -105 341 321 -9 -356 -303 83 399 170 -192 -389 -107 250 354 35 -311 -258 118 367
4320C67j26m20j94K63M23M9l57l19L0L93K74j46m42j71K08M72J42m22m00K6M58
$$ 367 241 -179 -373 -110 313 362 5 -314 -284 109 383 237 -205 -376 -168 304 446 24 -376 -350 108
4341A08L63j86m81k21K64M12J37l95l85j2M86L54q6n68j91K54L62K02l07m66R
$$ 108 471 285 -196 -417 -153 259 396 1 -384 -396 90 444 358 -210 -401 -147 215 417 110 -356 -347
4362c47M24L27q2m32l36K65L96K49l14m99o4M27L98l6m84l24K20M77J41l35m11
$$ -347 77 404 322 -110 -446 -181 215 464 150 -349 -413 14 412 376 -108 -432 -212 265 406 71 -340
4383c40q8M61L29n8l56l90K19M69J24j92n09p6M00L96l2l94k94O9M97K25l31l97
$$ -340 -428 33 362 304 -52 -442 -223 246 370 178 -331 -407 -7 389 357 -37 -331 -262 235 460 129 -268
4405b68o3K96M08l6m22l09J71M64J22j86m85k8L05L27K0m20k74J35M35J67k18
$$ -268 -331 -35 373 337 -85 -394 -223 241 363 177 -308 -336 -31 296 316 -104 -378 -243 192 359 141
4426A41m34j7K97L60o2l86k82J95L70J90k49l91q2L44L53m6l93k54J43L82K08
$$ 141 -293 -310 -13 347 285 -101 -383 -188 182 372 123 -268 -350 -6 347 301 -92 -346 -203 179 387
4447C87k87l82n7L25L60j01l96k72K40L79K08l08m30j8L69L44m7m62k37K10L93
$$ 387 100 -282 -339 -14 346 245 -151 -423 -183 196 404 96 -334 -352 17 361 314 -148 -385 -175 218
4468B18J20k23l59j22M02L50p8l96l03R8M80K52k59n05o7M29M06q0n07k99K13
$$ 218 338 115 -244 -366 36 386 308 -88 -391 -293 187 439 180 -325 -392 37 443 363 -144 -443 -230
4489b30N04J62k91m88n8M16L61qm39l38P6M95K89k77m89j05L59M91k3m80l56J89
$$ -230 274 436 145 -343 -401 15 376 368 -71 -409 -333 162 451 174 -315 -420 -61 430 407 -73 -429 -240
4511b40L75L35k73n52j00L76M37Pm10l11L1M52L53k76m97j08L17M83J8l90m30
$$ -240 135 470 197 -355 -455 -79 358 365 -45 -356 -325 127 480 204 -293 -401 -84 399 417 27 -403
4532d03P1M96K53j52n14j93L11M59J20m28m26M1M99L21j84m64j95K38M58J06l51
$$ -403 -332 164 417 265 -249 -442 -131 328 448 20 -406 -365 134 455 271 -193 -388 -150 308 414 63
4553F3m48J3L76L83j37m34k44L07L90J06l29l79J5M21L25j63m70k02L22L71J14
$$ 63 -385 -372 4 387 250 -184 -428 -121 269 375 46 -333 -318 103 428 265 -205 -407 -85 286 400
4574D00l36m38J9M11L34j78l52k64K04M71R2l16l79j4L93L84j95m10k18K42M54
$$ 400 64 -374 -355 56 390 212 -140 -404 -200 271 363 47 -332 -346 47 431 236 -174 -392 -150 304
4595C04J26m26l57P3L84K84j32m53j78K29M58J10m10l30j2M47K84j35m54j79K18
$$ 304 430 4 -353 -280 104 388 256 -197 -375 -146 312 422 12 -318 -330 117 401 266 -188 -367 -149
4616a49M33J21l97l62M1L93L97k13n08j86K95M54N3l15l83kL98L32j37m55k33
$$ -149 284 405 8 -354 -313 80 477 264 -244 -430 -135 319 372 57 -326 -328 70 402 265 -190 -423
4637d23K02N42J41m15m22RM22M09j49m92k65K47N00J24l82m77%M84L59m9n39l08
$$ -423 -221 321 462 47 -375 -366 56 465 316 -176 -441 -194 306 430 48 -429 -429 55 414 365 -174 -482
4659d82J94N37K05l01n20o2M80L77o1n02l38K31N26J51l11m25r3M04M41j05m35
$$ -482 -288 249 454 153 -367 -429 51 428 367 -135 -473 -242 284 435 124 -301 -394 10 451 346 -89
4680h9l27J65M90K08k42m88j35L88L95O6n37k90J26M73K70l34m54r7L62N12o9
$$ -89 -416 -251 239 447 205 -283 -418 -30 365 431 -106 -396 -270 203 473 139 -315 -412 -50 462 393
4701C93m12l95J64M65K39k94m57r1L50L92Ml99l07R3M03K70k56m33j23K83L67
$$ 393 -19 -414 -250 215 454 160 -297 -388 -38 354 358 -41 -348 -255 148 418 162 -271 -394 -111 256
4722B56J15m57k74R7M13K70k65m29j01L13L90l8k76l66J04L45L32k29m28j03K68
$$ 256 371 -86 -360 -263 150 420 155 -274 -375 -62 328 290 14 -352 -248 97 429 200 -228 -331 -63
4743f3M30j1m27l01P0M52K68k43m22j04K93L84L8m11l42J68L94K44k19m61j24
$$ -63 367 356 -71 -372 -302 150 418 175 -247 -351 -58 326 364 -47 -389 -221 173 417 198 -263 -387
4764c87L19L96ql44l51O8M34K70j62m51j94L14M58Q4m80l70J09M68K72j98n33
$$ -387 -68 328 320 -24 -375 -307 127 397 235 -216 -410 -96 362 446 -34 -404 -295 173 445 247 -286
4785b86j09K57M90L2m07l44J6M98K71j69m62k88L84M42P9m05m18R0M11L86j91
$$ -286 -395 -138 352 384 -23 -367 -351 147 418 249 -213 -501 -117 325 404 -1 -419 -329 82 468 277
4806B77m75k74L19M94Q7m06m17J1M67L60j35n17k07K17M82J39l26m35J9L38L41
$$ 277 -198 -472 -153 341 428 22 -395 -384 83 443 308 -209 -416 -199 283 422 96 -339 -320 18 359
4827C59o4m56k31J51N09J22k89m23k2L39M17q7l93l16J63M72J14k23m64pL09M10
$$ 359 295 -161 -392 -241 268 390 101 -322 -344 -5 412 325 -68 -384 -221 251 365 142 -322 -329 -20 390
4849C90q5l89k43N7M41J81j70m47n6K43L73j4l21l51J87M73J16k19m23n3K64L60
$$ 390 305 -84 -327 -270 171 352 182 -265 -321 -78 295 281 -40 -391 -204 269 385 166 -257 -310 -46 314
4871C14nm10k64J62L68K00k27m22j9L29L60j39l39k30J16L83K36k97l52l4K38
$$ 314 309 -101 -365 -203 165 365 138 -284 -303 26 386 247 -92 -322 -206 177 413 116 -236 -270 -32
4892c2L60m1l79k84J38M05K19k40m18r1L80L62q7l69k99J49L98K64l48l52k8L18
$$ -32 328 287 -92 -376 -238 167 386 146 -272 -363 17 379 292 -77 -376 -227 171 435 87 -265 -293 25
4914B5L22n8l61k63J26L68K29k14m17j25K61M07L5m25l41J80N09J67k07n20j35
$$ 25 347 289 -72 -335 -209 159 388 174 -243 -368 -107 300 335 -90 -431 -251 258 425 218 -302 -437
4935d37M22L29N5m12l65J22M28K58k33m43j04L02L69J15m03l63J0M87K76j98m21
$$ -437 -15 314 369 -43 -408 -286 142 400 167 -276 -380 -78 291 406 3 -360 -350 137 413 215 -206
4956b06k11K39M74J08m11l61P6L52L63j23n14j71K22M43J17l44l32n1L15L49q1
$$ -206 -417 -178 296 404 -7 -368 -292 60 423 300 -214 -385 -163 280 397 53 -279 -330 -15 334 253
4977B53l93k90K15M23K00k90m92nM00L96j18m11k31J87L77J74l12l53j5K59L60
$$ 253 -140 -430 -215 208 408 118 -374 -379 21 417 299 -112 -343 -156 221 395 83 -270 -285 -26 334
4998C34l7l54l28J78L97J92k50l75n7K51L83l0l56l23J40M07J75k09m09k7K70
$$ 334 297 -57 -385 -207 190 382 132 -243 -300 -49 334 304 -52 -375 -235 172 347 138 -271 -298 -28
5019b8K90m4k80k97J62L09K20j67l79j07L00L02N8l99k29M5L73K21k00l39j15
$$ -28 262 218 -62 -359 -197 112 332 165 -214 -321 -21 281 339 -60 -289 -244 129 350 150 -189 -304
5040c04K86L54l9l68k47J47L48J73k19l57k6K05L04J6k78l40R9L66K52k34l50
$$ -304 -18 336 297 -71 -318 -171 177 350 131 -226 -252 -47 257 273 -5 -345 -246 120 372 138 -212
5061b12j28L21L00O1m44k28J19L84J90k78l42m0K13M00kl34l01N0M18K35j85l96
$$ -212 -340 -19 281 342 -102 -330 -211 173 363 85 -257 -297 -84 316 314 -20 -321 -271 147 382 197 -199
5083a99j88L26L92N7l82l25N3L93K60j95m15k50L93L74N1l19l71P4L71K48j42
$$ -199 -387 -61 331 388 6 -319 -266 127 387 192 -223 -473 -80 294 345 26 -345 -271 100 348 206
5104B06l93k18K11M76J18k91m61J4L17M12m9m48l87L11M80J27l83m03QL49M21
$$ 206 -187 -405 -194 282 400 109 -352 -338 -21 391 342 -106 -493 -182 298 425 42 -361 -353 -4 417
5125D17q9m40l02K19M38J67l09l85j14M01L83l9m20l46J24N47J81k61m90n1L27
$$ 417 328 -112 -414 -195 243 410 101 -284 -398 3 386 347 -73 -419 -295 252 433 172 -318 -369 -42
5146d2M02k0l34l76P2M69K08k21m23j60L20M01K8l57k97N6L82K48j85l97j64K52
$$ -42 360 340 6 -370 -298 171 379 158 -265 -425 -105 296 324 -33 -330 -274 108 356 171 -226 -390 -138
5168a38M34K0l08l05J3L82K35j25m16r9J90L33J14k69l89Q1K86K95r0l50k24J83
$$ -138 296 316 8 -297 -284 98 333 208 -208 -307 -117 216 330 61 -328 -247 39 334 244 -106 -330 -147
5190a47L93Q3l07l13L3L62K82j56m14j52J94M57O4l92k34J1L12K70j20l53k04
$$ -147 246 329 22 -291 -258 104 386 230 -184 -336 -142 315 379 -13 -247 -236 76 346 226 -127 -331
5211c31K13L37J17l23l48R0L25K62j57l55k09K44L99M2l21l65N0M01L02j89m06
$$ -331 -118 219 336 13 -335 -245 80 342 185 -170 -379 -135 264 306 -15 -380 -330 71 373 184 -222
5232b22j65K78L73J45l79l48lL93L09j45m20k44K70L57K08l65l78j0L22M50j29
$$ -222 -387 -109 264 409 30 -318 -321 72 381 236 -184 -428 -158 199 407 42 -336 -346 -24 426 297
5253B97m65k54K53M41J31k64n12L1L19L71n5m96k20K13M33K23l38m63m8L98L99
$$ 297 -168 -422 -169 272 403 139 -373 -342 -23 348 293 -203 -423 -210 223 446 108 -355 -403 -5 394
5274C94p4m66l63K10N19K18k05n52q7L17M80j1m14m07J16N31L02k70n41j97M52
$$ 394 320 -146 -509 -299 220 438 233 -319 -406 -89 391 380 -34 -441 -325 206 508 238 -303 -500 -48
5295d8M31L3m83l68L4N43L39k03n38k20L55M53R4l67m59L1N20K73j29n17k42K79
$$ -48 383 416 -67 -435 -401 142 481 278 -260 -480 -125 328 422 55 -404 -373 147 420 291 -226 -468 -189
5317a89N16J20l67m88O0M31L41j36n01k20K80M31J37l95m49J00M31L56j57m74
$$ -189 327 447 80 -408 -348 83 424 288 -213 -433 -153 278 415 20 -429 -329 102 458 301 -173
5337a73k60K01N19J19k99m72l5M11M38j19n16k34K36M81J44l37m70L7M20L29j05
$$ -173 -433 -232 287 406 107 -365 -400 11 449 330 -186 -420 -184 297 441 104 -366 -329 91 420 315
5358C15n34j77K67L58K11l21m84M0M15L36j65m29k68K46M53J45l40m13m0M36M06
$$ 315 -219 -396 -129 229 440 119 -365 -325 90 426 261 -168 -436 -190 263 408 68 -345 -385 51 457
5379D57j14n24l28L38M86J55m04m91O0M12M63j80m74l36K59M89J89l24n34o4N41
$$ 457 343 -181 -509 -171 315 470 66 -425 -365 47 510 330 -144 -480 -221 268 457 133 -401 -465 76
5400G6M49k06n30l22K79N35J87m09n07RN03L76j35m77l74K39O03K15l63n06j68
$$ 76 525 319 -211 -533 -254 281 468 59 -448 -439 64 440 305 -172 -546 -307 296 511 148 -358 -526
5421e26N16M94m6n23n14L19N39K74k77o51j18N34M24J4n71m37J78O09L06l07o33
$$ -526 -10 484 438 -85 -599 -280 259 533 256 -395 -513 21 445 459 -112 -549 -371 238 544 237 -396
5442c96j31M81N52l2n35m69J39O59K59k84n55l11N23O46q3n59m35J52O22L37l50
$$ -396 -527 -46 506 474 -61 -530 -391 268 527 243 -312 -623 -100 546 463 -96 -531 -379 243 580 230
5463B30n73k01L79O30P8n70m86M2O58L84k72o13k61L79O18J28n68m11J2N75M01
$$ 230 -343 -544 -165 465 543 -27 -513 -471 187 571 299 -314 -575 -196 422 550 -18 -429 -417 158 559
5484E59k00n94l33M29N23J47m63n73J00N69K94j28n83k84L43N35J46m68m71j0
$$ 559 359 -235 -568 -139 384 531 68 -505 -405 164 458 330 -253 -537 -194 341 487 19 -452 -462
5504d62N65M48k57n66k67L54N77J23m88n20M2N81L97k01n55k77L08N11K09m83
$$ -462 103 551 294 -272 -539 -185 392 515 27 -493 -451 130 527 326 -229 -506 -198 313 522 39
5524C9n17L5N44M93k69n59k78K78N93J77m76n75j2O50M07j67n94l16L96N82J08
$$ 39 -478 -443 101 594 325 -234 -512 -234 359 536 60 -515 -527 123 530 363 -231 -547 -151 431 539
5545E39m86n05k0N52M44k01n69k89K92N91K08n24n43J4N71M98j95o16l09L01O69
$$ 539 53 -452 -472 80 524 323 -246 -535 -243 348 556 32 -511 -497 74 572 377 -239 -548 -247 422
5566D22J18m48n88j0N68M61j47o10l54L32N93K40m34n93m6N49M95o5o48m91L33
$$ 422 540 92 -496 -506 62 523 376 -234 -588 -256 337 577 143 -450 -496 53 548 483 -165 -656 -323
5587c23O60K91m64o37q6N12O15j19o24m33K77O80K74m64o01p0M67O04m0o57m53
$$ -323 337 628 164 -473 -559 -47 568 449 -175 -608 -331 349 623 159 -442 -512 -45 559 519 -138 -591
5608e91J73O69L31l11o67k17N84N51j5n53n80K03P09L20l53o71j65N25N46j4n52
$$ -591 -418 251 582 271 -396 -613 -29 522 507 -46 -626 -423 286 606 253 -418 -583 -58 488 474 -78
5629g8m80J64O27M24l96o85j44M72O17M7o35n23K02O48L21l03o54k43N38N58O5
$$ -78 -558 -394 233 657 261 -424 -568 -96 521 568 -67 -590 -388 260 581 278 -376 -619 -81 477 542
5650E42o00m67J48N83L22k86n73k20M69N52J5n59m91J45O06M78l93o84j55M43
$$ 542 -58 -525 -377 206 528 242 -331 -551 -82 470 485 -74 -565 -420 186 664 271 -413 -568 -125
5670a25O06M6n55m96J36O14L54l12o36k07M27N71M0m95m96R2O54M03k66o81k50
$$ -125 481 527 -28 -524 -388 226 580 268 -368 -575 -148 423 463 -32 -528 -436 218 621 355 -326 -576
5691e76M57N93Q8n98n35J10O47M85m16n80k79M49O92J6n77n44J36O31M23k90o85
$$ -576 -119 474 562 -36 -571 -461 186 671 255 -325 -604 -155 537 553 -24 -568 -432 199 622 332 -353
5712c53k57L95O55J35n62n96K2P51M32l10o13l46M80O09J39m97o64J11O12M34
$$ -353 -610 -215 440 575 13 -583 -561 190 622 312 -301 -647 -167 442 581 84 -580 -469 143 577
5732E77j53p17l30L71O69J89m72o81L9N78N61j28q13l85M06O65K54n78o30J3O98
$$ 577 424 -293 -623 -252 417 606 134 -547 -508 70 631 503 -310 -695 -289 376 630 52 -578 -565 133
5753A33M79k15o39l91L84N95K75m73o84n0N82N96j64n84m61K97O84K53n05o06
$$ 133 612 397 -242 -633 -249 346 621 148 -536 -586 -4 592 428 -156 -617 -320 364 617 112 -494
5773d94n4O09N46j48o70l75K61O74K43m25o51o6N70N30q3p04l42K86O26K48m14
$$ -494 -548 61 607 459 -211 -586 -325 349 592 167 -484 -550 20 550 467 -237 -579 -293 333 581 167
5794A67o40j00N41N50j02n65m47L30O26K10m71n69k5N01N32j15n69m27K81N54
$$ 167 -473 -573 -32 518 416 -149 -596 -266 360 570 99 -470 -495 6 538 423 -146 -573 -292 262
5814B62L14l45o69q8N31N54q9n78m73K17O19L68m25o98j45O23N35Po97l85K17
$$ 262 576 231 -438 -526 5 559 470 -108 -581 -364 255 623 198 -500 -645 -22 513 520 -177 -562 -345
5835c45O54L15m03o12j60N24N49l6o61m28J69P63L05l67o91j59N06N96J9o88m48
$$ -345 309 624 221 -391 -551 -27 522 486 -175 -603 -434 329 634 267 -424 -583 -77 519 538 -150 -598
5856e98J98P08K96l61o71j63N49N65j1o30m94J38O70M39l64o09k55M45O54P5o74
$$ -598 -400 308 604 243 -428 -591 -42 523 512 -118 -612 -474 196 635 271 -338 -593 -148 506 581 -93
5877i3n16J20O93M33l24o77k59M87O00J17n84n98J39O03M44k66o58k49M31O27
$$ -93 -609 -489 204 637 313 -364 -623 -136 464 581 -3 -601 -462 141 585 319 -339 -588 -157 470
5897D70J39n40o18R4N91M46k31o17l56L99O69R7n31n34L6N61M51j37o37l06L78
$$ 470 609 69 -549 -455 136 582 351 -266 -622 -223 446 543 12 -522 -486 75 526 389 -248 -554 -176
5918a76O15J29m82n74M8N14N07j61o66l39L39O24K36m66o37NN32M85j96n53l67
$$ -176 439 568 86 -488 -440 74 581 420 -246 -585 -246 378 614 148 -489 -484 48 533 337 -216 -583
5939e83L02O26J70m52n11ON32L81j03n76l16L12N71J82m34n38m8N30M95k06n59
$$ -583 -281 345 515 63 -448 -442 90 471 368 -208 -524 -212 359 541 107 -431 -479 51 546 340 -219
5960b19l33L20N74J39m20m98n3N02M86j44n67l48L03N71K69m99n14m9M74N11j14
$$ -219 -552 -232 342 481 61 -437 -490 12 498 354 -213 -561 -258 313 582 83 -431 -480 -6 505 391
5981C91n53l35K55N76K24m56n67l0N32N06j49n87l12K83O20J50l98n38o8M76M92
$$ 391 -162 -497 -242 334 558 102 -465 -495 37 543 394 -193 -505 -222 398 548 150 -388 -456 20 512
6002E12j07n79m01K88O31K06l93o39r2N73N50p9o20m31K87N94K63l73o10r8M89
$$ 512 405 -174 -575 -287 344 550 157 -482 -574 -1 549 470 -150 -581 -294 300 563 190 -420 -518 -29
6023b9M89L0n96m44J47O14L84l63n73k11M55N90M5n55n70K06N69M15l62n82j77
$$ -29 460 490 -106 -550 -403 211 595 232 -341 -552 -97 493 538 -17 -587 -381 188 603 241 -341 -518
6044e18L81N51R9n52m53J53N31L54k86n75j92L42O00N2m88m40L4N54M34k65o05
$$ -518 -137 414 513 -39 -492 -339 192 546 260 -315 -507 -165 435 487 -1 -441 -407 147 581 316 -289
6065b89k70M31M99J74n10m82M1N20M61k79n52k43L19N24J16l88m60k2M75M84k13
$$ -289 -559 -128 371 545 35 -447 -406 114 575 296 -256 -499 -180 344 460 72 -388 -410 65 549 336
6086C36n88k05K55N39J52m66m84O0M99L59j78n18k55L75M56J16m50l82K0M30K92
$$ 336 -252 -457 -202 337 489 23 -461 -401 98 457 279 -239 -494 -119 337 453 3 -379 -359 71 363
6107C63o6m50k79K13M97J69l73m68j6M79L37r5n42k33K30N76J29l94m42nN03L23
$$ 363 297 -153 -432 -219 278 447 74 -394 -410 69 406 311 -231 -464 -234 342 471 77 -365 -370 133 456
6129D56j99n12k25L25M57J17l12n00J7M09M71j37o04k77L40M78J59l75n21JM98
$$ 456 257 -255 -480 -155 302 419 107 -393 -376 33 504 367 -237 -514 -174 304 463 88 -433 -432 66
6150F6L71j19m95l70L40N29J58l61m91q1M43M82j03n83k41K36N11K47m33n10j00
$$ 66 437 318 -177 -547 -207 322 480 119 -372 -453 -10 472 369 -214 -455 -219 292 539 106 -404 -504
6171e04N22M72j12n30l65K61N24K11l00n36j27M38N05n2m96m05J47O12K25k52
$$ -504 18 490 378 -152 -517 -256 268 479 179 -357 -484 -46 459 407 -89 -494 -347 265 490 238
6191B38o14r7M04M95K2m93l64Q9N13K89k93n04j42L43N20J6m46m02J12M60K87
$$ 238 -376 -473 -69 426 448 -45 -409 -320 193 482 189 -315 -457 -114 406 422 -24 -426 -314 146 433
6212D33j81n01k22L77M14Q0l89m25L1N16L37k53m96k07L59M73N5m09l80K9M41
$$ 433 252 -249 -471 -94 320 400 11 -414 -383 133 470 217 -279 -486 -127 346 401 -8 -388 -359 82
6233H2L41j38m83k67K31N27J22l51m59L9M65K66j37m56k08K77M96M3k98m42pM44
$$ 82 423 285 -198 -465 -234 293 415 64 -395 -356 109 375 238 -218 -426 -149 347 390 92 -350 -357 87
6255H7K24j13l37k12K55L51J20l10l87M6K92L34j00m18k05K22M00J32l36m07K4
$$ 87 311 198 -139 -351 -96 255 375 65 -322 -276 16 350 250 -168 -373 -151 249 381 45 -362 -338
6276c38M07L13j27m42k37K23M58J97m11m12j1M19L19j53l67k33K08M60J39l37
$$ -338 69 382 255 -187 -424 -201 257 454 43 -369 -380 39 358 205 -162 -395 -187 273 412 75
6296G5m11K2L89L60j59m29k65K75L95J07l18l46nM05K71j28m13j75J77L68K04
$$ 75 -336 -314 75 435 276 -153 -418 -143 252 359 41 -305 -310 95 366 238 -175 -350 -173 195 399
6317C99l15m47L1L10M01r6m29k94J98M91J56k49m33q5L72L78o3m27l31K63M35
$$ 399 84 -363 -332 -22 379 283 -146 -440 -242 249 405 156 -277 -362 10 388 325 -102 -433 -170 265
6338B65J41k64m83m4L96L31j1m10l21J93L98J76k00m41j08L75L38j7l79k88R1
$$ 265 406 142 -341 -385 11 342 331 -79 -400 -207 191 367 167 -274 -382 -7 331 314 -65 -353 -262
6359b62M04K15k32l09k01K31N05o4l00l30L1L77L41k12m66j14K47M55K7l33l22
$$ -262 142 357 125 -184 -385 -154 351 287 -13 -343 -312 65 406 194 -272 -386 -139 316 343 10 -312
6380c12k2M14L46k26l99j44J88M05P2k99l45QL97K22q4l62k37K73L00J08k96k70
$$ -312 -334 80 426 200 -199 -343 -155 250 322 23 -322 -314 83 305 221 -141 -378 -105 195 303 7 -263
6402b63n0L84K19n0l58k44K23M26N8l25l07M1L46K10j03k92k89K49L42J06k77
$$ -263 -313 71 290 240 -118 -362 -139 287 345 20 -287 -246 100 310 207 -85 -374 -125 217 323 46
6423D6l88K3L04L43m3m03k02J89L43J09k43l70L6L18K93j49l05k31K28K85J50
$$ 46 -342 -319 -15 328 285 -118 -320 -131 212 321 78 -292 -256 62 355 206 -99 -330 -102 183 333
6444C33j98l82J4K21L09n7l81j93J53M20J21l06l21o6L40L02p3l61j88J49L17
$$ 333 135 -247 -233 -12 297 240 -141 -334 -181 239 360 54 -267 -333 7 309 236 -125 -313 -164 153
6465A53K27k92l32q1L43K85r1l29k07J84L32J62k43l27j02L19L16k5l86j71L4
$$ 153 380 88 -244 -325 18 303 212 -117 -324 -140 192 354 111 -216 -318 1 317 292 -94 -265 -231
6486b31M15J76k46l41r1L10L00o0k73k74J00L42J60j42l56j06K68L16Ol48k10
$$ -231 184 360 114 -227 -318 -8 292 232 -41 -315 -215 127 287 145 -211 -317 -49 267 273 -75 -285
6507b85ML53L11j94l94j55K80K77J12l31k89M7L76K27j39m16q6J78L12J18k73
$$ -285 -281 72 383 189 -205 -360 -80 197 309 -22 -311 -264 112 339 200 -216 -302 -124 188 306 33
6528C3l43M6L06K71j04l35j92K08L60N4k38k97p0L25K85o7l59j71J45L11J09k00
$$ 33 -310 -264 42 313 209 -126 -318 -110 250 304 66 -231 -301 24 309 242 -117 -288 -143 168 277 77
6550G7k84m2K63K97r1k88j93M4M20R5k37l12n1K76K71n3k67k17J47L26J01k33
$$ 77 -207 -249 14 311 220 -68 -261 -217 203 298 61 -251 -302 -26 245 192 -75 -292 -145 181 282 49
6572D9k52o1K21L24k9k78k47Q8K90J92k11l14r4K87K56M8l34k39J38K87J43j48
$$ 49 -203 -264 -43 281 252 -26 -273 -185 105 297 86 -228 -322 -35 221 269 -65 -304 -166 121 264 116
6594A16k97q5K37K68Jk30k33J7L09K05j68l09j72K44L21L6k66k97Q9K78K04j21
$$ 116 -181 -266 -29 239 240 10 -223 -206 103 308 140 -169 -341 -97 224 260 -6 -303 -214 64 268 147
6616A47m04l0K03L52nk82k53K9L42J69j62k99j19K75L08Kk85k73M4L16K05j07
$$ 147 -257 -287 -84 268 263 -19 -272 -243 99 268 106 -193 -312 -37 271 273 -12 -285 -241 75 280 173
6638A73k95j90K08L38Q7l13l08P8L21J77j23k76j77J41L44Q6k51k24q4L38K79
$$ 173 -122 -312 -104 234 321 8 -300 -222 99 276 153 -123 -300 -159 185 271 20 -204 -288 50 329
6659C29j39k64k45J82L24J06k76k96%K78L15p7l39j64J20L25J20k32l51P9J92
$$ 329 190 -74 -319 -137 187 293 17 -279 -279 -1 314 237 -102 -266 -146 179 299 67 -284 -205 -13
6680a3K57J1l47k38J62L51J18k14l30r5K88L07jk85k76J20K93J98j84l62n6K29
$$ -13 244 255 -92 -330 -168 183 301 87 -243 -338 -50 257 256 -29 -305 -185 108 306 122 -240 -296 -67
6702f7L06K5l74j75R7L56J50j83l30j12L05K82l3l09k64J01L58J56j49k99j46
$$ -67 239 264 -110 -285 -188 168 318 135 -195 -307 -2 280 247 -62 -326 -225 133 289 140 -159 -305
6723c05L06K59J4k97k50J48K09K37j58l68l7K20K62P4l06k85L6L29K07j50l15
$$ -305 1 260 274 -23 -273 -125 84 321 163 -205 -242 -22 240 314 8 -277 -241 88 295 145 -170
6744a70q2J55L68k7k88k20M6L03K34k06k93j63K67L27l6j47l35J5L74K02j64l58
$$ -170 -252 -97 271 244 -44 -264 -218 85 319 113 -180 -343 -76 251 215 68 -267 -252 122 324 160 -198
6766a98j34K18L37M4k63l32N9L27K25j11l62j10J90L78K5k47l03k0L50K01p6l43
$$ -198 -332 -114 223 267 4 -328 -269 58 283 172 -190 -300 -110 268 293 46 -257 -277 73 274 198 -145
6788a45j95J70L70J44k88l37k4L39K81n7m20j86J82L64P3k19l38j2L31K57p2k97
$$ -145 -340 -170 200 344 56 -281 -305 34 315 258 -162 -348 -166 198 271 52 -286 -298 33 290 218 -79
6810g9k63J68L40J60k25l48%K19L45n7l59k62J37L91J50k33l86n2L12L22J3l67
$$ -79 -342 -174 166 326 101 -247 -247 -28 317 260 -99 -361 -224 167 317 84 -302 -354 -42 280 293 -74
6832g4k66J72K51K20j48l95q3K73L55m4k77l14R7L64J44j32l96p0K89K87J1l15
$$ -74 -340 -168 83 303 155 -240 -323 -50 305 261 -16 -330 -233 131 275 143 -253 -323 -34 253 264 -51
6854e1k67L2M29J89k10l33j30K80L67j8l41k56P2L72K07j82l26j19J66L86K5l07
$$ -51 -318 -286 143 332 122 -211 -341 -61 306 288 -53 -309 -237 135 342 160 -166 -285 -119 267 292 -15
6876a5l16J12L46K54k32l84j11K76L36L5l62k75J03M02J79j42m15j47K39M16r
$$ -15 -331 -219 127 381 149 -235 -346 -70 266 301 -61 -336 -233 169 348 206 -209 -356 -117 299 290
6897B90l17l31P6M52J99j61m36j67L09L28O6l05k74K9L12L13k01l82j39K05L72
$$ 290 -27 -358 -282 170 369 208 -228 -395 -86 242 308 3 -271 -242 70 383 182 -200 -339 -134 238
6918B38J28l44l30PL68L52j88l68j92J45M00R0k34l84qM23K56q8m56k28K04M56
$$ 238 366 22 -308 -301 67 419 231 -137 -329 -184 216 306 72 -312 -320 103 359 271 -185 -413 -209 247
6940B47Q5k36m10m1L87L24j22k99l25J68M58J36l20l39k7L24M08j35m01k31J68
$$ 247 332 96 -314 -355 32 356 234 -65 -390 -222 236 372 52 -287 -314 10 418 283 -118 -349 -181
6961a81M21J28k38l88j23L46L81m1m26k28J49L95J40k69l20q5L19L89n7m06k58
$$ -181 240 368 130 -258 -381 -35 346 305 -121 -349 -200 195 335 66 -254 -339 -20 369 312 -94 -352
6982c52K02L68J75j97m60j17L66L57J6m34k65J44L80J74k18l88j09K85M07l7l27
$$ -352 -150 218 393 196 -264 -381 -15 342 358 -76 -341 -197 183 357 139 -249 -358 -73 334 297 -30
7003c0l10R2M04J65j92l79j27K69M32pl44l17J06M34J61j84l46j79K51L52J6l09
$$ -30 -340 -248 156 321 129 -250 -377 -108 324 317 -27 -344 -238 196 357 173 -173 -352 -101 251 267 -42
7025d2k95J05L55K15k02l75q8K80L16L5l55l07P7M59J93k23m07j40L40L46O0l70
$$ -42 -337 -232 123 338 136 -239 -327 -47 269 304 -51 -358 -281 178 371 148 -259 -399 -59 287 347 -23
7047b3l63J34L80K46j91m28j32L06L60K4l75l29R3M23K31j36m35j47K93M14J8
$$ -23 -386 -252 128 374 183 -245 -377 -71 289 313 -62 -391 -298 125 356 220 -215 -362 -69 345 363
7068C63l71l60J04L96K22j21m25k02L28L19P4l37l44O2M00K55j34m16k07L14L54
$$ 363 -8 -368 -264 132 354 233 -192 -394 -66 253 327 -10 -354 -292 108 363 229 -187 -394 -80 274
7089B74R7l66l36J0M18L33k12m32j77K45L87R8k37m70J11K93L76j47m40j89J85
$$ 274 371 5 -331 -321 97 430 218 -214 -391 -146 241 339 102 -368 -257 36 412 265 -175 -364 -179
7110a79M30J12l21m14O2L34L93q0m81k47K52L61J53k96l16j23M43K92r2m46k55
$$ -179 251 363 42 -372 -310 24 417 337 -144 -391 -139 222 375 79 -237 -360 83 375 283 -163 -418
7131d18K46L46J74k72m07l5L50L37m3m48k55K07M67J38k70m66K4L64K82j4m22
$$ -418 -172 174 348 76 -331 -366 -16 321 278 -170 -425 -218 249 387 117 -349 -325 39 321 307 -115
7152a15k80J68N00J22k65l92o7K90L66n0m14k49J27M52J84k41m53j9L31L65o6
$$ -115 -395 -227 273 395 130 -262 -329 -39 327 277 -137 -386 -259 193 377 136 -317 -336 -5 360 294
7173B94l54k43J00M11J58k61l87p5L67K47L8l33l29K09L69J35k13m30o8L48L23
$$ 294 -60 -303 -203 208 366 105 -282 -357 10 257 295 -38 -367 -158 211 346 133 -297 -365 -17 306
7194C06pm04k99J88L99J67j94l45j42K81L58j8l47k84J02L85J62j49l85r4K79
$$ 306 299 -105 -404 -216 183 350 156 -189 -331 -50 308 290 -57 -341 -239 146 308 159 -226 -320 -41
7215d1L55P9m44k69J00M19J57k11m03j32L57L86o6l10l43R5M16K16k01m06j06
$$ -41 314 393 -51 -320 -220 199 356 145 -258 -390 -33 353 287 -23 -366 -271 145 361 160 -246 -352
7236c52J95M52P2l35l89Q9M33K13k14m36r1K46M59ol45l83R7M05K31j38m83n9
$$ -352 -157 295 367 32 -357 -268 165 378 164 -272 -363 -117 342 336 -9 -392 -295 110 341 203 -280 -339
7258c39K27L89O6l71k97N7L53K75j45m22j67K40L73J38l47l67P2L62K79j35m48
$$ -339 -112 277 343 -28 -325 -268 85 360 215 -207 -374 -134 239 377 30 -337 -265 97 376 241 -207
7279b07j47J70M29L0k48l30J0L92K71j08l61j87K01L27P3l06l54K7L70L03j27
$$ -207 -354 -184 245 275 27 -303 -293 99 370 262 -99 -286 -85 242 315 9 -345 -318 52 355 228
7300B28m02j87J98L53J61l23l02o0L75K34k7m40j81K05L78J09k52l18o0L31K48
$$ 228 -174 -361 -163 190 351 28 -274 -334 41 275 248 -192 -373 -168 210 319 67 -251 -311 20 268
7321B68Ll66j91J52L95J08l25l17LK56L17n7l02k51J21L94J18j87l47n9L07K89
$$ 268 271 -95 -286 -134 261 369 44 -273 -270 -14 303 246 -56 -307 -186 208 326 139 -208 -267 40 329
7343C29q1l63k06J70L93J01k67l49j3L02L03n5l59k49J71L58J32k80l12p7L58
$$ 329 248 -115 -321 -151 242 343 76 -273 -286 16 319 264 -95 -344 -173 185 317 37 -275 -352 6
7364FK64p8k55k17J07L41J57k06l64n6L14K97o9l35j87J01L49J66k36l72l2K65
$$ 6 270 192 -63 -280 -173 168 325 119 -245 -301 13 310 241 -94 -281 -180 169 335 99 -273 -305 -40
7386d0K87k6l40k39J90K96J88k50k82o2K53L59j11k60k80J24L71J65k14l90o8
$$ -40 247 221 -119 -358 -168 128 316 66 -216 -278 -25 334 223 -37 -317 -193 178 343 129 -261 -329
7407c29L51K50j8k72l11J59L12J83k26k96q6K14K78Q9l81j92L3M10J41j97k86
$$ -329 22 272 254 -18 -329 -170 142 325 99 -197 -283 -69 209 298 -83 -275 -242 168 309 112 -174
7428a74j16K71L06Ok44l92O3L90K54j93l54j26K01L05J16l25l11J20L19K49k21
$$ -174 -290 -19 287 293 49 -343 -280 110 364 171 -183 -309 -108 197 313 -12 -323 -203 116 365 144
7449A44l31j43K63L31pk91k64R4K93J72j14k60j90K05K92J8j99k90N4L46J90j59
$$ 144 -187 -330 -67 264 257 -34 -298 -204 89 261 147 -113 -303 -98 194 212 13 -277 -223 123 313 154
7471A54l57j02J95L13O4k69k46L8K60K29q4l21j71J98K87N0k59j87L6K22J78k3
$$ 154 -203 -305 -110 203 267 -2 -248 -210 50 279 195 -126 -297 -99 188 238 -21 -208 -172 50 228 205
7493B05l46j33J72L37L8l04j98L1K40J81n2k48k46J86L21N8k37k38L9K58K01j02
$$ 205 -141 -274 -102 235 273 -31 -229 -198 42 223 171 -77 -323 -137 184 242 5 -233 -194 64 265 163
7515A63k55j88J78L00K2j98k56k7K72K30q0k84j12J39K20Q1j26k49j2J95J74k
$$ 163 -92 -280 -102 198 220 22 -234 -261 11 241 161 -123 -235 -96 124 205 79 -170 -182 13 187 185
7537A85k68j56J67K26Q5j48k69l6K39K19l1k72j70J23K71P4j84k68j6K30K34o3
$$ 185 -83 -239 -72 154 239 91 -178 -214 25 244 213 -59 -229 -106 165 239 55 -213 -229 1 235 172
7559A72k57j89J06K80J35j06k87j37L05J95L8k33k45M6L40P6j58k25j08K45K11
$$ 172 -85 -274 -168 112 247 141 -146 -283 22 217 255 22 -223 -177 163 239 81 -144 -252 -7 204
7580B04L3k90j89M2L23J04j17k85r0K66J88K7k55j75O2K34J80j68k25j04J66K69
$$ 204 237 -53 -242 -200 123 227 110 -175 -265 1 189 216 -39 -214 -152 82 262 94 -131 -235 -69 200
7602B00J7k01k17k8L51J09j37k19n6J34K38J0k85j28J9K88R1r6k67k8J87J30P5
$$ 200 217 16 -201 -229 122 231 94 -125 -181 -47 191 201 -84 -212 -193 95 186 90 -177 -205 -18 112 187
7625A87j46k43N4K39J62j69j65j24J94K14M4k27j77m2J68K24r1k14o5R5K32L9
$$ 187 41 -202 -148 91 253 84 -81 -205 -11 203 247 20 -157 -199 -31 193 102 -112 -177 -82 150 189
7647A89k10k10NK75J93j05k04j70J51K71k7j36k48O0K00J87r2k39o8Q1K00J27
$$ 189 -21 -231 -226 49 242 137 -67 -237 -86 185 158 22 -226 -166 34 221 129 -110 -178 -97 103 230
7669B30k07k24l0K30K02m5j97j98J43J81R6j70j18j12K87Q6n0k20j54J73K08R4
$$ 230 23 -201 -231 -1 201 156 -41 -239 -96 85 181 11 -107 -219 68 154 104 -116 -270 -97 111 205
7691B05j72j63j7J25J85N0k79j30J10J68R8j34k00NJ44J80j2j83k06N8K74P3j09
$$ 205 33 -130 -147 -22 163 213 -66 -196 -86 82 180 46 -154 -149 -5 175 163 -20 -226 -168 106 179 70
7714G0k21n6K04J43k4j89q1J4K27J45j49j92r0J92J73j3k20j26P9J25J37j23j21
$$ 70 -151 -207 -3 140 116 -73 -154 -140 87 232 83 -109 -199 -7 166 153 -67 -193 -114 11 148 25 -96
7737i6n6J21J95Lj80r0o9J96J50j25j77n3J05K32j3j83j14PJ57J53q0k02j5Q0
$$ -96 -152 -31 164 167 -13 -103 -172 24 174 49 -128 -181 -76 156 143 -40 -154 -147 10 163 83 -119 -134 -54
7761e4J95qj59p2k7J70O7l4j50j30J49J79M1j89j12kJ84J25j14j43n2J09J31Q
$$ -54 141 133 -26 -98 -125 45 112 78 -72 -202 -53 126 167 -22 -134 -136 48 173 59 -84 -136 -27 104 112
7785A12o8j46K2J42M2j3j62q3R3J93lj64r6k2J93J32p0j83q3P2J91M3j56j13m0
$$ 112 44 -102 -80 62 104 91 -71 -154 -61 132 129 -35 -131 -153 40 172 102 -81 -164 -92 99 142 -14 -127 -167
7810a67K24J20l1j91j23J21J99J7j85j16KJ96O3m8j26j30J02J58J40k44r5pJ43
$$ -167 57 177 146 -45 -168 -47 152 169 -16 -132 -130 66 129 81 -45 -175 -73 85 225 -19 -114 -121 22
7833B2J36l2j43j42P2J40Q1o1k22k0J71J36k9j20j58P1J59J23j60j16l6J80L5
$$ 22 158 126 -17 -159 -87 53 134 73 -149 -169 2 138 109 -11 -169 -98 61 184 24 -92 -128 52 87
7856H7N8j30j63K0J84J22j49j64J0J46R9N5j88j52O2J63N0l5j47o6J01J55qp4
$$ 87 145 15 -148 -128 56 178 29 -135 -125 21 120 175 -13 -165 -103 60 110 75 -72 -138 -37 118 110 36
7880C6k04Q8J81P3j12j30j06J10K00Qj21j73L6J38P5oj97l1J20J08K4j68q9OJ17
$$ 36 -168 -80 101 174 62 -68 -174 -64 136 144 23 -150 -114 24 99 93 -104 -135 -15 93 117 -51 -140 -134 -17
7905a7J74o7j81o2N4K39l0j24j25K5J70P7j00q0q2J34J03J8j34j14K5Q3J29j8
$$ -17 157 90 -91 -153 -99 140 110 -14 -139 -114 56 133 33 -47 -129 5 108 126 -8 -122 -97 -14 115 97
7929I7q6j38P1J36Q5j23j50J4R3J10o4j08j07R7J77Nn3j29k8J25J11m0j64q6P7
$$ 97 11 -127 -56 80 165 42 -108 -94 -1 109 45 -63 -170 -73 104 109 56 -73 -101 24 135 95 -69 -155 -78
7954g8J73K6j31j01k3J47J41p0j11j38J36J21j0n8r2p7Q9J64m0r6n6k3J56R5j08
$$ -78 95 121 -10 -111 -134 13 154 84 -27 -165 -29 92 82 24 -68 -145 -56 108 68 -28 -84 -107 49 144 36
7979C6o5j27J81P8M0j65q7M1J46K1m5j10j1L2J19N3k04n5J8J67O5q5r5q3R3J53
$$ 36 -29 -156 25 103 143 -22 -109 -68 78 99 54 -56 -67 -35 84 137 -67 -122 -104 63 128 43 -52 -135 -42 111
8005A11%j32j33L9J86J4j7j60o9J43J20k8o2j13J2J90L9q6j13l4rJ84O7j71q9
$$ 111 111 -21 -154 -115 71 85 68 -92 -161 -18 102 74 12 -101 -89 101 140 54 -59 -93 -102 82 149 -22 -111
8030a11P5N5J10o3j31m3M0J84j2o7r4mJ03N4m9q1j03J46R6O0j64q5k3R5J10K2
$$ -111 -36 19 129 66 -65 -108 -68 116 104 37 -57 -61 42 96 47 -34 -137 9 105 165 1 -84 -107 -12 98 120
8056A20j65j24J01J29J1j00j25N6O5J20K2j49n7J8J31N4q8j38K8O5J26l5j46l6
$$ 120 -45 -169 -68 61 72 -28 -153 -97 -32 88 110 -39 -96 -78 53 107 19 -119 -91 -26 100 65 -81 -117
8080a17O1R5P6q1j35LQ8O5j2r6m0L8J10J7Mj14p2P9J72l5j68q7J00J22K4o2j18
$$ -117 -56 39 115 34 -101 -98 -10 55 43 -53 -93 -55 55 72 76 -38 -110 -31 141 106 -62 -149 -49 73 97 35 -83
8107h3k7P4J16L4j34j31J02Q6P5j15m5o5R6J37j3r7j22K1J33L8rj20q2R1J18k0
$$ -83 -110 -36 80 114 -20 -151 -49 37 112 -3 -48 -113 -17 120 107 10 -112 -91 42 80 71 -49 -131 -40 78 58
8133E8o2j20K9J41J16r2j75OQ8P9O4j92k1J8R6Q4o8j27o3Q3J00Q8j45p9PP5R4
$$ 58 -4 -124 -95 46 162 70 -105 -99 -11 68 132 -60 -81 -63 33 117 49 -78 -141 -58 42 130 -15 -94 -87 -12 82
8160H2qj22o8J03R9j4o9j37J33k0J30l8j36l5L7J13M3p7j07J5R4O7k4j29o8P4
$$ 82 74 -48 -116 -13 86 72 3 -134 -1 -21 109 71 -65 -100 -63 50 93 16 -91 -76 18 85 61 -68 -136 -62
8186f2P6J02r8j44k7
$$ -62 14 116 18 -126 -153
8191a53
$$ Imaginary data points
##PAGE= N=2
##DATA TABLE= (X++(I..I)), XYDATA
0@%%%%%%%%%%%%%%%%%%%%%Mm%mQqJ0j2J0j0J2j2J2j6K0k0K0k0K0k2K5k7K8k7K7
$$ 0 0 0 0 0 0 0 0 0 0 0 0 0 0 0 0 0 0 0 0 0 0 4 0 0 -4 4 -4 6 -6 4 -6 6 -6 6 -10 10 -10 10 -10 10 -12 13 -14 14 -13 14
46A4l0L2l4L8m2M4m8N7o7P9r6J20j51J96k61L52m88P04j059J681k894N674j4259
$$ 14 -16 16 -18 20 -22 22 -26 31 -36 43 -53 67 -84 112 -149 203 -285 419 -640 1041 -1853 3821 -10438
69a0438Q3194L88686k95440l97860K2282J38077K11997O5475j95137j38945l080
$$ -10438 72756 461442 166002 -231858 -209576 -71499 140498 205973 10836 -128109 -131189
80a31189P7542J62415N1824q7822j93588j72481K77071L96472k41433l86226P8414
$$ -131189 -53647 108768 160592 72770 -120818 -293299 -16228 380244 138811 -247415 -169001
91a69001J57396J12954J07442j88459k27519Q2796J68527J04235j9617j90298
$$ -169001 -11605 101349 208791 20332 -207187 -124391 44136 148371 128754 -61544
101f1544j13685P8847J83983J36933j88663k63434J33725J88085l7250J5996m6974
$$ -61544 -175229 -96382 87601 224534 35871 -227563 -93838 94247 56997 72993 26019
112B6019j72528N1780J66040L5966k9839j37423j15145J42666J82114j7781j69268
$$ 26019 -146509 -94729 71311 107277 77438 -59985 -175130 -32464 149650 131869 -37399
123c7399j46710J20742K16558o2431j39080j478q424N4817R7864o2707p1434J1867
$$ -37399 -184109 -63367 153191 90760 -48320 -49798 -58222 -3405 94459 31752 -39682 -27815
135b7815k2164N3110R1437o1749r3947j1757N2752J10752q056j46328k8538Q2339
$$ -27815 -49979 3131 94568 32819 -61128 -72885 -20133 90619 82563 -63765 -92303 -9964
147i964O4338L1345q6839j08270O6007J03914Q105m2439r0841j9816J13644M7513
$$ -9964 54374 85719 -1120 -109390 -43383 60531 68636 26197 -64644 -84460 29184 76697
159G6697m8890m0339n4196J2226J08578K5349o7777n8399l4032N9029J13167o145
$$ 76697 27807 -12532 -66728 -54502 54076 79425 11648 -46751 -80783 -21754 91413 85268
171H5268j10780q2562L4364J44446N6813j18156j03536N822Q2556J16633j2442
$$ 85268 -25512 -108074 -73710 70736 127549 9393 -94143 -88321 -5765 110868 98426
182I8426j56226o1834Q2340R4781M6201o0415j29650k5327J09575J06850j0928
$$ 98426 -57800 -119634 -37294 57487 103688 43273 -86377 -111704 -2129 104721 93793
193I3793j19704q3953M1017J02590Q1170l4064j56815p0057J21211J34651O959
$$ 93793 -25911 -109864 -68847 33743 114913 80849 -75966 -146023 -24812 109839 116798
204A16798j13421j37293J6722J76116R2787j00709j41017k4725R2814J03767J9485
$$ 116798 3377 -133916 -117194 58922 151709 51000 -90017 -114742 -21928 81839 101324
215A01324q0767j13357j7888J16250J10419j9964j22404j07489M1304J73617P6073
$$ 101324 20557 -92800 -110688 5562 115981 96017 -26387 -133876 -92572 81045 157118
226A57118j30515j47363J1619J22545R5450k1018j17337q4374M7157J18161N3774
$$ 157118 26603 -120760 -109141 13404 108854 87836 -29501 -113875 -66718 51443 105217
237A05217n8451j06218m9882P2449J27578J9238j19819r8593L6027J06599O1675
$$ 105217 46766 -59452 -109334 -36885 90693 109931 -9888 -108481 -72454 34145 95820
248I5820l7555j04410n7485O8062J09407J5374q1009q3527o072R0288Q9102l5808
$$ 95820 58265 -46145 -103630 -35568 73839 89213 8204 -75323 -81395 8893 97995 62187
260F2187j11883l7237O3512P5744J5916n4245p0593q775O7218O4929j6356p2134
$$ 62187 -49696 -86933 -23421 52323 68239 13994 -56599 -65374 1844 66773 50417 -21717
272b1717m2317K4510P0320M3742n3615q4906Q042P3188L6061k0540n1677l4642
$$ -21717 -64034 -39524 30796 74538 20923 -63983 -55941 17247 53308 32768 -18909 -53551
284e3551L1897N8946P785m3384l9030M399L9696L1984r085m7542l1763L7150N3844
$$ -53551 -21654 37292 45077 1693 -37337 -32938 6758 38742 29657 -17885 -49648 -12498 41346
297D1346q398m2252k3996M933M1706L3986l3224n1806K067L9208L2036m088m3690
$$ 41346 32948 -9304 -33300 -28367 13339 47325 14101 -37705 -35638 3570 35606 31518 -12172
310a2172l4271K2519N5287J8318m5600m8497Q329M4346L5942o140n8358l9903
$$ -12172 -46443 -23924 31363 49681 4081 -44416 -36087 8259 44201 38061 -20297 -60200
322f0200M0787O1035P211m0625n2260j0019N9419N8027k1614p0891l3946L7241
$$ -60200 -19413 41622 48833 8208 -44052 -54071 5348 63375 41761 -29130 -63076 -25835
334b5835O4353K2468m5110o8461j0733O7944O1487j9489o7608m3068K2461P4820
$$ -25835 38518 60986 15876 -52585 -63318 4626 66113 46624 -20984 -64052 -41591 33229
346C3229M3099n1513q1231r855O2706O3838J433o9129o6662K0953Q5910M4543
$$ 33229 76328 24815 -56416 -66271 -3565 60273 61706 -7423 -74085 -53132 32778 77321
358G7321m4678p7700k8120N1971P9406J4920p2563p3953J3840P9620N2280k5617
$$ 77321 32643 -45057 -73177 -21206 58200 73120 557 -73396 -59556 20064 72344 46727
370D6727p7272m9644M4538R0740K0337o6763o8505m550O5759P0136j4347q2395
$$ 46727 -30545 -80189 -35651 55089 75426 8663 -59842 -64392 1367 71503 57156 -25239
382b5239m7096L5284P3259L3053m3696p1746k1311N5313P4115o40p5272n0415
$$ -25239 -72335 -37051 36208 69261 25565 -46181 -67492 -12179 61936 61296 -13976 -64391
394f4391K2458O2758M5075l1939p7598j7047N2649M8938P472m1988n4920J247
$$ -64391 -41933 20825 65900 33961 -43637 -60684 -8035 40903 48375 6387 -48533 -47286
406d7286N5680M5091j3719o3143l5557L8089N6905J5063m0624n8857M420O2227
$$ -47286 8394 53485 39766 -23377 -58934 -20845 36060 51123 10499 -48358 -43938 18289
418A8289K4805k4602l0500k3602J3450M4694J3216k5839l2902j3944L2187M1707
$$ 18289 43094 18492 -12008 -35610 -22160 22534 35750 9911 -22991 -36935 -4748 36959
430C6959r058l9615k4481J5868M6515Q102m0207j7991R557J4127K2538l435l1661
$$ 36959 27901 -11714 -36195 -20327 26188 34290 -5917 -23908 -14351 -224 22314 18879 -12782
443a2782q247J2940J8493J6523k1900l3565J2200K9332R468j3069k9642j418L1501
$$ -12782 -21029 -8089 10404 26927 5027 -28538 -16338 12994 22462 9393 -20249 -21667 9834
456I834P312j1499o828j4933J744K4458R014p851k3306k2908L0577M4356j7936
$$ 9834 17146 5647 -1181 -16114 -14370 10088 19102 11251 -12055 -34963 -4386 39970 22034
469B2034m2248j3335K0786M3279M821m7076k0565K0165K0981J5290p366k7742
$$ 22034 -20214 -33549 -12763 30516 35337 -11739 -32304 -12139 8842 24132 16766 -10976
481a0976j3628N571L0352L1676k8658n1395K914L5688L3557L804n3899l8962L8149
$$ -10976 -24604 -19033 11319 42995 14337 -37058 -34144 1544 35101 38905 -14994 -53956 -15807
494a5807M6904N192k5570m2342r704M1660L8629l220m5461l9511K6358M9018Q577
$$ -15807 31097 36289 10719 -31623 -41327 333 38962 35742 -9719 -49230 -22872 26146 34723
507C4723j6372l6489l1033L6021N4459m182l5579l5707j0947M9479N2269k1423
$$ 34723 18351 -18138 -49171 -13150 41309 37127 1548 -34159 -45106 4373 56642 35219
519C5219o3137k8818L9837O0000N74m5180l3889m718M1835M8716k1776n1904j1117
$$ 35219 -27918 -56736 -16899 43101 43675 -1505 -35394 -40112 1723 50439 28663 -23241 -34358
532c4358J3950L2039L2766k3084n1828j0285L2030M0594R006l8396m1780p00M7095
$$ -34358 -20408 11631 44397 21313 -30515 -40800 -8770 31824 40830 2434 -39346 -40046 7049
545G049N0180k5489p2590p610N1486L2677n258l7044k9873K0920L0211N92k628
$$ 7049 57229 31740 -40850 -48460 3026 35703 30445 -6599 -36472 -15552 14659 15251 12623
558A2623p774k5665r849L1079M2019j0494o4115k0387N5846M3010j9704m6943
$$ 12623 4849 -20816 -30665 414 42433 31939 -32176 -52563 3283 46293 26589 -20354
570b0354j9929L4483L7414j5302k5647J474P88j324J5118J3964j1173k9437o176
$$ -20354 -40283 -5800 31614 16312 -9335 -7861 -7073 -8397 6721 20685 9512 -19925 -26101
583b6101L3925K2404k1787k7819K46K1546J5752j0442j5249P96N97K267J6566
$$ -26101 7824 30228 8441 -19378 -19132 2414 18166 7724 -7525 -6729 -6132 -3865 12701
596A2701K875k4292j4643J9433K7751o476l4974p715L2420J8871k1997k4442J0888
$$ 12701 15576 -8716 -23359 -3926 23825 17349 -17625 -25340 7080 25951 3954 -20488 -9600
609i600K3491n057j7704O398J2206j1903j3360J5257K3006j0989l5717l690M1350
$$ -9600 13891 8834 -8870 -2472 9734 -2169 -15529 -272 22734 11745 -23972 -27662 13688
622A3688K4618l3128m2064J3287M4935P970l0270j8917O944J4714R309n5p112
$$ 13688 38306 5178 -36886 -23599 21336 29306 -964 -19881 -12937 1777 11086 11031 3919
635C919j2802j0010J2226K7251M228k9285k6327J3172L7019R712k5223k3005l597
$$ 3919 -8883 -18893 -6667 20584 24812 -4473 -30800 -17628 19391 29103 3880 -19125 -22722
648b2722J6896K8910M945l0952k8284O578L6581K6769k3079m4392n194L4857K9301
$$ -22722 -5826 23084 28029 -2923 -31207 -24629 11952 38721 15642 -28750 -33944 913 30214
661C0214q021l1635j3592J0179J3635J8027O763k8038l0635Q327L9279K8628k4557
$$ 30214 22193 -9442 -23034 -12855 780 18807 25570 -2468 -33103 -24776 14503 43131 18574
674A8574n4447o039M8558L4240j5451m2656j9335K5832L0388M338j3565k5571
$$ 18574 -35873 -41912 6646 40886 25435 -17221 -36556 -10724 19664 24002 10437 -15134
686a5134j4173K1093K9293N956k0979l3310l304L6891K5672j1442l0818k3616
$$ -15134 -29307 -8214 21079 27035 6056 -27254 -30558 6333 32005 20563 -10255 -33871
698c3871J5490M0698J1183k6789l2369n957L4358L2262j5564l4405j1008J5550
$$ -33871 -18381 22317 33500 6711 -25658 -31615 2743 35005 19441 -14964 -25972 -10422
710a0422K5904N885j7958j3667n720M072K4183J3605k0721k6305l593K5744L0030
$$ -10422 15482 21367 3409 -10258 -15978 -11906 12277 25882 5161 -21144 -24737 1007 31037
723C1037j2327l8635o695K5116K1011k430k2270j1617J0223R852O290J490j4442
$$ 31037 18710 -19925 -26620 -1504 19507 17077 -5193 -16810 -6587 3265 9555 11045 -3397
736c397j0659Q073J1370P364n376j8650k034J6570O793l850p643q650M304J1267
$$ -3397 -14056 -5983 5387 12751 7375 -11275 -13309 3261 10054 6204 -1439 -10089 -5785 5482
750E482K708m763j0591l942J4504Q589j0945r103J404Q994P907q777j1448O932
$$ 5482 8190 3427 -7164 -11106 3398 11987 1042 -8061 -6657 2337 10244 1467 -9981 -3049
764c049Q298k029k151k600k005K038K081M480J649j1208p635J0379J3069L59j4987
$$ -3049 5249 3220 1069 -1531 -3536 -1498 583 5063 6712 -4496 -12131 -1752 11317 11676 -3311
779c311j4460J0111K1342P84j5401j2218O34J5541J2736p085j5357p870N972J7411
$$ -3311 -17771 -7660 13682 14466 -935 -13153 -12519 3022 15758 8673 -6684 -14554 -8582 8829
793H829Q700j2437j7969m241J4858J9715n01k0685j5411M886K1135J6699j1218
$$ 8829 17529 5092 -12877 -17118 -2260 17455 16954 -3731 -19142 -14256 6879 23578 12360
806A2360k7483q778J8816K4344L507k3578k3394N783K6018J6077r773k5034j3177
$$ 12360 -15123 -23901 -5085 19259 22766 -812 -24206 -18423 7595 23672 13899 -11135 -24312
819b4312J3501K5266J0259j7075k7882n516K5177K5766l128k7934k2039J0197
$$ -24312 -10811 14455 24714 7639 -20243 -25759 -582 25184 22056 -5878 -27917 -17720
831a7720L1579J4437j8012k7618q382J9714K7673K977k5169k3659L112K6745K1140
$$ -17720 13859 28296 10284 -17334 -25716 -6002 21671 24648 -521 -24180 -21068 5677 26817
844B6817j0190k9016j3826J4777K7410R934k0514k5795k198K1336K3542o08k7574
$$ 26817 16627 -12389 -26215 -11438 15972 25906 5392 -20403 -22601 -1265 22277 21669 -5905
857e905j9995J1080K5709J3596j3396k7364o893K0102K0658J715j8647k0437L149
$$ -5905 -25900 -14820 10889 24485 11089 -16275 -23168 -3066 17592 19307 660 -19777 -16628
870a6628K1505J4629n441k2052j4223J4011K1871M049j3423j9150l157K0026J4872
$$ -16628 4877 19506 14065 -7987 -22210 -8199 13672 17721 4298 -14852 -18009 2017 16889
883A6889o234j4686j1131M947J8305O753j0314j2916n221J0748J5204k057j2180
$$ 16889 10655 -4031 -15162 -10215 8090 14843 4529 -8387 -13608 -2860 12344 10287 -1893
896a893p501L64J2206R578q645j0662p93M328R442K439j0796n432M102N052M676
$$ -1893 -9394 -9030 3176 12754 4109 -6553 -7346 -3018 6424 8863 -1933 -7365 -3263 1789 6465
911F465m024q547K478N360P68M89m940l867O683L651l221k013l973J484R226l21
$$ 6465 2441 -6106 -3628 1732 2500 2989 -1951 -5818 865 4516 1295 -718 -4691 -3207 6019 5698
927E698p830l457O64Q394O928r283r606K621O388P516Q6j2406o087O146Q572P043
$$ 5698 -2132 -5589 -4925 3469 10397 1114 -8492 -5871 517 8033 8119 -4287 -10374 -4228 4344 11387
943A1387n909j6108j993J2695J1488J022j5934j4406J0241J7269L278p812j4392
$$ 11387 5478 -10630 -12623 72 11560 12582 -3352 -17758 -7517 9752 13030 5218 -9174
956i174o379J3048J5034J660j2102j8048o05K1660J5095p628k1912j3823J5839
$$ -9174 -15553 -2505 12529 14189 2087 -15961 -16566 5094 20189 12561 -9351 -23174 -7335
969g335K5610j5j8591j4856j427J6945J8688l766k0125j5320N050K4577J4856
$$ -7335 18275 18260 -331 -15187 -16614 331 19019 15253 -4872 -20192 -15142 9435 24291
982B4291j4831k5236p822J9345K5903j602k4575j5226M639J9014J8528o727k6778
$$ 24291 9460 -15776 -23598 -4253 21650 20048 -4527 -19753 -15114 3900 22428 15701 -11077
995a1077j3063J4219K5646Q988k0859k5113J044K3248J9074o478k3950j1870R554
$$ -11077 -24140 -9921 15725 24713 3854 -21259 -20215 3033 22107 15629 -8321 -20191 -10637
1008a0637J7748J2883p316k5583j1520J8278K5046L264k3007k2902O484K6757
$$ -10637 7111 19994 12678 -12905 -24425 -6147 18899 22163 -844 -23746 -17262 9495
1020I495J3331j3575k2460n207J5092J5529K517j0821j6283m081J6069J6727k033
$$ 9495 22826 9251 -13209 -18416 -3324 12205 14722 3901 -12382 -16463 -394 16333 14300
1033A4300j7783j4615O161K1167R818j3471j9285k258J6138J4399l373j5160r677
$$ 14300 -3483 -18098 -11937 9230 19048 5577 -13708 -15966 172 14571 11198 -3962 -13639
1046a3639N713J4344N556q372j0573k134O791Q852K101p231q960n47Q998Q392
$$ -13639 -7926 6418 11974 3602 -6971 -9105 -2314 6538 8639 1408 -7552 -8099 899 9291
1060I291k584j0864n846P334J0759o21j0052n211M892P694Q41o438m434K585M822
$$ 9291 6707 -4157 -10003 -2669 8090 7469 -2583 -7794 -2902 4792 5633 -805 -5239 -2654 2168
1075B168J729k828m410n30M112M061r96o010k997N136N181q38m101m059%N830
$$ 2168 3897 1069 -3341 -3871 241 4302 3306 -2704 -5701 -565 4616 3778 -323 -4382 -4382 1448
1091A448M652j687o635o355L447J2540M666j1630j3737K784J8014Q364j3668j4572
$$ 1448 6100 4413 -2222 -8577 -5130 7410 12076 446 -13291 -10507 7507 15871 2203 -12369
1105a2369K309J2076Q163l162j0058m898J547N574J0213K775j4404j4953N701
$$ -12369 -10060 2016 10179 7017 -3041 -7939 -6392 -818 9395 12170 -2234 -17187 -11486
1118a1486K2240J0924j8038k3153L085K2076J3372q020k0038q498J1811J5398
$$ -11486 10754 21678 3640 -19513 -16428 5648 19020 11000 -9038 -17536 -5725 9673
1130I673N281q157j7892p559J5396J9898R86k0145j8181P291K2399R527r719j8252
$$ 9673 14954 6797 -11095 -18654 -3258 16640 17626 -2519 -20700 -13409 8990 18517 8798 -9454
1144i454r887J1669K1275O164j5095k2676l992K5206K2365j0715k7864j0335J7780
$$ -9454 -19341 -7672 13603 19767 4672 -18004 -21996 3210 25575 14860 -13004 -23339 -5559
1157e559K2603n92j7238j1359j45R747J4666L416j3828j8136k265K2434K1449
$$ -5559 17044 16452 -786 -12145 -12290 -2543 12123 15539 1711 -16425 -18690 3744 25193
1170B5193j1760k9589p833K1449K2971l559k3215j1496R267J4481P899n284j4923
$$ 25193 13433 -16156 -23989 -2540 20431 16872 -6343 -17839 -8572 5909 13808 8524 -6399
1183f399p886P065J5200Q443j1162j8851j318J6324J3071l054j5771j0265O808
$$ -6399 -14285 -7220 7980 16423 5261 -13590 -14908 1416 14487 11433 -4338 -14603 -7795
1196g795J4389P314p302j6784n176J4821J4555l553j5724q506R190J3377l72r056
$$ -7795 6594 13908 6606 -10178 -15354 -533 14022 10469 -5255 -13761 -4571 8806 8434 -622
1210f22m882O23L871M597K342l190q516l389J0222J0485n852j3597k573J1896
$$ -622 -5504 -4881 -1010 3587 5929 2739 -5777 -9166 1056 11541 5689 -7908 -10481 1415
1224A415R758o124j2485m56R424N237l330o168k233K898M370K478k421o611k278
$$ 1415 11173 5049 -7436 -7892 1532 6769 3439 -2729 -4962 -2064 2306 4784 2363 -4248 -6526
1239f526O585O766k020q208m218N224P932J043o157o280o43O584Q226l40j1257
$$ -6526 59 6825 4805 -3403 -7621 -2397 5535 6578 421 -5859 -6502 82 8308 7968 -3289
1254c289q996O524J5429L812j4021j3510M879J5901O193r151j1969j810Q079Q800
$$ -3289 -12285 -5761 9668 13480 -541 -14051 -9172 6729 12922 3771 -8198 -10008 -1929 6871
1268F871K357n972j1406m844J1096J5788l04j7997j3874Q651K1268O507j5615
$$ 6871 9228 3256 -8150 -12994 -1898 13890 13586 -4411 -18285 -9634 11634 18141 2526
1281B526j7264L99J6333J3503m263j5851j0213N083J6374J0476r551j8728n767
$$ 2526 -14738 -14339 1994 15497 11234 -4617 -14830 -9747 6627 17103 7552 -11176 -16943
1294a6943J3386J7839J590j7269j5095L697J7109J3041o349j9872r662J1417J9351
$$ -16943 -3557 14282 15872 -1397 -16492 -12795 4314 17355 11006 -8866 -18528 -7111 12240
1307A2240O347j5871k0057J505J9923J3652o451j8877r552J0404J6441N474r847
$$ 12240 18587 2716 -17341 -15836 4087 17739 11288 -7589 -17141 -6737 9704 15178 5331
1320E331j6547m598J4170J5858J43j5986j5790M891K0818R649j1603j7944m509
$$ 5331 -11216 -15814 -1644 14214 14357 -1629 -17419 -12528 8290 17939 6336 -11608 -16117
1333a6117J4307J5796j684j4501j1263K978J5299R535p719j3821n675P830J4828
$$ -16117 -1810 13986 12302 -2199 -13462 -10484 4815 14350 6631 -7190 -12865 -5035 9793
1346I793L322j2667j1780J380J1990J0576m476j4197n847P388J2485L669j1166
$$ 9793 13115 448 -11332 -9952 2038 12614 8138 -6059 -11906 -4518 7967 11636 470
1359D70j1067K999J0296O446l278j1077m336P719P898Q83o236q153Q81R020N150
$$ 470 -10597 -7598 2698 9144 5866 -5211 -9547 -1828 6070 6953 717 -7436 -6555 2465 7615
1374G615l249q570m499P449Q964j713p657n584K309R584L614p370p064J36O588
$$ 7615 4366 -4204 -8703 -1254 7710 5997 -1660 -7244 -4935 4649 8263 893 -6171 -6035 553
1389E53P042k402r055l686M442Q269L225p997q657K058Q227O131k365j0785m925
$$ 553 7595 5193 -3862 -7548 -3106 5163 8388 391 -8266 -6208 2019 8150 5785 -5000 -9925
1404i925P496R488J918q118j0515J208J1726P396m218j2018o641Q849J2883R82
$$ -9925 -2429 7059 8977 859 -9656 -8448 3278 10674 6456 -5562 -12203 -3354 9529 10511
1418A0511r924j0966p2J3234R998n231j3169p620P098J5341M361j1650j3462j182
$$ 10511 587 -10379 -10451 2783 12781 7550 -5619 -13239 -6141 9200 13561 1911 -11551 -12733
1432a2733J3661J3593m236j6142q524O840J5776P135j1275j5857j926J3039J4252
$$ -12733 928 14521 10285 -5857 -14381 -7541 8235 15370 4095 -11762 -13688 -649 13603
1445A3603q81j6102j1709N583J6010R331q831j7500m615J2385J4861J854j4298
$$ 13603 12722 -3380 -15089 -9506 6504 15835 7004 -10496 -15111 -2726 12135 13989 -309
1458c09j4660L090J6604J0770o794j6992p499J0971J5803K949j2516j4381N78
$$ -309 -14969 -11879 4725 15495 8701 -8291 -15790 -4819 10984 13933 1417 -12964 -12386
1471a2386J4972J1318m277j4737r520P449J6279N348j1440j4426r41J3300J1871
$$ -12386 2586 13904 9627 -5110 -14630 -7181 9098 14446 3006 -11420 -12361 939 12810
1484A2810l086j3864q575N756J3499N782q228j2650l094J0130J2137m11j2827
$$ 12810 9724 -4140 -12715 -6959 6540 12322 4094 -8556 -11650 -1520 10617 10206 -2621
1497b621r228M960J2413N377p299j0870k160Q499Q902l66q557p398J891R579O381
$$ -2621 -11849 -6889 5524 10901 3602 -7268 -9428 -929 7973 7607 -950 -8348 -6457 3122 9503
1512I503n009j0515l115Q308R167j439r541n720M373Q808K629o448o840J96N915
$$ 9503 4494 -6021 -9136 -828 8339 6900 -2641 -8361 -3988 4820 7449 1001 -5839 -5643 272
1527B72N627o46p472n271L819Q311K915o425q261O61Q620N889l637r042l395O676
$$ 272 5899 5253 -2219 -7490 -3671 4640 7555 1130 -7131 -6470 2150 8039 4402 -4640 -8035 -1359
1543a359P796J34o699p026P52R118O301m728r608l759O973J0025L96r626p964
$$ -1359 6437 6571 -128 -7154 -6402 2716 9017 4289 -5319 -9078 -2105 7920 8316 -1310 -9274
1558i274K533J0504O111n737j0003l383O157J0621K880j0166j0792J634J2026
$$ -9274 -6741 3763 9874 4137 -5866 -9249 -3092 7529 10409 243 -10549 -8915 3111
1571C111R061n121j4126n577R679J2820J499j1719j1037K630J1927Q102l663j2673
$$ 3111 12172 7051 -7075 -12652 -2973 9847 11346 -373 -11410 -8780 3147 11249 7586 -5087
$$ [...]
8191H0
##END NTUPLES=NMR FID
##END=
