##TITLE=1H_AM-1Sh
 aceton-d6, 24 sc, 
 31.1.2020
##JCAMPDX= 6.0         $$ Bruker NMR JCAMP-DX V2.0
##DATA TYPE= NMR FID
##DATA CLASS= NTUPLES
##ORIGIN= UXNMR, Bruker Analytische Messtechnik GmbH
##OWNER= root
$$ XWIN-NMR		Version 3.5
$$ Fri Jan 31 14:22:55 2020 Russian Standard Time (UT+4h)  she@DPX200
##.OBSERVE FREQUENCY= 200.1315
##.OBSERVE NUCLEUS= ^1H
##.DELAY= (6, 6)
##.ACQUISITION MODE= SIMULTANEOUS
##.ACQUISITION SCHEME= undefined
##.AVERAGES= 24
##.DIGITISER RES= 18
##SPECTROMETER/DATA SYSTEM= spect
##.PULSE SEQUENCE= zg30
##.SOLVENT NAME= Acetone
##.SHIFT REFERENCE= (INTERNAL, Acetone, 0, 15.7039)
##AUDIT TRAIL= $$ (NUMBER, WHEN, WHO, WHERE, WHAT)
$$ ##TITLE= Audit trail, XWIN-NMR		Version 3.5
$$ ##JCAMPDX= 5.01
$$ ##ORIGIN= Bruker BioSpin GmbH
$$ ##OWNER= she
$$ F:/spectra/data/she/nmr/H-F/1/audita.txt
$$ ##AUDIT TRAIL=  $$ (NUMBER, WHEN, WHO, WHERE, WHAT)
(   1,<2020-01-31 14:22:01.79 +0400>,<she>,<DPX200>,
      <continue with go, POWCHK disabled, PULCHK disabled
       configuration hash MD5:
       00 E9 B6 7A A2 85 ED C7 34 08 36 98 17 FE 4E 26
       data hash MD5: 16K
       0B A7 17 10 D4 A4 70 CC F4 3E B4 86 6A 1F 29 CE>)
$$ ##END=
$$ 
$$ hash MD5
$$ AB 4E 5E CE 7B 1B 93 60 90 A1 B4 8A BE 89 28 04
##$RELAX= 
##$RELAX= 
##$RELAX= 
##$RELAX= 
##$RELAX= 
##$RELAX= 
$$ Bruker specific parameters
$$ --------------------------
##$DU= <F:/spectra>
##$EXPNO= 1
##$NAME= <H-F>
##$PROCNO= 1
##$TYPE= <nmr>
##$USER= <she>
##$AMP= (0..31)
100 100 100 100 100 100 100 100 100 100 100 100 100 100 100 100 100 100 
100 100 100 100 100 100 100 100 100 100 100 100 100 100 
##$AQSEQ= 0
##$AQ_mod= 1
##$AUNM= <au_zg>
##$AUTOPOS= <>
##$BF1= 200.13
##$BF2= 200.13
##$BF3= 200.13
##$BF4= 200.13
##$BF5= 200.13
##$BF6= 200.13
##$BF7= 200.13
##$BF8= 200.13
##$BYTORDA= 1
##$CFDGTYP= 0
##$CFRGTYP= 5
##$CHEMSTR= <none>
##$CNST= (0..31)
1 1 145 1 1 1 1 1 1 1 1 1 1 1 1 1 1 1 1 1 1 1 1 1 1 1 1 1 1 1 1 1 
##$CPDPRG= <>
##$CPDPRG1= <>
##$CPDPRG2= <>
##$CPDPRG3= <>
##$CPDPRG4= <mlev>
##$CPDPRG5= <mlev>
##$CPDPRG6= <mlev>
##$CPDPRG7= <mlev>
##$CPDPRG8= <mlev>
##$CPDPRGB= <>
##$CPDPRGT= <>
##$D= (0..31)
0 1.2 0 0 0 0 0 0 0 0.06 0 0.03 0 0 0 0 0.0002 0 0 0 0 0 0 0 0 0 0 0 0 
0 0 0 
##$DATE= 1580466000
##$DBL= (0..7)
120 120 120 120 120 120 120 120 
##$DBP= (0..7)
150 150 150 150 150 150 150 150 
##$DBP07= 0
##$DBPNAM0= <>
##$DBPNAM1= <>
##$DBPNAM2= <>
##$DBPNAM3= <>
##$DBPNAM4= <>
##$DBPNAM5= <>
##$DBPNAM6= <>
##$DBPNAM7= <>
##$DBPOAL= (0..7)
0.5 0.5 0.5 0.5 0.5 0.5 0.5 0.5 
##$DBPOFFS= (0..7)
0 0 0 0 0 0 0 0 
##$DE= 6
##$DECBNUC= <off>
##$DECIM= 24
##$DECNUC= <off>
##$DECSTAT= 4
##$DIGMOD= 1
##$DIGTYP= 9
##$DL= (0..7)
0 120 120 120 120 120 120 120 
##$DP= (0..7)
150 150 150 150 150 150 150 150 
##$DP07= 0
##$DPNAME0= <>
##$DPNAME1= <>
##$DPNAME2= <>
##$DPNAME3= <>
##$DPNAME4= <>
##$DPNAME5= <>
##$DPNAME6= <>
##$DPNAME7= <>
##$DPOAL= (0..7)
0.5 0.5 0.5 0.5 0.5 0.5 0.5 0.5 
##$DPOFFS= (0..7)
0 0 0 0 0 0 0 0 
##$DQDMODE= 0
##$DR= 18
##$DS= 0
$$ [...]
##$SUBNAM2= <"">
##$SUBNAM3= <"">
##$SUBNAM4= <"">
##$SUBNAM5= <"">
##$SUBNAM6= <"">
##$SUBNAM7= <"">
##$SUBNAM8= <"">
##$SUBNAM9= <"">
##$SW= 24.9337058887773
##$SWIBOX= (0..15)
0 0 2 0 0 0 0 0 0 0 0 0 0 0 0 0 
##$SW_h= 4990.01996007984
##$TD= 16384
##$TD0= 1
##$TE= 0
##$TE2= 300
##$TE3= 300
##$TEG= 300
##$TL= (0..7)
0 120 120 120 120 120 120 120 
##$TP= (0..7)
150 150 150 150 150 150 150 150 
##$TP07= 0
##$TPNAME0= <>
##$TPNAME1= <>
##$TPNAME2= <>
##$TPNAME3= <>
##$TPNAME4= <>
##$TPNAME5= <>
##$TPNAME6= <>
##$TPNAME7= <>
##$TPOAL= (0..7)
0.5 0.5 0.5 0.5 0.5 0.5 0.5 0.5 
##$TPOFFS= (0..7)
0 0 0 0 0 0 0 0 
##$TUNHIN= 0
##$TUNHOUT= 0
##$TUNXOUT= 0
##$USERA1= <user>
##$USERA2= <user>
##$USERA3= <user>
##$USERA4= <user>
##$USERA5= <user>
##$V9= 5
##$VALIST= <valist>
##$VCLIST= <CCCCCCCCCCCCCCC>
##$VD= 0
##$VDLIST= <DDDDDDDDDDDDDDD>
##$VPLIST= <PPPPPPPPPPPPPPP>
##$VTLIST= <TTTTTTTTTTTTTTT>
##$WBST= 1024
##$WBSW= 4
##$XGAIN= (0..3)
0 0 0 0 
##$XL= 0
##$YL= 0
##$YMAX_a= 930623
##$YMIN_a= -1398147
##$ZGOPTNS= <>
##$ZL1= 120
##$ZL2= 120
##$ZL3= 120
##$ZL4= 120
##$ABSF1= 10
##$ABSF2= 0
##$ABSG= 5
##$ABSL= 3
##$ALPHA= 0
##$AQORDER= 0
##$ASSFAC= 0
##$ASSFACI= 0
##$ASSFACX= 0
##$ASSWID= 0
##$AUNMP= <proc_1d>
##$AZFE= 0.1
##$AZFW= 0.1
##$BCFW= 1
##$BC_mod= 2
##$BYTORDP= 1
##$COROFFS= 0
##$CY= 11.3945322036743
##$DATMOD= 1
##$DC= 2
##$DFILT= <>
##$DTYPP= 0
##$F1P= 16.9975609425685
##$F2P= -3.02152046262296
##$FCOR= 0.5
##$FTSIZE= 0
##$FT_mod= 4
##$GAMMA= 1
##$GB= 0.15
##$INTBC= 1
##$INTSCL= 1
##$ISEN= 128
##$LB= 0.24
##$LEV0= 0
##$LPBIN= 0
##$MAXI= 10000
##$MC2= 0
##$MEAN= 0
##$ME_mod= 0
##$MI= 1.114404
##$NCOEF= 0
##$NC_proc= 0
##$NLEV= 6
##$NOISF1= 3.799351
##$NOISF2= 2.8
##$NSP= 1
##$NTH_PI= 0
##$NZP= 0
##$OFFSET= 15.70392
##$PC= 1
##$PHC0= -9946.175
##$PHC1= 12.00081
##$PH_mod= 1
##$PKNL= yes
##$PPARMOD= 0
##$PSCAL= 0
##$PSIGN= 0
##$REVERSE= no
##$SF= 200.130013532006
##$SI= 16384
##$SIGF1= 3
##$SIGF2= 2
##$SINO= 400
##$SIOLD= 16384
##$SREGLST= <1H.CDCl3>
##$SSB= 0
##$STSI= 0
##$STSR= 0
##$SW_p= 3612.71676300578
##$SYMM= 0
##$S_DEV= 0
##$TDeff= 0
##$TDoff= 0
##$TI= <>
##$TILT= no
##$TM1= 0
##$TM2= 0
##$TOPLEV= 0
##$USERP1= <user>
##$USERP2= <user>
##$USERP3= <user>
##$USERP4= <user>
##$USERP5= <user>
##$WDW= 1
##$XDIM= 8192
##$YMAX_p= 0
##$YMIN_p= 0
$$ End of Bruker specific parameters
$$ ---------------------------------
##NTUPLES= NMR FID
##VAR_NAME=  TIME,          FID/REAL,        FID/IMAG
##SYMBOL=    X,             R,               I
##VAR_TYPE=  INDEPENDENT,   DEPENDENT,       DEPENDENT
##VAR_FORM=  AFFN,          ASDF,            ASDF
##VAR_DIM=   8192,          8192,            8192
##UNITS=     SECONDS,       ARBITRARY UNITS, ARBITRARY UNITS
##FACTOR=    0.0002004,     1,               1
##FIRST=     0,             0,               0
##LAST=      1.6414764,     0,               0
##MIN=       0,             -1398147,        0
##MAX=       1.6414764,     930623,          0
$$ Real data points
##PAGE= N=1
##DATA TABLE= (X++(R..R)), XYDATA
$$ [...]
1326g72K29P22L85l69j45j37n6k07K2M74N64k15q55l27L52N22L28j68m80j52J2
$$ -772 -543 179 564 195 50 -87 -143 -350 -328 146 710 495 -360 -687 -335 187 515 347 -133 -285 -273
1347b73k8O1N10K79k89n09k49L20L85J37k51J11j66k96j77J87O50K28m26o86r3
$$ -273 -301 -240 270 549 260 -249 -498 -178 207 344 93 204 38 -258 -435 -248 402 630 204 -482 -575
1368e75N06O08k17l60J0q9k6n3K8N85L9l60m84p5L58L28R6p4j78l14j87R4N64
$$ -575 -69 539 322 -38 -28 -117 -143 -196 -168 417 456 96 -388 -463 -105 223 319 245 67 -247 -434 -340 224
1391B24L19j48n67l03J09M15K86k07j86K25j64k25j56K33M47J15l37n34J14K24
$$ 224 543 395 -172 -475 -366 49 335 128 -58 167 3 -222 -378 -145 302 417 80 -454 -340 -116
1411a16K85L0M5j89k48j05J60M14J59k77k38k61K56L5J29J38qn2k12k44m2M86
$$ -116 169 199 244 55 -193 -298 -138 276 435 158 -80 -341 -85 -50 79 217 209 157 -55 -299 -341 145
1433A45L08q9n04k96K49L94K7j14n6j06k54l2L38K38m4k32k08k4K20J47O7M6j01
$$ 145 453 364 -140 -436 -187 207 234 120 64 -42 -296 -328 10 248 204 -28 -236 -260 -40 107 174 220 119
1456A19j70j38o8K01K07L3q7k70j6J84k3Q4J47M9k86j10j27K95L25j6l29k47K
$$ 119 -51 -189 -257 -56 151 184 97 -173 -189 -5 -28 56 203 252 -34 -144 -271 24 349 333 4 -243 -241
1479b41K30K25j49J46j24k47j1q5K07K52p6m6j80n0J67J30N6R3k63j17k78J68
$$ -241 -11 214 65 211 87 -160 -171 -256 -49 203 127 81 -99 -149 18 148 204 297 34 -83 -361 -193
1501a93M12M0k55k23J5N6K01Kj14J44n4j8j56o0J51K43p8k06p1p2K49L7J71r5
$$ -193 219 259 4 -219 -204 -148 53 55 -59 85 31 13 -143 -203 -52 191 113 -93 -164 -236 13 50 221 126
1525A26j67j76R7j8K49J46j57k59l4M2J31Q2M1Mm6p5j71J20J83J71k35k59J39
$$ 126 -41 -217 -120 -138 111 257 100 -159 -193 -151 -20 62 103 107 61 -14 -185 -65 118 289 54 -205 -66
1548f6j27K29R7M4k38l3jPR4O8R2j14j48p2P3J35j53K05J08j66j32j17J97J43
$$ -66 -193 36 133 177 -61 -94 -95 -88 6 74 166 52 -96 -168 -95 40 -113 92 200 34 -98 -215 -18 125
1572A25L7m9k00m4JJ96l9O0j03j06m6J6J23K21qq3k15J5M3J86j21j4K0L0r7n7
$$ 125 162 113 -87 -131 -130 66 27 87 -16 -122 -168 -152 -29 192 184 101 -114 -99 -56 130 9 -5 15 45 -52 -109
1598a09J06J59J13k94k19J03K33J8Kj36N0n4n1J5J35J18j38j22j76L06l0l6o5
$$ -109 -3 156 269 -25 -244 -141 92 110 112 -24 26 -28 -79 -64 71 189 51 -71 -247 59 29 -7 -72
1621g2Q3J19j22j66m5J93K19n7j89j47N0N5J55j61J69Qn5r3q8L18k0j19k59J21
$$ -72 11 130 8 -158 -203 -10 209 152 -37 -184 -134 -79 76 -85 84 92 37 -56 -144 174 154 35 -224 -103
1645a03J35M5Oj41J21j0O0l72K00K39L8j95j71l1K68J52k87j63L96n0j69j75M7
$$ -103 32 77 83 -58 63 53 113 -259 -59 180 218 23 -148 -179 89 241 -46 -209 187 137 -32 -207 -160
1668a60L46M7l88m9J38K39q7j30q5L04N9k86q6K1J90J07j53k45J13L12j45j70
$$ -160 186 233 -155 -204 -66 173 86 -44 -129 175 234 -52 -138 -117 73 180 27 -218 -105 207 62 -108
1690a08J51J86o4k57j66K84K55j87k67p0L10J52k35k53J43M56j86l78j58M00M61
$$ -108 43 229 165 -92 -258 26 281 94 -173 -243 67 219 -16 -269 -126 330 144 -234 -392 8 469
1711D69l36l30%K76J65l58j06K23J98j17l64O2M21O2k17m11K87L67k01l00K4L23
$$ 469 133 -197 -197 79 244 -114 -220 3 201 84 -280 -218 203 265 48 -363 -76 291 90 -210 -186 137
1733A37J17j94n37J05N66K16n04k49J80M46k3m44k4M64L9l02n00L36N01o7n04
$$ 137 254 60 -477 -372 194 410 -94 -343 -163 283 260 -184 -208 256 295 -7 -507 -171 330 263 -241
1754b41j26M68K19k78k79J8M38K10n04l04K78N86k03o40j10O29L34m97l84J63
$$ -241 -367 101 320 42 -237 -219 219 429 -75 -379 -101 485 282 -358 -468 161 495 -2 -386 -223
1774b23O67j93n18k22N94K84j23o09J7P24On03m18L65O23j18p14j71P53L68m66
$$ -223 444 251 -267 -489 105 389 266 -343 -326 398 404 -99 -517 -152 471 353 -361 -532 221 589 123
1795A23o03J34O71R0p33j72N28M82l95o89Q5P85M08p07o32M38Q24k25q41p3O41
$$ 123 -480 -346 325 415 -318 -490 38 520 125 -564 -479 306 714 7 -625 -187 637 412 -429 -502 139
1816A39N51o44o79K48R77K5q03m38N13O66l39p14O5P98K36p08o55M70J066l17
$$ 139 690 46 -633 -385 592 617 -186 -624 -111 555 216 -498 -433 365 601 -107 -762 -292 774 457
1836D57q50k64Q04O55o92q30K69J118Q1j146m11P19Q51l08j051j63R50O16p53
$$ 457 -393 -657 147 802 110 -720 -451 667 748 -398 -809 -90 761 453 -598 -761 189 805 52
1855E2q28M05R49l6r59k74O93O57m11r28K44J014K7r24o24Q87R38m33j066k5J119
$$ 52 -776 -371 578 542 -417 -691 2 659 248 -680 -436 578 605 -319 -943 -56 882 449 -617 -642 477
1876D77L46q50r60O93J091n8j183l53R93O89n39j077J53R85M70j041o67O27J021
$$ 477 823 -27 -987 -294 797 739 -444 -797 196 885 346 -731 -578 407 877 -164 -831 -204 817
1895H17l49j141j11J104O06q84j061O00J140M5j170n45J108Q13o35j058J12J198
$$ 817 468 -673 -784 320 926 42 -1019 -419 721 766 -404 -949 159 972 337 -721 -609 589
1913E89M50j235q42P72J251m47j282j58J127Q61j002j058M37J269J19j237p45
$$ 589 1039 -196 -1038 -266 985 538 -744 -902 225 1086 84 -974 -537 732 851 -386 -1131
1930a131J153R65m46j265p9J340M71r83j111Q23J253l26j402k72J431O92r79j197
$$ -1131 22 987 541 -724 -803 537 1008 25 -1086 -263 990 664 -738 -1010 421 1113 134 -1063
1948a063M83J371K67j532o38J067J358q05j548P9J582O06j249j150P48J398j76
$$ -1063 -580 791 1058 -474 -1112 -45 1313 508 -1040 -961 621 1227 -22 -1172 -424 974 798
1965G98j475m29J307J042j030j296K95J631K21j471p82J159J245p20j509l2J590
$$ 798 -677 -1106 201 1243 213 -1083 -788 843 1064 -407 -1189 -30 1215 495 -1014 -1046 544
1982E44P50j338j308Q04J563O8j680o35J321J301j077j525L88J641L29j605r16
$$ 544 1294 -44 -1352 -548 1015 1083 -597 -1232 89 1390 313 -1212 -824 817 1146 -459 -1375
1999a375J060J494m41j608k00J555P82j161j459R20J511j08j666o44J496J271
$$ -1375 -315 1179 738 -870 -1070 485 1267 106 -1353 -433 1078 970 -696 -1340 156 1427
2015A427r89j655L29J665N11j543j052R67J595m73j664l33J738R89j362j445O62
$$ 1427 438 -1217 -888 777 1288 -255 -1307 -340 1255 782 -882 -1215 523 1512 150 -1295 -633
2032f33J743M6j877p19J485J399r50j810L22J819N94j731j102J137J500k89j762
$$ -633 1110 1156 -721 -1440 45 1444 494 -1316 -994 825 1419 -312 -1414 -277 1223 934 -828
2049h28m50J603J111j197j684Q08J681K16j842q22J435J445q62j834O3J981O94
$$ -828 -1278 325 1436 239 -1445 -637 1044 1260 -582 -1404 31 1476 614 -1220 -1157 824 1518
2066A518j686j280R07J816l23j851n05J716J280j201j689L37J993K32j692j071
$$ 1518 -168 -1448 -541 1275 952 -899 -1404 312 1592 391 -1298 -961 1032 1264 -428 -1499
2082a499J257J774q17j821j05J905Q50j638j554R38K116k35k071n22J656J462
$$ -1499 -242 1532 715 -1106 -1211 694 1544 -94 -1648 -710 1406 1171 -900 -1422 234 1696
2098A696j333j775L15K108M98j913j229J389J750p16j964j41K026Q17j474j631
$$ 1696 363 -1412 -1097 1011 1509 -404 -1633 -244 1506 790 -1174 -1315 711 1528 54 -1577
2114a577R92J948j09k122q00J883J567j282j933L26K003O23j951j206J257J851
$$ -1577 -585 1363 1254 -868 -1668 215 1782 500 -1433 -1107 896 1519 -432 -1638 -381 1470
2130A470n58k065j57J962Q55j312j753P15K037R6k000q94J624J630j062j952J34
$$ 1470 912 -1153 -1310 652 1507 195 -1558 -843 1194 1290 -710 -1604 20 1650 588 -1364 -1230
2147a230K166O18j764j516J295J974m76k058m72J902J261j392j890O82K076J75
$$ -1230 936 1554 -210 -1726 -431 1543 1067 -991 -1463 439 1700 308 -1582 -900 1176 1351
2163A351k005j010J734J601r14k132R4J996J014j903j378J103J980m35k084o36
$$ 1351 -654 -1664 70 1671 757 -1375 -1281 715 1729 -174 -1552 -449 1531 1096 -988 -1624
2179a624J977J324j308j937N61K138L50k023j234J756J748r41j978k28K174R00
$$ -1624 353 1677 369 -1568 -1007 1131 1481 -542 -1776 -20 1728 787 -1191 -1419 755 1655
2195A655j741j599J027K160j73k262o14J780J448j228j994M10K194M74k005j255
$$ 1655 -86 -1685 -658 1502 1329 -933 -1547 233 1681 453 -1541 -1131 1063 1537 -468 -1723
2211a723J501J888p18k072m01K129J019j616j656P72K251N8k235r02J726J656
$$ -1723 -222 1666 948 -1124 -1525 604 1623 7 -1649 -877 1374 1432 -803 -1705 21 1677
2227A677j098k051K13K289O33k078j413J410J949m21k176l27J872J206j481j924
$$ 1677 579 -1472 -1259 1030 1663 -415 -1828 -418 1531 1110 -1066 -1393 479 1685 204 -1720
2243a720R60K061L3k050r67J768J573r61k028Q2K185N68j762j436J225J977m24
$$ -1720 -760 1301 1334 -716 -1683 85 1658 697 -1331 -1249 936 1504 -258 -1694 -469 1508 1084
2260A084k161m64K013J186j429j929Q08K083K65j985j096J507J865r59k104k8
$$ 1084 -1077 -1541 472 1658 229 -1700 -892 1191 1456 -529 -1625 -118 1747 788 -1316 -1344
2276a344K113P58j665j507J134J899k45k121n64J919J261j343j899O39K164L75
$$ -1344 769 1527 -138 -1645 -511 1388 1143 -978 -1542 377 1638 295 -1604 -965 1199 1574
2292A574k139j194J630J763p65k133l6J963R38j572j653R92J946r1k042q05J848
$$ 1574 -565 -1759 -129 1634 869 -1264 -1300 663 1601 29 -1624 -632 1314 1223 -819 -1624 224
2309B24J409j148k012N64J886N18j853j234J392J827n42k228j53J979R93j545
$$ 224 1633 485 -1527 -963 923 1441 -412 -1646 -254 1573 1031 -1197 -1350 629 1622 77
2325G7j587P30K052J02k099r42J838J525j050j979K09K113N41j888j273J300J879
$$ 77 -1510 -780 1272 1374 -725 -1667 171 1696 646 -1333 -1124 989 1530 -358 -1631 -331 1548
2342A548n38k071k99J728J220j367j759P57J963R5k025p69J588J490r65j849L2
$$ 1548 1010 -1061 -1360 368 1588 221 -1538 -781 1182 1277 -748 -1517 71 1561 596 -1253 -1221
2359a221K022O95j687j370J078J816l24k081k75J722J127j206j754N45K054J20
$$ -1221 801 1496 -191 -1561 -483 1333 1009 -1072 -1347 375 1502 296 -1458 -913 1141 1261
2375A261j944q60J491J561r30j670j47J926P85j667j238Q91J810k59j820m99J661
$$ 1261 -683 -1543 -52 1509 579 -1091 -1238 688 1473 -194 -1432 -541 1269 1010 -810 -1309 352
2392C52J183j238j714N42J850K49j706j040J333J606o67j797l30K001Q01j509
$$ 352 1535 297 -1417 -875 975 1224 -482 -1522 -189 1417 750 -1047 -1377 624 1425 -84
2408h4j473R10J847j21j719o46J511J092q95j695N00J738K48j640q96J093J662
$$ -84 -1557 -647 1200 1079 -640 -1286 225 1317 422 -1273 -773 965 1213 -427 -1323 -230 1432
2425A432o62j743j21J598Q22j319j306P44J746r1j786o49J404J293r66j561J51
$$ 1432 770 -973 -1094 504 1326 7 -1299 -555 1191 1100 -686 -1335 69 1362 396 -1165 -1014
2442a014J717N38j417j167J003J546m86j646k02J539R38j197j463O77J627N1j681
$$ -1014 703 1241 -176 -1343 -340 1206 720 -926 -1128 411 1349 152 -1311 -634 993 1044 -637
2459f37o62J342J148p18j562J51J635O13j320j259Q24J583l45j499m26J357J010
$$ -637 -1299 43 1191 473 -1089 -938 697 1310 -10 -1269 -445 1138 793 -706 -1132 225 1235
2476A235j060j260L83J574pj305o66J026J254n57j508q5J507O79j283j132O82
$$ 1235 175 -1085 -702 872 865 -440 -1106 -80 1174 617 -891 -976 531 1210 -73 -1205 -523
2493e23J523k45j500l57J230J152j082j400L97J679J82j538o84J066J163m92j480
$$ -523 1000 755 -745 -1102 128 1280 198 -1202 -805 874 1056 -482 -1166 -100 1063 571 -909
2510i09N6J414N73j303r61P77J243m6j478m65J163J006q26j270L95J346L00j384
$$ -909 -853 561 1134 -169 -1130 -353 890 844 -634 -1099 64 1070 244 -1026 -631 715 1015 -369
2528c69o71Q36J247m52j322j75J353O82r96j151M69J424p7j226n45J144Q85p34
$$ -369 -1040 -204 1043 591 -731 -906 447 1129 133 -1018 -549 875 798 -428 -973 171 1056 322
2546C22j157Q7J303L36j089p09Q08J035l76j249k19J281O77r85j029N74J063Q4
$$ 322 -835 -748 555 891 -198 -907 -99 936 560 -689 -908 373 1050 65 -964 -390 673 757
2564G57j129n48Q86J031n33j263J66J136L33r40p98O05J115k42j177j50R84N56
$$ 757 -372 -920 -34 997 464 -799 -633 503 836 -104 -902 -297 818 576 -601 -751 233 789
2582G89o19r88L80J043J7j011n37R28Q20m99j064J32J097L18q20q77O32J048k06
$$ 789 170 -818 -438 605 622 -389 -926 2 822 323 -741 -609 488 806 -14 -891 -259 789 583
2601E83j035k65Q85P25o25j033L48R82J28r30o20Q32Q30l81j097Q9Q53M75p00
$$ 583 -452 -717 168 893 268 -765 -417 565 693 -237 -857 -25 805 424 -673 -584 269 744 44
2620D4q19N02J071j78r44m11Q14O96n90r12K76Q04K07p86m90P04N79k28q01j39
$$ 44 -775 -273 798 620 -324 -735 79 775 185 -727 -451 353 560 -226 -716 -12 567 339 -462 -601
2640f01Q49N44q46n98L78P49J32r46l99Q31N42l84p78J68Q62O2p15m69M83P48
$$ -601 248 792 -54 -652 -274 475 607 -339 -738 93 635 251 -527 -359 503 565 -150 -619 -136 612
2660F12k68p76j58P93M09o23o99L41R59mq16l45N89N98n12n91J16P73J81o93m73
$$ 612 344 -432 -590 203 612 -11 -710 -369 590 586 -230 -575 14 612 100 -491 -375 398 579 -114 -587
2681e87L08Q78q9r46k2N52N05n37o00K50O10P1n69m25M99P33m87o16j5Q00J90
$$ -587 -279 599 510 -436 -458 94 599 62 -538 -288 322 393 -176 -601 -102 631 144 -472 -487 313 503
2702E03n31n41M52O12j43p74j36P20K58m16n02J44O97J26o37k25M11M74l08n02
$$ 503 -28 -569 -117 495 352 -422 -558 162 420 4 -498 -354 343 469 -168 -393 18 492 184 -318
2722c18j18P25L5l45l79L32N95j40o88j88N26L68l08m87O0O13J55n12k93L18M54
$$ -318 -436 289 324 -21 -400 -68 527 387 -301 -489 37 405 97 -390 -330 283 438 -74 -367 -49 405
2743D05j83n42J9N00J29l93l26J75N80o6n07j71L98L68l70m49J82N10R2m32k79
$$ 405 222 -320 -301 199 328 -65 -391 -216 364 298 -209 -380 18 386 16 -433 -251 259 351 -81 -360
2764c60K81M68o6n53q8L93L21m39k88J84M58Nm78j66L17L08k16l73L0N25J41l63
$$ -360 -79 389 323 -230 -318 75 396 -43 -331 -147 311 316 -162 -328 -11 297 81 -292 -262 263 404 41
2786D1l62K77L68j31l23j84L70K63l59l03K10M01kl96k19K97L22j63m24R0L61
$$ 41 -321 -44 324 193 -130 -314 56 319 -40 -343 -133 268 266 -130 -349 -52 270 107 -317 -227 134
2807A34J74l43k69K20L00l5l86L2J88K13k21k19J16L48q7j46j85J88K76j93k31
$$ 134 308 -35 -304 -84 216 181 -205 -173 15 228 7 -212 -96 252 165 19 -166 22 298 105 -126
2828a26p4L46M7k48k1n7M56j22k44j63K24K12j61k18M0K30Q5l24j02K73K47j15
$$ -126 -200 146 193 -55 -76 -133 323 201 -43 -206 18 230 69 -149 -109 121 206 -118 -220 53 300 185
2850A85l32J00K10j6j69k02K00J19M9k32o0J82K46l04j17R8Q4J38k68j85K47J47
$$ 185 -147 -47 163 147 -22 -224 -24 95 144 -88 -148 34 280 -24 -141 -43 41 179 -89 -274 -27 120
2872A20L2k43pJ52K00l86j2NJ75K23k61j28R2K07j85j23Q4Q1J86j99j56J79J17
$$ 120 152 -91 -98 54 254 -132 -144 -139 36 259 -2 -130 -38 169 -16 -139 -55 26 212 13 -143 36 153
2895A53o7j61r5K89N5j50k04J53J23K0k07q9J72R6J1k16j18L43M3k34p6O8O1J86
$$ 153 86 -75 -170 119 174 24 -180 -27 96 116 -91 -180 -8 88 99 -117 -235 108 151 -83 -159 -91 -30 156
2919A56k12l9P7J0j0r8R7M9L4j40n6K24M3j36r6n8J15J56j22j22J39N4l0j32N8
$$ 156 -56 -95 -18 -8 -18 -116 -19 30 64 -76 -132 92 135 -1 -97 -155 -40 116 -6 -128 11 65 35 -97 -39
2944c9m7J57j55P8l3J18rj4k07J35J10n1j33J49m1j7M7j08%J17o6m8MJ55q3N2
$$ -39 -86 71 -84 -6 -39 79 70 56 -151 -16 94 43 -90 59 18 1 48 -60 -60 57 -9 -57 -53 102 19 71
2970G1K7j56Q4n5RLo3J95m6j30N1l9M5Jj20M1J08j6O4j12M4l1P9j58k7J33N1m6
$$ 71 98 -58 26 -29 -20 -17 -80 115 69 -61 -10 -49 -4 -3 -123 -82 26 10 74 -38 6 -25 54 -104 -131 2 53 7
2998Gj08J03J1m6j9J2O0M4mj94J90%j1m9p5P9J35j9j00j33J11j6m6Q0l5M5O0q4
$$ 7 -101 2 13 -33 -52 -40 20 64 60 -134 56 56 45 -4 -79 0 135 116 16 -117 -6 -22 -68 12 -23 22 82 -2
3026bm4QP5K2o9n7QJ13m5q1Q9o2J51r4k3j6R8j69J23q2J56m9q2l9R2j15O4J02
$$ -2 -46 -38 37 59 -10 -67 -59 54 9 -72 17 -45 106 12 -11 -27 71 -98 25 -57 99 50 -32 -71 21 -94 -30 72
3054G2j19J47nj62J11j33K01j45O4JN3q2n5k4J40j00P5k6j31O6J93j30J9K2q0
$$ 72 -47 100 95 -67 44 -89 112 -33 31 32 85 3 -52 -76 64 -36 39 13 -118 -52 141 11 30 52 -28
3079b8Q9j43K3J06m5j1j7R0n8l2nN6Qj34J36j0o7J0qnQ7m1o9M9K8nL5jr4R1j06
$$ -28 61 -82 -59 47 2 -9 -26 64 6 -26 -31 25 33 -101 35 25 -42 -32 -40 -45 42 1 -68 -19 9 4 39 38 -56 35 -71
3110g1R5j0j0l9K6l1L1M8pp2N8Oo8L9K5N8j17N8m3k1O2p4O2j9P4p1L3P2p5l9j2
$$ -71 24 14 4 -35 -9 -40 -9 39 32 -40 18 24 -44 -5 20 78 -39 19 -24 -45 17 -57 5 -14 60 -11 22 94 19 -20 -32
3141c2pN8j4N2p7r7J01k2J27j77Q9M1k0k6m5L8m3J11j09m2P5j9n7J27J3q4P7k6
$$ -32 -39 19 5 57 -20 -117 -16 -38 89 -88 1 42 22 -4 -49 -11 -54 57 -52 -94 -19 -38 -95 32 45 -39 38 12
3169A2J4k2J63j77q3J56o6j6K7j45J32oO1M2j51Q1j00l1n4Q0R5L3r3P4K7%l2n
$$ 12 26 4 167 -10 -93 63 -3 -19 8 -137 -5 -11 50 92 -59 22 -78 -109 -163 -83 12 45 -48 26 53 53 21 16
3197A6l8K7N5q9L8M4n2m0mJ5J46j28JJqj3Q2m2o2k1J26j35O4L3R9j01o7J7J0J46
$$ 16 -22 5 60 -29 9 53 1 -39 -43 -28 118 -10 -9 -8 -16 -29 53 11 -51 -72 54 -81 -17 16 115 14 -53 -36 -26 120
3227A20p9j42Q7oQLL1J7r3O4L8O7k08K29j29j77J31J39mo3n9J16o2j53J54j06
$$ 120 41 -101 -14 -20 -12 -9 22 39 -54 10 48 115 -93 136 7 -170 -39 100 96 33 -26 90 28 -125 29 -77
3253g7J10j9q9rK3L0J20q7M6o3J02K3j02Orj8Nml5J0k2L0JpP5n9k3J7P8n6p2L6
$$ -77 33 14 -75 -84 -61 -31 89 2 48 -15 87 110 8 14 5 -13 -8 -12 -47 -37 -59 -29 -28 -35 40 -19 -42 -25 53 -3 -75 -39
3285c9nP7J5K6r1M7K4l8M0K3K7Mk21N9P6j7J04k28J38l9L7j18J01J5M3n9m4m3
$$ -39 -44 33 48 74 -17 30 54 16 56 79 106 110 -111 -52 24 7 111 -117 21 -18 19 -99 2 17 60 1 -43 -86
3313h6J4J86k03M4L3P5Q0j05J4m4M5o6r4M5R2j44N2k3P1M8q3J13j67M3M4j4K7
$$ -86 -72 114 -89 -45 -12 63 143 38 52 8 53 -13 -107 -62 30 -114 -62 -85 -14 34 -49 64 -103 -60 -16 -30 -3
3340cm7n6J33l9j2K7J1nk7j7M0P3q9n8NO8L9l8P4J2M4l1m8j66JR7L0l5l1l3J28
$$ -3 -50 -106 27 -12 -24 3 14 9 -18 -35 5 78 -11 -69 -64 4 43 5 79 91 135 104 56 -110 -109 -12 18 -17 -48 -81 47
3371D7n1K6K7m5j15J00R8Mo4m5j0P0N9j05j21J33pQ8j74Q8J8n0M6q5qO6P4q7J71
$$ 47 -4 22 49 4 -111 -11 87 91 27 -18 -28 42 101 -4 -125 8 1 89 -85 3 21 -29 17 -68 -76 -10 64 -23 148
3400A48j08Ppj00R2o3J19r4J2L7J4l0j4JJ8M1L3j02Ll4JL4q9K5J03n3k3p4J19
$$ 148 40 47 40 -60 32 -31 88 -6 6 43 57 27 13 14 32 73 106 4 7 -27 -26 8 -81 -56 47 -6 -29 -103 16
3429A6Q3j6p2Nj2R9p8j19M7k0L3o7M2M8P9j75R2j10J52j3j73J07J12Q7j00l9r2
$$ 16 99 83 11 16 4 103 25 -94 -47 -67 -34 -101 -59 -11 68 -107 -15 -125 27 14 -159 -52 60 147 47 8 -84
3456h4R5M1j04n8P4P0L4J0j57J07J3m3q5J14J08k9j55N2J4K7O0k25J14J59j05
$$ -84 11 52 -52 -110 -36 34 68 78 -79 28 41 -2 -87 27 135 106 -49 3 17 44 104 -121 -7 152 47
3481D7j55J9J04N0Nj05M9q3R7j53J32o1J28J06j71j15P0J61p0k01J24O0l5o9L9
$$ 47 -108 -89 15 65 70 -35 14 -69 28 -125 7 -54 74 180 9 -106 -36 125 55 -146 -22 38 3 -66 -27
3506b7P8l6o0L7j18J74km9n3O4n3J5J6%j21P7Q7r5Q9j1Q6o2J1n9J44j76J18j06
$$ -27 51 15 -45 -8 -126 48 46 -3 -56 8 -45 -30 -14 -14 -135 -58 29 -66 23 12 98 36 47 -12 132 -44 74 -32
3534c2P3j3K8o4k7N9Jk9q0J24m6o0L3o6J62K1p4j3M2O1m6j58J32J7k1j05k5J28
$$ -32 41 28 56 -8 -35 24 25 -4 -84 40 -6 -66 -33 -99 63 84 10 -3 39 100 54 -104 28 45 24 -81 -106 22
3562B2J27j19m3j21K14o9j7l3J10j6O9j04l0Qm4j5J76k60K27r8N1p7n1P9n7L2
$$ 22 149 30 -13 -134 80 11 -6 -39 71 55 124 20 -10 -2 -46 -61 115 -145 82 -16 35 -42 -93 -14 -71 -39
3588c9q0K24j05M6j9k9m7O5J8j20J13j9N0k8r3J1J18n6n7O7q2P4J3J3Lk5K4Rm4
$$ -39 -119 105 0 46 27 -2 -49 16 34 -86 27 8 58 30 -63 -52 66 10 -47 20 -62 12 25 38 41 16 40 49 5
3617EM0k6p4j20J40J50k33P7J24Mr4O6j01j9O1N2J4j8k2Ro9J9J2m1L0n4J12n5
$$ 5 45 19 -55 -175 -35 115 -118 -41 83 87 -7 59 -42 -61 0 52 66 48 26 35 -34 -15 -3 -44 -14 -68 44 -11
3645a1j05J07o1O7L9R8J0j23j8l4Q0n4J02j51J03p9M5o5J06n3N0j74J04k5p8J81
$$ -11 -116 -9 -70 -3 36 134 144 21 3 -31 49 -5 97 -54 49 -30 15 -50 56 3 53 -121 -17 -42 -120 61
3671F1Or8L0l5L4O0%n0r4L6M4L4k4kn6M2L4j1M8o9mkP5j19J19n8k4M6o9l2K2o
$$ 61 67 -31 -1 -36 -2 58 58 8 -86 -50 -6 28 4 2 -54 -12 22 11 59 -10 -14 -16 59 -60 59 1 -23 23 -46 -78 -56 -62
3703f2J35m9Jj9L6k4m7j0P4O9j11kQ9m6K5j18J58%rr8k0N8o6K14j16o6R1r2O5
$$ -62 73 24 25 6 42 18 -29 -39 35 104 -7 -9 80 34 59 -59 99 99 90 -8 -28 30 -36 178 62 -4 87 -5 60
3732F0q5O3Mo5m5J75r4Jn8J6n8J08q6MR1k0l9j3J7MQ7p2L1p3O0%j5PK9j06J32
$$ 60 -25 38 42 -23 -68 107 13 14 -44 -28 -86 22 -64 -60 31 11 -28 -41 -24 -20 67 -5 26 -47 13 13 -2 5 34 -72 60
3763F0n9QL4m5m1l0%L6J23q7MMm1R2k12J79jj1P5j28J31r0l8Q2j27J13l7k9K2
$$ 60 1 9 43 -2 -43 -73 -73 -37 86 -1 3 7 -34 58 -154 25 24 13 88 -40 91 1 -37 45 -82 31 -6 -35 -13
3792a3O1j12J02j11J54p1j3l4O2n9M6n9Q0p4q0J05M7O0o8j04J84j10M8q7M6m6
$$ -13 48 -64 38 -73 81 10 -3 -37 25 -34 12 -47 33 -41 -121 -16 31 91 23 -81 103 -7 41 -46 0 -46
3818d6oQ6o2m3Q9K8m6O3m6O5l3k8R8j06L2j5o9K0R1o7J6Q8n9l9m3j47J81Q6j56
$$ -46 -52 34 -28 -71 18 46 0 63 17 82 49 21 119 13 45 30 -39 -19 72 5 21 109 50 11 -32 -179 2 88 -68
3847f8P3M6L1p2m9Q1K7o8j13J76l0l6J24j11j09M1R0m3k8P0m1J7n1J09j07K7k
$$ -68 5 51 82 10 -39 42 69 1 -112 64 34 -2 122 11 -98 -57 33 -10 -38 32 -9 8 -43 66 -41 -14 -16
3874a6K7m7O9N6j15J9p9J16j68K03o0K5p7R1m4K5L7R6j66Kn6N5MJ07p9k3o2J17
$$ -16 11 -36 33 89 -26 -7 -86 30 -138 65 5 30 -47 44 0 25 62 158 -8 -6 -62 -7 -3 104 25 2 -60 57
3902E7K8p0L7l2o0q8J81J4m2L8o9J4m9O1jm6M6q2J7k6J26q0j04J35k4L2Qm7O1
$$ 57 85 15 52 20 -40 -128 53 67 25 63 -6 8 -41 20 19 -27 19 -63 -46 -72 54 -26 -130 5 -19 13 21 -26 35
3931C5p1P4l7R0j45J42j53o8J03o6K3n6J13J33p2pj04J50m0q8Nj4Q6%N0j31rO2
$$ 35 -36 38 1 91 -54 88 -65 -133 -30 -96 -73 -129 -16 117 45 38 -66 84 44 -44 -39 -53 33 33 83 -48 -57 5
3959EJ48j85J7l4M1M5j11O0PN0o7O3p9J51j72J2J8r5J33O3j33jK4L4o6M2L4j20
$$ 5 153 -32 -15 -49 -8 37 -74 -14 -7 43 -24 39 -40 111 -61 -49 -31 -126 7 70 -63 -64 -40 -6 -72 -30 4 -116
3987a16L3J43n8p4LO6J0n0JJ76j13k6R6q5K5j6l8M0m8mL6L7L9J8j18lM9PQmmk18
$$ -116 -83 60 2 -72 -69 -3 7 -43 -42 134 21 -5 91 6 31 15 -23 17 -31 -35 1 38 77 95 -23 -26 23 30 38 34 30 -188
4019a88K10J0m4J29j51j1P8kMJj8O7j37K5O4j24J58j23N8J0o0P8N8Rr4k0n9J07
$$ -188 22 32 -12 117 -34 -45 33 31 35 36 18 85 -52 -27 37 -87 71 -52 6 16 -44 34 92 101 7 -13 -72 35
4047C5k0j8j7m5J26j3n0l1L0R9m7M6r7M4k15K25l6L0m5J1L2p7KM3P6n1j35K05
$$ 35 15 -3 -20 -65 61 48 -2 -33 -3 96 49 95 -2 42 -173 52 16 46 1 12 44 -33 -31 12 88 37 -98 107
4075A07pk13K8k7Q2J22j51k1Q1N9j38JJ06q7O5n2j2L8j3L6j04J21qp3P4o2J35
$$ 107 100 -113 -85 -112 -30 92 -59 -80 1 60 -78 -77 29 -58 7 -45 -57 -19 -32 4 -100 21 13 -60 14 -48 87
4102H7o1P5j44qN8j3j9L0j3m9J15j9j29J24j15O5J0oJ10p0p1Mk0M5J23j08L7J8
$$ 87 26 101 -43 -51 7 -6 -25 5 -8 -57 58 39 -90 34 -81 -16 -6 -12 98 28 -43 -39 -59 -14 109 1 38 56
4130E6J34k25k1J21l7j8r9M6J05N5j02k6o3N6J1l0J4O2k6N9k32M1J39K9q4j22
$$ 56 190 -35 -56 65 28 10 -89 -43 62 117 15 -11 -74 -18 -7 -37 -23 39 13 72 -160 -119 20 49 -35 -157
4156a57J86L1j16nM8L3L2jo2j65J86k0n2j6J5J19m1L5p2l6J18j32K4j30J82R8
$$ -157 29 60 -56 -61 -13 20 52 51 -11 -176 10 -10 -62 -78 -63 56 15 50 -22 -58 60 -72 -48 -178 4 102
4182A02q1j84J48L9p4N8j28J31P5L0j36km0P4L5j09K6J7Nj00J75j4q7OL2O6M1
$$ 102 21 -163 -15 24 -50 8 -120 11 86 116 -20 -22 -62 12 47 -62 -36 -19 -14 -114 61 47 -40 -34 -2 64 105
4209A05n9j58J04Q2J9j47O6oJ25k9j75p7Q9J51n7q1j8O8Kn9n3J45M6j45J22j29
$$ 105 46 -112 -8 74 93 -54 12 6 131 102 -73 -150 -61 90 33 -48 -66 2 4 -55 -108 37 83 -62 60 -69
4235f9R7O1k8j66kJ81n3Oq1J63q5o6j11J11J18j54J01j61Q2J38k2l0J5n8NK7j10
$$ -69 28 89 61 -105 -107 74 21 27 -54 109 24 -42 -153 -42 76 -78 23 -138 -56 82 60 30 45 -13 -8 19 -91
4262i1J25j1l7Kj07O2J21Oj37n6P4K69l73J30j29J65k2j7l7J13o9o2K7O3k8K0
$$ -91 34 23 -14 -12 -119 -57 64 70 -67 -123 -49 220 -153 -23 -152 13 -9 -26 -63 50 -19 -81 -54 9 -19 1
4288Aj62J96k9J86j65o4m1N8J11j01km6R8P9p3n8pj6O7j54J69r3jL8K4n8n6J55
$$ 1 -161 35 6 192 27 -37 -78 -20 91 -10 -12 -58 40 119 46 -12 -19 -35 32 -122 47 -46 -47 -9 15 -43 -99 56
4316E6n2j32J91j32J44j90J10P0o0q8L0R0l6j09Q4K3KJ2p8L5RO8o0J47j40o0J16
$$ 56 4 -128 63 -69 75 -115 -5 65 5 -83 -53 37 1 -108 -24 -1 1 13 -65 -30 -21 47 -13 134 -6 -66 50
4343E0o0p5J6J77o0o9qJ9Q7j02J9J2R3l0q8j3P0p5N5p8m7J25No9L8k2q8J69j11
$$ 50 -10 -85 -69 108 48 -21 -29 -10 77 -25 -6 6 99 69 -19 -32 38 -37 18 -60 -107 18 23 -46 -8 -30 -118 51 -60
4372f0J8N9l1k9m9R5q5O6L6q0J00q7PL8l1P2Oj48j0J90k1J9j53M4K3L1r0J35l4
$$ -60 -42 17 -14 -43 -92 3 -82 -16 20 -60 40 -47 -40 -2 -33 39 45 -103 -113 77 56 75 -78 -34 -11 20 -70 65 31
4401C1p6j3J36j05j21J24l8R4l8p3J64m0j93N3L4P5K3j03L0R0J4m8QNmp5L0l5
$$ 31 -45 -58 78 -27 -148 -24 -62 32 -6 -79 85 45 -148 -95 -61 14 37 -66 -36 54 68 20 28 33 29 -46 -16 -51
4429e1O5%P7j71L0P4Nj36j9J67j00R0J4p8N3m1K6J11j11pk9O9K8r9J6L1o0j4J30
$$ -51 14 14 91 -80 -50 24 29 -107 -126 41 -59 31 45 -33 20 -21 5 116 5 -2 -31 38 66 -33 -17 14 -46 -60 70
4458G0j48P7k8mN4J06k3q0L8Q0j14o4J32j15M4Nj35P1P5mm1L2M3K0k0k1m7P3p1
$$ 70 -78 -1 -29 -33 21 127 104 24 62 142 28 -36 96 -19 25 30 -105 -34 41 37 -4 28 71 91 71 50 3 76 5
4487Ej21O5m4L26j88m9L2K4p8kj8%P8kp0r2N7J00K2Mj5q8J11pj24L2R3j2j19l7
$$ 5 -116 -51 -95 231 43 -6 26 50 -28 -30 -48 -48 30 28 -42 -134 -77 23 45 49 34 -54 57 50 -74 -42 51 39 -80 -117
4517a17R7O3m3j8J5O1o2n0M5J3Pj0j9k2N1Q7k42J07J8L7m8N2K0L0nOj06j3k7P9
$$ -117 -20 43 0 -18 -3 58 -4 -54 -9 4 11 1 -18 -40 11 98 -144 -37 -19 18 -30 22 42 72 67 73 -33 -46 -73 6
4547Fn3O0M7j8op8J73j82Q7j0n6m7O9k9L6p3L0Km1J31nj04rO1o0K21j21K4m6m9
$$ 6 -47 13 60 42 36 -42 131 -51 36 26 -30 -77 -8 -37 -1 -74 -44 -42 -83 48 43 -61 -70 -9 -69 152 31 55 9 -40
4577d0JR5Mj28K0jLj8J06q3K8K1p7k0M3K7N6k6M4j07J50j21J4M0J09n9j01lO5
$$ -40 -39 56 60 -68 -48 -49 -46 -64 42 -41 -13 8 -69 -89 -46 -19 37 11 55 -52 98 -23 -9 31 140 81 -20 -23 42
4606D2l1j49J66m3J6Q5p2j31J59nm6r0J8L2k4R5q2o0N9J69j05p2j6J80J8j37k2
$$ 42 11 -138 28 -15 1 86 14 -117 42 37 -9 -99 -81 -49 -73 22 -60 -120 -61 108 3 -69 -85 95 113 -24 -46
4633d6L0M0J0o7M9M5N1k6p7j6M2p8N5q2J16k4j8j5K8P5o2N0j36J4P7kj04J26o4
$$ -46 -16 24 34 -33 16 61 112 86 9 -7 35 -43 12 -70 46 22 4 -11 17 92 30 80 -56 -42 35 33 -71 55 -9
4662ik0M8q6J4J53j65P2M2Lj29J47j43J37j11qJ35j07P8Mn4k6n8M8Q9r2L8l5L0
$$ -9 -29 19 -67 -53 100 -65 7 49 52 -77 70 -73 64 -47 -55 80 -27 51 55 1 -25 -83 -35 54 -38 0 -35 -5
4690eJ08r8j00R5O1j9j49J23M3p6j1m8N4K5J0l5M6j1j31K04k26J41o0J04k5n0
$$ -5 103 5 -95 0 61 42 -107 16 59 -17 -28 -76 -22 3 13 -22 24 13 -118 86 -140 1 -59 45 20 -30
4716c0j5j8L3J03n2jN9q6mM3N0J6j20k1M7l2K0n8l1R6O0q4Q7p0R6p5k13J31J41
$$ -30 -45 -63 -30 73 21 20 79 -7 -11 32 82 98 -22 -43 4 -28 -8 -66 -97 -1 59 -25 62 -8 88 13 -200 -69 72
4745G2r4o6RQ1J30j06j4J8p4N7l6pL6j0J23q7o1JJ53o9r1K7J06p3o5q1J38L8n1
$$ 72 -22 -88 -79 2 132 26 12 30 -44 13 -23 -30 6 -4 119 32 -29 -28 125 56 -35 -8 98 25 -40 -121 17 55 4
4774Dm7N0J8M6j48m4N0J58nn6l0P3l6p1k5k7K38j29l1qK3JO1k7p7N8Rl1q7o6K03
$$ 4 -43 7 25 71 -77 -121 -71 87 82 26 -4 69 33 -38 -63 -90 148 19 -12 -20 3 4 65 38 -39 19 28 -3 -90 -156 47
4805D7J1j03j30J61qlQ1j78L1J30r2O7k6J2m7N2l8l9R3j2Pl1k1O5o2mN6P9J5j91
$$ 47 58 -45 -175 -14 -22 -25 56 -122 -91 39 -53 14 -12 0 -47 5 -33 -72 21 9 16 -15 -36 29 -33 -37 19 98 113 -78
4835g8oJ52o2q7p9J43J23j1p2n2J8k5Q2j45M3J19l0J6r4N7rPJ8j0k0J38n7l8r5
$$ -78 -84 68 6 -81 -160 -17 106 95 23 -29 -11 -36 46 -99 -56 63 33 49 -45 12 3 10 28 18 -2 136 79 41 -54
4864e4k3J08Nl8O7L7j38L0MK1O4o3j02J8J32k3L3r3m8R0J4p0M2p9J28j12j6P9
$$ -54 -77 31 36 -2 65 102 -36 -6 -2 19 83 20 -82 -64 68 45 78 -15 -63 27 41 -29 13 -66 62 -50 -66 13
4892A3O6k3j32N0P7p2K3k3l5J31m3L6j47O3R7p7q9M9O2Q0j25j68J23J11j88R3
$$ 13 79 56 -76 -26 51 -21 2 -21 -56 75 32 68 -79 -16 81 4 -85 -36 26 106 -19 -187 -64 47 -141 -48
4918d8N6K0p1J3qK3PM9j37J55j29Q9k2m2L0l4J34r1m8J20mj94O2N5N1q8J9J55
$$ -48 8 28 -43 -30 -38 -15 -8 41 -96 59 -70 19 -3 -45 -15 -49 85 -6 -54 66 62 -132 -70 -15 36 -52 -33 122
4946A22j97P2Q2j05kn6J5L6l4N3K2M0j13J04n1m4J86j71L4L4N4q4n5N1j7O5l5
$$ 122 -75 -3 79 -26 -28 -84 -69 -33 -67 -14 8 48 -65 39 -12 -56 130 -41 -7 27 81 -3 -58 -7 -24 41 6
4973Fn9Q3P7j47L6j3M2M2j58J19o0LO1k64J56J10l7k7j45K41k7l4m6j5J38j30
$$ 6 -53 30 107 -40 -4 -17 25 67 -91 28 -32 -29 32 -232 -76 34 -3 -30 -175 66 39 5 -41 -56 82 -48
4999d8O3mJ6j15J11l4OJ9lJ0j31Q9l6J37o9n5J00j43J37n1k8o2P7M5J4p6J29n2
$$ -48 15 11 27 -88 23 -11 -5 14 11 21 -110 -21 -57 80 11 -44 56 -87 50 -1 -29 -91 -14 31 45 -31 98 46
5027D6n7j7O5Mo3k5k1nP2m%j28J71k9k7j10P8J42j84J23m7M0J6k6l4K6jJ2j2p5
$$ 46 -11 -28 37 41 -22 -47 -68 -73 -1 -5 -5 -133 38 9 -18 -128 -50 92 -92 31 -16 24 40 14 -20 6 5 17 5 -70
5057g0R6O1l9q3k5L4j8P0j13P7J28r7M1j66Q1J53j21L8j18L4K2qR1j21j9Q9k8
$$ -70 26 87 48 -35 -60 -26 -44 26 -87 -10 118 21 62 -104 -23 130 9 47 -71 -37 -15 -23 68 -53 -72 17 -11
5084a1k8J3J51j74j5P1l4P1l9p4O5P7p0n1L7NK9j07J19K4j70J19o8L8m5J48r1
$$ -11 -39 -26 125 -49 -64 7 -27 44 5 -69 -4 73 3 -48 -11 -6 23 -84 35 59 -111 8 -60 -22 -67 81 -10
5111a0j55J73k8O1k4K0n4l3n7Q7J31l5o3j12J55p3Q9K9j24N8n2M8M7j14M6j0o6
$$ -10 -165 8 -20 41 17 37 -17 -50 -107 -20 111 76 13 -99 56 -17 72 101 -23 35 -17 31 78 -36 10 0 -66
5138f6kl3J94k09J69ro4N8m0k6P7o3N0Lk9M1l2L8J9p1J9n7J6K3p3J3J09p4P6j01
$$ -66 -68 -101 93 -116 53 44 -20 38 -2 -28 49 -14 36 39 10 51 19 57 76 5 24 -33 -17 6 -67 -54 55 -19 57 -44
5168d4Q6k32J63O9L3j57K11j22k1mm4lJ25m0lO2j31Q9lJL1o1m6J05q4l7P0ojL3
$$ -44 42 -190 -27 42 75 -82 129 7 -14 -18 -62 -65 60 20 17 79 -52 37 34 35 66 5 -41 64 -20 -57 13 7 6 39
5198C9j43K1P9j12J16Rj7Q9j26J8K9q5R8P0j23M3l0KKQ3o1k0n3L2o0P4O4j41P7
$$ 39 -104 -83 -4 -116 0 9 -8 81 -45 -27 2 -83 15 85 -38 5 -25 -23 -21 62 1 -19 -72 -40 -100 -26 38 -103 -26
5227b6j5Q3J0j06R9m2J54q5J7q9k8j04K67j05QK9N3j37nJ3k8K0L7n0J9L1p6J12
$$ -26 -41 42 52 -54 45 3 157 72 89 0 -28 -132 135 30 38 67 120 -17 -22 -9 -37 -17 20 -30 -11 20 -56 56
5255E6r2K4l4J18j00J2pj8K8j7L8k6L7q6mJ32M5o7j29J00o5J39l0M0j24J0J04
$$ 56 -36 -12 -46 72 -28 -16 -23 -41 -13 -30 8 -18 19 -67 -71 61 106 39 -90 10 -55 84 54 94 -30 -20 84
5282H4oo6j03O9ll1M9o1KK8k4N1K4l9P0j51J03M2Kl8PK1J4k3KJ5N6L5j20K4q2
$$ 84 78 12 -91 -22 -25 -56 -7 -68 -66 -38 -62 -11 13 -26 44 -107 -4 38 40 2 9 30 44 21 23 38 94 129 9 33 -49
5313d9N2j0J87l03J8J58K3n4o7rK1L8k4k4R3j73J25l4Pk9k2L3J25m3j5k6J0J9
$$ -49 3 -7 180 -123 -105 53 76 22 -45 -54 -33 5 -19 -43 50 -123 2 -32 -25 -54 -76 -43 82 39 24 -2 8 27
5341B7m5O8n0L6R2p9j41L9Q8k9j17J20n9Q3r0R3N4o8o5J08r4P0n7J02Kqj16%N2
$$ 27 -18 50 0 36 128 49 -92 -53 35 6 -111 9 -50 33 -57 36 90 22 -43 65 -29 41 -16 86 88 80 -36 -36 16
5370A6L3q5M3p2N4K9l1j9Ko6J69j63J04L3j2j46J37O2j72O1k7jR3K1j22Q9j54
$$ 16 49 -36 7 -65 -11 18 -13 -32 -30 -96 73 -90 14 47 35 -111 26 88 -84 -23 -50 -51 42 63 -59 30 -124
5397a24J21q4J18n4J01l9o7q4LJ18K4nl4j9J04qj12L9k0J05r6P8m9k7NM1m4K7
$$ -124 -3 -87 31 -23 78 39 -28 -112 -109 9 33 28 -6 -25 79 71 -41 -2 -22 83 -13 65 16 -11 -6 35 -9 18
5425A8m2Q0j29R9o1l0M3l5N4n4R8q8pJ15o0J4j41J84j60Q1K1n0k2J2M0J06j6K3
$$ 18 -24 56 -73 26 -35 -65 -22 -57 -3 -57 41 -47 -54 61 1 15 -126 58 -102 -21 0 -50 -72 -60 -20 86 70 93
5453I3o5J0o8J0J9m3M9k4k9K7K0N6N5j48M7k9q1L9L4n5R7Kj02Q1JK8q3j5K05k22
$$ 93 28 38 -30 -20 -1 -44 5 -19 -48 -21 -1 55 110 -38 9 -20 -101 -62 -28 -83 14 16 -86 -5 -4 24 -59 -74 131 -91
5483i1K29p2N8q4o6l0J15j9J7j13m5J60q2J13k04P0N4m5J0n4R4m5K6LMj13J06
$$ -91 138 66 124 40 -26 -56 59 40 57 -56 -101 59 -23 90 -114 -44 10 -35 -25 -79 15 -30 -4 -1 3 -110 -4
5510dP0r1K9K0l4k0j2L7Ol6M3m2J8nJl1Q0r5J94m5q5j1l7J17r3p3J03n2k8R7l6
$$ -4 66 -25 4 24 -10 -30 -42 -5 1 -35 8 -34 -16 -21 -20 -51 29 -66 128 83 -2 -13 -50 67 -26 -99 4 -48 -76 21 -15
5541a5N5l7L6K3J0P2j44M5M1j07k7J31M8n7m4O4r8j8q6oJ71j9n8NJ0m1J39k25
$$ -15 40 3 39 62 72 144 0 45 86 -21 -48 83 131 74 30 94 -4 -22 -108 -114 57 38 -20 -15 -5 -46 93 -132
5569a32J11k6PJ7Nm8j5J32lm0m1nk4L0P9k5L4j03qN0JrO3j07O%qO2P4rj17NJ32
$$ -132 -21 -47 -40 -23 -18 -66 -81 51 48 8 -33 -38 -62 -32 47 22 56 -47 -55 -5 -4 -13 50 -57 -51 -51 -59 3 77 68 -49 -44 88
5602H8j03O7l4l5J00o2m2m6J15k6j6l2Jj0J50j02q7Q3mn4j04O5J13n2P6j03L4
$$ 88 -15 52 18 -17 83 21 -21 -67 48 22 6 -26 -25 -35 115 13 -74 9 5 -49 -153 -88 25 -27 49 -54 -20
5629b0Pp2J02P2j25J2n3KQ8k9m6K5L3l7R2J1l0j8o8R4j30J68j1m0n4N7q3R3J6
$$ -20 -13 -85 17 89 -36 -24 -77 -75 13 -16 -62 -37 -4 -41 51 62 32 14 -54 40 -90 78 67 27 -27 30 -53 40 56
5658E6m0q1K4L9K8pL4k2P1m0n9j25M7J46k41K31m7j41J87k6O1j44q9J94o1j25
$$ 56 16 -65 -41 -2 26 19 53 31 102 62 3 -122 -75 71 -170 61 14 -127 60 34 95 -49 -138 56 -5 -130
5684a30J35K6o9J2pN4L9m0K8Lj04l0L3O9L1q4J03n3K3j8m8NQ9m2j04QK4J04k7
$$ -130 5 31 -38 -26 -33 21 60 20 48 51 -53 -83 -50 19 50 -34 69 16 39 21 -27 -22 67 25 -79 -71 -47 57 30
5713C0k7k4k4Q9q4J12m9j4J23j70q0K09j70K4J35p1N2j6j02P1oj19J47m9K2rj6
$$ 30 3 -21 -45 44 -40 72 23 9 132 -38 -118 91 -79 -55 80 9 61 45 -57 14 8 -111 36 -13 9 0 -16
5740a6j3J01j27O4N2r0JJ9J5o1P2J9j02J13k7m4j00J59m8n7Pj5J38j10R3n3L2
$$ -16 -29 72 -55 9 61 -29 -28 -9 6 -55 17 36 -66 47 20 -24 -124 35 -13 -70 -63 -78 60 -50 43 -10 22
5767B2nL9j63J26j7l8OL1L9pK7j49RQ8jp8O8J01j01%Q3q8J19j83L9n2O1L5q7J59
$$ 22 17 56 -107 19 2 -36 -30 1 40 33 60 -89 -80 8 7 -71 -3 98 -3 -3 80 -8 111 -72 -33 -85 -24 11 -76 83
5797H3j35O2L6m4r0O8lo9J02Kp3N4l0P6j07O7p5Q7K5K0o8q9P9%P1q3J11j11oK4
$$ 83 -52 10 46 2 -88 -20 -23 -92 10 12 -61 -7 -37 39 -68 -1 -76 11 36 56 -12 -101 -22 -22 49 -34 77 -34 -40 -16
5827a6n8J54o9J37j69M9jO9j00M7o2jJ97j30l7j2O7q4L2N9K3m4m5K9j40J17o6
$$ -16 -74 80 11 148 -21 28 27 96 -4 43 -19 -20 177 47 10 -2 65 -19 13 72 95 51 6 35 -105 12 -54
5854e4L6L6k8K1j62J75Jk0L3j0pj52J20Knq3J5J60j81O3L9m1R7j02J6O0p0L6m1
$$ -54 -18 18 -10 11 -151 24 25 5 38 28 21 -131 -11 -9 -14 -97 -82 78 -103 -40 -1 -42 55 -47 -31 29 -41 -5 -46
5883d6P3l2o7j6J5J58q7qn0N6Nk6N6o5P3l7N2J8j48J74j59J69j84J49k4q8K1R
$$ -46 27 -5 -72 -88 -73 85 -2 -10 -60 -4 1 -25 31 -34 39 2 54 72 -76 98 -61 108 -76 73 49 -39 -18 -9
5911ip1J01JN3l6m4J45j58N7r3N0j14K00nrj44K8K3K2oN3J1j26Q0p0m8K5J01j6
$$ -9 -80 21 22 75 39 -5 140 -18 39 -54 -4 -118 82 77 68 -76 -48 -25 -3 -9 44 55 -71 9 -61 -109 -84 17 1
5940AP0r2j6J04j23k8L4J16l8o4m0J57j51Q1n2J23p8J05j46L1o7M9R7k7q9J2O8
$$ 1 71 -21 -37 67 -56 -84 -50 66 28 -36 -76 81 -70 11 -41 82 4 109 -37 -6 -73 -24 73 46 -43 -31 37
5967C7q0M2N5O9p0o4no0P5ok3k6J27mo6Q4k28J20k5R0Lpj7p5L1J3O6p7l5J81o8
$$ 37 -43 -1 54 123 53 -11 -16 -76 -1 -7 -30 -56 71 67 1 85 -143 -23 -48 42 45 38 21 -54 -23 -10 56 -21 -56 125 57
5998E7J5r9N4j46Q5k1M2P8m6j04P2k8l2J45m6L9k2n7J3q0R1j39O7J2j4K0J32j29
$$ 57 72 -27 27 -119 -34 -55 -13 65 19 -85 -13 -41 -73 72 26 65 43 -14 -1 -81 10 -129 -62 -50 -64 -44 88 -41
6026d1J30j10j2M8O3r3l3J71j25k1r2O9j7K1j7M0J0k4N0J3r2j3O0rK0K2O8j61
$$ -41 89 -21 -33 15 78 -15 -48 123 -2 -23 -115 -46 -63 -42 -59 -19 -9 -33 17 30 -62 -75 -15 -24 -4 18 86 -75
6054g5J5J3Q0J2j06P2k0Pp2Q6m4k7J28o0q7M8N1l2qM6n3JM1k5K7pn4j8J79j08
$$ -75 -60 -47 33 45 -61 11 -9 -2 -74 12 -32 -59 69 9 -78 -30 21 -11 -19 27 -26 -25 16 -9 18 11 -43 -61 118 10
6084A0j7ol2L3L7l4oq7J02p7N7L3j00R9o0J54K6k41P6J05J8l0j19L9J7l0m3J06
$$ 10 -7 -13 -45 -12 25 -9 -15 -102 0 -77 -20 13 -87 12 -48 106 132 -109 -33 72 90 60 -59 -20 -3 -33 -76 30
6112C0m7J44j63L5m0k9jL8L6jP8n6L0j58J39J2K9n2p1L9k7L2N2Oj05jP5n2M7M2
$$ 30 -17 127 -36 -1 -41 -70 -71 -33 3 2 80 24 54 -104 35 47 76 24 -47 -8 -35 -3 49 55 -50 -51 24 -28 19 61
6142F1k2m0j5k9P2k5J9jp8N6R2j09K11j96k1J07l5o5K5k1k9N4OK4r5J05o8J06
$$ 61 39 -1 -16 -45 27 2 21 20 -58 -2 90 -19 192 -4 -25 82 47 -18 7 -14 -43 11 17 41 -54 51 -17 89
6170H9p7j45J52p9J06k5m1%O6M9j29kO5j04O1L9k5P8l7o6p2J52j19P9l5J14m3
$$ 89 12 -133 19 -60 46 21 -20 -20 46 95 -34 -36 29 -75 -14 25 0 78 41 -25 -97 55 -64 15 -20 94 51
6197E1p9L7K4Jo5L6O7r5k7MO8jm3K1J6MJ4o2L8j00J16l5p8J02j9L6M0p7N4k7j57
$$ 51 -28 9 33 34 -31 5 72 -23 -50 -46 22 21 -22 -1 15 19 33 -29 9 -91 25 -10 -88 14 -5 31 71 -6 48 21 -136
6228a36J59Kn4J8l0M2L8j37R1O9J1j15M0p5j2j1J22qq6J15n1N2Oj03J41j19M9
$$ -136 23 25 -29 -11 -41 1 39 -98 -7 62 73 -42 -2 -77 -89 -100 22 14 -72 43 -8 44 50 -53 88 -31 18
6255A8qK7j00N9j5J20j00l3J01k7K9j24Q9q7O3l3J19p4m5N7K2r5nm0O6L7j04J14
$$ 18 10 37 -63 -4 -19 101 1 -32 69 42 71 -53 36 -51 12 -21 98 24 -21 36 58 -37 -42 -82 -16 21 -83 31
6283C1l8PJ05j61Q0j06J16N2M8j36m4J04l6j4P6l9m1O3m2n7R7j17K2J20j01L7
$$ 31 -7 0 105 -56 24 -82 34 86 134 -2 -46 58 22 8 84 45 4 67 25 -32 65 -52 -30 90 -11 26
6309B6q1J27n8P6j51J28m8J3NK1o5n1O4kO1k1J0j70J42r7R5j19P5J31j38L1l1
$$ 26 -55 72 14 90 -61 67 19 32 37 58 -7 -58 6 4 65 44 54 -116 26 -71 24 -95 -20 111 -27 4 -27
6336b7%k3L7k5J7k3kR1n2O9o4j8P4j43N5L5p9J8pK39n4o9M1j4j75J08qm4L1l5
$$ -27 -27 -50 -13 -38 -21 -44 -46 45 -7 62 -2 -20 54 -89 -34 1 -78 -60 -67 172 118 49 90 76 -99 9 1 -43 -12 -47
6366d7M6Qp5J51j60R7N5j50Q7ONj1m0j9n5J41n0J13j75J84p8n5m0J9J6n8M9k1
$$ -47 -1 7 -68 83 -77 20 75 -75 12 18 23 12 -28 -47 -102 39 -11 102 -73 111 33 -22 -62 -43 -27 -85 -36 -57
6394e7L9%q8R4M5r0k1n3J58p1J14Q4j33j43L4P5p3M5M7k9l4J15j99P9L3o2k4R9
$$ -57 -18 -18 -106 -12 33 -57 -78 -131 27 -44 70 154 21 -122 -88 -13 -86 -41 6 -23 -57 58 -141 -62 -29 -91 -115 -16
6422a6N8J0M4q8M9l2M0j62L2J44Lq4m4j04Q8N3k5J50p7Pk0r1K2L9l7LN2m9O0k5
$$ -16 42 52 96 8 57 25 65 -97 -65 79 82 -2 -46 -150 -62 -9 -34 116 39 46 26 -65 -43 -4 -41 -38 14 -35 25 0
6452@p6l1K26j23q1k6Q5j7JJ7k4o4P6PNk3J4P1qj05rP4k1k1P9l0M9l7j4p5L0O3
$$ 0 -76 -107 119 -4 -85 -111 -26 -43 -42 -25 -49 -113 -37 -30 -25 -48 -34 37 29 -76 -85 -11 -32 -53 26 -4 45 8 -6 -81 -51 12
6484A2n0N4K6j08N6Kl6PJ38j35m0R1Kl2Pq6L9Q5o5omR2j0m1m9j4R4oj90K52j16
$$ 12 -38 16 42 -66 -10 -8 -44 -37 101 -34 -74 17 19 -13 -6 -92 -53 32 -33 -39 -43 49 39 -2 -51 -65 29 23 -167 85 -31
6515c1q9J32o0k4J29rj8j11M8O5n3M8k5N4n1O8j24M2O1l2k6J10j05M7K8K5k01
$$ -31 -120 12 -48 -72 57 48 30 -81 -33 32 -21 27 2 56 5 73 -51 -9 52 20 -6 104 -1 46 74 99 -102
6542a02J27R1k05J03k3O6p2m4n0P6R9M7j28P1koo1m2P8k2K5l9r4N4Q3N4j48n9
$$ -102 25 116 -89 14 -9 57 -15 -59 -109 -33 66 113 -15 56 54 48 -13 -55 23 1 26 -13 -107 -53 30 84 -64 -123
6570a23J22l3J01j58%M0l3J09j10Q9n8J10j35k7J86q1Mq5l9J63K4o4n9j07K30
$$ -123 -1 -34 67 -91 -91 -51 -84 25 -85 4 -54 56 -79 -106 80 -1 3 -82 -121 42 66 2 -57 -164 66
6595F6j59R9j5L6J6j11K8L8J54j60mjN7K1Qm4k9R3j63K0Q0r8J10j06K6k9K03n5
$$ 66 -93 6 -9 27 43 -68 -40 -2 152 -8 -12 -13 44 65 73 29 0 93 -70 -50 30 -68 42 -64 -38 -67 136 81
6623H1j58J05O3r9L3j29L3Q0Q1n1j12K6J08n3j4n0P0J03j55J3nJ10p2n2K0O0q1
$$ 81 -77 28 91 -8 25 -104 -71 9 90 39 -73 -47 61 8 -6 -56 14 117 -38 -25 -30 80 8 -44 -24 36 -45
6650d5O6k6q6J44J1K5j57J13n5K3k5L1M1K6j49j5J55r7L4M1q9J07L4j01Kr0M7
$$ -45 21 -5 -91 53 64 89 -68 45 -10 13 -12 19 60 86 -63 -78 77 -20 14 55 -34 73 107 6 8 -82 -35
6677c5j0J55r3rl6J2K3n6J09M9j96L1N6M0K5j56L9J48l2o6j5l0J19pl0n7M1P8
$$ -35 -45 110 17 8 -28 -16 7 -49 60 109 -87 -56 0 40 65 -91 -52 96 64 -2 -17 -47 72 65 35 -22 19 97
6705I7q7M0l2M1P3j0k02J36o5Q2j03J8J3J0J2M%O3j24L7l8j7R2k7m6jl3J10j2
$$ 97 10 50 18 59 132 122 -80 56 -9 73 -30 -12 1 11 23 27 27 90 -34 3 -35 -52 40 13 -33 -34 -67 43 31
6734C1o2j0M9N3j50N4q4R5Q0m7P8r3P6k2j32j2M1Q6p6N5j40K08l9j47K3J04N8
$$ 31 -31 -41 8 61 -89 -35 -119 -24 56 9 87 -6 70 48 -84 -96 -55 31 -45 10 -130 78 39 -108 -85 19 77
6761G7j64K4L5Q4Pp5k7Q0Q1r1n4p0R6lRm3l6K53j90l7k5J58m2o5N0j0J8Om4q0
$$ 77 -87 -63 -28 56 63 -12 -39 41 122 31 -23 -93 3 0 9 -34 -70 183 -7 -44 -69 89 47 -18 32 22 40 46 2 -78
6791g8O3O7n0Pp4J39m9o6K5m2P6J0m1l2P9l6k9o6J40J6K8j92O9J4K1q7l9O0R2
$$ -78 -15 52 2 9 -65 74 25 -41 -16 -58 18 28 -13 -45 34 -2 -31 -97 43 59 87 -105 -36 -22 -1 -88 -127 -67 25
6820B5M7q4m9O9J5M1k02J41j06O0Np9J31J31q9j2j0K4N9j00JpR1o5j29N4P4O0
$$ 25 72 -12 -61 8 23 64 -138 3 -103 -43 -38 -117 14 145 56 44 34 58 117 17 18 11 102 37 -92 -38 36 96
6848I6j81K6NR1j4%m5K2J3k7j4j29J47j2J62j52p1J36L1j42j7J35J4Q7k28n4J50
$$ 96 -85 -59 -54 37 23 23 -22 0 13 -14 -28 -157 -10 -22 140 -12 -83 53 84 -58 -75 60 74 161 -67 -121 29
6875B9l0J15k16J43P8l2q5p6R5%n3Nr3J96r6l7P8lR6J7j65L4j2Q3K1j59N6j4M9
$$ 29 -1 114 -102 41 119 87 2 -74 21 21 -32 -27 -120 76 -20 -57 21 18 114 131 -34 0 -12 71 92 -67 -11 -25 24
6904B4J0j14P8J2j00J16L9J7L7j64j2LJ76o0j63R5n7J34n4m1J0j1P3k9L6p1P5
$$ 24 34 -80 -2 10 -90 26 65 82 119 -45 -57 -54 122 62 -101 -6 -63 71 17 -24 -14 -25 48 19 55 -16 59
6931E9m9l0J9N1qj61J71n4N6M3j67O6k4M9M1p7l4R2N6j30ok5O4N8k7j08J04N7
$$ 59 10 -20 -1 50 42 -119 52 -2 54 97 -70 -4 -28 21 62 -15 -49 43 99 -31 -37 -62 2 60 33 -75 29 86
6959H6m9r1N7P4p1m6MM8R9j36Q0j36J15k1Qj74K71j2m9r5K0j66K59j41j2J12o3
$$ 86 37 -54 3 77 6 -40 -36 12 111 -25 55 -81 34 13 21 -153 118 106 57 -38 -18 -184 75 -66 -78 34 -29
6986b9O5k9N2j29K5N2k0oL9o9M5j3p0R2l7L2k1l2J11l1j39J14L6J07k08l1J11
$$ -29 36 7 59 -70 -45 7 -13 -19 20 -49 -4 -17 -87 5 -32 0 -21 -53 58 27 -112 2 38 145 -63 -94 17
7013A7K9O1j75J08J5j4j28K3R0n8J8rm5Q1K8q3l6R5j05Q9m9j28K62n2q7P7n2o8
$$ 17 46 107 -68 40 55 41 -87 -64 26 -32 -14 -23 -68 13 41 -42 -78 17 -88 1 -48 -176 86 34 -53 24 -28 -96
7041i6J71r5o3Q8j8OQj19P3R1K5q0q7P2J14k93K77j72J61j13L9M2K4l2j4q5qJ47
$$ -96 75 -20 -83 5 -13 -7 1 -118 -45 46 71 -9 -96 -24 90 -203 74 -98 63 -50 -11 31 55 23 9 -76 -84 63
7069F3m9L2p6j22K37j26J7J43q4o3r4N6J8J22m8j0j8J07Op5l9o1M9Q3Pj49L7J76
$$ 63 14 46 -30 -152 85 -41 -24 119 35 -28 -122 -66 -48 74 26 16 -2 105 111 36 -3 -64 -15 68 75 -74 -37 139
7097A39j07j43N7Q3m8r9J29k2PN2q4m4M9R2j12MQ4rr2N0Oj6J50j13k3O4o4K1K9
$$ 139 32 -111 -54 29 -19 -118 11 -11 -4 48 -36 -80 -31 61 -51 -47 37 28 -64 -14 -8 -24 126 13 -10 54 -10 11 40
7126D0l4j1jj31J50p1QJ51k3k89K57r0N5p2O5QJ93k12o3m0L1P3ON4j74J62Nk5
$$ 40 6 -5 -6 -137 13 -58 -50 101 78 -211 46 -44 11 -61 4 12 205 -7 -70 -110 -79 -6 0 54 -120 42 47 22
7154B2o3p9J07J31j78N5k9l8J27m3m3J03j19j3J0P0k0j03N7m9J16p4M2n2j1J57
$$ 22 -41 -120 -13 118 -60 -5 -34 -72 55 12 -31 72 -47 -60 -50 20 0 -103 -46 -95 21 -53 -11 -63 -74 83
7180H3m6j91M9J24J17j97K0j7R1j00M6k3J3NPQ1q1P3j38j7J08O7j19P9j09k7L4
$$ 83 37 -154 -105 19 136 -61 -41 -58 33 -67 -21 -44 -31 -26 -19 62 -19 54 -84 -101 7 74 -45 34 -75 -102 -68
7207f8J47j84J25K3r4K4m4Q9J0j0m7J8J2n7O4R1k04J60p1n7r8J11L7j36O4L0j
$$ -68 79 -105 20 43 -51 -27 -71 18 28 18 -29 -11 1 -56 8 99 -105 55 -16 -73 -171 -60 -23 -159 -95 -65 -66
7234f6O2j3qj2Q1q5R4p3k4J39r6P0o8R1n2M9j36k4O0j1N9q8P2J07j08k8p6R8m
$$ -66 -4 -17 -25 -37 44 -41 53 -20 -44 95 -1 69 1 92 40 89 -47 -71 -11 -22 37 -51 21 128 20 -8 -84 14 10
7263A0j36J91n8l8J64j75M2J25j20l5O2n1K7j10MJ01p8J48n5J2p2R8m8m5M4j69
$$ 10 -126 65 7 -31 133 -42 0 125 5 -30 32 -19 8 -102 -98 3 -75 73 18 30 -42 56 8 -37 7 -162
7289a62J40k3lK3J7Q4k5o3p2R8p4J5P6q4P9m5j48K19m1n5N5n1O7P3j37M8K5k6
$$ -162 -22 -45 -48 -25 -8 76 51 -12 -84 14 -60 -45 31 -53 26 -19 -167 52 11 -44 11 -40 27 100 -37 11 36 10
7317A0L5j81J61p8J02%j39K4J48p7N9L8j82M0n2J42k1j18P5K2N2qm0m3R3j78J52
$$ 10 45 -136 25 -53 49 49 -90 -66 82 5 64 102 -80 -40 -92 50 29 -89 -14 8 60 52 12 -31 62 -116 36
7344C6k4l9J9J1j0R9j39M0K6k0l5R1K1j32R0j12J51pj31R9J05j80m5lJ16N6r3
$$ 36 12 -27 -8 3 -7 92 -47 -7 19 -1 -36 55 76 -56 34 -78 73 66 -65 34 139 -41 -86 -89 27 83 -10
7371a0N4m6ok7N1o3M5M9O0j84M2L5Q1m0j23M3O0o0J01r4Q2n9J8j6lj51J43l7o1
$$ -10 44 -2 -8 -35 16 -47 -2 47 107 -77 -35 0 81 41 -82 -39 21 -39 62 -32 50 -9 9 -7 -10 -161 -18 -55 -116
7400a16J64j22K64j42lj74P6O5N9q7O4q7j8P3J6j4k0m9M5M7r0r7Q8R2p5L0P2k7
$$ -116 48 -74 190 48 45 -129 -53 12 71 -16 48 -39 -57 16 32 18 -2 -51 -6 41 -49 -146 -58 34 -41 -11 61 34
7428C4K2j2Q6p0r1on3J02N8j35K38k33R4M0q2N7q0Q7J2j31J38k6q2n3k8J42qk7
$$ 34 56 44 130 60 -31 -37 -90 12 70 -65 173 -60 34 74 -8 49 -31 56 68 -63 75 49 -33 -86 -114 28 20 -7
7456gk8rJ1m9J20l5j5o4J05p8l2K7KP1jL8j0r2P9jn1PK9j7K2K1k2Pm7j4j1J30
$$ -7 -35 -44 -33 -82 38 3 -12 -76 29 -49 -81 -54 -52 19 18 56 46 -46 33 32 -19 -12 17 0 22 43 21 28 -19 -33 -44 86
7488H6k0j07J52k3p6rn9J8l4R7p9L3j2O8p3R4j10Q3J5o3l1N3J0M2q8l8J93j45
$$ 86 66 -41 111 88 12 3 -56 -38 -72 25 -54 -21 -33 35 -38 56 -54 29 44 -19 -50 3 13 55 -33 -71 122 -23
7516b3K9n2K0k8PlP7q2J04n5j49K22o9mLj8J3km1P2n4m4N7jK5R5j06M5l4k6m7
$$ -23 6 -46 -26 -54 -47 -50 27 -55 49 -6 -155 67 -2 -6 -3 -21 -8 -10 -51 21 -33 -77 -20 -21 4 99 -7 38 4 -22 -69
7547f9M3P9l4n8J30m6j34J3J71j87Q5J9p5j1O8Nm3j3P3n3J02m8j7p6P8PMj66J50
$$ -69 -26 53 19 -39 91 45 -89 -76 95 -92 -7 12 -63 -74 -6 -1 -44 -57 16 -37 65 17 0 -76 2 9 13 -153 -3
7576cn5J30m2o2R8o2O0ol7K3l2m9O9lR3j58o8K52j31L7j37j20J38J25j8L3j91
$$ -3 -58 72 30 -32 66 4 64 58 21 44 12 -37 32 29 122 -36 -104 148 17 54 -83 -203 -65 60 42 75 -116
7603a16J39L4l4j6J4mm0J6p9R2KJ3Rm8oQ1m6M8j17J0M9m1J3J2Q4l1j8p6K6L9n1
$$ -116 23 57 23 7 21 17 -23 -7 -86 6 8 21 30 -18 -24 57 11 59 -58 -48 1 -40 -27 -15 69 38 20 -56 -30 9 -42
7634d2P3l0j23R5K7j00Q7Q6j37P2L7j11M7j5L2O5o8k2K8O8mq0%l2l2J62J2j59
$$ -42 31 1 -122 -27 0 -100 -13 73 -64 8 45 -66 -19 -34 -2 63 -5 -27 1 69 65 -15 -15 -47 -79 83 95 -64
7662f4P6j22J40M3j32P3M5j27O6om8J31j4o9lNO0m7j34J15J1K8J3q6K7Q1j12k1
$$ -64 12 -110 30 73 -59 14 59 -68 -2 -8 -56 75 61 -8 -11 -6 54 7 -127 -12 -1 27 40 -46 -19 62 -50 -71
7690g1L3L6m4o1J72m3n1O5k8n0p0J62j15L9K9Q1L6j76J9m2Q8Q6j20J11j01Opj8
$$ -71 -38 -2 -46 -107 65 22 -29 36 8 -42 -112 50 -65 -26 3 84 120 -56 -37 -79 9 95 -25 86 -15 -9 -16 -34
7718c4K0n9Q4o6j6Q1n5%O8N2r6Nj8L8K2jm8L9M6r6KRl2P7O6o7r5J01p9K5K4kj14
$$ -34 -14 -73 11 -55 -71 10 -45 -45 23 75 -21 -16 -34 4 26 25 -23 16 62 -34 -32 -23 -55 22 88 21 -74 27 -52 -27 -3 -5 -119
7751a19O4Q1q6J5M9k2k4J9o6O2j2k1%R5k5r9K6Q9Oj20Q7R2r4QJ45j33J6O4m7j6
$$ -119 -55 26 -60 -45 4 -18 -42 -23 -89 -27 -39 -60 -60 35 10 -89 -63 26 32 -88 -1 91 -3 5 150 17 33 97 50 34
7781C4%l5j7m6O0j2kp7J44j06N8k9K7N2j36j0P6M0j42L3J16Jm1P5j65J36o9K0
$$ 34 34 -1 -18 -64 -4 -16 -18 -95 49 -57 1 -28 -1 51 -85 -95 -19 21 -121 -88 28 29 -12 63 -102 34 -35 -15
7809a5q9O5L7L7l2qr5N5K9J01j20R9o5qJ7j32J26L4j22J13l1p5K5KJ04j02Lk3
$$ -15 -104 -39 -2 35 3 -5 -100 -45 -16 85 -35 64 -1 -9 8 -124 2 36 -86 27 -4 -79 -54 -52 52 -50 -47 -70
7837g0lN5QM4nm0r9J71j44R5r0R1o8J45q1J0k6O4m8m8J4J1o5P1o9M1J47j38K6
$$ -70 -73 -18 -10 34 29 -11 -110 61 -83 12 -78 13 -55 90 9 19 -7 57 9 -39 -25 -14 -79 -8 -77 -36 111 -27 -1
7866aL9l4q6L4J6J0Q1q5j4J9j1L4Q6n8r6P4%j19J74r7Q8l0o5M0l5Oo0J77q9L4
$$ -1 38 4 -82 -48 -32 -22 59 -26 -40 -21 -32 2 88 30 -66 8 8 -111 63 -34 54 24 -41 -1 -36 -30 -90 87 -2 32
7896C2j1K1k3o7OK7J21j93J12M2m9n0l9O8K6L7p3m6j00K07l4oK6j20M2j5R4ok4
$$ 32 21 42 19 -48 -42 -15 106 -87 25 67 18 -32 -71 -3 23 60 -13 -59 -159 48 14 8 34 -86 -44 -59 35 29 5
7925ELO3p0M4j22K7QL1n3k4P1j8r5J19o1J1K9j09M3J48j16J11K2p4L9q4Q1k9M5
$$ 5 8 71 1 45 -77 -50 -42 -11 -64 -88 -17 -35 -130 -11 -72 -61 -32 -141 -98 50 -66 45 67 -7 32 -52 29 0 45
7954D5j20P7l4RL8J3m1q1Q2MM1l9K7L8k0p6krk4on5K20m3m6K0M3K2lj20J44j04
$$ 45 -75 2 -32 -23 15 28 -13 -94 -12 -8 33 -6 21 59 39 -37 -39 -48 -72 -78 -133 87 44 -2 18 61 83 80 -40 104 0
7985@o6M1n4P3m2J6M7k0P8K1j05m5jk2L3kJ68k17R3l4J6n4O2M1l8oL8NM6r1Q6
$$ 0 -66 -25 -79 -6 -48 -32 15 -5 73 94 -11 -56 -57 -79 -46 -48 120 -97 -4 -38 -22 -76 -14 27 -11 -17 21 26 72 -19 67
8016F7p8J9m2K3o7J02J5j32L4L1L2KK3j3K8r2M2K4K4l0L1Oo5RP9j6r5l8R9r0K0
$$ 67 -11 8 -34 -11 -78 24 39 -93 -59 -28 4 6 29 16 44 -48 -6 18 42 12 43 49 -16 -7 72 56 -39 -77 22 -68 -48
8047d8O5k4M9K0j02J10om1n7P2l7m3L2L6k1jLm4M0k5K3j45O8M2J4L2RN3j01R7
$$ -48 17 -7 42 62 -40 70 64 23 -34 38 1 -42 -10 26 5 4 7 -37 3 -22 1 -144 -76 -34 -20 12 21 74 -27 70
8077G0j53M6L0m0RRO5ln3k1N7K7j4q7l8Q7L3K6r3P7O7j33P3k3r9M7j2N5Q3j13
$$ 70 -83 -37 -7 -47 -38 -29 36 33 -20 -41 16 43 29 -58 -96 -9 24 50 -43 34 101 -32 41 18 -81 -34 -46 9 92 -21
8107b1Q6j23O5p0QK6m8J3J20r2Nn9J40%j48Q3k6J23n8Kj09J12j8O1n7p9pK9k4
$$ -21 65 -58 7 -63 -55 -29 -77 -64 56 -36 -31 -90 50 50 -98 -15 -41 82 24 26 -83 29 11 72 15 -64 -71 -42 -66
8136f6K7j1O8o1M4n6N7l4O5O4p4k7m8N6K7j28J3J07k1j48O9K8L0J00q5o1MJ5L4
$$ -66 -39 -50 18 -43 1 -55 2 -32 33 97 23 -4 -52 4 31 -97 -84 23 2 -146 -77 -49 -19 81 -4 -65 -61 -46 -12
8165a2j5k8nJ53j10K8K2n8L9q0O5J2j30K17j38NO6o1o1J21o6K6l5qM9N7
$$ -12 -27 -55 -60 93 -17 11 33 -25 14 -66 -1 11 -119 98 -40 -35 31 -30 -91 30 -36 -10 -45 -53 -4 53
8191E3
$$ Imaginary data points
##PAGE= N=2
##DATA TABLE= (X++(I..I)), XYDATA
0@%%%%%%k4M8m8M8m8P2j20J44j68J99k23K64l15L69m38N24o06P06q16R25j058
$$ 0 0 0 0 0 0 0 -24 24 -24 24 -24 48 -72 72 -96 103 -120 144 -171 198 -240 284 -322 384 -432 493 -565
27e65J201j360J540j728J943k183K439k727L042l382L760m175M624n123N672o277
$$ -565 636 -724 816 -912 1031 -1152 1287 -1440 1602 -1780 1980 -2195 2429 -2694 2978 -3299
43c299O956p703Q540r493J0563j1795J3233j4917J6937j9405K2499k6530L2011
$$ -3299 3657 -4046 4494 -4999 5564 -6231 7002 -7915 9022 -10383 12116 -14414 17597
56A7597l9945N2535p5683J32328n21243r63736N73661R37628P71044j5072n59548
$$ 17597 -22348 30187 -45496 86832 -434411 -1398147 -824486 113142 884186 869114 309566
67C09566p87113l97648K26717P74102O77972P0017o53804q15902l44623M22650
$$ 309566 -477547 -875195 -648478 125624 803596 873613 219809 -596093 -940716 -518066
77e18066P92180N42695j08300n97541o52890k53844L09943O97775N62557l5403
$$ -518066 274114 816809 708509 110968 -541922 -795766 -485823 211952 774509 739106
87G39106o43930p11854j98261M52307O94349L99191j60018n55026n48546j64004
$$ 739106 95176 -616678 -814939 -362632 331717 730908 570890 15864 -532682 -696686
97f96686L41347O27423M44316j14641o11021o01501r0949M65570O08056K84889
$$ -696686 -355339 272084 716400 601759 -9262 -610763 -701712 -236142 371914 656803
107F56803k03754n10210m61240r3638L61336N72954L41041j85629n76388m89785
$$ 656803 453049 -57161 -518401 -612039 -250703 322251 663292 477663 -98725 -588510
117e88510j908M58315N21905J93656k31843m63943l81490l5325L64866N16912
$$ -588510 -590418 -132103 389802 583458 351615 -112328 -493818 -529143 -164277 352635
127C52635K54608k36858n39020l88363O9703M38071M40745J23975k48045m24722
$$ 352635 607243 370385 -168635 -556998 -487295 -49224 391521 515496 267451 -157271
137a57271l10650K0913L60276M50492J79529k62190m94782l07816J22201M17889
$$ -157271 -467921 -447008 -86732 363760 543289 281099 -213683 -521499 -399298 18591
147A8591L67055O2590k52903l81265k52478O0905L54747L93944J10403k83608
$$ 18591 385646 448236 195333 -185932 -438410 -377505 -22758 371186 481589 197981
157A97981m45985k30116J62128L87849K97234J3365k47267l36517k04401Q8670
$$ 197981 -248004 -478120 -315992 71857 369091 382456 135189 -201328 -405729 -317059
167c17059L46416L43256M8116k97618l90804j59934J81925L52377K45770k2592
$$ -317059 29357 372613 420729 123111 -267693 -427627 -245702 106675 352445 329853
177C29853k50028k99153j48895J16361L21536K88301M811k97771l44295j01126
$$ 329853 79825 -219328 -368223 -251862 69674 357975 362786 65015 -279280 -380406
187c80406K00706L13629J89706m5821k34702k67196j15264J38429L07451K36963
$$ -380406 -179700 133929 323635 277814 43112 -224084 -339348 -200919 106532 343495
197C43495l8738k90180k94853n5202K08680K81951J43946p1056k20901k29540
$$ 343495 304757 14577 -280276 -335478 -126798 155153 299099 228043 7142 -222398
207b22398q2251J48310K87857J94746p3593k81804k46026j3118K05831K46290
$$ -222398 -304649 -156339 131518 326264 252671 -29133 -275159 -288277 -82446 163844
217A63844J10136q3799k11927k01540m8385J60352K63237J51055r9215k66632
$$ 163844 273980 190181 -21746 -223286 -271671 -111319 151918 302973 203758 -62874
227f2874k02516K1013K01451K11426P7880r2057j97955j74968k1431J67836K38312
$$ -62874 -265390 -244377 -42926 168500 246380 154323 -43632 -218600 -240031 -72195 166117
238A66117J11173j18229k47092j63590M6033J94676J81432M9535r9518j82119
$$ 166117 277290 159061 -88031 -251621 -205588 -10912 170520 220055 120537 -61582
248f1582j48872R8J70824K15718P5410j34410k25621j24837O4373J81472J55145
$$ -61582 -210454 -210356 -39532 176186 251596 117186 -108435 -233272 -168899 12573 167718
259A67718K9590j05272j70601j23381K2318J69841J89537M4746j43683k03906
$$ 167718 197308 92036 -78565 -201946 -179628 -9787 179750 224496 80813 -123093
269a23093r1146Q0169J67407J27674J1862j05137j57085j02803M0175J68375J64129
$$ -123093 -214239 -134070 33337 161011 172873 67736 -89349 -192152 -151977 16398 180527
280A80527J5765j47889j79864o2332Q9740J53823J04563m566j05104j42016q1445
$$ 180527 196292 48403 -131461 -193793 -104053 49770 154333 149767 44663 -97353 -178798
291a78798N4004J62143J38939p978j47237j55333l7933R3656J38858Q5656j5689
$$ -178798 -124794 37349 176288 168310 21073 -134260 -172193 -78537 60321 145977 130288
302A30288j04355j29669o2557O6436J55207J15069k8711j45074j32087j5290R6069
$$ 130288 25933 -103736 -166293 -99857 55350 170419 141708 -3366 -135453 -150743 -54674
313e4674J22621O7952k4346j02237j17356m4250P7041J44867R0573m4084j37601
$$ -54674 67947 135899 111553 9316 -108040 -152290 -75249 69618 160191 116107 -21494
324b1494j10540N07R5873J09845N2555l3079r9456j03836k7370Q3863J33707O8802
$$ -21494 -132034 -131527 -35654 74191 126746 93667 -5789 -109625 -136995 -53132 80575 149377
336A49377n7449j29046q9186J4847R1915R5833M0208l8075r6226r1756j2530Q8379
$$ 149377 91928 -37118 -126304 -111457 -19542 76291 116499 78424 -17802 -109558 -122088 -33709
348c3709J21527M8959o6019j18947p1158K4742Q8033Q4518K9353m3736r2495p9204
$$ -33709 87818 136777 70758 -48189 -119347 -94605 -6572 77946 107299 63563 -28932 -108136
360a08136R20R0943J09083L1419p2988j09062n3759L3850Q3303P2306J9037m7232
$$ -108136 -107216 -16273 92810 124229 51241 -57821 -111580 -77730 5573 77879 96916 49684
372D9684q7711o7336J3448R2095R4773J4131p5662r5953l9126L8141P7863O3033
$$ 49684 -38027 -105363 -91915 180 94953 109084 33422 -62531 -101657 -63516 14347 77380
384G7380J0077n0835q2175n4622K3680Q9844Q0873Q66p6738q4451k5704M2569
$$ 77380 87457 36622 -45553 -100175 -76495 13349 94222 95088 18350 -66101 -91805 -49236
396d9236P1102N2618K984n1538p6704m3509L2059Q6280O7263j0459p4871p2685
$$ -49236 21866 74484 77468 25930 -50774 -94283 -62224 24056 91319 80860 5989 -66696
408f6696j5627M3839O6016M5146l863n4275p0373l1618L9605Q1201N3331j9654
$$ -66696 -82323 -38484 27532 72678 68815 14540 -55833 -87451 -47846 33355 86686 67032
420F7032p1847o1407o558M4800N9733L7087r371n3897o3527k1819M4091P5605
$$ 67032 -4815 -66222 -72780 -27980 31753 68840 59469 5572 -57955 -79774 -35683 39922
432C9922M1871k7287o8184n0779R21M4350N4085L0299j4291n3885n6534j1887
$$ 39922 81793 54506 -13678 -64457 -63536 -19186 34899 65198 50907 -2978 -59512 -71399
444g1399M7770O8305L0447l1929o3023m1938O461M3662M9108K3768j8870n2741
$$ -71399 -23629 44676 75123 43194 -19829 -61767 -55306 -11644 37464 61232 42362 -10379
456a0379m9252l443M9611O1581K0315l6049n7444l3199J0969M2196M4035J8269
$$ -10379 -59631 -63074 -13463 48118 68433 32384 -25060 -58259 -47290 -5094 38941 57210
468E7210k2840n1498m2003M624N0558N3928J1042l8238n1901k5586J5237M0868
$$ 57210 34370 -17128 -59131 -54507 -3949 49979 61021 22783 -29118 -54704 -39467 1401
480A401L8714J1655k5935m8156l3825J0914M8992M5560L876l8143m5801j9520
$$ 1401 40115 51770 25835 -22321 -56146 -45232 3760 49320 53196 15053 -30748 -50268
492e0268J7288L8741L4610P146k8603m5570k6906J6591M7582L7598k786l7648
$$ -50268 -32980 5761 40371 47517 18914 -26656 -53562 -36971 10611 48209 45423 7775
504G775l9799j3450J9119L6134K9501K560k9041m1514k0920J9779M4721L1586
$$ 7775 -32024 -45474 -26355 9779 39280 41840 12799 -28715 -49635 -29856 14865 46451
516D6451p350l6797l5284q811K0646L4614K5763k165l1134l7914j3350K3696M0957
$$ 46451 39101 2304 -32980 -41791 -21145 13469 39232 37067 5933 -31981 -45331 -21635 19322
529A9322K3990j1545l4566k9465m515K0941L1542K1464n159l0680l3799q523K5409
$$ 19322 43312 31767 -2799 -32264 -36779 -15838 15704 37168 32009 1329 -32470 -40993 -15584
542a5584L7811J8318j4455l2842k5049r51K1606K9351J7206q799l0219k8989l148
$$ -15584 22227 40545 26090 -6752 -31801 -32752 -11146 18205 35411 26612 -3607 -32596 -35744
555c5744K6120L3341J3086j6137k9872k1295J337K1783K7337J3523j1758k9486
$$ -35744 -9624 23717 36803 20666 -9206 -30501 -29164 -7381 19956 33479 21721 -7765
567g765k4492J150K6580K9452Q479j7641k7976j7207M377K1754K4256R614j3449
$$ -7765 -32257 -31107 -4527 24925 33404 15763 -12213 -29420 -25043 -3289 20967 30581 17132
580A7132k7996k0438N078K6024K5280M328j8146k4979j3742O189K1415K1575O027
$$ 17132 -10864 -31302 -26224 -200 25080 29408 11262 -13717 -27459 -21270 145 21720 27747
593B7747j5328k5623j5841P454K4539K1449J588j8007k2684j1247P974K0729J9238
$$ 27747 12419 -13204 -29045 -21591 2948 24397 25985 7978 -14706 -25953 -17979 2750 21988
606B1988L380j6434k4165j2267R993K3665J7808j507j8167k0107p813R080J9738
$$ 21988 25368 8934 -15231 -27498 -17505 6160 23968 22461 4294 -15813 -23626 -14546 5192
619E192J6411N64j6901k1652q662J1462K1705J4513l202j7532j8381n677J0608
$$ 5192 21603 22167 5266 -16386 -25048 -13586 8119 22632 19430 1898 -16483 -22160 -11552
632a1552J9220J3619k434j7111j8737n371J2454J9881J1287n444j6613j5123l556
$$ -11552 7668 21287 18853 1742 -16995 -22366 -9912 9969 21256 15812 -801 -15924 -19480
645a9480J0562J7514J1451l817j6761j6602k820J2682J8115R008o221j5957j3888
$$ -19480 -8918 8596 20047 16230 -531 -17133 -19953 -7271 10844 19852 13631 -2326 -16214
658a6214j629J1645J6466Q827n832j6078j3976o98J3092J6072O610p208j5119
$$ -16214 -17843 -6198 10268 19095 13263 -2815 -16791 -17489 -4397 11675 18285 11077 -4042
671d042j1820L16J1608J4865O678o678j5624j1953J380J3204J4487M122p949j4164
$$ -4042 -15862 -15546 -3938 10927 17605 10927 -4697 -16650 -15270 -2066 12421 16543 8594 -5570
685e570r703J594J1867J3593M409q040j4399r287K827J2555J2201K864q376j3285
$$ -5570 -15273 -13679 -1812 11781 16190 8150 -6249 -15536 -12709 -154 12047 14911 6535 -6750
699f750p820L001J1668J1531K937q308j3460p702M102J2234J0711J266q604j2335
$$ -6750 -14570 -11569 99 11630 14567 6259 -7201 -14903 -10801 1433 12144 13410 4806 -7529
713g529o338M124J1502J0388R18r090j2050n564M840J1499R329j32r001j1054
$$ -7529 -13867 -9743 1759 12147 13065 3975 -8075 -13639 -8799 2700 12029 11897 2896 -8158
727h158m628M829J1110Q594n21r035j0675l883N249J0954P791j289r115r810l104
$$ -8158 -12786 -7957 3153 11747 11226 2191 -8484 -12367 -7118 3836 11627 10338 1223 -8587 -11691
742a1691N569J0175P131j530q901r468k646O115R918N967j914q469q661k453O036
$$ -11691 -6122 4053 11184 9654 753 -8715 -11361 -5246 4672 10639 8725 256 -8405 -10858 -4822
757d822R733N696k329q792q156j613O318R297N292l122q626p579r17O242Q909
$$ -4822 4911 10607 8278 -514 -8670 -10283 -3965 5332 10624 7502 -1124 -8703 -9620 -3378 5531
772E531M660l322q613p188j78O658Q288L727l570q081o366M1O440P984L291l788
$$ 5531 10191 6869 -1744 -8932 -9110 -2452 5836 9563 5993 -2088 -8454 -8413 -1973 6011 9302 5514
788E514q045o173P58O835P388K476m086p586n396J123O432P066K120m320p366
$$ 5514 -2531 -8704 -7946 -1111 6277 8753 4667 -2919 -8315 -7192 -760 6306 8426 4106 -3260
803c260m860J460O529O419J532m238o899m327J381O105O497J687m594p367m076
$$ -3260 -8120 -6660 -131 6288 7820 3582 -3317 -7644 -6263 -158 6339 8026 3432 -3935 -8011
818h011K284O543N848O10m891o459l357K305O220N367M54m924o339k810K579N965
$$ -8011 -5727 816 6664 7274 2383 -4076 -7433 -5128 1092 6459 6913 1989 -4350 -7160 -4581 1384
834A384M990m4m755n909k608K732N873M682l21m759n916k114L197N851L779q57
$$ 1384 6374 6330 1575 -4334 -6942 -4210 1663 6345 6024 1265 -4651 -6765 -3568 2283 6062 5205
850E205m584m899j803K742N323M101p73m864n118j329L177N330L406j114m562
$$ 5205 621 -4278 -6081 -3339 1984 6085 5312 448 -4670 -5999 -2822 2508 5914 4800 238
865B38m989j016L235N157L246j239n060m666n26L855N010K211j814m219m004n26
$$ 238 -4751 -5767 -2532 2625 5871 4632 -428 -5094 -5620 -1765 3245 5456 3642 -577 -4581 -5107
881e107L299M777K471j712m787l964J46L924M308J650k115m053l017k30L209M305
$$ -5107 -1808 2969 5440 3728 -1059 -5023 -4877 -953 3355 5005 2890 -1163 -4180 -4410 -1201 3104
897C104J921j963m517l241M66L809L794J249k150m002k682L26L213L950J539k287
$$ 3104 5025 3062 -1455 -4696 -4230 -421 3373 4622 2472 -1530 -4212 -3886 -673 3277 4816 2529
913B529m539k625J011L856L166M69k022l255k614L56L346L788J116k621m285k254
$$ 2529 -2010 -4635 -3624 232 3398 3867 1845 -1410 -4024 -3668 -322 3466 4582 1961 -2324 -4578
929d578J489L919K821m6k580l142j652Q89L230L145L61k864l531j413J584L324
$$ -4578 -3089 830 3651 3605 1025 -2117 -3769 -2880 350 3495 3856 992 -2539 -3952 -2368 956
945I56K230j21k149k835j540Q15L140L113R7l159l637o72K238L084J588p23j960
$$ 956 3186 3065 916 -1919 -3459 -2644 496 3609 3706 547 -3090 -3762 -1524 1560 3148 2425 465
962D65k580r53J058K966K209j86k708l055m61J941K802J414o24k088k271r18J142
$$ 465 -2115 -3068 -2010 956 3165 2979 271 -2784 -3245 -1304 1498 2912 2288 200 -2071 -2989 -1847
979a847L025K340p92l208k554L31K183K229P84p97j790j902o64J213K795J845
$$ -1847 1178 3518 2726 -482 -3036 -2705 -522 1707 2491 1694 -96 -1998 -2662 -1449 1346 3191
995C191q34l031k282L36K315K080N64r01j753j757n84J616K634J566j281k972
$$ 3191 2357 -674 -2956 -2620 -305 1775 2339 1438 -315 -2072 -2656 -1040 1594 3160 1879 -1093
1011a093j772P51K203J717K11p21j724j707k89J762K683J020j627k714j417J098
$$ -1093 -2865 -2114 89 1806 2017 1296 -428 -2135 -2424 -662 2021 3041 1414 -1300 -2717 -1619
1027a619K013J348K35j063j426j392j41J659K446P30j824k558j050J382K077R82
$$ -1619 394 1742 1977 914 -512 -1904 -2045 -386 2060 2790 966 -1592 -2642 -1260 817 1799
1043A799k49r74j276j252J09J861K067J52j904j961m20J205J441P01q2m54j409
$$ 1799 1550 576 -700 -1952 -1843 18 2085 2237 333 -1628 -2048 -843 598 1299 1217 763 -646
1060f46j309J50J982K039J1k146j931pJ413J333N07j87q60j203r38L53J793J721
$$ -646 -1955 -1805 177 2216 2227 81 -1850 -1857 -444 889 1396 1209 349 -854 -1792 -1439 354 2075
1078B075j56k136j635K57J204J129M49J3o92j413j090Q39K023J446q39j950j355
$$ 2075 1919 -217 -1852 -1595 -391 738 1187 1200 508 -905 -1995 -1156 867 2313 1474 -476 -1831
1095a831N60J241Q79J91j61n63j274p24P08J817J181p84j889r24M12J124P14L91
$$ -1831 -1271 -30 849 1040 879 316 -958 -1682 -974 843 2024 1240 -649 -1573 -1161 -37 677 1068
1113A068p3q04j269o39R73J849R55j200j830o85R54R86M25J52m1p47j233l56J098
$$ 1068 995 191 -1078 -1717 -744 1105 2060 860 -970 -1655 -701 285 710 862 821 74 -1159 -1515 -417
1132d17J816L29j213j526l95Q29Q49M06Q8R4q24j293l20J416J673Q3j428j379
$$ -417 1399 1728 515 -1011 -1406 -577 272 678 766 860 36 -1257 -1577 -161 1512 1595 167 -1212
1150a212O1Q48O54K41J15k5p33j157m4J279J338k1j249j015R0M84M68M67K78j63
$$ -1212 -1151 -303 351 592 707 682 -51 -1208 -1252 27 1365 1344 95 -920 -830 -346 122 589 867 704
1170G04j052j067J81J532J237k83j468q97K29P89K15L24L39k03r11r82K73J535
$$ 704 -348 -1415 -1234 298 1535 1252 -216 -1113 -884 -95 120 444 783 580 -331 -1313 -1040 495
1188D95J019o07j376n57M45N50K95J53L22k09r97q50N93J473O14p57j081m04M60
$$ 495 1514 907 -469 -1026 -581 -31 264 417 739 530 -467 -1317 -724 749 1363 606 -475 -879 -419
1207d19M53K85J43J90l21r26o32P51J274M43q74p95j55K58L36J01L85K70l96j203
$$ -419 34 319 462 652 331 -595 -1227 -476 798 1241 367 -428 -583 -325 11 112 497 767 371 -832
1227h32m56J006J286J37q52j055K14K62L13J65L34J76n05q69l41R58R37O4r00
$$ -832 -1288 -282 1004 1141 289 -766 -552 -290 23 188 522 698 193 -676 -1017 -59 878 942 42
1246D2o19J01L09M2K86M42J39p94q47K1R91Q82j76r22n79L09L09L2J07M33J14
$$ 42 -577 -476 -167 -125 161 603 742 -52 -899 -878 113 995 819 -103 -682 -373 -64 -32 75 508 622
1267F22o48p30O1Q34P13k05p35m36J95K21M0M15K79j13q58n17L90R88L54n01p33
$$ 622 -26 -756 -695 139 852 647 -88 -524 -329 -108 -68 347 626 513 -345 -862 -472 516 870 369 -364
1288c64j59L30Q0l8L79M43j64p84m92K62R93M05o26n80j21K18J19J08K09K29k80
$$ -364 -523 -193 -113 -151 228 671 507 -277 -769 -507 486 891 265 -315 -436 -218 -99 9 218 447 167
1309A67o41k11L68P74K63o32l11j0M1k4J54L01M15l40q29l55O30P56O7m47m74
$$ 167 -474 -685 -317 457 720 88 -223 -233 -192 -216 -62 239 654 314 -515 -870 -240 516 583 136 -338
1330c38N3J93j32J08N35K41n43p27j08P11O27l5m34n49K9J52K03R2K94p1l33n18
$$ -338 -285 -92 -224 -116 419 660 117 -610 -718 -7 620 585 151 -398 -369 -217 -14 78 372 301 -32 -550
1352e50J00M57M00l3l14k49J74k30L5K65M64p5n83n36K87N89L14k67l54j11J45
$$ -550 -450 7 407 374 60 -189 -15 -245 -210 55 519 444 -139 -675 -388 201 515 248 -106 -217 -72
1373g2J1j02K60K44N6n47k72J51M11L01j03k61j76j84m0L52L67J70m76m95j63
$$ -72 -61 -163 97 341 397 -150 -422 -271 140 441 338 77 -99 -283 -323 29 396 566 90 -405 -568
1394e68M69M19Ol19j98J14k6j37M9L03L14k39m54k13K79M46Q9k32k51O8j33M9
$$ -568 -99 320 326 7 -191 -77 -103 -240 -191 112 426 187 -267 -480 -201 245 334 102 -149 -81 -214 -165
1416a65J85K77o1k62k92J19Q6L50n5j22Jj34k20P5J39M12J0k12o36K33L48L16
$$ -165 20 297 236 -26 -318 -199 -113 237 182 60 61 -73 -293 -218 -79 333 343 131 -505 -272 76 392
1438C92j60k01q5j09M1M9J49K65k29j66j39j5K04J45P7j42j19k12J22R9J40K94
$$ 392 232 31 -54 -163 -122 -73 76 341 112 -54 -193 -208 -4 141 218 76 -43 -255 -133 -34 106 400
1460D00k84j79j20J48J11Q3p2r4j3q9j19NL40K30k21m03m0J31L37k5K4j55p6o8
$$ 400 116 -63 -183 -35 76 159 87 -7 -20 -109 -228 -223 117 347 126 -277 -317 -186 151 126 150 -5 -81 -149
1484a49N4Q3Q4K26j16l00j56J18K03J15pp0j55q7K3J83K46L7k92l40K09J72N1
$$ -149 -95 -12 72 298 182 -118 -274 -156 47 162 155 85 -70 -157 -134 49 295 332 40 -300 -91 81 132
1507A32j59M9kO3j50m7P8J41J24r4k42j08J41J31J32Pq0l05p9J62K13O6j7k21
$$ 132 -27 22 20 83 -67 -114 -36 105 229 135 -107 -215 -74 57 189 196 116 -189 -268 -106 107 173 156 -65
1531f5k33J44J34P3K6j0J9m8j77o3K78J28L4k85r8M1J38J72r3%k21M6J7M9J2L8
$$ -65 -298 -154 -20 53 79 69 88 40 -137 -200 78 206 240 -45 -143 -102 36 208 115 115 -106 -60 -43 6 18 56
1557E6P4j77l9L9K30o7K1j30P7j84P2q3J12K02j24o1j90RJ71J16q3j3n6m9n3o
$$ 56 130 -47 -86 -47 183 116 137 7 84 -100 -28 -111 1 203 79 18 -172 -163 8 124 41 28 -28 -77 -130 -136
1583a36K66J28j14k25j98J87J69O3k23J7J1n3rO6J56nl8k23j76L07J52P0k46K6
$$ -136 130 258 144 -81 -279 -92 77 140 -83 -66 -55 -108 -117 -51 105 100 62 -161 -337 -30 122 192 -54 -28
1607b8L7j45K8J67L7j3r0o2j57J70J26q8o4mK21j37m4r7K77J43r7l78o2K21J44
$$ -28 9 -136 -108 59 96 83 -7 -69 -226 -56 70 -18 -82 -86 135 -2 -46 -143 134 277 180 -198 -260 -39 105
1632A05j05K9k3Kj31L1N2K68m8k85p0M9K91q6q2j11J56L1j80m4J69NJ78j16l41
$$ 105 0 29 6 8 -123 -92 -40 228 180 -105 -175 -126 165 79 -3 -114 42 73 -107 -151 18 23 201 85 -256
1657b56N7M15m9j93o2O9J60j91j70J86K91q3k34j81L60J63k13j66LR5K22l26j00
$$ -256 -199 216 167 -26 -88 -19 141 -50 -220 -34 257 174 -60 -241 119 282 69 -97 -94 1 223 -103 -203
1680b03K67K60j29l12r0L08J17j76j65J40J9l5j07j15L39J58k20k73kL82M4l20
$$ -203 64 324 195 -117 -207 101 218 42 -123 17 36 1 -106 -221 118 276 56 -217 -219 163 207 -113
1702a13j71J67L88j65m01L7M62J22l15k61L5L54J21k50j49J92K56l11l15J77M05
$$ -113 -284 -117 271 106 -295 -258 204 326 11 -250 -215 139 260 10 -139 53 309 -2 -317 -140 265
1723B65j5k93j52J90L34k52k79O8L40J16k63m86J80N56J43n80k71M20K80l6n10
$$ 265 250 -43 -195 -5 329 77 -202 -134 206 322 59 -427 -247 309 452 -128 -399 21 301 265 -245
1744b45P6L88J86n82k56L12N59j77n40q1N50J27k71l01J00M04nl37l03M57L15
$$ -245 -169 219 405 -177 -433 -121 438 261 -279 -360 190 317 46 -255 -155 249 244 -93 -396 61 376
1765C76k05n23k7O78J19m81m75L62P41k94n92q1N22M11m98m69J20O58P9n57k82
$$ 376 171 -352 -379 299 418 -63 -538 -176 565 271 -321 -402 120 531 33 -436 -316 342 421 -136 -418
1786d18M21N07k39o53j59R22K28n83o20L81P60j81o77j18O53L48o10n12K87P38
$$ -418 3 510 271 -382 -541 381 609 26 -594 -213 547 366 -311 -429 224 572 -38 -550 -263 475
1806D75N9p52m74N29Q24l99q08J23P18L14o42o73M05J034j47q65l67P06M90l94
$$ 475 534 -218 -692 -163 661 262 -546 -423 295 609 -33 -706 -301 733 586 -279 -646 60 550 156
1826A56o54J43P53J25o82n60O04Q21l72r91J38Q61L11p08p32N07R69r2j003l33
$$ 156 -498 -355 398 523 -159 -719 -115 706 334 -657 -519 342 653 -55 -787 -280 689 597 -406 -739
1846g39Q32P15m82j001O3J133J82p86n10L83Q45j62j013j28R46N75q68p94N21
$$ -739 93 808 326 -675 -612 521 703 -83 -593 -210 635 473 -540 -668 278 853 -15 -809 -288
1865b88R68j0j011m68J027O39n34j214K19J143M58j158o83N99J213l19j175j21
$$ -288 680 670 -341 -809 218 857 323 -891 -672 471 929 -229 -912 -313 900 581 -594 -715
1883g15R85O40p82r83M39J024J07r39n67O44R84m46j127K42J114L28j111q80P73
$$ -715 270 910 128 -855 -416 608 715 -224 -791 -147 837 391 -736 -494 620 948 -163 -1043 -270
1902b70J179k79j146l84J192N96p68j132M72J295M3j250o85J150R35m67j149j58
$$ -270 909 630 -516 -900 292 888 120 -1012 -540 755 798 -452 -1137 13 948 481 -668 -826
1920h26J351M33r64j172Q86J199j39j397l99J227Q11p88j180L86J361J71j264
$$ -826 525 958 -6 -1178 -292 907 768 -629 -1028 199 1010 222 -958 -572 789 960 -304
1937c04o84Q49J231o66j367O4J458N00j033j173Q10J321l04j415m45J237J241
$$ -304 -988 -139 1092 426 -941 -877 581 1081 48 -1125 -315 1006 702 -713 -1158 79 1320
1954A320j058j262J54J645L44j415r73J066J329m40j523j26J415P83j248j209
$$ 1320 262 -1000 -846 799 1143 -272 -1245 -179 1150 710 -813 -939 476 1259 11 -1198
1970a198P50J490k45j420n55J339J106q97j495M15J543K71j615p51J195J297l72
$$ -1198 -448 1042 797 -623 -1178 161 1267 370 -1125 -710 833 1104 -511 -1262 -67 1230 858
1987H58j827r4J478Q91j181j340N93J548R4j601p11J290J271p54j637K38J568
$$ 858 -969 -1063 415 1306 125 -1215 -622 926 1020 -581 -1292 -2 1269 515 -1122 -884 684
2004F84N39j504j008J060J375l51j706l62J643R27j157j489O19J790K17j865o99
$$ 684 1223 -281 -1289 -229 1146 795 -911 -1273 370 1297 140 -1349 -730 1060 1277 -588 -1287
2021a287J304J376q37j721K95J557O43j522j275J121J582k78j850m13J663J078
$$ -1287 17 1393 556 -1165 -870 687 1330 -192 -1467 -346 1236 958 -892 -1305 358 1436
2037A436j211j520N43J887N4j701r16J395J453p12j828n5J959N35j495j351J036
$$ 1436 225 -1295 -752 1135 1189 -512 -1428 -33 1420 708 -1120 -1175 784 1319 -176 -1527 -491
2054d91J733j31j899o06J671J265j184j796M84J915L96j766j159J373J662o70
$$ -491 1242 1111 -788 -1394 277 1542 358 -1438 -954 961 1357 -409 -1568 -195 1467 797
2070G97j915j99J974P64j322j536Q90J857j91j971n96J643J354r90j907K91K123
$$ 797 -1118 -1317 657 1421 99 -1437 -547 1310 1119 -852 -1448 195 1549 559 -1348 -1057 1066
2087A066L08j744j221J303J769n89k012l58K055R74j443j628Q39J924qj951q78
$$ 1066 1374 -370 -1591 -288 1481 892 -1120 -1478 577 1551 108 -1520 -681 1243 1235 -716 -1594
2104a594J587J723j215j842K29K083N90j774j469J321J876n21k172l35J958J302
$$ -1594 -7 1716 501 -1341 -1112 971 1561 -213 -1682 -361 1515 994 -1178 -1513 445 1747
2120A747j566j754P31K130J62k159r82J772J589r76k054J41K060P03j693j513
$$ 1747 181 -1573 -842 1288 1450 -709 -1691 81 1670 694 -1360 -1219 841 1544 -149 -1662
2136a662J194J883l80k069l76J835J302j429j902P25K087K48k078j110J641J804
$$ -1662 -468 1415 1035 -1034 -1410 425 1727 298 -1604 -879 1208 1456 -622 -1732 -91 1713
2152A713r27k133Q2J909J014j667j566R68K009k35k013p96K057J155j077k010
$$ 1713 786 -1347 -1265 644 1658 -9 -1575 -607 1402 1167 -846 -1642 415 1570 493 -1517
2168a517M56K188L15j933j276J623J777p56k162j0K055R89j728j775J120K007
$$ -1517 -1061 1127 1442 -491 -1767 -144 1633 877 -1285 -1295 760 1749 21 -1754 -634 1373
2184A373j28k053r12J942J540j060k162L13K217M98j908j334J415J889p27k097
$$ 1373 1245 -808 -1720 222 1762 702 -1460 -1147 1070 1568 -340 -1674 -259 1630 903 -1194
2200a194k08K158R64j595j787Q08K128K3k103p80J614J607j095j973K21K146N91
$$ -1194 -1402 756 1720 125 -1662 -854 1274 1297 -806 -1586 28 1635 540 -1433 -1212 934 1525
2217A525j783j504J375K000l69k382m67J983J353j471j908P88K098L06k192j102
$$ 1525 -258 -1762 -387 1613 1244 -1138 -1605 378 1731 260 -1648 -860 1238 1544 -648 -1750
2233a750J717J815j042k206J72K106Q15j869j448J195K011l31k174o09J961J387
$$ -1750 -33 1782 740 -1466 -1294 812 1627 -242 -1690 -495 1516 1185 -989 -1598 363 1750
2249A750j303k066N88K254L07k009j208J662J773r97k134N4K091R72j733j737
$$ 1750 447 -1619 -1031 1223 1530 -479 -1687 -25 1748 751 -1383 -1329 762 1734 1 -1736
2265a736J068K116k03k192o39J947J248j167j991M86K218K84j967j075J560J671
$$ -1736 -668 1448 1245 -947 -1586 361 1609 442 -1549 -1063 1155 1439 -528 -1603 -43 1628
2281A628q39k061j45K143R46j548j808J017K039k5k107r74J866J582j113k070
$$ 1628 789 -1272 -1417 726 1672 124 -1684 -667 1372 1347 -760 -1734 132 1714 601 -1469
2297a469K22K272N69j964j343J382J801n17k048k23J850J045j433j831R47J938
$$ -1469 -1247 1025 1594 -370 -1713 -331 1470 953 -1095 -1318 532 1577 144 -1687 -740 1198
2313A198K03k201q71J827J480r23j995J09K156N79j785j437J281J844l37k128
$$ 1198 1401 -800 -1671 156 1636 713 -1282 -1173 983 1562 -223 -1660 -379 1465 1128 -1000
2329a000m50J815J267j424j693O75J999J45j983j000J693J508q64j992M7K103
$$ -1000 -1450 365 1632 208 -1485 -810 1189 1334 -649 -1649 44 1552 688 -1304 -1257 846
2345H46P40j721j530J172J871l41k040n29J911J174j309j775O62K002K62j921
$$ 846 1586 -135 -1665 -493 1378 1037 -1003 -1532 379 1553 244 -1531 -869 1133 1395 -526
2361e26j077J561J524q47j811rJ859Q25j611j386Q30J911k07j884n63J673J322
$$ -526 -1603 -42 1482 635 -1176 -1185 674 1499 -112 -1498 -668 1243 1036 -848 -1411 262 1584
2378A584j161j727M51J837L24j698r98J259J529o90j707j66J615J058j437j529
$$ 1584 423 -1304 -853 984 1308 -390 -1388 -129 1400 710 -997 -1163 452 1510 73 -1456
2394a456Q24J824J17k060o41J580J339j096j695J96J909M76j641j159J066J811
$$ -1456 -632 1192 1309 -751 -1392 188 1527 431 -1264 -1068 841 1317 -324 -1483 -417 1394
2410A394n90j709k97J642R41j283j502P44J752L0j715p49J499J284j051j586L12
$$ 1394 804 -905 -1202 440 1381 98 -1404 -660 1092 1122 -593 -1342 157 1441 390 -1196 -884
2427h84J727N11j648j000R53J667o18j605l47J579R73j183j383O07J778J2j701
$$ -884 843 1354 -294 -1294 -341 1326 708 -897 -1244 335 1308 125 -1258 -651 1127 1139 -562
2444e62p60J286J358p34j657O4J684M98j333j172R77J508k80j607m72J453J154
$$ -562 -1322 -36 1322 588 -1069 -1005 679 1177 -156 -1328 -351 1157 877 -730 -1202 251 1405
2461A405j133j509N25J637K53j486r94J108J363n86j490j16J552P72j351j080
$$ 1405 272 -1237 -712 925 1178 -308 -1302 -194 1169 583 -907 -1023 529 1301 -50 -1130
2477a130O85J599k64j484o51J415J077q17j394K05J587J89j349q97J056J357n55
$$ -1130 -445 1154 890 -594 -1245 170 1247 430 -964 -759 828 1017 -332 -1229 -173 1184 629
2494F29j464j82J474O36j154j122P66J379j02j444n43J373J032r59j343L35J335
$$ 629 -835 -1017 457 1093 -61 -1183 -417 962 860 -584 -1127 246 1278 319 -1024 -689 646
2511F46M64j232r46Q70J243l47j450k29J450O33r68j091M31J335O7j363o29J097
$$ 646 1110 -122 -1068 -198 1045 698 -752 -981 469 1102 134 -957 -526 809 876 -487 -1116 -19
2529a9J044o38j328L23J256K87j099r28P77J187j06j333l31J243P35j003r79L57
$$ -19 1025 387 -941 -618 638 925 -174 -1102 -325 862 756 -577 -908 335 1070 67 -912 -555
2547e55J242J32j196n07Q45R53m75j335J94J191M87j115q37P36R99j53j200l62
$$ -555 687 819 -377 -884 -39 914 439 -896 -702 489 976 -139 -976 -240 759 606 -594 -956
2565i56J214P79p93j202M51J210J40j139o05P88J072n99r82q5J154N27j079q43
$$ -956 258 1037 244 -958 -507 703 843 -296 -901 -113 959 360 -622 -707 447 974 -105 -948
2583i48N23J128j44j083l33R96Q54q29j003L04J070K01r63o87Q81R15m25j047
$$ -948 -425 703 559 -524 -857 139 993 164 -839 -535 535 736 -227 -914 -33 882 457 -590
2601e90r7R74N39q05q36M45R67N3r87m64R78O10n69p60M0R37L13q88o66O28R32
$$ -590 -687 287 826 21 -815 -370 597 650 -337 -801 177 787 218 -542 -502 435 748 -140 -806 -178 754
2622G54k62j041q9R32M61p34p93M00J040J7j032m27R17N33l15r26J55P80K46p36
$$ 754 492 -549 -638 294 755 21 -772 -372 668 685 -347 -774 143 676 361 -565 -410 370 616 -120
2642a20o41N74Q17j47r27k00Q47N43p45o83L03R41lq93l36O08O09l87o61K5R06
$$ -120 -761 -187 630 483 -444 -644 203 746 1 -682 -379 562 559 -334 -670 -62 547 160 -501 -476 430
2663D30K07p20o42N61P42j91p75j39P60L66m58p51L22O84J45p17m97O70N39k69
$$ 430 637 -83 -725 -164 578 387 -388 -527 233 599 141 -610 -288 396 541 -176 -673 -3 536 267
2683B67p74L7O96L65o14m67K45P51j35o02l48O14N60m61o72J41O62J54o47k67
$$ 267 -507 -470 226 591 -23 -490 -245 506 371 -231 -579 35 595 134 -538 -397 265 419 -228 -495
2703d95M26N63k10o46j12O41L51m85n02K55N99qo69j92N49L46k64n35P6O01J53
$$ -495 -69 494 284 -362 -474 167 518 33 -469 -214 385 377 -292 -484 65 411 147 -388 -312 289 442
2724D42o43k36L86O05k50o58j17O55K36m18n44M45M89q8o57m6M45M19l30m38N5
$$ 442 -201 -437 -51 554 304 -354 -471 184 420 2 -542 -97 392 304 -353 -399 46 465 135 -303 -248
2745b48M82O0l75l10K81M57k10m24K7M34K58l98m16K86M77J3o96p4M27L40k84
$$ -248 234 294 -81 -391 -110 347 137 -287 -260 174 432 34 -382 -96 381 394 -302 -376 51 391 107
2766A07l34L0L90J38l48m01L37M00r6m25j52M30L59l89l56J55L13P5l56j93K71
$$ 107 -227 -197 193 331 -17 -418 -81 319 223 -202 -354 76 435 46 -310 -155 158 233 -123 -316 -45
2787d5L54j28m59M0M12K19m51j84K71K57j09l47j05L89J63k97j38J00J92L4k08
$$ -45 309 181 -278 -238 174 393 -58 -242 29 286 177 -170 -275 114 277 -20 -158 -58 134 168 -40
2808d0j94K17L20j45k98j23L92K39l60k12J64K85j6l62r3K68J01r2l02L9L37J23
$$ -40 -234 -17 303 158 -140 -263 129 368 8 -204 -40 245 229 -133 -226 42 143 51 -251 -212 125 248
2830B48k01k41J38K65r5l07m2L49M9j34l15K51K20m7l04m2J67L36j12m11J63K83
$$ 248 47 -194 -56 209 114 -193 -235 114 163 29 -286 -35 185 138 -166 -208 -41 295 183 -228 -65 218
2852B18kk58j11J06K30m6k00J6J36K01j60k51J47J93j58j03j46J33L15j29j97
$$ 218 216 -42 -153 -47 183 137 -63 -47 89 290 130 -121 26 219 61 -42 -188 -55 260 131 -66
2873f6j1J71P8k59k8M3K45j29j10RMK18n0l24J08K28m5q1j19J39J88j31j26J3
$$ -66 -77 94 172 -87 -115 -72 173 44 -66 -57 -53 165 115 -209 -101 127 82 1 -118 21 209 78 -48 -35
2897c5J04J4p5n4O9N6j0j56q5J44M0r4M2l7J58L4j01n1K6J01o5m0r1J65j5O3k08
$$ -35 69 83 8 -46 23 79 69 -87 -172 -28 12 -82 -40 -77 81 115 14 -37 -11 90 25 -15 -106 59 44 107 -101
2924a01J5J76Nj74l8K9J38J4q7n0Q4K8n2p9J13R1j06m2k1R4K2o6p7J2J17m3o0
$$ -101 -86 90 95 -79 -117 -88 50 64 -23 -73 11 39 -13 -92 21 112 6 -36 -57 37 59 -7 -84 -72 45 2 -58
2951e8O5k6R6o4Lq6P3K1p1k9O6P1J1j26l1J02J16j20l5KN2O3r8n0j6R9K7p5q0
$$ -58 7 -19 77 13 16 -70 3 24 -47 -76 -10 61 72 -54 -85 17 133 13 -22 -20 32 95 -3 -53 -69 30 57 -18 -98
2980i8J77k2r1j06L2J20J7j00q8J68M5j6m1M8j36J18n1o6L4P1K6p5n9J73r5R5
$$ -98 79 57 -34 -140 -108 12 29 -71 -159 9 54 38 -3 45 -91 27 -24 -90 -56 15 41 -34 -93 80 -15 80
3006H0j18o2K55k00P5j1o0Q4J1l1j0N7l9P4j95J3J48o8R7o9p4M4o1N5qL4M1l7
$$ 80 -38 -100 155 -45 30 19 -41 43 54 23 13 70 31 105 -90 -77 71 3 100 31 -43 1 -60 -5 -13 21 62 25
3034B5L0m8L8O3j10j5L1M3qq5J6N5o6K2Nj0J37Qj74O5l1o2R7q9J42j23L3j3p4
$$ 25 55 7 45 108 -2 -17 14 57 49 -36 -20 35 -31 -9 -4 -14 123 131 -43 22 -9 -71 26 -63 79 -44 -11 -24 -98
3063i8K01j01J2L6j22O2m6O3PL9mj00l0J02Lk0L7q9J09Plj42J12O6j05j1j6R6
$$ -98 103 2 14 50 -72 -10 -56 7 14 53 49 -51 -81 21 24 4 41 -48 61 68 65 -77 35 101 -4 -15 -31 65
3091F5JM3r5j3j2Q2r5R5k12J21k6J22N9k21P7R5o6j9o4j6J19Kq2OL1O4J6m6Pk5
$$ 65 66 109 14 1 -11 71 -24 71 -141 -20 -46 76 135 -86 -9 86 20 1 -63 -79 40 42 -40 -34 -3 61 77 31 38 13
3121A3m9J7n0K7K6nm1j3P0k3MN9P3j13J1O0j05J13q4J35n6m2l3L0R7k9j84R1l3
$$ 13 -36 -19 -69 -42 -16 -21 -62 -75 -5 -28 -24 35 108 -5 6 66 -39 74 -10 125 69 27 -6 24 121 92 -92 -1 -34
3150c4m7J84j04M2k2N1j30J50j13K3J23j43o0J7n2J37K1j09n2Q1O7k4q6J42j20
$$ -34 -81 103 -1 41 19 70 -60 90 -23 0 123 -20 -80 -63 -115 22 43 -66 -118 -37 30 6 -80 62 -58
3175e8Q7J4q4J8J18j56K2k0O2K8J5p6L3oj7L6n7Q6M3k3j09J19o1N2p6Q4p6L7J7
$$ -58 29 43 -41 -23 95 -61 -39 -59 3 31 46 -30 3 -3 -20 16 -41 45 88 65 -44 75 14 66 -10 74 -2 35 52
3204E2j6n8j04J65r7Q0l6N2k4K8j09R5k8J3o4PL3K2K2p5P0J9p1n7J07K9q1l6o1
$$ 52 36 -22 -126 39 -58 22 -14 38 14 42 -67 28 0 13 -51 -44 -11 11 33 -42 28 47 -24 -81 26 55 -26 -62 -123
3233a23N5K7J39r3n6j8N1O9j06j2q6J22O5j37N1P9k5M8k6K5n8M9p4o0R1k9kK7
$$ -123 -68 -41 98 5 -51 -69 -18 51 -55 -67 -153 -31 34 -103 -52 27 2 50 24 49 -9 40 -34 -94 -3 -32 -34 -7
3261gO5Q0j43j4m5M6L0m7p7J03R7p4l6j09J32l2Q1j05N5n6P2m5l6P6P1j75Q7P7
$$ -7 58 138 -5 -19 -64 -18 12 -35 -112 -9 88 14 -22 -131 1 -31 50 -55 0 -56 16 -29 -65 11 82 -93 -6 71
3289G1p5k0P8j49J42l7m3k2l1O5R7q4j5J54k25J43j39J46j5o9m3R3pR2p0M3j28
$$ 71 -4 -24 54 -95 47 10 -33 -55 -86 -21 76 -8 -23 131 -94 49 -90 56 41 -28 -71 22 15 107 37 80 -48
3316d8J38k8j89J13o3J17K9r5OM1KR0j91J0pJ41o7k4P2O3j07o6J06l4O3l5p5r9
$$ -48 90 62 -127 -14 -77 40 69 -26 -20 21 23 113 -78 -68 -75 66 -1 -25 47 110 3 -63 43 9 72 37 -38 -137
3344a37J53L4k6q3J08q6Q2j47J19NK2j32J16k2n2P0p0J3JN6k7p9K8PJ98j76l5
$$ -137 16 50 24 -59 49 -37 45 -102 17 22 44 -88 28 6 -46 24 -46 -33 -32 24 -3 -82 -54 -47 151 -25 -60
3371f0J56j06P5j17P5O8n5J20k13L3j8J64l7o2j1m6J14j04l2J35K7n4q5L0M5o5
$$ -60 96 -10 65 -52 23 91 36 156 -57 -24 -42 122 85 23 12 -34 80 -24 -56 79 106 52 -33 -3 42 -23
3397b3Q5j87P2J01K3k16J61M1K8j78N7n5N0O6oL8j5p4L0o9n6K70j33j3L0n1J25
$$ -23 62 -125 -53 48 71 -145 16 57 85 -93 -36 -91 -41 25 19 57 42 -32 -2 -71 -127 143 10 -3 27 -24 101
3424A01L3j28m9J31o4j2j20M4J46l4p9L0P1k2O0m0JO5l9j55J04n0K3l8J1n8J24
$$ 101 134 6 -43 88 24 12 -108 -64 82 48 -31 -1 70 48 108 68 69 134 95 -60 44 -6 17 -21 -10 -68 56
3451E6Qj02N8J8O0Lj66LJ14j5l1L1p8N9p1J11n7qQ0k6k6o3LQ4j27NJ5J62k3n0
$$ 56 64 -38 20 38 98 101 -65 -62 52 37 6 37 -41 18 -53 58 1 -7 73 47 21 -42 -39 45 -82 -77 -62 100 77 27
3481B7j04J91L4j31j1jN7k9j28K7M4K8j9m5J10p4J43j67L2m3M6Q3j66KM7M4J08
$$ 27 -77 114 148 17 6 5 62 33 -95 -68 -24 4 -15 -60 50 -24 119 -48 -16 -59 -13 70 -96 -94 -47 -3 105
3508A05j54o8P2k2J20j02J18K9j68l9P1N2L6k8oL4r5R9j53JJ7N1J97j92QJ11j33
$$ 105 -49 -117 -45 -67 53 -49 69 98 -70 -109 -38 14 50 22 16 50 -45 54 -99 -98 -81 -30 167 -25 -17 94 -39
3535c9Q3%j15J65K9j81j5J01L5p2M4Lj05J9P2j0rJ03k02Q8L9N6m5l7k4O6j23J79
$$ -39 44 44 -71 94 123 -58 -73 28 63 -9 35 38 -67 -48 24 14 5 108 -94 -6 33 89 44 7 -17 49 -74 105
3563A05j68JJ60o5M2j22RJ01n5M6p4Q6L5j4j85K9J47M0l0n1PM2Oj28m2N7J40q2
$$ 105 -63 -62 98 33 75 -47 -38 63 8 54 -20 66 101 87 -98 -69 78 118 88 37 44 86 92 -36 -78 -21 119 37
3591C7j00R1l5P2L1k07OJ4J16q0pJ07K8j43K6K0l5J15l7K1p3KK6j05J09O1l9l9
$$ 37 -63 28 -7 65 96 -111 -105 -91 25 -55 -62 45 73 -70 -44 -24 -59 56 19 40 -33 -31 -5 -110 -1 60 21 -18
3619a8n8L3J9R2o0k3j1p%l2M7J51j38q3J58j11N2L3q0m8%P0j0rk8J30O0j04J8
$$ -18 -76 -43 -24 68 8 -15 -26 -33 -33 -65 -18 133 -5 -88 70 -41 11 44 -36 -84 -84 -14 -24 -33 -61 69 129 25 43
3648D3Ol7j48J00j4M7J9k3K0M3J6L9o5j17K0P4o8rm8K76j44q0K9n0P2j09N6R3
$$ 43 49 12 -136 -36 -50 -3 16 -7 13 56 72 111 46 -71 -51 23 -45 -54 -102 174 30 -50 -21 -71 1 -108 -52 41
3676D1Lk4l1J13q5k3p8n5K2J74Nq2M4R0j33J1Qr8k0J66l3r4J29j68J63n1M8RR1
$$ 41 44 20 -11 102 17 -6 -84 -139 -117 57 62 -20 24 114 -19 -8 0 -98 -118 48 15 -79 50 -118 45 -6 42 51 142
3705A42j07O8j08k8M1P9K9r5K5rl6o0Q5l2K6Q4q8N2q9K7r3Q5J2K8j6M9Om7o4L6
$$ 142 35 103 -5 -33 8 87 116 21 46 37 1 -59 26 -6 20 104 16 68 -21 6 -87 -2 10 38 22 71 77 30 -34 2
3735BO4q1P6r4j25J51k1N7m0m1J22r2N5p3O6M%o5J01p8OM8L9K9j24O6J8Km1r7
$$ 2 66 -15 61 -33 -158 -7 -28 29 -11 -52 70 -22 33 -40 26 30 30 -35 66 -12 -6 42 81 110 -14 52 70 72 31 -66
3765f6J41k04O3J60j32J4k0q8M8N0J0J20m8k8J6Jj6j3nO2l7M4k07J70J19j22K7
$$ -66 75 -129 -66 94 -38 -24 -44 -132 -84 -34 -24 96 48 20 36 37 21 8 3 65 28 72 -135 35 154 32 59
3792E9k21J24k6k1J54o7L0K1J2m6M1l0p4l3J81j78K3M0Q4p7j6J2J0O8r6O5K3p2
$$ 59 -162 -38 -64 -85 69 2 32 53 65 19 60 30 -44 -77 104 -74 -51 -11 73 -4 -20 -8 2 70 -26 39 62 -10
3820a0j6p6J21P2j26kJ5J2q0J66j56N5K8L4m1O5q7M9l3M7lKj90J54j3o4J58j19
$$ -10 -26 -102 19 91 -35 -37 -22 -10 -90 76 -80 -25 3 37 -4 61 -26 23 -10 37 34 36 -154 0 -13 -77 81 -38
3848c8J26oo3o0P6J0L0j10mn0R8l9J01p5K7P2j03Q8m4L7j60N4M9J3J0m1k8m6K5
$$ -38 88 82 19 -41 35 45 75 -35 -39 -89 9 -30 71 -4 23 95 -8 80 36 73 -87 -33 16 29 39 -2 -30 -76 -51
3877e1mJ62j38k7R8m5or3O9J92j22m4m4qN1p7J00o9K01j88J30j06l3j9J0M8n2
$$ -51 -55 107 -31 -58 40 -5 -11 -104 -35 157 35 -9 -53 -61 -10 -87 13 -56 145 -43 87 -19 -52 -71 -61 -13 -65
3904f5P9j31J44o2j83J81J3P6k1O2j77O8p4Q6moM7o3R9p5l2K3K9j5qJ6m1k9kN
$$ -65 14 -117 27 -35 -218 -37 -24 52 31 93 -84 -16 -90 -4 -8 -14 33 -30 69 -6 -38 -15 14 -1 -9 7 -34 -63 -65 -60
3934f0L2L6j2o7k8%J12j65J26o3NO1J7o0M5O9j18J20j9j01J30j08Q6k9K0J3p3
$$ -60 -28 8 -4 -71 -99 -99 13 -152 -26 -89 -84 -23 -6 -66 -21 48 -70 50 31 -70 60 -48 38 9 29 42 -31
3961c1P3k5J7p5M2l7M7j54J09k0O6O5o3j8M0m5jk3j14K03l6k3q5J06l1o2N9L7
$$ -31 42 17 34 -41 1 -36 11 -143 -34 -54 12 77 14 -4 36 -9 -10 -33 -147 56 20 -3 -88 18 -13 -75 -16 21
3989B1k3J39j48rj0L2j7m2M6j7J9m1o0R2j53J65o6kLJ62j01M4n7P2J6j65L1n2
$$ 21 -2 137 -11 -20 -30 2 -15 -57 -11 -28 -9 -50 -110 -18 -171 -6 -72 -74 -71 91 -10 34 -23 49 65 -100 -69 -121
4017a21J36m7J07o6q3J16L6j47%j3J3J15K2j08J50mj13o2J12m3M5j60J85K9j24
$$ -121 15 -32 75 9 -74 42 78 -69 -69 -82 -69 46 68 -40 110 106 -7 -69 43 0 45 -115 70 99 -25
4042b5k3L4N0r0J83j85K2K7P9Nm7j4P3m2m5nO6m0j11O5p8J47l0P7j58Mm9J49r9
$$ -25 -48 -14 36 -54 129 -56 -34 -7 72 77 30 16 89 47 2 -3 63 23 -88 -23 -101 46 16 93 -65 -61 -110 39 -60
4071f0M8J1M1lj45Q9J2P2k25J87o1N4K8j65P7J36j17J26j86J27l3N6Or2K4K3l6
$$ -60 -12 -1 40 37 -108 -19 -7 65 -160 27 -34 20 48 -117 -40 96 -21 105 -81 46 13 69 75 -17 7 30 -6
4098fq6J25j4M7o3P1o2M7M2m9p2J44k22J20j8l7J70o2n2j35J26L7n2mj44K32q5
$$ -6 -92 33 19 66 3 74 12 59 101 52 -20 124 -98 22 4 -33 137 75 23 -112 14 51 -1 -5 -149 83 -2
4125bp2M3j2M5N1q6j6J30q3j12K5L4KO2k0J6j7j7J36m6j73J98p3J9J2J6m3J48
$$ -2 -74 -31 -43 2 53 -33 -49 81 -2 -114 -89 -55 -53 9 -11 5 -12 -29 107 61 -112 86 13 32 44 60 17 165
4153A65j79JMnj3J01J8j35P9m9o1M0L8j3n0l1P0O1r9j2R4N4rj41N9m7L7R8k9j33
$$ 165 -14 -13 -9 -14 -27 74 92 -43 36 -13 -74 -34 4 -9 -59 -90 -20 41 -58 -70 24 78 69 -72 -13 -60 -23 75 46 -87
4183h7J24O5r6Mj10K10j60P7p9R1N0q0o7j3J85K8r9j39P4J0J38j70O6O1nP3k41
$$ -87 37 102 6 10 -100 110 -50 27 -52 39 89 9 -58 -71 114 142 43 -96 -22 -12 126 -44 22 83 78 151 -90
4210i0oK10j47m6J11j9M6m3n8J0J8J33m3r9OK8O1j5l7k4J18j09p6j9K77r9j34
$$ -90 -96 114 -33 -79 32 13 59 16 -42 -32 -14 119 76 -23 -17 11 72 57 20 -4 114 5 -71 -90 187 88 -46
4237d6J1L4lQm8QJ4P8L5j06K5J5Q3j51j29J85o9j3NJ9K9K4M6r1J15n9M5q5J14
$$ -46 -35 -1 -4 4 -44 -36 -22 56 91 -15 10 25 108 -43 -172 13 -56 -69 -64 -45 -16 8 54 -37 78 19 64 -21 93
4266I3j01Q4j16K2N2m7K12l11J29j2Q2p1r7J01J4K2j09k2j0J62l0m9o2o0J79o8
$$ 93 -8 76 -40 -18 34 -13 199 -112 17 5 87 16 -81 20 34 56 -53 -75 -85 77 47 -2 -64 -124 55 -13
4292a3K5J3o4R3q5J3n9J89j12o1p3J51m2O4j19P8r1Q3J2j42O5J26J0j15K8J22
$$ -13 12 25 -39 54 -31 -18 -77 112 0 -61 -134 17 -25 39 -80 -2 -93 -10 2 -140 -75 51 61 -54 -26 96
4318I6l1q9l0J24oPj14l6J51p2o7NR1%jj4k3l7J34p7r2K3L2R0r7q8J34O9O1j04
$$ 96 65 -24 -54 70 64 71 -43 -79 72 0 -67 -62 29 29 28 14 -9 -46 88 11 -81 -58 -26 64 -33 -121 13 82 143 39
4348C9o3R9o5Ok2J1L6NO0j26Q1M0J6o1r2Q5k2kr5P1m6j6N4Q8m9j3Pj02k3J01p1
$$ 39 -24 75 10 16 -6 5 41 46 106 -20 61 101 117 56 -36 49 27 25 -70 1 -45 -61 -7 81 32 19 26 -76 -99 2 -69
4379f9M9O5m4j1l0P0l5M3k8k2O2o0o9M1Q0r5L4O9n1n7Q2p2J0o7M7J16m1jj2l0
$$ -69 -20 45 1 -10 -40 30 -5 38 10 -12 50 -10 -79 -38 42 -53 -19 50 -1 -58 24 -48 -38 -105 -58 58 17 16 4 -26
4409b6lR3q8K3mm6Q3o7PRL7J06k04J33j14O1JK5K7M6j11l8J28q7Q4j14P1o7O4
$$ -26 -29 64 -24 -1 -5 -51 32 -35 -28 -19 18 124 -80 53 -61 0 1 26 53 99 -12 -50 78 -9 75 -39 32 -35 29
4438B9K1m3j64J10J06O2j99R4L5rn9q9M5L9R6j57J6J11j8O2r5O5J0l7n9n3J20
$$ 29 50 7 -157 -47 59 121 -78 16 51 42 -17 -106 -61 -22 74 -83 -67 44 26 88 -7 58 68 31 -28 -81 39
4465C9j32J40J4m5p3J26k5m2K6RK6j20M7n2J18k3j2j77J30o2J28q7J21p6l3M8
$$ 39 -93 47 61 16 -57 69 44 2 28 37 63 -57 -10 -62 56 33 21 -156 -26 -88 40 -47 74 -2 -35 13
4491A3r7R4L8l8o6k6k6J74mL2j16L8M7j9n6Q4r6L0j1l7N1J00n0K8j34R7n4L6l3
$$ 13 -84 10 48 10 -56 -82 -108 66 62 94 -22 16 63 44 -12 72 -24 6 -5 -42 9 109 59 87 -47 50 -4 32 -1
4520apR5m8kp4K1J29n6p4jJ6P4j21PrL6n1nk2J2k2J76j35k2P8J01r8r8J32p2k5
$$ -1 -8 87 39 37 -37 -16 113 57 -17 -18 -2 72 -49 -42 -51 -15 -66 -71 -93 -81 -103 73 -62 -84 -6 95 -3 -101 31 -41 -66
4551f6M6J5oJ72j45mj7l3J12J2p4O3k1m2L6j59R7M5RnKJ9L8r0m0j0J45j00o7P8
$$ -66 -20 -5 -11 161 16 12 -5 -38 74 86 12 75 54 12 48 -111 -14 31 40 35 37 56 94 4 -36 -46 99 -1 -68 10
4581A0Q5k2j33J03k5O2r0J62k20J07j4K5m5j14J34no6L5m7P0Or5L0J29p7Mj4m7
$$ 10 95 73 -60 43 18 80 -10 152 -68 39 25 50 5 -109 25 20 -46 -11 -58 12 18 -77 -47 82 5 9 -5 -52
4609e2J08l0l4K7ONM0j33L0P0Nn2n7N3M7L1k4o2M4k1O9j27qR9n9R2o0M3j3J6m2
$$ -52 56 26 -8 19 25 30 70 -63 -33 37 42 -10 -67 -14 33 64 40 -22 22 1 70 -57 -65 34 -25 67 7 50 37 53 11
4640A1o7J36m6m1j9n3J08N4P1k91R8M0P1m9j11R5M3l6j21M0R2j1P2j12N1Mp4o8
$$ 11 -56 80 34 -7 -26 -79 29 83 154 -137 -39 1 72 23 -88 7 50 14 -107 -67 25 14 86 -26 25 29 -45 -113
4668a13O8J41o4N1m6J6j22J72n1r1PJ07N9k00n9K26n4r6Nj2J24j9j74O2Q5k7m0
$$ -113 -45 96 32 83 37 53 -69 103 52 -39 -32 75 134 -66 -125 101 47 -49 -44 -56 68 49 -125 -63 22 -5 -45
4695d5j20P0J17M7q2q0P4K2n7k9J12m3%o1Kj9L5J31j54L1J16n1r8j9K3R7P0n9
$$ -45 -165 -95 22 69 -13 -93 -19 3 -54 -83 29 -14 -14 -75 -73 -92 -57 74 -80 -49 67 16 -82 -101 -78 19 89 30
4723C0j33L4J45j31NN0J30j45L4p0Q7m1N1pj16J88K4r1n2p5J78o7m3j5O0M1l3
$$ 30 -103 -69 76 -55 -50 0 130 -15 19 -51 36 -5 46 39 -77 111 135 44 -8 -83 95 28 -15 -30 30 71 38
4750C8l6k6Q0j3o5k7N7M8%r1j39K46K6o4o4m7J19q8M3k0J1j1J00q3J3K7J8q9o1
$$ 38 2 -24 56 43 -22 -49 8 56 56 -35 -174 72 98 34 -30 -77 42 -46 -3 -23 -12 -23 77 -6 7 34 52 -37 -98
4779i8L8J69q9n7m2R2P8j65J5O9Q3q1q6J4J28K1Ql7r0J63j04N6j67j5J62qNn3
$$ -98 -60 109 20 -37 -79 13 91 -74 -59 10 93 12 -74 -60 68 89 97 60 -30 133 29 85 -82 -97 65 57 62 9
4807IM8m5K2j27N1J74r2j5M2j33J52K9j24j3Q9k7P3j57J14k0N1j06j83J15l3K16
$$ 9 57 12 34 -93 -42 132 40 25 67 -66 86 115 -9 -22 67 40 113 -44 70 50 101 -5 -188 -73 -106 110
4833A10j87l0Q5M7j86J94J7M3j00n4M6RJ33l7j16R0n8mo4PJ66k5l8n2n9J02O4
$$ 110 -77 -107 -22 25 -161 33 50 93 -7 -61 -15 -6 127 90 -26 64 6 2 -62 -55 111 86 48 -4 -63 39 103
4860A03j69NL9o6O9o4L8m2J87o6q0J13j64J27J4q6j4L4M1l6m4M8O0k5L2n1N6l2
$$ 103 -66 -61 -22 -88 -19 -83 -45 -87 100 34 -46 67 -97 30 44 -42 -56 -22 19 -17 -61 -13 47 22 54 3 59 27
4888B7l6K1O9K8j93n5O3j1N1P5j36O5N1pm7J3qP4j4K5q0Rn%rJ6R4k0p2pL0J3p
$$ 27 -9 12 81 109 -84 -139 -76 -87 -36 39 -97 -32 19 12 -35 -22 -30 44 30 55 -25 -16 -21 -21 -30 -14 80 60 -12 -19 11 24 17
4921A7p1MpJ55j30M4J6M1l3o0J9K2l4Q0n4R2k2m0l9J78k26Q3J7j65K9K0O5r0J5
$$ 17 -54 -50 -57 98 -32 12 28 69 36 -24 -5 17 -17 63 9 101 79 39 0 178 -48 35 52 -113 -84 -64 1 -89 -74
4950g4J12M7m2j47J44m6M5l0l3J33j98J3N6J10n6L1l9j20qJ45Oonok5MJ8k5N0
$$ -74 38 85 43 -104 40 -6 39 9 -24 109 -89 -76 -20 90 34 65 26 -94 -102 43 49 43 38 32 7 11 29 4 54
4979E4Mj2r7N4m3Q9n6k8J44%j40K3n3Q6n9l9K7L7P8j6n3p2O0J9m5P0Rj54J52m
$$ 54 58 46 -51 3 -40 49 -7 -35 109 109 -31 -8 -61 25 -34 -73 -46 -9 69 53 0 -72 -12 7 -38 32 41 -113 39 35
5009C5J1np9QK4P1l7l6K5P4o9K4K5j15LP1k4%k5rP4j81J43QN2j38Q2l4j5J01k5
$$ 35 46 41 -38 -30 -6 65 28 -8 17 91 22 46 71 -44 -41 30 6 6 -19 -28 46 -135 8 16 68 -70 12 -22 -37 64 39
5040C9j3j5O8j32n1J50oj2K2j1q0P5m7N8j18M1J44p7r5O1k5J31j87N4L2Pk4J7
$$ 39 26 11 79 -53 -104 46 40 28 50 39 -41 34 -13 45 -73 -32 112 35 -60 1 -24 107 -80 -26 6 13 -11 6
5068Fk8r7O3NJ39j25%Q9j19N2K2mnN4o2NK3Qj08J59Pj13J4Ook0P9j00J41j51%
$$ 6 -22 -119 -56 -51 88 -37 -37 52 -67 -15 7 3 -2 52 -10 -5 18 26 -82 77 84 -29 -15 -9 -15 -35 44 -56 85 -66 -66
5099f6J32j26J7n4Q6K1J2J8j5o5J18r6P6p9P4L1j58R3p2L3j0J18m1L0j19lO9k3
$$ -66 66 -60 -43 -97 -11 10 22 40 25 -40 78 -18 58 -21 53 84 -74 19 -53 -20 -30 88 47 77 -42 -45 24 1
5127Al8M4Q2j90N6l3r9K63j56JRN6mO4rj0M7J1j73M4M1o4K05j26r8M2J05l8P3
$$ 1 -37 7 89 -101 -45 -78 -177 86 -70 -69 -60 -4 -8 56 47 37 84 95 -78 -34 7 -57 148 22 -76 -34 71 33 106
5156A06r5M4L9j49J58j36L7j9Q6K5j2j32Q3N2r4J06M0j50P6kr5K4Q4r0k9QP4l6
$$ 106 11 55 94 -55 103 -33 4 -15 71 96 84 -48 35 87 -7 99 139 -11 65 63 -32 -8 76 -14 -43 -35 39 3
5184CMk0n6p0R8L9K8O9p0j00J10j40M0P5p8L1J2R5o8l2O9q9K4nN8N5j00J09j62
$$ 3 7 -13 -69 -139 -41 -2 26 95 25 -75 35 -105 -65 10 -68 -37 -25 70 2 -30 39 -50 -26 -31 27 82 -18 91 -71
5213g1QO5K0J2l5QL4n7m0M3L3L3k4n1o2R5L1J12o4k7r2oJ00j26J22p0N2q9nQ9
$$ -71 -63 2 22 34 -1 7 41 -16 -56 -13 20 53 29 -22 -84 11 42 154 90 63 -29 -35 65 -61 61 -9 43 -46 -51 38
5243C8o3j4OM9J05k7j52o9J45Kp3R8j00P5j20R6j0rJ10j81J99j63P6k5K3P3m8
$$ 38 -25 -39 -33 16 121 94 -58 -127 18 20 -53 45 -55 20 -100 -4 -14 -23 87 -94 105 -58 18 -7 16 89 41
5270D1lKNJ0q7J14k6k4p7l5J47o7N2j29J64j53J61j10n9J29k1mN8j10M8p4K6l9
$$ 41 38 40 45 55 -32 82 56 32 -45 -80 67 0 52 -77 87 -66 95 -15 -74 55 34 30 88 -22 26 -48 -22 -61
5298f1P7J24j68P3n3N3l2j4J8J9k5m0k4N7j33M3P9Oj08J16O1r3j8n7J10MQk7K3
$$ -61 16 140 -28 45 -8 45 13 -1 17 36 11 -29 -53 4 -129 -86 -7 -1 -109 7 68 -25 -43 -100 10 14 22 -5 18
5327A8O3p4J0K9j2l2m8J3K8o2R7l3L6Rk3O0r8P3n9Nm9pLj3J66qj8L4j60J71j25
$$ 18 81 7 17 46 34 2 -46 -33 -5 -67 30 -3 33 42 19 79 -19 54 -5 0 -49 -56 -53 -66 100 92 74 108 -52 119 -6
5358fON1r8r6N2N4L7Q3j92M9J64kp1n4Q2j8J3m8j85J70M1l2O0j61J48p0N7j30
$$ -6 0 51 -47 -143 -91 -37 0 83 -109 -60 104 102 31 -23 59 41 54 6 -179 -9 32 0 60 -101 47 -23 34 -96
5386i6J74j49M8K3K5K3j46J79k8ljMp0O8l5L5o4OMJ0Mp5O2N2N9p4J6j4j38P9L0
$$ -96 78 -71 -23 0 25 48 -98 81 53 50 49 53 -17 51 16 51 -13 -7 -3 7 11 -64 -2 50 109 35 51 37 -101 -22 8
5417Hk6m2J13l0j11J12n6Q0L9o0n1M7m4OJ47j41k1OJ4Lo4R8N2k26J60nnO2m2K1
$$ 8 -18 -60 53 23 -88 24 -32 48 87 27 -24 23 -21 -15 132 -9 -30 -24 -10 -7 -71 27 79 -147 13 8 3 65 23 44
5447D4q0j0J9O5l3JP6j56J03Pm1jm9jK15k04M8L3J0p7O7r3K5L2K4m7K1O8n8J3
$$ 44 -36 -46 -27 38 5 6 82 -74 29 36 -5 -6 -55 -56 159 -45 3 36 46 -31 36 -57 -32 0 24 -23 -2 66 8 21
5477B1J3l2m1l7K6KQ4o7p3Q4k7Ll4L7P5p9k9J06j44J16k4q7J21q0LN7M5Jn8Q3
$$ 21 34 2 -39 -76 -50 -48 36 -31 -104 -20 -47 -44 -78 -41 34 -45 -74 32 -112 4 -20 -107 14 -66 -63 -6 39 40 -18 65
5507F5n0j29J72q0j4J64j74J0OQ8j08N7J0rKr4J11l6q3J76p3P6j16j5Ll8LK8k5
$$ 65 15 -114 58 -22 -36 128 -46 -36 -30 58 -50 7 17 8 10 -84 27 -9 -92 84 11 87 -29 -44 -41 -79 -76 -48 -73
5536g3n6K46k44M9N0J0O1q1J5R4j71Nj8J78O5r3j43Q8J7K8l0Po0N3M6q4J54j24
$$ -73 -129 117 -127 -78 -28 -18 43 -38 -23 71 -100 -95 -113 65 130 37 -106 -18 -1 27 -3 4 -56 -3 43 -41 113 -11
5564a1q0J46n3J0n1J84j76J8M0o8J31j84R3p0L2J15o5n0M5j1Q7m0j22J06j01O2
$$ -11 -91 55 2 12 -39 145 -31 -13 27 -41 90 -94 -1 -71 -39 76 11 -39 6 -5 82 42 -80 26 -75 -13
5590a3QM4l1j29J25n0n2L2k7J41l4J8j24N2m0J20m4J4o6J7O0p2N3O0p2L9oo0O3
$$ -13 -5 39 8 -121 4 -46 -98 -66 -93 48 14 32 -92 -40 -80 40 -4 10 -56 -39 21 -51 2 62 -10 29 23 -37 26
5619B6K5n6j6P5o3Q2j44M0J71j30j9m1J11j36J26k1o1pM2N7l6L8M0n0mn4O0K3
$$ 26 51 -5 -21 54 -9 73 -71 -31 140 10 -9 -50 61 -75 51 30 -31 -38 4 61 25 63 103 53 49 -5 55 78
5647G8l3%j04R1nk5J55j38m1j5M0K5l3N9o6k0L4R1j0J0j00K6Q5j54Q6j7l6Q5l9
$$ 78 45 45 -59 32 27 2 157 19 -22 -37 3 28 -5 54 -12 -32 2 93 83 93 -7 19 104 -50 36 19 -17 68 29
5676B9o7m9J59j2n0L6P0j57J17k6r3m3J19o5Oj6mR5j5j28J08K9p6l6O7m0N6M9
$$ 29 -38 -87 72 60 10 46 116 -41 76 50 -43 -86 33 -32 -26 -42 -46 49 34 -94 14 43 -33 -69 -2 -42 14 63
5704F3j26M4J5K22k30p0J21K7j09kN9N8j5p9j19J59N8q7O4q1j4J38o4j6o5N8N
$$ 63 -63 -19 -4 218 -12 -82 39 66 -43 -45 14 72 57 -22 -141 18 76 -11 53 -28 -42 96 32 16 -49 9 14
5731A4J01j09KPK7j38J04k3N0o4N4j28O3o9J86o2j04J33j10J18p6J6r5J14M9M
$$ 14 115 6 8 15 42 -96 8 -15 35 -29 25 -103 -40 -109 77 15 -89 44 -66 52 -24 -8 -103 11 60 64
5757F4mk1l3plK8pJn7P3n9o0J44n4l0M4J38j50k4J3p9K4P4K8j31j1P6J8l5P0o2
$$ 64 60 39 6 -1 -4 24 17 18 -39 34 -25 -85 59 5 -25 19 157 7 -17 -4 -83 -59 15 43 -88 -99 -23 -5 -40 30 -32
5788c2J4N7J13j45n5l1Q6L1q9J82j16j00J04Pl7l4P1r3R5m4k1N5j2J6NJ12j15
$$ -32 -18 39 152 7 -48 -79 7 38 -51 131 15 -85 19 26 -11 -45 26 -67 28 -16 -37 18 6 22 27 139 24
5815B4r9J15J3j6l1m4J71q5q8J13nl6o7M3j3l5k5K1K2o4J02M8m9n5Kl7J1L7JJ0
$$ 24 -75 40 53 37 6 -38 133 48 -40 73 68 32 -35 8 -5 -40 -65 -44 -22 -86 16 64 15 -40 -38 -75 -64 -27 -26 -16
5845a6M5P0j03R6j24kl3J09m5oj1N1Q0j40q4J19P0j25J88j77J70j82J33j00k8
$$ -16 29 99 -4 92 -32 -34 -67 42 -3 -9 -20 31 111 -29 -113 6 76 -49 139 -38 132 -50 83 -17 -45
5870d5J5O0M0l7J0j06P6j47J62j31K39j41J6j2o0R0M8j28L9m0L1O2p1N8M0r6J7
$$ -45 -30 30 70 33 43 -63 13 -134 28 -103 136 -5 11 -1 -61 29 77 -51 -12 -52 -21 41 -30 28 68 -28 -11
5897a1Q8j88R5j3K5J6rq1J39q4j07J15n8O9n1J21p9o7J43j2o2J00l7o3O9qK5n6
$$ -11 77 -111 -16 -29 -4 12 3 -78 61 -23 -130 -15 -73 -4 -55 66 -13 -80 63 51 -11 89 52 -11 58 50 75 19
5925A9J3l4Nj10J69Rp1l5p2J65k0m6M9j8k8n4L4L4O7p8j11J69j0l1Q1Mj60J8R3
$$ 19 32 -2 3 -107 62 71 0 -35 -107 58 38 -8 41 23 -5 -59 -25 9 76 -2 -113 56 46 15 96 100 -60 -42 51
5954E1M2j65N5o1M4M4j7P7Q2j18j8n7R3j1p2m7J45j02R7j42M3M7N8Jk03J77k01
$$ 51 93 -72 -17 -78 -34 10 -7 70 152 34 16 -41 52 41 -31 -78 67 -35 62 -80 -37 10 68 69 -134 43 -158
$$ [...]
8191H
##END NTUPLES=NMR FID
##END=
