##TITLE=1H_AM M301
 CDCl3, 8 sc, 
 7.06.2021
##JCAMPDX= 6.0         $$ Bruker NMR JCAMP-DX V2.0
##DATA TYPE= NMR FID
##DATA CLASS= NTUPLES
##ORIGIN= UXNMR, Bruker Analytische Messtechnik GmbH
##OWNER= root
$$ XWIN-NMR		Version 3.5
$$ Mon Jun  7 10:06:13 2021 Russian Standard Time (UT+4h)  she@DPX200
##.OBSERVE FREQUENCY= 200.131506
##.OBSERVE NUCLEUS= ^1H
##.DELAY= (6, 6)
##.ACQUISITION MODE= SIMULTANEOUS
##.ACQUISITION SCHEME= undefined
##.AVERAGES= 8
##.DIGITISER RES= 18
##SPECTROMETER/DATA SYSTEM= spect
##.PULSE SEQUENCE= zg30
##.SOLVENT NAME= DMSO
##.SHIFT REFERENCE= (INTERNAL, DMSO, 0, 15.7039)
##AUDIT TRAIL= $$ (NUMBER, WHEN, WHO, WHERE, WHAT)
$$ ##TITLE= Audit trail, XWIN-NMR		Version 3.5
$$ ##JCAMPDX= 5.01
$$ ##ORIGIN= Bruker BioSpin GmbH
$$ ##OWNER= she
$$ F:/spectra/data/she/nmr/H-F/1/audita.txt
$$ ##AUDIT TRAIL=  $$ (NUMBER, WHEN, WHO, WHERE, WHAT)
(   1,<2021-06-07 10:05:04.73 +0400>,<she>,<DPX200>,
      <created by zg, POWCHK disabled, PULCHK disabled
       configuration hash MD5:
       00 E9 B6 7A A2 85 ED C7 34 08 36 98 17 FE 4E 26
       data hash MD5: 16K
       A5 A6 B7 6A 29 ED 3B 10 83 C6 E9 9B 9E 55 FC DF>)
$$ ##END=
$$ 
$$ hash MD5
$$ 0A C5 9A F1 86 39 CA CF F2 BA 0A 4F 3E 19 91 5D
##$RELAX= 
##$RELAX= 
##$RELAX= 
##$RELAX= 
##$RELAX= 
##$RELAX= 
$$ Bruker specific parameters
$$ --------------------------
##$DU= <F:/spectra>
##$EXPNO= 1
##$NAME= <H-F>
##$PROCNO= 1
##$TYPE= <nmr>
##$USER= <she>
##$AMP= (0..31)
100 100 100 100 100 100 100 100 100 100 100 100 100 100 100 100 100 100 
100 100 100 100 100 100 100 100 100 100 100 100 100 100 
##$AQSEQ= 0
##$AQ_mod= 1
##$AUNM= <au_zg>
##$AUTOPOS= <>
##$BF1= 200.13
##$BF2= 200.13
##$BF3= 200.13
##$BF4= 200.13
##$BF5= 200.13
##$BF6= 200.13
##$BF7= 200.13
##$BF8= 200.13
##$BYTORDA= 1
##$CFDGTYP= 0
##$CFRGTYP= 5
##$CHEMSTR= <none>
##$CNST= (0..31)
1 1 145 1 1 1 1 1 1 1 1 1 1 1 1 1 1 1 1 1 1 1 1 1 1 1 1 1 1 1 1 1 
##$CPDPRG= <>
##$CPDPRG1= <>
##$CPDPRG2= <>
##$CPDPRG3= <>
##$CPDPRG4= <mlev>
##$CPDPRG5= <mlev>
##$CPDPRG6= <mlev>
##$CPDPRG7= <mlev>
##$CPDPRG8= <mlev>
##$CPDPRGB= <>
##$CPDPRGT= <>
##$D= (0..31)
0 1.2 0 0 0 0 0 0 0 0.06 0 0.03 0 0 0 0 0.0002 0 0 0 0 0 0 0 0 0 0 0 0 
0 0 0 
##$DATE= 1623045904
##$DBL= (0..7)
120 120 120 120 120 120 120 120 
##$DBP= (0..7)
150 150 150 150 150 150 150 150 
##$DBP07= 0
##$DBPNAM0= <>
##$DBPNAM1= <>
##$DBPNAM2= <>
##$DBPNAM3= <>
##$DBPNAM4= <>
##$DBPNAM5= <>
##$DBPNAM6= <>
##$DBPNAM7= <>
##$DBPOAL= (0..7)
0.5 0.5 0.5 0.5 0.5 0.5 0.5 0.5 
##$DBPOFFS= (0..7)
0 0 0 0 0 0 0 0 
##$DE= 6
##$DECBNUC= <off>
##$DECIM= 32
##$DECNUC= <off>
##$DECSTAT= 4
##$DIGMOD= 1
##$DIGTYP= 9
##$DL= (0..7)
0 120 120 120 120 120 120 120 
##$DP= (0..7)
150 150 150 150 150 150 150 150 
##$DP07= 0
##$DPNAME0= <>
##$DPNAME1= <>
##$DPNAME2= <>
##$DPNAME3= <>
##$DPNAME4= <>
##$DPNAME5= <>
##$DPNAME6= <>
##$DPNAME7= <>
##$DPOAL= (0..7)
0.5 0.5 0.5 0.5 0.5 0.5 0.5 0.5 
##$DPOFFS= (0..7)
0 0 0 0 0 0 0 0 
##$DQDMODE= 0
##$DR= 18
##$DS= 0
##$DSLIST= <SSSSSSSSSSSSSSS>
$$ [...]
##$SUBNAM2= <"">
##$SUBNAM3= <"">
##$SUBNAM4= <"">
##$SUBNAM5= <"">
##$SUBNAM6= <"">
##$SUBNAM7= <"">
##$SUBNAM8= <"">
##$SUBNAM9= <"">
##$SW= 20.0188882624521
##$SWIBOX= (0..15)
0 0 2 0 0 0 0 0 0 0 0 0 0 0 0 0 
##$SW_h= 4006.41025641026
##$TD= 16384
##$TD0= 1
##$TE= 0
##$TE2= 300
##$TE3= 300
##$TEG= 300
##$TL= (0..7)
0 120 120 120 120 120 120 120 
##$TP= (0..7)
150 150 150 150 150 150 150 150 
##$TP07= 0
##$TPNAME0= <>
##$TPNAME1= <>
##$TPNAME2= <>
##$TPNAME3= <>
##$TPNAME4= <>
##$TPNAME5= <>
##$TPNAME6= <>
##$TPNAME7= <>
##$TPOAL= (0..7)
0.5 0.5 0.5 0.5 0.5 0.5 0.5 0.5 
##$TPOFFS= (0..7)
0 0 0 0 0 0 0 0 
##$TUNHIN= 0
##$TUNHOUT= 0
##$TUNXOUT= 0
##$USERA1= <user>
##$USERA2= <user>
##$USERA3= <user>
##$USERA4= <user>
##$USERA5= <user>
##$V9= 5
##$VALIST= <valist>
##$VCLIST= <CCCCCCCCCCCCCCC>
##$VD= 0
##$VDLIST= <DDDDDDDDDDDDDDD>
##$VPLIST= <PPPPPPPPPPPPPPP>
##$VTLIST= <TTTTTTTTTTTTTTT>
##$WBST= 1024
##$WBSW= 4
##$XGAIN= (0..3)
0 0 0 0 
##$XL= 0
##$YL= 0
##$YMAX_a= 221265
##$YMIN_a= -152971
##$ZGOPTNS= <>
##$ZL1= 120
##$ZL2= 120
##$ZL3= 120
##$ZL4= 120
##$ABSF1= 10
##$ABSF2= 0
##$ABSG= 5
##$ABSL= 3
##$ALPHA= 0
##$AQORDER= 0
##$ASSFAC= 0
##$ASSFACI= 0
##$ASSFACX= 0
##$ASSWID= 0
##$AUNMP= <proc_1d>
##$AZFE= 0.1
##$AZFW= 0.1
##$BCFW= 1
##$BC_mod= 2
##$BYTORDP= 1
##$COROFFS= 0
##$CY= 11.3945322036743
##$DATMOD= 1
##$DC= 2
##$DFILT= <>
##$DTYPP= 0
##$F1P= 15.9154993809931
##$F2P= -4.1035820241983
##$FCOR= 0.5
##$FTSIZE= 0
##$FT_mod= 4
##$GAMMA= 1
##$GB= 0.15
##$INTBC= 1
##$INTSCL= 1
##$ISEN= 128
##$LB= 0.24
##$LEV0= 0
##$LPBIN= 0
##$MAXI= 10000
##$MC2= 0
##$MEAN= 0
##$ME_mod= 0
##$MI= 1.114404
##$NCOEF= 0
##$NC_proc= 0
##$NLEV= 6
##$NOISF1= 3.799351
##$NOISF2= 2.8
##$NSP= 1
##$NTH_PI= 0
##$NZP= 0
##$OFFSET= 15.70392
##$PC= 1
##$PHC0= -11124.8
##$PHC1= 14.60101
##$PH_mod= 1
##$PKNL= yes
##$PPARMOD= 0
##$PSCAL= 0
##$PSIGN= 0
##$REVERSE= no
##$SF= 200.130013532006
##$SI= 16384
##$SIGF1= 3
##$SIGF2= 2
##$SINO= 400
##$SIOLD= 16384
##$SREGLST= <1H.CDCl3>
##$SSB= 0
##$STSI= 0
##$STSR= 0
##$SW_p= 3612.71676300578
##$SYMM= 0
##$S_DEV= 0
##$TDeff= 0
##$TDoff= 0
##$TI= <>
##$TILT= no
##$TM1= 0
##$TM2= 0
##$TOPLEV= 0
##$USERP1= <user>
##$USERP2= <user>
##$USERP3= <user>
##$USERP4= <user>
##$USERP5= <user>
##$WDW= 1
##$XDIM= 8192
##$YMAX_p= 0
##$YMIN_p= 0
$$ End of Bruker specific parameters
$$ ---------------------------------
##NTUPLES= NMR FID
##VAR_NAME=  TIME,          FID/REAL,        FID/IMAG
##SYMBOL=    X,             R,               I
##VAR_TYPE=  INDEPENDENT,   DEPENDENT,       DEPENDENT
##VAR_FORM=  AFFN,          ASDF,            ASDF
##VAR_DIM=   8192,          8192,            8192
##UNITS=     SECONDS,       ARBITRARY UNITS, ARBITRARY UNITS
##FACTOR=    0.0002496,     1,               1
##FIRST=     0,             0,               0
##LAST=      2.0444736,     0,               0
##MIN=       0,             -152971,         0
##MAX=       2.0444736,     221265,          0
$$ Real data points
##PAGE= N=1
##DATA TABLE= (X++(R..R)), XYDATA
$$ plain form
0 0 0 0 0 0 0 0 0 0 0 0 0 0 -8 8 -8 8 -8 16 -16 16 -24 24 -32 37 -41 48 -57 65 -77 88 -101 114 -130 149 -166
35 -166 189 -211 237 -262 294 -326 361 -401 443 -491 540 -596 657 -724 799 -880 967 -1069
53 -1069 1180 -1302 1445 -1604 1790 -2009 2266 -2577 2961 -3455 4105 -5007 6349 -8545 12768
68 12768 -23773 112115 221265 -79202 -94277 18128 77819 103241 48490 -62766 -26742
79 -26742 67453 122143 55896 -68695 -40760 92874 99636 58604 -12495 -88291 31659 179573
91 179573 56508 -78912 -27471 54458 94805 59096 -41968 -33187 54640 74589 41304 -16162
103 -16162 -43655 26058 76956 47350 -2906 -55565 -19664 93748 64304 -52103 -39174 24842
115 24842 39102 30268 -20761 -46543 14376 48117 9811 -28706 -35300 -927 28463 10923
$$ packed form
0@%%%%%%%%%%%%qJ6j6J6j6K4l2L2m0M8n6O9p8Q9j05J22j42J65j89K15k44K79l15
35a66L55m00M48m99N56o20O87p62Q44r34J031j136J253j381J523j679J847k036
53a069K249k482K747l049L394l799M275m843N538o416P560r112J1356j4894K1313
68A2768l6541J35888J09150l00467j5075J12405N9691K5422n4751j11256L6024
79b6742R4195N4690o6247j24591K7935J33634O762m1032p1099p5796J19950J47914
91A79573j23065j35420N1441Q1929M0347l5709j01064Q781Q7827J9949l3285n7466
103a6162k7493O9713N0898k9606n0256n2659L5901J13412k9444j16407J2929O4016
115B4842J4260q834n1029k5782O0919L3741l8306l8517o594L4373K9390j7540
$$ plain form
127 10923 -9938 -31983 -39547 19926 40927 -36414 -55535 5282 19766 -5630 -31712 -42571
139 -42571 -6319 23013 -4945 -36190 -37366 -15665 8964 -2170 -24703 -26589 -27961 -9781 14535
152 14535 -19118 -51648 -16262 13879 -748 -27339 -44453 -22464 16117 7366 -26289 -36319
164 -36319 -23996 -411 7586 -11231 -24085 -25279 -14631 12278 5235 -35018 -32160 4627 16463
177 16463 738 -28213 -37107 -2204 24907 8370 -18775 -30471 -15627 14786 19529 -3961
189 -3961 -25572 -23886 9838 32777 -389 -36589 -18557 19993 32777 5878 -34566 -28296 18700
202 18700 38689 14790 -22078 -32394 2876 39776 27216 -14473 -32320 -2822 42046 35199
214 35199 -18136 -37077 2896 45688 38572 -12464 -40976 -4612 44734 43948 -593 -34812 -15398
$$ packed form
127A0923k0861k2045p564N9473K1001p7341j9121O0817J4484k5396k6082j0859
139d2571L6252K9332k7958l1245j176K1701K4629j1134k2533j886j372J8180K4316
152A4535l3653l2530L5386L0141j4627k6591j7114K1989L8581q751l3655j0030
164c6319J2323K3585P997j8817j2854j194J0648K6909p043m0253K858L6787J1836
177A6463j5725k8951q894L4903K7111j6537k7145j1696J4844L0413M743k3490
189c961k1611J686L3724K2939l3166l6200J8032L8550J2784k6899m0444O270M6996
202A8700J9989k3899l6868j0316L5270L6900j2560m1689j7847K9498M4868o847
214C5199n3335j8941L9973M2792p116n1036k8512L6364M9346p86m4541l4219J9414
$$ plain form
227 -15398 36031 48798 6682 -31397 -16369 33816 50862 6944 -35589 -16245 36212 51924
239 51924 11079 -33309 -21719 29480 49990 16805 -23831 -21633 19534 43962 18124 -20962
251 -20962 -19423 19580 41949 16090 -23351 -21774 18858 41901 16501 -21859 -22266 12802 34237
264 34237 14857 -16899 -18003 10152 27257 9291 -18517 -17547 11722 27707 6257 -22823 -21143
277 -21143 9441 27356 6256 -23529 -20978 7121 20713 2097 -23556 -19396 9010 19544
289 19544 -3170 -28390 -22202 8888 22805 -1635 -31111 -26176 4652 20831 858 -29010
301 -29010 -26567 3689 17952 -1848 -29051 -26278 4556 20541 -979 -30273 -29206 630 21846
314 21846 5238 -26507 -30107 -3373 17406 7415 -20142 -27500 -3858 16225 6329 -17982 -25600
$$ packed form
227a5398N1429J2767m2116l8079J5028N0185J7046m3918m2533J9344N2457J5712
239E1924m0845m4388J1590N1199K0510l3185m0636K198M1167K4428k5838l9086
251b0962J539L9003K2369k5859l9441J577M0632K3043k5400l8360m07L5068K1435
264C4237j9380l1756j104K8155J7105j7966k7808R70K9269J5985k1450k9080J680
277b1143L0584J7915k1100k9785K551K8099J3592j8616k5653M160K8406J0534
289A9544k2714k5220O188L1090J3917k4440k9476M935L0828J6179j9973k9868
301b9010K443L0256J4263j9800k7203K773L0834J5985k1520k9294J067K9836K1216
314B1846j6608l1745l600K6734K0779r991k7557p358K3642K0083r896k4311p618
$$ plain form
327 -25600 -5507 17404 11149 -14514 -25196 -9566 13726 15597 -5987 -20868 -10854 8123
339 8123 13250 113 -14047 -9564 6057 11699 2329 -10248 -10284 3949 14053 7100 -6255 -11046
353 -11046 -2378 11354 13168 1449 -8328 -6052 4683 13106 7730 -4314 -6590 2818 12395 9932
367 9932 -2856 -8893 1220 14825 14197 -813 -12594 -4813 13985 19432 4376 -12180 -9402
380 -9402 9638 19962 7681 -10218 -9659 8012 19399 8478 -10916 -11760 7720 21462 10444
393 10444 -11098 -15385 3535 21556 14522 -8046 -15571 480 17925 13776 -6176 -14258 1069
406 1069 17011 11242 -7376 -13923 229 16936 12552 -6578 -14449 -1900 14148 12849 -4724
419 -4724 -12929 -916 12175 8065 -5991 -10944 1784 13398 5767 -9465 -10958 1802 12753
$$ packed form
327b5600K0093K2911o255k5663j0682J5630K3292J871k1584j4881J0014J8977
339H123N127j3137j4160M483J5621N642r370j2577l6J4233J0104o953j3355m791
353a1046Q668J3732J814j1719r777K276J0735Q423n376j2044k276R408R577k463
367I932j2788o037J0113J3605o28j5010j1781P781J8798N447j5056j6556K778
380i402J9040J0324j2281j7899N59J7671J1387j0921j9394q44J9480J3742j1018
393A0444k1542m287J8920J8021p034k2568p525J6051J7445m149j9952q082J5327
406A069J5942n769j8618o547J4152J6707m384j9130p871J2549J6048j299j7573
419d724q205J2013J3091m110j4056m953J2728J1614p631j5232j493J2760J0951
$$ plain form
432 12753 6925 -9208 -11799 1272 10750 4653 -9113 -11818 3229 13061 1466 -14096 -12802
445 -12802 4613 16127 2835 -17952 -15349 4696 14778 3387 -16004 -16775 3409 14618 2054
458 2054 -16260 -17555 2165 17713 3849 -19613 -20835 567 18788 8476 -19463 -23936 318
471 318 16569 6940 -14378 -21411 -2413 15778 6959 -13682 -19895 -4742 15419 11798 -12054
484 -12054 -21723 -6703 13698 15018 -7278 -21640 -6353 12381 10395 -3914 -14172 -6964 9677
497 9677 10980 -2800 -11029 -6610 6579 13454 2199 -9959 -7193 3845 12362 6800 -7109 -5428
511 -5428 5550 7050 3590 993 -1389 2513 6438 3976 2698 1782 -113 4113 7669 5280 1765
526 1765 -1408 917 8280 7601 2710 2162 -1075 166 9194 9239 576 -2998 55 7490 10395 58
$$ packed form
432A2753n828j6133k591J3071R478o097j3766k705J5047R832j1595j5562J294
445a2802J7415J1514j3292k0787K603K0045J0082j1391j9391p71K0184J1209j2564
458B054j8314j295J9720J5548j3864k3462j222K1402J8221j0312k7939m473K4254
471C18J6251r629k1318p033J8998J8191q819k0641o213J5153K0161l621k3852
484a2054r669J5020K0401J320k2296j4362J5287J8734j986j4309j0258P208J6641
497I677J303j3780q229M419J3189O875j1255j2158K766J1038Q517n562j3909J681
511e428J0978J500l460k597k382L902L925k462j278r16j895M226L556k389l515
526A765l173K325P363o79m891n48l237J241R028M5q663l574L053P435K905j0337
$$ plain form
542 58 -7054 994 10234 9481 -727 -8851 -1423 9827 8646 1468 -5719 -7349 4333 11917 2184
557 2184 -7926 -6435 2917 10171 2523 -11022 -7950 5407 9158 49 -11043 -8354 4091 6538
571 6538 -1032 -6355 -8009 -2147 5522 685 -8199 -6676 -191 3498 -303 -9538 -8696 2834 5451
586 5451 -3382 -10203 -6608 3105 3274 -6170 -7974 -1759 1184 624 -4845 -9046 -2341 5200 1766 -5956
602 -5956 -9829 -4323 6765 6156 -6756 -12310 -2426 9078 5940 -8854 -12851 1059 11055 4683
616 4683 -8155 -12939 -1304 12510 8542 -6788 -13294 -3848 11051 12396 -4451 -15281 -4585
629 -4585 13096 13232 -5006 -15992 -3426 14683 12687 -4094 -14325 -5274 12149 14339 -741
642 -741 -12628 -7077 8219 14996 2883 -11693 -7986 8318 14902 2610 -11574 -7461 8654
$$ packed form
542E8p112Q048R240p53j0208q124P428J1250j181p178p187j630J1682P584r733
557B184j0110J491R352P254p648j3545L072J3357L751r109j1092K689J2445K447
571F538p570n323j654N862P669m837q884J523O485L689l801r235Q42J1530K617
586E451q833o821L595R713J69r444j804O215K943n60n469m201O705P541l434p722
602e956l873N506J1088o09j2912n554R884J1504l138j4794l997J3910R996o372
616D683j2838m784J1635J3814l968j5330o506R446J4899J345j6847j0830J0696
629d585J7681J36j8238j0986J2566J8109j996j6781j0231R051J7423K190j5080
642g41j1887N551J5296O777j2113j4576L707J6304O584j2292j4184M113J6115
$$ plain form
655 8654 14053 2767 -8997 -6946 5268 11605 4798 -4775 -5895 1650 8954 6391 -2793 -5507
669 -5507 1639 8469 5165 -2912 -4278 2295 6781 4122 -1240 -1798 1307 2939 2337 2151 1229 117
685 117 70 1210 2544 2307 894 60 166 1010 2530 2096 -586 -1518 1054 4038 3216 -2600 -5100 1247
703 1247 6974 3555 -4207 -6180 -71 6459 3860 -3735 -5875 -1130 4556 4030 -2960 -6988 -1928
718 -1928 4606 4517 -2720 -9210 -4064 5768 5047 -3730 -8602 -4492 3286 3961 -3547 -7472 -3145 1463
734 1463 1501 -3114 -6991 -3421 1650 1263 -3119 -6880 -4430 2049 1721 -4481 -5868 -2316 789 -352
750 -352 -4928 -5316 546 1946 -2477 -5988 -4304 1157 3607 -2092 -6561 -3768 1466 3506 -854 -7256
766 -7256 -4007 4465 5337 -2039 -8050 -4739 6026 8787 -1739 -9538 -4480 6246 10034 452 -9389
$$ packed form
655H654N399j1286j1764K051J2214O337o807r573j120P545P304k563r184k714
669e507P146O830l304q077j366O573M486k659n362n58L105J632o02j86r22j112
685A17m7J140J334k37j413q34J06Q44J520m34k682r32K572K984q22n816k500O347
703A247N727l419p762j973O109O530k599p595k140M745N686n26o990m028N060
718a928O534q9p237o490N146R832p21q777m872M110P778O75p508l925M327M608
734A463L8m615l877L570N071l87m382l761K450O479l28o202j387L552L105j141
750c52m576l88N862J400m423l511J684N461K450n699m469K793N234K040m360o402
766g256L249Q472Q72p376o011L311J0765K761j0526p799N058J0726L788r582r841
$$ plain form
781 -9389 -4788 7007 10336 1785 -8750 -6344 7851 12962 2245 -9232 -7132 7012 15145 4548
795 4548 -9351 -7558 5961 14129 6407 -7705 -8096 5407 13433 6546 -6209 -8492 3940 14024
809 14024 7118 -5695 -8371 1849 12529 8726 -4669 -8189 1069 9855 8163 -2464 -7522 142
823 142 8493 6536 -1721 -6419 -1342 7291 6363 -1675 -5653 -1853 4269 5657 -482 -4651 -1540 2137
839 2137 2727 -39 -2951 -1456 1822 1181 -960 -1931 -1098 555 678 -1374 -1141 79 -620 -1458 -1376 -26
857 -26 1280 -674 -3844 -2431 938 1940 -183 -3684 -3490 703 2484 -247 -3825 -3439 587 3557
873 3557 -35 -5046 -4184 1023 4121 951 -4779 -4974 799 3686 1049 -3871 -4611 -69 3323 829
889 829 -3439 -3814 79 2972 1025 -3507 -4102 25 2678 797 -2661 -3389 -201 1742 -225 -2321
$$ packed form
781i389M601J1795L329q551j0535K406J4195N111j0717j1477K100J4144Q133j0597
795D548j3899J793J3519Q168p722j4112l91J3503Q026o887j2755k283J2432J0084
809A4024o906j2813k676J0220J0680l803j3395l520R258Q786j692j0627n058P664
823A42Q351j957q257m698N077Q633r28q038l978L800O122J388o139m169L111L677
839B137N90k766k912J495L278o41k141r71Q33J653J23k052K33J220o99q38Q2J350
857b6J306j954l170J413L369J002k123l501J94M193J781k731l578L86M026K970
873C557l592n011Q62N207L098l170n730j95N773K887k637m920p40M542L392k494
889H29m268l75L893K893j947m532n95M127K653j881l458p28L188J943j967k096
$$ plain form
905 -2321 -1727 377 713 -1487 -2451 -631 1407 486 -2212 -2779 -170 2092 556 -2977 -3098 897 3180
922 3180 50 -4469 -3719 2303 5229 461 -5781 -4878 2350 6390 1554 -6066 -5601 2457 7122 2443
938 2443 -6038 -6384 2679 8891 3256 -6512 -7696 2113 10388 5285 -6338 -8405 1513 10398 6879
953 6879 -5080 -8774 982 10697 7362 -3982 -9077 170 11162 8461 -3609 -9011 -1154 10432
967 10432 9836 -2379 -9130 -1675 9056 9846 -533 -8243 -2214 8546 8962 -168 -7069 -3111 7370
982 7370 9091 189 -6684 -3326 5290 8425 1228 -6122 -3162 4038 6094 1463 -4696 -3457 3268
997 3268 4798 256 -3949 -3093 1630 4222 -156 -4173 -2375 1012 2207 -351 -3255 -2003 1008
1012 1008 277 -1759 -2591 -1475 797 377 -3065 -3177 -849 468 -406 -3002 -3670 -331 1222 -1357
$$ packed form
905b321N94K104L36k200r64J820K038r21k698n67K609K262j536l533j21L995K283
922C180l130m519P50O022K926m768o242R03P228M040m836p620M65Q058M665m679
938B443q481l46R063O212n635r768j184R809Q275n103j1623k067R918Q885l519
953F879j1959l694R756R715l335j1344n095R247J0992k701j2070n402P857J1586
967A0432n96j2215o751P455J0731P90j0379p710O029J0760M16r130o901L958J0481
982G370J721q902o873L358Q616L135p197p350K960P200K056m631o159J239O725
997C268J530m542m205Q56M723K592m378m017J798L387J195k558k904J252L011
1012A008p31k036q32J116K272m20l442j12K328J317q74k596o68L339J553k579
$$ plain form
1028 -1357 -3805 -3302 100 1742 -1535 -5114 -2900 437 1626 -415 -4201 -3629 553 1805 -245
1043 -245 -2865 -3473 81 2792 -259 -3603 -2835 485 2757 803 -2897 -2582 402 2132 1324 -908
1059 -908 -2188 120 1688 748 354 -204 -597 952 1287 216 150 285 328 1258 1340 1123 488 -779 -176
1078 -176 2463 3123 629 -1720 -1316 2407 4892 1324 -2791 -1871 2254 4986 2336 -3141 -3105 2116
1094 2116 5691 3173 -3260 -5177 1234 7272 4269 -3612 -6443 192 7738 5354 -3798 -6990 -359
1109 -359 7190 5658 -3220 -7630 -1402 6911 6348 -2424 -8470 -3006 6864 7545 -1759 -8825 -4309 6201
1125 6201 8104 -1433 -8571 -4170 5580 7551 -602 -8159 -4671 4543 7507 95 -7517 -5631 3703
1140 3703 7691 1092 -6955 -5650 3144 7048 1074 -6349 -4793 2675 5879 615 -5467 -4513 2025
$$ packed form
1028a357k448N03L402J642l277l579K214L337J189k041l786N72M182J252k050
1043b45k620o08L554K711l051l344P68L320K272j954l700L15K984J730q08k232
1059i08j280K308J568r40l94n58l93J549L35j071o6J35M3R30Q2k17o35j267O03
1078a76K639O60k494k349M04L723K485l568m115R20M125K732k650n477L6N221
1094B116L575k518o433j917O411O038l003p881k831O635P546k384r152l192O631
1109c59P549j532q878m410O228Q313n63q772o046N464R870O81r304p066M516J0510
1125F201J903r537p138M401R750J971q153p557L488R214K964p412p612J886R334
1140C703L988o599q047J305Q794L904n974p423J556P468L204n264o082R54O538
$$ plain form
1155 2025 5174 1078 -4830 -4214 1398 4493 931 -4175 -3705 1596 3816 87 -4293 -2823 2029
1170 2029 3548 -856 -4455 -2025 2493 2958 -1052 -3957 -2129 2343 2406 -1338 -3976 -1771 2672 3046
1186 3046 -1763 -5050 -1598 3441 3364 -1934 -5397 -1555 3745 3438 -1774 -4641 -1573 3488 3402 -1413
1202 -1413 -4302 -1815 3094 4115 -725 -4930 -2364 3201 4694 -16 -4509 -2811 3062 4383 563
1217 563 -3200 -2252 2141 4029 1026 -2291 -2163 1201 3821 2362 -1485 -2668 385 3340 3032 -275
1233 -275 -2298 -408 2542 2666 810 -1093 -1025 1306 2678 1752 -21 -1628 -218 2827 2830 150 -2331
1250 -2331 -1450 2090 4028 813 -2703 -2213 960 3983 2369 -2273 -3756 38 3843 3112 -2161 -4916
1266 -4916 -719 4455 3560 -2067 -5582 -2105 4233 4496 -1852 -5914 -2955 3227 4936 -898 -6267
$$ packed form
1155B025L149m096n908O16N612L095l562n106M70N301K220l729m380J470M852
1170B029J519m404l599K430M518M65m010k905J828M472O3l744k638K205M443L74
1186C046m809l287L452N039p7n298l463L842N300l07n212k867L068N061q6m815
1202a413k889K487M909J021m840m205K566N565J493m710m493J698N873J321l820
1217E63l763R48M393J888l003l317J28L364K620j459l847j183L053K955l08l307
1233b75k023J890K950J24j856j903O8K331J372r26j773j607J410L045Lk680k481
1250b331Q81L540J938l215l516M90L173L023j614m642j483L794L805p31n273k755
1266d916M197N174q95n627l515L477O338K63o348m062K959O182J709n834n369
$$ plain form
1281 -6267 -3774 2859 4917 -308 -6331 -4622 2465 5178 -182 -6008 -5015 1967 5361 226 -5752
1296 -5752 -4774 1313 4743 1064 -5357 -4851 1314 4574 882 -4928 -4705 1082 4694 901 -4411 -4001
1312 -4001 1176 4631 1152 -3878 -3590 1499 3919 881 -3492 -2970 2042 4138 458 -3592 -2454
1327 -2454 2204 4480 410 -3934 -2094 2832 4335 319 -3823 -1923 3297 4520 -223 -4144 -1978
1342 -1978 3672 5206 -229 -4665 -2328 3949 5323 29 -5146 -2555 3951 5355 73 -5291 -2858
1357 -2858 3863 5866 322 -5597 -3578 3552 6332 967 -5444 -4095 2847 6108 1062 -4957 -4437
1372 -4437 2214 5690 1570 -4437 -4376 1256 5517 2240 -3979 -4790 599 4956 2843 -2984 -4554 -359
1388 -359 4115 2872 -2117 -4215 -965 3289 2787 -1253 -3626 -1100 2349 2949 -282 -2894 -2012 1532
$$ packed form
1281f267K493O633K058n225o023J709P087K713n360n826R93O982L394n135n978
1296e752R78O087L430l679o421N06O165L260l692n810K23N787L612l793n312M10
1312d001N177L455l479n030K88N089K420l038m373N22N012K096l680m050J138
1327b454M658K276m070m344J840M926J503m016m142J900N220J223m743l921K166
1342a978N650J534n435m436K337O277J374n294n175K591O506J404n282n364K433
1357b858O721K003n544n919K019P130K780n365o411J349O942L261n046o019N20
1372d437O651L476m120o007O1N632M261l277o219q11N389M357k113n827j570M195
1388c59M474j243m989k098L250M254n02m040k373K526L449O00l231k612Q82L544
$$ plain form
1404 1532 2667 833 -1895 -2047 614 2232 1161 -719 -1491 -140 1517 1603 5 -1185 -820 693
1420 693 2060 977 -1133 -1750 -68 2139 1919 -630 -2051 -733 1698 2305 166 -2182 -1650 1478
1436 1478 2625 302 -2332 -2154 1283 3152 578 -2699 -2487 872 3168 1135 -2667 -2841 316 2506
1452 2506 1152 -2276 -2985 2 2444 1017 -2055 -3082 -116 2525 1017 -2362 -2891 -239 2302
1467 2302 994 -2440 -2638 145 1736 445 -1990 -2389 339 2233 103 -2573 -2160 554 2386 183
1483 183 -2917 -2096 1312 2522 -56 -3037 -2031 2000 2952 -330 -3289 -1921 2350 3754 -391 -4203
1499 -4203 -1978 2699 4040 179 -4246 -2625 3131 4694 215 -4324 -2989 3077 5461 426 -4632
1514 -4632 -3169 2974 5934 1248 -4821 -3753 2567 5892 1795 -4534 -4485 2317 6161 2115 -4186
$$ packed form
1404A532J135j834k728j52K661J618j071j880p72J351J657Q6j598j190L65J513
1420F93J367j083k110o17J682K207k20k549j421J318K431O07k139k348N32L128
1436A478J147k323k634J78L437J869k574l277K12L359K296k033l802j74L157K190
1452B506j354l428p09K987K442j427l072j027K966K641j508l379n29K652K541
1467B302j308l434j98K783J591j291k435l99K728J894k130k676M13K714J832k203
1483A83l100Q21L408J210k578k981J006M031R52l282k959J368M271J404m145l812
1499d203K225M677J341l861m425J621N756J563m479m539J335O066K384n035n058
1514d632J463O143K960m686o069J068O320L325m097o329M9O802L844m046o301
$$ plain form
1529 -4186 -4847 1630 6324 2660 -4046 -4807 1072 5687 3410 -3378 -5091 507 5196 3306 -2684
1544 -2684 -4866 -499 4709 3442 -2113 -4356 -809 4146 3397 -1611 -3991 -1064 3055 3318 -863
1559 -863 -3426 -1332 2291 2522 -324 -2736 -1553 1910 2329 -104 -1892 -1201 1058 2025 119 -1574
1575 -1574 -792 755 1060 526 -728 -528 300 526 258 -34 -150 0 265 -258 144 564 55 -447 -114
1594 -114 665 934 43 -938 -361 748 965 -86 -994 -879 652 1140 389 -1105 -1065 486 1355 267
1612 267 -1284 -993 271 1151 251 -1185 -1290 162 983 -67 -1206 -1158 -86 674 -67 -979 -779 -84
1630 -84 107 -527 -793 -410 206 28 -746 -936 -267 302 -260 -1230 -1070 334 895 -381 -1693 -1165 773
1649 773 1385 -314 -2260 -1454 1029 1877 -274 -2605 -1685 1291 2702 -29 -2969 -2074 1705 3375
$$ packed form
1529d186o61O477M694l664o706p61N879M615k277o788j713N598M689j890n990
1544b684k182M367N208j267n555k243L547M955p49n008k380K927M119K63m181
1559h63k563K094L623K31k846k412J183L463M19k433j788O91K259R67j906j693
1575a574P82J547L05n34j254K00Q28K26k68k92j16J50K65n23M02M20n09n02L33
1594a14P79K69q91r81N77J109K17j051r08J15J531M88p51j494M0J551Q69j088
1612B67j551K91J264Q80r00j436j05J452Q21j050j139M8J072P60p41r12K00O95
1630h4J91o34k66L83O16j78p74j90O69N69n62r70J60J404N61j276j312N28J938
1649G73O12j699j946Q06K483Q48k151k331R20K976J411k731k940Q95L779J670
$$ plain form
1665 3375 425 -3144 -2453 1918 4001 948 -3238 -2921 1700 4305 1787 -3029 -3314 1345 4749 2289
1681 2289 -2854 -3649 1067 5004 2750 -2586 -4079 681 4903 3219 -2298 -4275 192 4837 3477
1696 3477 -1758 -3946 -581 4354 3707 -1509 -4096 -766 3938 3729 -1052 -3963 -1052 3411 3563 -626
1712 -626 -3675 -1309 2732 2980 -357 -3070 -1515 1978 2846 -351 -2878 -1431 1555 2437 -239 -2595
1728 -2595 -1398 1051 1637 -499 -1986 -1056 1012 1145 -654 -1551 -866 637 767 -866 -1494 -440 757
1745 757 449 -839 -1394 -170 958 253 -1212 -1174 240 1156 -58 -1688 -1187 791 1412 -72 -1557
1762 -1557 -1280 669 1554 -11 -1335 -1249 770 1521 146 -1503 -1138 600 1666 545 -1428 -1502 750
1779 750 1583 568 -1150 -1241 529 1377 767 -747 -750 155 1213 666 -536 -900 96 641 599 -136 -563
$$ packed form
1665C375k950l569O91M371K083l053m186L17M621K605k518m816k85M659L404k460
1681B289n143p95M716L937k254n336j493M760M222j684n517j977M467M645j360
1696C477n235k188L365M935o47n216k587L330M704k09m781k911K911M463J52m189
1712f26l049K366M041K48l337k713J555L493Q68l197k527J447K986Q82k676k356
1728b595J197K449N86k136j487R30K068J33j799q97O85J503J30j633o28J054J197
1745G57l08j288n55J224J128p05j465L8J414R16j214j630N01J978O21j484j485
1762a557K77J949Q85j565j324Q6K019P51j375j649L65J738J066j121j973p4K252
1779G50Q33j015j718r1J770Q48o10j514lR05J058n47j202l64R96N45m2p35m27
$$ plain form
1798 -563 -98 361 528 151 -123 -281 -269 276 456 416 -249 -646 -270 788 939 -143 -1066 -886 535 1264
1818 1264 157 -1531 -1461 662 1879 582 -1817 -2164 345 2277 987 -1876 -2605 99 2691 1553
1834 1553 -1691 -2932 -342 2853 2083 -1652 -3274 -544 2805 2482 -1234 -3568 -931 2953 3037 -907
1850 -907 -3443 -1182 2737 3097 -661 -3361 -1441 2380 3374 -173 -3055 -1586 2186 3363 233 -3011
1866 -3011 -1939 1952 3330 161 -2703 -1683 1607 2975 443 -2376 -1608 1336 2834 465 -2253
1881 -2253 -1585 977 2134 519 -1835 -1550 905 1738 247 -1550 -1151 681 1462 -65 -1679 -877
1897 -877 904 1159 -208 -1517 -865 760 898 -613 -1390 -513 1006 536 -797 -1524 -233 1262 554
1914 554 -1032 -1859 -336 1458 802 -1043 -1707 -287 1456 985 -1087 -2018 -298 1584 933 -1143 -2079
$$ packed form
1798e63M65M59J67l77k74j58J2N45J80m0o65l97L76J058J51j082r23J80J421P29
1818A264j107j688P0K123J217j297k399l47K509J932j290k863p29K704K592j138
1834A553l244j241K590L195p70l735j622K730L349l23l716k334K637L884Q4l944
1850i07k536K261L919L60l758k700J920L821R94l547k882J469L772J177l130l244
1866c011J072L891J378l169k864J020L290J368k532k819P68K944J498k369k718
1881b253O68K562J157j615k354K85K455Q33j491j797L99J832P81j527j614Q02
1897h77J781K55j367j309O52J625J38j511p77Q77J519m70j333p27J291J495p08
1914E54j586q27J523J794o56j845o64J420J743m71k072r31J720J882o51k076r36
$$ plain form
1931 -2079 -363 1888 1192 -855 -2006 -275 1761 1402 -685 -1791 -245 1392 1483 -426 -1624 -457
1947 -457 1320 1556 -145 -1290 -747 1115 1317 235 -904 -591 615 1334 503 -465 -221 346 844 842
1965 842 110 -214 39 611 715 226 -167 -316 65 588 779 293 -560 -586 343 1109 595 -585 -1269 216
1985 216 1283 654 -729 -1703 -221 1614 1390 -715 -1947 -597 1536 1755 -635 -2343 -971 1465
2001 1465 2170 -247 -2391 -1405 1665 2247 60 -2434 -2020 1107 2528 307 -2488 -2123 973 2572
2017 2572 597 -2459 -2176 775 2588 968 -2154 -2489 723 2592 1067 -1797 -2125 440 2572 1257
2033 1257 -1645 -1944 261 2213 1014 -1219 -1921 105 1974 881 -1162 -1729 469 1795 783 -1061
2049 -1061 -1225 365 1601 677 -1107 -1241 478 1290 539 -1095 -993 488 1489 43 -1168 -812 908
$$ packed form
1931b079J716K251o96k047j151J731K036l59k087j106J546J637R1j909j198J167
1947d57J777K36j701j145N43J862K02j082j139L13J206P19q31r68K44N67M98k
1965H42p32l24K53N72J04m89l93j49L81N23J91m86q53k6R29P66n14j180o84J485
1985B16J067o29j383r74J482J835k24k105j232J350K133K19k390j708J372K436
2001A465P05k417k144R86L070N82k187k494M14L127J421k221k795L65L096J599
2017B572j975l056K83K951J813j620l122l35L212J869j525k864l28K565K132j315
2033A257k902k99K205J952j199k233p02K026J869j093k043n67K198J326j012j844
2049a061j64J590J236r24j784j34J719Q12p51j634J02J481J001j446j211L56J720
$$ plain form
2066 908 1096 -192 -1815 -1104 744 1563 -263 -1576 -813 792 1344 -526 -1865 -1173 1326 1543 -3
2083 -3 -1715 -989 1484 1925 205 -2077 -1024 1408 1449 -160 -2380 -1353 1043 1738 -116 -2149 -922
2100 -922 318 2012 219 -1816 -1700 991 1801 403 -1418 -1378 321 1598 610 -831 -1543 -136 1529
2117 1529 779 -728 -1091 373 1226 733 -268 -806 -226 874 852 490 -590 -149 1116 1044 772 -210
2135 -210 -625 2 1052 687 144 -347 39 739 316 -68 -577 -529 38 981 1303 -93 -706 -556 1087
2154 1087 1238 252 -1148 -866 886 1743 276 -1431 -708 955 1389 1036 -1289 -1162 195 1437 551
2171 551 -1088 -1640 373 1925 431 -1171 -2333 150 2079 1156 -1315 -2276 -117 1868 1330 -1114
2187 -1114 -2126 -695 1520 866 -1001 -2129 -537 1541 1159 -908 -1706 -215 1358 980 -738 -1467
$$ packed form
2066I08J88j288j623P11J848Q19j826j313P63J605N52j870j339O92K499K17j546
2083cj712P26K473M41j720k282J053K432M1j609k220J027K396O95j854k033J227
2100i22J240J694j793k035J16K691Q10j398j821M0J699J277r88j441p12J407J665
2117A529p50j507l63J464Q53m93j001n38N80J100k2l62j080M41J265p2k72r82
2135b10m15O27J050l65n43m91L86P00m23l84n09M8N67R43L22j396o13J50J643
2154A087J51r86j400K82J752Q57j467j707P23J663M34l53k325J27J357J242q86
2171E51j639n52K013J552j494j602j162K483J929r23k471r61K159J985n38k444
2187a114j012J431K215o54j867j128J592K078l82k067p98J491J573l78j718p29
$$ plain form
2203 -1467 -205 988 794 -1025 -1582 -353 1228 757 -785 -1306 103 1161 740 -1009 -1345 140
2219 140 1211 507 -1087 -1196 358 1579 470 -1051 -1084 604 1659 330 -1565 -1219 737 1788
2235 1788 491 -1633 -1404 836 2060 529 -1632 -1597 650 2109 554 -1818 -1853 615 2173 673
2251 673 -1703 -1875 468 1962 874 -1683 -2116 338 2176 1035 -1556 -2249 -89 2066 1335 -1227
2267 -1227 -2077 -269 1847 1420 -1019 -2180 -537 1603 1411 -665 -2071 -897 1232 1427 -208 -1662
2283 -1662 -823 798 1591 116 -1421 -788 690 1386 303 -909 -866 287 1066 408 -584 -601 236 1003
2301 1003 658 -159 -523 -37 661 758 228 -391 -291 327 687 539 18 -273 -77 664 880 333 -439 -288
2321 -288 508 1064 508 -409 -711 288 1045 769 -439 -771 25 1034 796 -305 -1087 -185 1092 1022 -355
$$ packed form
2203a467J262J193j94j819n57J229J581m71j542n21J409J058m21j749l36J485
2219A40J071p04j594j09J554J221j109j521l3J688J055j329j895L46J956J051
2235A788j297k124K29K240J224j531k161L5K247J459j555k372l5K468J558j500
2251F73k376j72K343J494j088k557m33K454J838j141k591o93K160K155p31k562
2267a227q50J808K116m27k439j161J643K140j92k076j406J174K129J95j635j454
2283a662Q39J621P93j475j537O33J478O96j083j212M3J153P79o58r92j7Q37P67
2301A003l45q17l64M86O98R7n30o19J00O18L60j48n21k91J96P41K16n47p72J51
2321b88P96N56n56r17l02R99P57k76j208l32P96J009k38j101p82R02J277p0j377
$$ plain form
2340 -355 -1004 -271 781 922 -310 -1212 -408 744 952 -305 -1098 -479 710 830 -202 -1182 -402 639
2358 639 591 -305 -1198 -480 571 528 -449 -1100 -467 551 402 -551 -1040 -186 690 336 -874 -1142 23
2377 23 902 363 -891 -1145 59 1040 359 -1018 -1298 238 1174 364 -1271 -1372 296 1452 551 -1427
2395 -1427 -1706 385 1750 685 -1467 -1637 213 2009 954 -1453 -1992 167 2089 1005 -1444 -2132
2411 -2132 146 1991 1319 -1282 -2256 -128 2123 1501 -1029 -2117 -496 1967 1726 -827 -2289 -633
2427 -633 1835 1725 -602 -2342 -589 1517 1950 -320 -2109 -860 1457 1784 -84 -1744 -1065 1238
2443 1238 1680 100 -1686 -1250 952 1618 131 -1328 -831 643 1497 354 -1033 -844 364 1041 696
2460 696 -674 -710 307 933 392 -525 -595 86 587 426 4 -131 174 584 216 -3 196 329 352 270 188
$$ packed form
2340c55o49P33J052J41j232r02Q04J152K08j257p93O19J189J20j032r80P80J041
2358F39m8q96q93P18J051m3r77o51O33J018j49r53m89Q54Q76l54j210k68J165
2377B3Q79n39j254k54J204R81o81j377k80J536R36q10j635j01J668J156r01j978
2395a427k79K091J365j065k152j70J850J796j055k407n39K159J922j084k449o88
2411b132K278J845o72k601r74K128K251o22k530j088J621K463k41k553j462J656
2427f33K468j10k327j740J753K106M33k270j789J249K317L27j868j660O79K303
2443A238M42j580j786M36K202O66j487j459M97J474Q54j143j387J89J208O77l45
2460F96j370l6J017O26n41r17p0O81N01j61m22j35L05M10l68k19J99J33K3q2q2
$$ plain form
2481 188 282 207 155 -17 137 600 273 99 93 126 482 430 -28 -154 175 466 586 87 -239 125 523 676
2503 676 -170 -332 -99 305 408 -128 -552 -171 438 235 -152 -393 -93 99 285 -235 -334 -259 0 -123 -393
2524 -393 -234 -166 -147 -235 -415 -259 21 -123 -515 -436 -209 385 36 -588 -826 77 641 -19 -848 -991 -17
2545 -17 626 169 -975 -1191 140 964 381 -1044 -1365 -125 1063 458 -1022 -1450 -28 1285 707 -1061
2563 -1061 -1653 -40 1499 1101 -811 -1718 -150 1404 1281 -713 -1912 -531 1514 1495 -419 -1814
2579 -1814 -503 1688 1748 -374 -1842 -740 1471 1702 19 -1767 -917 1131 1963 246 -1669 -810
2595 -810 1015 1859 389 -1663 -933 786 1725 417 -1487 -1107 763 1490 562 -1286 -1017 523 1289
2612 1289 532 -1047 -949 327 1149 502 -779 -878 219 1035 249 -723 -660 288 900 136 -602 -606 286 682
$$ packed form
2481A88R4p5n2j72J54M63l27j74oL3L56n2m58j26L29K91J20m99l26L64L98J53
2503F76q46j62K33M04J03n36m24L81O09k03l87k41L00J92J86n20r9P5K59j23k70
2524c93J59O8J9q8j80J56K80j44l92P9K27N94l49o24k38R03N64o60q29j43R74
2545a7O43m57j144k16J331Q24n83j425l21J240J188o05j480m28J422J313n78j768
2563a061n92J613J539l98j912r07J568J554j23j994j199J381K045j9j914j395
2579a814J311K191O0k122j468J102K211K31j683j786Q50K048Q32j717j915Q59
2595h10J825Q44j470k052P30J719R39j308j904L80J870P27r28j848K69J540P66
2612A289p57j579R8J276Q22o47j281r9J097Q16p86r72O3R48O12p64p38mQ92L96
$$ plain form
2632 682 5 -425 -337 290 655 -72 -376 -228 285 541 -211 -650 -233 530 580 -320 -785 4 570 383 -235
2653 -235 -817 -63 678 475 -330 -739 -54 604 608 -371 -627 -79 630 699 -67 -684 26 709 734 -21 -621
2674 -621 -261 383 652 -42 -520 -246 316 590 30 -399 -446 83 348 17 -173 -244 -77 294 233 -50 -237
2695 -237 -260 72 195 106 -166 -455 -254 182 243 37 -420 -529 46 473 4 -566 -824 -67 741 141 -576
2716 -576 -1051 -81 700 749 -581 -1202 -270 676 894 -508 -1129 -546 703 1072 -351 -1454 -664 786
2734 786 1151 -72 -1234 -798 705 1272 -104 -1320 -855 757 1153 131 -1279 -1104 622 1497 362
2751 362 -1093 -946 465 1369 499 -999 -1060 424 1335 604 -932 -1092 224 1401 596 -781 -1005 176
2769 176 1147 800 -772 -1012 205 976 536 -470 -832 284 955 502 -453 -726 38 851 368 -699
$$ packed form
2632F82o77m30Q8O27L65p27l04J48N13K56p52m39M17P63N0r00m65P89N66j87o18
2653b35n82P54P41k03q05m09O85O58Mr79k56N48P09O9p66o17P10O83K5p55o00
2674f21L60O44K69o94m78K74N62K74n60m29m7N29K65l31j90p1J67L71o1k83j87
2695b37k3L32J23q9k72k89K01M36O1k06m57j09N75M27m69n70k58P57Q08o00p17
2716e76m75R70P81M9j330o21R32R46K18j402o21N83J249L69j423j103P90J450
2734G86L65j223j162M36J503N67j376j216M65J612L96j022j410J75J726Q75j135
2751C62j455J47J411R04q70j498o1J484R11p31j536j60J316J177q05j377k24J181
2769A76R71l47j572k40J217P71m40j006l62J116O71m53r55k73P64Q13m83j067
$$ plain form
2787 -699 -613 331 810 247 -531 -287 197 602 -106 -451 -325 508 587 -90 -833 -454 561 704 -190 -766
2807 -766 -352 611 610 0 -863 -371 639 849 -186 -795 -254 724 822 -66 -990 -347 692 898 73 -754
2827 -754 -558 530 924 69 -784 -569 378 904 97 -638 -540 363 830 229 -706 -478 261 779 512 -297
2847 -297 -725 211 553 462 -120 -463 -15 548 437 -146 -448 -108 265 403 -3 -274 -124 -34 405 236 3
2868 3 -223 -188 256 222 -142 -387 -434 -175 193 254 -242 -428 -157 447 338 -146 -773 -434 302 649 -198 -811
2890 -811 -737 80 704 -30 -716 -951 162 572 272 -707 -860 44 880 229 -725 -1043 -67 816 459 -700
2910 -700 -880 -72 727 511 -541 -889 -121 792 637 -476 -772 -94 786 633 -286 -620 -61 695 653 -4
2930 -4 -753 -156 759 520 -318 -479 -133 689 561 -35 -436 -49 602 448 -200 -447 356 540 377 -156 -447
$$ packed form
2787f99Q6R44M79n63p78K44M84M05p08l45J26Q33P9o77p43L79J015J43q94n76
2807g66M14R63jo10q63M92J010K10j035o09N41R78R8q88r24O43J039K06q25q27
2827g54J96J088L94q55q53K15R47N26q07p35R8R03M67o01r35K28P39N18k67q09
2847b97m28R36L42r1n82l43M48N63j11n83l02L40L73J38m06k71J50R0M39j69k33
2868Ck26L5M44l4l64k45m7K59L68O1m96j86K71O04j09m84o27L39P36L47q47o13
2890h11P4Q17O24p34o86k35J113M10l00r79j53R04Q36o51r54l18R76Q83l57j159
2910g00j80Q08P99k16j052l48P68R13j55j113k96O78Q80j53r19l34N59P56m2o57
2930dp49N97R15k39q38j61L46Q22j28n96m01L87O51j54o48k47Q03J84j63n33k91
$$ plain form
2951 -447 194 854 330 -406 -393 316 569 68 -392 -468 446 782 145 -601 -539 455 865 104 -841 -600 500
2972 500 789 -5 -835 -621 464 945 247 -936 -754 264 773 145 -714 -1139 109 900 325 -837
2990 -837 -807 114 923 599 -682 -948 72 756 483 -471 -826 -155 772 504 -524 -808 -193 506 542 -270
3010 -270 -574 -136 356 685 -111 -502 -248 403 666 -28 -391 -269 159 385 -39 -210 -20 217 305 328 -35
3031 -35 54 39 259 225 209 -61 -206 -7 198 358 220 -93 0 164 252 227 -331 -291 -48 203 272 -82 -616
3054 -616 -222 439 250 -78 -581 -260 468 338 -243 -742 -228 268 444 -176 -672 -308 215 448 -21 -732
3074 -732 -502 252 757 -59 -591 -434 290 243 -71 -617 -382 178 470 24 -620 -550 95 360 -32 -493 -516
3095 -516 182 250 -35 -444 -315 15 447 5 -277 -131 365 265 -199 -326 46 376 249 -184 -460 43
$$ packed form
2951d47O41O60n24p36J3P09K53n01m60p6R14L36o37p46O2R94M10p61r45K41J100
2972E00K89p94q30K14J085M81o98j183J82J018N09o28q59m25J248P91n75j162
2990h37L0R21Q09l24j281k66J020O84k73r54l55O71R27k68j028k84O15O99L6q12
3010b70l04M38M92L29p96l91K54O51K63o94l63J22M28K26m24j71J90K37Q8K3l63
3031c5Q9j5K20l4j6k70j45J99K05J60j38l13R3J64Q8k5n58M0K43K51O9l54n34
3054f16L94O61j89l28n03L21P28j30n81m99N14M96J76o20m96L64N23K33m69p11
3074g32K30P54N05q16n32J57P24m7l14n46K35N60K92m46o44P0O45K65l92m61k3
3095e16O98O8k85m09J29L30M32m42k82J46M96j00m64j27L72L30j27m33k76N03
$$ plain form
3115 43 347 299 -198 -497 -151 637 294 -296 -468 -55 705 298 -531 -438 143 801 385 -580 -610 100 651
3136 651 333 -524 -696 -82 929 593 -494 -707 24 871 529 -369 -879 -280 677 592 -449 -858 -325
3155 -325 690 671 -260 -792 -85 800 659 -137 -880 -554 554 655 -16 -715 -366 434 718 5 -492 -334
3175 -334 225 600 -90 -409 -462 225 631 139 -419 -332 131 331 225 -186 -237 189 386 324 29 -42 -6 74
3197 74 115 -60 -61 -108 -68 61 15 127 25 17 -90 344 206 46 -235 -66 252 409 61 -102 -216 79 498
3220 498 137 -284 -365 170 275 221 -341 -364 37 449 335 -376 -654 53 313 262 -322 -500 -35 331 42
3241 42 -117 -452 -269 548 92 -273 -539 -142 477 76 -216 -382 -132 200 125 -205 -393 -97 213 -114 -264
3262 -264 -182 115 118 -135 -181 -283 97 126 -77 -437 -67 128 279 -150 -283 -285 267 444 -257 -592 -96 517
$$ packed form
3115D3L04m8m97k99L46P88l43n90j72M13P60m07q29R3N81O58m16r65l0P10N51
3136F51l18q57j72O14J011l36j087k13P31Q47l42q98n10N99R57q5j041m09N33
3155c25J015j9r31n32P07Q85j41p96p43L26J108J01o71o99L49Q00K84p13m97J58
3175c34N59L75o90l19n3O87M06m92n58Q7M63K00j06m11n1M26J97o2k95p1L6Q0
3197G4M1j75jm7M0J29m6J12j02qj07M34j38j60k81J69L18J57l48j63j14K95M19
3220D98l61m21q1N35J05n4n62k3M01M12j14p11k78P07K60n1n84j78M65L66k89
3241D2j59l35J83Q17m56l65k66L97O19m01k92j66K50L32p5l30j88K96L10l27j50
3262b64Q2K97Lk53m6j02L80K9k03l60L70J95J51m29j33kN52J77p01l35M96O13
$$ plain form
3284 517 417 -152 -496 -165 263 772 -211 -774 -67 586 606 -140 -783 -309 691 770 -115 -819 -258 750
3304 750 808 81 -590 -221 612 701 -53 -881 -447 492 769 218 -799 -593 383 827 345 -683 -562 291
3324 291 717 229 -653 -608 117 736 177 -605 -598 78 768 371 -395 -690 87 588 359 -388 -511 -65 593
3345 593 480 -371 -497 -132 275 300 -91 -217 -143 249 230 -181 -316 -129 198 -124 -219 11 126 -5 65 171
3367 171 -47 73 58 -180 129 168 149 -52 -232 23 111 205 185 -146 59 305 207 -6 -238 -127 288 259 33
3390 33 -446 -72 297 302 -116 -200 -11 121 186 -14 -169 -141 256 274 -18 -115 -105 115 267 100 -185 -230 79
3413 79 144 -137 -157 88 80 256 -71 -159 55 46 -159 -100 -145 112 200 -98 -172 -69 76 148 -118 -473 -70 224
3437 224 220 -120 -392 -156 185 292 -172 -492 -239 358 451 -178 -381 -199 302 484 -146 -677 -370 285 686
$$ packed form
3284E17j00n69l44L31M28N09r83n63P07O53K0p46o43M74J000P9q85p04N61J008
3304G50N8p27o71L69Q33Q9p54q28M34R39K77n51j017K06R76M44m82j028J21Q53
3324B91M26m88q82M5P25O19n59p82PO76O90l97p66k95P77N01k29p47j23M46O58
3345E93j13q51j26L65M07K5l91j26P4L92j9m11j35J87L27l22r5K30J15j31P0J06
3367A71k18J20j5k38L09L9j9k01j80K55Q8R4k0l31K05K46r8k13k32J11M15k9k26
3390C3m79L74L69Nm18q4J89J32O5k00j55K8L97J8k92r7J0K20J52j67k85m5L09
3413G9O5k81k0K45qJ76l27q8K14rk05N9m5K57Q8k98p4J03J45P2k66l55M03K94
3437B24ml40k72K36L41J07m64l20K53N97R3o29k03J82N01J82o30n31L07O55M01
$$ plain form
3458 686 39 -619 -495 413 722 62 -664 -397 363 785 75 -746 -590 384 731 211 -506 -714 279 913
3478 913 299 -466 -609 272 806 357 -354 -726 181 680 459 -452 -753 91 691 606 -267 -788 -10 576
3498 576 650 -335 -513 26 602 242 -160 -491 -78 337 423 -9 -543 -9 242 230 -337 -400 -172 242 229 -234
3520 -234 -419 24 169 139 -172 -354 58 227 147 -181 -216 -113 103 -135 -290 -189 33 106 132 -279 -177 238
3542 238 221 33 -274 -163 105 197 -235 -315 -197 229 128 -200 -47 -34 252 367 -14 -214 -232 93 204 180
3564 180 -216 62 110 191 322 -103 -231 33 62 47 -106 -210 83 120 125 -107 -44 -209 107 65 4 -119 -76 -34
3588 -34 9 167 -35 -180 -52 8 190 82 -93 -185 -123 -27 138 -168 -191 -247 336 362 -47 -488 -274 204 419
3611 419 -155 -402 -237 72 597 -181 -425 -485 200 689 116 -506 -501 241 695 171 -603 -462 165 674 249
$$ packed form
3458F86o47o58J24R08L09o60p26K67P60M22p10q21J56R74L47n20p17k08R93O34
3478I13o14p65j43Q81N34m49p11l72R07M99k21r11l01Q44O00q5q73n21P78N86
3498E76P4r85j78N39N76l60m02l31M13M15Q6m32n34N34K51j2n67o3K28M14j3m63
3520b34j85M43J45l0l11j82M12J69q0l28l5J03K16k38j55J01K22P3K6m11J02M15
3542B38j7j88l07J11K68R2m32q0J18M26j01l28J53J3K86J15l81k00j8L25J11k4
3564A80l96K78M8Q1J31m25j28K64K9j5j53j04K93L7Nk32O3j65L16m2o1j23M3M2
3588c4M3J58k02j45J28O0J82j08j75r2O2R6J65l06k3n6N83K6m09m41K14M78K15
3611D19n74k47J65L09N25p78k44o0O85M89n73o22NP42M54n24p74J41O27N09m25
$$ plain form
3632 249 -517 -708 69 692 286 -303 -590 46 792 439 -406 -615 -27 464 649 -192 -624 4 648 529
3652 529 -223 -726 -151 657 488 -261 -594 34 404 614 -179 -507 39 427 477 39 -536 -232 541 362
3672 362 -23 -350 55 331 200 -146 -414 -14 416 260 -109 -416 43 399 357 -199 -337 -96 363 138
3692 138 -339 -383 7 402 -34 -304 -277 232 496 209 -203 -385 162 374 -74 -292 -526 36 499 142 -235
3713 -235 -582 122 482 245 -391 -481 150 428 144 -240 -318 79 377 115 -288 -339 69 396 376 -200 -337
3734 -337 75 338 268 -40 -394 -184 142 351 16 -330 -40 -24 381 277 -79 -47 54 130 181 -77 -218 43
3756 43 87 97 30 -92 20 69 245 36 -132 -215 -145 188 267 5 -257 -25 -68 177 -44 -314 -297 67 176
3779 176 -17 -376 -310 -28 374 225 -259 -425 -105 303 196 -256 -492 -111 401 328 -320 -564 -257 434 253
$$ packed form
3632B49p66j91P77O23m06n89k87O36P46l53q45k09N88M91J85q41m32O28O44j19
3652E29p52n03N75Q08j69p49l33O28L70K10p93l28N46L88N0m38n75L04P73j79
3672C62l85l27M05K76j31l46k68M00M30j56l69l07M59L56m2n56j38K41M59k25
3692A38m77m4L90L95m36k70K7N09K64k87m12j82N47K12m48k18k34N62M63l57l77
3713b35l47P04L60k37o36r0O31K78k84l84p8L97K98k62m03n1M08L27k0n76j37
3734c37M12K63p0l08l54K10L26K09l35l46K90J6M05j04l56L2J01P6N1k58j41K61
3756D3M4J0o7j22J12M9J76k09j68q3P0L33P9k62k62K32m3K45k21k70J7L64J09
3779A76j93l59O6K82M02j49m84j66L20M08j07m52k36L81N12p3o48k44L07O91j81
$$ plain form
3800 253 -225 -611 -100 306 404 -191 -546 -113 312 372 47 -398 -99 183 548 -168 -381 -36 332 448 -49
3821 -49 -177 -156 380 351 120 -241 9 260 298 -72 -441 9 266 415 -88 -170 0 594 277 -217 -169 92
3843 92 499 309 -198 -222 -19 462 213 -303 -353 -42 472 293 -244 -415 -115 610 269 -341 -636 -43 288
3864 288 312 -295 -473 27 393 314 -418 -575 -44 503 159 -297 -442 -78 486 313 -400 -465 -13 351 385
3885 385 -168 -468 -202 363 464 -214 -614 -212 366 237 -52 -389 -201 195 433 -24 -441 -303 317 301
3905 301 97 -489 -255 109 535 241 -253 -61 111 283 208 -180 -286 95 326 201 -7 31 -104 155 231
3926 231 145 -61 -113 23 -68 101 138 -178 21 82 231 188 -106 -83 -72 28 88 -34 -164 -41 254 243 -108
3949 -108 -285 43 164 204 110 -172 -85 16 251 -56 -159 -262 138 198 32 -262 -166 111 364 18 -260 -242
$$ packed form
3800B53m78l86N11M06R8n95l55M33M25O0l25m45K99K82L65p16k13L45L68J16m97
3821d9j28K1N36k9k31l61K50K51L8l70l69M50K57J49n03q2J70N94l17m94M8K61
3843I2M07j90n07k4K03M81k49n16n0L11N14j79n37j71L00P25l41o10k95N93L31
3864B88K4o07j78N00L66p9p32j57N31N47l44m56j45L64N64j73p13o5M52L64L4
3885C85n53l00K66N65J01o78m00M02N78j29k89l37J88L96K38m57m17J38O20j6
3905C01k04n86K34L64M26k94m94J92J72J72p5l88j06L81K31j25k08L8j35K59P6
3926B31q6k06n2J36r1J69L7l16J99O1J49m3k94K3J1J00O0j22j30J23K95j1l51
3949a08j77L28J21M0r4k82Q7J01K35l07j03j03M00O0j66k94R6K77K53l46k78J8
$$ plain form
3971 -242 108 308 33 -211 -185 91 160 96 -322 -286 84 251 34 -105 -325 48 119 -15 -154 -173 234 259
3993 259 27 -210 -42 488 188 -20 -145 -27 188 300 -212 -276 12 298 309 -110 -328 -219 341 321 -134
4014 -134 -295 -21 426 538 -306 -483 -13 413 275 -6 -530 -224 447 343 -208 -502 -18 408 459 -165
4034 -165 -516 -312 315 582 -31 -483 -404 258 375 -104 -693 -385 301 586 -26 -548 -441 258 511 81
4054 81 -553 -484 89 485 228 -321 -384 193 440 60 -300 -436 133 288 -80 -367 -450 28 366 275 -125 -291
4076 -291 -74 343 101 -136 -260 -29 268 64 24 -362 153 117 3 148 -12 122 -1 218 -140 15 -18
4097 -18 -98 -58 -130 217 19 122 175 47 203 27 35 -101 -57 165 148 -3 59 -134 17 96 -37 -160 64 212
4121 212 239 -85 -188 12 -6 52 -179 -75 -234 95 32 1 -191 -67 60 205 -127 -66 -67 137 116 -177 -216
$$ packed form
3971b42L50K00k75k44K6K76O9o4m18L6L70J67k17j39k20L73P1j34j39j9M07K5
3993B59k32k37J68N30l00k08j25J18K15J12n12o4K88K86J1m19k18J09N60k0m55
4014a34j61K74M47J12q44j77M70M26j38k81n24L06O71j04n51k94M84M26N1o24
4034a65l51K04O27K67o13m52P9O62J17m79n89L08O86K85o12n22J07O99K53m30
4054H1o34O9N73L96k57n49o3N77K47l80l60j36N69J55l68k87q3M78L38r1m00j66
4076b91K17M17k42k37j24K31K97k04m0l86N15l6j14J45j60J34j23K19l58J55l3
4097a8q0M0p2L47j98J03N3j28J56j76Qj36M4K22j7j51O2j93J51P9j33j23K24J48
4121B12K7l24j03K00j8N8k31J04j59L29o3l1j92J24J27J45l32O1jK04k1k93l9
$$ plain form
4144 -216 -129 49 -51 -133 -200 -131 132 -33 -77 -6 -145 -8 -108 -79 9 225 99 -94 -80 71 125 59 -104 -22
4168 -22 -121 133 31 -185 -221 -146 95 186 -113 -270 -100 226 292 -120 -434 -248 380 438 -12 -315 12 223
4190 223 450 -69 -504 -227 335 546 159 -266 -385 289 594 90 -221 -276 202 519 195 -400 -355 247 561
4211 561 249 -282 -323 178 509 118 -163 -383 214 499 238 -280 -357 -122 305 188 -251 -434 -2 295 318
4232 318 -164 -296 -3 314 189 -145 -288 51 349 58 -5 -274 -30 75 240 -253 -226 -1 25 27 -132 -35
4254 -35 6 201 98 -144 -22 67 188 18 29 136 38 61 -39 -335 -106 161 139 -129 -122 -95 260 295 -35 -217
4278 -217 58 116 289 -54 -122 -39 151 180 23 -183 -75 151 32 -70 -190 -42 235 170 -95 -188 4 18
4300 18 73 15 -184 -101 -47 296 -79 103 -114 -69 79 -55 -56 2 -88 85 20 168 12 -83 -149 -111 49 42 -159
$$ packed form
4144b16Q7J78j00q2o7O9K63j65m4P1j39J37j00K9Q8K16j26j93J4J51N4o6j63Q2
4168b2r9K54j02k16l6P5K41R1k99j57J70L26O6m12l14J86O28N8m50l03L27K11
4190B23K27n19m35K77N62K11l87m25j19O74L05n04l11n5M78L17l24n95M5O02L14
4211E61l12n31m1N01L31l91k81k20N97K85k61n18p7K35M27j17m39j83M32K97K3
4232C18m82j32K93L17j25l34j43L39K98k91o3k69K44J05J65m93K7K25K6Kj59R7
4254c5M1J95j03k42J22Q9J21j70J1J07r8K3j00k96K29K67k2k68PK7L55L5l30j82
4278b17K75N8J73l43o8Q3J90K9j57k06J08K26j19j02j20J48K77o5k65r3J92J4
4300A8N5n8j99Q3N4L43l75J82k17M5J48j34jN8r0J73o5J48j56r5o6L8J60pk01
$$ plain form
4325 -159 -143 105 136 25 -17 -138 -123 3 183 -125 -270 -98 -39 276 66 -292 -188 182 226 -220 -310 -133
4347 -133 149 408 -65 -277 -210 41 373 276 -219 -348 105 459 373 -249 -259 37 504 67 -388 -428 -3 440
4369 440 363 -52 -299 119 289 234 -208 -266 18 388 270 -189 -249 -164 339 311 -190 -307 -128 399 342 -108
4391 -108 -157 82 103 303 -97 -173 33 210 304 -15 -266 -25 110 119 -128 -152 0 178 220 -73 -174 140 203
4414 203 32 -150 -311 -38 159 128 -182 -288 -40 247 44 -193 -148 21 123 23 -138 -76 102 269 -41
4435 -41 -160 -137 24 9 24 -128 -228 89 58 -23 -358 -10 108 292 20 -154 -157 218 343 3 -176 -119 121
4458 121 232 98 -132 24 -140 204 110 -35 -110 -25 207 70 -8 -30 110 -259 198 28 -53 -8 14 110 -3
4481 -3 -108 -81 -107 73 120 -13 -42 -126 39 127 168 -125 -14 -83 1 111 47 -298 -224 2 258 99 -138 -256
$$ packed form
4325a59J6K48L1j11m2j21J5J26J80l08j45J72N9L15k10l58J04L70M4m46r0J77
4347a33K82K59m73k12O7K51L32r7m95j29M53L54q6o22j0K96M67m37m55m0M25M43
4369D40p7m15k47M18J70n5m42n8K84L70j18m59o0Q5N03k8n01j17J79N27n7m50
4391a08m9K39K1K00m00p6K06J77R4l19k51K41J35Rk47k4J52J78M2k93j01L14O3
4414B03j71j82j61K73J97l1l10j06K48K87k03k37M5J69J02j00j61O2J78J67l10
4435d1j19K3J61j5J5j52j00L17l1q1l35L48J18J84k72j74lL75J25l40j79N7K40
4458A21J11j34k30J56j64L44r4j45p5Q5K32j37p8k2J40l69M57j70q1M5K2R6j13
4481cj05K7k6J80M7j33k9q4J65Q8M1k93J11o9Q4J10o4l45P4K26K56j59k37j18
$$ plain form
4505 -256 98 328 233 -117 -333 -32 298 -20 -121 -383 -75 230 273 -179 -335 92 438 195 -126 -305 -56
4526 -56 192 349 161 -291 -179 295 317 -10 -482 -114 305 191 14 -201 -10 227 339 19 -288 -187 254
4547 254 319 43 -412 -46 94 162 -7 -202 -164 308 301 -114 -214 -177 125 287 58 -94 -277 -98 157 38
4569 38 -352 45 85 50 -140 -219 9 204 40 -215 -281 61 171 -66 -293 -179 -69 154 30 -225 -331 70
4591 70 191 -57 0 -247 -115 81 99 -108 -197 59 271 17 -330 -214 -180 69 140 -101 -370 31 121 120 -95
4614 -95 -194 -77 201 45 -27 -316 -93 290 104 100 -206 -201 154 109 152 -2 22 255 353 13 4 -32 84 198 -53
4639 -53 -81 -1 -15 54 -120 -304 -6 -63 115 25 76 65 120 -17 -1 90 41 -69 27 106 -6 18 -42 -8 -20 18 52
4666 52 -33 -313 125 192 161 -232 -225 -121 135 136 -47 -184 -129 146 291 -38 -423 -128 257 299 -75 -194 -167 174
$$ packed form
4505b56L54K30r5l50k16L01L30l18j01k62L08L05M3m52j56M27L46k43l21j79K49
4526e6K48J57j88m52J12M74K2l27m72L68M19j14j77k15J91K37J12l20l07J01M41
4547B54O5k76m55L66J40O8j69j95L8M72pm15j00L7L02J62k29j52j83J79K55j19
4569C8l90L97M0l5j90p9K28J95j64k55o6L42J10k37k27J14J10K23j24k55j06M01
4591G0J21k48N7k47J32J96J8k07q9K56K12k54l47J16L4K49P1k41k69M01R0jk15
4614i5r9J17K78j56p2k89K23L83j86ml06NL55m5M3j54K4K33R8l40rl6J16J14k51
4639e3k8Q0j4O9j74j84K98n7J78r0N1j1N5j37J6R1m9j10R6P9j12K4o0L4j2L8L4
4666E2q5k80M38O7l1l93PJ04K56Jj83j37N5K75J45l29l85K95L85M2l74j19K7L41
$$ plain form
4690 174 236 70 -261 -98 75 292 166 -294 -231 256 197 97 -327 -218 227 129 75 -106 -165 152 164 222 -257
4713 -257 -80 184 174 239 -65 -133 24 288 122 -152 -216 120 190 65 -31 -43 178 124 -86 -160 -126 161 65 -37
4737 -37 -185 -47 179 113 -7 -214 -63 86 114 -50 -253 -112 242 197 -54 -270 -154 314 272 -76 -387 -195
4759 -195 341 156 20 -338 -17 223 163 -158 -449 -139 271 106 -35 -248 -199 269 108 43 -247 -202 85
4780 85 327 -82 -197 -321 88 373 -108 -203 -210 149 478 266 -287 -130 54 263 23 -159 -250 -27 259 70
4802 70 -66 -112 -57 157 157 158 -87 42 88 133 230 -78 30 37 127 145 25 -84 -19 131 41 168 -29 -19 134 -109
4828 -109 112 -36 -84 -115 -193 266 -70 -147 25 127 59 56 -66 -192 132 110 62 -130 -269 117 191 8 -195
4851 -195 -252 17 309 168 -138 -235 11 101 199 -6 -331 34 111 242 -174 -182 68 117 108 -166 -256 -6 62 75
$$ packed form
4690A74O2j66l31J63J73K17j26m60O3M87n9j00m24J09M45r8n4j81n9L17J2N8m79
4713b57J77K64j0O5l04o8J57K64j66k74o4L36P0j25r6j2K21n4k10p4L4K87r6j02
4737c7j48J38K26o6j20k07J51J49K8j64k03J41L54m5k51k16J16M68m2l48l11J92
4759a95N36j85j36l58L21K40o0l21k91L10M10j65j41k13M9M68j61o5k90M5K87
4780H5K42m09j15j24M09K85m81r5pL59L29k12n53J57J84K09k40j82r1K23K86j89
4802G0j36m6N5K14%Jk45J29M6M5R7l08J08PR0J8j20j09O5J50r0J27j97J0J53k43
4828a09K21j48m8l1p8M59l36p7J72J02o8lj22j26L24k2m8j92j39L86P4j83k03
4851a95n7K69K92j41l06r7K46R0R8k05l25L65P7J31m16qK50M9rk74r0K50O8J3
$$ plain form
4875 75 -219 -179 17 242 -69 -196 -156 -3 133 71 -118 -159 21 132 141 -157 -203 81 110 -17 -289 -108 205
4898 205 8 -120 -151 -32 89 146 290 -218 -160 203 347 -8 -153 102 160 272 -12 -173 -276 52 282
4919 282 75 -373 31 242 524 244 -116 -211 120 348 -20 -195 -121 167 314 98 -305 -125 150 309 65
4940 65 -149 -290 154 301 194 -207 -349 62 319 281 -83 -295 -68 316 319 -206 -158 -20 231 99 -29 -118
4962 -118 -10 95 154 136 -76 -21 252 354 -50 -130 -131 17 136 -136 -125 -140 -70 44 154 -65 26 -159 85
4985 85 -37 -58 74 95 124 -87 59 53 108 -98 -118 99 -57 -86 -45 38 174 24 -133 -67 -157 -134 -23 19 -126
5010 -126 -136 143 149 -68 -76 -252 -4 -44 132 -77 -181 -68 18 155 -97 -85 -25 13 -35 0 -47 -243 -35 47 -193
5035 -193 7 158 -70 99 -310 -113 201 80 -34 -262 35 -24 -46 -91 -103 18 20 -126 -201 -81 -142 -122 75
$$ packed form
4875G5k94M0J96K25l11j27M0J53J36o2j89m1J80J11Rk98m6K84K9j27k72J81L13
4898B05j97j28l1J19J21N7J44n08N8L63J44l55j45K55N8J12k84j61j03L28K30
4919B82k07m48M04K11K82k80l60r5L31K28l68j75P4K88J47k16m03J80K75J59k44
4940F5k14j41M44J47j07m01j42M11K57l8l64k12K27L84Ln25M8J38K51j32j28q9
4962a18J08J05N9j8k12N5K73J02m04q0jJ48J19k72J1j5P0J14J10k19R1j85K44
4985H5j22k1J32K1K9k11J46oN5k06k0K17j56k9M1Q3J36j50j57O6r0K3J11M2j45
5010a26j0K79Ok17qj76K48m0J76k09j04J13Q6J37k52J2O0L8m8L5m7j96K08Q2k40
5035a93K00J51k28J69m09J97L14j21j14k28K97n9k2m5j2J21Kj46p5J20o1K0J97
$$ plain form
5058 75 -174 -8 183 127 66 -38 -60 167 224 40 -228 -305 127 301 245 -231 -132 245 475 68 -147 -188 132
5081 132 431 234 -252 -215 93 365 180 -28 -196 156 355 245 2 -378 248 158 388 -27 -354 -108 413
5102 413 305 19 -390 -65 327 239 75 -270 -108 139 271 -160 -234 -115 222 203 -4 -262 7 243 132
5123 132 90 -131 -55 88 144 -86 -125 -128 30 159 -78 -350 -161 90 79 -31 -154 11 -77 -29 20 -148 -26
5146 -26 -220 -127 39 37 41 -64 132 -1 -31 -35 40 -156 -43 -99 73 118 42 49 -256 -34 155 -53 -155 32 26 -94
5172 -94 13 26 23 159 55 -18 -90 -157 154 256 -95 -87 49 17 124 -151 -130 -112 -20 121 -19 -26 -110 78 18 103
5198 103 -5 -48 -40 59 13 47 -7 38 -118 40 34 -75 14 -89 -206 132 122 -127 -27 -65 -32 69 128 -129 -184
5223 -184 45 159 -26 -47 -50 185 136 95 -154 -93 115 274 -22 -42 -287 17 146 241 -89 -315 90 231 72
$$ packed form
5058G5k49J66J91n6o1j04k2K27N7j84k68p7M32J74n6m76R9L77K30m07k15m1L20
5081A32K99j97m86L7L08K72j85k08j68L52J99j10k43l80O26r0K30m15l27K46N21
5102D13j08k86m09L25L92q8j64l45J62K47J32m31p4J19L37j9k07k58K69K36j11
5123A32m2k21P6J43N6k30l9lJ58J29k37k72J89K51j1j10j23J65q8M8M9j68J22
5146b6j94R3J66kMj05J96j33l0mP5j96J13n6J72M5p6Pl05K22J89k08j02J87oj20
5172i4J07J3lJ36j04p3p2o7L11J02l51QJ36l2J07k75K1J8R2J41j40pq4J88o0Q5
5198A03j08m3QR9m6L4n4M5j56J58oj09Q9j03j17L38j0k49J00l8L3J01N9k57n5
5223a84K29J14j85k1lK35m9m1k49O1K08J59k96k0k45L04J29R5l30k26M05J41j59
$$ plain form
5246 72 -385 -268 -120 307 345 -259 -182 24 288 155 -127 -147 -81 163 338 -105 -148 101 138 249 -7 -315
5268 -315 -119 127 247 -55 -261 -222 186 299 -165 -204 -49 3 175 -39 -373 -152 105 235 -38 -227 -110
5289 -110 -38 237 75 -130 -174 105 99 -34 -228 -163 41 59 -30 -261 -238 182 -34 -23 -202 -51 -45 62 -275 -291
5313 -291 16 19 19 42 -117 -25 57 109 -106 -208 29 110 180 -104 -146 -14 180 51 -37 -164 129 239 91 -74
5337 -74 -154 54 389 49 -31 -50 48 198 173 -135 -80 -70 135 193 36 -209 -164 102 93 4 10 -17 123 289 107
5362 107 -83 -3 281 200 -51 -10 -127 24 160 82 13 -36 144 39 164 233 170 20 72 175 -6 60 -112
5385 -112 -137 -45 156 161 59 -24 -46 53 -21 -245 -304 124 37 107 -179 -171 35 170 101 28 -201 59 312 126 -30
5410 -30 -232 -117 34 93 -54 -149 -56 124 179 111 -172 -129 139 201 129 -138 -201 228 244 -82 -170 -265 191 239 64
$$ packed form
5246G2m57J17J48M27L8o04P7K06K64j33k82k0O6K44J75m43m3K49L7J11k56l08
5268c15J96K46J20l02k06L9M08J13m64l9J55N2J72k14l34K21K57J30k73j89J17
5289a10P2K75j62k05m4K79oj33j94O5K04J8q9k31K3M20k16J1j79J51OJ07l37j6
5313b91L07L%K3j59R2Q2N2k15j02K37Q1P0k84m2J32J94j29q8j27K93J10j48j65
5337g4q0K08L35l40q0j9R8J50k5l08N5J0K05N8j57k45M5K66rq9Ok7J40J66j82
5362A07j90Q0K84q1k51M1j17J51J36p8o9m9J80j05J25O9o3j50N2J03j81O6j72
5385a12k5R2K01Nj02q3k2R9p4k24n9M28q7P0k86QK06J35o9p3k29K60K53j86j56
5410c0k02J15J51N9j47r5R3J80N5o8k83M3K68O2p2k67o3M29J6l26q8r5M56M8j75
$$ plain form
5435 64 -177 -72 122 451 34 -190 -155 -107 161 2 -107 -222 107 192 137 -348 7 22 119 -4 -25 14 -3
5458 -3 193 110 -229 -88 106 128 1 -48 -138 34 -19 -36 45 -115 45 268 25 -148 -112 132 63 -102 -205 -36
5482 -36 22 35 -113 -128 -210 77 215 -165 -247 -76 98 189 42 -154 -138 51 178 7 -129 25 160 286 -15
5505 -15 -103 18 131 240 70 89 -103 137 315 -27 -136 -114 -102 108 71 27 -224 97 269 -88 65 -71
5527 -71 -5 243 49 57 73 28 90 -40 -82 -4 18 193 -84 195 62 5 138 -82 105 -120 -34 -57 124 3
5551 3 -109 -36 -130 -211 27 65 -67 -141 -19 74 150 131 -84 -192 168 79 -101 -99 -302 141 -51 53 -138 -153 -112
5576 -112 282 100 -61 -76 18 239 -44 -32 -195 -10 154 185 -115 -127 32 63 121 -51 -201 -107 166 112 -74
5599 -74 -168 -10 190 -5 -55 -76 53 83 122 -83 -87 -12 97 -32 -75 31 16 122 124 -211 -201 156 138 139 -107 -276
$$ packed form
5435F4k41J05J94L29m17k24L5M8K68j59j09j15L29Q5n5m85L55J5R7j23k1L9j7
5458cJ96q3l39J41J94K2j27m9r0J72n3j7Q1j60J60K23k43j73L6K44o9j65j03J69
5482c6N8J3j48j5q2K87J38l80q2J71J74R1j47j96J6J89J27j71j36J54J35J26l01
5505a5q8J21J13J09j70J9j92K40J78l42j09K2J2K10l7m4k51L21J72l57J53j36
5527g1O6K48j94QJ6m5O2j30m2P8K2J75k77K79j33n7J33k20J87k25Q6k3J81j21
5551Cj12P3r4q1K38L8j32p4J22R3P6j9k15j08L60q9j80Kk03M43j92J04j91j5M1
5576a12L94j82j61j5R4K21k83J2j63J85J64L1l00j2J59L1N8j72j50R4K73n4j86
5599g4r4J58K00j95n0k1J29L0L9k05mP5J09j29m3J06j5J06Kl35J0L57j8Jk46j69
$$ plain form
5625 -276 15 99 6 -7 -134 -98 76 111 -175 14 72 280 6 63 55 49 174 26 -146 -135 215 199 -80 -107 -144
5650 -144 34 213 98 -216 -2 68 99 -3 -100 -67 -2 290 99 -293 -148 4 154 141 -157 -241 -87 172
5672 172 189 -244 -190 -89 265 139 -12 -40 -72 102 32 -46 -97 -96 230 152 -95 -132 32 134 163 -71 -69 -270 -59
5697 -59 158 -157 -63 -30 -43 -80 -17 -40 -21 -58 184 88 -134 -148 64 23 122 14 -79 7 -80 159 28 16 70 -78
5723 -78 -58 84 70 86 17 -70 82 109 -89 -82 -6 128 122 -54 -158 -213 -16 86 -52 -81 -125 62 50 13 -70 -165
5749 -165 144 52 -184 7 -132 74 102 -74 -3 -91 132 16 54 76 -167 -174 -11 -52 -86 12 127 91 48 40 -47
5774 -47 16 -20 -187 -186 -20 150 112 8 -9 14 122 56 -59 -88 41 197 -7 -47 -18 46 11 125 -27 2 155
5799 155 197 4 -144 158 146 58 43 41 -140 160 105 -28 -98 -79 -46 232 263 -188 -178 -66 183 177 -85 -308 47
$$ packed form
5625b76K91Q4r3j3j27L6J74L5k86J89N8K08k74N7qoJ25j48j72J1L50j6k79k7l7
5650a44J78J79j15l14K14P0L1j02r7L3O5K92j91l92J45J52J50j3k98q4J54K59
5672A72J7m33N4J01L54j26j51k8l2J74p0p8n1JL26p8k47l7J64J02K9k34Kk01K11
5697e9K17l15R4L3j3l7O3k3J9l7K42r6k22j4K12m1R9j08r3Q6q7K39j31j2N4j48
5723g8K0J42j4J6o9q7J52K7j98PP6J34oj76j04n5J97J02j38k9m4J87j2l7q3r5
5749a65L09r2k36J91j39K06K8j76P1q8K23j16L8K2k43pJ63m1l4R8J15l6m3qq7
5774d7O3l6j67JJ66J70l8j04j7K3J08o6j15k9J29J56k04m0K9O4l5J14j52K9J53
5799A55M2j93j48L02j2q8j5kj81L00n5j33p0J9L3K78L1m51J0J12K49ok62k23L55
$$ plain form
5824 47 168 122 -108 -154 -50 126 316 -74 -328 57 122 79 -170 -286 40 271 159 26 -124 -140 87 87 -130
5847 -130 -200 -36 329 98 -37 -215 -29 176 98 -6 88 90 117 174 19 -195 94 -55 151 51 -46 -191 -25
5870 -25 153 11 30 -17 34 119 -167 -65 37 168 164 87 77 -46 -68 -13 -167 -52 -11 99 -90 -24 103 81 -58
5895 -58 -64 -16 -18 146 -55 42 11 -19 174 113 -78 -82 -55 231 43 23 -40 -148 107 -200 -9 -94 88 141 80 -108
5921 -108 10 -127 -46 -6 39 -18 -84 -2 -109 -132 -16 92 144 -22 -53 9 -43 -99 -134 76 85 28 163 45 39 61
5947 61 88 -23 -53 11 118 -35 5 -72 -116 -111 83 9 -24 90 -85 29 129 -2 -71 67 163 -14 -75 -115 -58
5972 -58 89 -43 31 -215 -44 135 65 -27 -358 -160 119 248 -38 -73 2 -10 190 -95 -358 -179 75 161 90
5995 90 -150 -127 178 220 100 -248 -161 6 163 75 -11 -205 29 220 -2 -89 -136 136 196 -70 -99 -96 57 252
$$ packed form
5824D7J21m6k30m6J04J76J90l90k54L85O5m3k49j16L26K31j12j33j50j6K27%k17
5847a30p0J64L65k31j35j78J86K05p8j04R4KK7N7j55k14K89j49K06j00r7j45J66
5870b5J78j42J9m7N1Q5k86J02J02J31mp7j0j23k2N5j54J15M1J10j89O6J27k2j39
5895e8oM8kJ64k01R7l1l0J93o1j91mK7K86j88k0o3j08K55l07J91q5J82N3o1j88
5921a08J18j37Q1M0M5n7o6Q2j07k3J16J08N2j66l1O2n2n6l5K10Rn7J35j18oK2
5947F1K7j11l0O4J07j53M0p7m4NJ94p4l3J14j75J14J00j31o9J38R6j77o1m0N7
5972e8J47j32P4k46J71J79p0r2l31J98K79J29k86l5P5j2K00k85k63J79K54Q6p1
5995I0k40K3L05M2j20l48Q7J67J57q8q6j94K34J91k22q7m7K72O0k66k9LJ53J95
$$ plain form
6019 252 2 -57 -234 131 202 203 -148 5 149 49 178 -192 -29 -118 59 25 -43 -6 -24 11 -132 -97 57 247
6043 247 24 -99 25 -153 36 14 62 5 56 24 229 -6 93 107 258 -22 -147 -105 214 315 -8 25 47
6066 47 45 25 61 -16 83 183 81 29 -4 -12 32 61 2 86 -50 8 150 208 -48 -1 -59 35 72 -83 89 -20 63
6093 63 -33 28 27 58 23 4 -28 59 -83 -156 -5 52 -127 -71 35 -96 34 107 -31 54 -17 56 -13 -128 -142 -90 11
6120 11 -38 -78 -96 -117 -16 67 -102 11 -38 123 110 -67 -96 -148 -137 54 189 114 -134 -65 157 172 -59 -98 -240
6145 -240 129 131 -4 -51 -46 67 212 -7 -185 -116 -154 142 -35 -263 24 161 92 196 -118 -62 -110 154 -100
6168 -100 -213 -297 61 139 105 84 -17 -104 157 109 -113 -237 -7 147 75 -77 -159 -48 51 36 -135 -43 16 57
6192 57 -4 -39 74 98 92 147 -57 53 84 -28 44 -169 -12 76 45 -14 -34 96 129 -71 -82 -19 -150 150 61 56
$$ packed form
6019B52k50n9j77L65P1Jl51J53J44j00J29l70J63q9J77l4o8L7j8L5j43L5J54J90
6043B47k23j23J24j78J89k2M8n7N1l2K05k35R9J4J51k80j25M2L19J01l23L3K2
6066D7kk0L6p7R9J00j02n2l3qM4K9n9Q4j36N8J42N8k56M7n8R4L7j55J72j09Q3
6093F3r6O1jL1l5j9l2Q7j42p3J51N7j79N6J06j31J30P3j38Q5p1P3o9j15j4N2J01
6120A1m9m0j8k1J01Q3j69J13m9J61j3j77k9n2J1J91J35p5k48O9K22J5k31l9j42
6145b40L69Kj35m7NJ13J45k19j78O9l8K96j77k28K87J37o9J04l14N6m8K64k54
6168a00j13q4L58P8l4k1j01q7K61m8k22j24K30J54p2j52q2J11R9j5j71R2N9M1
6192E7o1l5J13K4oN5k04J10L1j12P2k13J57Q8l1n9k0J30L3k00j1O3j31L00q9n
$$ plain form
6218 56 -107 -31 97 90 126 -97 85 188 177 123 -193 110 96 27 42 -69 -150 95 365 -1 -52 94 207 4
6242 4 -90 -134 -56 91 116 118 -52 146 -56 25 -32 -67 1 -100 140 -111 -10 -120 50 -125 -95 60 -171 -47
6266 -47 54 96 158 120 54 23 -14 -152 152 105 11 -17 -137 83 -18 -107 -150 -46 76 -94 -22 -12 64 -16 116
6291 116 -121 -199 68 -36 -232 -201 -235 106 -6 0 -150 -206 2 90 44 -174 -107 136 125 89 -172 48 42 -17 7
6316 7 -83 -25 80 144 195 -25 -106 35 172 210 -43 -44 21 81 -67 -30 148 -74 197 52 -26 -57 -118 158 149 -37
6342 -37 -48 20 166 70 -51 -169 50 154 130 -167 -28 67 16 105 -1 30 83 213 0 43 49 186 142 -35 -155
6367 -155 -265 79 66 -52 -211 -76 -10 135 -28 43 -32 -52 33 -107 -101 -74 122 -173 46 -177 -9 80 224
6390 224 84 33 -72 12 235 79 22 -109 38 60 210 -12 -324 120 135 54 -62 0 3 151 152 -11 -178 198
$$ packed form
6218E6j63P6J28pL6k23J82J03j1n4l16L03j4o9J5j11q1K45K70l66n1J46J13k03
6242Dr4m4P8J47K5Kj70J98k02Q1n7l5O8j01K40k51J01j10J70j75L0J55k31J24
6266d7J01M2O2l8o6l1l7j38L04m7r4k8j20K20j01q9m3J04J22j70P2J0P6q0J32
6291A16k37p8K67j04j96L1l4L41j12Oj50n6K08Q8m6k18O7K43j1l6k61K20on9K4
6316Gr0N8J05O4N1k20q1J41J37L8k53jO5O0j48L7J78k22K71j45p8l1o1K76rj86
6342c7j1O8J46r6j21j18K19J04k4k97J39R5n1Q9j06L1N3J30k13M3OJ37m4j77j20
6367a55j10L44j3j18j59J35O6J45j63P1p5k0Q5j40OK7J96k95K19k23J68Q9J44
6390B24j40n1j05Q4K23j56n7j31J47K2J50k22l12M44J5q1j16O2LJ48Jj63j67L76
$$ plain form
6414 198 62 13 -11 128 -107 18 31 62 -29 119 118 -103 -36 -94 -46 -113 5 -81 -127 -64 60 169 3 11 73 135
6440 135 128 -95 143 24 31 25 -23 92 159 7 114 31 2 147 8 -300 92 117 100 44 225 232 139 230 -153 195
6466 195 119 40 77 -35 -73 25 56 26 50 57 140 75 8 -100 13 107 16 162 -166 -147 -39 -125 -90 -127 -92 -34 240
6493 240 -8 -133 -31 -116 159 -80 -90 106 22 84 95 48 32 -164 69 -7 -71 -194 -38 137 84 -179 -49
6516 -49 104 93 188 -109 -164 85 -1 26 -131 -146 -103 219 49 -61 -137 -63 123 83 90 -93 -6 80 -3 -29 -83 -196
6542 -196 143 27 -95 -7 15 96 73 46 74 -16 41 41 -117 -138 -11 -52 -25 83 -36 29 59 55 -201 13 214 142
6568 142 127 -70 -4 13 -111 172 -130 -104 -18 64 172 -47 -63 -17 -47 19 -77 -37 6 -8 7 -38 -171 43 -13 -46
6594 -46 162 43 -186 -123 -22 -7 -74 3 -73 45 -110 15 -101 -39 -41 165 105 65 150 -28 -184 44 43 -95 -53
$$ packed form
6414A98j36m9k4J39k35J25J3L1r1J48jk21O7n8M8o7J18q6m6O3J24J09j66QO2O2
6440A35pk23K38j19Pom8J15O7j52J07q3k9J45j39l08L92K5j7n6J81Pr3R1l83L48
6466A95p6p9L7j12l8R8L1l0K4PQ3o5o7j08J13R4r1J46l28J9J08q6L5l7L5N8K74
6493B40k48j25J02q5K75k39j0J96q4O2J1m7j6j96K33p6o4j23J56J75n3k63J30
6516d9J53j1R5k97n5K49q6K7j57j5M3L22j70j10p6P4J86m0Pj83Q7Q6q3k6n4j13
6542a96L39j16j22Q8K2Q1k3k7K8r0N7%j58k1J27m1K7J08j19O5L0mk56K14K01p2
6568A42j5j97O6J7j24K83l02K6Q6Q2J08k19j6M6l0O6r6M0M3j4J5m5j33K14n6l3
6594d6K08j19k29O3J01J5o7P7p6J18j55J25j16O2kK06o0m0Q5j78j56K28jj38M2
$$ plain form
6619 -53 150 24 -29 37 17 -43 -14 50 -13 -119 -15 -47 141 -80 -224 67 60 12 -127 -97 -41 -157 75 -90 15
6644 15 -109 9 -48 74 -13 -18 35 121 29 -26 34 9 137 239 -206 -25 -125 -49 -67 41 -72 30 17 -32 14
6669 14 -99 112 -5 -22 54 -119 101 -7 7 -135 19 -221 0 -123 -179 -183 78 159 -8 -204 128 78 -12
6692 -12 -100 -173 -54 75 39 -71 -58 -45 94 83 6 -162 113 110 87 -65 2 105 116 182 -49 -158 101 54 123
6717 123 -79 -44 -119 218 73 67 -182 -84 97 -79 2 -44 -132 272 273 -152 -37 -64 -35 69 115 -4 5 56 73 96
6743 96 41 -7 18 192 -15 -86 -164 7 20 -40 -143 -126 -10 66 37 14 28 -131 51 -136 37 2 53 41 -71
6768 -71 -20 -74 72 -82 123 85 -44 -97 -55 -62 103 -68 53 -53 31 -88 -117 54 80 -104 -111 -9 40 -10 -106
6793 -106 -116 -70 58 -42 34 28 -66 144 -19 -52 -60 56 61 73 127 -5 -32 151 -38 -71 -33 33 155 35 -94 -3
$$ packed form
6619e3K03j26n3O6k0o0K9O4o3j06J04l2J88k21j44K91pm8j39L0N6j16K32j65J05
6644A5j24J18n7J22q7nN3Q6r2n5O0k5J28J02m45J81j00P6j8J08j13J02j3m9M6
6669A4j13K11j17j7P6j73K20j08J4j42J54k40K21j23n6mK61Q1j67j96L32n0r0
6692a2q8p3J19J29l6j10J3J3J39j1p7j68K75lk3j52O7J03J1O6k31j09K59m7O9
6717A23k02L5p5L37j45ok49R8J81j76Q1m6q8M04Jm25J15k7K9J04M6j19RN1J7K3
6743I6n5m8K5J74k07p1p8J71J3o0j03J7J16P6k9k3J4j59J82j87J73l5N1j2j12
6768g1N1n4J46j54K05l8j29n3M2pJ65j71J21j06Q4j19k9J71K6j84pJ02M9n0r6
6793a06j0M6J28j00P6or4K10j63l3qJ16NJ2N4j32k7J83j89l3L8O6J22j20j29R1
$$ plain form
6819 -3 159 206 15 -40 153 -29 59 25 9 77 33 -31 -12 -131 156 67 -42 32 68 -85 -130 -4 -148 -159 150
6844 150 70 -79 -99 -22 92 -41 0 -92 69 74 61 42 10 71 131 13 -35 -87 -112 111 188 -60 -24 -54 -14 160
6870 160 -74 32 -70 -44 144 -85 -171 -44 247 -61 -38 -141 -97 30 9 111 -160 -54 38 186 98 -112
6892 -112 35 -28 164 -117 -123 5 -28 1 184 -54 -72 121 -154 107 12 -144 55 131 -32 -38 -68 71 143 9
6916 9 -120 -174 139 -30 55 -109 -141 44 141 -66 7 -29 -7 91 -73 -127 70 -6 145 -50 -61 -50 64 -68 10
6941 10 -23 215 1 -14 0 -59 -138 -14 -209 53 -89 16 28 -108 -131 -40 90 155 43 49 30 8 -183 -50 11
6966 11 -66 38 105 18 -12 -146 82 16 141 18 -63 217 -76 42 75 -9 61 17 100 59 -64 -47 80 61 29
6991 29 -159 43 -89 -82 28 12 -65 37 44 88 -8 129 -61 -66 -31 -62 14 -50 -94 -111 93 -17 -89 -5 -104 103 -24
$$ packed form
6819cJ62M7j91n5J93j82Q8l4j6O8m4o4J9j19K87q9j09P4L6j53m5J26j44j1L09
6844A50q0j49k0P7J14j33M1r2J61Nj3j9l2O1O0j18m8n2k5K23P7k48L6l0M0J74
6870A60k34J06j02K6J88k29q6J27K91l08K3j03M4J27k1J02k71J06R2J48q8k10
6892a12J47o3J92k81oJ28l3K9J83k38j8J93k75K61r5j56J99P6j63ol0J39P2j34
6916Ij29n4L13j69Q5j64l2J85R7k07P3l6K2R8j64n4J97p6J51j95j1J1J14j32P8
6941A0l3K38k14j5J4n9p9J24j95K62j42J05J2j36k3R1J30O5j12Oj9k2j91J33O1
6966A1p7J04O7q7l0j34K28o6J25j23q1K80k93J18L3q4P0m4Q3m1j23J7J27j9l2
6991B9j88K02j32PJ10j6p7J02PM4r6J37j90nL5l1P6o4m4j7K04j10p2Q4r9K07j27
$$ plain form
7018 -24 -8 -199 83 -13 -16 -32 -35 -61 221 25 -60 -119 -50 197 191 26 -113 -72 -20 66 91 -49 -33 21 85 19 -41 -71
7046 -71 -151 33 83 0 -210 15 -2 4 -117 -75 30 130 -169 -2 45 37 -38 12 -114 28 -170 129 -67 -32 -64
7071 -64 170 -59 85 20 -36 166 51 84 -74 -43 50 -76 116 -78 -66 115 65 59 -75 -103 51 44 -104 -13 154
7096 154 132 104 39 -52 39 -109 -81 32 -144 30 -27 -93 -14 -82 120 126 72 -106 -104 -178 206 16 -21 -196 -148 165
7122 165 16 21 -47 -202 99 -123 98 -117 -116 -6 -80 222 -111 -74 -70 62 79 -5 -58 -85 73 46 76 125 -88
7147 -88 31 -152 -32 -10 14 -102 129 -124 12 9 70 25 -112 -53 100 -109 -90 91 154 46 -78 54 54 -39
7171 -39 39 27 73 -57 104 -11 66 119 20 104 147 121 117 120 21 -123 -199 -125 -119 -78 78 -27 68 -32 2 -34 -87 52
7199 52 -38 17 65 -59 -64 -27 -89 60 13 -131 -169 3 82 -22 -91 162 96 26 -88 -69 -44 55 7 -103 -10 50 -68
$$ packed form
7018b4J6j91K82r6lj6lk6K82j96q5n9O9K47oj65j39M1N2Q6K5j40J6N4O4o6o0l0
7046g1q0J84N0q3k10K25j7Oj21M2J05J00k99J67M7qp5N0j26J42j98K99j96L5l2
7071f4K34k29J44o5n6K02j15L3j58L1R3j26J92j94J2J81n0oj34k8J54pj48R1J67
7096A54k2k8o5r1R1j48K8J13j76J74n7o6P9o8K02On4j78Kp4L84j90l7j75M8L13
7122A65j49No8j55L01k22K21k15JJ10p4L02l33L7MJ32J7q4n3k7J58k7L0M9k13
7147h8J19j83J20K2K4j16K31k53J36lO1m5j37N9J53k09J9J81O3j08j24J32%r3
7171c9P8j2M6j30J61j15P7N3r9Q4M3k6mLr9j44p6P4OM1J56j05R5j00L4l6n3J39
7199E2r0N5M8j24nL7o2J49m7j44l8J72P9j04o9K53o6p0j14J9K5R9m8j10R3O0j18
$$ plain form
7226 -68 109 102 -21 -60 66 151 -142 23 127 64 -57 -28 -119 4 183 108 -83 47 72 4 49 -258 -47 38
7250 38 42 87 9 -156 141 218 -65 -191 -44 191 -25 129 -10 -157 186 -2 -109 -93 -137 247 51 77 -104
7273 -104 -124 54 -5 93 -168 -69 6 -27 23 -69 21 20 61 60 70 -22 -32 -17 -31 -92 59 42 -200 41 -160 -13 -72
7300 -72 109 -143 -47 -93 188 85 10 -181 -27 55 171 -24 109 59 -69 14 -52 8 106 71 68 68 116 134 -61 35
7326 35 5 29 109 -81 4 57 -61 174 1 38 -7 20 14 -21 -41 21 -58 211 18 32 93 40 -210 -35 26 50 -1
7353 -1 -69 22 -192 -24 16 222 84 -12 -38 179 -127 99 -65 61 -6 63 -53 91 180 83 -40 3 -14 46 29
7378 29 -51 -16 71 71 -116 25 -11 -120 -71 -168 190 125 86 -121 48 124 -30 -191 -231 4 -95 -54 76 -28 56
7403 56 105 -4 179 -190 -62 67 24 -32 149 75 -55 82 -31 -105 -136 7 124 -122 -123 144 138 -45 177 -277
$$ packed form
7226f8J77pj23l9J26Q5k93J65J04o3j21K9r1J23J79p5j91J30K5o8M5l07K11Q5
7250C8MM5p8j65K97P7k83j26J47K35k16J54j39j47L43j88j07J6m4L84j96K6j81
7273a04k0J78n9R8k61R9P5l3N0r2R0jM1jJ0r2j0J5j4o1J51j7k42K41k01J47n9
7300g2J81k52R6m6K81j03p5j91J54Q2J16j95J33n0j28Q3o6O0R8l5l%M8J8j95R6
7326C5l0K4Q0j90Q5N3j18K35j73L7m5K7ol5k0O2p9K69j93J4O1n3k50J75O1K4n1
7353ao8R1k14J68M0K06j38r6k6K17l06K26j64J26o7O9j16J44Q9r7j23M3j7O0j7
7378B9q0L5Q7%j87J41l6j09M9r7L58o5l9k07J69P6j54j61m0K35r9M1J30j04Q4
7403E6M9j09J83l69J28J29m3n6J81p4j30J37j13p4l1J43J17k46jK67oj83K22m54
$$ plain form
7427 -277 -90 197 45 -66 -60 147 128 81 -22 -178 -174 246 -2 -198 -135 118 -113 50 -45 145 61 -86 77
7450 77 -76 -18 130 128 -30 62 -80 -36 165 -136 -112 -147 -45 -44 -24 -28 -43 7 21 96 -93 -138 -7 203 8 -110
7476 -110 -123 15 58 -129 31 -179 -27 107 60 -15 -107 40 107 43 -51 -30 -176 -27 123 -48 -27 78 -99
7499 -99 -47 101 -55 19 -103 154 73 -69 49 -23 107 -116 98 55 -236 -143 66 75 105 -140 -91 43 -21 -59
7523 -59 76 -49 -61 -42 68 95 9 136 -52 -14 -59 -1 31 138 -31 -27 -32 130 99 135 54 82 -25 -123 -142 38
7549 38 83 -123 91 62 18 -108 -36 -64 -75 68 0 -20 43 219 -71 -43 118 166 43 138 7 29 62 -102 -71
7574 -71 -79 181 26 145 25 -79 153 -16 70 127 -62 -54 -19 117 10 127 -86 43 81 -25 -179 52 -118
7597 -118 -1 -116 21 97 46 -17 -49 -70 69 7 -76 32 8 -13 193 -32 -18 -201 55 31 96 -28 -42 18 -75
$$ packed form
7427b77J87K87j52j11OK07j9m7j03j56MM20k48j96O3K53k31J63r5J90q4j47J63
7450G7j53N8J48kj58R2j42M4K01l01K4l5J02JK0mj5N0J4P5j89m5J31K10j95j18
7476a10j3J38M3j87J60k10J52J34m7p5r2J47O7o4r4K1j46J49J50j71K1J05j77
7499i9N2J48j56P4j22K57q1j42J18p2J30k23K14m3k91R3K09RL0k45M9J34o4l8
7523e9J35j25j2J9J10K7q6J27j88L8m5N8L2J07j69MnJ62l1L6q1K8j07r8j9J80
7549C8M5k06K14k9m4j26P2k8j1J43o8k0O3J76k90K8J61M8j23R5j31K2L3j64L1
7574g1qK60j55J19j20j04K32j69Q6N7j89QL5J36j07J17k13J29L8j06j54K31j70
7597a18J17j15J37P6n1o3l2k1J39o2q3J08k4k1K06k25J4j83K56k4O5j24j4O0r3
$$ plain form
7622 -75 3 -90 -192 23 78 18 -99 -187 46 56 -97 155 -104 -91 123 -54 84 -53 -45 -17 104 -88 20 -83
7646 -83 -96 -70 50 154 -91 15 88 25 -8 94 16 -66 145 -78 -6 109 172 -90 -77 73 106 58 97 -60 3
7671 3 -94 73 146 63 -137 -84 -60 -228 14 34 -19 -13 115 -40 17 -187 53 -35 -117 -94 9 185 -98 -10 -9 -111
7697 -111 45 -32 -8 -24 -100 -42 -78 -22 -47 11 -120 127 86 -138 51 9 76 -51 153 59 -45 -122 -220 -43 7
7722 7 -19 -11 -69 -79 -107 113 -5 49 -62 65 196 56 45 -125 -105 50 188 -81 203 -30 -84 -81 81 66 -225
7747 -225 177 -106 91 -17 -34 -35 56 -64 8 -119 -59 -27 146 51 70 66 19 -172 113 49 -135 83 68 87 40
7772 40 -87 13 145 196 26 -51 21 67 82 -87 8 4 47 37 104 -43 -133 123 -65 -48 0 24 -38 -82 -53 -204
7798 -204 65 51 73 -100 -32 7 58 26 0 -42 104 -140 62 -48 -256 -67 106 90 -152 136 79 17 -99 -31
$$ packed form
7622g5P8r3j02K15N5o0j17q8K33J0j53K52k59J3K14j77J38j37QK8J21j92J08j03
7646h3j3K6J20J04k45J06P3o3l3J02p8q2K11k23P2J15O3k62J3J50L3m8L9j57O3
7671Cr7J67P3q3k00N3K4j68K42K0n3OJ28j55N7k04K40q8q2K3J03J76k83Q8Jj02
7697a11J56p7K4j6p6N8l6N6k5N8j31K47m1k24J89m2O7j27K04r4j04p7r8J77N0
7722Gk6Qn8j0k8K20j18N4j11J27J31j40j1j70K0J55J38k69K84k33n4LJ62j5k91
7747b25M02k83J97j08j7jR1j20P2j27O0L2J73r5J9mm7j91K85o4j84K18j5J9m7
7772D0j27J00J32N1j70p7P2M6J5j69R5mM3j0O7j47r0K56j88J7M8K4o2m4K9j51
7798b04K69j4K2j73O8L9N1l2k6m2J46k44K02j10k08J89J73j6k42K88n7o2j16O8
$$ plain form
7822 -31 -13 -22 -9 26 -56 66 90 -47 -3 33 107 -115 149 -109 -74 -178 19 -29 117 -192 154 -89 10 159 27
7847 27 -195 -12 40 49 57 39 19 -108 113 22 20 143 -11 78 9 -109 -32 -39 47 -46 125 -56 -117 -61 -68 23 6 -55
7875 -55 4 2 -38 15 49 -36 -157 -28 65 164 -111 -159 -26 68 -27 52 -17 3 46 19 91 -123 -3 12 -34 116 -50
7902 -50 -30 110 -36 116 -18 -71 -116 -56 -18 -68 -36 -29 197 -6 105 23 54 56 -73 41 -45 36 -33 113 63 -66
7928 -66 -58 176 -132 107 -26 -17 2 197 -34 32 34 -83 100 -85 172 82 -59 -24 -71 -112 56 317 -80 -108 50
7953 50 5 -38 -160 -82 -16 -52 19 -81 -132 46 -13 3 -150 -82 26 -4 34 -106 39 -81 -50 -25 74 -64 130
7978 130 -26 -150 -13 -4 39 -85 31 -83 -71 49 -16 2 -104 34 -10 117 -95 71 37 -1 0 2 -61 -248 222
8003 222 76 -165 123 -149 30 5 -142 1 71 270 97 45 59 -62 126 122 110 -121 30 22 53 11 110 120
$$ packed form
7822c1J8rJ3L5q2J22K4j37M4L6P4k22K64k58L5j04J97m8J46l09L46k43R9J49j32
7847B7k22J83N2RQj8k0j27K21r1kJ23j54Q9o9j18P7pQ6r3J71j81o1N6pR1j7o1
7875e5N9km0N3L4q5j21J29R3R9k75m8J33R4r5P9o9K0M3k7P2k14J20J5m6J50j66
7902e0K0J40j46J52j34n3m5O0L8n0L2PK26k03J11q2L1Kj29J14q6Q1o9J46n0j29
7928f6QK34l08K39j33RJ9J95k31O6Kj17J83j85K57r0j41L5m7m1J68K61l97k8J58
7953E0m5m3j22P8O6l6P1j00n1J78n9J6j53O8J08l0L8j40J45j20L1K5R9j38J94
7978A30j56j24J37RM3j24J16j14J2J20o5J8j06J38m4J27k12J66l4l8JKo3j87M70
8003B22j46k41K88k72J79k5j47J43P0J99j73n2J4j21J88mj2k31J51qL1m2R9J0
$$ plain form
8027 120 150 154 77 -111 -46 68 115 30 38 77 -79 -86 -74 -42 151 -88 139 6 -100 -12 -7 16 -41 21 158 -145 81
8054 81 58 -30 -8 -8 -93 -274 25 -34 -16 -81 -2 101 -133 -20 -16 -27 -132 160 37 -102 -77 129 -12 -98 21
8079 21 -171 -30 69 -83 11 -113 -137 160 172 -110 -100 -5 227 -111 -81 5 -6 66 -18 -142 -78 -11 62 -51 -80
8104 -80 49 -45 111 -85 25 -36 138 238 -27 -338 43 -118 -18 23 -80 100 1 24 49 15 -14 -21 -14 -20 -100
8129 -100 -113 136 41 53 -156 8 53 29 11 -190 68 -17 -98 56 -152 -51 156 90 12 -111 133 -98 -26 -77
8153 -77 -123 34 -8 -1 19 -90 138 88 109 177 127 -97 78 239 -111 -24 -37 239 22 -87 40 -57 66 -62
8177 -62 -25 25 -161 38 136 32 -108 -111 -33 48 138 -73 -249 -185
$$ packed form
8027A20L0Mp7j88O5J14M7q5QL9j56pJ2L2J93k39K27j33j06Q8NK3n7O2J37l03K26
8054H1k3q8K2%q5j81K99n9J8o5P9J03k34J13Mj1j05K92j23j39K5K06j41q6J19
8079B1j92J41R9j52R4j24k4K97J2k82J0R5K32l38L0Q6j1P2q4j24O4O7P3j13k9
8104h0J29r4J56j96J10o1J74J00k65l11L81j61J00M1j03J80r9K3K5l4k9pPoq0
8129a00j3K49r5J2k09J64M5k4j8k01K58q5q1J54k08J01K07o6p8j23K44k31P2n1
8153g7m6J57m2PK0j09K28n0K1O8n0k24J75J61l50Q7j3K76k17j09J27r7J23j28
8177f2L7N0j86J99R8j04j40lP8Q1R0k11j76O4
8191a85
$$ Imaginary data points
##PAGE= N=2
##DATA TABLE= (X++(I..I)), XYDATA
$$ plain form
0 0 0 0 0 0 0 0 0 0 0 0 0 0 0 8 -8 8 -8 16 -16 16 -24 24 -32 40 -41 49 -57 70 -80 89 -105 119 -136 153 -175
35 -175 194 -220 247 -274 307 -344 382 -422 469 -518 573 -633 698 -768 847 -933 1029 -1132
53 -1132 1248 -1379 1526 -1691 1882 -2101 2360 -2667 3040 -3505 4104 -4907 6044 -7794 10854
68 10854 -17767 70038 -83394 -152971 77426 98277 70841 346 -73936 -29384 84875 84021
80 84021 6338 -94027 -45028 91599 80095 -20384 -56481 -78934 21150 139794 9781
91 9781 -143405 -49158 58721 54155 -3571 -82192 -63637 39281 41609 -22291 -62483 -62780 5309
104 5309 48733 -9138 -62320 -72959 -30285 58166 25507 -98256 -75685 18379 16975 -17534
116 -17534 -51091 -63339 -2927 28526 -25369 -61508 -45211 -7074 15289 -12983 -41741 -41803 -34405
$$ packed form
0@%%%%%%%%%%%%%Qj6J6j6K4l2L2m0M8n6P2q1R0j06J27j50J69j94K24k55K89l28
35a75L69m14M67n21N81o51P26q04Q91r87J091j206J331j466J615j780J962k161
53a132K380k627K905l217L573l983M461n027N707o545P609r011J0951j3838J8648
68A0854k8621Q7805j53432o9577K30397K0851k7436p0495p4282M4552J14259q54
80H4021p7683j00365M8999J36627j1504j00479l6097k2453J00084J18644j30013
91I781j53186R4247J07879m566n7726p8621J8555J02918K328o3900m0192k97O8089
104E309M3424n7871n3182j0639M2674Q8451l2659j23763K2571R4064j404l4509
116a7534l3557j2248O0412L1453n3895l6139J6297L8137K2363k8272k8758o2P398
$$ plain form
129 -34405 8118 25572 -46247 -67137 6220 22411 -21396 -39597 -32797 442 23612 -11107
141 -11107 -42533 -27002 797 16705 781 -25466 -19951 -7220 2943 18064 -7871 -37782
153 -37782 17 32484 5463 -22124 -22619 2876 33992 18201 -20966 -20642 3982 22643 22327
166 22327 -750 -12346 -1941 10528 25727 17489 -17972 -12156 29319 32924 5511 -15305 -12057
179 -12057 22641 42902 14682 -14502 -11885 10485 34132 29247 -691 -14377 -601 28057
191 28057 39611 4208 -26732 916 39740 36343 2033 -26448 -8856 38356 45563 7121
203 7121 -23513 -16703 21903 47829 21675 -20313 -22859 13990 46907 27644 -24388 -30369 18782
216 18782 50518 25348 -24610 -36431 10417 51716 31175 -19101 -37373 -4018 41683 38085
$$ packed form
129c4405M2523J7454p1819k0890P3357J6191m3807j8201O800L3239K3170l4719
141a1107l1426J5531K7799J5908j5924k6247N515J2731J0163J5121k5935k9911
153c7782L7799L2467k7021k7587m95K5495L1116j5791l9167L24K4624J8661l16
166B2327k3077j1596J0405J2469J5199q238l5461N816M1475L605k7413k0816L248
179a2057L4698K0261k8220k9184K617K2370K3647m885k9938j3686J3776K8658
191B8057J1554l5403l0940K7648L8824l397l4310k8481J7592M7212P207l8442
203G121l0634O810L8606K5926k6154m1988k546L6849L2917j9263n2032n981M9151
216A8782L1736k5170m9958j1821M6848M1299k0541n0276j8272L3355M5701l598
$$ plain form
228 38085 -11967 -39060 -9042 36756 37370 -12160 -43847 -10701 39025 36300 -13128 -45592 -18072
241 -18072 32538 37393 -7486 -40843 -23147 20180 32149 -3253 -37294 -23205 17295 27770
253 27770 -6427 -39282 -24836 17144 28463 -6886 -39817 -26981 11614 23513 -4926 -33314
265 -33314 -24576 6322 16034 -7730 -31156 -21552 8534 15888 -10912 -34523 -22283 9326 17847
278 17847 -9000 -34486 -22173 8212 14547 -9537 -29727 -17899 10208 13436 -13391 -31316
290 -31316 -15489 14245 18378 -11011 -33938 -17763 14294 20756 -5673 -29807 -18023 13843
302 13843 20247 -5331 -26532 -14480 16080 23415 -4315 -27849 -15074 16495 27583 3238
314 3238 -25070 -18017 13376 27005 8250 -17241 -16068 11089 25764 8410 -14500 -13368 10351
$$ packed form
228C8085n0052k7093L0018M5798O14m9530l1687L3146M9726k725m9428l2464K7520
241a8072N0610M855m4879l3357J7696M3327J1969l5402l4041J4089M0500J0475
253B7770l4197l2855J4446M1980J1319l5349l2931J2836L8595J1899k8439k8388
265c3314Q738L0898R712k3764k3426R604L0086P354k6800k3611J2240L1609Q521
278A7847k6847k5486J2313L0385O335k4084k0190J1828K8107L228k6827j7925
290c1316J5827K9734M133k9389k2927J6175L2057O462k6429k4134J1784L1866
302A3843O404k5578k1201J2052L0560P335k7730k3534J2775L1569J1088k4345
314C238k8308P053L1393J3629j8755k5491J173K7157J4675j7354k2910J132K3719
$$ plain form
327 10351 26636 12750 -12809 -15180 6686 25364 18421 -5581 -14989 1683 19879 17837 945
340 945 -9503 -543 15357 16083 2680 -6727 -2018 12271 17859 6122 -6861 -5864 6401 16639
354 16639 12638 -1507 -8154 -746 10463 13844 4938 -6204 -4646 6542 12514 6138 -5651 -7714
368 -7714 4577 14737 8445 -6962 -12872 -687 15947 14191 -4390 -16205 -6644 12325 16156
381 16156 -331 -15619 -9234 9387 15304 220 -16013 -10792 9484 17224 710 -18133 -14616
394 -14616 6984 18972 5196 -16856 -17328 3063 16567 5773 -13495 -15898 2175 14540 3538
407 3538 -14487 -14756 2504 14689 4634 -14472 -16477 562 13235 5885 -11768 -15769 -440
420 -440 10846 2658 -11518 -12196 1840 10625 -340 -14627 -11066 3741 10059 584 -14037 -12435
$$ packed form
327A0351J6285j3886k5559k371K1866J8678o943k4002r408J6672J8196k042j6892
340I45j0448Q960J5900P26j3403r407M709J4289N588j1737j2983R97J2265J0238
354A6639m001j4145o647P408J1209L381q906j1142J558J1188N972o376j1789k063
368g714J2291J0160o292j5407n910J2185J6634j756j8581j1815R561J8969L831
381A6156j6487j5288O385J8621N917j5084j6233N221K0276P740j6514j8843L517
394a4616K1600J1988j3776k2052m72K0391J3504j0794j9268k403J8073J2365j1002
407C538j8025k69J7260J2185j0055j9106k005J7039J2673p350j7653m001J5329
420d40J1286q188j4176o78J4036Q785j0965j4287L561J4807O318r475j4621J602
$$ plain form
434 -12435 3062 9379 -785 -12555 -10737 3885 10395 -3703 -16646 -9370 7715 12950 -3148
447 -3148 -20176 -11731 9918 14034 -2360 -17729 -12634 8475 15078 -2462 -17396 -11376 8785
460 8785 17654 -186 -20663 -13246 10721 20765 4182 -20486 -17280 10634 21894 4283 -15263
473 -15263 -14394 7201 20848 6251 -14242 -12310 6517 20588 10981 -12839 -15962 4979 21167
486 21167 14156 -8259 -16925 2951 20825 11928 -5197 -9910 1187 15896 12752 -3777 -8299
499 -8299 1199 12516 13773 913 -9612 -1965 10403 13473 5025 -7297 -4174 8998 9355 1831
513 1831 -556 -593 2767 6182 2659 -316 481 25 2766 5576 1407 -2613 -3057 -45 5718 4033
529 4033 -3024 -3426 -2362 -1388 4941 4063 -5805 -7473 -1454 3871 3708 -5484 -10920 -1270 7087 1951
$$ packed form
434a2435J5497O317j0164j1770J818J4622O510j4098j2943P276J7085N235j6098
447c148j7028Q445K1649M116j6394j5369N095K1109O603j7540j4934O020K0161
460H785Q869j7840k0477P417K3967J0044j6583k4668L206K7914J1260j7611j9546
473a5263Q69K1595J3647j4597k0493J932J8827J4071r607k3820l123K0941J6188
486B1167p011k2415q666J9876J7874q897j7125m713J1097J4709l144j6529m522
499h299R498J1317J257j2860j0525P647J2368L070q448j2322L123J3172L57p524
513A831k387l7L360L415l523k975P97m56K741K810m169m020m44L012N763j685
529D033p057m02J064R74O329q78r868j668O019N325j63r192n436R650Q357n136
$$ plain form
545 1951 -8041 -12226 -3002 7558 2786 -7321 -10543 -7727 2459 7422 -4098 -13692 -7462 2419
559 2419 5659 -3168 -13938 -8208 5846 5878 -5682 -13324 -7309 5250 5702 -5169 -9269 -6186 -305
574 -305 5221 -322 -8991 -5494 2545 3554 -1612 -7874 -5329 5569 6340 -4126 -8576 -2292 6372
589 6372 5049 -4686 -5729 2306 4747 1582 -2549 -4468 2223 8368 2626 -5074 -4969 2292 10224
604 10224 7022 -5936 -8328 3845 12625 6180 -7425 -8213 7250 14337 3637 -8277 -7321 5609
618 5609 15570 7085 -8419 -9647 3533 14932 10545 -6335 -12807 1870 16561 10911 -7195
631 -7195 -13640 2540 17749 10072 -8335 -13000 793 15525 12045 -5550 -13176 -2231 12162
644 12162 12787 -1631 -12772 -4610 11484 12897 -2236 -12935 -4741 11283 11900 -2579 -11799 -4819
$$ packed form
545A951r992m185R224J0560m772j0107l222K816J0186M963j1520r594O230R881
559B419L240q827j0770N730J4054L2j1560p642O015J2559M52j0871m100L083N881
574c05N526n543q669L497Q039J009n166o262K545J0898P71j0466m450O284Q664
589F372j323r735j043Q035K441l165m131j919O691O145n742p700J05P261P932
604A0224l202j2958k392J2173Q780o445j3605p88J5463P087j0700j1914R56J2930
618E609R961q485j5504j228J3180J1399m387j6880o472J4677J4691n650j8106
631g195o445J6180J5209p677j8407m665J3793J4732l480j7595p626J0945J4393
644A2162O25j4418j1141Q162J6094J413j5133j0699Q194J6024O17j4479r220O980
$$ plain form
658 -4819 8019 10218 344 -8392 -5645 3459 7903 2671 -5797 -6338 2146 7019 1781 -5954 -5396
673 -5396 2354 5673 800 -4780 -3931 732 2175 186 -1055 -1637 -2321 -1411 -338 376 -348 -2121 -2579
690 -2579 -1681 -812 -143 -852 -2867 -3184 -491 1445 -747 -5126 -5765 676 4792 -729 -7913 -6839 391
707 391 5026 511 -7181 -7067 -262 3649 1179 -5699 -7387 -1054 4313 1544 -5558 -8708 -2147 6402
723 6402 3238 -6579 -8471 -1615 4929 3317 -4799 -6997 -729 3409 1684 -2852 -5252 -797 4083
738 4083 2110 -2820 -4500 -808 4476 3535 -2888 -3581 1449 3666 1722 -2095 -1628 3781 4717 -733
754 -733 -2903 515 5038 5516 -13 -3664 731 6023 5579 526 -3689 268 8361 6892 -1526 -4751
770 -4751 887 9627 9355 -2299 -7448 719 10659 9875 -966 -8348 -527 10734 9787 -754 -8085
$$ packed form
658d819J2838K199r874q736K747R104M444n232q468n41Q484M873n238p735N58
673e396P750L319m873n580Q49M663J443j989j241n82o84R10J073P14p24j773m58
690b579Q98Q69O69p09k015l17K693J936k192m379o39O441M116n521p184J074P230
707C91M635m515p692J14O805L911k470o878j688O333N367k769p102l150O561Q549
723F402l164r817j892O856O544j612q116k198O268M138j725m536k400M455M880
738D083j973m930j680L692N284r41o423o93N030K217j944l817M67N409R36n450
754g33k170L418M523M78n529l651M395N292m44n053m215L957Q093j469q418l225
770d751N638Q740k72j1654n149Q167R940p84j0841p382P821J1261r47j0541p331
$$ plain form
785 -8085 -2441 10520 11811 -1538 -10042 -3446 9870 13229 -60 -11949 -5303 9099 12176 1305
799 1305 -10724 -6972 7510 11725 863 -10083 -7931 5459 12020 1335 -10982 -8632 3442
812 3442 10761 3246 -9749 -9790 2038 8638 2958 -7485 -9601 305 7414 2050 -6745 -8083 -1086
827 -1086 5965 2800 -6337 -7931 -1726 3823 2654 -3896 -6772 -2151 1948 1108 -2426 -4365 -2148
842 -2148 1226 -19 -2674 -2604 -1197 9 -252 -2144 -2038 -251 -847 -1908 -1103 -211 224 -1286 -3611
859 -3611 -1420 1875 1776 -1255 -3604 -2361 1818 2999 -903 -3714 -1971 2269 3324 -621 -4593 -2406
875 -2406 3054 4293 -206 -5058 -3380 2969 4723 92 -4003 -3059 1874 4132 571 -3590 -2417
890 -2417 2109 3663 705 -3357 -2514 1789 3653 724 -2743 -1905 1519 2879 434 -1739 -396 1598
$$ packed form
785h085N644J2961J291j3349q504O596J3316L359j3289j1889O646J4402L077j0871
799A305j2029L752J4482M215j0862j0946K152J3390O561j0685j2317K350J2074
812C442P319p515j2995m1J1828O600n680j0443k116R906P109n364q795j338O997
827a086P051l165r137j594O205N549j169o550k876M621M099q40l534j939K217
842b148L374j245k655P0J407J206k61j892J06J787n96j061Q05Q92M35j510k325
859c611K191L295r9l031k349J243M179J181l902k811J743M240J055l945l972K187
875b406N460J239m499m852J678O349J754m631m095R44M933K258l561m161J173
890b417M526J554k958m062Q43M303J864k929l467Q38L424J360k445k173J343J994
$$ plain form
906 1598 1399 -470 -1239 806 2632 929 -1461 -1072 1622 3135 1054 -1846 -1082 2858 3882 236
922 236 -3414 -1183 4402 5617 -144 -4911 -1842 5285 6772 454 -5649 -2695 5497 7748 979
937 979 -5764 -3540 5634 9091 1231 -6840 -4692 5838 10673 2580 -7967 -6132 5303 11079 3904
952 3904 -7370 -7325 3916 11033 4146 -6961 -7919 2737 11151 4992 -7388 -8742 1596 10364
966 10364 6034 -6643 -10313 374 9492 5772 -5222 -9783 -1456 8286 5461 -5091 -9078 -2413
980 -2413 6878 5608 -4583 -9446 -2769 5194 5301 -3204 -8760 -3812 4007 3618 -2641 -7104 -4021
995 -4021 2669 3028 -3039 -6031 -3254 1360 2447 -2341 -6019 -2769 1288 1168 -1797 -4197 -2118 976
1011 976 56 -2532 -2546 -808 831 7 -2983 -2377 600 1326 -399 -2054 -2267 977 2217 -730 -2586
$$ packed form
906A598j99j869p69K045J826j703k390L89K694J513k081k900P64L940J024l646
922B36l650K231N585J215n761m767L069P127J487o318o103K954Q192K251o769
937I79o743K224R174L457p860q071K148J0530M835q093j0547J835J1435N776p175
952C904j1274M5J1241P117o887j1107r58J0656Q414o159j2380j354J0338Q768
966A0364m330j2677l670J0687R118l720j0994m561Q327R742k825j0552l987O665
980b413R291j270j0191m863O677P963J07q505n556M948P819l89o259m463L083
995d021O690L59o067k992K777M614J087m788l678L250M057j20k965k400K079L094
1011I76r20k588j4J738J639q24k990O06K977P26j725j655k13L244J240k947j856
$$ plain form
1028 -2586 -647 1935 2466 -615 -3337 10 3168 2649 -265 -2653 -1321 3419 3667 117 -1792 -498
1044 -498 2623 4125 847 -2126 -421 3018 3762 1364 -1848 -654 2892 3553 1573 -332 -751 1490
1060 1490 3073 1745 376 568 630 1530 1917 378 56 781 949 1504 1257 584 41 -363 232 2542
1078 2542 1985 -773 -1913 -694 2735 3466 -397 -3754 -1534 2759 3518 -8 -4444 -2914 2720 4627
1094 4627 169 -4949 -4583 2364 6198 1120 -6248 -5880 1553 7164 2341 -6707 -6960 1544 6876 2843
1110 2843 -5762 -7502 569 7365 3633 -5694 -8219 -679 7714 5261 -5007 -9117 -1747 7464 6136
1125 6136 -4270 -9219 -1872 7064 5740 -3492 -8580 -2464 6454 6106 -2670 -8244 -3340 5588 6785
1140 6785 -1777 -7960 -3781 5033 6678 -1114 -7167 -3435 4618 5586 -1242 -6191 -2841 3805 4696
$$ packed form
1028b586J939K582N31l081k722L347L158n19k914k388J332M740K48l550j909J294
1044d98L121J502l278k973J705L439P44k398l212J194L546O61j980j905m19K241
1060A490J583j328j369J92O2R00L87j539l22P25J68N55k47o73n43m04N95K310
1078B542n57k758j140J219L429P31l863l357K220M293P59l526m436J530N634J907
1094D627m458n118L66O947L834n078p368L68P433N611m823r048k53Q504N332m033
1110B843q605j740Q071O796l732r327k525P540Q393k453j0268m110P370R211j328
1125F136j0406m949P347Q936j324r232n088O116Q918l48q776n574M904Q928J197
1140F785q562o183M179Q814J645p792o053L732Q053R68o828m949L350O646Q91
$$ plain form
1155 4696 -681 -5399 -2781 3195 4362 -444 -4667 -2630 2860 4033 -830 -4380 -1700 3232 3077
1170 3077 -1672 -4256 -662 3581 2535 -1770 -3578 -413 3567 2355 -1902 -3204 -54 3550 2694
1185 2694 -2089 -3932 342 4716 3002 -2406 -4275 509 5105 3073 -2494 -3809 613 4775 3175
1200 3175 -2246 -3827 373 4547 3681 -1679 -4339 -172 4711 4159 -1100 -4129 -1040 4302 4331 -868
1216 -868 -3677 -1140 3100 3929 -17 -3100 -1406 2269 3600 1039 -2326 -2403 1359 3317 1664 -1787
1232 -1787 -2754 7 2680 1599 -1029 -2037 -997 1167 2037 159 -1914 -2091 -273 2134 1335 -1919
1248 -1919 -3136 -1109 1979 2271 -1276 -4110 -2438 1271 2622 97 -4072 -3956 486 3473 785
1263 785 -3892 -4989 -108 4271 1607 -4133 -5558 -770 4545 2903 -3915 -6181 -1232 4144 3461
$$ packed form
1155D696n377m718K618N976J167m806m223K037N490J173m863l550K680M932j55
1170C077m749k584L594M243j046m305j808L165L980j212m257j302L150L604q56
1185B694m783j843M274M374j714n408j869M784M596k032n567j315M422M162j600
1200C175n421j581M200M174q66n360k660M167M883n52n259l029L089N342K9n199
1216h68k809K537M240Q29l946l083J694L675J331k561l365p7L762J958j653l451
1232a787r67K761K673j081k628j008J040K164Q70j878k073j77J818K407p99l254
1248a919j217K027L088K92l547k834J672L709J351k525m169J16M442K987k688
1263G85m677j097M881M379k664n740j425M788N315j642o818k266M949N376o83
$$ plain form
1278 3461 -2714 -6518 -2110 4360 4248 -1912 -6112 -2650 4335 4898 -1721 -6040 -2739 4180 5643
1293 5643 -755 -5776 -2519 3740 5209 90 -4893 -2780 3733 5287 24 -4483 -2490 3532 5376
1308 5376 456 -4266 -2162 3363 5174 434 -3832 -1922 3418 4502 247 -3192 -1379 3398 4302
1323 4302 -230 -3351 -920 3651 4049 -404 -3710 -834 3902 3619 -1012 -3860 -774 3964 3623 -1600
1339 -1600 -4243 -583 4325 3857 -2270 -5096 -984 4476 3886 -2262 -5541 -1284 4708 4108 -2319 -5749
1355 -5749 -1723 4665 4609 -2121 -6189 -2282 4386 4843 -1581 -6422 -2864 4079 5260 -1124 -6051 -3272
1371 -3272 3490 5154 -491 -5681 -3354 3000 5277 462 -4969 -3906 2255 5117 1233 -4194 -3996
1386 -3996 1274 4677 1754 -3589 -3907 694 3851 1983 -2408 -3310 143 2945 2352 -1162 -3160 -943
$$ packed form
1278C461o175l804M408O470j12o160m200L462O985N63o619m319L301O919J463
1293E643o398n021L257O259J469n119m983K113O513J554n263m507J993O022J844
1308E376m920m722K104N525J811m740m266J910N340J084m255l439J813M777R04
1323D302m532l121K431M571L98m453l306K876M736k83m631k848L086M738l41n223
1339a600k643L660M908m68o127k826M112N460n90o148l279M257N992o00o427l430
1355e749M026O388n6o730m068L907O668M57o424m841L558O943J181o384m927K779
1371c272O762J664n645n190K327O354K277m815n431J063O161K862l884n427J98
1386c996N270L403k923n343l18M601L157j868m391r02L453K802n93l514j998K217
$$ plain form
1402 -943 2497 2515 -387 -2430 -1476 1482 2359 319 -1510 -1463 357 1636 1009 -731 -1508 -505 954
1419 954 1555 -23 -1846 -1652 515 1895 880 -1712 -2277 19 1943 1375 -1166 -2644 -1057 1780
1435 1780 1914 -756 -2969 -1690 1664 2499 -710 -3478 -2143 1387 2822 -111 -3533 -2416 1173
1450 1173 2352 168 -2769 -2574 902 2647 265 -2627 -2477 695 2860 709 -2729 -2094 1053 2493
1466 2493 623 -2513 -1979 1200 2369 318 -1972 -1507 1358 2505 -91 -2399 -705 1994 2529 -4
1482 -4 -2488 -721 2430 2658 -359 -2646 -764 2958 2902 -844 -2905 -466 3339 3308 -983 -3682 -539
1499 -539 3852 3592 -775 -4099 -987 4134 4146 -1023 -4498 -1318 4101 4794 -1323 -5217 -1809 4199
1515 4199 4981 -662 -5528 -2513 4028 5286 -228 -5380 -3238 3477 5732 76 -5469 -3570 3049
$$ packed form
1402i43L440J8k902k043R54K958Q77k040j829M7J820J279o27j740p77J003J459
1419I54O01j578j823J94K167J380j015k592n65K296J924n68k541j478J587K837
1435A780J34k670k213J279L354Q35l209k768J335L530J435k933l422J117L589
1450A173J179k184k937J95L476J745k382k892J50L172K165k151l438O35L147J440
1466B493j870l136N34L179J169k051k290M65K865J147k596k308J694K699N35k533
1482dk484J767L151K28l017k287J882L722n6l746k061K439L805l1m291k699L143
1499e39M391k60m367l324L112N121J2n169l475L180N419O93o117l894L408O008
1515D199P82n643m866L015O541J258n514n152K142O715K255n656n545J899O619
$$ plain form
1530 3049 5769 559 -5496 -4034 2747 5259 1186 -4904 -4666 2024 5310 1502 -4349 -4470 1009
1545 1009 5147 1820 -3726 -4285 528 4340 2170 -2994 -3939 132 3632 2226 -1991 -3839 -467
1560 -467 3034 1931 -1506 -2902 -788 2433 1914 -935 -2310 -651 1627 1777 -425 -1931 -485 1104
1576 1104 1059 -153 -958 -592 713 792 -135 -417 -234 -57 -7 -275 -98 257 -166 -467 -293 118 209 -240
1596 -240 -1220 -445 783 533 -511 -1135 -681 738 972 -415 -1267 -1027 625 1045 -257 -1553 -1073 511
1614 511 971 -182 -1384 -970 661 1022 -196 -1068 -763 203 817 -154 -937 -606 135 492 -34 -593 -293
1633 -293 427 258 -456 -446 299 615 45 -681 -334 1070 1043 -200 -1246 -15 1597 1448 -393 -1699
1651 -1699 135 2046 1847 -438 -2085 -385 2516 2719 -248 -2649 -646 2885 3403 -203 -3111 -1102
$$ packed form
1530C049K720n210o055J462O781K512m073o090K38O690L286l808n851j21N479
1545A009M138l327n546n59M813L812k170n164r45M071L500j406m217j848L372
1560d67L501j103l437j396K114L221n19k849j375J659K278J50k202j506J446J589
1576A104m5j212q05L66J305P9r27k82J83J77N0k68J77L55m23l01J74M11R1m49
1596b40r80P75J228k50j044o24M54J419K34j387q52K40J652M20j302j296M80J584
1614E11M60j153j202M14J631L61j218q72L05R66O14r71p83L31P41L57n26n59L00
1633b93P20j69p14J0P45L16n70p26L47J404k7j243j046J231J612j49j841j306
1651a699J834J911j99k285j647J700K901K03k967k401K003L531N18l606k908K009
$$ plain form
1667 -1102 3015 3859 -163 -3640 -1747 2876 4223 393 -3514 -2262 2695 4778 790 -3904 -2847
1682 -2847 2303 4808 1104 -3947 -3349 1838 4905 1189 -3826 -3834 1222 4643 1566 -3508 -4041 507
1698 507 4381 1977 -3211 -4347 79 4009 2302 -2953 -4405 -425 3688 2168 -2539 -4052 -802
1713 -802 3054 1932 -2063 -3741 -908 2289 1905 -1753 -3185 -980 1951 1688 -1101 -2797 -948 1529
1729 1529 1313 -1198 -2269 -911 1213 836 -1030 -1728 -385 961 502 -897 -1170 21 1052 507
1745 507 -864 -764 600 1143 220 -1122 -682 982 1384 -122 -1170 -443 1209 1503 -54 -1231 -447
1762 -447 1261 1656 -113 -1381 -422 1373 1641 19 -1489 -650 1418 1845 145 -1551 -687 1212 1697
1779 1697 122 -1352 -695 939 1494 238 -1254 -761 674 1228 425 -679 -877 116 1030 336 -441
$$ packed form
1667a102M117Q44m022l477J893M623J347l830l907J252M957K083l988m694J057
1682b847N150K505l704n051N98N187L067l716n015qN056L421l077n074n33M548
1698E07L874k404n188j136M426L930j707n255j452L980M113j520m707j513L250
1713h02L856j122l995j678K833L197l84l658j432K205K931k63k789j696J849K477
1729A529k16k511j071J358K124l77j866o98J343J346m59j399k73J191J031n45
1745E07j371J00J364N43r23j342M40J664M02j506j048P27J652K94j557j177P84
1762d47J708L95j769j268R59J795K68j622j508Q39K068M27j700j696Q64J899M85
1779A697j575j474O57J634N55j256j492M93J435N54q03j104j98R93R14o94p77
$$ plain form
1796 -441 -655 -136 616 385 -181 -289 -330 -236 190 328 151 -488 -709 -151 645 540 -379 -1194 -445 898
1816 898 1117 -281 -1703 -777 1114 1831 -2 -1865 -1368 1013 2146 433 -2153 -1864 1007 2720
1832 2720 706 -2348 -2319 750 3116 1095 -2414 -2736 538 3336 1594 -2008 -3030 282 3475 2041
1848 2041 -2062 -3257 -92 3481 2401 -1614 -3351 -641 3109 2477 -1308 -3431 -880 2942 2764
1863 2764 -1274 -3138 -982 2517 2714 -953 -3416 -1184 2208 2409 -663 -2909 -1335 1628 2271 -603
1879 -603 -2641 -1248 1429 2030 -388 -2363 -1300 1202 1652 -616 -2056 -951 987 1092 -529 -2040
1895 -2040 -750 899 986 -640 -1493 -423 883 800 -1030 -1267 45 1007 557 -1113 -1466 285 1589
1912 1589 671 -1055 -1086 554 1555 609 -1316 -1211 705 1786 779 -1456 -1434 820 1977 811 -1408
$$ packed form
1796d41k14N19P52k31n66j08m1R4M26J38j77o39k21N58P96j05r19q15P49J343
1816H98K19j398j422R26J891P17j833j863M97K381J133j713k586K89K871J713
1832B720k014l054K9L069K366k021l509l22L274K798j742l602j022L312L193j434
1848B041m103j195L165L573j080m015j737K710L750o32l785k123K551L822j78
1863B764m038j864K156L499J97l667k463K232L392K01l072k246J574K963O43k874
1879f03k038J393K677O01k418j975J063K502M50k268j440J105J938J05j621j511
1895b040J290J649Q7j626q53J070J306q3j830k37J312R62m50j670l53J751J304
1912A589r18j726l1J640J001r46j925J05J916J081j007k235K2K254J157j166k219
$$ plain form
1929 -1408 -1468 700 2194 876 -1110 -1475 462 2070 1277 -947 -1417 302 2018 1245 -748 -1484 383
1946 383 1709 1196 -343 -1458 -195 1467 1256 -269 -837 -505 922 1089 -154 -922 -359 394 677
1963 677 392 -453 -530 156 455 405 -98 -600 -429 245 192 298 -245 -883 -605 317 703 2 -1250 -1105 233
1984 233 1213 171 -1264 -1505 240 1537 757 -1284 -1994 -106 1769 1316 -1192 -2372 -524 1860
2000 1860 1606 -1087 -2521 -704 2070 1997 -889 -2536 -1020 1811 2519 -691 -2738 -1190 1966 2453
2016 2453 -222 -2576 -1509 1754 2574 50 -2443 -1569 1285 2689 194 -2215 -1782 1284 2559 439
2032 439 -2117 -1639 1015 2186 580 -1869 -1680 984 1998 563 -1565 -1529 679 1690 300 -1649
2048 -1649 -1202 631 1432 120 -1462 -1079 773 1113 -5 -1314 -1000 786 1268 -424 -1498 -542 932
$$ packed form
1929a408o0K168J494j318j986l65J937J608p93k224m70J719J716p73j993p36J867
1946C83J326n13j539j115J263J662k11j525n68L32J427J67j243p68N63P53K83
1963F77k85q45p7O86K99n0n03n02J71O74n3J06n43o38K78R22L86p01j252J45J338
1984B33R80j042j435k41J745J297p80k041p10J888J875m53k508j180J848K384
2000A860k54k693j434J817K774p3k886j647J516K831P08l210k047J548L156M87
2016B453k675k354J067L263Q20k524k493Q74K854J404k495k409M33L066J275k120
2032D39k556M78K654J171j606k449J89K664J014j435k128L6K208J011j390j949
2048a649M47J833Q01j312j582L83J852L40j118j309L14J786M82j692j074R56J474
$$ plain form
2065 932 1275 -652 -1781 -186 1657 976 -414 -1816 -429 1632 770 -905 -1710 -422 1298 1467
2081 1467 -776 -1571 83 1523 1835 -694 -1620 -746 1589 1490 -701 -2085 -413 1864 1882 -323 -2341
2098 -2341 -1119 1633 2174 -90 -1813 -992 1273 2016 280 -1443 -1426 1120 1809 308 -912 -1230 655
2115 655 1695 680 -966 -812 505 1496 731 -782 -1404 -116 782 752 -469 -686 -111 718 634 154
2133 154 -510 -106 100 386 303 -103 -740 -200 947 787 349 -750 -524 90 781 467 -647 -660 14 874
2153 874 989 -736 -1610 -1407 610 1078 -327 -1509 -963 983 1173 -511 -2020 -1455 1001 1419 -399
2170 -399 -1984 -1355 998 2021 225 -1942 -1695 559 1899 771 -1669 -2012 381 1831 489 -1563
2186 -1563 -1830 150 1709 990 -1313 -1560 135 1833 853 -1349 -1631 250 1774 895 -1132 -1191 341
$$ packed form
2065I32L43j927j129J595J843o81j390j402J387K061q62j675q05J288J720J69
2081A467k243p95J654J440L12k529r26Q74K335r9k191j384J672K277J8k205k018
2098b341J222K752N41k264j723Q21K265P43j736j723J7K546O89j501j220l18J885
2115F55J040j015j646J54J317R91p65j513o22J288Q98l0j221k17N75Q29q4m80
2133A54o64M04K06K86q3m06o37N40J147j60m38j099K26O14O91l14j114j3O74Q60
2153H74J15j725q74K03K017M68j405j182N46J946J90j684j509N65K456M18j818
2170c99j585O29K353J023j796k167K47K254J340j128k440l43K393J450j342k052
2186a563k67J980J559p19k303k47J695J698r80k202k82J881J524q79k027n9J532
$$ plain form
2203 341 1553 592 -1069 -1270 63 1585 331 -1053 -910 565 1291 494 -1013 -1034 736 1525 159
2220 159 -1019 -836 881 1420 -24 -1488 -798 1247 1368 -119 -1623 -914 1107 1619 -34 -1654 -1066
2237 -1066 1100 1727 -190 -1999 -1128 1226 1958 -275 -2076 -1196 1077 2139 -30 -2186 -1381 1272
2253 1272 2031 179 -2091 -1482 933 2195 355 -1986 -1612 811 2288 987 -1670 -1905 555 2208
2269 2208 1111 -1459 -1840 213 2104 1214 -1011 -1731 108 1798 1381 -742 -1641 -281 1620 1440
2285 1440 -387 -1185 -250 1200 1294 89 -904 -351 830 1172 303 -722 -572 637 808 467 -355 -596
2303 -596 139 775 478 -9 -590 -240 312 483 139 -358 -481 -18 613 469 -168 -570 -212 248 712 -67
2323 -67 -1055 -655 276 599 224 -1080 -932 137 807 318 -937 -1190 -154 852 248 -857 -1399 -122
$$ packed form
2203C41J212r61j661k01J333J522j254j384J43J475P26p97j507k1J770P89j366
2220A59j178J83J717N39j444j464O90K045J21j487j504P09K021N12j653j620N88
2237a066K166O27j917j809Q71K354P32k233j801Q80K273J062k169k156Q05K653
2253A272P59j852k270O09K415J262j840k341L74K423J477j301k657k35K460J653
2269B208j097k570l81K053J891q90k225p20J839J690m17k123q99J360J901j80
2285A440j827p98R35J450R4j205r93N53J181L42q69j025J50J209J71l41q22k41
2303e96P35O36k97m87n81L50N52J71l44m97j23M63O31j44o37m02L58M60M64p79
2323f7r88M00R31L23l75j304J48J069O70m89j255k53J036J006o04j105n42J277
$$ plain form
2341 -122 1039 588 -724 -1343 -217 812 515 -743 -1409 -365 674 405 -644 -1181 -413 803 510
2358 510 -626 -1012 -189 637 335 -613 -848 -128 729 412 -829 -824 219 687 157 -981 -753 336 927
2377 927 43 -918 -652 614 1292 57 -1098 -773 761 1240 154 -1001 -852 693 1497 249 -1489
2394 -1489 -945 1061 1906 204 -1635 -1115 1097 1900 403 -1612 -1304 1081 2179 555 -1602 -1673 684
2411 684 2261 876 -1633 -1887 490 2459 888 -1676 -1917 335 2405 1281 -1461 -1857 394 2422
2427 2422 1226 -1266 -2131 -64 2097 1553 -878 -2065 -160 1894 1545 -729 -1929 -311 1572 1615
2443 1615 -343 -1718 -526 1274 1451 -159 -1392 -499 912 1469 34 -1105 -555 927 1064 76
2459 76 -876 -604 504 979 44 -588 -459 509 688 163 -247 -126 335 277 116 -251 -89 135 157 -8 -189
$$ packed form
2341a22J161m51j312o19J126J029k97j258o66J044J039k69j049n37P68J216k93
2358E10j136l86Q23Q26l02r48k35P20Q57l17j241NJ043M68n30j138K28J089N91
2377I27q84r61K66J266O78j235j155L25J534M79j086j155J49J545Q04j248j738
2394a489N44K006Q45j702j839N20K212Q03j497k015L08K385J098j624k157p1K357
2411F84J577j385k509k54K377J969j571k564k41K252K070j124k742l96K251K028
2427B422j196k492q65K067K161n44k431j187J905K054l49k274j200J618J883M3
2443A615j958j375J192J800J77j610j233Q93J411N57j435j139N50J482J37r88
2459G6r52K72J108M75r35o32J29R68J79n25m10J21M61n8j61l67J62K24K2j65j81
$$ plain form
2480 -189 -149 140 -74 -56 -183 134 170 -173 -376 88 31 14 -267 -595 -25 184 -177 -693 -611 53 176 -175
2502 -175 -387 -619 -148 120 111 -568 -731 -123 258 -352 -351 -536 -238 227 -22 -361 -474 -196 18 -116 -325
2523 -325 -250 17 -82 -315 -359 -257 154 15 -514 -318 9 259 -113 -449 -330 273 706 -53 -778 -377 292
2544 292 856 81 -1006 -546 647 1194 137 -1003 -640 706 1590 351 -1150 -844 756 1651 505
2561 505 -928 -1074 591 1738 836 -1106 -1448 499 2034 985 -876 -1569 342 2026 1178 -1058
$$ packed form
2480a89M0K89k14J8j27L17L6l43k03M64n7j7k81l28N70K09l61n16Q2O64J23l51
2502a75k12k32M71K68ro79j63O08L81o10Jj85K98M65k49l39j13K78K14j34k09
2523c25P5K67r9k33m4J02M11j39n29J96L27K50l72l36J19O03M33p59p25M01O69
2544B92N64p75j087M60J193N47j057j140L63J346Q84j239j501L06J600Q95j146
2561E05j433j46J665J147r02j942l42J947J535j049j861o93J911J684q48k236
$$ [...]
8191B13
##END NTUPLES=NMR FID
##END=
