##TITLE=1H_AM M300
 CDCl3, 8 sc, 
 3.06.2021
##JCAMPDX= 6.0         $$ Bruker NMR JCAMP-DX V2.0
##DATA TYPE= NMR FID
##DATA CLASS= NTUPLES
##ORIGIN= UXNMR, Bruker Analytische Messtechnik GmbH
##OWNER= root
$$ XWIN-NMR		Version 3.5
$$ Thu Jun  3 11:24:15 2021 Russian Standard Time (UT+4h)  she@DPX200
##.OBSERVE FREQUENCY= 200.131506
##.OBSERVE NUCLEUS= ^1H
##.DELAY= (6, 6)
##.ACQUISITION MODE= SIMULTANEOUS
##.ACQUISITION SCHEME= undefined
##.AVERAGES= 8
##.DIGITISER RES= 18
##SPECTROMETER/DATA SYSTEM= spect
##.PULSE SEQUENCE= zg30
##.SOLVENT NAME= CD3CN
##.SHIFT REFERENCE= (INTERNAL, CD3CN, 0, 15.7039)
##AUDIT TRAIL= $$ (NUMBER, WHEN, WHO, WHERE, WHAT)
$$ ##TITLE= Audit trail, XWIN-NMR		Version 3.5
$$ ##JCAMPDX= 5.01
$$ ##ORIGIN= Bruker BioSpin GmbH
$$ ##OWNER= she
$$ F:/spectra/data/she/nmr/H-F/1/audita.txt
$$ ##AUDIT TRAIL=  $$ (NUMBER, WHEN, WHO, WHERE, WHAT)
(   1,<2021-06-03 11:23:06.18 +0400>,<she>,<DPX200>,
      <created by zg, POWCHK disabled, PULCHK disabled
       configuration hash MD5:
       00 E9 B6 7A A2 85 ED C7 34 08 36 98 17 FE 4E 26
       data hash MD5: 16K
       F5 9F 73 23 C7 A1 E2 37 5F 3C 8B 7E E2 0C 6C 44>)
$$ ##END=
$$ 
$$ hash MD5
$$ 6A D7 8E CC 6D 92 FD 14 49 D4 78 5F 3D 44 97 84
##$RELAX= 
##$RELAX= 
##$RELAX= 
##$RELAX= 
##$RELAX= 
##$RELAX= 
$$ Bruker specific parameters
$$ --------------------------
##$DU= <F:/spectra>
##$EXPNO= 1
##$NAME= <H-F>
##$PROCNO= 1
##$TYPE= <nmr>
##$USER= <she>
##$AMP= (0..31)
100 100 100 100 100 100 100 100 100 100 100 100 100 100 100 100 100 100 
100 100 100 100 100 100 100 100 100 100 100 100 100 100 
##$AQSEQ= 0
##$AQ_mod= 1
##$AUNM= <au_zg>
##$AUTOPOS= <>
##$BF1= 200.13
##$BF2= 200.13
##$BF3= 200.13
##$BF4= 200.13
##$BF5= 200.13
##$BF6= 200.13
##$BF7= 200.13
##$BF8= 200.13
##$BYTORDA= 1
##$CFDGTYP= 0
##$CFRGTYP= 5
##$CHEMSTR= <none>
##$CNST= (0..31)
1 1 145 1 1 1 1 1 1 1 1 1 1 1 1 1 1 1 1 1 1 1 1 1 1 1 1 1 1 1 1 1 
##$CPDPRG= <>
##$CPDPRG1= <>
##$CPDPRG2= <>
##$CPDPRG3= <>
##$CPDPRG4= <mlev>
##$CPDPRG5= <mlev>
##$CPDPRG6= <mlev>
##$CPDPRG7= <mlev>
##$CPDPRG8= <mlev>
##$CPDPRGB= <>
##$CPDPRGT= <>
##$D= (0..31)
0 1.2 0 0 0 0 0 0 0 0.06 0 0.03 0 0 0 0 0.0002 0 0 0 0 0 0 0 0 0 0 0 0 
0 0 0 
##$DATE= 1622704985
##$DBL= (0..7)
120 120 120 120 120 120 120 120 
##$DBP= (0..7)
150 150 150 150 150 150 150 150 
##$DBP07= 0
##$DBPNAM0= <>
##$DBPNAM1= <>
##$DBPNAM2= <>
##$DBPNAM3= <>
##$DBPNAM4= <>
##$DBPNAM5= <>
##$DBPNAM6= <>
##$DBPNAM7= <>
##$DBPOAL= (0..7)
0.5 0.5 0.5 0.5 0.5 0.5 0.5 0.5 
##$DBPOFFS= (0..7)
0 0 0 0 0 0 0 0 
##$DE= 6
##$DECBNUC= <off>
##$DECIM= 32
##$DECNUC= <off>
##$DECSTAT= 4
##$DIGMOD= 1
##$DIGTYP= 9
##$DL= (0..7)
0 120 120 120 120 120 120 120 
##$DP= (0..7)
150 150 150 150 150 150 150 150 
##$DP07= 0
##$DPNAME0= <>
##$DPNAME1= <>
##$DPNAME2= <>
##$DPNAME3= <>
##$DPNAME4= <>
##$DPNAME5= <>
##$DPNAME6= <>
##$DPNAME7= <>
##$DPOAL= (0..7)
0.5 0.5 0.5 0.5 0.5 0.5 0.5 0.5 
##$DPOFFS= (0..7)
0 0 0 0 0 0 0 0 
##$DQDMODE= 0
##$DR= 18
##$DS= 0
##$DSLIST= <SSSSSSSSSSSSSSS>
$$ [...]
##$SUBNAM2= <"">
##$SUBNAM3= <"">
##$SUBNAM4= <"">
##$SUBNAM5= <"">
##$SUBNAM6= <"">
##$SUBNAM7= <"">
##$SUBNAM8= <"">
##$SUBNAM9= <"">
##$SW= 20.0188882624521
##$SWIBOX= (0..15)
0 0 2 0 0 0 0 0 0 0 0 0 0 0 0 0 
##$SW_h= 4006.41025641026
##$TD= 16384
##$TD0= 1
##$TE= 0
##$TE2= 300
##$TE3= 300
##$TEG= 300
##$TL= (0..7)
0 120 120 120 120 120 120 120 
##$TP= (0..7)
150 150 150 150 150 150 150 150 
##$TP07= 0
##$TPNAME0= <>
##$TPNAME1= <>
##$TPNAME2= <>
##$TPNAME3= <>
##$TPNAME4= <>
##$TPNAME5= <>
##$TPNAME6= <>
##$TPNAME7= <>
##$TPOAL= (0..7)
0.5 0.5 0.5 0.5 0.5 0.5 0.5 0.5 
##$TPOFFS= (0..7)
0 0 0 0 0 0 0 0 
##$TUNHIN= 0
##$TUNHOUT= 0
##$TUNXOUT= 0
##$USERA1= <user>
##$USERA2= <user>
##$USERA3= <user>
##$USERA4= <user>
##$USERA5= <user>
##$V9= 5
##$VALIST= <valist>
##$VCLIST= <CCCCCCCCCCCCCCC>
##$VD= 0
##$VDLIST= <DDDDDDDDDDDDDDD>
##$VPLIST= <PPPPPPPPPPPPPPP>
##$VTLIST= <TTTTTTTTTTTTTTT>
##$WBST= 1024
##$WBSW= 4
##$XGAIN= (0..3)
0 0 0 0 
##$XL= 0
##$YL= 0
##$YMAX_a= 191885
##$YMIN_a= -114644
##$ZGOPTNS= <>
##$ZL1= 120
##$ZL2= 120
##$ZL3= 120
##$ZL4= 120
##$ABSF1= 10
##$ABSF2= 0
##$ABSG= 5
##$ABSL= 3
##$ALPHA= 0
##$AQORDER= 0
##$ASSFAC= 0
##$ASSFACI= 0
##$ASSFACX= 0
##$ASSWID= 0
##$AUNMP= <proc_1d>
##$AZFE= 0.1
##$AZFW= 0.1
##$BCFW= 1
##$BC_mod= 2
##$BYTORDP= 1
##$COROFFS= 0
##$CY= 11.3945322036743
##$DATMOD= 1
##$DC= 2
##$DFILT= <>
##$DTYPP= 0
##$F1P= 15.9154993809931
##$F2P= -4.1035820241983
##$FCOR= 0.5
##$FTSIZE= 0
##$FT_mod= 4
##$GAMMA= 1
##$GB= 0.15
##$INTBC= 1
##$INTSCL= 1
##$ISEN= 128
##$LB= 0.24
##$LEV0= 0
##$LPBIN= 0
##$MAXI= 10000
##$MC2= 0
##$MEAN= 0
##$ME_mod= 0
##$MI= 1.114404
##$NCOEF= 0
##$NC_proc= 0
##$NLEV= 6
##$NOISF1= 3.799351
##$NOISF2= 2.8
##$NSP= 1
##$NTH_PI= 0
##$NZP= 0
##$OFFSET= 15.70392
##$PC= 1
##$PHC0= -11476.22
##$PHC1= 7.000984
##$PH_mod= 1
##$PKNL= yes
##$PPARMOD= 0
##$PSCAL= 0
##$PSIGN= 0
##$REVERSE= no
##$SF= 200.130013532006
##$SI= 16384
##$SIGF1= 3
##$SIGF2= 2
##$SINO= 400
##$SIOLD= 16384
##$SREGLST= <1H.CDCl3>
##$SSB= 0
##$STSI= 0
##$STSR= 0
##$SW_p= 3612.71676300578
##$SYMM= 0
##$S_DEV= 0
##$TDeff= 0
##$TDoff= 0
##$TI= <>
##$TILT= no
##$TM1= 0
##$TM2= 0
##$TOPLEV= 0
##$USERP1= <user>
##$USERP2= <user>
##$USERP3= <user>
##$USERP4= <user>
##$USERP5= <user>
##$WDW= 1
##$XDIM= 8192
##$YMAX_p= 0
##$YMIN_p= 0
$$ End of Bruker specific parameters
$$ ---------------------------------
##NTUPLES= NMR FID
##VAR_NAME=  TIME,          FID/REAL,        FID/IMAG
##SYMBOL=    X,             R,               I
##VAR_TYPE=  INDEPENDENT,   DEPENDENT,       DEPENDENT
##VAR_FORM=  AFFN,          ASDF,            ASDF
##VAR_DIM=   8192,          8192,            8192
##UNITS=     SECONDS,       ARBITRARY UNITS, ARBITRARY UNITS
##FACTOR=    0.0002496,     1,               1
##FIRST=     0,             0,               0
##LAST=      2.0444736,     0,               0
##MIN=       0,             -114644,         0
##MAX=       2.0444736,     191885,          0
$$ Real data points
##PAGE= N=1
##DATA TABLE= (X++(R..R)), XYDATA
0@%%%%%%%%%%%%%%qJ6j6J6j6K4l2L2m0M8n6O6p4Q8j04J20j36J52j70J94k23K49
36A30k76L12l51L94m40M88n38N94o60P29q04Q87r77J076j186J308j440J587j756
55i23J946k159K402k685L020l420L911m528N329o420P993j0482J5024k5935J00808
70H3881J08004j94774p9402Q6398J11210j8585p5876l2213M3564L0615J6335j6607
82F2550n7245j9458P9473N7118m7222r3271j0692R5332O4377o9292p6299K1409
94F780N4752J0690k6637k9353N784K2095Q768o926k8584k5523L5351M8111k4307
107E1001o0637p399M7637K7869l6471l4904K6108K5572k4961k4877R118K0459
119A8515Q853j5260k4244m566J4973J7798l25k6466j7050K1309K2848j5173l3703
$$ plain form
0 0 0 0 0 0 0 0 0 0 0 0 0 0 0 0 -8 8 -8 8 -8 16 -16 16 -24 24 -32 34 -40 48 -56 64 -72 80 -90 104 -119 130
36 130 -146 166 -185 209 -231 257 -281 313 -347 382 -422 465 -512 564 -622 686 -754 833 -923
55 -923 1023 -1136 1266 -1419 1601 -1819 2092 -2436 2893 -3527 4466 -6016 9008 -16927 83881
70 83881 191885 -2889 -82291 4107 115317 96732 20856 -11357 32207 62822 79157 62550
82 62550 5305 -14153 65320 122438 75216 -18055 -28747 66585 130962 61670 -14629 6780
94 6780 61532 72222 45585 16232 22016 44111 52879 45953 17369 -8154 27197 75308 51001
107 51001 -9636 -17035 30602 58471 22000 -12904 13204 38776 13815 -11062 -1944 18515
119 18515 27368 12108 -12136 -16702 -1729 16069 15744 -10722 -27772 -6463 16385 1212 -32491
132c2491k692M0436K4578l8901m6934J3695M6695J7902k7222l7840l451L1643
144a4582K3988j1542l2840j2322L0195L2102j8480m5685n972M4371L4749k3486
156D96n0475q386M0895L2210j1941l5761j4292K3407K7859n234k7628j0698K2544
169a7004K5233q678l2396r381K7812K6069q515k7828q964J8053J6242m129j1222
182a4708n50Q238L184p243p081P213J4742J309j4718j0365R108J6364P56j5780
196i531n432J5625J2478j1707k0559K545K6789J6826j8109l1186k954L1204K7001
209C2990j2860l5795r754L0329K8802j3304l7091p227L6218L0734j9836m5246
221b2040q770M1859L9012j4815n0311j9229L6427M4019n463m5784k4022L0519
$$ plain form
132 -32491 -35183 5253 29831 -9070 -56004 -42309 4386 22288 -4934 -42774 -46225 -14582
144 -14582 9406 -2136 -34976 -47298 -17103 14999 -3481 -49166 -55138 -10767 23982 496
156 496 -49979 -58365 -17470 14740 2799 -32962 -47254 -23847 4012 -1222 -28850 -39548 -17004
169 -17004 8229 -449 -32845 -42226 -14414 11655 3140 -24688 -33652 -15599 643 -3486 -14708
182 -14708 -15258 -7020 -3836 -11079 -18160 -10947 3795 5104 -9614 -19979 -10871 5493 6249 -9531
196 -9531 -14963 662 13140 1433 -19126 -16581 10208 27034 8925 -22261 -25215 5989 32990
209 32990 20130 -15665 -25419 4910 33712 20408 -16683 -23910 12308 43042 23206 -22040
221 -22040 -30810 11049 50061 35246 -15065 -34294 2133 46152 40689 -5095 -29117 1402
233A402M2331n369m5309k1760L3026M4266o024m8612k6678L0507M6841K474m2863
246D232l0753J9118M0781P233l2638k6328J5812L3409L257l1450k2318J8089L3492
259C1936K744l1065k3019J3067K9113O215k1992j7924P932J8366R84j6247q255
272h145J2379J3655o556j9388n820J6252J5797p717j8997m725J3972J0161q753
285B115j4581K738J7140M989j7850j8355Q032K5445R466k2027k5460M889K8090
298D631J2794j9528k4366M673K6175R832k1994k3379Q952L0967J0347k5998k8941
311c5835O134L3869J7870k1470l1422J02K8735J8278j5782k6286P9K6214J4487
324A4973j6788k5046J189K6720J7452j5123k6884l725K2702J9382p751k1179n954
$$ plain form
233 1402 43733 38364 -6945 -28705 4321 48587 42563 -6049 -32727 -2220 44621 47095 4232
246 4232 -26521 -7403 33378 40611 7973 -18355 -2543 30866 34123 2673 -19645 -1556 31936
259 31936 34680 3615 -19404 -6337 22776 28991 6999 -10925 -2993 15373 16357 110 -8145
272 -8145 4234 17889 11333 -8055 -13875 2377 18174 10457 -8540 -13265 707 10868 2115
285 2115 -12466 -9728 7412 12401 -5449 -23804 -15772 9673 19139 -2888 -28348 -23459 4631
298 4631 17425 -2103 -26469 -21796 4379 14211 -7783 -31162 -22210 8757 19104 -6894 -35835
311 -35835 -29701 4168 22038 568 -30854 -30752 -2017 16261 479 -25807 -25728 486 14973
324 14973 -1815 -26861 -25672 1048 18500 3377 -23507 -27232 -4530 14852 7101 -14078 -20032
337b0032J4693J3159n651j3481r87J3089P538q412j1742J127J2197P149o129q872
351f354N20O530J589l916m37O202L204p574r225L433J4083O860j0745j4442J974
366h298J6105P512j1700j3843M726J8349N781j7354j8197Q206K5858R802k1316
379E631k5485M245K9222J6075j8409k7977K56K7694J7187j7597k8015J139K9660
392A3626J7834j9389l1986j518L2330K3900j6287l4895p104K7903K5624j0414
404A9624l0865q223K3640K1958j0113k7951o698K3608K2457r629k8699r385K1048
417G72K2730m676k4445j1003J5281J8097l377j8292o062J3385J2836p092j6649
430h495l120J5163J2008p199j6216l337J2178R797n879j1427O45J0399K947j0558
$$ plain form
337 -20032 -5339 7820 2169 -11312 -12299 790 8328 -84 -11826 -10699 1498 8647 2518 -6354
351 -6354 -5834 696 2285 -1631 -2068 4134 7338 -236 -9461 -6028 8055 14915 4170 -10272 -8298
366 -8298 7807 15319 3619 -10224 -5498 12851 18632 1278 -16919 -8713 17145 26947 5631
379 5631 -19854 -15609 13613 29688 11279 -16698 -16442 11252 28439 10842 -17173 -16034 13626
392 13626 31460 12071 -19915 -21433 10897 34797 18510 -16385 -23489 4414 30038 19624
404 19624 -11241 -19464 4176 26134 16021 -11930 -18628 4980 27437 17808 -10891 -20276 772
417 772 23502 18826 -5619 -16622 -1341 16756 13379 -4913 -10975 2410 15246 8154 -8495
430 -8495 -11615 3548 15556 8357 -7859 -11196 982 10779 4900 -6527 -5882 4517 7464 -3094
444c094r027P225J5136O26j5782j2352Q304J8154K913j6484j2763Q578J6851O12
458H897j7647j0959J2989J9651j874k2817j4096J4677K5378K045k4421j8619J1392
471a5404K5013N335k0765j7567R770K2724L993k0972j7057J1289K5035N149k1887
484e344k0892Q000K6418R993j7941k0584L236K0915R765j3247j5911L642J7259
497E309O389j2495j4282L927J6966P876j0609j4351O6J3190Q358n794q947J17
511d280O762K578m332l294M523N597k225o739j823N966N789l042n788J229N542
526F463Q33o314m602O328J0737j044j3457q267Q526J5569K354j5251j2258P711
540b672J6032K803j4556j1804Q596J7479J096j7986j3714R634K2337N040k0568
$$ plain form
444 -3094 -12121 -4896 10240 10866 -4916 -17268 -8964 9190 12103 -4381 -17144 -8566 8285 8897
458 8897 -8750 -19709 -6720 12931 11057 -11760 -25856 -11179 14199 16244 -8177 -26796 -15404
471 -15404 9609 14944 -5821 -23388 -13618 9106 13099 -7873 -24930 -13641 11394 16543 -5344
484 -5344 -26236 -18236 8182 18175 234 -20350 -17114 3801 13566 319 -15592 -11950 5309
497 5309 11698 -797 -15079 -11152 5814 13690 3081 -11270 -11204 1986 10344 4550 -4397 -4280
511 -4280 2482 5060 728 -2566 1957 7554 5329 -1410 -3233 2733 8522 5480 -308 921 6463
526 6463 7296 982 -3620 2708 13445 12401 -1056 -9323 -797 14772 17126 1875 -10383 -2672
540 -2672 13360 16163 1607 -10197 -1601 15878 16974 -1012 -14726 -5092 17245 22285 1717
553A717j9056P086K3441R195j7255k0648M170K2174Q234j6297j8174M679K2051
566A1317Q361j7376k0151L435K2730J1952j4606k1273k40J8801J2277r781j7605
579a2159o89J5833Q710j0577j4499J973J5493P874j1078j4623J457J3637P835
592I187p628j1504P53R761L545o894o521M163R404J4j1087n819P849J1060p14
607E569j1847o188Q182R754k597j1044k911J0597R064o599j4473j544J4583J2497
621A3043o844j8662n341J5673J5480n252j8370o244J4685J5264o436j8835m998
634a6837J7123J6277p204k1901p339J7724J9409l419k1923j1167J3753J9446r58
647A2984j8199r952J1096J7272j489j7656r517J1878J7799R2j7920j1621R145
$$ plain form
553 1717 -17339 -10253 13188 22383 5128 -15520 -11350 10824 19058 2761 -15413 -10734 11317
566 11317 19678 2302 -17849 -14414 8316 20268 5662 -15611 -15851 2950 15227 5446 -12159
579 -12159 -12848 2985 11695 1118 -13381 -11408 4085 11959 881 -13742 -12285 1352 9187
592 9187 1559 -9945 -9192 569 4114 -2780 -9301 -5138 4266 4280 -6807 -12626 -4777 6283 5569
607 5569 -6278 -12466 -4284 5470 2873 -8171 -11082 -485 8579 1980 -12493 -14037 546 13043
621 13043 6199 -12463 -17804 -2131 13349 8097 -10273 -16517 -1832 13432 6996 -11839 -16837
634 -16837 286 16563 9359 -12542 -19881 -2157 17252 13833 -8090 -19257 -5504 13942 12984
647 12984 -5215 -15167 -4071 13201 11712 -5944 -15461 -3583 14216 14308 -3612 -15233 -6088
660f088J7269L455j3484j1503M969J2981K652r237p154M982R513K99r214n094
674e654N348Q687N41p249n093L163N174N26k931r48K434O90l656k825L805O253
690H265L7p304n229M567P847K23q021m034O153P328l183j0251k926J0276R964
705A3712m492j4394n731J0958J3469j424j4822q735Q538J4071k22j4304p867R020
719b223J4096j375j6022r251J0481J7132K3j7125j2272Q440J6723L532j3675j2277
733a3793N425J3976K789j1820r938O030J3757K056j2947j0261N638J3831L804
746H547j0858j0724L468J0915L225p341o710L191P941J29p843l829N534Q076j316
761B405q812l563N830O832j427o937j820O055M013m651o207K038Q845L808p745
$$ plain form
660 -6088 11181 14636 1152 -10351 -5382 7599 10251 1014 -6140 -1158 8355 8654 -560 -5654
674 -5654 -306 8381 8922 1673 -3420 -257 4917 5443 2512 1564 3998 4688 1032 -1793 2012 8265
690 8265 8302 998 -4231 336 8183 8406 385 -3649 2504 9832 6649 -3602 -6528 3748 13712
705 13712 9220 -5174 -10905 53 13522 12098 -2724 -11459 -2921 11150 10928 -3376 -11243 -2223
719 -2223 11873 10498 -5524 -14775 -4294 12838 12861 -4264 -16536 -8096 8627 12159 -1516 -13793
733 -13793 -8368 5608 8397 -3423 -13361 -7331 6426 8482 -4465 -14726 -9088 4743 8547
746 8547 -2311 -13035 -9567 1348 4573 -2768 -9478 -6287 1654 1783 -6060 -9889 -4355 3721 2405
761 2405 -6407 -9970 -4140 2692 1265 -5672 -7492 -1437 2576 -2075 -8282 -6244 2601 6409 -1336
776a336r806K419J2210N653q293j0762J320J1952O123q959j0871L061J3801N587
790A2099j1837j3075L965J6440P906j1477j6219O03J6734J0620r167j5980q56
803a0244J5006J0154r119j5320m82J6049J0665r266j7319k107J6059J2856o798
816A0134j6493m760J2472J1885l976j3137m212R791J0008m203j2056l051R684
829B086R606l371j1609m508P706Q908j004q024m138M461N145j338m876m70M308
844B882K451l605m820J324N053J931l850l304J386L579l75m031n28M528L388l774
860B235p368l1P883N745m060r470k192P980P642l825r568j646Q626O714n325j0843
876g503j079J1103Q571n869j3381l286J1079J1311l611j3231n262R166J0411k343
$$ plain form
776 -1336 -11142 -8723 3487 9140 847 -9915 -8595 3357 9480 521 -10350 -7289 6512 12099
790 12099 262 -12813 -8848 7592 15498 4021 -12198 -11595 5139 15759 6592 -9388 -10244
803 -10244 4762 14916 5797 -9523 -10005 6044 16709 7443 -9876 -11983 4076 16932 10134
816 10134 -6359 -11119 1353 13238 9262 -3875 -8087 1704 11712 7509 -4547 -7598 2086
829 2086 11692 8321 -3288 -7796 -90 8818 7814 -210 -4348 113 5258 3920 -956 -1426 2882
844 2882 5333 1728 -3092 -1768 3285 5216 1366 -1938 -552 3027 2652 -1379 -1907 2621 6009 2235
860 2235 -5133 -5164 2719 8464 4404 -5066 -7258 722 8364 4539 -5029 -6675 1951 8665 3340 -7503
876 -7503 -8582 2521 11092 5223 -8158 -11444 -365 10946 7335 -5896 -11158 -1992 8419 6076
890F076j1374m641Q717R644k976j2266m931R337J1329j774j2516o470O836J0660
904E651O67r503n885M783P798l55p695l435N589O701j770q044l323O001O663j131
920B712o761k706L960M190j730m151P91M261J424n187l937K921O742J376o302
935b397n301L160P234R16o215m263M416P249j070q576m597P354J0203q27j1380
950d094p086P159J2179J388j1396q374N725J2566J360j1218q201O754J2754J586
964A1102j2688r801O459J4864L717j2219j2367N158J3930N203r970j1607K710
977e509J2594M962r191j0651K964J2503M810r157j0999J418J2054O569o806j0566
991e005o53Q982N899m780p595J48O856L631m943o137R48O670K979m613n552L60
$$ plain form
890 6076 -5298 -9939 -1222 8422 5446 -6820 -11751 -2414 8915 7141 -5375 -11845 -5009 5651
904 5651 6318 -3185 -9070 -4287 3511 3156 -4539 -7974 -2385 4316 2546 -5498 -8821 -2820 3843 2712
920 2712 -4049 -6755 -2795 1395 -335 -4486 -3695 566 1990 -3197 -7134 -4213 2529 3905 -2397
935 -2397 -7698 -4538 2696 3612 -2603 -6866 -2450 4799 3729 -4847 -9444 -2090 8113 7286 -4094
950 -4094 -11180 -4021 8158 9546 -1850 -10224 -4499 8067 9427 -1791 -9992 -3238 9516 11102
964 11102 -1586 -11387 -4928 9936 13653 1434 -10933 -5775 8155 13358 3388 -8219 -5509
977 -5509 7085 12047 2856 -7795 -4831 7672 12482 3325 -7674 -6256 5798 12367 5561 -5005
991 -5005 -5658 3324 9223 4443 -3152 -3004 3852 7483 2540 -3597 -2649 4021 7000 2387 -3165 -2805
1007b805M933K508k986l037J017K674m74l739k92L744K760k760n363k76M925L803
1023D632l045n691K6N460K727m372n560J610P726K598p044p399J689R495M957
1038G809o546r617J31R481N836n623r146K14R083N455o594r360M60J0420O466
1053H469o215j0793j173R646P850l868r912k859P725O824k888q288j560O753O099
1068E810l479p983j566O875O007k401p523k236N201N058j282m828j321L310K453
1083B095k005l463J148M029J130l598l482J496M340J092l225k430K336L042j476
1098A029l766o09N115L687l412o609j083O930N666k949p715k214O394O685l080
1113D069q034j751P506O348l794r816j934R252Q530l810j1678l838Q594J0201
$$ plain form
1007 -2805 2128 4636 1650 -1387 -370 2304 1830 -1909 -2201 1543 4303 1543 -3820 -4096 829 4632
1023 4632 1587 -4104 -4078 1382 4109 -263 -5823 -4213 3513 6111 -933 -8332 -6643 2852 7809
1038 7809 1263 -8354 -8223 1258 7094 1471 -7675 -7461 1622 7077 483 -8877 -8417 2003 8469
1053 8469 2254 -8539 -9712 -66 7784 3916 -5996 -8855 -1130 5694 2806 -5482 -7042 -289 5810
1068 5810 2331 -5652 -7218 -343 5664 3263 -4260 -6496 -1295 3763 2481 -2347 -3668 -358 2095
1083 2095 90 -3373 -2225 1804 2934 -664 -4146 -2650 1690 2782 -443 -2873 -537 2505 1029
1098 1029 -2737 -3346 1769 5456 2044 -4565 -5648 1282 6948 3999 -3716 -5930 464 7149 4069
1113 4069 -3965 -5716 1790 8138 4344 -5472 -7406 1846 10376 6566 -5112 -8950 -356 9845
1127I845j933j0934n094P155R823j558j0221m829P446J0197j723j1302n958P591
1141a495J0852P5j0522p202N220R901J296q168o086L894Q048Q04p320n152M121
1156a734P938O08p452n322L139P183J599n449m545J614M895N43l609k021K353
1171b60K848j264m033j003L867K773j726m167m15L197K465k548l004R88M082M23
1187B223m685l399L061N963O25n973n070K876P206J463o135n010K601P056J153
1202C955o590m992L734P962J414p968o718L614R263L464p435p805K010Q663L631
1217F202n976o954J397Q074L372o081o645J557Q294L818n652p504M11P675M489
1232F477l764o405p04N576L526k912m520M34M486K347l455l916J044M322J934
$$ plain form
1127 9845 7912 -3022 -8116 -961 8862 7304 -2917 -7746 -300 9897 8174 -3128 -9086 -1495
1141 -1495 9357 9432 -1090 -8292 -3072 6829 8125 -43 -6129 -2235 5813 6617 -703 -5855 -1734
1156 -1734 6204 6812 -640 -5962 -2823 4360 5959 510 -4035 -2421 2474 3017 -592 -2613 -260
1171 -260 2588 1324 -2709 -3712 155 2928 1202 -2965 -3380 -183 2282 -266 -3270 -2282 1800 2223
1187 2223 -2462 -5861 -2800 3163 3788 -2185 -7255 -4379 2827 4290 -1845 -6855 -4254 2802 3955
1202 3955 -2635 -7627 -3893 4069 5483 -2485 -9203 -5589 3674 7138 -297 -8102 -6092 2571 6202
1217 6202 226 -6728 -5331 2743 6115 34 -6611 -5054 3240 7058 1406 -6098 -5687 1988 6477
1232 6477 2713 -3692 -4396 1180 4706 1794 -2726 -2292 2194 4541 1086 -2830 -1786 2536 4470
1247D470k528l744N81L009P98j486j279J376J542j302k721K17L397K106k392l830
1263a786k86M344K261k977l965J180M348J521m352m511K034O539K284n646o757
1278e769J437P919L932n395p237J53P360M453n027p216M20P750M641n709q578
1293f866K92R119N927n367r294j672Q522O896l586q638k309O930O186k934q098
1308d892j480O965N864l192q183k252O536O610j677p444l187M710N701q73n659
1323b453j873L624L976j622m835n61L939L453k291m331o12L303K829j444l073
1338a971k19K719J058k520j770J818L385k88m354k213K881M699k87m760k577L093
1354a306M224n76n030j783M262M654j979o285k331N276O425j438p556l679N152
$$ plain form
1247 4470 1942 -1802 -1221 1788 2586 1100 -179 1197 2739 1437 -1284 -1067 2330 4436 2044 -1786
1263 -1786 -2072 2272 4533 1556 -2409 -1229 3119 4640 288 -4223 -2189 4350 6634 988 -5769
1278 -5769 -4332 3587 7519 2124 -5113 -4960 2400 6853 1826 -5390 -4970 2780 7421 1712 -6866
1293 -6866 -6574 2545 8472 3105 -6189 -7861 661 7557 3971 -4667 -6976 -46 6140 3206 -4892
1308 -4892 -6372 593 6457 3265 -4918 -7170 -634 5976 4299 -3145 -6332 -1622 4079 3206 -2453
1323 -2453 -4326 -702 3274 1652 -3183 -3744 195 3648 1357 -2974 -3586 -283 2546 1102 -1971
1338 -1971 -2190 529 1587 -933 -2703 -885 2500 2212 -2142 -4355 -1474 3225 2938 -1822 -4399 -1306
1354 -1306 2918 2342 -2688 -4471 -209 4445 2466 -3819 -6150 -874 5551 4113 -3443 -7122 -1970
1369a970O841q4p027m170M443O672n18o817m020M991P267j99p689m849M272P862
1385E005Q09o061n832L233O097J466m822m412K065N853Q06m585l815K175N578
1400C560J278m561m337J601M939J963l601k886Q20K533R28j876j388J648J422
1415B043o35k647k2J648K486j102j899k4J857L38j725j391J137K392K45l509j604
1432b412K014M441M12m714m361L060M296P65m068l196K723M715L58n288l289L175
1448a369N780J038o376m857K299P541J877n751n823J823O989K066n140n656K135
1463c424O778K210n830n831J770P178L073n080o454Q14O233L464l788n460K48
1478d099M977K867l292m598Q15M928K224l459m417M90M716K382k683l521l1L319
$$ plain form
1369 -1970 4871 4787 -2240 -6410 -1967 4705 4187 -2630 -6650 -1659 5608 5409 -2280 -7129 -2857 5005
1385 5005 5814 -247 -6079 -2846 3251 4717 -105 -4517 -2452 3401 4207 -378 -4193 -2018 3560
1400 3560 4838 277 -4060 -2459 2480 4443 842 -2044 -1224 1309 2237 361 -1027 621 2043
1415 2043 1408 -1239 -1261 387 2873 1771 -128 -152 1705 2043 318 -1073 64 2456 2701 -808 -2412
1432 -2412 -398 4043 4455 -259 -4620 -1560 2736 3501 -567 -3763 -1040 3675 4033 -1255 -4544 -1369
1448 -1369 4411 5449 -927 -5784 -3485 4056 5933 182 -5641 -3818 3171 5237 97 -5559 -3424
1463 -3424 3354 5564 -266 -6097 -4327 2851 5924 844 -5610 -4796 1437 4901 1113 -4347 -4099
1478 -4099 878 3745 453 -4145 -3330 1598 3822 363 -4054 -3564 1152 3534 851 -2670 -2701 618
1494F18J339j912k135J058K433j38k754j214K291K454k68l540r92K363K419j057
1510I65k584q79L091K095k562l416J095M071K858l655n007K3N133L729l112n503
1526c658l64M899L604l195n301J1N464L616l608o187o73O289M904k850p223j611
1542e883N547N326j737o301j951M520M939j879o132j696N143M867j758n998k216
1557e209M209N317o65n205k721K792M176R7l889k107K758K810o08l151j088K373
1573a11K952o99k951j482J820K083j89j653j96J103N57j211n89R03J989k19k605
1590d98j128J799K648m34k732j231K206K464j257l052q40L525K852j968m354j298
1606c298M154M046j122n389k319L999M472j050m934k332L892M249q88n592k237
$$ plain form
1494 618 1957 45 -2090 -1032 1401 1263 -1491 -2705 -414 2040 1772 -1768 -2760 -397 2022 965
1510 965 -1619 -2498 593 2688 126 -3290 -2195 1876 4734 1079 -3928 -3905 1228 4957 1845 -3658
1526 -3658 -4022 877 4481 1286 -4015 -4004 1460 5076 1468 -4719 -5392 897 5801 2951 -4272 -5883
1542 -5883 -336 4990 3253 -3048 -4999 -479 4460 2581 -3551 -5247 -104 4763 3005 -2993 -5209
1557 -5209 -1000 4317 3652 -1553 -4274 -1482 2694 2791 -1098 -3205 -447 2363 1755 -1396 -2484 -111
1573 -111 2841 2142 -809 -2291 -471 1612 1423 -230 -426 677 1234 23 -566 337 2326 2107 -498
1590 -498 -1626 173 2821 2387 -345 -1576 630 3094 1837 -1215 -2055 1470 4322 2354 -2000 -3298
1606 -3298 856 4902 3780 -1609 -3928 71 4543 3493 -1441 -3773 119 4368 3480 -2112 -4349
1621d349M001N321p97n964l299L504N700J70n152l726K427N226Q20m981l096K532
1637a663M336N75m681l206K462M835O30m003l224J296M123R68k756k590J098K638
1653H38M18k610j573J970K215n32k485j147J822K206m81k081m20J422J152j181
1669d67j666Q73K302P11k837k088J299L421J088l374k604J313L805O75l311k601
1685c461J911M069O31m103l348K296N237J103m697m328J573N819J989m363m364
1700d036J113N401K136m259m449J292N667K029m241m912Q23N874K756l635n272
1715c713J98M696L187k424m724j6L888K687k464l775NL665K434k277l676n60L357
1732D88K555j174l528m45K465J646j038k017K48J672L61j373j325R08K006K80
$$ plain form
1621 -4349 -348 4973 4176 -1788 -5087 -1583 4117 4287 -865 -4591 -2164 3062 3882 -1099 -4195 -1663
1637 -1663 2673 3248 -1433 -4639 -2177 2658 3288 -715 -3939 -2643 1480 2448 -308 -2898 -1800 838
1653 838 1256 -1354 -2927 -957 1258 726 -1759 -2906 -1084 1122 641 -1440 -1860 -438 714 -467
1669 -467 -2133 -1260 1042 1753 -1084 -3172 -1873 1548 2636 -738 -3342 -2029 1776 2451 -860 -3461
1685 -3461 -1550 2519 3150 -953 -4301 -2005 3232 4335 -362 -4690 -3117 2702 4691 328 -4036
1700 -4036 -2923 2478 4614 355 -4094 -2802 2865 4894 653 -4259 -3436 2438 5194 1559 -3713
1715 -3713 -3515 1181 4368 1944 -2780 -2796 1092 3779 1315 -2460 -2455 1210 3644 1367 -2309 -2869 488
1732 488 3043 1869 -1659 -2104 361 2007 969 -1048 -800 872 1233 -140 -1465 -557 1449 1729
1748A729j818j174Q43J609l18j478k12J633J153j776j910L11K604J682j849l404
1764b375N8L454K363k413l052l36L770J797k373l699J33M444K376k697m662l32
1780c544M368L582k318m821r92M020L545j763m276j279L949L415j971m566p82
1795c433L471L862j567m632j646L366L611m70l980j947K411K992l10l060j461
1810b793K152K559p37l044p32K122K239n68k519p60J029J902k39j823K03J236
1826B27L58j210j099Q85J805J73k118j065J124K219l27j891j139J735K146q38
1842I85k899n16K540K804j373l703j204L238L387r17m046j546K802L475n97l962
1858a532j554L006L772q29m477k373L344M596j51m895k980K670M851L42m135l095
$$ plain form
1748 1729 -89 -1263 -420 1189 871 -607 -819 814 1967 191 -1719 -1408 1196 2878 1029 -2375
1764 -2375 -2317 1137 3500 1087 -1965 -2301 1469 3266 893 -2806 -2673 1771 4147 1450 -3212 -3544
1780 -3544 824 4406 2088 -2733 -3725 295 3840 2077 -2199 -3478 471 3886 1915 -2651 -3433
1795 -3433 38 3900 2333 -2299 -3945 -579 3032 2562 -1418 -3365 -954 2038 1728 -1332 -2793
1810 -2793 -641 1918 1181 -1863 -2595 -473 1766 1198 -1321 -2081 -1052 850 611 -1212 -1009 227
1826 227 585 -625 -1724 -839 966 1139 -979 -2044 -920 1299 972 -919 -2058 -323 1823 985
1842 985 -1914 -2430 110 2914 1541 -2162 -3366 -128 3259 2342 -1704 -3250 -448 3027 2430 -1532
1858 -1532 -3086 -80 3692 2863 -1614 -3987 -643 3953 3802 -1093 -4073 -1403 3448 3790 -345 -3440
1874c440J986M360P27l976l129K360M317O59m215l052J740M351J134l437l184
1889b799J066L354J405k654k309Q89K764M00k363j659J045K534L12k188j526P21
1905a008K207J89j664q83O67J462o38j272K2J555P59j420j665K39K011J172j754
1922b1j654M62K079M74j713j952J579K341M20k904k095J371L427J102l412k485
1938b981R79L640J115k628l322Q65L972J224l151l146J221L921J396k519m074
1953c488M56M331K611l439l124l37L702K234k125l569K62L154J993k047l036J12
1969b310L108K008j729l209j54K198K076q21k342o35J672J392p30j520j5J482
1985D71N92j301q53L54J405M13j111j022P42P64k25j126J48J188R60j401j774
$$ plain form
1874 -3440 -1454 2906 3633 -343 -3472 -1112 3205 3864 -351 -3403 -1663 2688 3822 385 -2799
1889 -2799 -1733 1621 3026 372 -1937 -1048 1716 2116 -247 -1906 -861 1673 1985 -203 -1729 -1008
1905 -1008 1199 1388 -276 -1159 -492 970 332 -940 -918 637 1396 -24 -1689 -1450 561 1733 -21
1922 -21 -1675 -1213 866 1340 -373 -2325 -746 1595 2015 -889 -2984 -1613 1814 2916 -496 -2981
1938 -2981 -2002 1638 2753 125 -3197 -2332 1640 2864 -287 -3433 -2212 1709 3105 586 -3488
1953 -3488 -3032 1299 3910 471 -2653 -2990 712 2946 821 -2748 -2486 668 2661 614 -2422 -2310
1969 -2310 798 2806 1077 -2132 -2286 -88 1988 1167 -1175 -1810 -138 1254 524 -996 -1011 471
1985 471 1063 -238 -1091 -737 668 1081 -30 -1052 -310 454 229 -897 -749 439 1399 -2 -1776
2002a776K88K133J297j487k297k81K754J651j732k268m3K517J633k005k948M90
2018b074L321K048k590l266j53L527K737k009l737q16L485K816j478l886m76L262
2034G11K939j779l867q97L356K880p46l992j644K851L063k13l648j509K346K810
2050B661q10k733j197K077K572n60k927j336K064K320Ok448j182J346J692l07
2066A238j647l17R26R41p15j391J64J353P67r91j423K44J488L53r99j382J271
2083a20J289m07j643q52J487J828k92k480j426J735K618j76k702j359J489K993
2099A982l62k908j493K012K918l71l341j615K087L407K79l566k290J704L536L88
2115B367l043k269J358L287N89k856k497J572L309O64k588k725R60L345R72k029
$$ plain form
2002 -1776 -1488 645 1942 455 -1842 -2123 631 2282 550 -1718 -1761 756 2389 384 -2564 -2074
2018 -2074 1247 3295 705 -2561 -2714 813 3550 1541 -2196 -3012 473 3289 1811 -2075 -2551 711
2034 711 3650 1871 -1996 -2893 463 3343 2597 -1395 -3039 -188 2875 2662 -986 -2495 -149 2661
2050 2661 1851 -882 -2079 -2 2570 2010 -917 -2253 -189 2131 2137 -311 -1493 -147 1545 1238
2066 1238 -409 -726 200 1141 426 -965 -801 552 1319 328 -1095 -851 637 990 -9 -1391 -120
2083 -120 1169 762 -881 -1733 -246 1582 1290 -1190 -2616 -881 1737 1561 -1141 -2500 -1011 1982
2099 1982 1620 -1288 -2781 -769 2149 1778 -1563 -3178 -1091 2316 2595 -971 -3261 -1557 1979 2367
2115 2367 -676 -2945 -1587 1700 2289 -567 -3064 -1492 1817 2481 -107 -2832 -1872 1473 2445 416
2131D16k745N93K474J286j717j958L55K260O19j285j734M19J766O82j380j438
2147a387N90J332O65j006j060N77L99N39j104M63J25P90j128p11m18J984l0r42
2165c22k48r13K421P5j530j110J580J385K83k242j551J169K642K47k066k191J103
2182a268K566O07j868k293R39K692J092k619k345P17L412J178k516k891M64L427
2198A294J527j947l009L32K685J712j848k584l2K839J653j931k668J10K738J680
2214B551j330k567k40K063J315p60j830l80J870Q74j042j304j27J645Q36j231
2230C43j300K51J254Q14j094j079M00R95J96r89n15R77P84m40j502J03J167J141
2248A506p52j631l94J295J404r74j898J56J641J433j107k567j68K653J764j401
$$ plain form
2131 416 -2329 -1736 738 2024 307 -1651 -1296 964 1583 298 -1436 -1017 749 1431 51 -1387
2147 -1387 -797 535 1200 194 -866 -289 110 649 -455 8 133 923 -205 -916 -1334 650 620 -322
2165 -322 -570 -1483 938 1013 -517 -1627 -47 1338 1621 -621 -2172 -1003 1639 1886 -180 -2371 -1268
2182 -1268 1298 1905 37 -2256 -1317 1375 2467 -152 -2497 -1780 1632 2810 294 -2597 -2133 1294
2198 1294 2821 874 -2135 -1803 882 2594 746 -1838 -1870 969 2622 691 -1977 -1867 871 2551
2214 2551 1221 -1346 -1586 477 1792 1032 -798 -1178 692 1566 524 -780 -907 738 1574 343
2230 343 -957 -706 548 1362 268 -811 -411 584 780 -209 -724 253 1037 597 -905 -802 365 1506
2248 1506 754 -877 -1271 24 1428 454 -1444 -1288 353 1786 679 -1888 -2056 597 2361 960
2264I60k941n95K658K144j079k967q34K435K323r76k908n35K131K531r36l392
2280a981r88K383K963o74l001j717K171K478K53k909j575J851K242Q0k743j005
2296b172J478K263p4k208j335R90K127N57j732j254N28J659J55j172o65O59J044
2313H48l32r87m08J046R13p00o95j84O07L29l19m75J74R51l11p46n15P90J408
2332A394k81j618o36R23J460j78j564j034J499J720k80k460o38J703J766r5k670
2349i89j181J452K574L2k604j531J402K570K28k310j871J600K224M0k313j649
2365b326J210K608N09j991k391J043K653N69j594k075M28K327Q69j729j284L59
2381h15J870L67j535j344N25J812O20j281j233M84J214R1o34n89N09O71l00r84
$$ plain form
2264 960 -1981 -2576 82 2226 1147 -1820 -2654 -219 2104 1128 -1780 -2315 -184 2347 1411 -1981
2280 -1981 -2969 -586 2377 1703 -1298 -3015 -844 1634 1887 -1022 -2597 -746 1496 1576 -1167 -2172
2296 -2172 -694 1569 1495 -713 -2048 -1058 1069 1626 -106 -1360 -832 827 982 -190 -855 -196 848
2313 848 516 -471 -879 167 1080 380 -315 -499 108 437 118 -357 -183 768 457 -289 -804 -14 1394
2332 1394 1113 -505 -1141 -218 1242 1064 -500 -1534 -35 1685 1405 -1055 -1693 10 1776 1681 -989
2349 -989 -2170 -718 1856 1888 -716 -2247 -845 1725 1953 -357 -2228 -628 1596 1636 -677 -2326
2365 -2326 -1116 1492 2001 10 -2381 -1338 1315 1884 290 -1785 -1357 970 1839 110 -1174 -815
2381 -815 1055 1422 -113 -1457 -932 880 1500 219 -1014 -530 684 775 141 -448 61 732 432 -552
2399e52J34Q03O80n53r27l22J210N80o93q65M2J294M13j346q41N49J635L20j655
2418i4j690R08K050J127j863k052N01K142R71j737j830O43K154P00j690k288L97
2435a651K632J324j737k630j62K634J864j425k611j76K408J622j538k427J44K141
2451D12J297q12k483o56K231J765r42k062o41J635J542m95j706l19R73J059k37
2468E61j531l68J013J281m43j357m20J062R93n19r15k8N66M96n18l52K32P33l46
2487A40o59n00P11P76J91j049l07P31N60l81j037P8J009Q29p17j408j24J466J369
2506A678q65j767m02J607J231n13j866l96J454J492o11k196k66J740J568q02k024
2523i38o77J734J776l86j941j355J223K057j65j637j301J479J434j81j593r95
$$ plain form
2399 -552 -418 385 1065 512 -415 -737 473 1053 360 -505 -463 831 1244 -102 -943 -394 1241 1561 -94
2418 -94 -1784 -876 1174 2301 438 -1614 -1113 1029 2000 263 -1567 -924 1230 1930 240 -2048 -1651
2435 -1651 981 2305 568 -2062 -2224 410 2274 849 -1762 -1938 470 2092 554 -1873 -1729 412
2451 412 1709 897 -1586 -2242 -11 1754 812 -1250 -1891 -256 1286 791 -915 -1234 -261 798 561
2468 561 -970 -1338 -325 956 513 -844 -1264 -202 791 272 -643 -671 -105 391 -127 -479 -247 486 140
2487 140 -519 -1019 -308 468 659 -390 -697 34 594 213 -824 -746 263 1092 375 -1033 -1157 309 1678
2506 1678 813 -954 -1356 251 1482 969 -897 -1293 161 1653 1042 -1154 -1420 320 1888 1086 -938
2523 -938 -1615 119 1895 1509 -432 -1787 -564 1493 1328 -309 -1610 -131 1303 1122 -471 -1466
2539a466J281J581N9k005p22R08J271K33j173p18K83J116K06j222j86N20P49k24
2557D91p87m05Q35N61k14p01j39Q26p4m18l09K16P98J52j221m44P80J005lj226
2577b77q60R39J343r9j561o85J218J436j45k131p44J363J731k62k027j096J299
2594e58K065q6j699j694J204J974L26j981j456R76K286K47j916j767R79K346M94
2611A740j839j895O32K208Q83j810j476J40K249M61j233j537K43J706P95j505
2627b38j273M24J412Q36j163j370J13J555L69p67o72P4Q23O96r40o55M67M47L38
2646D76o97p01R10K85o1o11l8J93Q00l04o89o5R84O91j331n13J36J302M0m69j156
2667h18P1J229J021p93j731K95J775N20j396j888P65J715Q93j086j895K83J653
$$ plain form
2539 -1466 -185 1396 1455 -550 -1272 -364 907 1140 -33 -751 -468 648 854 -368 -554 -34 715 491
2557 491 -296 -701 134 695 481 -220 -359 467 393 -25 -334 -118 680 832 -389 -833 -53 952 949 -277
2577 -277 -1137 -198 1145 1046 -515 -1200 18 1454 1309 -822 -1566 -203 1528 1266 -761 -1857 -558
2594 -558 1507 1421 -278 -1972 -768 1206 1532 -449 -1905 -929 1357 1604 -312 -2079 -1100 1246 1740
2611 1740 -99 -1994 -1362 846 1729 -81 -1557 -1417 832 1293 60 -1477 -1234 472 1267 -238
2627 -238 -1511 -1087 325 1161 -2 -1372 -1259 296 665 -102 -774 -700 123 819 -121 -776 -309 138 476
2646 476 -221 -922 -12 273 212 -399 -437 -244 556 252 -437 -502 482 1173 -158 -671 -535 767 807 338 -818
2667 -818 -747 482 1503 710 -1021 -726 1049 1569 173 -1715 -950 765 1658 572 -1323 -1040 613
2684F13J066q51j847K6J692J064j331j680M9J480J285l00j913q33J346J809r51
2701G24j097m85M96J351l02j173p60P97J414j315M1j10Q25J40n90m22q62J392
2719F4Q65o18n78j71K97K06j07k47J3N73o7n75k72O45M25j29q73j05Q25M25m11
2740A85q13j12J010P82q19j158n1J400Q18n35j684j05J131J372n22j763k48J351
2758B39J218p57j468q13J808J381k20k296n90J422J836m70j834q81J072J658l5
2775A270j786p50Q47J505M7j526j009R81J642R5j630j021Q59J427J45j117j116
2792a137O58J161K97j067q84O29R92K10j343k87N71P22j27p89j19K53N85R8q71
2811d48m7N74N3j29o06K1Q59J78n01q81M49Q40K60q85q03P76P94K65j029o15L47
$$ plain form
2684 613 1679 828 -1019 -993 699 1763 432 -1248 -1199 281 1566 1266 -647 -1480 -134 1675 724
2701 724 -373 -858 -362 989 687 -486 -1246 -449 965 -350 -309 -419 406 546 -44 -466 -1328 64
2719 64 929 311 -267 -438 -141 65 -42 -289 -276 297 230 -345 -617 28 453 324 -549 -654 171 596 185
2740 185 -628 -740 270 1052 233 -925 -976 424 1242 707 -977 -1082 49 1421 899 -864 -1112 239
2758 239 1457 700 -768 -1581 227 1608 1388 -908 -1498 -76 1760 1290 -544 -1425 -353 1305 1270
2775 1270 -516 -1266 -419 1086 1133 -393 -1402 -421 1221 1316 -314 -1335 -476 951 1096 -21 -1137
2792 -1137 -479 682 979 -88 -972 -343 649 859 -484 -771 -200 522 395 -394 -513 -260 325 423 -448
2811 -448 -495 79 132 3 -603 -582 277 455 -46 -927 -478 362 622 -263 -1066 -290 504 769 -260 -875 -528
2832e28J211M17j248j370P91J453K70j249q79L66J367O53j353r27K60J537L63
2849A134j183j309N58J374P13j069j414L08J413N53o36j315m6J327O38q69j006
2866h29j6J317O30p38j169k8R32P26m60r18lP59N26m42n35j41O95M6m01k74J44
2887a79L68K42l57l82M2N96k25m14J72M31J48l40n68K29P38J59n01p83O7Q74N24
2908H41q47p01L87J012L15r22r87N19J039L73j007r66J35J313P92q15j232j36
2926h87J281Q48r51j091o6J311Q64p65j473r1J409R34q07j346k55J490Q56n60
2944G01j279k07R31Q52n07r88l06Q76Q94m47q58p21J095Q77m23r50k20P55N12
2963E87m86l28k06N77L07l03p01N3P51J70l81n14K62L76L0k81m46J38P40q7o67
$$ plain form
2832 -528 683 1100 -148 -1518 -727 726 996 -253 -1132 -766 601 1254 -99 -1026 -766 771 1134
2849 1134 -49 -1358 -800 574 1287 218 -1196 -888 525 1078 442 -873 -919 408 1046 177 -829
2866 -829 -845 472 1102 364 -805 -833 99 825 365 -553 -556 203 729 287 -248 -389 306 352 -49 -323 -179
2887 -179 189 431 74 -308 -266 330 105 -309 -137 294 442 102 -466 -237 501 660 159 -624 -557 317 841
2908 841 -6 -707 -320 692 1007 85 -902 -383 656 1029 22 -944 -809 504 1296 481 -751 -887
2926 -887 394 1242 291 -800 -866 445 1309 544 -929 -1020 389 1323 516 -830 -1085 405 1261 701
2944 701 -578 -785 146 998 491 -497 -803 73 967 520 -338 -1059 36 913 490 -460 -680 75 587
2963 587 101 -227 -433 144 451 148 -553 -500 251 421 40 -474 -212 164 194 -87 -533 -395 345 258 -409
2984d09n6N31M58j13q44m02O52P91j46j021l50R05P07l77r34k37N64J027k01j234
3004f89m35J020Q87J63j302q84P69J463M9j296r98Q51J159K05j304p82O68J316
3022H60Q4r57r39N65J096L15q11j147M68R64M66p43p90J40J091J01o32p63L49
3041b83N89J00l96m58J88M56K72m24m01K80L18k33M6j24L44l38J31m35L94rK75
3062B92m38j10M9M84J96q26j02M19M59j43n74o89R44O18n4q79m18N05J040j25
3082F48j038o63P04Q46P2j063o41P56J041J31j015p19L62J187L62j062q77M19
3100e50J011L37q00m47K3R47L21p28r02J59J013N32o75j050L7J151L43n84m75
3119c37r1P97M08p97l50Q1O57J32n69k84L98L03K32l28n87K22L66Qk34m59L96
$$ plain form
2984 -409 -465 66 524 411 -433 -835 -183 608 462 -559 -909 -4 703 326 -608 -845 -281 746 545 -689
3004 -689 -1124 -104 783 946 -356 -1240 -471 992 1041 -255 -1253 -402 757 962 -342 -1124 -456 860
3022 860 944 -13 -952 -387 709 1024 213 -934 -466 498 964 221 -569 -429 662 763 131 -632 -283
3041 -283 306 406 10 -448 -260 196 468 44 -357 -77 241 8 54 -70 274 -64 67 -368 26 17 292
3062 292 -146 -256 -207 277 473 -353 -455 -36 423 280 -294 -983 -39 579 525 -354 -772 -267 773 648
3082 648 -390 -1053 -349 497 569 -494 -1135 -379 662 793 -222 -941 -579 608 970 -92 -969 -550
3100 -550 461 798 -2 -449 -426 521 842 114 -788 -629 384 916 241 -809 -772 379 722 138 -337
3119 -337 -428 369 777 -20 -370 -289 368 500 -69 -353 45 348 580 252 -335 -113 253 261 27 -432 -36
3140c6P92m96o38J40M74L31l00m56q8M63M33l01o84M5O62L60n28p49L7Q62N69
3161H92n71j014k1P22Q33p13p18n2Q74N10m60p97k87Q20Q21m93j074k11Q61Q59
3181G81k07j149l96P99Q51k55q12m77O23R45j02q94o06P90N46j45o54l55N80O20
3201D83J80q35m72N66M51r8l90n16O31J91o1l73n0M10K05j13l99j83M90Q7j83
3222B1l93J91K60m2k36j49K62K85k67j74l36N32N24k60n98r1O47L50m27l89j99
3243d89N47O63l64p28k05N61N91%j076k00N27J026n16m53o16O74O75j31q46m38
3263g98M75R43m4p73o45O20R60k51o50m48M78O14K0o86k89M94L61J3l62m56K30
3284a94O66N0m11n21L49K11L14m18j93K01L88m1m43J0K29K02m42j08j2N23J42
$$ plain form
3140 -36 756 260 -378 -238 236 567 267 -189 -277 186 619 318 -366 -321 341 701 173 -576 -539 323 892
3161 892 321 -693 -714 8 841 128 -590 -642 232 742 282 -515 -802 18 839 346 -728 -939 -78 781
3181 781 574 -575 -971 -172 679 424 -388 -865 -242 703 601 -293 -899 -109 437 292 -362 -717 -137 483
3201 483 663 -172 -644 -78 373 275 -115 -631 0 191 130 -243 -293 117 322 209 -190 -373 117 204 21
3222 21 -372 -181 79 37 -199 -348 -86 199 -68 -242 -578 -46 478 218 -380 -471 176 526 99 -290 -489
3243 -489 58 721 357 -371 -576 -15 576 576 -500 -700 -173 853 337 -116 -732 -58 617 486 -360 -798
3263 -798 -323 620 576 -197 -842 -222 738 487 -163 -611 -133 481 501 -185 -474 20 381 394 32 -424 -194
3284 -194 472 522 111 -410 -61 150 464 46 -147 54 442 401 -42 -32 197 399 -43 -151 -163 360 502
3305E02n05l20J39L88R6l81l55M96K11L0l82o83M65P98J90r02l93J80R25K16o69
3326D6p22K95O99K90o05q00L85Q96L99j019o02PJ100N21q67p71K34J003J72p19
3346e8n59K01O70L50n80r36M75P95L06m78p40j95J000M01l79p46R7M63K41j35
3366A93o00j1M20M09l72l53n0M83L03j77n97m3J75L45j00o6p0J67j2K7k04K57
3388A24K9J12n16k1K28K80j56j95O1L25L9j71l31M1K13O09m05m74p3O38J67o76
3410a52l53K1P68L10m50n98nO59N70o51o35J17M46P76n60q88j2P84N61m78p23
3431d93k22P06N20l86l78j29N03M06k47o52J2J53M71m4k42l67L21L23n1l08j78
3452b82K12L13k66m72K85L38J26j07k75K8Q5J60l5m83M21K09jj92l74L30K74j69
$$ plain form
3305 502 -3 -323 -184 204 300 -81 -436 60 271 301 -81 -764 -299 499 689 -213 -606 -426 499 715 46
3326 46 -676 -381 318 608 3 -797 -412 484 883 -136 -738 -731 369 890 23 -748 -514 489 661 -58
3346 -58 -617 -416 254 604 24 -912 -437 358 664 186 -554 -749 251 652 273 -473 -376 87 328 193
3366 193 -407 -418 2 411 39 -314 -364 119 422 245 -352 -395 -220 125 25 -41 -111 56 44 71 -133 124
3388 124 153 265 -251 -272 -44 236 80 -115 -54 271 310 139 -192 -151 62 671 266 -208 -281 357 524 -152
3410 -152 -505 -484 284 594 144 -454 -459 200 770 119 -516 -399 47 823 263 -625 -637 147 708 230 -493
3431 -493 -715 -9 511 125 -253 -382 121 527 280 -372 -360 -207 264 220 -22 -389 -68 255 204 -104 -282
3452 -282 -70 243 -23 -495 -210 128 254 147 -128 -100 -15 145 110 -373 48 257 256 64 -310 20 294 125
3474A25m02%M55L10l51m54j24M89N34k74p26P0M02O05l58o13k24L80O95j78o18
3495b57m82P11N26k8q17l54O55O84j19o70m90M31O86o0n43m90M06P57K6m78q35
3516g41M33P28N2o72n11L66M84K68n87k58K03M10K83m64n55J89K86L72m21k24
3536c59P4N06N7k94j37J11J60J08k63j62J55J69N8m37l1N36pl41k3R9L17Q1l03
3559G4m28R2M67J17k67m07L60J01K13m23l06J21N35J96m79m15L75L51K11n40m20
3580d72L24N47J81m34m00R7N65J20m65k91r2M87L42n15m53J46N86n1j51l82M2
3601b69O26J42l21k81k80O46j13k57j38r2L11L01j5m12r4K55L79m25k09J28M23
3622C05k31j02k76L34J82k70j75J44J46J48l21j81K26J35J00j74j67rK18K46k98
$$ plain form
3474 125 -277 -277 178 488 137 -317 -441 48 582 308 -418 -348 54 659 301 -312 -536 -156 539 361 -257
3495 -257 -739 -28 498 470 -347 -701 -46 638 519 -151 -641 -210 476 416 -127 -617 -211 546 572 94 -741
3516 -741 -308 420 472 -200 -711 -345 139 407 -180 -438 -235 175 458 -6 -561 -372 -86 286 -135 -359
3536 -359 -285 221 278 -16 -153 -42 118 226 -37 -199 -44 125 183 -254 -285 251 244 -97 -120 -21 296 377 74
3559 74 -354 -262 205 322 55 -352 8 109 322 -101 -407 -286 249 445 -34 -449 -74 277 488 -52 -472
3580 -472 -148 399 580 146 -254 -157 408 528 63 -228 -320 167 509 -6 -459 -313 273 222 71 -311 -269
3601 -269 357 499 178 -103 -383 263 150 -107 -245 -337 -26 275 260 -152 -246 9 388 -37 -246 -118 305
3622 305 74 -28 -304 30 212 -58 -233 -89 57 205 -116 -297 -71 64 164 -10 -177 -186 32 278 -20
3643b0l62K04L41M02o59l92J81O51L3l04m78J75N87K98m87m95k33O21L44n79p30
3664i02O43M53M29j91r07J42M07N10k13r25J33N98K56k04n69J55K78M90l35o28
3684c80j38M63L73l8n65p7K47M43o9m08j80K49M17j19m08k48N76r5j62P6j22J38
3706b7J41l06M5O6J57M4j33j95K36k7K9m9k86J19L55k34J3k89J50M27j6l74j57
3729c11L78J75L4l41m05K90N11m8n02j64L50L35j11k44m20K56L83J14n99j14J53
3750b80O08N8n80k09M22J78J26k71k62K34K57O0l62l51J66O12j08m51r8L02K17
3771B68P9k99k10k54L44K19k26k23O4J83J14k04R8j93K54k69J47J1m6K53J19l74
3793a45P5J46K0n62L19m5L19k5j95l38L26L37k18j00j71K03L29j76k92l4J48M15
$$ plain form
3643 -20 -382 -178 163 565 -94 -486 -305 346 379 75 -403 -228 359 657 170 -325 -558 63 407 -172 -902
3664 -902 -259 194 623 432 -475 -333 74 584 371 -554 -421 177 433 229 -340 -185 93 583 248 -380
3684 -380 -518 -55 318 280 -285 -362 -115 328 259 -149 -329 -80 337 218 -190 -438 138 43 -119 -43 -165 -27
3706 -27 114 -192 -147 -81 76 120 -13 -208 28 1 30 -19 -305 -186 169 -65 -52 -341 -191 236 220 -154 -311
3729 -311 67 242 276 -65 -470 -180 331 283 -219 -383 -33 302 191 -53 -473 -217 166 280 -319 -433 -280
3750 -280 328 386 -194 -403 19 197 323 52 -210 24 281 341 -21 -372 -206 406 298 -153 -251 51 268
3771 268 347 48 -162 -416 -72 147 -79 -302 -238 -55 59 -145 -47 -240 14 -255 -108 -97 -143 110 229 -145
3793 -145 -70 76 96 -466 -147 -192 127 102 -93 -431 -105 232 14 -86 -257 -54 275 99 -193 -227 -79 336
3815C36m3k29m65J34N15J28k79m21K73K59J33k11n47J49N41K3l44l70L56K74K78
3836D90m42m07L80J98K39l78l67J00L43K80l96j63n5N26N4k75l73j1M20O8n5n69
3858c93J43M85j49J59n48K42k9J65j46j82O7K98J34j42n04K26K73kj55k2N3J59
3880A32j38j51L5O9K08j08m08k4N38R6j37k97p8L70J44k17l01KM14K95l73n26
3902d55L14K55L2l47O2k89O21K75k59n39oK10N31k58m91K8K14J86L31o90r8M34
3924F1K01l2m40j27K35M14o9l96j18N2L98J05k18p8kK19q8j55n2Q3J42n1R9k42
3948e9J34M0L8l19M04k00K09m34O9J20j64L26o5m0j27M71l35l83J08L17N1L9m57
3971b57R5L0L94k10m53j5K09N44j78k04j75K26J37q0j53j29K88L84l69m41k9K70
$$ plain form
3815 336 293 64 -401 -267 248 376 97 -324 -51 208 341 130 -417 -268 273 296 -48 -418 -62 212 490
3836 490 48 -359 21 219 458 80 -287 -187 156 436 40 -123 -178 348 402 127 -246 -257 163 231 176 -393
3858 -393 -250 235 86 245 -303 -61 -90 75 -71 -253 -186 112 246 104 -400 -174 99 97 -58 -80 -27 132
3880 132 -6 -157 -122 -53 155 47 -361 -385 153 249 112 -185 -263 107 251 34 -267 -265 149 444 71 -455
3902 -455 -141 114 146 -201 -139 -428 193 468 209 -330 -336 -126 405 147 -344 -316 -102 84 415 -275 -373 61
3924 61 262 230 -210 -337 -102 312 243 -153 -271 -219 179 284 66 -12 -14 205 117 -38 -90 -7 135 84 183 -59
3948 -59 75 115 153 -166 238 38 247 -187 -118 2 -162 164 99 59 -68 403 68 -315 -207 110 161 200 -257
3971 -257 -162 -132 262 52 -401 -416 -207 337 159 -45 -220 6 143 63 -90 -219 69 453 84 -357 -386 -116
3993a16M46k20j86l89L30N5L78n04j2L73L7K03n48j9K34J70Jk47k16O9K91L49
4015D79m14n01M45K24o2k15k58J21L95n9k35k3j56M58j10k8k43J80J5j19R8j62
4037a70K65n0oj17p4J69J62Rl92K92Q6L8l14rmK93K07o08J9K05J64J1k40k60J21
4062b03M63J17m26k15Q6M83N6l85j84K4K73J2k35k24j51P61K4j85m57K44M39N1
4084C68j68m07K29o8J07O5n84J80L09K77n1l94J8J12K95j17o8m47L39K99k84j25
4106a15QJ23Q6m1j87J19J9J17pk08k5r2K03qj28K03j03K36l56l8J96N4j00L7l37
4131c44M22j72J73q5n8K65n5n7l11K5K72J40j27l04j99N15J51k69l69R6M31J64
4153C04k96l40Q4K98J44j43n50L12K76J80k08n36M10J16J76K1n15p0J34N63k78
$$ plain form
3993 -116 330 110 -76 -465 -135 -80 298 -206 -218 155 192 395 -153 -172 62 232 233 -14 -230 -161 130 479
4015 479 65 -436 9 233 171 -44 -302 -181 214 155 -80 -103 -259 199 89 61 -182 -2 13 -106 -8 -170
4037 -170 95 45 39 -78 -152 17 179 188 -204 88 174 212 -102 -111 -115 178 385 -223 -204 1 165 176 -64 -324 -203
4062 -203 260 377 -49 -264 -178 305 361 -24 -208 -184 89 101 -134 -358 -509 252 276 91 -366 -122 317 368
4084 368 200 -207 22 -46 61 126 -458 -278 31 308 257 -137 -119 -7 288 171 103 -344 -5 294 10 -115
4106 -115 -107 16 102 61 -126 -7 12 129 122 -86 -111 -203 0 -8 -136 67 -36 200 -156 -194 2 56 -44 -7 -344
4131 -344 78 -94 79 -6 -64 201 146 89 -222 -197 75 215 88 -216 -415 100 251 -18 -387 -291 140 304
4153 304 8 -332 -248 50 194 51 -499 -187 89 269 61 -475 -65 51 227 248 -267 -337 -203 360 82
4174H2k26R1J69Q2j62j20o6K86N7r9j22r0J64J92r0R8m92M44Jj00j09lP0oLk87
4200b33M9L30L5j79k22K96J47p3m21Q7l1M89l40j19K18mK58j56k98mL85K6l3k98
4224i1l24K25L29Nk39k25L97K64j03n11J38J62L80k06m95q4L81K94j12k7m71K19
4246i4L06j25l99LM48j04J62l63j99L66J66j64o2o7j89L87l5j65r4Q1M06k03j19
4269e7k64K29N3R3p9p1K46k6j36n6j01R5M1K30j03j11j8L7k89J34M6M45k46o8
4293B4m5l4J47j00N4k01j5M06j0l36m0O6L61k2l03j43J24K36p9l27j99K92M49
4316C05j24k77Q4J4J19K14m43k48J93L59j3k60j25K21R6P6j64l12J00K74J03k62
4338g0RN0p5L06l0n14J22L27J6r7r0M8j51K13M7j70L06n2k19J41k83L42l59K51
$$ plain form
4174 82 -144 -53 116 198 36 -84 -150 136 193 94 -28 -118 46 238 148 246 -246 198 199 99 -10 -13 57 51 54 -233
4200 -233 -184 146 181 2 -220 76 223 150 -271 -184 -215 274 -66 -185 33 29 287 131 -167 -171 214 240 207 -91
4224 -91 -415 -190 139 144 -95 -320 77 341 238 -273 -135 27 407 201 -294 -378 3 297 185 158 -313 -94
4246 -94 212 87 -312 -309 139 35 197 -166 -365 1 167 3 -59 -126 -315 72 37 -128 -222 -141 265 62 -57
4269 -57 -321 -92 -39 54 -25 -96 150 124 -12 -68 -169 -74 -33 197 94 -17 -35 2 -287 -153 -107 338 92 24
4293 24 -21 -55 92 -8 46 -155 -170 236 226 -110 -150 -84 277 255 -48 -191 -67 169 90 -237 -436 -144 305
4316 305 181 -96 -12 2 121 335 -108 -356 -163 196 183 -77 -202 19 115 191 27 -285 -185 89 192 -70
4338 -70 -61 -11 -86 220 190 -324 -202 125 141 44 -46 2 -149 64 111 -59 247 195 -24 117 -166 176 -183 68
4362F8L5j23J0L45n07n4K95k7R4p0K0k63L40m2r4j26N3L45j36k36K5J6M11j96
4386A83k02j94K27R5K59l47j45k4Q0L76m19Pj94M52P3m5k37l07L97K36k14k06
4408a49mJ63L32m30k65J27J96L58j6k86k09N56m2l30l4K5K2J79p8j99k28J01K79
4431F8l7p6m5M6J99m7j81P5j8J43o0j45j29J94P0l7Qk02J81n7n7J08l1L36k86
4456B0j89J6kK77P6l09J58Nl1L9k56J90n8K98j44j10Q4J93m9O5l75q0L5M06k07
4481E2k10j82M62K13l54J4p6j89L28J37k94J28N7K13k11q4k70J61J16m2k57M3
4503b45K63J57n5j06j50Q9P4M0k11N9j06M42l43n9m9L24L0j63j39L50j28j4k9
4526C1J3l7J50j8l19K5L01O8j56j46M3K73k5j23j98M2j01L11n0l6l00K77K45l37
$$ plain form
4362 68 103 -20 -10 335 -172 -226 69 42 136 66 86 -177 163 121 27 -99 -46 299 163 -73 -48 -32 379 183
4386 183 -19 -213 14 109 368 21 -124 -148 -68 308 -111 -104 -298 154 227 182 -55 -362 35 271 57 -149
4408 -149 -153 10 342 -88 -353 -226 -30 328 312 26 -183 373 331 1 -33 -8 14 193 115 -84 -312 -211 68
4431 68 31 -45 -90 -44 155 108 -73 2 -16 127 67 -78 -207 -13 57 20 28 -174 7 -50 -107 1 -30 306 20
4456 20 -169 -153 -155 122 198 -111 47 52 21 60 -196 -6 -64 234 90 -20 64 257 208 273 -102 -182 -147 259 52
4481 52 -158 -340 122 335 -19 -5 -81 -270 58 195 -99 29 86 299 88 4 -266 -105 11 -31 -288 -245
4503 -245 18 175 120 14 -136 -47 27 67 -144 -85 -191 251 -92 -151 -200 124 154 -9 -148 202 74 60 31
4526 31 44 7 157 139 -180 -155 146 214 58 -88 -45 228 203 80 -118 -76 -177 134 84 48 -252 25 270 -67
4550f7m4q0R2K79j75%k6j09L26m9q1l92K75K72Q5l64O6k4M8J64k29k40J2J49K86
4575A74k01L6RN7J01l17j06K16P5l6K28l33K24r3K02j73l71J33L18j76l8R0p3
4598e4k1J28q9J32j32R6J37j27j04R0o1j22M3J35J09k05J01p3l6M6K21k30q0J7
4622g9J17j21K39k25l8J20o1J22k54ML30P0j07j46m3K72l23Q6n2j97M73n6o7m14
4646c50K54K69m6Mk76RJ18K07j96k66J73K46J54k88K0p6m5J31k0r0j63L42o5n3
4670gp9J37K48q9k69q3Q8J34J7L6K1l64K31j1J41l29O7Q6m9j2J30j95K89l8j84
4695h4j38J50J74O9p6j72N0J83j43j04ko4J26J12j30m4L11m4j71q8mK71K30m16
4719dQ3L3J1Pm4k68K20L9Q4k3j95j1O0K28j82k23J65J4L90k00k06j80K85K9J12
$$ plain form
4550 -67 -111 -191 -99 180 5 5 -21 -130 196 147 66 -326 -51 221 306 -58 8 -16 32 196 -33 -273 -261 -112 174
4575 174 -27 9 18 75 176 -141 -247 -31 44 8 236 -97 127 34 236 63 -308 -175 143 -33 -71 19 -54
4598 -54 -75 53 -36 96 -36 60 197 70 -34 56 -5 -127 -84 51 160 -45 56 -17 -53 -7 214 -16 -96 -79
4622 -79 38 -83 156 -69 -107 13 -48 74 -180 -176 154 224 117 -29 -72 200 -123 -37 -89 -286 187 131 64 -350
4646 -350 -96 173 127 131 -145 -136 -18 189 -7 -273 -100 146 300 12 32 -44 -89 42 22 -68 -231 111 46 -7
4670 -7 -86 51 299 210 -59 -142 -54 80 97 133 154 -210 21 10 151 -178 -111 -25 -74 -86 44 -151 138 100 -84
4695 -84 -222 -72 102 171 95 -77 -27 156 13 -91 -93 -157 -31 81 -49 -93 218 174 3 -85 -89 182 412 -4
4719 -4 79 112 123 130 86 -182 38 77 161 138 -57 -68 -8 220 38 -185 -20 -6 384 184 -22 -202 83 112 224
4744B24j43j49J06m2K85l85o8J44K30q2j57k69K03n1K11K3j86J30K3r0k15K95
4766C7p0J33j49j7m6m3L24j66j82Q5J75j4o9j22Q8N1j69K29l03K30J35r2k27j02
4790b84J69J32M8k49J58J54L1J74m21j7J07l5J24k79J62k3L33k68n6o0K2J34Q3
4813A39j67l66K13L10J81k60k93L40p3L36k58l65J57J73J42j37k38J75J7J49r6
4834G9k36o3K60J43k52j45J16J27j4O8j19n4j05Q6j62K10J56R5m06K26K6q1J64
4857A19k1j74l82J91M67k86j45J97l9P3j98k04M35n6K14k90L9p0J22J00j28J37
4879A01j0N1J61k77k04L8J28K62k29k23L4J26K85k79j15j14K77L06m24l89L90
4900a05N5L19l83j35J4J53Q8p2o6J66L1J21j81k68L40l08L11J1k40L0R7O5j50
$$ plain form
4744 224 81 -68 38 -4 281 -104 -172 -28 202 120 -37 -306 -103 -154 57 80 -106 24 47 -43 -258 37
4766 37 -33 100 -49 -66 -112 -155 169 3 -179 -94 81 67 -2 -124 -36 15 -154 75 -228 2 137 45 -182 -284
4790 -284 -115 17 65 -184 -26 128 159 333 -88 -105 2 -33 91 -188 -26 -49 284 16 -40 -100 -78 56 139
4813 139 -28 -394 -181 129 310 50 -243 97 24 360 102 -263 -106 67 209 72 -166 9 26 175 79
4834 79 -157 -220 40 183 -69 -214 -98 29 15 83 -36 -90 -195 -109 -271 -61 95 190 -216 10 36 -45 119
4857 119 98 -76 -458 -267 200 -86 -231 -34 -73 0 -198 -402 33 -23 191 -99 -60 -130 -8 92 -36 101
4879 101 91 142 303 26 -178 -140 -12 250 21 -202 -168 -42 243 -36 -151 -265 12 318 -106 -495 -105
4900 -105 -50 269 -114 -249 -235 -82 6 -66 -132 34 65 186 5 -263 77 -231 80 91 -149 -119 -22 43 -107
4923a07J41k3j06N7o1N2L3K31k17q4l4Q8Q2N9j2k10RL22j35r7M0O0j15j59O3P7
4949d6pL55j04k44p1PK52l51Mj7K31J85r6m41K73J49l2j06k8j00K94K2M8j97j19
4974a39L95j54k2j62nq9L64q9j21q2O8K53M5m20O1K53m4L0j47j85K10M9K8k39
4998a42p5M12K2k43n0j07Q4K8J15m1n9P5M8LL5Q8k27N5m0j04j32J81L3O9M9o0
5024A7L29j72j99J8P1p3OJ20j54L0r2J07J03j45J49J86k33L6k48l8L0L72j68j66
5048a14Q2l5N0m6k90K57K60r9j75n8m0K07K10j70j79M4J34j45m3Q9j34O0L73l28
5072i0j04N4J67n1k06P2J45N5J43j27n5kJ40o2o5oJ92j95M8j4j32J33kM3j11J55
5098A25k27J07j3J02J1k61J53l1K09n4m3k09K32k29J28J55j52J22m7J69k53P1
$$ plain form
4923 -107 34 11 -95 -38 -99 -47 -14 217 0 -84 -118 -30 52 111 99 -111 -102 220 85 -12 28 88 -27 -186 -123 -46
4949 -46 -53 302 198 -46 -117 -110 142 -209 -205 -222 9 194 98 -343 -70 79 47 -59 -87 -187 107 129 177 -20 -139
4974 -139 256 102 80 -82 -87 -176 188 99 -22 -104 -36 217 262 -158 -97 156 112 142 -5 -190 20 69 97 -142
4998 -142 -217 195 217 -26 -76 -183 -99 -71 44 3 -56 19 67 70 105 193 -34 21 -19 -123 -255 -74 -41 28 77 17
5024 17 346 174 -25 -7 64 -9 -3 117 -37 -7 -99 8 111 -34 115 301 68 104 -144 -182 -152 220 52 -114
5048 -114 -32 -67 -17 -63 -353 -96 164 65 -110 -168 -208 -1 209 39 -140 -96 38 -107 -150 -61 -195 -135 238 -90
5072 -90 -194 -140 27 -24 -230 -158 -13 42 185 58 3 1 141 79 14 8 200 5 53 39 -93 40 38 81 -30 125
5098 125 -102 5 -8 94 105 -156 -3 -34 175 121 78 -131 101 -128 0 155 3 125 78 247 -6 65
5120F5j3j46J4J42K4k11Pk19N19n0n8k94J82J82k0k6k09o3N9K26j5j86m2J87K53
5145C08l31k50K80j2J09k21k22L21Qk6K64k64m8J3K12j04j23j55M14Q4j79j37
5167e9j03M6J44M2k16J01Q7J02l27J29J3J03L0j25N0m3K1k0J17l68L34m1n7j5
5191e5k96L42K4R2k13P3l0J46j52Mo4J22J09k0j14k46K61Q1P2j97j27P8K69r1
5215F8j91j69K97K11k02j61j7J69J59p6Qr5k56L96k9k45L2OL34j10k3k66L05L8
5239A83j68k26K73j63L63j43l11J40j8J11k0L5l08K48K12j58j82N6K30Rj07k54
5261a98%L85j40j15N9L1N6l6n1J82l42K85j88N2o2l5K77K2l2j73L72l43j14J10
5285Bm9RJ63m7j17Q5k90M11j32k7j50k85O33j5k61j5J65J21j20m9k02J07L1R3
$$ plain form
5120 65 52 -94 -80 62 86 -125 -118 -337 182 132 74 -220 -38 144 124 98 -111 -174 -115 111 96 -90 -132 55 308
5145 308 -23 -273 7 -5 104 -117 -339 -18 -10 -36 228 -36 -84 -71 141 37 -86 -241 173 257 78 -59
5167 -59 -162 -116 28 70 -146 -45 42 144 -183 -54 -41 62 92 -33 17 -26 -5 -25 92 -276 58 17 -40 -55
5191 -55 -351 -9 15 107 -106 -33 -63 83 -69 -65 -129 -7 102 82 -32 -278 -17 64 136 -61 -188 -110 159 68
5215 68 -123 -292 5 216 14 -147 -164 5 164 88 96 1 -255 141 112 -133 -101 -95 239 129 106 -160 145 183
5239 183 15 -211 62 -101 262 119 -192 -52 -70 41 21 56 -252 -4 208 50 -132 -76 154 163 56 -198
5261 -198 -198 187 47 -68 -9 22 78 42 -9 173 -169 116 -72 -20 -82 -117 160 182 150 -23 349 6 -108 2
5285 2 -47 -38 125 78 -39 46 -244 167 35 8 -142 -427 206 191 -70 -85 80 201 81 32 -170 -63 -32 61
5309F1m7ol5PR9j03N9l0Q6Q5o2l32J12K35J34o7l14M6J99L9j16m65L26J89l5J72
5335B37m98K97nj8j11KJ47Kr9L7%R4Lj6Pk6j76K34L7p7J89k04j89J29O2r3J9N9
5363D3J49r8J15j27Mn4k13J78M0j28P9n7J0J26Pk8k3l24M22r1J43k35j08K53J35
5388B18k02k02J13J7L75l32J35j53Q9L9p0j94R0J53L2P0j05p5J41m8o6m6k5k9
5412g5P4J35l7j86R5J8k77K24o1K40k03R7j92O0M2j1J21j25m2O6O0%j15k2K01
5437H7K4j86k4J55J8K4k26J25J63r4p2o6l9J80k14K48k50N3J78mj07N8j35K84
5461A80j01K32k30l60J84K75r2j84q4K39j1J10j18k3L9l9P5l17jJ27J72J20j84
5484Ij11P9J38J4j58j34N4L08l08N4J53k14n8L49l69J48J13J0J23j71j30j1P4
$$ plain form
5309 61 14 8 -27 -20 79 -24 35 5 91 176 114 -218 -106 129 263 196 -118 -72 127 166 50 -415 -89 100 65 237
5335 237 -261 36 31 13 -98 -96 51 53 -46 -9 -9 85 88 72 79 53 -123 111 148 71 260 56 -133 -4 58 -35 -16 43
5363 43 192 94 209 82 86 32 -181 -3 37 -91 -12 -69 -59 67 74 46 23 -301 121 30 173 -62 -170 83 218
5388 218 16 -186 -73 -56 319 -13 122 -31 58 97 27 -167 -77 76 108 178 73 -2 139 91 25 -21 -46 -75
5412 -75 -1 134 97 -89 6 24 -253 -29 -90 150 -53 44 -148 -88 -46 -57 64 -61 -103 -37 23 23 -92 -114 87
5437 87 111 -75 -99 56 74 98 -128 -3 160 66 -6 -72 -111 69 -145 103 -147 -94 84 80 -27 31 -104 180
5461 180 79 311 81 -279 -95 180 88 -96 -180 59 48 158 40 17 56 17 92 -225 -226 -99 73 193 9
5484 9 -102 -23 115 129 -29 -163 -109 199 -109 -55 98 -116 -174 175 -194 -46 67 77 200 29 -101 -112 -38
5507c8J79m48R7K86o7J3j05j24J21K13j53j23Q2P7P2j64j30K98J9l2L8r9k14L36
5531A34j00Jk89J46K70m3j99Q6j37K00j8k4k29K02j30K42J5k49R6N8K44k18k4
5554C4J5N4L9k21o1K73lj69m9j48J54J68ok40K43j52P1J58q3J12k77K10R0j63
5578D9k16P5J23j2L9L8k07K30p5m5K4j13qL4J09j22K17j31j69K10J7M6p7j06Q5
5603A5N9K5p0o6P6k9l1K1n6K47p1J9J16m38J06l4K82O9l35P8Mp4L19k51k18OK35
5630DJ02k40l8M2K97j20l5J9O6jLK3j27l6J61p2j60K18k76K67k13J30j30J04K9
5655A7j18K30l67J46L9l5J54q8p8J66j58N5o3J37K1n4k15J88Q3j2n0N5L6o5J29
5680A53j35r1J38p1O0j35K4J17pP7j20J7j55R8J26o4n0L5R9J97l07N2k23N2J36
$$ plain form
5507 -38 141 -307 -210 76 9 22 -83 -207 -86 127 -26 -149 -67 10 82 -82 -212 86 105 73 111 12 -202 134
5531 134 34 35 -254 -108 162 119 -80 6 -131 69 51 27 -202 0 -130 112 127 -122 -26 32 276 58 34
5554 34 49 103 142 -79 -140 133 130 -39 -88 -236 -82 86 80 -160 83 -69 2 160 77 189 -88 122 212 49
5578 49 -167 -92 31 19 58 96 -111 119 44 -1 23 -90 -98 -64 45 -77 140 9 -160 50 67 113 36 -70 15
5603 15 74 99 29 -37 39 10 -21 0 -56 191 120 139 255 -183 -77 -111 171 240 -95 -17 -13 -87 232 -19 -237 -231 4
5630 4 106 -134 -172 -130 167 47 12 31 97 96 99 122 -5 -41 120 48 -112 106 -170 97 -116 14 -116 -12 17
5655 17 -101 129 -238 -92 -53 -88 66 -22 -100 66 -92 -37 -100 37 58 4 -211 -23 60 48 -2 53 89 24 153
5680 153 18 -73 65 -6 54 -81 -57 60 53 130 10 27 -128 -30 96 32 -18 17 116 313 6 58 -165 -113 23
5705B3n0j88M0J25L7J01j18j37J98M4l5k27K15m2J06M4j28N3j68P3J73R7l50J56
5729D2K50k92J2o6j0l2Q6m9j06K9n8J62J25j18q1O8j10K9L7K09j09P2l0j06L0
5754a6n2M9m3pJ99j75K11j48j26J2J35o4j37J42J38j97L8r9K07k10J70m6mj16
5778a39J83J0p1p9M4jJ74J31l16K5P1Q2j91o0K36J5K6k86KJ26j01L31l66K80k62
5803a36L38j08Pj23m8J22O2o8o8j67o6K84Pj13n5R5J49j89Q5j58K8R2P6r7J01
5828E0l17L49n6n1K6J17k18K2K4N2K03k19L2j48L20j17r7r9K1K19n5k03K49l70
5852b66L11j2o3j70J45J18n0J38k22o8Q5J69j39j66L32k9n4M9j31M7K01Q1l18
5875a2o3J21m8K1K50k47l15K33K43r0q9m7Q3k11K03m8l27L48J59mk99l3K49l9
$$ plain form
5705 23 -27 -215 -175 -50 -13 88 -30 -167 31 75 40 -187 28 -14 92 136 8 61 -107 -34 139 236 -114 42
5729 42 292 0 12 -54 -64 -96 -10 -59 -165 -136 -194 -32 93 -25 -106 -38 -148 -119 -82 127 18 90 60 -46 -16
5754 -16 -68 -19 -62 -69 130 -45 166 18 -108 -96 39 -25 -162 -20 118 -79 -41 -140 67 -143 27 -19 -23 -139
5778 -139 44 54 -17 -96 -52 -53 121 252 -64 -39 32 114 -77 -137 99 114 140 -146 -144 -18 -119 212 -154 126 -136
5803 -136 202 94 101 -22 -70 52 114 46 -22 -189 -255 29 36 -77 -132 -37 112 -77 8 -150 -122 -30 46 -51 50
5828 50 -267 82 26 -25 1 118 -100 -78 -54 -2 201 -18 14 -134 186 69 -28 -127 -106 113 58 -145 104 -266
5852 -266 45 33 -30 -200 -55 63 13 151 -71 -139 -54 115 -24 -190 142 113 59 108 -23 24 225 306 -12
5875 -12 -75 46 -2 19 269 22 -293 -60 183 93 4 -43 40 -171 32 -16 -343 5 164 160 -139 -172 77 38
5899C8J17l38J45J30m8j36n0O2P9J5k4j31J57j55J81mj25L4P6O0k52L53k78PJ47
5924F0lq0O6j14J16l0r8j31L03k81K00p3P5k7q5O3j40K93k11L5Ol7q6J38N8Ql7
5951a2O6P1q1j7O8k70JK02O5k3L6k01M9J5R6O2jM1k61pK28j03o7K10l12K27K9
5978A11j26j47J69k2K5om9o8J83p2j12J50o6J85L8j99O6L2p7o9R7j06P5L6j0J1
6004D9r6R3j73J81L1j22P1J60j71L3j50l3K44r9O5k05L9M4Ol1l3L61l32J88k32
6029a12J7O0O2m3rr5j61K18J34p4j2p5N9M9j05J1j94K91J84q9k86J06K60k62p0
6054a36qP4O4p8j5K43lk09O8M4j87j15L12j21J57o6o5O0J6r0J75j71J18lr7n2
6080h5O3J47J18m0ll68J87M6q7L6l53L87l3n2J87k03K01j14r1N4m4K04p7k35N5
$$ plain form
5899 38 155 -183 -38 92 44 -92 -142 -80 -1 14 -10 -141 16 -139 42 38 -87 -53 23 83 -169 184 -94 -87 60
5924 60 57 -23 43 -71 45 15 -83 -214 89 -192 8 -65 10 -17 -102 -39 -179 114 -97 -62 -56 -93 -179 -41 17 25 -12
5951 -12 54 125 44 27 95 -175 -174 28 93 70 106 -95 -46 -31 65 127 126 167 -94 -101 127 24 -43 167 -145 82 111
5978 111 -15 -162 7 -15 10 4 -45 -113 70 -2 -114 36 -30 155 193 -6 60 92 15 -54 43 -63 12 48 38 49
6004 49 -47 46 -127 54 85 -37 34 194 23 56 -94 -127 117 18 83 -122 -83 -39 -33 -64 -97 264 -68 120 -112
6029 -112 -95 -35 27 -16 -25 -120 -281 -63 71 -3 -15 -90 -31 18 -87 -76 -270 21 205 116 -170 -64 196 -66 -136
6054 -136 -144 -70 -6 -84 -99 144 141 -68 0 44 -143 -258 54 -67 90 24 -41 19 35 -55 120 -51 67 64 -33 -85
6080 -85 -22 125 243 203 200 -168 19 65 -22 14 -339 48 15 -37 150 -53 148 34 -57 -3 -47 157 80 -155 -100
6105a00P5L02l23Q0JP8j71R1k05J12J8N0K6M9k14N7k1P7k9jJ94o8R1k15l7J31
6131D8J1l03L01j69J38N2k7k42K60j05L33k58n1o1m0J58j2j26J5L95j51n9r4j58
6155a45K44n5j10n9n6J41j4M7n8J09K1p8K7j96K01j6k5N1n1q4J89j9k19J19J14
6180G8K12l36j68J99M0jJ33j96L6n9J36M5j43O7k79M47j61j01j6M9l5L3J16l13
6204b17K80K02j07l01K5R6J73P3k52q2P8K86k08m6j9p0L7J16k35J08j4J72m0j43
6228h8K00m9m8N3pl14L84J48j44j49p9K36o7j70K1k5J13p8o9l5K1K00k4J92k69
6253d7P6J23k97K59p8r0p9J70n2k4P4j3K72k86j53l7J45o4K92r0j13K9J04r7K1
6278D5m3k14L59j85r3mL16j4k38R6o2P0m6J40j33K5k7KR6k76K20N1K4njk10k7
$$ plain form
6105 -100 -25 277 -46 34 35 113 -58 33 -172 -60 -42 8 34 83 -131 -74 -95 -18 -47 -48 146 78 169 -46 -83 48
6131 48 59 -244 57 -112 26 78 51 -191 69 -36 297 39 -12 -73 -113 45 33 -93 -78 317 166 107 13 -145
6155 -145 99 44 -66 -125 -181 -40 -54 -7 -65 44 65 -13 14 -182 19 3 -22 29 -22 -106 83 64 -155 -36 78
6180 78 290 -46 -214 -15 25 24 157 -39 -3 -62 74 119 -24 43 -236 211 50 -51 -67 -18 -53 -20 96 -217
6204 -217 63 265 158 -143 -118 -22 151 224 -28 -110 -32 254 46 0 -19 -89 -52 64 -171 -63 -77 95 55 -88
6228 -88 112 63 15 68 61 -253 131 279 135 -14 -93 143 76 -94 -73 -98 15 -63 -132 -167 -146 54 30 222 -47
6253 -47 29 152 -145 114 36 -54 -133 37 -15 -39 35 22 294 8 -145 -182 -37 -101 191 101 -12 17 121 24 45
6278 45 2 -212 147 -38 -131 -135 181 167 -71 25 -37 33 -13 127 -6 19 -8 -6 90 -186 34 85 109 104 103 -107 -134
6305a34K15j19k18J23j6K02L8j03J03J17j96q9R0R0l0p9J4k6L8P1j1j00j08j2
6329a40J41K21j65j8Oj22R8Nn4K2M0k03L04n7k39L24k8j20J64k35J85k0Q4l26
6353a33R0K14l30o5K75Q8q8M0j17jQ5k1j39J83k47K4M51m32K75j91K20k8j15j02
6377f4Oq6L20k27m1j4k19K62N2j62P6O2Q1j03R6p8j72L44j50J57m10M16Q1j82
6401D5n3jR8k7j93J0k25M23j08k11L36k50K59K3j01J0l9Q5L8j15J04M7j81j37
6425a63Q2K3P7r4J73k36R8L6O8J11l44J21K12j65j8k36J87r3J26P5N5j55P8j40
6449a22K76k03j06J29q7L55j09j58j37m5K38M5j04o4K05q5k16L83j74L2q2N8l4
6472eo5QL5q3PJ25J69k15M5j9m7J2M0j08J92l9L1j78J69K0Q8j46P6q7p5j07r2
$$ plain form
6305 -134 81 -38 -256 -133 -149 53 91 -12 91 208 12 -77 13 103 73 -6 8 -18 20 91 80 -20 -128 -140
6329 -140 1 222 57 39 45 -77 21 26 -28 -6 34 -169 135 78 -161 163 135 15 179 -56 129 109 193 -133
6353 -133 -43 171 -159 -224 51 139 51 91 -26 -27 58 37 -102 81 -166 -142 309 -123 152 -39 181 153 38 -64
6377 -64 -58 -144 176 -51 -92 -106 -325 -63 -11 -173 -97 -35 46 -57 39 -39 -211 133 -17 140 -270 146 227 45
6401 45 -8 -9 89 62 -131 -121 -346 77 -31 -242 94 -156 103 126 25 35 -4 81 119 4 108 155 -26 -163
6425 -163 -81 -58 19 -75 98 -138 -40 -4 64 175 -169 -48 164 -1 -19 -255 -68 -161 -35 40 95 -60 18 -122
6449 -122 154 -49 -155 -26 -113 242 133 -25 -162 -207 31 76 -28 -92 113 28 -188 195 21 53 -29 29 -5
6472 -5 -70 -62 -27 -110 -103 22 191 -24 21 2 -45 -33 7 -101 91 52 83 -95 74 94 182 36 112 25 -50 -157 -249
6499b49J29l4J71M9Oj35M7o2K20M5j26j57R6JK3r0J18j90R1L2n1j99K41K01J73
6524C50k40k22R8J17r7k7J40l30K55k49K75j59nl7J46j15K17J3l23L20Kr9k17
6547a87N6J85q6J14l5l5p4K9%J21j54J28K4j03k7l1K34l36j2J63J21o3o6L8n2
6572d8k3P9J24n0j23J8j87J95j87J19JP4m4k5NQ5J01n6l8j16L1K00q7q8ol0j38
6599b14L05p7m9K17k34Q8J02k16K09j71j86J76m7L23j74J02k14Q2l5J29L7k16
6621f3J03j03n4J08J61l32K11k2K4J5o2K10k00j84J98q9j3J24K0j23J75q9P3o9
6645A9p3p8O7J95l9j29J48j68L7L3k45K60O7R7m98L72j9j83K00j68N0O2L1q0M4
6670BJ49k12Q0j36N5J26n4p7J43k88J50O3J90j57k1j49J80kj38L32j31k77N5J17
$$ plain form
6499 -249 -120 -154 17 66 72 -63 -16 -78 142 187 61 -96 0 1 24 -66 52 -138 -47 -15 -66 -265 -24 177 350
6524 350 110 -112 -14 103 6 -21 119 -211 44 -205 70 -89 -94 -131 15 -100 117 130 -193 127 129 30 -187
6547 -187 -131 54 -32 82 47 12 -62 -33 -33 88 -66 62 86 -17 -44 -75 159 -177 -189 -26 95 32 -34 4 -48
6572 -48 -71 8 132 82 -41 -23 -210 -15 -202 -83 -82 -8 -52 -77 -72 13 114 58 20 -96 -65 135 48 -40 -46 -76 -214
6599 -214 91 14 -35 182 -52 36 138 -78 131 -40 -226 -50 -97 226 52 154 -60 22 -13 116 153 -63
6621 -63 40 -63 -117 -9 152 -180 31 9 33 48 -14 196 -4 -188 10 -79 -92 32 52 -71 104 15 88 19
6645 19 -54 -132 -65 130 91 -38 110 -58 -21 12 -233 27 94 191 -307 65 46 -137 63 -105 -55 7 38 -42 2
6670 2 151 -61 19 -117 -62 64 10 -67 76 -212 -62 1 191 34 13 -136 44 42 -96 236 105 -172 -117 0
6694@j15P0P5p8J7k4J58j02N8J09j81k88M35j23J3q6r3K4M4J29L5p2J06k5k7j20
6720f1J13j13L7j17N7J16j06J73M2k33j08K30J92m70N24k76%k07J45N5Q8q7O5
6743E9l50R3K35j50K40k28p9J70N0P6j21k0n8L5J48l13nQ3Q9K28m5k03o2K68j72
6768c2l8Q5J63n2J61m94R7j9K82j35L7j4R0j30K26j55q7p4j3k1m7R2J53j49J4
6793f0O5m4J52r5J26L7k90Q4K6M0lj2j02L08k55K60k74O6O7o8N2J00j16m3j77
6818a56K25q5n8R4p5Q1j84L79l7k38o5J40Q4l7J00j02p7J87j27j98J58j39J83
6841E3n0L9j26Q7k53L06j71L9K28k09LJ3P0p8QJ04j33J26k85L06J05k37o3j87
6865c05K34K58j46k24J02M7Q0J74l2p6j57K5p2l3j67K85J7r4j85K26J29l09J12
$$ plain form
6694 0 -115 -45 30 -48 -31 -55 103 1 59 168 -13 -301 134 11 24 -62 -155 -131 -87 42 77 5 111 86 59 -61
6720 -61 52 -61 -24 -141 -84 32 -74 99 141 -92 -200 30 222 -248 276 0 0 -207 -62 -7 81 -6 59
6743 59 -291 -198 37 -113 127 -101 -180 -10 40 116 -5 -25 -83 -48 100 -213 -218 -135 -46 182 137 -66 -128 140 -32
6768 -32 -70 15 178 126 287 -207 -110 -129 153 18 55 41 131 1 227 72 -15 -89 -102 -123 -170 -78 75 -74 -60
6793 -60 5 -39 113 18 144 181 -109 -25 1 41 38 26 -76 232 -23 237 -37 29 96 28 80 180 64 21 -156
6818 -156 69 -16 -74 20 -55 26 -158 221 184 -54 -119 21 105 68 168 66 -11 176 49 -149 9 -130 53
6841 53 3 42 -84 3 -250 56 -115 -76 152 -57 -54 -41 29 -49 -41 63 -70 56 -229 77 182 -55 -118 -305
6865 -305 -71 187 41 -183 -81 -34 46 220 188 112 -45 -20 -92 -125 -292 -7 10 -84 -269 -43 86 -223 -111
6888a11J16k23K18J7l7P8o9%Mml3mO6j46J6M0N3k54K92j27K6J07L6j0q3J7Qm1
6916d8J01j43J97k05N7L5j08M2J49K54o17K88j36N6L56j07k66J29j18R8L2j92
6938a46R9M5L9O2j09J47k96J69J2q7k64M03J3o3J8J9k87K10j1k7l2j5J37mj27
6963i5J04j6Lo7k23J70N5J12j30o0J99O2r8j31J08M9rl0k00J98j5J5J11k61P7
6988g2K7j6mJ35k91J56J05m1O4j14J1j0K9k9L6m1o4K23k00j4L61m06K65K4l32
7013a98K69J05k68L1j20kK58J6j27L2k9R1o8J37k47m6jM06k33o6R3J8K47j39k34
7038g5K04l02J09L4o3j24K63k00J23j51J73m3J94n8l3k4q8J13M7k41K14R5Q8l17
7062f2n9O6j15K26n0J67J6j80k5PJ16j55K06j38k1l2O5N5N3k9k56K43j97k8j6
$$ plain form
6888 -111 5 -218 0 17 -20 58 -11 -11 -7 -11 -44 -48 18 -128 -112 -72 -19 -273 19 -108 -82 25 61 51 -32 -15 -7 -48
6916 -48 53 -90 107 -98 -41 -6 -114 -72 77 331 -286 2 -134 -78 278 171 -95 34 -84 14 46 -146
6938 -146 -47 -2 37 99 -10 137 -159 10 22 -65 -329 74 87 24 42 61 -226 -16 -27 -54 -86 -101 36 32 -95
6963 -95 9 -7 -4 -71 -294 -124 -69 43 -87 -147 52 114 16 -115 -7 42 33 3 -197 1 -14 1 112 -149 -72
6988 -72 -45 -61 -65 70 -221 -65 40 -1 63 -51 -40 -50 -21 -50 -14 -55 -119 104 -96 -110 251 -155 110 134 -198
7013 -198 71 176 -92 -61 -181 -183 75 91 -36 -4 -33 58 -10 127 -120 -166 -167 239 6 -60 33 51 298 159 -75
7038 -75 129 -173 -64 -30 -93 -217 46 -154 -31 -182 -9 -52 142 84 51 27 -61 52 99 -142 72 167 255 -62
7062 -62 -121 -55 -170 56 6 173 189 9 -16 -9 107 -48 158 20 -1 -33 32 87 140 111 -145 98 -99 -127 -143
7087a43KP8J93l26K56m5N6R4k69K48Rj32J87k28q5Q2J41j87p0k2O6O2Q0n9j63
7112a75N8J25J04j22JQ8j37J76j91R4l21L47l9J09j07l9j08Q1l7O1J07r2j04J55
7136C4N8r8q4k8K55l29M76k78N1j44K81k31J70l21N4J03k2J89k83L31j03n3O1
7159H9k43K75q2q3P0P4m0Op1o6K20m63M36j69L5r6K5J9J74m2j93J75K22j73q5
7184A4J03q9j29R2P9k4m5O9k44J93J05j20j01N7J13n3k96J23K31j03O5j07L3M2
7208HJ21j84R1J50l22q4J3K18K6j13O7k00R2N0L2K36k60O0N7j70L6J00J2j56L37
7233B17p8j41lm2J1K21r3j24QJ43j09r4O6n2O5J11j93l7P6J78j85R9r1J6J19R4
7259A82l61J21OJ14K6j35l3j50K81M0k1n3k32J33J7j04J84l0m7j39K96q9o6K27
$$ plain form
7087 -143 -141 -63 130 -196 60 15 71 165 -104 144 153 21 208 -20 -105 -23 118 -69 -139 -161 -95 -33 47 -12 -175
7112 -175 -117 8 112 -10 -9 79 -58 118 -73 21 -300 47 8 117 10 -29 -137 -56 -93 -32 75 -17 -121 34
7136 34 92 -6 -90 -118 137 -192 284 6 57 -87 194 -37 133 -188 -134 -31 -53 136 -147 184 81 28 89
7159 89 -154 121 39 -44 26 100 60 66 -5 -71 149 -314 122 -47 -12 -108 -83 -64 110 68 -125 50 272 99 14
7184 14 117 28 -101 -9 70 46 1 70 -174 19 124 4 -97 -40 73 20 -276 -153 78 -25 40 -67 -34 8
7208 8 129 -55 36 186 -136 -220 -207 11 37 -76 -9 -209 -117 -67 -35 201 -59 1 58 -112 -76 24 36 -120 217
7233 217 139 -2 -5 -47 -36 185 92 -32 -24 119 10 -84 -18 -70 -5 106 -87 -124 -48 130 -55 44 -47 -31 88 182
7259 182 -179 -58 -52 62 88 -47 -80 -230 51 91 70 17 -215 -82 -65 -169 15 -15 -62 -201 95 6 -60 167
7283A67l38M8L0K3O7J1J64k13j30J99n1j07J77k51K02k3J89k39k24L32J3j65N8
7306f1M9Nm2j33K25k6N2M3j61N0J01r5K62k72J23l4qk32K65j63J08q5j90K39j47
7331a27K49j24j04K02k03J26K3%q0j84L45k46J92o6J0K76m60J74J9j72Q7J74r3
7354A8J18p6l9J05k05L2J3P5j3mj25p6L18k00n8M9M1O4M1r3j57J28nJ18q6r5L6
7381g6K34k06J0j6O7k5J53j79J76N1j69K3k15K51j48j21J57J31n2N8j07P2L5j40
7405c6l7k7J11K50m09J20K01K1k06P2O4k25k2n2R8J76m5K33j33k91L02r7j26N8
7429@M2m1J09L5k21r0J96l3o5K06m60K80K23j76K02j40j17K33k82K82l05O4K98
7452B40k92rj4J15P1p0j29J80l48M60j52j44j29MM24j05K1j60k24K68l3kL1o9
$$ plain form
7283 167 -171 -123 -93 -70 -3 8 172 -41 -171 28 -23 -130 47 -204 -2 -25 164 -75 -299 33 46 -119 -61
7306 -61 -12 -7 -49 -182 43 17 69 112 -49 1 102 7 269 -3 120 86 78 -154 111 -52 56 -29 -219 20 -127
7331 -127 122 -2 -106 96 -107 19 42 42 -38 -222 123 -123 69 3 13 289 -171 3 22 -150 -63 111 18
7354 18 136 60 21 126 -79 -47 -34 41 28 24 -101 -177 141 -59 -117 -68 -27 37 78 -15 -172 -44 -49 69 -17 -112 -76
7381 -76 158 -48 -38 -54 13 -12 141 -38 138 189 20 43 -172 79 -69 -190 -33 98 46 104 -3 69 104 -36
7405 -36 -73 -100 11 261 -148 -28 173 194 -12 60 124 -101 -123 -175 -77 99 54 287 154 -137 165 68 -58 0
7429 0 42 1 110 145 -76 -166 30 -3 -68 138 -322 -42 181 5 207 67 -50 183 -99 183 -122 -58 240
7452 240 -52 -61 -75 40 111 41 -88 92 -256 204 52 -92 -221 -217 207 102 123 -37 -261 7 -26 -28 3 -66
7476f6J34p1k08J69J39j34J54k09k0L18n2q1rk58K57k0j44J77j73J39j15K8q2
7499a27J72J94j89j33J08j30MJ5P0n5R0J30n1k06PJ2m3J85j49J02l36M18j76O6
7523b2j83P4K93j07l37K72oJ1K54l55j73M17j11O4k2j0j3j06M2J34j66j18M44
7546B76j63K1k87N5L14j88M7O8k35j07K02J2J28r1j59J47P6o1j71N0lJ07m8j23
7570a33J28p0j4J16M3o5J25j80j4l2J14J70j85q2k6N8J6K98m81J47l7J9mK14O
7595A31J4k8j96m2k5J46o7o7J16J1Q6Nj34M4n2m3J81l11J83J18O0j29n1J19J42
7620B11k01K1j8k46L22Rm6m3n7J59j11m6M7P1r7N7M4j17K7k2K3n5R4j87K72j48
7646c7q2J33k05J07N2J55j87N8j68L71k41j73J81K3O6j58K5J15J21q1p6k23K23
$$ plain form
7476 -66 68 -3 -211 -42 97 -37 117 -92 -112 206 154 73 64 -194 63 43 -101 76 -97 42 -73 -45 -127
7499 -127 45 239 50 -83 25 -105 -101 -86 -16 -71 19 149 98 -108 -101 -89 -132 53 -96 6 -330 88 -88 -22
7523 -22 -205 -131 162 55 -282 -10 -16 -5 249 -106 -279 138 27 91 69 59 46 -60 -18 116 -50 -168 276
7546 276 113 134 -153 -98 216 28 75 143 -92 -199 3 15 143 52 -107 40 116 55 -116 -66 -69 38 -10 -133
7570 -133 -5 -75 -89 27 70 5 130 -50 -64 -96 18 188 3 -79 -105 -47 -31 267 -214 -67 -104 -85 -89 125 131
7595 131 145 117 -79 -121 -146 0 -67 -134 -18 -7 79 84 -50 -6 -58 -101 80 -231 -48 70 130 1 -50 69 211
7620 211 10 31 13 -233 89 98 52 9 -48 111 0 -46 1 72 -25 32 76 -41 -14 -36 -13 -68 26 -161 111 -37
7646 -37 -119 14 -191 -84 -32 123 -64 -6 -174 197 -44 -217 -36 -13 53 -105 -80 35 156 75 -1 -224 -1
7669am6J9j47J92R2N5j27k64J34J43K3j53j42K04N5n4M1J7j4k69L45j59J5r8K60
7694A21k12o3N4J06o4J59j4j05K30j69j68m1K45j70j14K51K0j05K31j42n1O6o3
7717BK0m3j44K13J26l24K30n9j61R2o3J47R7M2j97K4J32k19K41j82R9O3k37J39
7741C8j74J62j00M7m0j04K56N2q0O6j60Oj59K26j79Jj68K58J92r0p7l04N06j24
7765E1q6j87K18j42K50m49K36J4J63o2p2j63K59k1O8j25L7l2J14r0J48j38J38
7788A29m4Q3o7o4k4P0MJ65l60k94N47j43j79J58J58l05K83o8J00M2q7j17j87J08
7812i2M8J38K33l31P0n1r4L1R6q9Q0o9J57k36Q1J27N8k81K01j54J26N9Q5q4l12
7837b03J12K4N4o2p1l7K89j33kQL4R9J21k35j3J43j33Q2l03J89k13K93OK3l10
$$ plain form
7669 -1 -47 -28 -175 17 109 164 37 -227 -93 50 73 -80 -222 -18 37 -17 24 41 27 -242 103 -56 -41 -139 121
7694 121 -91 -154 -100 6 -58 101 87 -18 212 43 -125 -166 79 -91 -205 46 66 -39 192 50 -1 65 2
7717 2 22 -21 -165 48 174 -150 80 21 -140 -48 -111 36 133 175 -22 2 134 -85 156 -26 73 136 -101 38
7741 38 -136 26 -74 -27 -67 -171 85 137 57 123 -37 -31 -190 36 -143 -142 -310 -52 140 50 -27 -331 175 51
7765 51 -35 -222 -4 -146 104 -345 -109 -95 68 6 -66 -229 30 9 77 -48 -11 -43 71 -19 129 -9 129
7788 129 85 168 101 37 13 83 87 252 -108 -402 145 2 -177 -19 139 -166 117 49 149 191 104 -13 -200 -92
7812 -92 -44 94 327 -4 66 15 -79 -48 48 -41 39 -30 127 -109 -28 99 157 -124 77 -77 49 108 193 109 -203
7837 -203 -91 -67 -13 -75 -146 -183 106 -27 -29 -21 13 112 233 -2 -15 128 -5 77 -226 -37 -250 43 49 72 -238
7862b38L6K54J40l13K24j70l8K75j44k36J39K14k6j20Q4k38L41nl90L53l65K91
7884F8j55m77M50J63J60L27m76l58N46m11n33P61m98K51K98L21n42J86j00NN33
7905E19l83o63J104q94L39O3j55K16j03K0j37j5K67q3j05Ql1r8jN3j4J76Jk27
7929a43M9N6l2l2J54J38k46k2K61J16l90n2n3J91J66q1j18j24K12N4J2k96K03
7952B3n6J57Jj14o4Q7j06p7J65K88j47n1l9m0L0j6j00M6j09n0k8J99J31l95J34
7977a31Q7J26n3j70J17L1k12N8J69j46K74l0J2j61K6j24M4O5j24K58j86J13n4
8000a1k9P5q8O3j56K33j06J17j36QO5J59k15J00k81J79J22p4j2m1m4N2L10k38
8024E2o7k75Q9K84o0j70O2j2J80K34k93jk1o4p7K74j62j2J89p5j18nqJ8n1J30
$$ plain form
7862 -238 -202 52 192 -121 103 -67 -105 170 26 -210 -71 143 117 -3 81 -157 184 179 -211 142 -223 68
7884 68 -87 -564 -114 49 209 536 60 -298 248 -163 -696 65 -433 -182 116 437 -105 81 -19 -14 519
7905 519 136 -527 577 -317 22 85 -70 146 43 63 -74 -89 178 95 -10 -2 -33 -131 -132 -79 -93 83 84 -143
7929 -143 -94 -38 -70 -102 52 190 -56 -78 183 299 -91 -143 -196 -5 161 80 -38 -162 50 104 116 -180 23
7952 23 -33 124 125 11 -53 34 -72 -149 16 304 157 106 67 27 57 41 -59 -13 -122 -172 -200 -1 130 -265 -131
7977 -131 -44 82 29 -141 -24 7 -205 -147 22 -124 150 120 132 -29 -3 -127 -83 -18 -142 116 -70 43 -11
8000 -11 -40 35 -53 10 -146 87 -19 98 -38 -30 35 194 -21 79 -202 -23 99 25 13 -28 -72 -20 290 52
8024 52 -15 -290 -201 83 23 -147 -85 -97 83 317 24 23 2 -62 -139 135 -27 -39 150 75 -43 -48 -56 -38 -89 41
8050D1P6r7j32N1O2k9J36j19Pk32J30K53L2k55j52L92j10M3j6l2N4k79O7J04P0
8075F5k47L52j80j26j9K05j1J0j05L14j35r2N6j90j64K72j14K6j3p3J35J17j01
8098a8R9k53o6K44k20K59R7k84K53j41k6j00q1J04J88j16r9K00j63m2K14J7j26
8121f0j0J05jk19J75Q0l5RMr7p4N5K9oPm4n2J48j05Q7L5J37j74Q8lj00J06J2j53
8150e6J40kL4k54K44ok08J04Q2k75K00l5q6N0N2l4O4k25R9J63j55J82o0j65r8
8175b45L52o9nK8j38J34j46J08n5P7J18Nj24jJ29k05
$$ plain form
8050 41 117 20 -112 -61 1 -28 108 -11 -4 -236 -106 147 179 -76 -228 164 54 97 81 49 103 -176 -109 -5 65
8075 65 -182 170 -10 -136 -155 50 39 49 -56 258 123 31 87 -103 -267 5 -109 -83 -96 -169 -34 83 -18
8098 -18 81 -172 -238 6 -214 45 142 -142 111 -30 -56 -156 -237 -133 55 -61 -160 40 -123 -165 49 66 -60
8121 -60 -70 35 34 -185 -10 70 35 44 48 -49 -123 -68 -39 -45 -38 -82 -134 14 -91 -4 31 168 -6 82 79 -21 85 97 -56
8150 -56 84 82 116 -138 106 100 -108 -4 78 -197 3 -32 -118 -68 -16 -50 14 -211 -112 51 -104 78 18 -147 -245
8175 -245 107 38 33 61 -77 57 -89 19 -36 41 159 164 40 39 168 -37
8191c7
$$ Imaginary data points
##PAGE= N=2
##DATA TABLE= (X++(I..I)), XYDATA
0@%%%%%%%%%%%%%Kj0J6j6J6j8K6l2M0m8N6o4P2q8J04j20J36j54J78k02K27k58
35a37K91l27L67m12M61n12N70o34P02p78Q62r52J049j157J277j404J545j705J879
54I85k073K292k540K824l151L530l983M533n211O077p229Q844j1288J5475k4598
69a5513Q2957p6283j05805J54774Q8082m3093j05752q566N4209L7093k0133k4825
81A7145m4111M07O9112L7908p3386p7681J6568R8760L7880q6211p8319M4674O5662
94B8408l604m2186k3391J2876K6879m78j7259k0416r306L2417L7208l4264n7629
107g0745Q236N4869J8871m1838l4623K9813L0041k6184k4715J8519K2932j57j9339
120c4320j8412O105K2594J2252p537k2992r141K5477K0941j8172k7410Q170L8379
$$ plain form
0 0 0 0 0 0 0 0 0 0 0 0 0 0 0 2 -8 8 -8 8 -10 16 -16 24 -24 32 -32 40 -48 56 -64 72 -82 96 -106 121 -137
35 -137 154 -173 194 -218 243 -269 301 -333 369 -409 453 -499 550 -607 670 -734 811 -894 985
54 985 -1088 1204 -1336 1488 -1663 1867 -2116 2417 -2794 3283 -3946 4898 -6390 9085 -15513
69 -15513 67444 -8839 -114644 40130 128212 85119 -20633 -29199 25010 62103 41970 17145
81 17145 -26966 -26559 42553 80461 7075 -70606 -54038 44722 82602 -3609 -81928 -37254 28408
94 28408 24804 -17382 -40773 -27897 -1018 -1496 -18755 -39171 -48477 -16060 21148 -13116 -70745
107 -70745 -62509 -7640 11231 -30607 -65230 -35417 -5376 -31560 -56275 -37756 -14824 -14981 -34320
120 -34320 -52732 -46627 -24033 -11781 -19318 -42310 -51451 -25974 -5033 -23205 -50615 -42445 -4066
133d066J3944m1549l6584K9511N0782L555l8354k9912J2368L8298J6437k1641
145g211k9081L71L3611K3727k5084l9281Q572M8150K1779l5490m4524Q771M9602
158A3912K3099k6754l5911j700L1671K3516j3379k8329k391K6584J8904j6111
170A3111k9543O13L2484J9436j8848k8330q05K4299J4485j0062j3833Q06R432
183A3245K164p093m341Q026J1382l574j5545n981J2570J4530m112j6343l188J5224
197A6964Q783j4159j6091Q220K4799O841k4779k5370Q353L3779J5722k3665l3611
210a4214J294L4591K0198k3070l4287L262L8063J9163l0644l9814O302M6161K5159
223E2164l1094m8171l027M6110L3672k2203m7790j0914L9617L4693j9133m6147
$$ plain form
133 -4066 9878 -31671 -68255 -38744 12038 15593 -22761 -52673 -40305 -2007 14430 -7211
145 -7211 -36292 -35921 -2310 21417 -3667 -42948 -34376 13774 35553 63 -44461 -35690 13912
158 13912 37011 10257 -25654 -27354 4317 27833 14454 -13875 -16266 10318 29222 13111
170 13111 -16432 -15819 16665 36101 17253 -11077 -11882 12417 26902 16840 3007 3813 13245
183 13245 15409 8316 3975 12001 23383 19809 4264 -1717 10853 25383 21271 4928 1740 16964
197 16964 25747 11588 -4503 3717 28516 35357 10578 -14792 -6439 27340 43062 19397 -14214
210 -14214 -12920 21671 41869 18799 -15488 -12226 25837 45000 14356 -25458 -19156 27005 52164
223 52164 21070 -27101 -30128 15982 49654 27451 -20339 -31253 8364 43057 23924 -22223
235b2223q591M0736L3867k1597m9450j1284M1937L9084j5304m8459j8747L1972
247h059L7977n770l8971j8754K4865L0421o947l3629j3764K5966K8653q390l4832
260b1234j4506K2924K8479l208k7431j4011J4708J8874k823j7548n383J4468J1016
273D325j0494j7379Q06J9029J1051j2178j8884J101J7222Q023j1015j2607O049
286a4951J5933O22j8188j1177J4706K3088J38k5447j7876J4751K8603M894k4667
299i571j9538J2778K6685K609k4692j6375J6931K8741P10l0419k0068J7788L4023
312A9602O393k9345k5851J1177L2472J0456k2744k3162Q423K7140P867k1886k0664
325b0122J0323K7856Q587k2487k3379N886K7099J2927j5636k1506M02J8727J0252
$$ plain form
235 -22223 -30814 9922 43789 22192 -27258 -38542 3395 42479 27175 -21284 -40031 -8059
247 -8059 29918 24148 -14823 -33577 -8712 21709 14762 -18867 -32631 -6665 21988 13598 -21234
260 -21234 -35740 -12816 15663 12455 -14976 -28987 -14279 4595 1772 -15776 -21159 -6691 4325
273 4325 -6169 -23548 -22742 -3713 7338 -4840 -23724 -22623 -5401 2622 -8393 -21000 -14951
286 -14951 982 1604 -16584 -27761 -13055 10033 10171 -15276 -33152 -18401 10202 15096 -9571
299 -9571 -29109 -16331 10354 12963 -11729 -28104 -11173 17568 18278 -12141 -32209 -14421 19602
312 19602 25995 -3350 -29201 -18024 14448 24904 2160 -21002 -12579 14561 22428 542 -20122
325 -20122 -9799 18057 26644 4157 -19222 -13336 13763 26690 11054 -10452 -10050 8677 18929
338A8929r558j3731K316J3427M496j1133j0059N286J2844L308r944q922L217Q233
352H709J135n107r75M765J140p512o041O190J2489J281j3821j1189O755J5885
366A3704K933j4702j0942Q191J6827k89j9211j1704J3982K2867N2k5400j8963
379b2655J3826K9279O087k5430k3422R375K9065Q564k3441k3237R437K9935Q157
392B5540k6062k6183R579L4560J3015k6229l1276M039L3295J8165k0596k9594
404b1747q5K8265J6059j7698k5705J957K6592J5030j7888k7263K90K6398J6770
417B0975j3356k5275l864K0443J5867r328j9088j804J5857R932j0916j4907J904
430a3560J6693P880j1787j5313J704J5009P434r573j0844K865J0879J235j0627
$$ plain form
338 18929 9371 -4360 -2044 11383 15879 4746 -5313 -27 12817 16125 6181 -2741 476 8709
352 8709 9844 4737 3762 8527 9667 2155 -3886 2304 14793 16074 2253 -8936 -2181 13704
366 13704 16637 1935 -9007 -816 16011 15722 -3489 -15193 -1211 21656 21708 -3692 -22655
379 -22655 -8829 20450 26537 1107 -22315 -12940 16125 24689 1248 -21989 -12552 17383 25540
392 25540 -522 -26705 -17126 17434 30449 4220 -27056 -23017 10278 28443 7847 -21747
404 -21747 -21832 6433 22492 4794 -20911 -18954 7638 22668 4780 -22483 -22193 4205 20975
417 20975 7619 -17656 -21520 -1077 14790 5462 -13626 -15430 427 10359 -557 -15464 -13560
430 -13560 3133 11013 -774 -16087 -14383 626 8060 -1513 -12357 -9492 1387 2622 -8005
443h005n768R665J2106l739j6432o560J3106J6354k815j8450p927J3066J5318
456I919l988j7640n717J6229J5760p916k2320o084K0601K1334p123k6284j0971
469b4200J9173K3496k577k4152j1851J5872K1405l083k2714j0390J7330K2465
481B0774l032k5434j3755J6381K5299J841k3429j6402J0905K1974M225j7394j3571
494a1618Q532J7325J678j5508j0684Q946J6594K084j4776j1778N272J4724N268
507A6059r760r425J970Q043J825n435k939M545M024l731o779N79O487L854m568
522D749o076J230N601j30o304k227O573P114m397j3070l484J1804J2595l879j6814
537f715p832J1741J4925k450j6298p764J1966J4825m022j8978p937J4938J8985
$$ plain form
443 -8005 -13773 -4108 7998 4259 -12173 -18733 -5627 10727 7912 -10538 -18465 -5399 9919
456 9919 5931 -11709 -17426 -1197 14563 6647 -15673 -21757 -1156 20178 13055 -13229 -24200
469 -24200 -5027 18469 15892 -8260 -20111 -4239 17166 14083 -8631 -19021 -1691 20774
481 20774 17742 -7692 -21447 -5066 20233 22074 -1355 -17757 -6852 15122 19347 1953 -11618
494 -11618 -3086 14239 15917 409 -10275 -1329 15265 17349 2573 -9205 -3933 10791 16059
507 16059 6299 -3126 -1156 6887 8712 3277 338 4883 8907 5176 -1603 -1024 5463 9317 4749
522 4749 -1327 -97 5504 5374 -930 -3157 3416 10530 6133 -6937 -10421 1383 13978 10099 -6715
537 -6715 -14547 -2806 12119 9669 -6629 -14393 -2427 12398 8376 -10602 -18539 -3601 15384
550A5384k954k3235j2827J4874K2485J504k1767j6422J1021K2526K295k0098j3932
563b1146J0968K1140J699k1035j4825J1188K2855M508j9781j8150P487K1408P255
576A3571j5002j5960M839J7329N327j3968j1759O947J5587L123j4020j1938O732
589i192J5334L764j1259j0201L978J1217K181q537n021N694Q129k227j0322k738
603i200J0056Q886m316j2126k615J0331Q277m950j0711K2J0863O354r398j1881
617a0408L056J5752P464j1856j6622J312J8238J1321j1033j7911p79J7501J1412
630A7447j1122j7410Q85J8491J1306j2991k0285L30K0880J4544j1171k2259l961
643a5316J8718J6147p223j9696n200J5408J4159o521j8278l999J5728J4142o272
$$ plain form
550 15384 12430 -10805 -23632 -8758 13727 15231 -6536 -22958 -11937 10589 12884 -7214 -21146
563 -21146 -10178 10962 12661 -8374 -23199 -12011 10844 15352 -4429 -22579 -15092 6316 13571
576 13571 -1431 -17391 -12552 4777 10104 -3864 -15623 -8676 6911 10034 -3986 -15924 -9192
589 -9192 6142 9906 -1353 -11554 -7576 3641 5822 -2715 -7736 -2042 6087 3860 -6462 -9200
603 -9200 856 9742 5426 -6700 -9315 1016 9293 4343 -6368 -6346 4517 10871 1473 -10408
617 -10408 -7352 8400 15864 4008 -12614 -11302 6936 18257 7224 -10687 -11466 6035 17447
630 17447 6325 -11085 -10200 8291 19597 6606 -13679 -13349 7531 22075 10904 -11355 -15316
643 -15316 3402 19549 12326 -7370 -12570 2838 16997 10476 -7802 -11801 3927 18069 11797
656A1797j9014o328J4418J5411k812j6178q470R417J2895o37j1638n222O963Q604
670I206k524r792k897P645P481k689q762l219N063N557p21m433j116K298N81l105
686a427j639M186M317k508p549k417O076O758k259q329k309O934N683n085r178
701h746M26J0708O447q102j3324m18J3493J0407o626j5421m144J2383J1893m504
715D472j4651m584J2318J1621n835j6053l811J4492J3699n376j8396o784J3543
728e345J5651k287j6062q543R809J3986j103j3192o586R330J2423k305j3720o441
742a4385R972J3177q14j3256p771P489J1852N01r246n598N504P654j517p516j857
757e811P102O337m001q496j111P910N772l304o949n90O448L112n165n159M030
$$ plain form
656 11797 -7217 -13545 873 16284 13472 -2706 -11176 -1759 11136 10499 -1139 -6361 602 9206
670 9206 6682 -3110 -6007 1638 9119 6430 -2332 -5551 -488 5069 4348 -85 -1201 1097 1678 -1427
686 -1427 -3066 1120 5437 2929 -4620 -7037 -961 5797 3538 -4791 -7100 -166 5517 432 -8746
701 -8746 -8320 2388 8835 733 -12591 -13009 484 10891 4265 -11156 -15300 -2917 8976 4472
715 4472 -10179 -14763 -2445 9176 3341 -12712 -16523 -2031 11668 6292 -12104 -18888 -5345
728 -5345 10306 8019 -8043 -16586 -6777 7209 6106 -7086 -13672 -4342 8081 5776 -7944 -14385
742 -14385 -4413 8764 7950 -5306 -13077 -5588 6264 6765 -2481 -8079 -2575 5079 3562 -3954 -5811
757 -5811 1291 7628 3627 -4869 -5980 1930 7702 4398 -2551 -3141 3307 6419 1254 -3905 125
772A25P746P40q860o810N585J1689J528j0472q866M762J2573K195j0839q694O357
787a241J2709J069j3428r600Q299J5613K348j5391j2933O610J7628N307j4089
800B901j3788M041J6039O003j2927j3427M614J6601N386j3348j4907L769J7612
813H569P984j2197j5546N84J5356R025q851j3136k85J1723P509p658j1675O87
827g911J1569O633p100j1496q37J0506P328m645r004j954O129N014k953n058M38
842c341M432J560m332l454K411N115J64m511k803K495L675q82l655o5M246J722
858B777m842m944K025P922L521o728q446J151R182N314o413q657R55R538M218
873F573p357r000K407J1464M951r017j1899J575J3069Q034q012j2896j248J1424
$$ plain form
772 125 7871 8611 -249 -7059 -1474 10215 11743 1271 -7595 -2833 9740 11935 1096 -7598 -1241
787 -1241 11468 12537 -891 -10491 -2192 13421 15769 378 -12555 -5945 11683 16990 2901
800 2901 -10887 -6846 9193 15196 2269 -11158 -6544 10057 15443 2095 -12812 -9043 8569
813 8569 16553 4356 -11190 -10606 4750 13775 4924 -8212 -8497 3226 10735 3077 -8598 -7911
827 -7911 3658 10291 3191 -8305 -9142 1364 8692 4047 -4957 -6911 -782 4232 1279 -3779 -3341
842 -3341 1091 2651 -1681 -5135 -2724 2391 2555 -1956 -4759 -2264 1411 529 -3126 -3191 1055 2777
858 2777 -2065 -7009 -4984 2938 6459 -269 -8715 -7564 1618 6932 519 -8138 -7183 2355 6573
873 6573 -784 -9784 -7377 4087 9038 21 -11878 -10303 2766 10800 2788 -10108 -11356 68
887F8Q674n566j1613j296J0631P633o274j1897p89J1701Q598o096j2637k588J0443
902a008R428l465j0591l406P636O907k450p805j296O581N417l783p835p27P500
917A103N414l318p071j264N725L804k636l786Q43M466K45n019k470M636N428p35
933E365p004l355N048O617j038o632k899N704N874k853q239j298Q270P506m018
948G048j1854l108R947J0460l082j2458n268Q967J0890k302j2232n133R566J0843
962A2284k945j3625o100J0522J3083j715j4792q284Q518J3965J008j2766r226
975a0073O308J2402J387j1353q177O394J1683R83j1423q892N794J2110K452r774
989a79r389L111J0161L477o769p237K158P229J845n939n246K998O697Q63n999
$$ plain form
887 68 8742 3176 -8437 -9733 898 8531 2257 -9640 -10429 1272 9870 3774 -8863 -11451 -1008
902 -1008 8420 4955 -5636 -9042 -1406 5501 3051 -4754 -6050 531 5948 2165 -5670 -6397 1103
917 1103 6517 3199 -3872 -5136 589 4393 1757 -2029 -1186 3280 3525 -1494 -3964 672 6100 5365
933 5365 -1639 -4994 54 6671 5633 -999 -3898 1806 7680 4827 -3412 -4710 3560 11066 7048
948 7048 -4806 -7914 2033 12493 9411 -3047 -8315 652 11542 9240 -2992 -8125 1441 12284
962 12284 9339 -4286 -10386 136 13219 11504 -3288 -11572 -3054 10911 11919 -847 -10073
975 -10073 -3765 8637 10024 -1329 -9506 -3112 8571 9554 -1869 -10761 -4967 7143 9595 -179
989 -179 -9568 -6457 3704 7181 412 -6825 -4667 2562 4407 -1532 -6778 -3780 2917 3780 -2219
1004b219m711K635N647J197m157l028J775L148r04l147L72L528J816l543m405
1019e996J460N599J942m071m887J613N573J451n023m063L264O858K11p600n351
1034i020M882R240J489q381p838L690J0110L213p674p868K979R366K863q177p627
1049h753L902J0501K807q539r239K662J1288M824o898r784N72R288N232n367p992
1064e496Q42P621M180n429p449J083Q101M201n213p097j37O737M207l062n461
1079b372j63M192K097l036k907K039L588J93m039k597K899M061o7m233j853L127
1095I29K714j901l515O03M874J597m487n407J435P439L487n412p250N92P525M261
1111G484m779p523P17Q057L850n968q295J109J0118N514p030j0989j13J0778P662
$$ plain form
1004 -2219 -6930 -4295 1352 2549 -1608 -4636 -2861 287 -617 -3764 -3392 136 1952 -1591 -5996
1019 -5996 -4536 1063 3005 -1066 -5953 -4340 1233 2684 -2339 -6402 -3138 3720 3931 -3669 -9020
1034 -9020 -4138 5102 6591 -1790 -9628 -5938 4172 7385 -289 -8157 -5178 4188 7051 -1126 -8753
1049 -8753 -4851 5650 8457 -82 -9321 -6659 4629 9453 2555 -7229 -6657 2631 7863 2496 -5496
1064 -5496 -4654 2967 7147 1718 -5731 -4648 3453 7654 2441 -4656 -4793 1944 6151 3089 -2372
1079 -2372 -2535 1657 3754 718 -2189 -150 3438 3631 -408 -3005 -106 3955 3888 -345 -2198 929
1095 929 3643 1742 -1773 -1170 3704 5301 814 -4593 -3158 4281 7768 2356 -4894 -4302 3223 7484
1111 7484 2705 -4818 -4101 3956 7806 1838 -6457 -5348 4770 10284 3254 -7735 -7848 2930 10592
1126A0592n652j1245j924R442Q035m540j0553j907R406P578m998j0850k575J0150
1140I59Q764m116j1480m202Q664R155k020r625m420O334P502j399q312k980N914
1155a262O509j656q335l066N658O666q33o546l645L693M877m70m190j342L070
1170h72K394j937l685M99L906K098k869l562M20L779J764k886k761J802L693o09
1186A174m226j887M122N197j413o477l117N241O382p43o784l651M840O124n35
1201D247o752l472N466P234j378q265m466O079R005o6q971o106N086Q735J082
1216G458p530n692L721Q093P27p146n362M235P937Q83p063n975K893Q560K064
1231G803o091n984J532O151K385m326m078J654M434Q20m130l075K095M443N70
$$ plain form
1126 10592 4940 -6305 -8229 1213 9248 4708 -5845 -7752 1654 9232 4234 -6616 -9191 959
1140 959 9723 5607 -5873 -10075 -1411 7744 5724 -3901 -8321 -1987 5515 4116 -4196 -7176 -1262
1155 -1262 5247 3591 -4744 -7810 -2152 4514 3681 -2865 -6510 -2817 2060 1590 -2600 -3942 -872
1170 -872 1522 -415 -4100 -3601 305 2403 -466 -4028 -3608 171 1935 -951 -3712 -1910 1783 1174
1186 1174 -3052 -4939 -817 4380 2967 -3510 -6627 -1386 4996 4253 -2531 -6182 -1342 4782 4247
1201 4247 -2505 -5977 -511 6723 5345 -2920 -7386 -1307 7698 7632 -1339 -7445 -2359 6376 7458
1216 7458 -72 -5764 -2043 6050 6777 -369 -5731 -1496 6441 7324 261 -5714 -2821 5739 7803
1231 7803 1712 -4272 -2740 3411 5796 1470 -2608 -954 3480 4300 170 -2905 -810 3633 4203
1246D203l725l101J466L328M57k305j397J437J397j576k289J212L228O30l219
1261b54l494J469M224J477m007l328J972M441K67m688l126L470N500p2o493m713
1277g355L938P842J295p053o086K827P770K220o153o469L108P848J969p254o473
1292h026L316Q958L013p592q168J848R662M491o179p856K15Q176M441n057p514
1307f272R23P831M112n634p409M86Q065M320m150p639q42O474M946k717n954n36
1323c996M451L206k819m247O66M406J919l333l914Q28M372J777k503k896K25L043
1339A185M71k349j398K341K522j467l853r30L997L408j543m752j327L991L375
1354C671j707m635n29M837K905l148n834J5O474M375l463p408j170O387N686k594
$$ plain form
1246 4203 478 -2623 -1157 2171 2628 323 -1074 363 1760 184 -2105 -893 2335 2965 -254
1261 -254 -3748 -2279 1945 3422 -585 -3913 -1941 2500 2767 -1921 -5047 -1577 3923 3851 -2642 -7355
1277 -7355 -3417 4425 5720 -1333 -7419 -4592 3178 5398 -755 -7224 -4116 3732 5701 -1553 -8026
1292 -8026 -4710 4248 7261 -331 -8499 -6651 3011 7502 1323 -6533 -6318 1858 6299 1242 -6272
1307 -6272 -5349 2482 6594 960 -6449 -5963 2102 6422 2272 -5367 -6209 265 5211 2494 -3460 -3996
1323 -3996 455 3661 842 -3405 -2739 1667 3586 253 -3661 -2833 1539 3316 813 -2083 -1858 1185
1339 1185 1656 -693 -2091 250 2772 1305 -2548 -3478 519 3927 2384 -2368 -3695 296 3671
1354 3671 1964 -2671 -3200 1637 4542 1394 -4440 -4425 2049 6424 2961 -4447 -5617 770 6456 3862
1370C862p232j993N898N363k374p218j178O083N358k588p806k413P016O302k171
1385D909p229l192M491O347J61o434l442L404N491m81n176k939L878N030q95m662
1401g39l228L379M579N50m437k726J516L136J58k755p85J782J884j229k453j70
1417a538K522R26j462k020K38K254O08k817n71J339K891j750l046q47M019K733
1433C479j958l856k106M194M130j495n665j713M750L813j303o133j564N284M562
1448D419j581o839k594M994O346j193o302l714L880O428P78o752l639L742O058
1463D031j8o432m076M086O774P82o729n109L188O926J632n209m734J767N484J569
1479C932m169l963J962N122O38m487l453K314M880R57l676l266J232L573R44k683
$$ plain form
1370 3862 -3370 -5363 535 5898 3524 -3694 -4872 1211 6569 3981 -3825 -6238 778 7080 4909
1385 4909 -2320 -5512 -1021 5326 5487 -947 -4389 -985 4506 4025 -1151 -4090 -212 4818 3923 -739
1401 -739 -3967 -588 3991 4541 104 -2622 -1106 2030 2188 -567 -1352 430 2314 1085 -1368 -1538
1417 -1538 984 1910 448 -1572 -1334 920 1528 -1289 -1860 -521 2370 620 -2426 -3273 746 3479
1433 3479 1521 -2335 -4441 -247 3883 2388 -3277 -4990 -240 3573 2270 -3863 -5427 -143 4419
1448 4419 2838 -4001 -6595 -1601 4745 3552 -2750 -6464 -2584 3844 4622 -2130 -5769 -2027 4031
1463 4031 4013 -2419 -6495 -2409 4365 5147 -1582 -6691 -3503 3423 5055 -154 -4888 -3121 2363 3932
1479 3932 -237 -4200 -2238 2884 3522 -965 -4418 -2104 2776 3733 57 -3209 -1977 1596 2540 -143
1495a43j795J601K080p30k535j5K320J879j637k873k86L059J829j913l014M36
1511a737L310O50k672k343J639L988L56l465m036J911M977J927l904m937J247
1526c089N473K061m202m606J603N794J759m906n072J665O771K946n090o566R07
1541d552O576L796l877o081j85N931L592l416n743J77N797L369l332n904l78N643
1557A413M347k641n637j404M158L895j282l970j202L049K472j552l265k17K963
1572A127K128j568l061o14K717K031j112k184j46J502M52j191q10J431J482r18
1588A266k349n71K042K041j016k984r0K274J700j661l025N27L092K181l164m134
1604c871P39M446K878k892n041o87M934L443k193n194j018M648L731k765n236
$$ plain form
1495 -143 -1938 -337 1743 1013 -1522 -1537 783 2662 1025 -1848 -2134 925 2754 841 -2173 -1737
1511 -1737 1573 2223 -449 -2792 -1153 2835 3191 -274 -4310 -2399 2578 4505 601 -4336 -3089
1526 -3089 2384 4445 243 -4363 -2760 3034 4793 -113 -5185 -3520 3251 6197 1107 -5459 -4552
1541 -4552 2024 5820 1943 -4138 -4323 1608 5200 1784 -3959 -3782 2015 5384 2052 -3852 -4230 1413
1557 1413 5760 3119 -2518 -3922 236 4131 2849 -1121 -2323 726 3198 1646 -1619 -1836 1127
1572 1127 3255 1687 -1374 -1988 729 2760 1648 -536 -682 820 1272 81 -729 702 2184 1266
1588 1266 -1083 -1654 388 2429 1413 -1571 -1661 613 2313 652 -2373 -1846 1246 3427 263 -3871
1604 -3871 -3132 1314 4192 1300 -3741 -4428 506 3949 1756 -3438 -4456 192 3923 1158 -4078
1619d078n38M999M072k852n641j608N206M751j700n904k294M127M695p86n322
1634b873j917L818L809r24m808j762L675M271j045m510k373K952M030j31l437
1649a225j790J951K623m42k609n87K066J896j038k580k64K393J836j271k215J29
1665a127J878P57j524j154J216J900l94k512j233K359L064o57l329j882K282L289
1681B933r4l486k033K639L692r67m290j712L347M445n62n534k913L620N239K89
1697D613n369l461K706N423J91m833l412K739N355K61n097l810K840N703J043
1712D892n015m462J852N509J672m026l950J100M437J535l472l259J301M060J338
1727C512l426l506J158L795J722k520l149M42K802J157j479j989N40K043K09j618
$$ plain form
1619 -4078 -4616 383 4455 1603 -4038 -5646 -440 4311 2611 -3293 -5587 -1460 3235 2449 -2873
1634 -2873 -4790 -972 2837 1913 -2895 -4657 -982 3289 2244 -2266 -4639 -1687 2343 2212 -1225
1649 -1225 -3015 -1064 1559 1117 -1492 -2079 -13 1883 845 -1735 -1999 394 2230 959 -1256 -1127
1665 -1127 751 1508 -16 -1170 46 1946 1552 -960 -2193 166 3230 2573 -756 -2638 -356 2933
1681 2933 2839 -647 -2680 -41 3651 2684 -1606 -3318 29 4474 3912 -1622 -4535 -915 4324 4613
1697 4613 -756 -4217 -1511 3912 4103 -730 -4142 -1403 3952 4213 -884 -4694 -1854 3849 4892
1712 4892 -123 -4585 -2733 2776 4448 422 -3528 -2428 2009 3544 72 -3187 -1886 2174 3512
1727 3512 86 -3420 -2262 1533 3255 735 -2414 -1972 830 1987 508 -1481 -941 1102 1311 -307
1743c07j175J223J906k36j978j017J271J418o23j342k4J714O63k031j545J235
1759h48K536P10k809k589J093L535J251k808k811P40L490J410l314k834J345M223
1775B320J303m004l764J567M536K177l838m348O05M467K827k972m444K00M325
1790I57K545k911m250N15M446K374k770m510j3M210K992k005m170r17L425K573
1806B491j038l388o72K942J738j516k582k16K790J735j384k705k74K066J652q56
1822G83j664R3J530K50j319q38J400J427n14j930p91J654J681n37k194m64K167
1839G34J311j133k490K46K636J793j994l342o8L790K362k034l883n08L584K585
1855C589j504m424l44L652K969k066m656m72M174L537j966m987j410M057M275
$$ plain form
1743 -307 -1482 -259 1647 1411 -567 -1584 -313 1105 482 -860 -884 830 1493 -538 -2083 -848
1759 -848 1688 2398 -411 -3000 -1907 1628 2879 71 -2740 -2000 1490 2900 -414 -3248 -1903 2320
1775 2320 3623 -381 -4145 -2578 1958 4135 297 -4051 -3446 1021 3848 876 -3568 -3368 957
1790 957 3502 591 -3659 -3144 1302 3676 906 -3604 -3617 593 3585 1580 -2590 -3507 -82 2491
1806 2491 1453 -1935 -2607 335 2073 557 -2025 -2241 549 2284 900 -1805 -2079 -13 1639 783
1822 783 -881 -788 742 992 -327 -1165 235 1662 1148 -782 -1573 81 1762 1225 -969 -1433 734
1839 734 2045 912 -1578 -1332 1304 3097 1103 -2239 -2307 1483 3845 1811 -2072 -2580 1004 3589
1855 3589 2085 -2339 -2683 969 3938 1872 -2784 -3256 918 4455 2489 -2498 -3908 149 4424
1870D424j385m723k071L117M128q38m365j782L164L739r60m470j741L088L706
1885C031k94l956k395K153L786J7l074k038J646K675p2k622j224J754K238m76
1901A149k267j305J710J986j81j877r48J354Q13k73j165J86J590J50j449j253
1917a780R10J899M62k180j345J393J930j98j898j211J598K620n45k858j531K125
1933f09L310o82l119k168K103L669M14l498k766J963M205l75l658j760K121L146
1949B296Q57l991k620J675M467J764m408l807J895M101Q84l326k648J619K676
1964A434J148k766k486J030L319J164k739k910Q87L073J242j812k256K76K170
1979G74O27j042j602O98J375J75j153j131R53J338l9j219n23O66Q63l83r04N6
$$ plain form
1870 4424 3039 -1684 -3755 -638 3490 2652 -1713 -3495 -331 3408 2448 -2022 -3763 -675 3031
1885 3031 2737 -1219 -3614 -1461 2325 2342 -732 -2770 -1124 1551 1479 -1143 -2367 -613 1625 1149
1901 1149 -1118 -2423 -713 1273 1092 -785 -1733 -379 434 161 -1004 -818 772 922 -527 -1780
1917 -1780 -870 1029 1491 -689 -2034 -641 1289 1091 -807 -2018 -420 2200 1655 -1203 -2734 -609
1933 -609 2701 2019 -1100 -3268 -1165 2504 2918 -580 -3346 -1383 2822 2447 -1211 -2971 -850 2296
1949 2296 3153 -838 -3458 -1783 2684 4448 40 -3767 -1872 2229 3113 -213 -2861 -1242 1434
1964 1434 2582 -184 -2670 -1640 1679 2843 104 -2806 -1919 1154 2396 584 -1672 -1396 774
1979 774 1401 359 -1243 -545 830 1005 -148 -1279 -326 1012 973 -246 -769 -103 760 377 -527 -471
1997d71J202L76j320j343J029J989M73k019k096J252K521O69k162k027R18K729
2013A720O41k500k453J442L576O71l230k992J357L791J492k713l677P74L524K081
2029C504k838l196N16L607J764k680l491N11L933K055k497l943k37L905K544j947
2045A510l553m81K885K122j403l078q0K517J783j330l018j95K722J721j159k528
2061a565n66J952J655r24j700n25J811N02p62j253L99J733J73j527r84Q36J303
2078E58J71j256p39J092J045n28j654l78J742J570j073k390m41K345K042j142
2094I64k593q70K497K047r62k583q13K593K201j239l207q50L031K813j002l790
2110a763j425K717L207l95l522j712K553K701m19l182j496K463K864l90l307j739
$$ plain form
1997 -471 731 1107 -213 -1556 -527 1462 1935 -84 -2180 -928 1593 2262 100 -1927 -1009 1720
2013 1720 2361 -139 -2592 -1150 2426 3097 -133 -3125 -1768 2023 3515 802 -2875 -2101 1423 3504
2029 3504 666 -2530 -2014 1593 3357 677 -2814 -2303 1630 3685 1188 -2755 -2992 913 3457 1510
2045 1510 -2043 -2524 361 2483 1080 -1998 -2078 439 2222 892 -2126 -2321 401 2122 963 -1565
2061 -1565 -2131 -179 1476 552 -1148 -1673 138 640 -122 -1375 -976 757 930 -597 -1581 -745 558
2078 558 729 -527 -1266 -174 871 343 -1311 -1689 53 1623 550 -1840 -2281 64 2106 964
2094 964 -1629 -2499 -2 2045 1083 -1500 -2313 280 2481 1242 -1965 -2815 216 3029 2027 -1763
2110 -1763 -3188 -471 2736 2341 -1181 -2893 -340 2361 1942 -1240 -2736 -273 2591 2201 -1106 -2845
2126b845K061L247P3l030j993J476K684N00k163j919J282K117j1j842j331J209
2142d85J950j7j818j219R30J485K75j262q92N24O72K07r94J52P39K49p54l45P73
2161A70N21Q44j731j701J906Q39J32j321j139J360J615n95k223n59J421K770p55
2178A554k496j487J978K224K18k535j632J574K708k14k736j403J719L062O4l108
2194e10k358J865K983P72k654k606J096L165R35k579k386J006L042P56k481k224
2210b178Q06K750R93k013k504N43K439J218j578j860J04J923P69j246j390O51
2226e73J209M48j236j024M93J489O7r75j161P66J019j77j063J03N74P54o56j459
2244a402L84J315J102j402j604J03J976O64j315j444L48J781R45j569k005N66
$$ plain form
2126 -2845 -784 2463 2536 -494 -2487 -1011 1673 2173 10 -1909 -627 1490 1479 -363 -1694 -485
2142 -485 1465 1448 -370 -1589 -659 826 1101 -161 -1053 -529 143 350 -644 -492 247 496 -258 -603 170
2161 170 691 1535 -196 -1897 9 848 980 -341 -1480 -120 1495 900 -1323 -1882 -461 2309 1554
2178 1554 -942 -2429 -451 1773 1991 -544 -2176 -602 2106 1892 -844 -2247 -528 2534 2598 -510
2194 -510 -2868 -1003 1980 2752 98 -2508 -1412 1753 2688 109 -2277 -1271 1771 2527 46 -2178
2210 -2178 -1372 1378 2371 358 -2146 -1603 836 2054 476 -1384 -1280 643 1412 166 -1224 -573
2226 -573 636 1084 -152 -1176 -683 806 873 -102 -1263 -497 522 345 -718 -615 -41 713 57 -1402
2244 -1402 -1018 297 1399 -3 -1607 -1504 472 1136 -179 -1623 -1275 506 1451 -118 -2123 -1557
2260a557K556J021k074k228K66K923J327j823k514q7K608J885j810k598M9K728
2276F72J878j807k778k27K978J893j633k823o32K712K417j158k755q06K175J846
2292A952l26k762o26K077J824p98k423o87J909J868o22j983p61J163J520k15j513
2309d03k78Q57P28k43j113j2Q98N82o65q45K51M78N05p74k85M63M89k69j099l
2329g38J037R93p25j510k17J272J436q19j738l86J471J454r64j654n16J923J738
2346B057j229k605k41K202J880p89k549q31J769K294n20k351j036J818K251q15
2362A305k528p17J616K375n38k539j113J306K669k3k240j506J121K248L9j537
2378f2j560J232J824j9j722r01R21J638J38j775q09O51J521j09j067m02O61N85
$$ plain form
2260 -1557 999 2020 -54 -2282 -2016 907 2234 411 -2103 -2190 418 2303 493 -2105 -2056 672
2276 672 2550 743 -2035 -2262 716 2609 976 -1847 -2479 233 2650 1492 -1263 -2069 106 1952
2292 1952 1626 -1136 -1762 315 2139 1341 -1082 -1769 140 2008 1386 -597 -1358 -195 1325 1110 -403
2309 -403 -681 176 904 661 -452 -464 434 1016 351 -494 -243 235 740 -34 -319 144 633 364 -735 -738
2329 -738 299 1292 567 -943 -1160 112 1548 729 -1009 -1395 76 1530 566 -1088 -1604 319 2057
2346 2057 828 -1777 -2018 184 2064 1275 -1274 -2105 -336 1958 1438 -913 -1949 -131 2120 1305
2362 1305 -1223 -1940 -324 2051 1513 -1026 -2139 -833 1836 1813 -427 -1933 -812 1436 1475 -62
2378 -62 -1622 -390 1434 1415 -307 -1208 -287 1351 1489 -286 -1095 -444 1077 968 -99 -501 160 745
$$ [...]
8191f4
##END NTUPLES=NMR FID
##END=
