##TITLE=1H_AM M299
 CDCl3, 8 sc, 
 3.06.2021
##JCAMPDX= 6.0         $$ Bruker NMR JCAMP-DX V2.0
##DATA TYPE= NMR FID
##DATA CLASS= NTUPLES
##ORIGIN= UXNMR, Bruker Analytische Messtechnik GmbH
##OWNER= root
$$ XWIN-NMR		Version 3.5
$$ Thu Jun  3 11:18:18 2021 Russian Standard Time (UT+4h)  she@DPX200
##.OBSERVE FREQUENCY= 200.131506
##.OBSERVE NUCLEUS= ^1H
##.DELAY= (6, 6)
##.ACQUISITION MODE= SIMULTANEOUS
##.ACQUISITION SCHEME= undefined
##.AVERAGES= 8
##.DIGITISER RES= 18
##SPECTROMETER/DATA SYSTEM= spect
##.PULSE SEQUENCE= zg30
##.SOLVENT NAME= CD3CN
##.SHIFT REFERENCE= (INTERNAL, CD3CN, 0, 15.7039)
##AUDIT TRAIL= $$ (NUMBER, WHEN, WHO, WHERE, WHAT)
$$ ##TITLE= Audit trail, XWIN-NMR		Version 3.5
$$ ##JCAMPDX= 5.01
$$ ##ORIGIN= Bruker BioSpin GmbH
$$ ##OWNER= she
$$ F:/spectra/data/she/nmr/H-F/1/audita.txt
$$ ##AUDIT TRAIL=  $$ (NUMBER, WHEN, WHO, WHERE, WHAT)
(   1,<2021-06-03 11:16:54.90 +0400>,<she>,<DPX200>,
      <created by zg, POWCHK disabled, PULCHK disabled
       configuration hash MD5:
       00 E9 B6 7A A2 85 ED C7 34 08 36 98 17 FE 4E 26
       data hash MD5: 16K
       F7 40 B1 52 B0 72 23 53 8D 4D 05 8B 56 B7 6E 80>)
$$ ##END=
$$ 
$$ hash MD5
$$ B4 4E BF 73 D1 93 44 E3 54 E2 C4 66 00 1A 89 BE
##$RELAX= 
##$RELAX= 
##$RELAX= 
##$RELAX= 
##$RELAX= 
##$RELAX= 
$$ Bruker specific parameters
$$ --------------------------
##$DU= <F:/spectra>
##$EXPNO= 1
##$NAME= <H-F>
##$PROCNO= 1
##$TYPE= <nmr>
##$USER= <she>
##$AMP= (0..31)
100 100 100 100 100 100 100 100 100 100 100 100 100 100 100 100 100 100 
100 100 100 100 100 100 100 100 100 100 100 100 100 100 
##$AQSEQ= 0
##$AQ_mod= 1
##$AUNM= <au_zg>
##$AUTOPOS= <>
##$BF1= 200.13
##$BF2= 200.13
##$BF3= 200.13
##$BF4= 200.13
##$BF5= 200.13
##$BF6= 200.13
##$BF7= 200.13
##$BF8= 200.13
##$BYTORDA= 1
##$CFDGTYP= 0
##$CFRGTYP= 5
##$CHEMSTR= <none>
##$CNST= (0..31)
1 1 145 1 1 1 1 1 1 1 1 1 1 1 1 1 1 1 1 1 1 1 1 1 1 1 1 1 1 1 1 1 
##$CPDPRG= <>
##$CPDPRG1= <>
##$CPDPRG2= <>
##$CPDPRG3= <>
##$CPDPRG4= <mlev>
##$CPDPRG5= <mlev>
##$CPDPRG6= <mlev>
##$CPDPRG7= <mlev>
##$CPDPRG8= <mlev>
##$CPDPRGB= <>
##$CPDPRGT= <>
##$D= (0..31)
0 1.2 0 0 0 0 0 0 0 0.06 0 0.03 0 0 0 0 0.0002 0 0 0 0 0 0 0 0 0 0 0 0 
0 0 0 
##$DATE= 1622704614
##$DBL= (0..7)
120 120 120 120 120 120 120 120 
##$DBP= (0..7)
150 150 150 150 150 150 150 150 
##$DBP07= 0
##$DBPNAM0= <>
##$DBPNAM1= <>
##$DBPNAM2= <>
##$DBPNAM3= <>
##$DBPNAM4= <>
##$DBPNAM5= <>
##$DBPNAM6= <>
##$DBPNAM7= <>
##$DBPOAL= (0..7)
0.5 0.5 0.5 0.5 0.5 0.5 0.5 0.5 
##$DBPOFFS= (0..7)
0 0 0 0 0 0 0 0 
##$DE= 6
##$DECBNUC= <off>
##$DECIM= 32
##$DECNUC= <off>
##$DECSTAT= 4
##$DIGMOD= 1
##$DIGTYP= 9
##$DL= (0..7)
0 120 120 120 120 120 120 120 
##$DP= (0..7)
150 150 150 150 150 150 150 150 
##$DP07= 0
##$DPNAME0= <>
##$DPNAME1= <>
##$DPNAME2= <>
##$DPNAME3= <>
##$DPNAME4= <>
##$DPNAME5= <>
##$DPNAME6= <>
##$DPNAME7= <>
##$DPOAL= (0..7)
0.5 0.5 0.5 0.5 0.5 0.5 0.5 0.5 
##$DPOFFS= (0..7)
0 0 0 0 0 0 0 0 
##$DQDMODE= 0
##$DR= 18
##$DS= 0
##$DSLIST= <SSSSSSSSSSSSSSS>
$$ [...]
##$SUBNAM2= <"">
##$SUBNAM3= <"">
##$SUBNAM4= <"">
##$SUBNAM5= <"">
##$SUBNAM6= <"">
##$SUBNAM7= <"">
##$SUBNAM8= <"">
##$SUBNAM9= <"">
##$SW= 20.0188882624521
##$SWIBOX= (0..15)
0 0 2 0 0 0 0 0 0 0 0 0 0 0 0 0 
##$SW_h= 4006.41025641026
##$TD= 16384
##$TD0= 1
##$TE= 0
##$TE2= 300
##$TE3= 300
##$TEG= 300
##$TL= (0..7)
0 120 120 120 120 120 120 120 
##$TP= (0..7)
150 150 150 150 150 150 150 150 
##$TP07= 0
##$TPNAME0= <>
##$TPNAME1= <>
##$TPNAME2= <>
##$TPNAME3= <>
##$TPNAME4= <>
##$TPNAME5= <>
##$TPNAME6= <>
##$TPNAME7= <>
##$TPOAL= (0..7)
0.5 0.5 0.5 0.5 0.5 0.5 0.5 0.5 
##$TPOFFS= (0..7)
0 0 0 0 0 0 0 0 
##$TUNHIN= 0
##$TUNHOUT= 0
##$TUNXOUT= 0
##$USERA1= <user>
##$USERA2= <user>
##$USERA3= <user>
##$USERA4= <user>
##$USERA5= <user>
##$V9= 5
##$VALIST= <valist>
##$VCLIST= <CCCCCCCCCCCCCCC>
##$VD= 0
##$VDLIST= <DDDDDDDDDDDDDDD>
##$VPLIST= <PPPPPPPPPPPPPPP>
##$VTLIST= <TTTTTTTTTTTTTTT>
##$WBST= 1024
##$WBSW= 4
##$XGAIN= (0..3)
0 0 0 0 
##$XL= 0
##$YL= 0
##$YMAX_a= 322622
##$YMIN_a= -209444
##$ZGOPTNS= <>
##$ZL1= 120
##$ZL2= 120
##$ZL3= 120
##$ZL4= 120
##$ABSF1= 10
##$ABSF2= 0
##$ABSG= 5
##$ABSL= 3
##$ALPHA= 0
##$AQORDER= 0
##$ASSFAC= 0
##$ASSFACI= 0
##$ASSFACX= 0
##$ASSWID= 0
##$AUNMP= <proc_1d>
##$AZFE= 0.1
##$AZFW= 0.1
##$BCFW= 1
##$BC_mod= 2
##$BYTORDP= 1
##$COROFFS= 0
##$CY= 11.3945322036743
##$DATMOD= 1
##$DC= 2
##$DFILT= <>
##$DTYPP= 0
##$F1P= 15.9154993809931
##$F2P= -4.1035820241983
##$FCOR= 0.5
##$FTSIZE= 0
##$FT_mod= 4
##$GAMMA= 1
##$GB= 0.15
##$INTBC= 1
##$INTSCL= 1
##$ISEN= 128
##$LB= 0.24
##$LEV0= 0
##$LPBIN= 0
##$MAXI= 10000
##$MC2= 0
##$MEAN= 0
##$ME_mod= 0
##$MI= 1.114404
##$NCOEF= 0
##$NC_proc= 0
##$NLEV= 6
##$NOISF1= 3.799351
##$NOISF2= 2.8
##$NSP= 1
##$NTH_PI= 0
##$NZP= 0
##$OFFSET= 15.70392
##$PC= 1
##$PHC0= -11476.46
##$PHC1= 6.800985
##$PH_mod= 1
##$PKNL= yes
##$PPARMOD= 0
##$PSCAL= 0
##$PSIGN= 0
##$REVERSE= no
##$SF= 200.130013532006
##$SI= 16384
##$SIGF1= 3
##$SIGF2= 2
##$SINO= 400
##$SIOLD= 16384
##$SREGLST= <1H.CDCl3>
##$SSB= 0
##$STSI= 0
##$STSR= 0
##$SW_p= 3612.71676300578
##$SYMM= 0
##$S_DEV= 0
##$TDeff= 0
##$TDoff= 0
##$TI= <>
##$TILT= no
##$TM1= 0
##$TM2= 0
##$TOPLEV= 0
##$USERP1= <user>
##$USERP2= <user>
##$USERP3= <user>
##$USERP4= <user>
##$USERP5= <user>
##$WDW= 1
##$XDIM= 8192
##$YMAX_p= 0
##$YMIN_p= 0
$$ End of Bruker specific parameters
$$ ---------------------------------
##NTUPLES= NMR FID
##VAR_NAME=  TIME,          FID/REAL,        FID/IMAG
##SYMBOL=    X,             R,               I
##VAR_TYPE=  INDEPENDENT,   DEPENDENT,       DEPENDENT
##VAR_FORM=  AFFN,          ASDF,            ASDF
##VAR_DIM=   8192,          8192,            8192
##UNITS=     SECONDS,       ARBITRARY UNITS, ARBITRARY UNITS
##FACTOR=    0.0002496,     1,               1
##FIRST=     0,             0,               0
##LAST=      2.0444736,     0,               0
##MIN=       0,             -209444,         0
##MAX=       2.0444736,     322622,          0
$$ Real data points
##PAGE= N=1
##DATA TABLE= (X++(R..R)), XYDATA
$$ [...]
2373a13J833p58k676o06K036K118r11k577r11K501K352r34k975j053K325K665
2389B316m03k908j703K016K849L2l185j623J966K763l6l126j653J944L056j24
2405B181k994j697K022K598K75k635k096J781K558J02k269j824J423K711J76k722
2421d10j635J421K572K40k493j864J593K361J66k224j482J484K159k81k065j138
2437a596J133K113k60j739j099R64J926J86j852j060Q01J744P5j706j056R76J767
2454A317j38j653j154J224J526J86j660j007Q54J492P6j416p66M87J384L04j178
2471a22j007K93J573K66r32j070R3J155P23n43j097l12R88P28k37q93n07O82R92
2490G73r7j102p82O90J157P32j297j348J61J401J248j014j652l90J545J584o92
$$ y = [-113, 1720, 962, -1714, -2320, -284, 1834, 923, -1654, -2565, -64, 2288, 1354, -1621, -2674, -349, 2316, 1913, -995, -2698, -682, 2167, 2199, -986, -2609, -643, 2120, 2084, -1042, -2695, -751, 2305, 2181, -813, -2510, -488, 2110, 2385, -250, -2346, -565, 1993, 2095, -174, -1998, -575, 2136, 2312, -410, -2045, -624, 1948, 2188, -305, -2169, -576, 1785, 1951, -273, -1755, -271, 1888, 1607, -458, -1596, -463, 1650, 1390, -349, -1448, -484, 1442, 1628, -224, -1284, -483, 1261, 1336, -370, -1426, -450, 1317, 1179, -474, -1628, -404, 1122, 1308, -352, -1359, -505, 987, 1063, -353, -1119, -632, 752, 1056, -122, -1129, -836, 737, 1003, 71, -999, -906, 249, 972, 429, -668, -980, 8, 736, 499, -394, -901, -219, 773, 676, -426, -1208, -518, 639, 1371, 74, -1274, -1113, 288, 1536, 522, -1130, -1520, 25, 1609, 917]
2507I17j999o25J496K056r21k030r92J879K185m19k620j228J763K524j17k534
2523f65j859J282K891M39k581k173J387L032M03k815k260J261L411P68l012k478
2539b969J202L324Q00k409k517P57K978J174j916k702N83K821J226k164k546M24
2555a934L079J441k062k993M32L022J264j734k403J72K579J361j679k194K37K292
2571H80J160j762j806J50K015J457j315k090p2K124J052j198j724J39J840P71
2587A621j250j304P2J614Q01r51j412m0J693N17p62j271j28J245P57o44j114n8
2605f14Q15J033p03j250m3J163P44p07r30k66Q73N91j05q99l31M38O57K69p74
2624c9n83K37P87M50q21r43K09J001P08p64j111n9Q14R43k86j299n74R30J479
$$ y = [917, -1082, -1707, -211, 1845, 924, -1106, -2098, -219, 1966, 1547, -1073, -2301, -538, 1986, 1869, -665, -2524, -1242, 1649, 2088, -493, -2666, -1279, 1753, 2156, -659, -2919, -1658, 1753, 2521, -491, -2969, -1767, 1557, 2357, -52, -2569, -1812, 1166, 2340, 424, -2278, -1695, 1126, 2352, 188, -2358, -1934, 1145, 2586, 524, -2469, -2037, 985, 2249, 515, -1888, -1716, 863, 2224, 545, -1649, -1412, 880, 2040, 278, -1528, -1378, 637, 2094, 779, -1311, -1383, 741, 1793, 595, -1129, -990, 850, 1621, 371, -933, -861, 753, 1554, 603, -809, -849, 844, 1361, 599, -672, -800, 445, 1202, 558, -556, -614, 201, 1234, 531, -719, -762, 401, 1145, 438, -492, -758, 115, 706, 601, -298, -629, -191, 466, 735, -39, -622, -385, 402, 852, 31, -912, -703, 298, 1006, 242, -869, -928, -114, 829, 543, -756, -1330, -400, 1079]
2643A079l62j551p67J044J677Jj734j446J302K197jk153j504J036K276N56j955
2660c05j735P37K556O12j918k179P86K560J199k150k549M80L176J271k223k584
2676b266j34L434J205j692k973N28K723J939k397k567K01K351K093j625k733m32
2692b345K998J721j132k841l07K339J914j243k836k08K153K078j210k829j85K068
2708A35K047r64k493o16J796K097q90k169m72J501J748n30k111o97J604J531n80
2725I37j581q34J347J504m59j521n04R31J211oj495l87P31R97p7j214m15P72R55
2744H92k61q54n65N87J044j26o96n10L50P90k4n54m70K90N19K44n52n13J53P32
2764D76L67l69q55k30Q36N25k73o76n65N80R03j3j075n95O08R95L51j155j094
$$ y = [1079, 717, -834, -1601, -557, 1120, 1121, -613, -2059, -757, 1440, 1439, -714, -2218, -1182, 1094, 1650, -305, -2040, -1303, 1253, 1865, -53, -2232, -1446, 1114, 2313, 163, -2386, -1906, 1270, 2541, 318, -2266, -2400, 1034, 2239, 547, -2426, -1898, 825, 2764, 367, -2200, -1999, 352, 2445, 820, -1913, -2345, 653, 2374, 1242, -1599, -1906, 433, 2347, 1104, -1732, -1940, 213, 2291, 1081, -1748, -1933, 135, 2182, 1218, -1275, -1891, -95, 2002, 1112, -1057, -1529, -28, 1720, 1190, -921, -1618, -14, 1517, 937, -644, -1478, -131, 1373, 914, -607, -1111, -180, 1031, 1025, -470, -857, -126, 871, 794, -420, -835, -63, 892, 631, -223, -788, -201, 843, 717, 21, -489, -139, 651, 627, 73, -397, -107, 412, 656, 104, -409, -256, 476, 843, 474, -381, -611, 225, 750, 477, -199, -764, -184, 719, 706, -369, -964, -356, 639, 990, -165, -1259]
2783a259Q96J216K56j208j223N01J552N87j368j337J19J952Q62j224j960K76K008
2800F46J213j543k120J89K334J422j581k394j19K333J731j489k256l21K276J885
2816B206j054k913m49K326K045j088k789q54K608K421j202k868p48K235K277p14
2832A439k936p84K013K274n80k401j435K050K452m22k596j453J765K449M6k540
2848f59j303J394K261%k239j259J308J924J16j946j313J106J945%j561j303P64
2865g65J891J97j460j150J011J381j76j036q72N88J174K18r82r42L85J223L18
2882A003r81o63K8Q68N78m56q93K6Q15J30k29n85k17N88M09j77o58%L27O51j14
2903D50n84l33O4O37M27p44n41L13P09j3m79m26J37P63M33q69o98J8J080N79o37
$$ y = [-1259, -363, 853, 1109, -99, -1322, -821, 731, 1318, -50, -1387, -1268, 684, 1546, 322, -1638, -1362, 646, 1859, 316, -1804, -1615, 719, 2141, 560, -1834, -1953, 380, 2111, 622, -1634, -1955, 321, 2206, 1152, -1761, -2210, 116, 2161, 1073, -1716, -2570, 38, 2459, 1257, -1611, -2359, -124, 2153, 1439, -1497, -2281, -268, 2006, 1426, -975, -2410, -360, 2092, 1670, -926, -2379, -614, 1835, 1881, -659, -1962, -568, 1693, 1693, -546, -1805, -497, 1427, 1543, -403, -1716, -610, 1335, 1335, -226, -1529, -765, 1126, 1323, -137, -1287, -276, 1105, 929, -107, -979, -391, 783, 1001, 19, -923, -538, 685, 1003, 22, -641, -613, 255, 833, 377, -516, -490, 325, 455, 226, -359, -576, 12, 421, 244, -414, -414, -87, 564, 450, -134, -467, -403, 234, 661, -83, -624, -311, 398, 385, -94, -520, -383, 380, 813, -56, -754, -736, 344, 923, 286]
2924B86j069r7J123Q01n26j555K73J127J016q51j594j19J527J101q38j648m59
2941a502J652J389n52k059o56J701J631n17j954q99J848J731o36k205q80J784
2957a24K138m65k409j142J617K096j50k417j343J599K239m1k284j523J392K571
2973A754q9k354j578J544K345O9k290j554J324J969O27k046j647R78K136M84j705
2990c3j891R37K156L93j841j425N57J915Q13j526j411J93J753P88j354j421O94
3007g03J048Q86r54j286J16J161O99o87j065o9Q66R94p65p48l18Q71P99n00q46
3026e01J30M93M15k78n20r3K79N64k6n26l39K68L21J97k49m16j05P94Nj93o32
3047d12K7N72L35j91o01k29M33P40j71r33m8L55N09N0o84m86M78P88n8p96l77
$$ y = [286, -783, -880, 243, 1044, 518, -1037, -764, 363, 1379, 528, -1066, -1185, 342, 1443, 605, -1043, -1502, 150, 1539, 987, -1072, -1728, -27, 1604, 1087, -867, -1766, 82, 1813, 1177, -1028, -1908, -124, 2014, 1549, -860, -2002, -385, 1711, 1561, -856, -2199, -600, 1639, 1598, -686, -2209, -817, 1754, 1665, -689, -2267, -723, 1622, 1691, -599, -2153, -829, 1140, 1767, -279, -1926, -948, 1188, 1672, -33, -1924, -987, 1169, 1562, -279, -1704, -1147, 768, 1581, 55, -1356, -1163, 590, 1378, 24, -1397, -703, 345, 1231, 277, -1009, -893, 268, 967, 280, -785, -854, 12, 1006, 241, -507, -825, 46, 845, 345, -501, -371, 122, 537, 259, -261, -354, -75, 489, 463, -63, -402, -134, 187, 384, 135, -281, -386, 408, 413, 220, -412, -385, 187, 522, 331, -270, -499, -66, 674, 503, -430, -478, -123, 386, 436, -248, -734, -256, 532, 474, -322, -699]
3068f99N97R13j31j121o85P46J396r2j338o55P82J193m9j221r88J123J282n4j592
3087e93r17J057J663J70j795j158J008J799L4j399j514R10J965K93j871j450J002
3104g96K198K65j654j834P79K224O29j537k063O08K383N68j581j703M58K006P88
3121A738j550j791L07K169J042j492j849J39J944J335j410k055K55J805J000j094
3137D93j621j24J713R57r80j354j78J397Q14n40j373j95J021J085m59j196m77
3154a017O62J142l17r27m55P31P71j02p42m15J76R83r3l89o09k29J033N93p84
3173A2n83q2Q89K99l61l69l05M67N65k25n85j16L50K33N31o82k96k89Q98M4j60
3194B35r47K97J260j81m83r34J42J091N68q25p16K06P90L52q55q09J69J095P16
$$ y = [-699, -102, 811, 680, -441, -1126, -380, 1016, 924, -414, -1069, -287, 906, 857, -364, -1352, -229, 1053, 999, -593, -1510, -453, 1210, 1380, -415, -1573, -565, 1234, 1268, -131, -1645, -735, 1230, 1523, -348, -1798, -796, 1402, 1667, 13, -1821, -1042, 1182, 1811, 274, -1789, -1181, 1202, 1770, 189, -1514, -1056, 950, 1738, 188, -1603, -1296, 873, 1915, 423, -1426, -1287, 657, 1992, 582, -1473, -1218, 587, 1587, 493, -1128, -1252, 461, 1418, 438, -916, -1094, 303, 1117, 577, -796, -991, 30, 1115, 656, -540, -1017, -355, 787, 470, -457, -912, -181, 590, 488, -254, -669, -493, 490, 397, 8, -601, -830, 203, 796, 12, -571, -653, 236, 535, 174, -195, -500, -33, 532, 307, -278, -394, -44, 189, 720, 38, -258, -547, 351, 395, 235, -712, -415, 845, 664, 181, -753, -611, 480, 1048, 223, -493, -287, 503, 855, 0, -809, -640, 455, 1171]
3213A171r75m42L0J120l31o28l21L5L38J554j210j476O25J250J107j308j635J75
3231i21J698J97p10j331K30J341R69j195j349J63J573P31j046j594J46J630Q84
3248A416q08j744l6J632Q71r12j607j42J686J257r49j982J03J413J403r15j989
3265a303j62J730J195p59j770j60J302J161p84j314l83J175J136k60j506q48J248
3282c02J324p9j400o35P76J252l04j084o05P36J045J41j154n21M36P89K06q01
3300a80n17K1R37L88m94n03l58Q07O34m50n77k76P58M77j90n79l99K37O73Q0m37
3321E2n00J88N30K46m08o84J20N79N37k77o71k83N29P46l66p53j62N12O85k33
3341C87r81n6O44P68j16j092l53Q35N26j78q51m87R34O88k51r99k7N74P19r4j104
$$ y = [1171, 196, -246, -216, 904, 573, -55, -376, -341, -3, 1551, 341, -1135, -510, 740, 1847, 539, -1096, -921, 777, 974, 264, -1067, -837, 504, 1473, 278, -1071, -908, 665, 1396, 350, -1244, -1098, 532, 1416, 608, -1136, -1172, 460, 1331, 419, -1188, -1330, 356, 1613, 664, -1318, -1215, 198, 1601, 686, -1303, -1465, 265, 1460, 701, -1069, -1229, 73, 1234, 450, -864, -1247, -72, 1064, 804, -702, -1550, -302, 1022, 943, -457, -1092, -316, 936, 632, -452, -1057, -321, 724, 865, -289, -810, -374, 415, 621, -180, -697, -676, 261, 649, 155, -348, -706, 101, 735, 285, -292, -568, 190, 667, 477, -102, -501, -264, 409, 489, 52, -448, -260, 270, 516, 108, -576, -456, 123, 660, 383, -288, -571, -42, 704, 338, -415, -577, -65, 620, 387, -594, -650, -6, 762, 646, -446, -799, 36, 562, 384, -467, -954, -20, 668, 417, -582, -609, -35, 684, 590, -514]
3362e14m14R10R51m13j098m66J018Q91k94j212l85J164Q32k75j350l01J074J112
3380A230n10j281n55R11J170j47j428m41J048J249n23j637l28J227J322m55j480
3397f28p32J214J375m51j360o92J065J328k16j310p36Q42J317P0j586o09R32J048
3415H71L33j605p43O04J344K18r53q72L09J047M33j030q25L23J137J20p09p90
3433g88J45R82L96n49r88L4Q86M78m58l84k83M17M91N3q00j71M33N09j46l71n48
3454f62J92J379o25m47l21k45J238J95o53k77n72J104L52o90oo78P20L84M02j260
3474d70J27K61P62K97j089n15J55J109J36q51p67M06J052K62j090n84L82R90K81
3493H54q21r02N05Q82K54o48q80J86J234K39r43p39M72R32L17r33r67N50J033
$$ y = [-514, -928, -18, 933, 520, -578, -1044, -26, 865, 571, -641, -1026, 138, 970, 695, -655, -956, 118, 1230, 720, -561, -1116, -205, 965, 818, -610, -1051, -3, 1246, 723, -914, -1242, -15, 1307, 852, -628, -1360, -146, 1229, 778, -582, -1274, -209, 1119, 903, -407, -1143, -301, 1016, 1086, -500, -1109, -177, 871, 1204, -401, -1144, -540, 804, 1022, 69, -803, -494, 553, 986, -44, -869, -546, 591, 711, 2, -788, -643, 339, 735, 186, -802, -768, 118, 596, 138, -246, -529, -112, 379, 432, -368, -539, -106, 403, 257, -114, -662, -470, 909, 284, -163, -484, -729, 509, 704, 51, -226, -798, 306, 658, -32, -38, -716, 4, 388, 790, -470, -343, -82, 680, 977, -112, -627, -472, 637, 773, -78, -845, -439, 613, 875, -215, -799, -417, 573, 854, 33, -869, -364, 518, 772, 124, -756, -570, 664, 903, -40, -779, -307, 625, 942, 9, -958, -408, 625]
3512F25K74r94p92L84J210Q0j163m86L42J111L16j046q78M80J362N6r96p16M69
3531c62J103K1r37q45M44J255L55j240p43L50J325J76r59r33M07J163N84j197
3549c3j068M22J217L34p48j079L74R37O04q78j008K92J142M64p68j056L36R75
3567D59M67n86j122J48P28P19l90o85l62N69P73k58o96k93M36Q01k31o87k30K85
3587a55O04jm89m75J56M49L70l24m22j93L13O95k53n86l30N53N36k9o96l97M33
3608b41Q70m3n92p96L52R10K10n80p82M7J064N38q76r08L0J162N67q18j038K15
3628g09R47P56o78j079j97J081P68n42j221n4J149N71l93j218m7J224O51o98r75
3647f64n3R23P78o59r13j67R02Q69p21r09j84J290M80q46p04J8Q45P58p14r86
$$ y = [625, 899, -95, -887, -503, 707, 787, -376, -862, -520, 591, 907, -139, -1017, -537, 825, 881, -115, -831, -362, 741, 762, -175, -1020, -576, 679, 1034, -206, -949, -599, 726, 902, -57, -990, -583, 580, 1164, -33, -1101, -679, 538, 872, 124, -955, -581, 356, 960, 82, -926, -634, 508, 972, 204, -852, -516, 459, 926, 340, -782, -634, 94, 813, 423, -262, -624, -55, 718, 460, -236, -529, -93, 708, 477, -210, -440, -155, 449, 448, -41, -516, -360, 89, 459, 135, -287, -480, -167, 528, 275, -311, -641, -88, 448, 419, -277, -674, -241, 629, 586, -6, -802, -450, 460, 670, 90, -692, -645, 419, 957, 81, -827, -797, 365, 932, 114, -924, -709, 238, 994, 316, -763, -960, 121, 889, 347, -874, -928, 221, 792, 399, -819, -866, 358, 1009, 311, -664, -717, 206, 984, 325, -588, -755, 147, 1016, 295, -614, -798, 492, 972, 126, -578, -560, 285, 1043, 329, -657]
3667f57J0R10P18p09r84N7P59R60o89r33j06J050N95p13j152R0J278M05o88j072
3687h71J13R50Q53o92j056j7Q03O82m17r70j70R44N80l12j116j29Q95P47l45r51
3707d79k48N45Q78l28p70k93O27O61k15o59l11M35N94Q7m87o03P2R62O2l81n74
3728d25N3O28K47j96q59J34L52M75k2n42m49L02P18rm52o53M05P50M88q75n69
3749d99J9R03L98o78p82LR28N80n11q43k54Q07P23k95j155l77J207P45l79j110
3769e70l66R78J011m14j130n16J030Q08k53j009p08J082R05k16j007p82Q64J220
3787I27j78j301l14P22R79q9j281m12O53R82j8j112m37O87Q86K0r97n85N97J130
3807H59l03q92o74P20J079m15r52m48R56Q60k43r39l66Q12O60r0r62m59P11Q29
$$ y = [-657, -647, 263, 981, 272, -712, -655, 104, 1064, 375, -558, -664, 386, 981, 268, -884, -794, 484, 889, 201, -871, -758, 192, 1045, 353, -703, -720, 83, 765, 348, -622, -792, 152, 732, 420, -696, -825, 70, 817, 472, -479, -727, -182, 696, 368, -402, -695, -68, 593, 378, -281, -592, -157, 437, 524, 37, -566, -494, 468, 530, 149, -425, -372, 256, 503, 307, -552, -418, -66, 409, 387, -155, -604, -302, 416, 407, -45, -698, -293, 457, 945, 70, -499, -480, 423, 821, 143, -639, -636, 292, 872, 361, -482, -736, 71, 794, 499, -656, -1033, 174, 919, 540, -570, -936, 42, 1053, 639, -491, -1007, 23, 831, 578, -431, -1139, -57, 848, 632, -375, -1157, -293, 927, 749, -552, -866, -144, 835, 746, -535, -947, -294, 688, 670, -442, -879, -192, 694, 714, -283, -868, -271, 859, 556, -336, -1010, -290, 789, 374, -578, -1026, -70, 790, 547, -392, -758, 54, 714, 624, -338, -797, -86, 743]
3827G43k92p54n82P78O86J7r70l57P06O81j05q83j54M34P46j81o80k45K86O37
3847E11j5o75l75N12N43J37l75p28L65N81J81o08m22M9O85J79m50n77K46N13J24
3868D01k38m46J16R7M68J6m78o30K78Q42R2n69o65J87P79M57o37p76L03O33L13
3889E43k96o60m02Q72M55j91r34l34R89N68%j148m11P07R31n0r81n71P79P84l
3910F47j156m30O57J229n5j013r76P02J081L15j292p97O16J116L03j006p45L81
3928d23J254J80j156r46O37J103M70j198q69O02J117N8q01r59M04J031M81p83
3946B02r37K99J091M10r75r04M98J037J40r49o42L88P63K89o46p78O13N77L58
3965H34q30m37j9R34L5n31o76M19O62K05m86p11J83Q15J35o33k97j34P89J84l75
$$ y = [743, 451, -303, -885, -107, 579, 596, -374, -731, -25, 656, 551, -332, -486, -52, 694, 513, -167, -412, -126, 511, 496, -179, -554, -42, 501, 638, 263, -465, -100, 481, 662, 54, -368, -319, 366, 545, 95, -482, -236, 277, 401, 163, -283, -167, -70, 398, 414, -64, -694, -416, 426, 518, -51, -716, -529, 250, 707, 70, -706, -403, 230, 543, 247, -413, -815, 57, 512, 321, -613, -947, 42, 610, 610, -538, -949, -242, 689, 639, -342, -913, -134, 650, 647, -509, -939, -282, 947, 892, -121, -1097, -395, 686, 1001, -291, -1088, -472, 644, 947, -59, -804, -423, 831, 1011, -145, -1091, -454, 649, 1119, -79, -948, -346, 771, 829, 28, -931, -527, 504, 985, 202, -735, -436, 655, 1065, 90, -814, -316, 721, 861, -88, -730, -342, 421, 710, 64, -714, -101, 476, 834, 4, -433, -452, 482, 517, -14, -690, -271, 391, 596, 110, -601, -418, 397, 532, -101, -398, -532, 257, 441, 66]
3986F6o98J51O03J79k37m63MO12K09l05m20j29O08K42j79n23n8M04K61J1m72l70
4008e04L41M89j17k23n31J81M55K87l65l30j06M14N85l21p30L7M02N90k01p74
4028d21j58M61P99k44o71n83N84P31J20p85p40O37Q61J71r38p51N02Q33N00r50
4048d2p38K99J155K89p93j151L04J360K55q41r88J34J262N97r43j184K03J262
4066D40N29q07j050m8J277Q00j090r60J8J298Q03r05j076M3J039P53p58j027l9
4085g60R78P73o66j012J87P23O27n28r23o7R93M54n43q74j53R37L69j65q45k7
4105e22P04M15k45q31J48L23O66k66p84J8L90M44k30n15r5L57L57j47m27j49M55
4126F6K02Q2n20j55M06K96o8o05l4L79L50j23m08k5lN17k50j77j11m6N24K1l28
$$ y = [66, -632, -481, 122, 301, 64, -399, -395, 217, 426, 121, -299, -428, 180, 422, 243, -280, -338, 66, 327, 338, -134, -504, -163, 326, 209, -14, -545, -364, 91, 378, 13, -317, -423, -9, 576, 255, -475, -438, -36, 554, 353, -421, -579, -118, 681, 437, -234, -817, -233, 498, 618, -167, -907, -270, 591, 762, -176, -927, -425, 408, 908, -42, -780, -481, 674, 963, 170, -981, -677, 683, 938, 97, -891, -757, 505, 1102, 159, -1025, -822, 440, 969, 162, -888, -936, 341, 1141, 51, -909, -891, 407, 1210, 305, -771, -728, 311, 1064, 306, -721, -760, 218, 991, 325, -687, -500, 223, 850, 322, -601, -668, 325, 779, 236, -638, -791, 146, 515, 350, -495, -522, 182, 597, 352, -479, -331, -8, 658, 392, -392, -374, 16, 460, 230, -285, -380, -23, 334, 187, -240, -389, 66, 268, 350, -170, -325, 81, 377, 309, -296, -330, 49, 399, 276, -132, -157, -160, 357, 107, -70, -181, -227, 297, 318, -10]
4149a0k17j08O62L7l44k55j54L82K70j41l67k09L77M88k58l20m44L04P23L7o18
4170a65n15L40P51K20p01p70N03P11K87n53p62N6J024L45o55p89J04J039O68q41
4190B97j028j3J147P52p23j166j03J082O56m99j144j55J408N45n43j142j99J058
4208B30Q96n48j151k25J062Q76o07j098l38J047R47l58j072p91J055Q90j62j106
4226d53l61P11Q62j13q52m57N86Q37j30r84m45P38O45r6q18k96N75N75J2r75j79
4247f18N26N08P1p33l04K48O13P2o64j18K1Q94m00l25k19K71M30k7l91l34K23
4268b56L58Jj20m35M04K86j8j61l94J64M51j59j37j70MR2K27j50m5l2P1K28l0
4291A79l36j74K67L18K8m27J1j19M34K04m10j69j7L97L04l41l83m9M46M20m59
$$ y = [-10, -227, -335, 327, 364, 20, -235, -389, -7, 263, 122, -245, -454, -77, 411, 153, -167, -611, -307, 416, 453, -165, -680, -340, 411, 631, -70, -840, -337, 374, 661, 108, -654, -598, 426, 771, 116, -673, -569, 470, 1138, 297, -731, -744, 403, 1155, 432, -734, -837, 245, 901, 402, -742, -897, 511, 1056, 513, -629, -828, 230, 1126, 578, -573, -798, 264, 1140, 533, -565, -903, 144, 1091, 733, -339, -1130, -75, 815, 653, -453, -814, -103, 759, 646, -206, -663, -77, 760, 630, -354, -799, -61, 584, 488, -330, -626, -51, 524, 536, -439, -618, -92, 416, 487, -246, -550, -302, 311, 383, -281, -399, -378, 516, 116, -209, -428, -157, 273, 246, -145, -479, -256, 102, 103, -17, -452, -48, 238, 220, 59, -335, -171, 280, 121, -16, -186, -182, -90, 137, -13, -58, -90, -19, 209, 179, -157, -331, -64, 254, 282, -145, -134, -253, 181, 385, -25, -194, -211, 186, 490, 149, -234, -283, 163, 583, 124]
4312A24m66j45P00L62l10p19p4O78M28k07p72j76P29N53k94r62k15Q09P67m55
4332C55q49l36P97R16l98j072j77O58Q58j73r87l91N55R48j16j097m28O02J135
4351H00o3j045o59Q29R92n7j012p95P47J057j39o80r72P22J120r8r22o05M80P89
4371D89K09q02n75K98Q84R0o62o66N49O74J52p30n73L48Q43j1m99n25L14N15K05
4392E27m23m00m3N56M87n89l05j1M76N2k65l00n9M08R4o4k72j26K86L5k5j62k36
4415c59J75R2J96k47j23J62lL71m03lo4J11J95j11p2k93L84R2q7l11J13J92Q0
4438H7M3m14J02q4L7O28n75K7k22R89l49l14l24M30K49K8o07l5M65K31l39q25
4460g72J65N0J011j68n06j66k68O02P56o25p46J50J151P7m45p42P02K92J49j228
$$ y = [124, -342, -487, 213, 575, 265, -454, -528, 150, 578, 371, -401, -577, 152, 705, 411, -551, -766, 43, 810, 355, -494, -830, -33, 883, 485, -587, -764, -106, 752, 579, -408, -799, -244, 704, 588, -509, -937, -335, 800, 737, -308, -967, -138, 854, 797, -215, -1010, -263, 794, 655, -25, -997, -275, 845, 747, -175, -780, -300, 489, 698, -104, -679, -381, 503, 593, -69, -735, -186, 488, 640, -90, -663, -315, 528, 517, 18, -507, -193, 322, 527, 104, -296, -339, 217, 704, 115, -190, -201, 275, 327, 62, -238, -297, 111, 205, 141, -131, -257, 29, 64, 39, -123, -359, -184, -92, 104, -143, -266, -104, -107, 264, -139, -142, -206, -95, 100, -11, -83, -376, 8, 100, 13, -298, -185, 7, 87, 130, -284, -182, -266, -229, 399, -176, -149, -371, 618, 269, -45, -369, 61, 310, 338, -269, -304, 161, 392, 53, -772, -607, -557, 454, 286, -220, -386, -654, -52, 704, 79, -667, -517, 634, 711, 266, -476, 226, 518, 667, -561]
4480e61J27j06R43M08j659j45J162O23m81Jj251J07J320N73p57o83k44R62P18
4499A057r16r70P11O06O41m15j107k30Q16K91R7j463M52N10M06k62n36j82O03
4518A09L08m3j015J24M95N44k12p25q2N27M86k13n34m28O32M75j26o52j2K06M85
4539C49o5l74k26K46L04J4k21l24N39L02o01k7K1j31J90K31jj83R7l28j29P09
4561C92j37l39j56L34M41m42l0j86K51k45M35j011N07L50K22l88k29j36J97M49
4581B79m34n5N3K31L35L0q04J33K49O30m38q01K56K04K37K31p37K00K42M50l28
4602A63p51K38R80m29J28o06k31P74M16o43p48M00O93L37n97r26J77P53R90p84
4622C34p61R6M25N64m80q57r6J028P62q49j285N10O03J137p47p65q5O76M67k82
$$ y = [-561, -434, -540, 403, 811, -848, -993, 169, 792, 311, 312, -939, -832, 488, 1061, 304, -379, -623, 339, 1057, 141, -829, -118, 488, 1129, 714, -393, -623, 193, 484, 581, -882, -430, 80, 486, 224, -312, -494, 109, 417, 374, -641, -517, -22, 522, 310, -415, -497, 30, 516, 303, -231, -659, -27, 448, 322, -330, -342, -136, 349, 284, -90, -316, -70, 234, 248, 27, -297, 242, 544, -57, -84, -63, -194, -4, 227, 226, 43, 140, -188, -317, 392, 255, -84, -240, 94, 535, 93, 63, -123, 128, -117, 318, -693, -186, 164, 386, -2, -231, -367, -170, 279, -155, -210, -157, 74, 409, 439, -365, -232, 17, 647, 209, -592, -336, -132, 105, 336, -401, -201, 41, 491, 163, -588, -350, 630, 201, 329, -277, -508, 266, 682, 39, -709, -309, 384, 721, 124, -802, -625, 128, 1118, 334, -427, -331, 94, 658, 178, -679, -775, 253, 1015, 166, -1119, -609, -6, 1131, 384, -381, -466, 210, 677, 395]
4642C95q31p0R05L87l64o90m51P85O71k69r95k75Q08Q72l21r53N8K51O36J15r38
4663b74j45M35M49m3n96j40L43M57J1o17k09J38M63K31l29n78R1L71L55l33l54
4684b74j46O09kJ2m05j59L43K24O0l75j02N8L27kj04n27J1M63K95l67l05r7M45
4707a8M32l01k49l83N75K48k12k74J4J55M26l14k75l63L23N64n4n90k00M25N19
4728D48k28m19j88K80P39k38o10k60M84N07Q0r82k70M22Q48q8o86n41N53P43j95
4749C99n76l91O76N55l88n76k16K64Q40J6q73j44M69N49k60n15m00M54R07m01
4769C89p95j07L97O53m6p06l57N99N17j08o46l80N01O81Q1r95l32N06P97m4q62
4790b57l83K54R21J03q49m59K11R07O0p30l37L77M86J88n27o68K39N73K10k89
$$ y = [395, -436, -506, 399, 786, 422, -268, -719, 66, 737, 468, -527, -802, 6, 878, 557, -396, -338, -87, 549, 664, -274, -419, 16, 465, 422, -174, -314, 29, 486, 497, -120, -329, -191, 272, 503, 174, -404, -313, 58, 413, 80, -274, -420, 189, 187, 199, -206, -365, -22, 202, 262, -113, -215, -157, 170, 168, 64, -463, -452, 11, 306, -61, -366, -463, -18, 414, 113, -136, -519, 56, 304, 92, -182, -168, -13, 413, 99, -176, -539, -216, 348, 294, -296, -496, -71, 448, 220, -199, -387, -107, 632, 394, -216, -476, 8, 515, 595, -387, -657, -235, 613, 525, -161, -702, -149, 594, 399, -177, -568, 108, 663, 275, -301, -517, -253, 587, 603, -270, -414, 55, 604, 344, -171, -571, -117, 790, 389, -406, -513, -116, 537, 491, -215, -572, 27, 544, 436, -210, -590, -89, 592, 673, -322, -654, -148, 649, 605, -257, -640, -386, 535, 638, -211, -670, -459, 448, 508, -222, -559, -182, 304, 492, -35, -703, -464, 109, 319, 30]
4810C0m69j0O27K41l35m28r2L80M36l89o9k36K39M04m9k40j03L8K77R4k57l51
4832b62k9M21J57l27j72p2L74K61k69k48k83N25K27o0n02j58M97L29L1n52m95
4853f07L36O91m4l98m16L55M57p6m45l21L04L35L14n89o46M81N59K84p00m61M65
4874a22M31J05m06n68L51N71N3n76n78N30O18J74q00l59K68P24J36n68n47K68
4894b95N60J29m43n84K26P17L51p00m12L4P85K77o62o10M95M91K60o45n58L15
4914b69O34K99p41o33M35Q25Jo24m82L05O21J62n26m19J4P53L68p54o07K49O66
4935B77J75m13n86J32O66L75n95n77J75M22M20l28o15N9K54O94l26o28N8M71K55
4956C65j21m37l94M47N07j98j92k40J22N12j43l46k12K2M96J46j37l83j68M33
$$ y = [30, -439, -449, 178, 419, 84, -344, -436, -56, 380, -9, -78, -314, -75, 329, 280, 40, -63, -25, 252, 346, 89, -262, -291, 130, 287, -40, -212, -284, 90, 351, 82, -166, -449, 76, 303, 243, -259, -417, 80, 409, 440, -112, -607, -271, 420, 376, -22, -438, -83, 374, 298, -147, -468, -164, 171, 485, -104, -750, -269, 290, 574, -126, -587, -122, 309, 414, 8, -560, -209, 362, 415, -161, -739, -209, 409, 583, -217, -576, -308, 416, 552, -16, -563, -295, 265, 394, -49, -633, -407, 310, 661, -39, -451, -417, 368, 645, -17, -627, -132, 359, 619, -26, -584, -269, 365, 664, -77, -710, -275, 550, 551, -73, -555, -250, 371, 533, 7, -412, -398, 355, 723, -31, -638, -389, 277, 452, 39, -547, -415, 251, 626, 31, -546, -371, 51, 471, 143, -472, -413, -159, 535, 209, -419, -361, 110, 365, 244, -193, -587, -140, 367, 169, -23, -263, -141, 371, 228, -118, -330, -308, 188, 334, 197, -186, -354, 79]
4976G9K45k77k70j77M95L37j08n03k16M61K63o7m12l42M52M60K0o24j80O0O84
4997C80J11o10l19J88M47L40n56l88M8O87L01m63o35k1P77L87n11p20J79P47J78
5018E47m97l21j4P66J28n44n24K1P44K96m01o03QO22M29n92n15o5Q38N7m79m57
5040e56L39N31K67o47k22j66P56M15l94j107L7Q03P23o07p41M86M13m6n33l92
5060f41j03J363l69Jp98J94M25P70m95p19J82M04O40j115o10O36K13J89J98n89
5080b24K31K2L78l31n00K22J47O17q7p47j0L8O65m1n96j28Q8K21J70L28m68j31
5102a36M6P58m45q11O67m93N48k57J29o09O70o7M60n96j55M06M2J48l35n74R12
5123C08K19k47o61K39j41N16Q0n05q4n2O27rm59n6P3L81M07n76o54J77N47M73
$$ y = [79, 324, 47, -223, -400, 95, 432, 324, -179, -395, 66, 329, 262, -150, -492, -40, 420, 440, -184, -364, -304, 380, 491, -119, -438, -250, 197, 537, -19, -407, -359, 328, 629, 166, -469, -490, 287, 674, 163, -557, -378, 369, 547, 50, -271, -285, 481, 609, 65, -459, -438, 306, 602, 201, -402, -394, 228, 657, 65, -450, -515, 323, 380, -99, -556, -217, 314, 581, -66, -288, -454, 302, 717, 323, -784, -747, 56, 779, 172, -569, -83, 330, 284, -249, -641, -744, 619, 250, 251, -547, -353, 72, 842, 347, -372, -190, 214, 854, -261, -871, -235, -22, 167, 365, -224, 7, 29, 407, 76, -424, -202, -55, 562, 475, -272, -282, -244, 421, 380, -216, -344, -256, -35, 135, 463, -5, -136, -90, 668, 223, -588, 79, -414, 134, -123, 6, -603, 67, 0, 460, -136, -291, 115, 157, 305, -30, -604, 308, 527, 280, -381, -142, -283, 233, 313, -192, -276, -328, 299, 290, -169, -225, -152, 229, 636, 60, -594, -417, 130, 603]
5145F03l11o26j03N36M46m07o34j25P80N51l52q98K0O03M06k46o18k72P20N18
5165E91k85p86l1M53N86j54p48j54O50N09m71m56k05M41N46j59o98j4L94M44k22
5186B31n33n7M10M30j69q12R6N81M01l63m46n24P95N56l01o98j68N62O29m16n63
5207c59n3M60M52k86n00l02N99M48l75k58k25J71N55r6m33k64M50M47k51l29j21
5228b70K51L86j76l33j65K13M19O4n54l65K26L99K56k14m65p7K41M80m78q8O9
5249a81L73N9O1o49K10k58M41Oj99M5m3M45l15J68l01k7N03o4K18o29j81O02J45
5272D29m39m83M35K91M03l43m05m57M59J042p59m78k8P16K90l34q59J93O36O54
5292I63o20j068N82K38N68l47q65K34K56M58L03j225j2O93M90l24o12j5K35M82
$$ y = [603, 292, -334, -437, 99, 545, 138, -496, -621, 159, 710, 358, -540, -520, 83, 489, 243, -375, -647, 73, 591, 306, -480, -511, -58, 528, 374, -374, -528, 122, 631, 160, -296, -501, -60, 486, 327, -371, -385, 9, 453, 231, -302, -359, 51, 481, 312, -500, -404, 177, 578, 215, -231, -755, 40, 596, 295, -403, -571, -9, 620, 204, -359, -412, 48, 500, 214, -286, -588, 11, 459, 84, -174, -399, -228, 327, 231, -202, -466, -16, 431, 180, -149, -270, -19, 367, 191, -142, -307, -94, 325, 389, -165, -530, -304, 95, 351, 137, -328, -405, -164, 316, -162, -250, -181, 192, 251, 312, -337, -127, -385, 56, 62, -137, -92, -135, 310, -5, 163, -138, -165, 338, 274, 492, -137, -318, 284, 429, -10, -493, -58, 233, 636, 293, -112, -569, -110, 932, 173, -305, -333, 383, 673, 339, -520, -327, 309, 963, 343, -725, -143, 95, 663, 316, -549, -315, -59, 399, 702, -523, -535, 158, 648, 324, -288, -303, -68, 414]
5312D14Jp27m01N21O05K44q89j8j02Q95qq84o13Q18N58O7l19q31N07P90l54n84
5334c10l00M32Q23l16n58l11N20N71n54l35R8j15Q97l65j05m43K00O81o0r69J58
5355c61J78K78J81o03l5M3N00j4j70l40M11M21P1m08L61p48O94l26O1l10l32M38
5377a0j01M11n47N8L04K54m58J24k54j04L85j66K9k88J36R06m37J9o61K28L23
5398A51j35L19j322P66M15K45k16o70K91M11J24n42l58K96M47Q1k1j58n75L09
5418a42O48m06n12M7K84L18M19p15k49M31K57J4o98n36Q97L12J5n59k75Q76p0
5439C56K16k20p75k2P93j68m46l22O49M71K26r11n86O90L61M51p89m91K06J022
5459G11n09j13l26j27R19J25p68j97j81O56J99n51k74L35M90m99j23K11n34J063
$$ y = [414, 415, -312, -713, -192, 413, 657, -232, -250, -352, 543, 535, -349, -962, -144, 414, 481, 162, -669, -162, 628, 274, -310, -610, -178, 645, 329, -229, -540, -20, 551, -3, -338, -240, -355, 542, 177, 72, -371, -171, 510, 450, -519, -361, -183, 95, 276, -327, -362, -319, 181, 167, -3, -343, 68, 489, 560, 152, 513, -235, 459, 133, 194, -116, -448, -10, -111, 300, -247, -189, 115, 369, -89, 35, -219, -323, 62, -104, -75, -363, -227, 679, 242, 261, -400, -172, 151, 16, 335, -987, -221, 194, 439, 223, -447, -156, 255, 379, -163, -521, -225, 222, 303, 282, 124, -451, -142, 506, 100, -412, -365, -81, 237, 656, -59, -308, 123, 380, 394, -304, -840, 57, 369, 384, -175, -450, 426, 356, 572, 352, -423, -445, 348, 180, -266, -588, 61, 532, 758, -153, -739, -49, 312, 763, -26, -517, -311, 711, 202, 89, -237, -364, 555, 680, -88, -285, -466, 190, 389, -162, -436, -101, 389, -110, -233, -22, -556, 507]
5479E07J25m16k73k19K10O58q72j92K05P74j01n91l61P96j48J45m48j11L1N71
5499B90j04j73K79q84Q44K31o77o01O79q7M03L8j81k98N07L38m81j80K32J81j76
5520A80l69j76K03R8N51n77K68J2j69J07k41n85J109l15j03K72l95m05L46L02
5540A13Ll78Q6l9K69J65P4j43o23K62L38l64j64m7N47J54L21o96M5M88r5k5p95
5563e04j08M48N53J42n04l93N41M11j46p13J22N3M62K28o70k95K70K92L34n00
5583B3n86M60J35P17p05j54k35L20L78k96j15RL54j59j16p86L91N52N10n34n67
5604d04O3O49L09l05m58J9L97j73l23m82N05%O41l50n77L30K28N3k69r9K59o7
5626e4L33j29m08L6K81K45k30k81K91MN3m6k62L0K30N7j2l94l7M23j2N0k26o5
$$ y = [507, 632, 216, -57, -276, -66, 592, -280, -472, -267, 507, 406, -185, -546, 250, 102, 247, -201, -312, -281, 290, 186, 13, 292, -592, 252, 483, -194, -795, -116, -203, 200, 238, 57, -241, 266, 604, 123, -57, 175, 356, 180, -189, -365, -162, -64, 487, -90, 178, 190, 21, 128, -113, -698, 411, 96, -7, 265, -130, -535, -189, 113, 116, -262, -176, -215, 54, 219, 293, 150, -473, -211, 127, -237, -401, -448, 99, 253, 574, -122, -77, 411, 316, 291, -504, -612, -164, 389, 531, 27, -366, 175, 586, 440, -273, -151, -98, 364, 592, -78, -373, -103, 189, 523, 23, -563, -103, 32, 749, 44, -110, -345, -25, 353, 57, -58, -49, 305, 146, 30, -756, -365, 187, 697, 163, -404, -341, 308, 617, 312, -146, -127, 270, 97, -226, -708, -203, -203, 438, 88, -489, -159, 69, 122, -147, -246, 13, -54, 279, 150, -258, -222, 59, 304, 74, -207, 84, 88, 141, 95, -167, -137, 93, 150, 138, -256, -293, 130, 118, 168, -58, -123]
5650a23K20K56l19j79K14K2L4m2k42J43K5J02m1k30p2K67j58L55j20j45m9j4M4
5673e2N9M8j45J05J54J51l81N5j93L04m0p5j69K56J8O8k98mQ2n3K87l17j9l7K92
5698I6J24o9m78J34L92l7k55k40K6N00Q9k98j73j30N33J54k47l77q9N23J61k51
5720H8k33j67N24L72n06m41M4M53J66m3o31J71K54M20l02m38o8N59K44m56k85
5741b75N7M22K71l99k41l2L75K46k04o15J50J91M81k07n17j82O03J35j09l28j66
5762c44K19N78m28k26k3J71K68m4m71O2J65J21O9k43j93L15J98j13j90p2L20j4
5784A25J7j94Nm0K4QMk92L33J00q5M5j32J0L17j49k3j07O4M5Qr9r5K10J8j8l4
5811F5M5r9r0L8J80o7j45J06Mo2O4p7J50P5L7j74j21k4P2J26J0r7k14M53j59Q5
$$ y = [-123, 97, 353, 34, -145, 69, 91, 125, 83, -159, -16, 9, 111, 70, -160, -232, 35, -123, 232, 112, -33, -82, -96, -52, 7, 55, -90, 15, 169, 320, -61, -6, -199, 105, 65, -10, -179, 77, 95, 163, -135, -139, -57, -110, 177, -140, -159, -196, 96, 220, 151, -327, -193, 199, 162, -93, -333, -307, 193, 282, -16, -189, -319, 214, 368, 121, -256, -345, 178, 339, 88, -145, -312, 212, 584, 78, -363, -319, 134, 300, 257, -374, -203, 51, 471, 169, -269, -337, 222, 466, 10, -275, -218, 204, 475, 76, -165, -197, 178, 424, 220, -395, -245, -54, 427, 220, -297, -479, 124, 259, 150, -178, -344, -125, 453, 25, -201, -224, -53, 215, 171, -300, -238, -73, 48, 117, -126, -319, -4, 194, 81, -109, -181, 139, 125, 142, -52, -47, -87, -63, -55, -51, -343, -10, 90, 5, 50, -82, -72, 245, 96, 73, -34, 30, 75, 83, -16, -111, 99, 117, 99, 65, 110, 11, -79, -41, 139, 72, -73, 33, 37, -25, 39, -38, 112, 187, 224, 50, -71, -95, -23, 103, 113, 16, -198, 255, 96, 181]
5837A81l27J09K80j07Qk09k5J13K05J3k86m0r6M40j99k16p4K25L17j3m98n6L99
5860A44L13l75n36M9K94N25j85n03j6K09M58j26k67k44K99K49j15k65l51O09J23
5881B89l34j96j91M10M08k33l74k08L01K99O7j70l27J22L83J41n44j40J20L59
5901A82ml54o0J62K88j6l44J02J11J63j80p3k59K91J39P6l74RjK69J12o7k79K15
5925A08m5jj35r9J50M8M0j33K16l53K28k1L2M6L9q5j06J10K38k45k72K24q4J56
5949E6j7l2j31N3M5K9j53O8J45O7j3l27K44o6np0m7J00J25M9k57jq6M69j03k69
5975a27Q7k7J61J64k86k06K63M11k16k08l00L00J52M5k74l93M90K16n0l96p4Q9
5997a79J18L71m36j32K23J71R4m42j01L58J27J16n49J9K54J34K77m63n0J16L23
$$ y = [181, -146, -37, 243, 136, 144, -65, -90, 23, 228, 241, -45, -85, -181, 259, 60, -156, -230, -5, 312, 299, -199, -255, 144, 457, 82, -454, -405, -111, 414, 229, -274, -290, -81, 377, 251, -16, -260, 39, 288, 173, -92, -443, 166, 289, -45, -241, -432, -22, 386, 153, -221, -429, -128, 171, 238, 68, -259, -137, 246, 387, -157, -297, -177, 182, 178, -176, -236, -74, 214, 198, -146, -44, 67, 230, 50, -23, -282, 9, 148, 224, -150, -141, -142, 127, 239, 172, -107, 108, 63, 62, -73, -172, -22, 26, 66, -67, 149, -204, 24, 3, 35, 81, 120, 35, -71, 39, 277, 32, -240, -16, -100, 56, 39, 7, -124, -71, -26, 3, -150, -82, 63, 130, 117, -210, 34, -32, -37, -107, -154, -54, 71, 120, -137, -138, -224, 245, 142, -127, -40, -67, 94, 258, -28, -234, 29, 440, 224, 16, -284, 16, 168, 213, -61, -454, 36, 252, 202, -194, -268, -179, -61, 310, -126, -258, -35, 136, 230, -212, -313, 45, 172, 288, -261, -242, 12, 146, 423, -40, -90, 26, 349]
6018C49j76n03L6J65M24n6l03j16K51K74n9l47k61J42L12K13J61p18l9R54m66
6039B37k05j51K03J40j19k32K34k56J97K92m69j23L23j73K84nj92j86K48l8K15
6060B24l14R0M2p3J41r9O9P3n7M51o14J63l52K26j12L10n7k21N17k92M4R7j38
6083A18k9K2J65Pj19J20k81J09r1j82J24k8K69o2j78J70j10K30j57p2J06k67J98
6106F2j26j25k93Q91m38j26R5J72J19k90N62q4l12K8O02r29j2N45l02M23k07p13
6128d58K40N18J2K60p08j34P42K60p88l62O3P73K19l89r31L00M25l5L10n30K03
6149a0L02R1j6m67n1M29K50n43p5J51p1K57j45l49R7K21M77m18j46j97L18R8j15
6172H8k29p4L14K36k94j14k45K99L29j52l61k9N1M85j11m05J3K23O5j24q9J82
$$ y = [349, 173, -330, -294, -129, 295, 239, -64, -180, 71, 345, 286, -61, -322, -180, 132, 345, 506, -212, -251, 703, 237, 32, -119, 84, 224, 105, -127, 107, -149, 48, 340, -129, -252, 71, -102, 182, 177, -15, -201, 47, 9, 224, -90, 0, 42, -31, 110, 11, 80, 153, 96, 547, -67, 96, -256, -30, -142, 168, 111, -110, 407, 115, 159, 256, 118, 89, 111, 276, 283, 164, 284, 3, 112, 21, -161, -37, -65, 204, 142, -36, 134, 24, 254, 97, 25, 131, -136, 62, -64, -189, -482, 409, -29, -155, -60, 112, 231, -59, 503, 419, 107, 135, 737, -192, -204, 341, 39, 462, 255, -458, -218, 300, 312, 572, -136, -270, 472, 732, -56, -418, -355, 418, 637, 248, -683, -383, 42, 7, 317, -213, -10, 292, 383, 367, -100, -151, 278, 528, -15, -90, 61, -10, 247, 102, -247, -150, 71, 548, 130, -16, -213, 105, 203, 88, -141, -215, 99, 335, 41, -73, -318, -19, 310, 158, -203, -232, -181, 304, 193, -212, -199, 24, 89, -35, -124, 58]
6194E8p0J18j9j52n4j17K42J50j32J6l04J63K59o2k40L5R9K34j03l14Q0P5J7J89
6218A68j84j23J42n3K37j71k4k62M31J63k85j86rO1L04j74j63j18K55K51k62k17
6240b19j55K96L48j00n68N38r7p0K03j64r7M19m6L3j38o56K40M07R3l47l63M49
6262FJ08N76r12L94J39m15M18n10j53J60L37j58N52q82J42P12n1p90J32M07l63
6283a51M69k76q27Q72K40j92Pm51L82L54n9r40M37L76r3N8mm49k15Q23l73L4k77
6306b55K9J82J01k77k87M29N04j26l83q8L72L9p1j40k24K62J41p3l63jJ43J34
6328D8J78k61k83O5K55K38l20j20K78r4J43L1k28j43L59J33r0l10O4m4L67M6k34
6351G8k00j12K40Q2l9l06J02N06k69Q3n36L31J81K08m48R2n30N21L38l49k12k6
$$ y = [58, -12, 106, 87, -65, -119, -236, 6, 156, 24, 40, -264, -101, 158, 96, -144, -109, -10, 224, 121, -193, -113, -38, -21, 168, -16, -139, 3, -50, 187, 16, -8, -270, 161, 324, 39, -147, -156, -95, 209, 35, -128, -246, 9, 260, -2, -219, -374, -78, 270, 170, -398, 140, 43, -27, 176, 12, -85, 334, 288, 321, 183, -473, -233, 174, 267, -80, -443, 6, 114, 690, -222, 172, 311, -104, 314, -196, -349, -189, 148, -10, 542, -340, -198, 514, 463, -327, -195, 212, -151, 318, 42, -785, 87, 327, 135, 142, -309, 73, 427, 368, -572, -135, 241, 148, 206, 202, -247, -462, 361, -12, 22, -255, -226, -44, 57, -220, -507, -78, 426, 300, -83, -171, 201, 240, 169, 29, -195, 67, 208, 135, -228, -229, -86, 48, 226, -35, -318, -253, 2, 240, -80, -200, 78, -16, 127, 158, -70, -213, 146, 279, 189, -121, -57, -101, 266, 312, 78, -122, -234, 6, 88, 49, -257, -155, 351, 82, 165, -371, -40, 141, 349, -99, -7, -537, -16, 322, -27, -239, -265]
6373b65N14Q0Q4k93k93mM42k46j85OL12K70n39q6q2J5L70p1l66l67M49O97K18
6396F60q21l80N24O18n02n36l1K05M17O12r84J67K02m48N13l25k59N20M2K36n77
6417a47l0k0R1O77j210M65L46R1J17m78n77M68K46L59n28n8j15N40j87Q6n50l55
6439g69P03K75Qk69M2O06k58r72K81K9M63n82M11l37J99N80L57p35j43R3q2N50
6461D50k02p11j89R07r3K11r87N24L67j67N7J87r46J30P24j1n52m27P93O4j6k79
6483a66L17k18K13k40J59q9j46K28K13N2o46J30L42K00m06j18N7K96k87L47o84
6504d46K21L46j76J16k61m49M73M33j08k87J89K74pn54P75r54O63O2O1j12n73
6525c14L17J12k38J81p24R39k17J90j41m35K80j70L99k12k09R9M90L5n18ko8O28
$$ y = [-265, 249, 329, 413, 120, -173, -177, 265, 19, -166, -160, 152, 422, -117, -203, -285, -270, 100, 29, -337, -704, -255, 442, 660, -161, -541, -17, 601, 99, -437, -468, -263, 154, 766, -218, -51, 151, -297, 216, -109, -368, 152, 194, 430, -147, -177, -197, -106, 571, -639, -174, 172, 263, 380, -98, -675, -207, 39, 398, -130, -188, -303, 237, 50, 136, -414, -769, -66, 209, 217, -52, -10, 596, 338, -634, -353, -324, 139, -443, -32, -369, -170, 410, 767, 32, -111, -18, -100, 450, 248, -463, -652, 255, 162, 373, -614, -90, 277, 110, 167, 354, -592, -462, 262, 251, -301, -728, 65, 129, 113, -166, 151, -67, 146, -94, 65, -24, -170, 58, 271, 323, -323, -193, 149, 349, -57, -175, -118, 178, -109, 238, -446, -225, 121, -55, 61, -200, -649, -176, 257, 149, -138, 51, 325, 318, -236, 539, -415, 248, 310, 371, 259, -314, 3, 115, -123, 58, -666, 273, 56, 246, 105, -330, -50, -220, 179, -33, -242, -143, 347, 382, -136, -138, -206, 422]
6547D22p7l11l00Q0M69K40n60k18K70L68j91k01j53k00M74L88m39j92j86O94J62
6568E39n59m36J66J80L91j31k83O3L60j46qj34k26K84M20m00o35M76O4L72m41
6589h4j3j63J77J62P1k36O2K09k1K6k95oK06J23l70n2j95N43J84j65k64k54L96
6612D1J93j64k72J44K36j70K31k88k43J96J84J58l30m7M6L15j1j94k06K17j23
6633h7K03m1p9l8J38K03l26q4kJ22R9L8j30j88K10J93k1l64M3P2L51j08k40Mp3
6658a05J85O6l31p8J55K83P1l89k13J81M06Nm18L5M7K87l6k69j38R6L98J1m06
6681a57j65J72K28Q1j13k72mL40J24j89k75p1L60J89l05k77J76J02J72N7m65P5
6703b17N04r5j69j93l3M03J78m42N5P5L7N5k36l48J62K91K29k32j83N6J39J85
$$ y = [422, 345, 34, -266, -186, 283, 523, -37, -255, 15, 383, 192, -9, -162, -362, 112, 500, 61, -131, -317, 377, 539, -20, -456, -290, -110, 281, 150, -133, -70, 290, 144, 136, 2, -224, 60, 480, 80, -555, -79, -15, 357, -84, -97, -260, -83, 79, 150, -86, -24, 185, 164, 190, -105, -111, 95, 218, -152, -204, -399, 144, 328, 163, -101, -355, 41, 234, 70, -202, -58, 178, 8, 239, -49, -292, -96, 88, 246, -84, -131, -85, 230, 219, 25, -181, 36, -87, 116, 75, -4, -42, 96, 299, -27, -111, -113, 9, 108, 146, 16, -172, 38, 231, 210, -154, -111, -39, 312, 204, -36, -32, -105, 80, 146, -185, -263, -108, 175, 246, -143, -356, -175, 231, 236, -182, -147, -100, 187, 151, -118, -256, -160, 238, 249, -157, -322, -150, 78, 159, 46, -226, -230, 110, 234, 45, -230, -301, 59, 248, -57, -334, -158, -56, 116, 173, -292, -217, 287, 192, 23, -170, -203, 200, 378, -64, -9, 66, 103, 158, -78, -426, -264, 27, 256, 24, -159, -103, 36, 221]
6725B21k50k27rK67O3l3k20m4L08J07j58m08L17NK88k26k39KL76N1k95o4j51K96
6749b3J09j61j83J31J65M1J63l40O2P0K2Lj27j67K15J54N4j11j90J92mm1J39k28
6773e5O0L7P1j61L9p3J6K62j41j91n0Q7J47P7k71O2J08J40J05k72j79K00j8K59
6797B59l12j48K6L60r6m7p5O6O8K60l32l04J97K54M3l10j08j07K61K90r8n09L05
6820e7K09J27j58k66k16N59k2Q4m18p1J18K97j82j42P2J83R8p8l24p4K37K85j12
6843A49l25jP8J62K4k05j76J49L55k3m68K00J06J58J6l39j35L89N1j75j65L4K00
6866E9O3j15M0k69L78ol9k51m7J72J87j49j40n0p6M41k08k3M2k12M19o1l40J8
6890a67J90L19k15k10N3M2J16k02P4r9J88J2k6j27j5n0O8J77n0j56n3J07K09j56
$$ y = [221, -29, -256, -265, 2, 65, 32, -188, -232, 76, 183, 25, -383, -66, -61, 227, 1, -238, -236, 140, 191, -104, -168, -319, -23, 86, -75, -258, -127, 38, 79, 242, -98, -36, 34, 56, 59, -68, -235, -20, 134, 188, 77, -113, 79, 75, 34, 173, -55, 5, 42, 113, -48, -9, -82, -66, 196, 55, -136, -186, -99, 48, 125, -146, -84, 24, 164, 269, -3, -182, 18, 0, 259, -53, -201, -175, 185, 89, 42, -33, 33, 101, 361, 29, -275, -78, 176, 219, -91, -199, -306, -45, 245, 147, -362, -57, 152, 279, 121, -145, -361, 198, 176, 260, -158, -229, -111, 186, 4, -138, -66, 117, 215, 137, -187, -261, -24, 261, 149, -176, -177, -99, 63, 87, -118, -294, -145, 210, 187, -281, -81, 25, 183, 199, -140, -275, 114, 165, -10, -175, -141, 59, 122, 7, 47, -222, 156, 150, 111, -140, -187, -15, 172, 23, -117, -167, -243, 198, -10, -33, 9, -203, 216, 155, -185, -167, 23, 342, 127, -83, -30, 12, 128, -74, 0, -99, 89, 101, 75, -52, -67, -117, -49, 128, 78, -78, -131, -24, 185, 29]
6914B9o2M9j2J25j84K0M8j32R7L1o0rNJ72m4j43n4J34j1L8l0l29J68K34K5j19
6940a4j50l2K59L5n0k68M3J80J67n3l87p5L04R5N4j34l2K0L08o2l14o4L60n2j7
6965A21j39k09K77J12j52m6j95K12J25j55j5p0O9Q7J65k10l4K47qp4j12L1o6K63
6989B24m5j43j85J52L03j42k52j00P0K69r9q2l7K2K01j39o7j6J30N0Q9k61L4K2
7013bL2O1j4j91P5J41J04l08P8M2K3P9j37K2N5J34j78k39P7J43rl2n7l5Q6J92
7039A42k06J01Ko5L4k29L52q7r6J51j00QJ2j83k5J81k07L55j77K03j25N3j33l0
7063f9j97O5K49n6l3K77k53L9K3j46J15J0m3r9J2NL6J31m2jj90J22K14n6j64k03
7089b54K05J73Q7k29j52O2K11j00q4K5M7m7K03k61jQ2K56m2k09n0p0K95K46l79
$$ y = [29, -33, 16, 4, 129, -55, -35, 13, -119, -22, 9, -51, -60, -55, 117, 73, -70, -124, 10, -1, 37, 7, -322, -154, 80, 105, -14, -164, -196, 63, 98, 48, -220, -177, 3, 170, 117, -270, -345, -41, 54, 108, -26, -58, -38, 270, 208, -106, -170, 190, 138, 121, -18, -227, 50, 162, 10, -36, -231, -19, 106, -49, -64, -134, -65, 22, 187, -23, -57, 190, 182, 108, -4, 27, -39, 224, 179, 36, -149, 3, 306, 164, -88, -188, -118, 151, 52, -30, -67, -45, 156, 17, -50, -66, 64, 114, 203, -58, -24, -2, 30, 91, 77, -114, -39, 102, 206, -102, -24, 18, 41, 120, -17, 5, 60, 194, 16, -223, -146, -3, -12, -44, -101, -136, -50, 142, -64, 37, 39, -26, 8, -221, 131, 44, -52, 99, -1, 7, 19, -164, -189, -8, -215, 140, -37, 166, 41, 94, -39, -69, -266, -201, 48, -8, -41, 236, -17, 22, 45, -101, 14, 24, -19, -118, -106, -101, -65, 66, 24, 23, -167, -45, 169, 113, -51, -254, -49, 124, 211, -18, -170, -108, 103, 3, -81, -56, -9, -56, 147, -114, -115, -33, 223, 181, -28, -78, -148, 147, 393, 14]
7113A4l48NM37l8o9j12p1L79k0p2k90K50M3n6r2k14K92M0J10j77k30Q4K92K1j45
7138C3l25K24OR9N5k81J35N4J38k14N2J03N2k0j09k83O8J77R1Q3j75m3K55r7J0
7163H8j26o1l0j0J66k6L0K9R3j28j5q5n1K64j30o8j96K76k4N0j15k3K60k62O7
7188b7p0p7L13j59j6k8N1q8P0Q7l4K2M9j72K64P5j84k39J33J57j60r4L5j0nK19
7214A12j51l6n3P1J65r0j43K10r4n2l1l8J5R3J09k49Q1N1R1J72j89j7k46M56j63
7239G4k5j26R1J85j61l6k24O9J87J18k28J6m6K80o3o1k32l4K59Q9J12l21K2J19
7263F4K12j78j89Q0J10M9k86J08r2K38J11k85n3p8K12O6K5j48j1O0Q2k29N0N2
7287c0O4J30j73q2k3K59Qk23J2oo4K0Q6j2M4M9nN5k06J02R5l13K09p0J38%P5m
$$ y = [14, -334, -329, 108, 70, 1, -111, -182, 197, 177, 105, -185, 65, 108, 52, -40, -254, 38, 78, 188, 11, -219, -135, 157, 178, 33, -292, -68, -62, 37, 92, -189, -54, 0, 138, -76, -24, 79, 131, 111, 2, -281, -213, -36, 55, 138, -37, -80, 175, 78, 88, -38, -99, -129, -139, 27, 1, 31, 60, 153, 25, 10, -75, -126, 138, 8, -60, -256, 20, -4, 46, -69, -92, 168, -94, -27, -97, -174, 139, -20, -36, -64, -13, -101, -31, 56, 22, 44, 93, -79, 185, 260, 76, -163, -30, 127, -33, -127, -92, -102, -107, 112, -39, -75, -128, -57, 108, 18, -125, 85, -9, -61, -92, -130, -115, -22, 87, -162, -81, -30, 61, 233, 44, 27, -219, 237, 74, 49, -77, 14, 199, 38, 2, -222, -153, 34, 152, -76, -60, -106, 174, 111, 50, -182, -216, 43, 132, 244, -77, -55, 64, 276, 98, -91, -11, 99, 148, -138, -30, -122, 116, 227, -58, -111, -189, 23, 89, 114, -34, -45, 15, 97, -132, -82, -30, 34, 164, -9, -91, -114, 145, 153, -70, -58, -64, -128, -108, -22, -34, 10, 59, 54, 109, -97, 5, 100, -213, -4, -74, 64, 64, 139, 135]
7315A35l83K70j14K54p9j64Q0r7R5J2qK3j3KM0j17O9k7j1K48j43q0jL3O9Qq5j57
7343a41J57q5P0J57r6j78J87r3K25k74L9J29j27J7nMj95J59o9O1j9J88o0J70j56
7368F5j18lJ52n3J2r5j0J12O8j12q8J3L55j95k41l8J57Q3j34pm8L2K29K5j46j82
7394a67J61Q2j50N6j79L36O0j91j61L8MJ80K3j56o7J84L3j89O8j21lJ94Nq8j01
7419a49J4K32o1M7j65J33j07K83k50R5r3j10K18l8j16O4Q7p5J6o9l8J11K6JN7
7444A13jn7j04N7m2O9j93K71Rj01j50R9Ko7J27L4j84J37%J41m7r4J45j39l4J82
7470A73k23o3K93k42l2N0m3J45J00o2j21J13q8J50j40K9n9M6r8O3j04Q4M8J06
7494A25p3q3j4P3K5j32R7j11M6J98k84Q9N0n0P2J91m70K14K35j22q9%kP6l1n7
$$ y = [135, -248, 22, -92, 162, 83, -81, -1, -98, -3, 9, 1, 24, 11, 13, 53, -64, 5, -22, -33, 215, 72, -8, -9, 24, 93, 101, 16, -141, 16, -69, 1, 158, 62, -116, 71, -22, 203, -71, -32, 97, -30, -13, -18, -14, -209, -50, -119, -58, -77, 111, 51, 221, 65, -53, -56, 96, 43, 55, -40, -50, 62, 130, 18, -70, -57, 298, 103, -138, -176, -19, 64, -70, -77, -125, -93, 136, 161, 15, -167, -6, 76, -74, -18, -197, 139, 199, 8, -153, -115, -111, 69, 92, -64, -131, 53, 86, -103, -35, -156, -159, 35, 40, -48, -149, -135, 97, 36, 83, -82, 51, -56, 227, -23, 72, -21, -131, 87, 49, -67, -3, 84, 9, 25, -44, -82, 29, 55, 56, 113, 112, 55, -49, 8, -34, 35, -158, 113, 122, 21, -129, -30, -28, -95, 32, 66, -118, 19, 19, 160, 113, 19, 164, 25, -9, 173, -50, -113, 180, -62, -94, -44, -87, 58, 158, 96, -25, 88, 0, 150, 10, 39, -20, 26, -72, -9, -113, -29, 19, 125, 52, -31, -45, 28, 53, -79, 18, -93, -47, 151, -133, -44, 6, -44, 28, 219, -251, -37, 198, 76, -13, -13, -15, 61, 30, -27]
7520b7l7m8J72p6K5k17J30J91J8r5o9r8K54r8q2j21R3J62J84k84j9J20q2P1j28
7545f1q3J69K9J90j58JL6j20J09Q2j20q5R7k00l3N4J36n5J30Ll46J34J87j39j35
7570a78J08P1j48Q1J29o7j5j1j3L8j3n8j32K25N4j74k3J17p4J83l1k1M2k48L2
7595a26J51j37O0l8P6L7k15K65m7pn9J37j32k2P7K4J2K8j89O9Q0L9k02O9P5L5
7621F0k6k52J65QJ05M5k06J32K27k54J29k58Q9Q7K4o1j09J51K0J3m8ok4j81J40
7646c0j4J70k28J64J20k18j22K28r0L25k16j10K3j3J71r7p7l5R0J23r2q0j06P7
7670c7O4k7Kn4J04N9m1PL9r7P7j49O8j07j7K37k0j67O4n7J07%m2j09n0J40o5K75
7698B04m06J38J96j13m9N4O5kr4J11j62k2J76J73j54o8n1MJ15R7k21j58M14k64
$$ y = [-27, -64, -112, 60, -16, 9, -208, -78, 113, 131, 36, -33, -131, 123, 25, -57, -178, -85, 77, 261, -23, -42, 78, -4, 67, -61, -144, 25, 54, 244, 86, 87, 123, 3, 112, 194, 74, -11, 86, -114, -147, -93, 43, -12, 118, 121, -225, -91, 96, -43, -178, -70, 1, -147, -66, 63, -4, -19, -30, -43, -5, -18, -76, -208, 17, 71, -103, -126, -9, -83, 100, 69, 48, 90, -158, -126, 25, -112, -52, -90, -14, 23, -192, 73, 26, 19, -40, 97, -35, -57, 20, 44, 56, 84, -105, -36, 44, 83, -119, -50, 25, 60, 34, -218, -53, -45, 60, 105, -101, 31, 258, 4, 133, -125, -36, 51, 75, 14, -95, 56, 76, 89, 41, 35, 11, -170, -30, -44, 126, -102, 62, 182, -36, -158, 70, -20, 305, 89, -21, 2, -11, 160, 63, -14, -49, 41, 164, 72, -8, -114, -37, 27, 0, 2, -52, 52, 111, 70, 77, 116, 19, 96, -53, 15, -92, -109, 128, 108, -59, 5, -52, 55, 55, 13, -96, -146, -6, -71, 204, -202, -64, 132, 19, -30, 24, 89, 87, -7, 104, -58, -80, 96, 269, 115, 47, -4, 0, 115, 212, -9, -167, 247, -17]
7722a7M9J5o2P6P1l9j64L8r1J92O1j30l1m9K43j97J39j49L7p5J48j74J8J11k55
7747b35M10k28K55l39J62lR4j61k3Q7p5J25p1k04J72QM3o1j1j00L03Kp7N7l13
7772a83M78l27n2j4n1K23M7j81K8M7k3P9j15k22J14L05k3j63j58K78o4J51k64
7795i0oK2O8K00j89m3J45m2n4p7o3J76Oj44L7J56j35J59j30j98J11J73M4J0j78
7820d2j76K41M3Q6m3r7LN2o1l9N0o6R7j1j4o7J7o8J94j34q3k17L50j89J67j98
7846b05K74P5r5j4o0j52L17O4l44R1J36qj03J21j28N4l5R2oj54P9J9j24K22k27
7871a11L9J56j4r8j3q1j6N3K07j19j50J83P5Qoj91m0O4j5J01r3j06K55k0j3j45
7897i0k9j53K53P8j1J07j17K8J80j41k12R0R8j37K8L8J0J10k43J32j40K11j24
$$ y = [-17, 32, 47, -15, 61, 132, 93, -71, -33, -124, 68, 129, -1, -32, -81, 162, -35, 104, -45, -8, -83, 65, -109, -91, 20, -235, 175, -53, 202, -137, 25, 22, 116, -45, -68, 19, -56, 69, -2, -206, -34, -26, 17, -44, -55, -155, 148, 150, 73, 130, -183, 295, -32, -84, -98, -149, 74, 121, -60, -32, 15, -8, 71, -44, -266, -152, 153, 130, -33, -191, 87, 23, 174, -90, -96, -74, -6, 194, 5, -38, 107, 65, 11, -66, -129, 47, 53, -91, -54, 102, -33, 126, -4, -202, -91, 82, 126, 136, -42, -218, 23, 66, 152, 109, 12, 15, 67, 6, -33, 17, -49, 48, 37, 23, -44, -27, -95, 99, -35, -118, -335, 15, -174, -7, -205, 69, 144, 49, 35, -25, -177, 140, 204, -140, -49, 87, 79, -24, 97, -31, 23, -12, 80, 74, -80, -1, 18, -106, 116, -111, -72, 84, 70, -28, -41, -122, -138, -85, 122, 3, -147, 36, 111, 119, 113, -78, -118, -54, -69, 32, -61, -167, 88, 68, 55, -90, -119, -272, -19, 59, 48, 155, 38, 66, 246, 105, -107, -17, 81, -56, -28, 10, 20, 130, -113, 19, -121, 90, -34]
7920c4L9m8Nq5K79k6j61n7J07n4J34o8o4N4q3K14k78N6M8J12n9j36j05K70q3J8
7946epj53J07k2J52J3l9k34L88j03J8j66M5J51p0j44M9J04m5j8j37k5l4L26j41
7971A0j02j2O1m6J57K57l91M4K39k28K3l6n9j9N4j1J68j61M1q5J27Q1l90O03k57
7996F8j34J97k44K20j62K02k33m41M52l56N67j44n7K58j92l4K30j08l44L57L30
8017D32o18J89l24N30l00M30q8l25q7J08l0K1PK02q3M1m9r7n3N1L9m2r0R1o5K34
8043A24p2j76M6j7J54q6l09L07J32k0K9n2j04Q1K4j87J21o5N4J38j37r7N0o4K48
8068A22L2k43J40Rj8n2k09J46L2K71k73L4OJ65m5P0j98m5Q4M9p7j74Q2K82o3r
8094A18k23M6q0K04qN6k36Q5J81o8M6k87K11J17j22j38l4L52j92o9k9L1j11L29
$$ y = [-34, 5, -43, -38, -123, 156, 130, -31, -88, 19, -35, 99, 31, -33, 21, -62, 152, -126, -70, -22, 90, 31, -105, -210, 60, -23, -5, -12, -165, -58, -80, 72, 85, 46, -188, 200, 97, 115, -51, -6, 145, 75, -69, -20, 84, 39, 21, -116, -141, -175, 151, 10, -92, -104, -43, -89, 68, 325, -66, -22, 217, -11, 12, -24, -83, -102, -48, -59, 109, -52, -11, -96, 31, 112, -278, 325, 68, -66, 131, -113, 107, -55, 147, -86, -527, -75, -431, 136, -8, -65, 193, 1, -33, 197, 89, -255, 102, 432, -186, 3, -321, 209, -91, 339, 251, -74, -161, -53, -83, -62, -55, 147, 64, 105, 56, -41, -94, -43, -4, -46, -136, -45, -110, 124, 52, -124, -78, -95, 59, -27, -336, -29, 103, 83, 112, 60, -44, 37, 61, -126, -5, -70, -16, 122, -15, -112, -62, -126, 122, 154, -89, 51, 60, 42, -10, -219, -73, -41, 230, -43, -9, -3, 162, 117, 187, -11, -56, 28, 77, 0, -174, -92, 190, 127, 118, -105, -59, -139, 65, 57, 113, -123, -38, 143, 75, 121, -166, 45, 162, 40, -98, -132, 220, 28, -41, -70, -39, -150, 179]
8118A79j06k12k2J28J15l2j74n7J20J0K24r6r7p1J74q2J06k71J70P8l5%j4m2J76
8143A69k23j42K11p9J08q7N1J04j53j6j4J47r3J0J07l1K13l66N2roN1qo9k3J04
8169HJ02j65m3J02P5K9n0r7pJj20J80O6k08J55m1L0Qm5J2Ro1
$$ y = [179, 73, -139, -161, -33, 82, 50, -124, -181, -61, -51, 173, 77, -20, -91, 83, 1, 107, -164, 6, 84, 49, 49, 35, -7, 169, -54, -196, 15, -64, 44, -43, 8, 112, -41, -57, -71, 76, -17, -7, 100, 69, 282, -84, -32, -41, -47, 4, -4, -73, -96, 8, 110, -55, -98, 4, 79, 108, 58, -39, -46, -45, -165, 15, 81, -127, 28, -13, 17, 25, -20, -8, 1, -60]
8191f0
$$ Imaginary data points
##PAGE= N=2
##DATA TABLE= (X++(I..I)), XYDATA
0@%%%%%%%%%%%Qj6J6j6J6k4L2m0M8n6P2q8J04j20J36j60J89k14K45k84L25l69
33a96M18m74N34o01O77p57Q45r42J049j164J289j428J580j746J927k123K338k577
51a351K838l127L449l805M207m660N176n773O467p290Q284r512J1071j3132J6002
66H844k0294K7513m2716J31772j90747j23816L41671L9204j03565q3955j6480
77c2569L2202Q4998R179p6054j15427P6699J38575n5510r6870J872m7983Q0914
89B6J60347j24301k19986Q2121J89563J8730j57045j03293J23060J08975r8612
100b0415n1715L4225j9055K7989N6794n1485o6731l94O4921O8210o0829q7866
112a06351L6319L2106J8732M5382q5987q2624J26699O9321j13812l7818O7057
$$ y = [0, 0, 0, 0, 0, 0, 0, 0, 0, 0, 0, 0, 8, -8, 8, -8, 8, -16, 16, -24, 24, -32, 40, -48, 56, -64, 72, -88, 101, -113, 132, -152, 173, -196, 222, -252, 282, -319, 358, -399, 446, -496, 553, -611, 678, -750, 830, -916, 1011, -1112, 1226, -1351, 1487, -1640, 1809, -1996, 2211, -2449, 2727, -3046, 3421, -3869, 4415, -5097, 5974, -7158, 8844, -11450, 16063, -26653, 105119, -85628, -209444, 132227, 171431, 67866, -16089, -32569, -367, 84631, 93810, 17756, -97671, -20972, 117603, 62093, -34777, -32905, -80888, 26, 160373, 36072, -183914, -101793, 87770, 106500, -50545, -153838, -30778, 78197, -20415, -72130, -37905, -56960, -28971, 27823, -23662, -90393, -90787, -25866, 42344, -18485, -106351, -70032, -37926, -19194, 26188, -59799, -142423, -15724, 53597, -60215, -98033, -30976]
123c0976K1169k3320q89J7783m0489l1607J02895M0287j31480j7788J02809r937
135a543k2945K8523m3797k4292O9728L0267n0499m8456K9960P1934j6262n7761
147c5143J3021Q371L867N5299j8456q5809J9712Q0794J0084n1625m2864K9212
159a3537N2530j0979j8126o387l5465K9090P8650l6357q7919J7630P2827K1402
171F3359m5071m9562J3018M3582K6974n045o6849l9392Q6699O2362o9680n5807
183c5412K2382K7680K5174P727m6286m6273L4180Q1348n201j01273k4585Q6793
195B6254M1087l5565m1403l1961K0633P7303J5125q1084n4534M8219P7488p294
207E4268p0773k5026L3259M0420K0287m1429p0449K2507R5261J2925q4509n1710
$$ y = [-30976, -9807, -33127, -34016, -16233, -56722, -88329, 14566, 54853, -76627, -94415, 8394, -1543, -24488, 4035, -39762, -64054, 5674, 35941, -14558, -63014, -33054, 38880, 22618, -35143, -22122, -13751, -9884, 45415, 26959, -58850, -39138, 41656, 51740, 115, -42749, -13537, 38993, 28014, 9888, 3501, -31964, -2874, 75776, 39419, -48500, -30870, 41957, 63359, 18288, -31274, -18256, 25326, 52300, 47255, -19594, -58986, 27713, 90075, 20395, -35412, -13030, 14650, 39824, 47551, 1265, -45008, -10828, 70520, 65319, -35954, -60539, 26254, 67341, 31776, -9627, -41588, -20955, 56348, 71473, -9611, -64145, -15926, 61562, 54268, -16505, -41531, -8272, 32148, 52435, 11006, -59443, -36936, 58325, 71250, -13259, -64969]
219f4969M2226O5523J0429m2859n0527o870O3587N4806n3467q0240K5759P8084
231D1482P976n4728l8102J5133M8247L0249l1030o5603p843P2632M3386n0132
243A1667n5350J1141L8877K1235q290l7712k2895L7688M6107k6623n9400O093
255c7462N5563J5314l2316k6456k926J7404L0776M830l9290k5633K9415L2035
267B1254j4130k5421J487J1631P606L847j2686k1600J1353L5498r74l8091j1226
280c1452K5410J3885l635l590j3290j1486J8266K2309j3898k4552P463K1972j76
293G226j4725n523J807Q014J7158j710l1376j0488L2862K2101j8287k3489R7J4091
307b242J3676L309j7637k0707J6098L4431p701l8057m678L0007J8265q369k3192
$$ y = [-64969, -22743, 42780, 53209, 10350, -40177, -47047, 16540, 71346, 17879, -62361, -36602, 41482, 49458, -5270, -43372, -28239, 20008, 50257, 19227, -46376, -54219, 18413, 61799, 11667, -43683, -32542, 6335, 27570, 19280, -18432, -41327, -3639, 42468, 15845, -43555, -37462, 18101, 33415, 1099, -25357, -28283, -10879, 19897, 24727, -14563, -40196, -10781, 21254, 7124, -18297, -16810, -5179, 2427, 6274, -6412, -28012, -16659, 18839, 17865, -20226, -31452, -6042, 7843, 4208, 618, -12672, -24158, -5892, 16417, 2519, -22033, -14570, 7402, 7226, -7499, -13022, -11215, -3201, 13957, 12247, -19129, -29617, 3245, 25346, 7059, -16430, -16333, -2242, 11434, 14743, -2894, -23601, -7503, 26928, 19227, -18830, -23508, 6499, 24764, 16395, -6797]
320f797j6575J4212L5577O956l8599k8690K7805M0495p087l6278j4488J8052L0096
333B4679R137l2229l5230J8806N0744N266m8030k8811K7058L9531M058l1486l3288
346b9795P935M7840K1083m2530m4191J9043N0564J0643l7601l3851R153L9338
358A7631K2600k7242m6195K505N1719K2859l8727l9721J0737L9093J9099k1214
370A3144l9057p804L9085L3564k3219m5062p51L7894J9889j8354k8859n765K4200
383a095K6277r514l6726j0951L2237K7910j5413l1883o371K0508K0420J18k2164
396f647j7742J3633K5750k489k4221o255J5946J2107l811j2041r785N145J9059
409H649O814j7752j6564Q083J7570K728r191o560j343M418P654J98r805k628J0366
$$ y = [-6797, -23372, -9160, 26417, 33373, -5226, -33916, -6111, 34384, 27297, -8981, -23469, -5417, 24679, 33816, 1587, -33643, -14837, 35907, 41173, -6857, -35668, -8610, 30921, 34979, 3493, -29795, -21860, 25980, 47063, 4533, -39658, -20615, 29949, 40592, 2991, -30860, -21707, 17631, 40231, 12989, -33206, -30701, 21018, 43877, 5150, -34571, -23834, 15259, 34358, 13144, -25913, -33717, 5368, 38932, 15713, -29349, -30100, 7794, 27683, 9329, -19530, -25295, -1095, 25182, 15668, -21058, -32009, 228, 28138, 12725, -19158, -25529, -5021, 15399, 15517, -6647, -24389, -10756, 14994, 12505, -11716, -17971, -2025, 10082, 6271, -5770, -15555, -10410, 8649, 15463, -2289, -18853, -10770, 6800, 9528, 337, -6223, -7566, -3148, 4506, 4704, -5101, -7729, 2637]
424B637M509q126o530K525N260O256J720j0844j0825P469J5655O33j2403n347
438g411M396M649K514j113o664j912R860N461j1173j1543Q048J6630P35j4736
452b259r974L565J3755J0269j0243j8464K862J8519L768j2864r069M209J2543
465F617O456j0600j8247P03K5295J4507k2074k5733P711K6286R489j6669k0703
478a6962K726K1888J0163j4021k0158Q13K4283J3876j8371k4395J313K5466J9430
491B6051j4555l2686l679L0792K1541j7138l1312p6L0213J3422j8242j9547j206
504a6422J7993J9714p421k8966r352K4319K5478r220l1411q601K3772K0946n528
517A5301k5728j3065K2690K3230j2379k2315j757J2873J3503O22j6349j2374P687
$$ y = [2637, 7146, -980, -7510, -4985, 275, 6531, 8251, -2593, -13418, -5949, 9706, 10339, -2064, -7411, -3015, 1634, 4148, 3035, -3629, -5541, 4319, 9780, -1393, -12936, -4888, 11742, 12477, -2259, -12233, -8668, 5087, 15356, 5113, -13351, -10489, 8030, 11798, -1066, -10135, -5926, 6617, 13073, 2473, -15774, -15071, 10224, 24731, 2657, -23076, -15365, 10921, 20410, 3741, -16962, -14236, 7652, 17815, 3794, -16364, -15551, 8732, 22608, 4237, -20158, -18845, 6621, 26051, 11496, -21190, -24869, 5923, 27464, 10326, -20986, -21062, 9151, 22573, 4331, -15216, -16422, 1571, 21285, 13864, -15102, -24454, -135, 25343, 16123, -15288, -23889, -117, 20829, 15301, -10427, -23492, -802, 22428, 10049, -12266, -14023, -1150, 12353, 12975, -3374, -15748, -8061]
530h061J9179O325j8957j6914J2234J8914q08j3883j0188O661J4950O0j0993m329
544e810P41O442P824m810q699j182M152Q418J300j2221m252J0356N647m199o611
559b904j829O495K634k619K255l587q516P023J1782m156j0701k774P103Q629m144
574D691r074J508N701K230j860o272l98N917R40J392n53j0985k643J6261O709
589A3564j2531j2382M753J6256O56j7013k777J3484M333o430p724j152Q204N470
603F711l164m928n667k98J1285O279q884j1889J403J5666O182j8651j2318J7922
617c51J6750j0277j9860k637J8396J3058j0842j4957p10Q415R723R52j2165q070
631a2575P292J2783K159j5464j2452J2885K1258k946k4102j1907J8461K3862o596
$$ y = [-8061, 11118, 17443, -1514, -18428, -6194, 12720, 11912, -1971, -12159, -5498, 9452, 9512, -1481, -5810, -5069, 1373, 9197, 4387, -4312, -5494, -1342, 7076, 8376, -3845, -8097, 2259, 7906, 3707, -2904, -4733, 1762, 4396, 1777, 4032, 445, -8071, -1048, 10734, 6578, -4123, -6897, 206, 8835, 4691, -4383, -2875, 2826, 5056, 3196, -3076, -3474, 2443, 3383, 4775, 4222, -6763, -9406, 6855, 13564, 1033, -11349, -6596, 9660, 10316, -6697, -9474, 4010, 8343, 1913, -5811, -6963, 1241, 6711, 3547, -1381, -7048, -7346, 3939, 10218, 1334, -10555, -9152, 6514, 12696, -5955, -18273, -351, 16399, 6122, -13738, -16375, 2021, 15079, 4237, -10720, -11430, -3015, 6708, 7660, -4505, -12575, -5283, 7500, 9659, -5805, -18257, -5372, 15886, 12940, -11162, -23069, -4608, 19254, 12658]
644A2658k4908n830J6035J3559l514j4580o187J0084J1533o28j2804r477Q684
657e375J7059N01j6073j1496O993J8265M983j5597j3481P042J5561J924j1955
670a649p584O457R224M2p190n672K917Q050K875n049o386j379N389N808N03n774
686E82o072J807P654K755n421m922J740M621J253k523k671j360K295N398N21o778
702a121m924L064Q112M610q386j0700L631J2326L393r334r379L860J1633J531
716H316q472o752K366Q644N055o763r454JR459Q280n650j3521J5J2755N873o988
732C164j1067J8J1970O503q975r252J523R466N354o478r293J535P518M629k687
747C928r904k239J2139N094p800q487R09J0382N668q852q768K786Q474M175n981
$$ y = [12658, -12250, -18080, -2045, 11514, 8000, -6580, -12767, -2683, 8850, 8222, -4582, -14059, -5375, 11684, 12185, -3888, -15384, -8391, 9874, 14857, -740, -14221, -7179, 8382, 10306, -1649, -9233, -2776, 6448, 6490, -700, -6372, -3455, 4595, 7470, 2421, -3965, -5344, 45, 5853, 6356, 582, -5490, -3683, 3971, 6726, 1305, -3617, -1877, 2744, 3997, 1474, -1197, -2557, -262, 5136, 5657, -1121, -6045, -2981, 5131, 9741, 1355, -9345, -5714, 6612, 10005, 671, -8708, -4848, 6785, 8316, -156, -6908, -4542, 4102, 9157, 2394, -7060, -7059, 2400, 10680, 5030, -8491, -8476, 4279, 10152, 3164, -7903, -7885, 4085, 10588, 1613, -7639, -6116, 3350, 8704, 2226, -7067, -5532, 1986, 6615, 3928, -5976, -8215, 3924, 9018, 1218, -7269, -6360, 4022, 9690, 838, -7930, -5144, 3330, 7505, 1524]
762A524q487K754Q575J004m857o221j82J0175M880r420q876K804J0161O530r010
777A354j2106M557J1232K215p250q318K902J0702J457q794o218K141J0287N402
791I563r383j0185K310R351P455m821j3362q21J2362N460o457r242K3J0971M592
806G816q653p165J975P359O112m448r862n57O412N591M62o667n354L833N997Q48
822C699m114m385K451O216j037m989j485J550M131K716l515m241j034K031O111
837D105K627o351n729J209O104N388l763q621O49P952L306m653o882r5Q617N451
853I314n579r061k189Q979J0091l915j2606m336Q713J0857j243j2370n780R238
867A13R933k334j1576n640R680J1857l658j3425n434R240J2213q43j3627p080
$$ y = [1524, -6963, -4209, 4366, 5370, 513, -5708, -5890, 4285, 9165, -255, -9131, -6327, 3834, 10364, 1354, -10752, -6195, 5037, 7252, 2, -8316, -5414, 5288, 6745, -2049, -8267, -6126, 4161, 9563, 180, -10005, -7695, 1656, 9111, 4290, -9072, -9893, 2469, 7929, 1472, -7770, -7747, 3224, 7816, -837, -8002, -6027, 1332, 7444, 2996, -6866, -7423, -1011, 4580, 5042, -1625, -6979, -3146, 2851, 3699, -415, -4800, -2349, 3867, 2830, -2159, -3644, -2094, 2037, 4753, 1238, -3003, -4037, -2006, 4105, 6732, 381, -5348, -4139, 1965, 7353, 3590, -5031, -4382, 3570, 6876, 2223, -4659, -4754, 3863, 9314, 3735, -5326, -7515, 1464, 11555, 7640, -4966, -9302, -589, 10268, 9025, -3345, -9125, 113, 10046, 7712, -3864, -9504, 176, 12033, 8375, -5050, -10484, -1244, 10969, 10126, -3501, -10581]
881a0581Q563J1100o52j1100o186P004J0029j240j0331n663P048J0363n26j1643
895c815o276P507J0630q62j0890n398P222Q752j904r200l541P006P126k894q772
910e309k064O765O264k326p743k976O004O825k349p649k689O376O505k815q511
925e692j526P492N425l484p865j169O937M929l414o550n66N360M483k759n612
940d011j439M830M744r46o652k736M790N409m91n543l047L097N042k46m017k396
956c612J643M190J146l735l258J161L692K403j484m510j907L184M757N88m419
971a61m136J667N112K167l468m865N65N758K811m366n414J82O461N195m021q397
987d910k024P262Q323j903j0661m837P626R620j536r992n115P103R748j893j0841
$$ y = [-10581, -2018, 9082, 8430, -2670, -8856, -1852, 8177, 6937, -3394, -9057, -2009, 8354, 7828, -3815, -10091, -2584, 8046, 7184, -3706, -9104, -1882, 6870, 4966, -4234, -7775, -769, 6357, 3463, -5309, -7373, -608, 5656, 3330, -4413, -7389, -1385, 5440, 3091, -4558, -7247, -871, 5634, 2819, -5692, -7218, 274, 5699, 2215, -5650, -6819, 118, 5047, 1633, -4917, -5483, -123, 4360, 1601, -4011, -5450, -620, 4124, 3178, -3474, -6210, -1420, 3989, 3498, -2045, -5092, -1995, 3047, 2801, -1216, -3612, -1969, 2221, 3367, -368, -3626, -2465, 1227, 3630, 2146, -2364, -4271, -1087, 3670, 4258, -161, -4297, -2630, 2482, 4649, 1181, -3684, -3119, 2639, 5450, 1084, -4330, -4148, 2313, 7508, 3487, -4910, -6934, 328, 8651, 6748, -3913, -8750, -1124, 8496, 6960, -3032, -8147, -1044, 8704, 6811, -4030]
1002d030m754P582J1211j155j2050p700P197J2732J829j1788r840N549J2737K761
1016A0281j0699r124N336J2488J460j1876q028O248J2082K449j1097j0104M306
1029f278J2931M131r470j0153K531J1273L965q020q754L138J0170K558q656p732
1043h366M123R684K660p780q087K026R166L737o033p239J446P370K507n669n111
1058e566K523O322J354o103n180L375O878P61n224m466J232N458K719m334m413
1073d664J559M536J251m023l337K165N058N41m666l526K435M783L71l106k408
1088c031J9K795K498j502l343m73K845K209q85l324r42L129K876j308l422j295
1104c154K177K982L97j966k683o46L878L192k259m901n87M714M121k203o559j357
$$ y = [-4030, -8784, -1202, 10009, 8854, -3196, -10896, -3699, 9033, 10862, -926, -10766, -5217, 7520, 10281, -418, -9542, -4206, 8282, 9742, -2134, -10162, -3914, 8168, 10617, -480, -10584, -6278, 6653, 10784, 1314, -8839, -6308, 4965, 8930, 910, -7844, -4706, 5464, 8022, -634, -8366, -4243, 5441, 8101, 321, -7766, -5740, 3426, 7163, 1130, -6109, -4663, 2707, 5214, -455, -5566, -3043, 3279, 4633, -1470, -6650, -3275, 3603, 4364, -860, -5326, -4094, 1364, 4083, -251, -4664, -3105, 1431, 2682, -1341, -4678, -2513, 2545, 3086, -1580, -5106, -2671, 2112, 2483, -623, -3031, -3012, -217, 2281, 779, -2564, -3037, -192, 2017, 1132, -2192, -3134, -5, 2871, 1563, -1859, -3154, -977, 2005, 2402, 436, -2247, -2893, 985, 4177, 1918, -2983, -3570, 1144, 5265, 3062, -3497, -4854]
1120d854O074N274k597o747k442N342O143p09o944m823M715Q534L44q930o293
1135g913N560J0290R65j0458p993O010J1612J382j0218q327M435J1090L208r154
1149D89r299L194J1689M251r739j0385L029J2881N377r972j2167K345J3379O082
1163A1154q839j1791J373J1624O157p587j0565Q49J0794O162p261j0845N8J1431
1177B714P130o632j1342j197J0289P675m917j0375j346Q770O149m391q498o42
1191f613Q052N161m559q000p42P347O171l584p718j951N845N548j373o286j915
1206d617M596M110k014n003p71M845L555k996m715p56M141M016j403m603j361
1221b976K696K515N92k738k045J790K578n03k700j191K095L269p96l478j812J684
$$ y = [-4854, 1220, 6494, 3897, -2850, -5292, 50, 6193, 5484, -1460, -6283, -1568, 6966, 7310, -1620, -7913, -2353, 7937, 8902, -1556, -9549, -3539, 8073, 9455, -763, -9090, -4655, 6435, 9643, 489, -8810, -5616, 6073, 10324, 585, -9800, -6771, 6110, 11487, 1515, -10652, -8307, 5072, 11154, 2315, -9476, -8103, 3521, 9678, 2091, -8474, -7625, 3169, 9331, 2070, -8775, -8717, 2714, 9844, 3212, -8130, -9327, 962, 8637, 3720, -6655, -8001, 769, 6918, 2527, -5971, -6613, 1439, 6600, 2041, -5959, -6701, 646, 6817, 3233, -4485, -6436, -591, 4957, 3584, -2702, -4617, -21, 4089, 2075, -2928, -3699, 1146, 4701, 1705, -3010, -3766, 375, 4391, 2988, -1615, -2976, -280, 2235, 2827, 89, -1956, -166, 2412, 1909, -791, -1982, 113, 3382, 2586, -892, -2704, -1020]
1237a020L775P90l036k451L52K143K205m25l723j092K883K397j082l501j666M116
1253F65L791j977n107k113M024N510p56o118l347L025N964J648n988n352L088
1268c043P064J474o301o456K984R503J772q018p388K941J0451L200q319q410K411
1283f135R687M898p077j0185J803J1023M745o919j0260K03J1836O789p928j1272
1297h792J95J1452P755p037j1975m71J1164P762n783j2000j594J1408Q025n420
1311D689j1400k645J0267R093m648j1434k831Q820Q916k879j1207l292Q551Q361
1325H361k394j0378l986P801Q729k205r377m202O092Q041q96p948m033M797O543
1340D945J61p122l922M377O366J5o353m464L801O925J44n941l840K483N385R93
$$ y = [-1020, 2755, 3545, 509, -1942, -1590, 553, 2758, 2333, -1390, -2482, 401, 2798, 1716, -1785, -3451, 665, 4456, 2479, -2628, -4741, -717, 4793, 4037, -2081, -5428, -2403, 3561, 5209, -779, -6131, -3043, 4021, 5495, -806, -7262, -4278, 5225, 6997, -1021, -8409, -5468, 4983, 8183, -136, -8546, -6135, 3552, 8450, 1373, -8812, -7009, 4014, 8759, 1840, -8420, -8217, 3619, 10408, 2480, -8792, -8597, 2855, 10610, 3573, -8402, -8873, 2291, 10053, 4270, -7730, -9324, 2084, 10109, 4689, -6711, -9356, 911, 10004, 5356, -6078, -8909, -89, 8827, 5948, -5259, -8551, 0, 8361, 5967, -4411, -8397, -596, 8133, 5928, -3449, -7651, -1559, 6482, 5586, -2362, -6395, -1598, 4945, 5106, -2016, -5938, -1561, 4805, 4820, -1533, -5997, -2196, 4729, 4873, -1068, -4908, -2425, 2960, 3953]
1356C953m358l367K154L920M92l250k847J527L891J119l175l527P70M242K147
1371C691k502l783l72L337K248j519k631n22K444J699j059k774o59K902K603r45
1387B158l787j884K601M456K33m238l322J985M599J143l891l629J880N109N30
1402C943m399m093K650N955J364n508n464K006P012L447n167p209N04P173M812
1417G026m863p790K09Q430M636n749q648M71R434N954o386j0089l56J0048O509
1432H836m782j0733j367R154P057l369j0127l340R032Q531l576j1424l232R279
1446f1J0011l931j2499l396R439R009j878j1697l938P408R096j276j0046m638
1460h397O216R615j232j0205n672O892J0534q94r857n967O120Q674M96q256o337
$$ y = [3953, -405, -3772, -1618, 2302, 2794, -456, -3303, -1776, 2115, 3234, 59, -3468, -2698, 1544, 3691, 1189, -2594, -2966, 371, 2619, 1100, -1531, -2053, 391, 2090, 1031, -1743, -2402, 500, 3103, 2158, -1629, -3513, -912, 3544, 3777, -461, -3783, -1798, 2801, 3944, 53, -3576, -1696, 3413, 3943, -456, -4549, -1899, 4056, 5420, -88, -5552, -3546, 3466, 6913, 1746, -5463, -4959, 2214, 7026, 2163, -5627, -5418, 3012, 7648, 1899, -6749, -6278, 3156, 9110, 2724, -7365, -7721, 2327, 8836, 4054, -6679, -8046, 1108, 8165, 4796, -5331, -8671, 361, 8892, 5316, -6108, -9340, -61, 9950, 6019, -6480, -9876, -437, 8572, 6694, -5003, -8941, -1533, 7563, 6287, -3759, -8397, -2181, 7434, 6202, -4003, -9675, -2783, 7751, 6857, -3000, -8967, -2847, 5827, 6323, -1933, -8270]
1475h270N063Q123L14o728m487K782P403J237n887n324K134O901K905o159n062
1490e055K001O012K164m870m444Q48N756J485l631l639L58M411K614l225l540
1505b755K2L957K276j839l777o38K944J798ll617j432L054L299j492l067j534
1521b804J821L773K49l565k038J478L009P63k814k591K044K654J012k754l499
1536c262J076M890J036l119m423M89N297K921l736m950K33N430K989l502n164
1551c795L70N215L362l262o203m53O689M438l926o836j672O831O209l008q540
1566d581j690O673O360k998q380j798P273O186l100q757k622P607P645k917r260
1581d359l951O880Q909j262r746m895O508Q759r16r476m849O926Q412r96r297
$$ y = [-8270, -3207, 4916, 5230, -1498, -5985, -3203, 4200, 5437, -450, -5774, -3640, 3261, 6166, 7, -5055, -3054, 2958, 5122, 252, -4192, -3344, 2412, 3897, 266, -3373, -3015, 1396, 4010, 785, -2755, -2733, 1224, 3500, 1661, -2116, -2754, 190, 1988, 1985, -1632, -3064, -10, 3289, 1797, -1270, -2804, -983, 2790, 3039, -526, -2564, -1086, 1923, 2686, -128, -2719, -675, 1979, 2991, 237, -3262, -2186, 2704, 3740, 621, -3802, -3313, 1984, 4905, 1169, -3781, -3548, 1882, 4871, 1369, -3795, -3425, 1790, 5152, 1890, -4313, -4766, 1923, 6361, 2435, -4401, -6073, 758, 6967, 3959, -4581, -6271, 402, 6762, 3764, -4616, -6414, 859, 7045, 3945, -4812, -7434, 173, 7818, 4901, -4359, -8310, -1430, 7479, 6217, -3529, -8424, -1916, 6843, 5927, -3549, -8398, -1472, 6940, 5944, -3353]
1596c353n614O181R762j91r512o045M982R139J601q216o479L778Q591J579p288
1611a085o161L510Q161J647p002o334K860Q341K388o356o259J885O818L097m684
1626H26n782J059N614K824l720m914M68N381K852l207n230lM915L687k852m666
1642b748o43L771L140j378l706j167K945K665p36l217j165K019K689J1k767k110
1658b397J708L059M79k441k338Q10K688J440k215k462N60K622J191j780k599Q
1674a667L003J935k001l216k85L110K436j629l457q64L247K994j773m134p93L488
1690C94L520j755m881j310M015M238j846n307j700M395M262j226n481k433M422
1705f93N116j321o049l031M790O256j026p135l483M863O657m09p180m085M600
$$ y = [-3353, -8967, -2786, 6976, 6785, -2727, -8772, -3790, 5349, 6950, -1266, -7745, -3967, 4624, 6203, -1085, -7246, -3736, 4425, 6072, -930, -7264, -4404, 3937, 6325, -31, -6290, -4405, 2413, 5510, 826, -4956, -3897, 1717, 4541, 821, -4093, -3625, 1756, 4608, 1401, -3829, -3832, 1083, 4770, 1918, -2748, -3391, 380, 3520, 2142, -1564, -2731, 214, 2879, 2143, -1074, -2239, -220, 2469, 2480, -287, -2397, -689, 2370, 2849, 408, -1930, -1120, 1568, 3008, 793, -1669, -1109, 1513, 2704, 924, -1675, -1667, 1336, 3271, 1270, -1946, -2231, 879, 3315, 1686, -1771, -2635, 612, 3606, 1833, -2301, -3094, 394, 3914, 2159, -2722, -4032, -17, 4221, 2375, -2932, -4632, -237, 4025, 2799, -2682, -5115, -693, 4423, 3102, -2947, -5978, -1188, 5068, 4042, -3093, -6576, -1713, 4944, 4535, -2645, -6730, -2130]
1720b130O990l81o979m271M618P082J70p333m957M250Q051R44p410n893L395Q402
1736D548J734p124o024L496P746J604o550n835K888P828J884o303o119J956P940
1751C669L174n633o981J232P110L527m686o247R97O207K974m149n331L98N871
1766B132L023l444n034r53N053M123k019n573j226L953L775j464l998j520L390
1781B18K622j181l256j026K436K637l92k837k036J426L203O62k399k393N79K490
1797G53J344j901j912N27J857Q37j414j694R7J819J381r52k172q50J867K414m42
1814A559k583j508J597K631j74k376j419J736K321m24k344j299J771K648P9k999
1830g84k306J805L641O47l574k616J672L920O56l810k437K101L884J85l750k702
$$ y = [-2130, 4860, 4479, -2500, -6771, -2153, 4929, 5099, -2234, -7191, -2941, 5110, 6054, -1356, -7249, -3854, 4548, 6282, -842, -6866, -3370, 4376, 5980, -570, -6405, -3517, 4311, 6195, -108, -6227, -4271, 3669, 6843, 1210, -5771, -4539, 2571, 6098, 1412, -4835, -3838, 2369, 5343, 1194, -4137, -3739, 2132, 5155, 1711, -3323, -4276, 777, 4900, 2881, -2692, -3918, 35, 3810, 2346, -1652, -3172, 218, 2840, 1659, -1597, -2623, -187, 2450, 2058, -779, -2815, -1389, 1814, 2476, 77, -2316, -1737, 753, 2097, 196, -1716, -1189, 668, 1505, 91, -1603, -1506, 313, 1694, 742, -1430, -2280, -413, 2001, 1559, -1024, -2532, -935, 1696, 1522, -854, -2273, -537, 1784, 1360, -984, -2283, -512, 2136, 2215, -784, -3090, -1285, 2356, 3003, -571, -3187, -1515, 2405, 3061, -749, -3186, -1085, 2799, 2984, -766, -3468]
1846c468J946M662P41m512l546K261N051R84m456m084K349N404J023m916m056
1861d617K276N696J320n047m674K227N988J835m782n154J625O221J945m370n423
1876d934J244O408K626m855n612J343O238K811m338n887Q03N819L254l605n689
1891d374j0N761L383l391n421l65N347L729k857n436n31M589L707k004n025j068
1907c966L902L487j243m318j180L163L168j013l508j449K345L276l00l392j788
1922b816J952K929M08k489k184J068K300J177j661j834L27J880N47r12j567k08
1938a083J676J334o04j683j036J154K312k54j678j405M69J907R50j617j555M77
1954f36J716K94r34j815K11K215R37j378k336J07K418J758j804k460k22K350J618
$$ y = [-3468, -1522, 3140, 3881, -631, -4177, -1916, 3135, 4119, -337, -4421, -2072, 3332, 4355, -561, -4617, -2341, 3355, 4675, -372, -5046, -2819, 3169, 5004, 222, -4932, -3307, 2914, 4859, 489, -4934, -3690, 2718, 5344, 489, -5123, -3780, 2458, 5269, 931, -4956, -4153, 1666, 4920, 1315, -4374, -4384, 1377, 4760, 1369, -4052, -4417, 930, 4659, 1802, -3634, -4165, 424, 4131, 2127, -2898, -3966, -64, 3423, 2180, -2138, -3318, -155, 3013, 2000, -1508, -2957, -612, 2664, 2364, -1028, -2816, -864, 2065, 2473, -16, -2200, -1132, 1168, 2345, 684, -1150, -823, 1057, 1604, 692, -875, -1083, 593, 1927, 1323, -360, -1396, -242, 2070, 1816, 138, -1267, -798, 1109, 2059, 442, -1113, -636, 1080, 1374, 440, -1375, -1164, 1051, 1988, 610, -1726, -1619, 799, 2557, 753, -1707, -1929, 421, 2039]
1971B039j166k812K72K650N06j464k173R4K778J478j847k654m26L034K400j913
1987G96l257l17L070K161j870l516L15L960J441k784l116K55L954K136k725l646
2003c143k1L763K762k184m283j36M098K441k172m201l53M621K864l068m334nM344
2020I93L324k668m789k53L830L300j683m748p60M144K871j493m295j308L765L685
2036C915j612m340j220L238L582j146m014j656K777L017j49l492j880K310L053
2051B383m07k709j607J244L009L20k635j628P20K388R14j636k079L52J950J067
2067A646r35k090j6J479J145l57j633p47J129J291J60j243j128J57J652R48j331
2084A27j211q9J362J584r69j960l95J675J505o21j871j103J924K030l55k174j394
$$ y = [2039, 873, -1939, -1667, 983, 1489, 25, -2148, -2054, 724, 2202, 355, -2299, -2725, 309, 2709, 796, -2461, -2778, 292, 2453, 583, -2933, -2618, 1342, 2783, -1, -3117, -2862, 1092, 3228, 503, -3143, -3164, 599, 3361, 1177, -3106, -3242, 856, 3297, 1125, -3076, -3429, 1192, 4056, 988, -3346, -3351, 993, 4317, 1649, -3140, -3393, 437, 3737, 2054, -2694, -3454, 690, 3561, 2068, -2227, -3535, 230, 3915, 2303, -2037, -3257, -19, 3563, 2417, -1597, -3253, -476, 2541, 2392, -1100, -2980, -670, 2383, 1976, -733, -2340, -1096, 1913, 2233, -402, -2030, -1310, 1078, 1992, 356, -1723, -1371, 579, 1646, 711, -1379, -1395, 84, 1229, 872, -761, -1508, -379, 912, 1072, -171, -1299, -1142, 510, 1458, 127, -1084, -1173, 189, 1773, 804, -1156, -1551, 124, 1629, 1008, -863, -1966, -42, 1988, 1633, -541, -1935]
2101a935J432K420N2k351j445J268K518m1k441j683J878K573j90k578j565J546
2117e42K718P4k494j692J309K646K09k405j740J646K343ok842j538K163K701m83
2134B067k908j576J874K685j17k892j349J751K386k72k828j053K105K397o89l053
2150a472j397K396K866m99l356j655K290K977j51l328j693K285K708l94l120j686
2166c229K380L048m67l468j506K091L020J61l159j949J646K797M63k340k183J259
2182a436K991L9k198j628R94K656L2j893k183J124K270J218j904j844J69J969
2198C76J179j396j307n09J766Q84p69j175k37P96J673j37j295r67N10J275R77
2215A644j296j032k47J239J229m98j682p07J422J290P7j573j553J364K036J00
$$ y = [-1935, -503, 1917, 1969, -382, -1827, -559, 1959, 1918, -523, -2206, -328, 2245, 2055, -523, -2088, -542, 2176, 2250, -244, -1936, -627, 2019, 2228, -177, -1917, -271, 2072, 2066, -776, -2314, -151, 2550, 2067, -841, -2417, -543, 2142, 2025, -867, -2216, -465, 1921, 1649, -1179, -2232, -127, 2270, 1581, -1472, -2869, -473, 2393, 1894, -1462, -3117, -827, 2150, 1999, -1329, -3022, -737, 1971, 1577, -1543, -3229, -849, 2199, 1732, -1736, -3242, -1151, 1869, 2030, -1129, -3078, -1432, 1365, 1828, -512, -2695, -1436, 1555, 1594, -604, -2232, -1238, 1418, 1450, -443, -2626, -1502, 768, 1986, 82, -1762, -1593, 376, 1555, 159, -1148, -1657, 109, 993, 224, -951, -1188, -392, 1281, 1144, -151, -1118, -608, 667, 1644, 348, -684, -931, 308, 1537, 1039, -643, -1350, 72, 1362, 1439, -134, -1687, -323, 1713, 1813]
2231A813k380j373J096K644M44k561j853J306K411P33k136k254R80K396J173j986
2247D53k422M78K751J471k122k561J63K970J561k169k661O16K505J359j713k609
2263a930L76K711J226j753k476L0K664J729j837k554R0K633J575j728k785N47
2279a482K738R79j885k336N81K596Q65j731k075L29K367J214j814k013J86K596
2295A115Q27j692k212P19K572P73k115j973P96K533O88k204j996Q63K269O85j525
2312A23j803M54J866J045j568j878L38K204J057j770k206M33K436R30j217k013
2328a569j63J896R60p60j382k14J224Q91l98j354n79R53J556k25j470j000Q25
2345h09J402M53r53j365J87R89Q47k24j391m35J019J173m4j606q43J219J549l5
$$ y = [1813, -567, -1940, -844, 1800, 2244, -317, -2170, -864, 1547, 2280, 144, -2110, -1130, 1266, 2439, 453, -1969, -1491, 1260, 2731, 609, -1952, -1789, 1181, 2742, 573, -2088, -1472, 1033, 2392, 679, -1930, -1554, 1157, 2383, 630, -1846, -1816, 848, 2577, 740, -1814, -1724, 909, 2484, 756, -2029, -1482, 1256, 2235, 350, -1986, -1405, 1191, 2056, 325, -1750, -1421, 946, 2160, 346, -1667, -1481, 1115, 1942, 250, -1962, -1243, 1329, 2102, -13, -1986, -1190, 1343, 2031, -173, -2169, -1306, 963, 1648, 123, -1680, -1226, 640, 1685, 117, -1761, -1423, 781, 1838, 68, -2138, -1705, 731, 1661, 444, -1569, -1732, 164, 1124, 364, -1018, -1232, -8, 883, 485, -869, -1448, -495, 1061, 836, -634, -1634, -809, 593, 1046, 93, -1272, -1085, -96, 751, 527, -864, -1299, -280, 893, 849, -757, -1600, -381, 1168, 1133]
2363A133j813j152R93K000O44j918j576M15K101J173j377k135P3K317J432j559
2379G51k508j70K937J726j723k913p6K695K084j286l060p35K841K252j219k809
2395a213j057K627K564r60l389q44K789K366j029l316r08K608K456q56k947r68
2411b077K067K491q44k633j218K160K332q04k582j095K172J966o49k385r63J914
2427a48K223r06k153j078J917J840m73k371o99J613J874n88k097n97J493J572
2443A422m28j941p72J615J455n74j919m53J463J485m28k058n42J462J386k09j841
2460h77n80J137J256k72j331n06R87J030r7j274p37P51J424m8j195r65O09J416
2478G28R2q32j087J36J026Q31m82j165k00Q83Q80j64j239n34R60Q80M5j105q64
$$ y = [1133, -680, -1832, -839, 1161, 1805, -113, -1689, -1274, 827, 2000, 623, -1512, -1439, 878, 2310, 751, -1757, -1927, 1010, 2736, 1013, -1900, -1976, 719, 2803, 1517, -1543, -2278, 563, 2815, 1596, -1213, -2270, 357, 2921, 1961, -1428, -2272, 517, 2883, 1854, -1462, -2370, 238, 2694, 1838, -1109, -2077, -10, 2481, 1637, -996, -2214, -54, 2278, 1474, -1108, -2203, -31, 1935, 1286, -1099, -2062, -148, 2075, 1169, -984, -2062, -145, 1695, 1222, -1149, -1848, -235, 1639, 1051, -1046, -1643, -150, 1422, 994, -947, -1719, -104, 1351, 777, -1142, -1595, -132, 1353, 925, -1133, -1675, -213, 1173, 964, -877, -1457, -320, 936, 664, -667, -1173, -186, 844, 747, -527, -1264, -513, 911, 863, -332, -1297, -688, 728, 820, -12, -1099, -963, 63, 894, 412, -753, -953, -70, 810, 646, -593, -1127, -167, 713, 758, -347, -1211]
2497a211O83J358M22j145j622K81J778Q13r60j763k07K069J201j115k025m94K259
2514C22J593j101k660k76K435J897q34k676j028K163K458o69k753j339K065K574
2530B171l84k977j245K134K726m55l100j579K175L065l09l069j831J838L073K1
2546B254k722k019J797K630M63k801k062J581K888N75k874k164J311L284L54k774
2562b79j675Q97K669N09k123j946J121K130P84k043j718P89K299M46j702j783
2578a625O96K065O36j715j449N68J895J99j411j184P76J780m4j347j166P41J365
2595G80L53j141j023L48J294K39r56q08N3J247M16r61q22K52J046L07n46j088
2613a010J37R42M48n40p52J4N91N81k55q98k13N85O55K03r45o14M42J287N9q98
$$ y = [-1211, -528, 830, 1252, 107, -1515, -1234, 544, 1357, 397, -1366, -1573, 496, 1697, 582, -1443, -1937, 322, 1915, 814, -1846, -2122, 313, 2210, 1376, -1300, -2328, -165, 2293, 1624, -1129, -2468, -403, 2171, 1787, -1190, -2435, -301, 2425, 1970, -1130, -2709, -534, 2531, 2222, -847, -2678, -840, 2233, 2254, -468, -2487, -690, 1940, 2403, -398, -2460, -879, 2009, 2584, -290, -2454, -1143, 2141, 2495, -279, -1954, -1057, 1612, 2121, -2, -1948, -827, 1303, 2087, 44, -1674, -885, 1414, 1860, 158, -1625, -929, 1136, 1772, 57, -1392, -824, 1071, 1270, -141, -1325, -549, 1231, 1187, -160, -1326, -585, 780, 1133, -8, -1031, -683, 611, 850, -106, -914, -861, 386, 802, -159, -981, -729, 317, 624, 78, -1010, -873, 69, 517, -23, -775, -761, -170, 411, 156, -742, -955, -370, 285, 488, -457, -1071, -629, 658, 717, -181]
2633a81r62K62J258N20q65j147J17J204R94p01j551k59J293J477p67j772m48J562
2651C4J670n00k195r16J543K058j34k307j248J654K022O9k459j628J721K477M9
2668A910k320k113J364L054N76k785j951J111K694N31j834k551J165K593R08k086
2684B66k547N46L488R19k588k488P31K937J191k149k100L13K485J592k134k324
2700a862K77K701J162j742k380J35K771J183j686k257LK289J596j653j856j01
2716a420J977J146j064j805K2J644J142j036j790j51J724J225j153j415j71J441
2732C16Q48m83j393j66J137M74j52j123k13R88O61n88p89l41P27J078m31j031
2750d81k76O17O57p8n91m47L57O98L9o56l60K11P43J62o21n99k8Q88M41n10q15
$$ y = [-181, -1143, -881, 377, 897, 32, -1115, -998, 206, 1200, 499, -1052, -1311, -18, 1459, 692, -1080, -1528, 34, 1704, 1204, -991, -1907, -364, 1694, 1560, -747, -1995, -341, 1681, 1750, -709, -2337, -616, 1861, 1910, -410, -2523, -1159, 1895, 2471, -314, -2265, -1154, 1540, 2071, 237, -2314, -1149, 1444, 2352, 266, -2281, -1735, 1753, 2672, 84, -2404, -1673, 1264, 2455, 306, -1794, -1481, 1004, 2596, 462, -1862, -1585, 1116, 2278, 536, -1844, -1709, 1062, 2245, 559, -1698, -1695, 594, 2190, 537, -1319, -1420, 557, 1703, 639, -1166, -1144, 500, 1642, 606, -1184, -1335, 389, 1614, 461, -954, -1125, 316, 1164, 681, -712, -878, 259, 733, 581, -542, -755, 233, 894, 306, -483, -824, -97, 981, 550, -481, -757, -140, 517, 439, -152, -599, -242, 456, 495, -161, -521, -310, 433, 595, -26, -625, -653, 235, 676, 166, -649]
2771f49l8O25P09j80j196m31J136Q53l15j296n06J170J027k47j285p73R26J473
2789A003M6j614r45N83J798M52j603j651J079J904N51j874j756R24K503N48k125
2806a77j895Q95K520O90j982k046O06K473J061j763k331M83K550J205j610k710
2822b031MK982J608j831k782J54K723J645j489k762m1K342J963j488k545o77K797
2839E72J802j250k464p67K369K023j100k542m85J945J905q70k216n91J875J538
2855A744n94j957p95J410J893o16j700j110J489J602l29j720n21Q72J332j08j367
2872d75n53Q99R69k16j058n22P18J004K39j240n22K61J099J30q83o08K43P37K43
2891D65n58n17N2R50l4l86l86J31K88N80j37p97j86M48O00j00p65j04L37O46r9
$$ y = [-649, -687, -62, 647, 467, -729, -1160, -24, 829, 514, -782, -1288, -118, 909, 662, -623, -1396, -470, 1003, 1049, -565, -1510, -927, 871, 1323, -280, -1931, -852, 1052, 1603, -271, -2027, -1103, 1400, 1948, -177, -2072, -1177, 1343, 2033, 51, -1995, -1389, 1084, 2145, 382, -1949, -1466, 1084, 2289, 679, -2031, -2027, 955, 2563, 732, -2050, -1896, 827, 2472, 983, -1779, -1820, 522, 2485, 997, -1548, -2225, 572, 2374, 1124, -1340, -2107, 262, 2285, 1185, -1357, -1842, 103, 2008, 1138, -1078, -1669, 206, 1744, 1150, -807, -1602, -192, 1701, 1085, -615, -1725, -236, 1366, 1037, -683, -1204, -332, 1000, 892, -475, -1028, -129, 840, 624, -434, -956, -238, 766, 1005, -235, -757, -496, 603, 733, -150, -758, -515, 222, 465, -93, -610, -558, 392, 358, -28, -414, -283, 5, 585, 448, -349, -535, -87, 513, 413, -352, -456, -119, 527, 428]
2912D28o86l24N52P35r7r15l95J80J165L15r23r52L13J171M18r26j075L81J272
2931F37M67j025j305L37J604M04r13j539J45J924Q04j054j910PJ906J163r54k251
2949a553J33J948J371j367k201j42K224J529j050k452k80J977J842r18k545m63
2965a947J953J970p93k787n08K029K113q17k586p63J939K126o28k563r48J927
2981b83J994l23k398r70J747J608J28k329j025J246K039j66j930j122J137J941
2997A294J97j857j119R47J757J10j462j259Q25J486L75j422q45M50J254N15j242
3014Dr39K95J061N96q25r02K10P42O00m67o99j71P52L74l64m87k47N58L83q1m89
3035i6m44L84N46j07k58l94J65L24L42n20l45OO11K98m86m57M3O40M19o18m21
$$ y = [428, -258, -582, -30, 705, 608, -307, -702, -522, 643, 958, 35, -917, -604, 567, 985, 59, -1016, -635, 637, 1104, 79, -1226, -889, 715, 1119, 206, -1333, -1188, 736, 1540, 486, -1424, -1417, 489, 1652, 698, -1553, -1420, 528, 1899, 532, -1669, -1811, 413, 1942, 892, -1560, -1840, 137, 1979, 1061, -1484, -1947, 6, 1976, 1183, -1604, -2112, -83, 2030, 1213, -1373, -2136, -197, 1929, 1301, -1262, -2210, -283, 1711, 1388, -1010, -1980, -233, 1375, 1503, -826, -1851, -605, 1434, 1268, -662, -1784, -647, 1294, 1491, -366, -1485, -538, 1219, 1329, -133, -1392, -567, 919, 1294, -128, -973, -523, 731, 1246, 4, -935, -640, 421, 1017, 192, -710, -500, 242, 842, 375, -324, -495, 257, 631, 267, -220, -467, 91, 474, 393, -96, -540, -156, 390, 283, 25, -369, -204, 120, 462, -58, -403, -397, 214, 512, 26, -431, -388, 252, 671, 53, -368]
3056c68k08O10N62m53o31l21P78P07m28p69k81R93O86n00j036k44R29J011m91
3075E46j024o22J099J088l91j543l77J444J011m49j607l99J291J302m68j818o02
3092a519J548J441l05j776j056J484J606k87j754j036J403J904l22k242q92J478
3108c25J857K0k130j381J548K070l1k138j334J158K218J17k011j437R65J958M46
3125A570j876j431O14K195N14j661j802Q10K228L76j660j380N83J629N64j290
3141a7j269K09J696N64q94j331J28J103Q91p46j368K31Q41R45o12j147K7O43J074
3160I68n84p85n31P28P41j62o45k32J69O99L04p30m18M10M8L80j06o74J57M00
3180A37K36P9p49p9K44P75n7q63n9L74N10m17q3l82J51R60k51o97j41N87L90K28
$$ y = [-368, -576, 34, 596, 143, -488, -809, -31, 676, 248, -521, -802, 191, 877, 377, -659, -903, 26, 1037, 546, -478, -1100, -1, 1087, 696, -847, -1224, 220, 1231, 782, -825, -1224, 67, 1369, 901, -917, -1519, 29, 1470, 1165, -611, -1667, -183, 1423, 1136, -618, -1654, -251, 1653, 1331, -911, -1803, -325, 1532, 1552, -578, -1959, -411, 1659, 1628, -510, -1844, -686, 1532, 1649, -362, -1799, -834, 1124, 1570, -306, -1737, -1123, 1072, 1586, -75, -1877, -1067, 1161, 1537, -123, -1503, -920, 709, 1273, -17, -1286, -1077, 619, 1183, 289, -1042, -914, 189, 1080, 334, -1034, -803, 38, 983, 371, -776, -749, -106, 968, 384, -401, -932, -204, 537, 375, -270, -502, -333, 366, 670, -60, -478, -68, -20, 360, 254, -420, -263, 137, 373, 452, -297, -376, -132, 643, 586, -277, -336, 38, 548, 131, 48, -334, -183, 777, 526, -171, -312, 275, 665, 893]
3202H93j219l79M16Q89L61j536l43J271L17M83o93q56K38N77N96j204k62M15N09
3221D73O31j451q7J78R45O9o31j219P12J504J80j566j085M33J869K05j421j068
3239a329O55J524K88j267j418P01J864M60j713j208N22J696M47j309j324M49J702
3256G40O50j491j521O11J800P54j419j610L32J865R39j458j615L12J775O74j062
3273B76j541L40J349Q06p55j425k57J401J032n27j593k94J055J361n26j399l29
3290a026J072J069m18j017l77P02P15o7p97n13M28Q38jq09l79O2Q25L04m21n95
3310d05OO47K45k76o36j05M90M73Q1m83m79J64N46K45o84m28O00K13M60n63q41
3331g30L27N21M06n47o52L11N34N59o39p01O5P53N43m14r22M4P46L89k34q41j34
$$ y = [893, -326, -705, -289, 600, 961, -575, -918, 353, 670, 1153, 460, -396, -158, 419, 1015, -189, -451, -36, 473, 1104, -347, -434, -256, 689, 758, 127, -1092, -380, 1124, 1304, -262, -1347, -914, 955, 1160, -261, -1329, -674, 850, 1138, -129, -1547, -846, 1018, 1478, -235, -1443, -921, 775, 1222, -87, -1411, -962, 740, 1390, -101, -1622, -1011, 789, 1543, 124, -1486, -1154, 711, 1650, 192, -1423, -1111, 664, 1338, 276, -1265, -925, 424, 1230, 475, -950, -1207, 194, 1226, 699, -894, -1188, -133, 1228, 702, -697, -1026, 46, 1115, 697, -320, -697, 5, 720, 653, -144, -657, -229, 609, 608, -201, -580, -518, 307, 611, 190, -405, -399, 248, 493, 217, -419, -524, -34, 439, 520, 37, -442, -278, 268, 513, -171, -599, 1, 214, 674, 111, -730, -403, 118, 524, -23, -675, -364, 170, 729, 90, -611, -546, 207, 750, 336, -586, -542, 204, 593, 359, -482, -616]
3352f16Q16M31l70r19j11J085O87p55r06k26J068Q21p20j038j85J203O12n01j137
3371g61r0J224O15o65j241L2J424N97j103r95N8J219R20p53j461L2J413N68n27
3390E06j491j88J468J097j047j266j21J459Q24o71j466j97J012J430n16j885n3
3407a105J080J404o99j534l80J251J134l85j474n11J289R91l79j214n67R59J108
3424I68l82q88o60N40J210q3q14o14J88J083L22r06p16K56Q31L26p17m38l0P65
3444B41L54l39o73J25L35N16k34p82k24P40M86J02r90q4K56R89j48j12j065l61
3464h68O90R34m05r84L35J90Q16n28o88l79J347M69p76n16l29N62Q05Rr08n86
3484h10N06R17J2j009k56M66P60J77j149n89P06J065q6r95o04N21R99J23j220
$$ y = [-616, 200, 631, 261, -658, -769, 316, 1003, 248, -658, -884, 184, 1005, 285, -753, -938, 265, 877, 376, -761, -851, 373, 988, 323, -918, -886, 538, 1135, 32, -963, -905, 314, 1234, 481, -980, -948, 465, 1033, 506, -985, -1173, 295, 1392, 345, -921, -1042, 417, 1241, 570, -896, -1093, -81, 1349, 833, -1052, -1105, -25, 1379, 680, -854, -1234, 17, 1151, 766, -708, -1219, 70, 1061, 682, -532, -1099, -140, 968, 586, -302, -962, -422, 788, 705, -109, -723, -535, 548, 870, -36, -752, -496, 335, 661, -56, -494, -524, 241, 595, 256, -417, -292, 43, 559, 325, -457, -681, 59, 545, 647, -343, -427, -171, 818, 670, 558, -507, -868, -178, 756, 351, -633, -298, -108, 708, 180, -508, -887, 460, 929, 153, -363, -692, -130, 675, 684, -224, -810, -304, 613, 625, -384, -640, -174, 586, 763, -386, -975, -269, 796, 710, -285, -889, -368, 631, 754, -466]
3503d66m22N72J012O7j187m48O28R52l3j049n74P47J003K1j361n16R14J029l51
3522E38r94n84O70J439l15j362m57P13J272n1j365o24R70J196k12j294n70R00
3540a30R69j7j413n20R49J203j40j292o41P45J224P8j244q40O43J162J95j031
3558a00o93K76J212J16r94o90N71Q61J66q49n78J61Q62P38r50p82K40P37K78n85
3578cn13j24O75N47l61o51j05N22M32n4o93l16L45O16L01p03m82Q1P02L22l31
3599B07p04l4L63P04l74o13k76O93O64k46q58l66O54Q47J82r60p25M52J046O5
3619G21r56n84K17J190L95j235o44N13R92J97r00q82M01J010N59r01r57J00J334
3638E70M11q64p58J82J041L19o73j030L27J022M21q15r87L74J003L09o83q99K05
$$ y = [-466, -888, -316, 696, 763, -424, -872, -244, 708, 675, -374, -948, -201, 802, 823, -538, -1054, -140, 889, 538, -456, -1040, -370, 1069, 754, -608, -1065, -352, 920, 869, -496, -1120, -150, 1046, 834, -460, -1030, -130, 839, 822, -591, -1111, -162, 1041, 901, -391, -1032, -287, 937, 1015, -229, -1069, -426, 736, 931, -100, -793, -517, 695, 811, -183, -873, -302, 559, 725, -124, -702, -541, 321, 1059, 109, -673, -433, 304, 582, -3, -516, -640, 35, 582, 221, -430, -535, -13, 419, 365, -328, -644, -299, 317, 618, -85, -567, -486, 216, 538, 207, -497, -531, -168, 536, 162, -451, -727, -34, 630, 384, -474, -840, -186, 661, 843, -117, -842, -390, 656, 721, -235, -819, -602, 588, 983, -252, -896, -383, 609, 806, -94, -976, -575, 435, 994, 93, -864, -764, 570, 981, 117, -641, -459, 582, 901, 228, -802, -475, 547, 968, 153, -834, -460, 543, 852, 169, -730, -525]
3657e25J023M79p48j127L44J285J83r52q21M28R97L52p79j123L39J199M86j054
3675a4q70K93J078K82q42p85K77J133K62j062p67M16J112L52q31r02M18R62M55
3694I67p76j115K10J192M47q41p46J75P59M80n41q16j49Q74P29o26p37KO89N50
3714G27l76p18k50N38M89l5o97l11L64O25K02o99m07K13N58J86m91k50O7O05N5
3735C95j77n80j59N77O41k34o42k99L15O06J16o07o51L40R72K61j047n44K64J021
3755E68J72p76o06K62O81N68p43q76k2J072P12p93j086P4J173N26o11j073m2J115
3775B95P23p84j188k71J563O27n66j189n9J049O98n41j317J00R94R46n38j217
3793f75k86J087Q42n63j078p5Q56Q36m16j329j18J104P37n30r97n1Q07P37m37
$$ y = [-525, 498, 977, 229, -898, -554, 731, 914, -38, -859, -431, 566, 918, 139, -984, -645, 554, 1040, -14, -884, -591, 487, 769, -73, -858, -581, 552, 814, -248, -1015, -599, 513, 865, 34, -868, -450, 512, 967, 191, -924, -714, 478, 925, 84, -662, -487, 272, 752, 211, -605, -754, 120, 849, 223, -514, -512, 177, 727, 351, -367, -617, -79, 410, 375, -322, -633, -269, 356, 558, -141, -548, -335, 223, 409, -82, -332, -265, 340, 395, 218, -362, -521, 56, 697, 463, -179, -478, -163, 443, 559, -48, -699, -359, 613, 874, -173, -717, -453, 568, 740, -36, -642, -380, 301, 869, 126, -750, -772, 300, 1012, 219, -867, -793, 380, 906, 295, -778, -820, 295, 1018, 234, -954, -1225, 338, 965, 399, -790, -849, 200, 898, 357, -960, -860, 134, 1080, 542, -675, -961, 126, 968, 405, -673, -748, 108, 944, 528, -801, -919, 185, 922, 392, -605, -656, 151, 888, 451]
3812D51j061J4O27P02k43j060j36P97Q02n10p95k47Q39P52n40r08J4O69O99m34
3832D32q78j1N51N99l20q69j62P75P37n27p98l3N99M50j79n69m84O42N75k40p29
3853d39k07M54O41k29m79n24M99O59M2o33l95L02M64J35m46j72L3M09J30m7o58
3874d61p0K58N17K50o73k80K51M96K95o56p03M60O92J48n59o27K44N86P25n34
3894C59j035j23R71N87l86j023p3Q62Q85m88j240j43Q46R93m50j070n01J222P40
3913I33k20j208l91P32J213l50j135n93Q37J257j35j298o64R34J082m1j429n28
3931a004J074Q46j31j059n75P28J062m6j262m84O01J033qj056n77P08Q99R2j124
3950b83p72P56J196k94r40l96L82J061p6r59m28L63J052j56p50l41M47O11Rp10
$$ y = [451, -610, -596, 31, 733, 490, -570, -706, 91, 893, 383, -412, -659, 180, 932, 392, -516, -502, 167, 866, 432, -446, -457, 94, 693, 373, -496, -658, 117, 854, 327, -471, -504, 95, 545, 366, -203, -687, -45, 530, 290, -439, -646, -192, 449, 220, -259, -783, -284, 375, 417, -216, -611, -309, 155, 290, -156, -328, -295, 114, 244, 197, -461, -531, -273, 244, 494, -179, -459, -208, 288, 583, -73, -776, -316, 376, 524, -35, -662, -418, 168, 893, 359, -676, -799, 172, 759, 373, -650, -723, 139, 1024, 536, -704, -847, -1, 992, 542, -528, -1029, 193, 933, 713, -495, -886, -154, 1059, 709, -426, -1019, -182, 1075, 940, -358, -1022, -88, 994, 953, -476, -1004, 70, 916, 785, -274, -849, -121, 941, 895, -367, -851, -250, 783, 775, -281, -858, -150, 749, 841, -283, -1055, -299, 897, 603, -337, -733, -351, 710, 634, -325, -753, -390, 662, 506, -244, -585, -138, 473, 482, -228]
3970b28n66M98Q73m4q78l76M32P29J3p94j86J93P63l0m33m36K04O22J48p72k38
3991e06L13L77K81m59l06O8N31J68k68m43m3L56L81j84o72Q1M77L46r2q29j08
4012e31N59M97n6o40j68K7N95K49m06p20K45P09J90n36o61K94N45J95q0p47k72
4033g12P29P89n10o49l84O89Q20k52j087l96Q21Q73j40r66n73P57R57j2j083p46
4053a075P51J063M2j088p75O24J395P0j237r25O87J380R8j198r87P56J125K99
4071A005q63j137J80J453M77j079q30K49J260K53q61j056K50J490K17r99j068
4088a059M19J105L64p87p12J13J001M43p47p57L2Q90M24n63p25L6R33L30p60p29
4108g49K98P09K44m64m30O3O50K15o98l60J63O49O3j47m80k17O06K50l99n03K14
$$ y = [-228, -794, -296, 577, 533, -345, -721, -289, 440, 453, -341, -527, -334, 429, 399, -34, -470, -266, 356, 504, -268, -506, -193, 184, 465, 6, -300, -232, 299, 467, 199, -244, -287, 69, 450, 266, -406, -325, 152, 498, 406, -423, -531, 28, 525, 469, -171, -339, -312, 283, 532, 126, -594, -349, 360, 550, 14, -647, -353, 192, 387, 307, -440, -712, 17, 806, 296, -353, -737, -48, 772, 520, -567, -963, -142, 731, 591, -375, -948, -191, 766, 754, -329, -1075, -324, 739, 781, -307, -1082, -458, 937, 1007, -230, -1155, -468, 912, 1010, -188, -1175, -419, 706, 1005, 142, -995, -815, 638, 1115, 36, -794, -545, 715, 968, 107, -949, -699, 791, 1008, 9, -1059, -640, 465, 829, 42, -670, -557, 444, 887, 140, -617, -585, 305, 729, 166, -559, -523, 410, 740, -20, -749, -451, 258, 502, 38, -392, -329, 321, 536, -162, -522, -359, 290, 353, 206, -274, -491, 115, 365, -34, -537, -323]
4129c23L47K14k42m74k5N93J63k26l25n2L23K18J23o68L6J74K35J41l28k55J32
4150b19L88K18l17m62K10J43M53m60k68m4M16L61q0p31j10N82L69j70o08k17M02
4171a44P56k79m56n05N59P63J7p69n24M39P75J18q35n58L10R65K26q19r26N41
4191c46J100K30j041q01K69J187N11r08r62J80J367K70r11r73J28J015P93r82
4209A26j188J41J378O17q78r30j41J154N79n93j011j04J087Q04p86r45p3P56P72
4228G65l85j099QQ00M55l07q26k77J024N29n20p85n9O81L79j62o92k47O34M01
4248C17Jp26m2M26N74k05p60p3M25M50j98l43k92L48L43j00l51N0J88L04l6m48
4270a48k18L41R4J3k21q5L51J10J03m45J9j35M30J11l05p6j16M05j30Jl18J60
$$ y = [-323, 24, 238, -4, -478, -503, 90, 253, 27, -298, -350, -27, 191, 314, -354, -318, -144, 91, 232, -96, -351, -219, 169, 387, 70, -392, -182, -39, 414, -46, -314, -358, 58, 419, 339, -392, -502, 80, 449, 279, -329, -546, -144, 612, 333, -123, -628, -69, 694, 711, -58, -582, -143, 632, 750, -85, -643, -333, 632, 858, 39, -887, -346, 754, 984, -57, -858, -589, 598, 1109, 201, -761, -581, 786, 1056, 145, -828, -700, 315, 1108, 126, -1062, -921, 457, 1074, 196, -734, -875, 279, 858, 265, -746, -850, 237, 1041, 255, -690, -763, -7, 765, 380, -719, -711, 89, 544, 237, -589, -866, 158, 687, 167, -618, -677, 4, 383, 221, -471, -718, -84, 317, 318, -408, -450, -24, 550, 345, -415, -488, -63, 387, 189, -154, -446, -98, 245, 145, -206, -156, 32, 336, 300, -148, -366, -25, 69, 82, -139, -224, 127, 237, 340, -105, -86, -221, 209, 320, 15, -61, -177, 228, 98, 99, -219, -59]
4292e9J48J20n3l18r2J41M62p8m41j01NM80K86o15k28K63L59P3m20l57P0O88J76
4315E09n28o42L33N68M59o16o13r5Q61N14p49o51O2R12M09n50q45pQ80O74n71
4336C14q81j56R21P14n50r99NP52Q85n14j196q6Q89P27k82j160j73P05R93m56
4356D52j094r8Q52Q86l68r77o50R13Q38k77q67l05P84O84j82q74n74N41Q96n4
4376E26r35l65N46P51n1p23l38L14P94o5o05l66L19O10j06k71m62K51L22K17m34
4397g1m98L02M00lq9l55M6L90n3q5l04k9K87J48j68k69P2K03J44k66J74k43K20
4420d7p9J5M4m8lK09O3J00m62M8K32J77k67L7j26J73J27j37k26j01L36M56k14
4443C07p54K88L15M34p23j15k11Q87K79k03p84j37N41O61o57l27K46j78O01l71
$$ y = [-59, 89, 209, 156, -162, -254, -113, 349, 271, -170, -271, -266, 214, 500, -115, -343, -80, 279, 352, -68, -425, -355, 333, 509, -19, -661, -328, 240, 699, 83, -530, -625, 236, 750, 1, -650, -588, 324, 733, 183, -662, -669, 211, 885, 314, -567, -723, 198, 912, 362, -637, -632, 120, 1005, 491, -705, -791, 98, 825, 543, -617, -790, -85, 908, 452, -642, -740, 112, 998, 630, -347, -997, -84, 754, 477, -390, -695, 89, 773, 591, -283, -857, -316, 580, 526, -409, -774, -228, 523, 472, -251, -589, -275, 519, 454, -151, -517, -198, 412, 306, 35, -427, -176, 146, 363, -71, -569, -267, 133, 130, 41, -314, -268, 122, 69, -16, -320, -349, -62, 86, -82, -351, -279, -76, 68, -198, -24, -267, -47, -126, -111, -67, -115, -118, 91, 154, 254, -208, -160, 72, 249, -18, 19, -107, 66, 193, 56, -170, -271, 65, 521, 307, -447, -159, 156, 590, -133, -248, -459, 428, 707, 504, -280, -417, 124, 785, 128, -199, 47, -131, 470, 99]
4463I9j13q95J033P14n28l55p05P36J164r34j007l51O28J486j57j417m35J071
4481C4N97k4j516M55K07J056k81p97m69L46J106k4j290o06P83N64M01j164k16
4500h38O78Q30j91l96r97Q68N41K15r20m41k98J190L58q42l41L16O19jJ08j208
4520g50L87N48N55p18o00J84P90j15k18m86M4M01K88qp38K72L32O5n4m69J27J97
4542C4L50l4l74o1K97P0q7L4m02L39P9L3l63l13O07K62k53o5qj63J90J46j58k03
4566d3j40K00j31K62o29j03O43J42n1q8l78J62J13K62j38j31j18L10N41o10m49
4587c74L80L06l04K6k64j63P25l0o72l6K8N68J92m83m62M65N09j31q4p64L65K95
4609I2P18n62p03j2R77K37r18o12N54K57O02o94n68K85P83K25r58n25L65R52O03
$$ y = [99, -14, -909, 124, 838, 310, -45, -750, -14, 1150, 216, -791, -1142, -514, 972, 815, -602, -1037, 34, 631, 607, -909, -454, -247, 809, 528, -269, -738, -392, 714, 690, -600, -1206, -423, 141, 542, -622, -838, -160, 670, 479, 83, -914, -46, 495, 710, -210, -651, -949, 241, 599, -243, -584, -268, 351, 350, 458, -750, -363, 185, 740, 22, -578, -394, 396, 281, 63, -423, -379, 22, 310, 302, -436, -164, 168, 233, 179, -290, -163, 34, 384, 350, -24, -85, 212, 282, 195, 229, -173, 166, 245, 278, -85, -398, 209, 471, 218, 153, 145, -18, 172, 318, 160, -43, -183, 17, -114, 148, -481, -584, 59, 201, 150, 62, -316, -154, -41, 221, 83, -48, -166, 144, 685, 75, -374, 6, 312, 8, 34, -230, -393, 332, 302, -370, -406, -378, 190, 382, -101, -563, -98, 411, 280, 196, -568, -203, 92, 810, 248, -455, -467, 510, 747, -171, -783, -229, 28, 630, -64, -632, -347, 436, 661, -297, -822, -457, 495, 1098]
4630A098j137m68P7P89K69o34p17L14O66O38q85o44K51R36M78j074m41k35R36
4649B17N09m90p98Q3Q06M14n39n75j48O73M98l71o40q0M12N27j95o66l3L16N03
4670D23r2n68j86L29O02l32k36l68J54N07L6k99k78R6L48J36j81m34J6L58J36
4691A67l6l74J2J67K62j2j74l04J46L23K23m75l15L72J04M4r5k09j74N96Q3k60
4713G1m18N2L95K43m2n61q3N29L50m86k97p7M35K18k53l87j15N57L53m16m29J48
4735b13K18N36k53n92r0O56L33m21o42Q8N69L88l51o45k1N88N52l72o85j35Q13
4756C21L86n10o21j76N90M70j14q04L9M52P81n09n54l61P15N87m45p92j00N54
4776i1O75k84p74l65Q01P73n47o20l15P51O35l34p36j56P66L82l38m27l71N90
$$ y = [1098, -39, -507, -430, 359, 628, -6, -723, -409, 257, 895, 10, -634, -383, 553, 1031, -43, -484, -719, 217, 726, 236, -562, -479, 327, 741, 202, -373, -521, 152, 650, 279, -361, -441, -29, 498, 303, -363, -396, -80, 423, 331, -237, -423, -94, 508, 176, -60, -428, -274, 233, 269, -30, -308, -212, 136, 272, 91, -343, -327, 31, 167, 131, -243, -231, -64, 198, 186, 12, -292, -146, 177, 400, -75, -390, -18, 86, 130, 35, -174, -348, 248, 331, 71, -347, -295, 100, 343, 301, -260, -343, 186, 536, 50, -247, -324, 111, 329, 76, -311, -426, 131, 484, 68, -361, -213, 5, 541, 288, -304, -394, 262, 595, 174, -468, -380, 189, 577, 226, -419, -440, 148, 700, 328, -357, -492, 321, 707, 197, -424, -600, -10, 460, 346, -458, -419, 33, 814, 305, -249, -610, 105, 692, 247, -545, -645, -91, 584, 300, -474, -839, -38, 735, 188, -432, -747, 4, 639, 305, -431, -587, 179, 561, 223, -204, -575, 15]
4796A5N74j20p11m24N86N33o1l79n13L90N24p6n44k91L44L20L17o13l19K13M14
4817A79Q9l27l70P9M29K98q5m30m35O31K29j9m96p3L29K74kn02j40J46M67k7j38
4840A06l31r5M81Q7p9l73j26L81J97o2n19J2M72K91j98o11N8M27K88r7o07m7L01
4863d4L31l2n33n7K40N32j01n51l96M26P37k07n39l21M43O20l01n46j79L03O50
4884D75p0o89l03N00P30j89p32k71L86O09N3o40m54N20N63j18n39m46M87P13j45
4905D40o66m26N73N86j39o37m41O66N84q5p19n82P75P11k03p55l88Q04L42L4p29
4926b55m49M59Q19P9r10l28M36O99P2q54l63K82O31K14n67n35K56N61J66l57o37
$$ y = [15, 589, 469, -242, -666, -80, 453, 392, 13, -500, -110, 414, 338, -206, -497, -153, 167, 484, -129, -448, -235, 179, 268, -59, -429, -350, 79, 377, 292, -138, -573, 58, 287, 268, -228, -301, 28, 302, 300, -202, -342, -196, 271, 244, 106, -225, -320, 161, 248, 169, -204, -330, 51, 248, 186, -333, -321, 151, 442, 244, -367, -309, 118, 406, 309, -298, -345, -44, 287, 255, -278, -335, -95, 437, 336, -215, -611, -185, 552, 345, -194, -515, -72, 548, 247, -299, -478, -175, 475, 405, -284, -587, -87, 643, 454, -278, -549, -163, 446, 499, -141, -595, -75, 488, 370, -169, -615, -128, 585, 440, -226, -652, -79, 507, 368, -269, -710, -44, 540, 455, -264, -846, -71, 640, 437, -318, -706, 98, 440, 474, -255, -704, -245, 574, 653, -257, -585, -149, 550, 622, -232, -595, -313, 318, 532, -35, -570, -314, 247, 413, 56, -581]
$$ [...]
8191F1
##END NTUPLES=NMR FID
##END=
