##TITLE=1H_AM BTMSPA
 CDCl3, 8 sc, 
 7.06.2021
##JCAMPDX= 6.0         $$ Bruker NMR JCAMP-DX V2.0
##DATA TYPE= NMR FID
##DATA CLASS= NTUPLES
##ORIGIN= UXNMR, Bruker Analytische Messtechnik GmbH
##OWNER= root
$$ XWIN-NMR		Version 3.5
$$ Mon Jun  7 10:20:41 2021 Russian Standard Time (UT+4h)  she@DPX200
##.OBSERVE FREQUENCY= 200.131506
##.OBSERVE NUCLEUS= ^1H
##.DELAY= (6, 6)
##.ACQUISITION MODE= SIMULTANEOUS
##.ACQUISITION SCHEME= undefined
##.AVERAGES= 8
##.DIGITISER RES= 18
##SPECTROMETER/DATA SYSTEM= spect
##.PULSE SEQUENCE= zg30
##.SOLVENT NAME= DMSO
##.SHIFT REFERENCE= (INTERNAL, DMSO, 0, 15.7039)
##AUDIT TRAIL= $$ (NUMBER, WHEN, WHO, WHERE, WHAT)
$$ ##TITLE= Audit trail, XWIN-NMR		Version 3.5
$$ ##JCAMPDX= 5.01
$$ ##ORIGIN= Bruker BioSpin GmbH
$$ ##OWNER= she
$$ F:/spectra/data/she/nmr/H-F/1/audita.txt
$$ ##AUDIT TRAIL=  $$ (NUMBER, WHEN, WHO, WHERE, WHAT)
(   1,<2021-06-07 10:19:24.39 +0400>,<she>,<DPX200>,
      <created by zg, POWCHK disabled, PULCHK disabled
       configuration hash MD5:
       00 E9 B6 7A A2 85 ED C7 34 08 36 98 17 FE 4E 26
       data hash MD5: 16K
       69 53 8D 55 0E 4D CE A9 9E C4 CD 7B BD 69 00 04>)
$$ ##END=
$$ 
$$ hash MD5
$$ E0 36 9A 6D 48 C0 47 6A CB E2 B8 64 8F AD 02 40
##$RELAX= 
##$RELAX= 
##$RELAX= 
##$RELAX= 
##$RELAX= 
##$RELAX= 
$$ Bruker specific parameters
$$ --------------------------
##$DU= <F:/spectra>
##$EXPNO= 1
##$NAME= <H-F>
##$PROCNO= 1
##$TYPE= <nmr>
##$USER= <she>
##$AMP= (0..31)
100 100 100 100 100 100 100 100 100 100 100 100 100 100 100 100 100 100 
100 100 100 100 100 100 100 100 100 100 100 100 100 100 
##$AQSEQ= 0
##$AQ_mod= 1
##$AUNM= <au_zg>
##$AUTOPOS= <>
##$BF1= 200.13
##$BF2= 200.13
##$BF3= 200.13
##$BF4= 200.13
##$BF5= 200.13
##$BF6= 200.13
##$BF7= 200.13
##$BF8= 200.13
##$BYTORDA= 1
##$CFDGTYP= 0
##$CFRGTYP= 5
##$CHEMSTR= <none>
##$CNST= (0..31)
1 1 145 1 1 1 1 1 1 1 1 1 1 1 1 1 1 1 1 1 1 1 1 1 1 1 1 1 1 1 1 1 
##$CPDPRG= <>
##$CPDPRG1= <>
##$CPDPRG2= <>
##$CPDPRG3= <>
##$CPDPRG4= <mlev>
##$CPDPRG5= <mlev>
##$CPDPRG6= <mlev>
##$CPDPRG7= <mlev>
##$CPDPRG8= <mlev>
##$CPDPRGB= <>
##$CPDPRGT= <>
##$D= (0..31)
0 1.2 0 0 0 0 0 0 0 0.06 0 0.03 0 0 0 0 0.0002 0 0 0 0 0 0 0 0 0 0 0 0 
0 0 0 
##$DATE= 1623046763
##$DBL= (0..7)
120 120 120 120 120 120 120 120 
##$DBP= (0..7)
150 150 150 150 150 150 150 150 
##$DBP07= 0
##$DBPNAM0= <>
##$DBPNAM1= <>
##$DBPNAM2= <>
##$DBPNAM3= <>
##$DBPNAM4= <>
##$DBPNAM5= <>
##$DBPNAM6= <>
##$DBPNAM7= <>
##$DBPOAL= (0..7)
0.5 0.5 0.5 0.5 0.5 0.5 0.5 0.5 
##$DBPOFFS= (0..7)
0 0 0 0 0 0 0 0 
##$DE= 6
##$DECBNUC= <off>
##$DECIM= 32
##$DECNUC= <off>
##$DECSTAT= 4
##$DIGMOD= 1
##$DIGTYP= 9
##$DL= (0..7)
0 120 120 120 120 120 120 120 
##$DP= (0..7)
150 150 150 150 150 150 150 150 
##$DP07= 0
##$DPNAME0= <>
##$DPNAME1= <>
##$DPNAME2= <>
##$DPNAME3= <>
##$DPNAME4= <>
##$DPNAME5= <>
##$DPNAME6= <>
##$DPNAME7= <>
##$DPOAL= (0..7)
0.5 0.5 0.5 0.5 0.5 0.5 0.5 0.5 
##$DPOFFS= (0..7)
0 0 0 0 0 0 0 0 
##$DQDMODE= 0
##$DR= 18
##$DS= 0
##$DSLIST= <SSSSSSSSSSSSSSS>
$$ [...]
##$SUBNAM2= <"">
##$SUBNAM3= <"">
##$SUBNAM4= <"">
##$SUBNAM5= <"">
##$SUBNAM6= <"">
##$SUBNAM7= <"">
##$SUBNAM8= <"">
##$SUBNAM9= <"">
##$SW= 20.0188882624521
##$SWIBOX= (0..15)
0 0 2 0 0 0 0 0 0 0 0 0 0 0 0 0 
##$SW_h= 4006.41025641026
##$TD= 16384
##$TD0= 1
##$TE= 0
##$TE2= 300
##$TE3= 300
##$TEG= 300
##$TL= (0..7)
0 120 120 120 120 120 120 120 
##$TP= (0..7)
150 150 150 150 150 150 150 150 
##$TP07= 0
##$TPNAME0= <>
##$TPNAME1= <>
##$TPNAME2= <>
##$TPNAME3= <>
##$TPNAME4= <>
##$TPNAME5= <>
##$TPNAME6= <>
##$TPNAME7= <>
##$TPOAL= (0..7)
0.5 0.5 0.5 0.5 0.5 0.5 0.5 0.5 
##$TPOFFS= (0..7)
0 0 0 0 0 0 0 0 
##$TUNHIN= 0
##$TUNHOUT= 0
##$TUNXOUT= 0
##$USERA1= <user>
##$USERA2= <user>
##$USERA3= <user>
##$USERA4= <user>
##$USERA5= <user>
##$V9= 5
##$VALIST= <valist>
##$VCLIST= <CCCCCCCCCCCCCCC>
##$VD= 0
##$VDLIST= <DDDDDDDDDDDDDDD>
##$VPLIST= <PPPPPPPPPPPPPPP>
##$VTLIST= <TTTTTTTTTTTTTTT>
##$WBST= 1024
##$WBSW= 4
##$XGAIN= (0..3)
0 0 0 0 
##$XL= 0
##$YL= 0
##$YMAX_a= 337557
##$YMIN_a= -371458
##$ZGOPTNS= <>
##$ZL1= 120
##$ZL2= 120
##$ZL3= 120
##$ZL4= 120
##$ABSF1= 10
##$ABSF2= 0
##$ABSG= 5
##$ABSL= 3
##$ALPHA= 0
##$AQORDER= 0
##$ASSFAC= 0
##$ASSFACI= 0
##$ASSFACX= 0
##$ASSWID= 0
##$AUNMP= <proc_1d>
##$AZFE= 0.1
##$AZFW= 0.1
##$BCFW= 1
##$BC_mod= 2
##$BYTORDP= 1
##$COROFFS= 0
##$CY= 11.3945322036743
##$DATMOD= 1
##$DC= 2
##$DFILT= <>
##$DTYPP= 0
##$F1P= 15.9154993809931
##$F2P= -4.1035820241983
##$FCOR= 0.5
##$FTSIZE= 0
##$FT_mod= 4
##$GAMMA= 1
##$GB= 0.15
##$INTBC= 1
##$INTSCL= 1
##$ISEN= 128
##$LB= 0.24
##$LEV0= 0
##$LPBIN= 0
##$MAXI= 10000
##$MC2= 0
##$MEAN= 0
##$ME_mod= 0
##$MI= 1.114404
##$NCOEF= 0
##$NC_proc= 0
##$NLEV= 6
##$NOISF1= 3.799351
##$NOISF2= 2.8
##$NSP= 1
##$NTH_PI= 0
##$NZP= 0
##$OFFSET= 15.70392
##$PC= 1
##$PHC0= -11283.82
##$PHC1= 15.60101
##$PH_mod= 1
##$PKNL= yes
##$PPARMOD= 0
##$PSCAL= 0
##$PSIGN= 0
##$REVERSE= no
##$SF= 200.130013532006
##$SI= 16384
##$SIGF1= 3
##$SIGF2= 2
##$SINO= 400
##$SIOLD= 16384
##$SREGLST= <1H.CDCl3>
##$SSB= 0
##$STSI= 0
##$STSR= 0
##$SW_p= 3612.71676300578
##$SYMM= 0
##$S_DEV= 0
##$TDeff= 0
##$TDoff= 0
##$TI= <>
##$TILT= no
##$TM1= 0
##$TM2= 0
##$TOPLEV= 0
##$USERP1= <user>
##$USERP2= <user>
##$USERP3= <user>
##$USERP4= <user>
##$USERP5= <user>
##$WDW= 1
##$XDIM= 8192
##$YMAX_p= 0
##$YMIN_p= 0
$$ End of Bruker specific parameters
$$ ---------------------------------
##NTUPLES= NMR FID
##VAR_NAME=  TIME,          FID/REAL,        FID/IMAG
##SYMBOL=    X,             R,               I
##VAR_TYPE=  INDEPENDENT,   DEPENDENT,       DEPENDENT
##VAR_FORM=  AFFN,          ASDF,            ASDF
##VAR_DIM=   8192,          8192,            8192
##UNITS=     SECONDS,       ARBITRARY UNITS, ARBITRARY UNITS
##FACTOR=    0.0002496,     1,               1
##FIRST=     0,             0,               0
##LAST=      2.0444736,     0,               0
##MIN=       0,             -371458,         0
##MAX=       2.0444736,     337557,          0
$$ Real data points
##PAGE= N=1
##DATA TABLE= (X++(R..R)), XYDATA
0 0 0 0 0 0 0 0 0 0 0 0 0 0 2 -8 8 -8 8 -8 16 -16 16 -24 24 -32 32 -40 48 -56 62 -72 80 -92 104 -117 132
35 132 -148 165 -184 205 -229 255 -281 313 -345 380 -419 464 -511 561 -620 682 -752 828 -916
54 -916 1013 -1126 1254 -1403 1580 -1790 2049 -2374 2794 -3363 4172 -5414 7523 -11782 23551
69 23551 -120163 -371458 57241 230224 77546 -60222 -188401 -75040 196142 143379
79 143379 -79415 -185417 -65872 171875 146482 -73319 -143640 -115655 109495 289912 -80236
90 -80236 -346580 33394 248120 55606 -80414 -154924 -61718 182772 131198 -103095 -154352
101 -154352 -34102 140814 130528 -72689 -140824 -66145 94496 221969 -44368 -300404
111 -300404 795 246657 59377 -99455 -130429 -45449 163376 125994 -109104 -140355 -8337
122 -8337 118560 113860 -59675 -138854 -42891 93550 171282 -24306 -251622 -28175 228651
133 228651 73867 -107204 -117122 -32642 139839 121334 -100444 -135399 3977 104075 97279
144 97279 -46066 -134960 -34813 96087 132339 -18212 -203342 -49460 197929 92482
154 92482 -105886 -118540 -22068 124357 115462 -90077 -139387 8349 105063 83977 -43508
165 -43508 -133000 -32128 106615 110541 -29586 -171533 -53499 174350 106385 -105428 -128975
176 -128975 -9654 121959 106736 -84952 -144110 11329 114768 73087 -50065 -127798 -26455
187 -26455 115692 95863 -46448 -146053 -42146 151468 106483 -99137 -131994 3044 121017
198 121017 90421 -80681 -136328 15292 119838 59817 -58859 -112438 -15081 114248 81033
209 81033 -59049 -122615 -22852 128805 94583 -87852 -127206 11451 119786 72479 -77364
220 -77364 -121888 15517 118973 52877 -67150 -100718 -4177 108570 70938 -66271 -110435
231 -110435 -5875 114398 77770 -77682 -117876 12153 115914 59880 -75402 -107255 13350
242 13350 110832 49846 -70123 -92567 4151 98197 59695 -63999 -99368 1841 100966
253 100966 61731 -66426 -103021 6789 104915 53688 -70218 -94497 10604 97649 48561
264 48561 -65257 -87966 7106 90191 51829 -58336 -92191 2358 94923 53854 -62009
275 -62009 -92874 3930 97583 53263 -67355 -90209 10406 92523 49738 -62080 -89890
286 -89890 8560 92819 48924 -59403 -89581 4426 96475 51242 -64325 -87715 6924 94042
298 94042 52944 -65588 -89483 12435 92315 48078 -61146 -89033 10521 95123 44965
309 44965 -62216 -84216 8092 94309 47541 -66372 -82713 12645 89917 47216 -64601
320 -64601 -85675 16311 90986 41112 -62034 -83453 13322 93991 39795 -66398 -79043
331 -79043 14073 91413 41476 -69623 -79210 20151 87799 37761 -65891 -80350 20275 89742
343 89742 33335 -65512 -77012 17600 90787 33714 -69996 -73554 21083 86123 32814 -68854
355 -68854 -72841 24294 82918 28580 -64069 -70973 21778 83417 26841 -64265 -66639 20769 80708
368 80708 27588 -64690 -64762 23257 76898 25669 -61276 -63761 22835 76135 23750 -59623 -61204
381 -61204 21299 75139 24191 -59823 -59598 22088 72768 24167 -58031 -59861 22396 72615 22444
394 22444 -56409 -57921 19864 72275 24354 -57518 -57752 20774 70696 25204 -56685 -59568 22700
407 22700 70794 21576 -53959 -57025 19240 70518 22190 -53899 -54352 16040 67805 27717 -54927
420 -54927 -58618 19709 67633 25390 -53347 -60673 21539 70525 18089 -52542 -52940 16057 67607
433 67607 22689 -54459 -52314 16348 63561 27899 -53914 -60365 21524 67872 22094 -53542
445 -53542 -60971 22652 74304 13693 -57921 -48082 19386 65968 20945 -58395 -50620 23129 61240
458 61240 23204 -53065 -59631 24814 69892 16683 -55214 -57357 25275 76639 8816 -63708
470 -63708 -39804 25802 59416 17074 -57270 -46377 29246 56081 15452 -47479 -53564 24315
482 24315 67593 11717 -53531 -49375 24885 72685 6493 -65292 -31955 31339 49917 12338
494 12338 -51466 -42295 31955 51487 6993 -41485 -45070 20631 63271 9908 -52355 -43085 24026
507 24026 67429 6742 -66121 -29345 36535 43116 6816 -45330 -40253 30751 49690 932
519 932 -37842 -37653 14488 57888 12408 -50751 -40567 21455 61162 10077 -63164 -31785 37850
532 37850 39585 2855 -38250 -38642 25170 49253 -509 -35997 -31252 9214 51531 17275 -47779
545 -47779 -40927 19855 56874 13593 -58999 -36626 38507 42370 -890 -36440 -35910 22336 51136
558 51136 -344 -39103 -26744 10329 47212 20225 -46565 -43493 22192 57299 13416 -57460
570 -57460 -40087 39935 48576 -5058 -39840 -31626 22744 51830 19 -43658 -23882 15270
582 15270 43088 18538 -44362 -43241 24333 55946 10155 -54314 -39355 38663 51041 -8263
594 -8263 -42957 -25672 24215 47839 -1437 -45031 -20493 20200 37111 13045 -40191 -39527 24229
607 24229 52189 6072 -50959 -36333 36198 51014 -10388 -46462 -20475 27407 42398 -4296
619 -4296 -44609 -17777 24189 32598 6539 -36414 -34455 23191 48125 2835 -47403 -31871 32718
632 32718 48352 -9644 -46781 -17390 29087 36806 -5671 -40327 -16104 24286 29459 2796
644 2796 -31553 -28741 19446 42661 3347 -41429 -28360 27315 44241 -5376 -43820 -17323
656 -17323 28493 33483 -5394 -35406 -15724 22163 28822 1908 -28932 -24958 16772 39026 5253
669 5253 -38004 -27621 24377 42615 -1971 -42327 -19963 28685 34592 -5874 -34658 -16214
681 -16214 21158 30769 1441 -31150 -23120 17787 36778 5301 -36787 -27945 23590 41676 -987
694 -987 -41213 -22250 27762 36628 -6498 -36163 -15939 21126 31248 832 -33763 -21653 20339
707 20339 33685 2964 -34695 -27016 23051 40551 -2618 -40274 -21182 27009 36946 -7543
719 -7543 -38332 -13689 23441 29452 -1226 -34890 -19938 24382 31681 -2080 -33284 -23396 23899
732 23899 39200 -5862 -39990 -16927 27374 35050 -8315 -39386 -11307 26948 27034 -4091 -33705
745 -33705 -17432 27253 29930 -7130 -30670 -17614 22613 35654 -6965 -37516 -12498 25758
757 25758 30433 -6777 -36545 -10600 27400 23869 -5812 -29403 -15486 25239 27981 -8905 -27849
770 -27849 -13232 19537 31251 -5578 -34800 -10528 23766 25745 -5052 -32777 -11851 26113
782 26113 22833 -7050 -26589 -14680 22223 27932 -8946 -28226 -10908 18119 28099 -4138 -33359
795 -33359 -10891 22957 23409 -3954 -29925 -14328 24286 24247 -7327 -25996 -14343 19621 28432
808 28432 -7285 -29412 -10427 17922 25805 -2526 -31866 -12507 22576 22819 -3680 -27519 -15772
821 -15772 22285 26156 -7184 -26492 -13220 18455 28469 -5399 -30988 -10361 20358 24805
833 24805 -3149 -30919 -12689 24187 23542 -6011 -26865 -13997 22150 27408 -8089 -28611 -10765
846 -10765 20596 27432 -6212 -32448 -9376 24507 23527 -7088 -29922 -10621 25455 23151 -9518
859 -9518 -26822 -10297 22198 25570 -9262 -29404 -7993 22216 23963 -7888 -30828 -8094 25413
872 25413 21139 -10140 -27484 -7794 24128 21072 -11331 -25813 -6503 21108 21329 -9524 -27442
885 -27442 -6220 22162 20182 -9247 -27689 -6761 24301 19362 -12065 -25613 -4875 22445
897 22445 18562 -11695 -24822 -3982 20735 17745 -9447 -25013 -5737 21786 18399 -10327 -25036
910 -25036 -5515 22302 18423 -11724 -24303 -3374 20770 16843 -9974 -23438 -3962 20272
922 20272 16141 -8583 -22195 -6207 19957 18411 -9476 -23064 -5085 19798 18398 -9430 -23777
935 -23777 -3716 20038 16275 -8318 -22642 -5097 20454 16295 -8867 -21045 -6348 19172
947 19172 19269 -9640 -23649 -4177 19674 18035 -9052 -24830 -3760 21596 15741 -9328 -22811
960 -22811 -5508 21917 17099 -11471 -22009 -4654 19754 19086 -11261 -25238 -2197 20874 16228
973 16228 -9920 -25070 -3419 23182 14657 -11531 -22200 -4731 22135 17146 -13850 -22504 -1764
986 -1764 19746 16918 -11848 -25083 -373 21798 13346 -11023 -23293 -2572 23638 13287 -13802
999 -13802 -20184 -2544 20993 16389 -14876 -22637 1587 20247 13800 -12343 -23753 1429 22913
1012 22913 10628 -12630 -20317 -864 22993 12150 -15112 -18142 185 19316 15113 -14198
1024 -14198 -22492 3520 20757 10715 -12210 -21102 1804 22377 9079 -13170 -17173 -89
1036 -89 20290 11563 -14394 -16752 1219 16700 13568 -11670 -21736 2700 20441 8997 -11653
1049 -11653 -18633 611 20763 9150 -13368 -15891 380 17952 11174 -13197 -16791 1477 15623
1062 15623 12303 -10117 -21739 1142 21311 9023 -12859 -18002 573 20466 9775 -14555
1074 -14555 -16508 1737 17646 10608 -12941 -17623 1785 16486 11575 -10063 -21656 254 22486
1087 22486 9794 -14435 -18006 1477 20439 10208 -15132 -17218 3064 18187 9789 -12797
1099 -12797 -17679 2273 17589 10598 -10606 -20506 417 22793 10203 -15678 -18079 3276 20943
1112 20943 9539 -16019 -17445 5296 19199 7822 -13934 -16640 3946 18482 8764 -12329
1124 -12329 -18760 2050 22384 9379 -17088 -17838 5609 21142 7466 -17193 -16691 7215 19466
1137 19466 5220 -14971 -14915 5215 17951 6818 -13409 -16663 3394 20353 7988 -16468 -16953
1150 -16953 6292 20135 5610 -16791 -15146 7421 18214 3715 -14820 -13060 5483 16068
1162 16068 5520 -12866 -14874 3800 18034 6856 -14680 -15964 5709 19465 4850 -16285
1174 -16285 -13759 7322 17282 3513 -14587 -12125 6020 15256 4950 -12367 -14059 4314 17268
1187 17268 6099 -13606 -15180 4968 19256 5318 -16288 -13389 7216 16917 3958 -14197
1199 -14197 -12452 6213 15440 4847 -11976 -13877 4189 17171 5960 -12942 -14655 3932 19142
1212 19142 6491 -16227 -13808 7455 16945 4419 -14104 -13247 6581 16202 4208 -12562 -13569
1225 -13569 4601 17680 5386 -13980 -14187 4564 18996 6269 -17283 -14346 8782 17362 3186
1238 3186 -15126 -13565 7696 17403 2596 -14419 -12870 5998 17852 3885 -15553 -13149 6174
1251 6174 18225 5045 -17684 -14126 9963 17388 1578 -15488 -12728 8414 17613 1172 -15317
1264 -15317 -11205 7126 16847 2754 -15727 -11601 7509 16652 3658 -16517 -12950 10314 16845
1277 16845 285 -14965 -10987 8630 16929 368 -15448 -9369 7997 15570 1820 -15439 -10186
1290 -10186 8771 15287 1951 -15285 -11409 10287 16110 -688 -14508 -9359 8579 16019 -31
1303 -31 -15348 -8343 8681 14400 1131 -14747 -9491 9146 14218 948 -13917 -10411 9046
1316 9046 15413 -412 -13996 -8850 7735 14999 759 -14855 -8619 8385 13672 1181 -13920
1329 -13920 -9829 8548 14181 565 -13640 -9963 8053 15027 44 -14314 -9007 7786 14525
1342 14525 889 -14940 -9385 8882 14213 479 -14503 -9815 9145 14803 -411 -14531 -9200
1355 -9200 8785 14920 -175 -15015 -8852 9029 14666 298 -15229 -9448 9799 15036 -486
1368 -486 -15230 -8996 9941 15073 -1000 -15295 -8203 9888 14458 -774 -14975 -8393 9971
1381 9971 14504 -772 -14901 -8563 10140 15002 -1423 -15577 -7633 10759 14278 -1828 -15451
1394 -15451 -7063 11102 13398 -2303 -14622 -6973 10580 13638 -2375 -14715 -6915 10474 14059
1407 14059 -2543 -15857 -6064 11654 12827 -3161 -15027 -5960 11774 12197 -4012 -13809 -5572
1420 -5572 10306 12335 -3243 -14066 -5590 9960 12516 -2696 -15229 -5468 11462 11252 -3462
1433 -3462 -13643 -5671 10977 11489 -4326 -12868 -4559 9241 11291 -2878 -13284 -4925 9297
1446 9297 11388 -2115 -14194 -5569 11276 10799 -3690 -12711 -5400 10460 11598 -4500 -12765 -3661
1460 -3661 9208 10857 -2657 -13172 -4532 9904 10853 -2246 -13702 -5596 11639 11036 -4296
1473 -4296 -12383 -4833 10230 11988 -4450 -13405 -3239 9667 10564 -2639 -13464 -4619 10569
1486 10569 10599 -2718 -13336 -5720 11641 11544 -4944 -12779 -4279 10149 12003 -4525 -14186 -2892
1500 -2892 10530 9853 -3294 -13538 -4371 11328 10195 -4107 -13104 -4993 11786 11400 -6164 -13356
1514 -13356 -2717 10684 10786 -5155 -14471 -2016 11772 8751 -4894 -13142 -3340 12072 9435
1527 9435 -5875 -12601 -3297 11683 10462 -6932 -13328 -1079 10948 9110 -5468 -13607 -1518
1540 -1518 12078 7894 -5820 -11944 -2294 11616 8653 -6375 -11573 -1917 10787 9391 -6424
1553 -6424 -12502 -324 10764 7651 -5182 -12105 -1240 11625 7330 -6021 -10805 -1531 10951
1566 10951 8081 -6376 -10947 -847 10265 8265 -6196 -11849 182 10606 6563 -5375 -10966
1579 -10966 -1274 11011 7176 -6160 -10409 -1107 10282 7719 -6283 -10844 -575 9909 7532
1592 7532 -5773 -11496 -330 10442 6340 -5321 -10323 -1709 10232 7480 -5880 -10556 -1202
1605 -1202 9919 7700 -5785 -11137 -860 10055 7291 -5657 -11323 -560 10616 6434 -5863
1618 -5863 -10239 -1257 10004 7439 -6101 -10982 -702 10279 7263 -6244 -11313 -321 10892
1631 10892 6784 -6720 -11027 305 11014 6054 -6787 -10097 -46 10377 6786 -6564 -10749
1644 -10749 194 10813 6561 -6744 -10791 482 11284 6253 -7469 -10339 1248 10905 5425
1657 5425 -7122 -9588 933 10263 5656 -6704 -9944 796 10541 5675 -7077 -9990 1034
1670 1034 10895 5456 -7905 -9689 2260 10367 4209 -7271 -8847 1774 9881 4224 -6990 -8791
1684 -8791 1457 9955 4644 -7416 -9069 1708 10236 4472 -8082 -8948 2949 9788 3137 -7194
1698 -7194 -8066 2063 9486 3441 -7086 -7753 1623 9092 4166 -6969 -8420 1683 9416 4193
1712 4193 -7465 -8576 2679 9387 2840 -6713 -7601 1689 9010 3434 -6772 -7291 1585 8391 4256
1727 4256 -6394 -8241 1663 9235 4170 -7019 -8486 2590 9612 2825 -6776 -7159 1889 9115
1741 9115 3509 -7074 -7061 2189 8473 3974 -6506 -8135 2122 9520 3703 -7221 -8320 2781
1755 2781 9790 2679 -7383 -7081 2367 9165 3265 -7570 -7218 2783 8479 3343 -6678 -8034
1769 -8034 2331 9509 3163 -7467 -7973 2815 9803 2500 -7847 -6992 2882 8993 2757 -7783
1783 -7783 -7006 3385 8466 2377 -6932 -7314 2824 9220 2374 -7752 -7164 3367 9314 1898 -8164
1798 -8164 -6420 3756 8559 1706 -7762 -6325 3994 8184 1330 -7106 -6289 3342 8618 1542 -7625
1813 -7625 -6117 3728 8431 1388 -7672 -5807 3986 7977 1102 -7206 -5583 3849 7738 1087 -6689
1828 -6689 -5397 3393 7830 1442 -6945 -5501 3580 7705 1251 -6836 -5390 3665 7652 1000 -6798
1843 -6798 -5066 3620 7288 1018 -6477 -5072 3442 7267 1130 -6579 -5211 3532 7266 889 -6573
1858 -6573 -5177 3405 7333 955 -6859 -4953 3583 7003 916 -6626 -5076 3584 6985 848 -6452
1873 -6452 -5108 3357 7177 854 -6511 -5003 3158 7272 1064 -6885 -5065 3641 7001 864 -6693
1888 -6693 -5128 3730 7198 559 -6538 -4995 3553 7252 462 -6775 -4528 3471 7009 891 -7027
1903 -7027 -4890 4222 6989 330 -6810 -4765 4270 7127 -198 -6812 -4191 4147 7034 -111 -6975
1918 -6975 -3722 4164 6450 442 -6850 -4363 4672 6780 -338 -6645 -4081 4575 6917 -674 -6717
1933 -6717 -3385 4217 6559 -448 -6795 -3051 4340 5639 52 -6291 -4011 4584 6325 -769 -6210
1948 -6210 -3419 4213 6350 -967 -6560 -2827 4151 5724 -813 -6621 -2680 4384 4842 -551 -5554
1963 -5554 -3605 4326 5879 -1147 -5949 -2918 3917 5706 -987 -6351 -2463 4195 5140 -770 -6129
1978 -6129 -2508 4416 4527 -798 -4999 -3358 3827 5799 -1024 -5725 -2620 3669 5450 -547 -6138
1993 -6138 -2562 4083 5008 -594 -5705 -2756 4311 4677 -824 -4777 -3112 3368 5806 -716 -5875
2008 -5875 -2527 3764 5323 -465 -6073 -2702 4370 5021 -851 -5640 -2606 4463 4862 -1234 -4967
2023 -4967 -2616 3561 5571 -804 -6046 -2255 4183 5014 -759 -5953 -2568 4692 4903 -1380 -5627
2038 -5627 -2327 4466 4882 -1656 -5292 -2081 3682 5101 -993 -6043 -2132 4346 4646 -1169 -5749
2053 -5749 -2311 4639 4633 -1706 -5535 -2011 4330 4541 -1861 -5298 -1556 3853 4387 -1267 -5542 -1778
2069 -1778 4431 4228 -1636 -5253 -1806 4411 4255 -1998 -5127 -1377 4254 4030 -1910 -5036 -1071 3949
2085 3949 3740 -1492 -4991 -1427 4194 3749 -1746 -4837 -1296 4159 3775 -1860 -4724 -1122 3918 3733
2101 3733 -1643 -4626 -1106 3879 3493 -1358 -4474 -1457 3816 3716 -1503 -4554 -1274 3775 3665 -1495
2117 -1495 -4397 -1232 3652 3527 -1371 -4422 -1279 3622 3470 -1335 -4333 -1376 3607 3631 -1450 -4510
2133 -4510 -1208 3752 3433 -1554 -4424 -1244 3648 3406 -1526 -4378 -1273 3615 3469 -1596 -4493 -1229
2149 -1229 3617 3540 -1629 -4627 -1132 3868 3279 -1706 -4380 -1143 3710 3362 -1681 -4401 -1138 3630
2165 3630 3487 -1730 -4525 -1034 3834 3300 -1725 -4607 -912 4053 3166 -1932 -4179 -807 3835 3244
2181 3244 -1922 -4234 -678 3779 3209 -1915 -4413 -548 4029 2983 -2054 -4210 -463 4131 2765
2196 2765 -2314 -3878 -330 3736 2807 -2127 -3952 -255 3609 2771 -1964 -4086 -348 3920 2566
2211 2566 -2129 -3902 -267 3912 2494 -2311 -3622 -98 3450 2451 -1998 -3658 -158 3344 2375
2226 2375 -1802 -3842 -427 3689 2403 -2103 -3649 -263 3498 2318 -2286 -3513 -53 3183 2187
2241 2187 -1910 -3469 -208 3161 2160 -1671 -3574 -470 3469 2308 -2127 -3414 -205 3310 2284
2256 2284 -2123 -3440 7 3184 2020 -1796 -3424 -190 3237 2183 -1653 -3466 -468 3378 2510
2271 2510 -1976 -3457 -200 3370 2416 -1987 -3516 92 3377 2083 -1856 -3335 -236 3238 2248
2286 2248 -1754 -3396 -316 3418 2484 -2098 -3538 -29 3448 2236 -2198 -3513 215 3557 1763
2301 1763 -2201 -3225 149 3355 1932 -2146 -3222 40 3381 2029 -2322 -3315 301 3495 1832
2316 1832 -2363 -3295 457 3485 1504 -2438 -3046 328 3300 1576 -2293 -3086 304 3219 1653 -2284
2332 -2284 -3166 407 3318 1550 -2346 -3050 458 3250 1369 -2398 -2728 526 3012 1416 -2150 -2766
2348 -2766 443 2995 1401 -2162 -2739 494 3081 1350 -2238 -2687 628 3044 1262 -2190 -2521 711
2364 711 2864 1187 -2016 -2492 530 2876 1299 -2012 -2467 518 2875 1370 -2112 -2532 555 2891
2380 2891 1277 -1993 -2514 566 2764 1195 -1857 -2465 373 2725 1342 -1957 -2418 284 2690 1373
2396 1373 -1985 -2629 437 2821 1259 -1986 -2618 499 2868 1073 -2011 -2430 418 2882 1342 -2116
2412 -2116 -2467 555 2890 1228 -2196 -2552 455 2714 985 -1990 -2627 638 2885 1034 -2329 -2362
2428 -2362 602 2805 1084 -2304 -2451 725 2739 1000 -2177 -2507 776 2815 963 -2117 -2345 622
2444 622 2950 775 -2602 -2278 932 2570 976 -2196 -2342 1191 2943 793 -2232 -1946 1040 2582
2460 2582 601 -2285 -2031 700 2801 806 -2480 -1555 1130 2574 911 -1720 -2112 1006 2423 847
2476 847 -2123 -1767 991 2324 644 -2055 -1814 1120 2318 737 -1786 -1927 1188 2476 977 -1933
2492 -1933 -1721 989 2558 381 -1971 -1774 641 2253 602 -1900 -1682 828 2191 556 -1780 -1926
2508 -1926 1313 2434 514 -1736 -1788 693 2207 375 -2071 -1623 773 2372 657 -1699 -1836 588
2524 588 2237 839 -1740 -1734 555 2398 253 -2286 -1791 1070 2428 622 -2082 -1731 972 2155
2540 2155 340 -1635 -1642 1017 1665 555 -1778 -1766 918 2417 499 -1847 -1692 854 2402 536 -1794
2557 -1794 -1864 794 2165 315 -2018 -1571 1053 2460 558 -2186 -1712 1108 2324 304 -1882 -1632
2573 -1632 977 2255 2 -1790 -1044 1013 2227 501 -1973 -1421 1259 2189 396 -1706 -1403 1081
2589 1081 2242 271 -2054 -1489 1075 2058 217 -1759 -1239 1075 2001 -14 -2111 -1246 1017 1810
2605 1810 160 -2039 -1516 1139 1840 198 -1662 -1228 1244 1993 -75 -1762 -1438 1025 1867 110
2621 110 -1932 -1038 1063 1680 105 -1667 -1181 1002 1789 21 -1703 -1307 1120 1848 2 -1762 -974
2638 -974 917 1783 81 -1709 -1005 1063 1582 95 -1628 -1165 1142 1778 59 -1623 -1167 1001 1863
2655 1863 -26 -1686 -983 963 1724 170 -1777 -1151 1054 1671 153 -1635 -1177 955 1825 16
2671 16 -1672 -1180 929 1842 13 -1738 -1055 863 1719 142 -1774 -1148 1072 1696 -24 -1627 -1203
2688 -1203 1074 1825 -18 -1822 -937 1197 1756 -67 -1907 -913 979 1513 -81 -1833 -944 1256
2704 1256 1834 -228 -1451 -1138 1215 1843 -216 -1830 -706 1014 1571 -166 -1943 -639 1279 1477
2720 1477 -297 -1739 -917 971 1581 -201 -1705 -763 991 1618 38 -1577 -724 985 1384 32
2736 32 -1544 -647 1265 1525 -72 -1310 -679 1042 1433 -282 -1452 -538 1108 1517 -476 -1519 -519
2753 -519 1095 1266 -168 -1289 -594 964 1121 -374 -1218 -596 1064 1378 -85 -1308 -683 1014 1239
2770 1239 -121 -1484 -432 1035 1173 -259 -1258 -903 899 1216 -313 -1423 -605 872 1266 -112
2786 -112 -1339 -635 893 1300 -375 -1585 -641 1068 1229 -438 -1409 -681 905 1278 -306 -1545 -551
2803 -551 1179 1305 -534 -1509 -367 868 995 -349 -1473 -725 1296 1268 -505 -1221 -321 1181 1302
2820 1302 -551 -1329 -476 923 846 -56 -1212 -696 1128 1113 -235 -1076 -565 1262 1110 -451 -1399 -351
2838 -351 960 1160 -287 -1349 -386 1018 1058 -283 -1441 -515 953 879 -382 -1239 -418 1175 1080 -499
2856 -499 -1370 -365 1033 811 -457 -1271 -293 1078 909 -356 -1079 -305 932 887 -434 -1243 -327 845
2874 845 810 -485 -1234 -244 962 741 -514 -1036 -268 918 788 -465 -1001 -255 847 841 -401 -1050 -259
2893 -259 880 828 -353 -1090 -251 943 779 -435 -1004 -242 792 766 -403 -957 -297 822 790 -303
2911 -303 -1034 -283 848 792 -328 -973 -309 919 777 -412 -936 -182 855 823 -353 -933 -145 809 739
2930 739 -327 -966 -253 883 758 -360 -979 -268 855 830 -446 -961 -195 864 733 -438 -1028 -197
2948 -197 843 679 -387 -1027 -256 845 653 -488 -1033 -239 870 695 -501 -979 -161 823 597 -454
2966 -454 -983 -76 916 657 -481 -1018 -143 861 644 -509 -914 -90 851 643 -388 -865 -76 806 575
2985 575 -410 -856 -19 859 519 -480 -830 -93 814 507 -519 -803 14 743 520 -453 -912 -9 806 502
3005 502 -432 -821 -5 777 462 -439 -769 6 747 487 -455 -757 -57 716 446 -402 -746 -42 757 482
3025 482 -418 -689 -22 642 461 -366 -674 -21 663 452 -410 -569 -41 638 392 -382 -698 -75 688 432
3045 432 -367 -755 -109 612 463 -411 -715 -75 669 433 -405 -745 -42 609 457 -370 -719 -80 672 469
3065 469 -383 -742 -2 690 463 -384 -713 -34 675 473 -413 -683 10 687 446 -360 -686 -27 678 435
3085 435 -371 -677 44 724 452 -421 -717 26 715 331 -396 -678 49 690 412 -403 -617 163 652 348
3105 348 -395 -686 58 698 328 -431 -584 139 652 292 -520 -642 107 639 328 -488 -572 169 675 262
3125 262 -492 -540 147 722 255 -464 -529 138 616 250 -455 -552 84 564 219 -399 -528 126 526 183 -402
3146 -402 -516 114 591 187 -408 -493 117 550 186 -448 -433 103 532 163 -367 -453 149 526 190 -353 -418
3167 -418 98 557 208 -346 -422 130 515 285 -343 -451 119 463 187 -351 -474 78 480 231 -335 -482
3187 -482 -4 526 256 -359 -431 117 526 266 -372 -495 142 505 205 -362 -487 73 527 190 -380 -410 92
3208 92 532 205 -424 -457 128 503 194 -316 -458 138 548 174 -403 -506 80 499 230 -423 -408 159 520
3229 520 199 -458 -536 125 472 164 -431 -414 72 510 112 -446 -362 86 496 116 -512 -380 175 509 54
3250 54 -394 -392 223 441 81 -342 -334 171 470 56 -377 -332 165 458 78 -340 -276 228 460 101 -334 -294 132
3273 132 403 56 -325 -259 207 373 96 -370 -300 108 332 79 -327 -298 130 358 79 -328 -264 137 364
3294 364 38 -336 -228 75 342 106 -240 -212 112 312 103 -209 -296 166 400 116 -290 -253 98 372 93
3315 93 -230 -284 145 344 51 -235 -247 34 279 55 -238 -298 77 361 85 -311 -332 110 361 79 -292 -203
3337 -203 87 315 34 -296 -340 76 357 94 -271 -308 138 357 62 -323 -274 134 390 109 -291 -221 184
3358 184 372 57 -294 -267 155 397 16 -299 -250 97 307 52 -342 -214 135 282 47 -347 -225 197 332
3379 332 14 -262 -149 211 252 -24 -264 -176 183 265 30 -283 -211 141 242 -35 -272 -157 194 214 -21 -205
3401 -205 -191 90 249 -25 -195 -150 145 188 52 -187 -169 73 233 76 -231 -145 141 204 3 -209 -157 101
3423 101 174 -15 -221 -203 69 206 11 -206 -207 88 284 62 -207 -150 93 188 23 -168 -121 95 218 69
3445 69 -185 -151 68 204 38 -135 -175 57 244 127 -157 -114 81 212 50 -175 -205 160 241 98 -126 -217
3467 -217 110 197 83 -228 -247 86 214 72 -206 -226 41 218 -27 -250 -169 64 260 -18 -190 -143 73 205
3489 205 72 -208 -147 67 240 0 -222 -177 93 220 16 -247 -163 178 160 5 -151 -119 113 201 -18 -242
3511 -242 -147 162 180 -9 -258 -117 61 195 -48 -206 -136 130 202 -64 -199 -90 100 129 -8 -133 -26 67
3533 67 70 27 -180 -107 112 146 48 -174 -17 94 122 -16 -112 -41 113 141 -17 -131 -135 40 90 14 -171 -9 79
3558 79 86 38 -116 -95 34 138 -67 -150 -100 53 160 11 -117 -116 40 174 45 -136 -112 27 148 59 -116 -161
3582 -161 49 140 41 -87 -113 54 151 17 -132 -102 73 134 57 -114 -97 74 151 -7 -176 -104 63 139 -5 -161
3606 -161 -74 86 155 -17 -207 -112 87 133 -20 -221 -136 82 137 -12 -169 -121 106 128 9 -193 -97 82 177
3629 177 -17 -132 -46 87 175 -49 -161 -5 160 131 30 -159 -68 143 200 -76 -83 49 68 151 -76 -145 -19
3652 -19 145 114 32 -97 -12 83 40 -21 -93 -51 17 49 -64 -132 -60 134 31 -60 -131 -14 77 73 18 -132 -20 40 77
3679 77 -39 -78 8 30 77 -28 -80 -3 75 82 -40 -21 -41 53 104 16 -48 -42 -23 66 51 -65 -32 38 117 -15 -131 -67
3707 -67 68 77 13 -88 -65 25 117 -36 -98 -49 47 148 66 -162 -91 42 129 2 -107 -86 30 153 36 -129 -39
3732 -39 99 133 3 -124 -54 141 164 32 -73 -40 124 108 -38 -164 -64 57 126 -6 -123 -38 89 82 -47
3755 -47 -71 -56 60 108 -31 -128 21 75 74 -68 -119 -68 56 103 -55 -111 7 31 23 -25 -108 49 111 68 -19 -47 7
3782 7 96 53 -24 -113 9 55 50 -47 -99 19 29 82 -53 -45 -6 65 102 25 -27 -66 55 41 -56 -59 -19 -4 45 -53 -80 29
3812 29 36 73 -45 -32 -45 70 72 20 -50 -71 22 74 7 -47 -34 59 58 -26 -66 -24 55 101 26 -117 -63 41 124 -51 -125
3841 -125 -79 74 133 50 -129 -154 31 107 18 -168 -35 43 159 -33 -168 -106 40 120 -35 -207 -82 57 114
3864 114 -21 -126 -46 115 179 -8 -168 -68 40 156 -23 -136 -29 102 112 1 -89 -90 134 80 -44 -147
3886 -147 -25 119 123 -41 -93 -15 139 98 -118 -122 -19 71 97 -121 -165 -24 150 38 -23 -117 -30 91 60 -57 -156
3911 -156 65 157 73 -66 -81 -17 74 67 -16 -56 3 81 54 -28 -30 -5 77 69 -47 -29 -27 118 79 -20 -55 -18 -7 97 -65
3940 -65 -114 -19 49 37 4 -43 -111 115 44 -36 -110 -132 -10 43 -8 -129 -66 28 91 3 -150 -93 73 107 -9 -106 -146
3967 -146 51 154 33 -137 -38 134 158 25 -167 -66 78 143 -39 -102 -25 106 125 -28 -106 -57 113 143 -57
3990 -57 -176 -17 101 170 -94 -188 -73 120 124 -83 -210 7 153 133 -47 -164 -42 169 107 -76 -128 -27 144
4013 144 150 -57 -133 56 153 70 -45 -155 18 120 125 -108 -206 -16 156 71 -102 -127 11 141 106 -122 -146 47
4037 47 123 31 -142 -178 10 65 26 -154 -142 22 26 70 -85 -63 -4 60 50 -52 -100 18 58 25 -102 -72 -25 100
4063 100 51 -12 -32 63 29 67 -11 -81 33 45 96 -37 -57 13 38 50 11 -84 -53 118 131 -18 -133 -49 72 92 -27
4090 -27 -159 -68 70 -4 -109 -128 -77 68 113 -59 -117 -28 106 106 11 -143 -46 117 123 -44 -149 33 175 124 -99
4115 -99 -156 -40 181 117 -81 -191 -1 190 112 -111 -186 -13 194 93 -86 -122 -47 158 117 -139 -189 54 164
4138 164 4 -147 -117 36 161 6 -120 -150 27 224 25 -151 -149 54 159 42 -98 -129 48 170 49 -142
4160 -142 -108 107 224 50 -123 -115 78 194 -4 -92 -89 82 112 -26 -149 -20 47 220 -9 -127 -56 91 110
4183 110 15 -94 -96 83 85 -3 -73 -70 47 101 64 -61 -92 61 59 3 -87 -81 44 132 44 -60 -18 53 91 58 -81 -89 26
4212 26 140 37 -66 -58 2 155 52 -23 -95 34 47 81 -23 -105 14 79 102 -144 -180 1 106 -2 -145 -140 45
4237 45 131 89 -141 -178 -44 118 65 -147 -178 63 225 46 -136 -179 -1 226 12 -162 -107 115 154 19 -119
4260 -119 -95 147 201 66 -138 -131 159 163 45 -129 -89 174 170 47 -200 -166 209 173 23 -184 -160 117 250 -43
4284 -43 -271 -94 168 153 -15 -130 -38 170 91 -62 -188 -42 139 150 -34 -181 -26 162 155 -28 -122 -50 165
4307 165 168 -2 -165 -35 195 109 -106 -140 -38 111 87 -28 -125 -39 134 132 -103 -114 -49 132 116 -74 -163 -63
4331 -63 86 97 -46 -142 -49 92 131 -75 -117 -65 89 125 -37 -83 -39 93 128 33 -121 -71 150 149 36 -91 -77
4356 -77 129 204 -36 -99 -48 87 198 2 -149 -94 97 178 -27 -162 -82 114 139 26 -173 -82 111 127 -26
4379 -26 -165 -83 143 182 -47 -257 -75 185 195 -101 -217 -117 156 180 -77 -221 -77 233 212 -87 -229 -29
4401 -29 226 213 -67 -206 -35 242 192 -121 -245 -84 226 144 -75 -206 31 221 129 -124 -293 -4 250 127
4423 127 -158 -236 -6 236 121 -228 -234 8 275 105 -191 -182 72 215 64 -160 -201 38 220 118 -145 -169
4445 -169 91 244 94 -136 -179 95 236 106 -163 -116 117 278 77 -215 -192 97 183 74 -177 -162 86 182
4467 182 36 -184 -182 -1 221 88 -126 -157 62 146 105 -164 -206 2 187 108 -156 -190 30 152 65 -84 -182
4490 -182 24 176 53 -123 -180 2 120 96 -110 -178 22 200 111 -134 -197 59 275 90 -157 -282 47 268
4512 268 144 -176 -222 47 249 124 -186 -298 48 286 73 -248 -256 88 248 99 -216 -250 56 324 130
4533 130 -204 -224 102 334 126 -210 -282 92 340 84 -249 -211 132 361 109 -265 -214 175 352 -3 -219
4554 -219 -215 155 373 -23 -337 -166 220 294 -26 -308 -177 101 264 12 -293 -168 184 247 -50 -306 -126
4575 -126 193 284 -57 -215 -148 172 271 -68 -258 -113 236 217 -64 -285 -82 210 278 -29 -228 -103 194 250
4597 250 -101 -203 -155 125 229 -1 -201 -105 108 138 -42 -242 -209 192 209 -46 -206 -150 140 203 -26 -253
4619 -253 -133 129 217 -13 -229 -123 146 231 -17 -221 -180 121 279 3 -181 -150 102 282 -12 -212 -162 198
4641 198 326 27 -279 -202 197 284 6 -262 -138 169 247 54 -309 -144 171 304 -2 -285 -190 215 376
4662 376 -74 -290 -203 180 287 -108 -355 -248 244 320 -71 -403 -204 245 334 -56 -358 -112 253 298 -47
4683 -47 -386 -149 306 292 -103 -355 -112 260 349 -145 -388 -93 272 268 -144 -303 -118 312 271 -120 -284 -14
4705 -14 302 199 -138 -431 -102 264 189 -180 -291 -23 275 179 -223 -393 -64 335 219 -165 -374 -29 291
4726 291 198 -179 -291 -79 281 165 -127 -269 -80 250 216 -153 -239 -57 204 218 -150 -277 -65 207 229 -105
4748 -105 -269 12 253 258 -156 -289 -96 184 179 -105 -298 -72 236 177 -105 -337 -75 257 195 -38 -307 -61
4770 -61 284 308 -127 -341 -85 302 205 -113 -370 -68 228 274 -146 -378 -73 286 220 -141 -343 -86 347 324
4792 324 -90 -375 -39 379 314 -190 -437 -51 363 259 -235 -419 -99 356 280 -221 -427 -71 377 239 -277
4813 -277 -443 -34 330 256 -282 -430 61 395 221 -225 -412 66 433 218 -306 -374 88 425 190 -200 -361
4834 -361 84 423 222 -267 -336 118 412 192 -321 -346 62 395 123 -353 -359 90 396 151 -286 -291 114 458
4856 458 117 -339 -370 74 321 96 -256 -291 88 361 68 -260 -331 76 334 104 -228 -325 17 280 155
4877 155 -201 -280 55 406 181 -274 -275 39 357 174 -258 -321 47 360 129 -231 -339 62 360 173 -273
4898 -273 -326 -23 357 178 -232 -358 -8 415 191 -276 -422 39 417 177 -310 -381 7 398 215 -302 -351
4919 -351 95 431 224 -368 -379 125 457 211 -303 -409 91 514 229 -296 -391 75 456 196 -384 -361 76
4940 76 467 146 -363 -366 93 465 112 -335 -417 93 425 135 -420 -358 150 448 180 -403 -355 129 462 75
4962 75 -401 -363 209 453 136 -448 -298 157 534 125 -392 -251 204 458 34 -368 -366 241 458 119 -425
4983 -425 -277 262 449 15 -363 -266 186 379 61 -395 -322 218 435 41 -364 -305 223 373 21 -359 -293
5004 -293 103 340 63 -326 -255 150 400 33 -264 -295 167 412 108 -286 -255 170 422 57 -332 -287 140
5025 140 377 101 -346 -326 161 393 50 -284 -360 129 438 49 -413 -362 159 470 102 -471 -368 155 418
5046 418 101 -402 -338 107 411 87 -396 -357 177 464 134 -454 -320 150 450 78 -424 -370 262 530 84
5067 84 -445 -342 275 539 61 -445 -369 295 500 59 -502 -316 288 506 25 -474 -371 279 496 -12 -501
5088 -501 -267 306 414 -4 -538 -287 299 530 -38 -512 -290 348 431 -75 -475 -269 331 427 -36 -487 -210
5109 -210 347 386 -36 -438 -204 311 380 -48 -472 -200 275 462 -105 -467 -228 276 410 -27 -419 -225 270
5130 270 368 -72 -418 -193 300 351 -81 -474 -219 242 355 -68 -378 -277 208 398 -43 -402 -256 210 352
5151 352 -63 -382 -264 254 391 1 -406 -201 256 436 22 -386 -258 265 421 23 -381 -297 292 386 1
5172 1 -397 -253 326 410 26 -460 -297 293 422 31 -522 -308 306 456 -49 -488 -274 299 394 -35 -442
5193 -442 -281 361 473 -67 -476 -252 388 495 -87 -498 -215 367 439 -7 -531 -250 421 474 -135 -567 -215
5214 -215 399 468 -108 -491 -210 377 458 -111 -541 -167 392 400 -161 -549 -200 405 444 -107 -532 -197 412 391
5236 391 -169 -516 -158 364 381 -91 -492 -158 418 367 -171 -491 -93 387 337 -155 -458 -70 452 388 -181
5257 -181 -454 -150 443 375 -182 -422 -90 430 360 -172 -425 -120 371 285 -166 -376 -129 338 328 -135 -403
5278 -403 -110 281 284 -77 -446 -162 300 337 -125 -460 -186 380 374 -132 -434 -145 326 307 -24 -450 -160 304
5300 304 409 -122 -455 -158 341 364 -120 -454 -146 396 423 -126 -501 -153 337 430 -191 -504 -182 374 392
5321 392 -184 -534 -218 429 399 -186 -555 -163 458 406 -151 -549 -187 414 430 -195 -538 -164 492 373 -277
5342 -277 -544 -122 485 419 -261 -508 -134 492 413 -284 -499 -55 470 412 -325 -534 -74 532 400 -270 -512
5363 -512 -19 526 313 -293 -529 -11 537 272 -273 -484 -11 464 307 -299 -456 -13 475 297 -277 -451
5383 -451 3 436 293 -300 -493 -35 444 285 -243 -445 -19 487 291 -216 -414 -43 399 265 -202 -416
5403 -416 -39 426 302 -233 -441 -59 443 300 -222 -432 -13 360 307 -230 -459 -57 433 261 -242 -502
5423 -502 -89 409 293 -223 -502 -124 415 314 -232 -484 -99 440 356 -281 -507 -98 483 377 -208 -529
5443 -529 -45 488 360 -188 -541 -73 488 408 -188 -459 -89 514 321 -309 -547 -32 424 355 -357 -575 -23
5464 -23 526 314 -345 -587 -37 486 283 -372 -539 33 509 339 -426 -548 -8 563 267 -415 -544 90
5484 90 568 328 -334 -512 34 558 242 -413 -497 94 558 235 -290 -455 91 534 318 -384 -460 119 554
5505 554 253 -377 -474 84 452 214 -335 -451 66 465 184 -409 -449 92 456 124 -386 -433 96 462 165
5526 165 -373 -384 82 492 166 -324 -374 70 425 175 -344 -465 84 474 184 -330 -409 89 482 243 -325
5547 -325 -420 57 476 205 -305 -352 76 516 193 -343 -428 77 472 241 -432 -424 -45 510 251 -365 -472 58
5569 58 477 233 -366 -520 62 516 258 -376 -474 119 522 227 -366 -497 82 581 251 -400 -501 86 577
5590 577 274 -364 -457 95 547 215 -432 -473 129 535 208 -470 -510 176 566 203 -496 -493 138 611 147 -496
5612 -496 -503 153 559 109 -549 -464 231 533 137 -468 -439 245 540 90 -512 -433 248 550 141 -470 -386 258
5634 258 553 66 -460 -342 297 551 87 -523 -364 223 480 31 -510 -348 283 545 122 -433 -352 151
5654 151 501 113 -422 -369 200 462 73 -417 -441 177 410 78 -486 -383 206 476 33 -448 -337 200 497
5675 497 113 -413 -402 193 445 115 -358 -375 273 476 123 -443 -413 204 539 101 -452 -361 221 467 88
5696 88 -417 -405 209 500 83 -441 -449 192 588 116 -541 -452 189 516 96 -468 -427 217 576 70 -489 -457
5718 -457 217 543 91 -535 -447 233 541 167 -521 -418 271 589 65 -491 -427 291 626 87 -538 -326 302
5739 302 576 86 -551 -370 369 583 23 -642 -438 382 591 -5 -579 -323 338 558 26 -620 -341 381
5759 381 560 -84 -579 -334 398 493 -46 -591 -287 407 479 -27 -520 -276 405 486 -106 -579 -298 381 560
5780 560 -71 -531 -231 358 510 24 -460 -265 373 479 -46 -500 -253 329 465 -101 -527 -295 315 474
5800 474 -58 -533 -270 341 433 -100 -572 -273 333 455 -73 -507 -228 354 481 12 -505 -258 407 486 -63
5821 -63 -478 -293 318 484 -65 -510 -310 315 512 -22 -504 -320 299 531 -13 -570 -311 421 555 1
5841 1 -554 -286 380 522 -89 -592 -341 414 560 -101 -614 -311 419 565 -93 -635 -287 439 578 -126 -642
5862 -642 -229 456 612 -138 -551 -218 466 571 -151 -685 -207 514 570 -137 -630 -259 484 526 -143 -674 -213
5883 -213 520 500 -198 -617 -202 528 501 -241 -623 -228 434 492 -251 -557 -205 449 479 -220 -573 -153 493
5904 493 407 -203 -623 -176 462 424 -178 -581 -140 480 452 -229 -588 -114 482 392 -189 -487 -96 526 410
5925 410 -195 -507 -163 402 428 -210 -545 -127 542 420 -228 -572 -162 471 394 -235 -566 -200 488 401 -209
5946 -209 -566 -210 452 419 -134 -591 -210 471 428 -121 -584 -180 472 460 -188 -584 -139 466 458 -180 -545 -131
5968 -131 536 470 -171 -564 -143 507 464 -257 -611 -152 503 523 -220 -618 -179 515 487 -236 -612 -122 573
5989 573 389 -218 -558 -148 573 438 -249 -643 -116 594 481 -252 -664 -94 546 425 -286 -613 -115 590
6009 590 406 -322 -583 7 613 426 -280 -607 -35 609 477 -373 -592 -21 600 361 -323 -560 0 583
6029 583 343 -371 -581 13 545 333 -343 -533 -3 559 324 -373 -554 13 529 318 -400 -516 37 488
6049 488 265 -307 -513 31 545 285 -333 -562 49 549 380 -301 -507 35 522 321 -327 -526 -42 523
6069 523 359 -305 -461 67 520 351 -312 -537 -11 591 318 -327 -521 -28 513 345 -304 -500 -35 512
6089 512 307 -337 -591 39 554 326 -344 -586 36 538 329 -366 -543 -19 617 364 -298 -503 -2 599
6109 599 340 -412 -547 3 580 339 -329 -568 11 569 312 -348 -596 10 599 295 -437 -564 46 633
6129 633 330 -375 -645 86 591 303 -464 -594 60 598 261 -463 -614 52 618 294 -430 -562 151 605
6149 605 223 -510 -503 161 656 226 -474 -459 129 599 261 -428 -493 176 570 219 -461 -479 177 612 221 -456
6171 -456 -495 104 614 218 -411 -525 83 536 188 -421 -494 167 571 176 -473 -513 138 561 221 -388 -499
6192 -499 147 542 186 -387 -439 157 524 190 -427 -459 140 575 225 -370 -398 131 536 259 -366 -403 179
6213 179 556 207 -403 -457 70 541 199 -437 -462 91 502 164 -442 -455 102 557 173 -476 -504 28 613
6234 613 191 -508 -421 105 534 199 -465 -450 154 584 228 -424 -507 143 619 247 -428 -401 211 590 245
6255 245 -498 -469 159 602 205 -493 -490 193 587 180 -539 -387 286 575 149 -521 -457 232 584 149 -553
6276 -553 -455 255 529 127 -537 -409 227 559 72 -508 -414 310 559 50 -542 -457 290 573 61 -516 -423
6297 -423 247 578 70 -486 -343 310 535 39 -509 -361 363 586 32 -544 -318 343 503 89 -552 -358
6317 -358 289 484 -25 -492 -386 296 543 86 -514 -370 243 547 70 -455 -322 240 483 59 -491 -338
6337 -338 206 481 67 -509 -368 296 549 57 -460 -330 294 535 99 -457 -338 260 515 49 -501 -340
6357 -340 312 567 46 -486 -345 308 591 46 -447 -347 314 527 68 -538 -374 289 550 18 -464 -334
6377 -334 227 530 33 -531 -336 316 498 47 -514 -363 329 547 7 -543 -373 308 557 -45 -520 -337
6397 -337 379 510 22 -532 -353 376 599 30 -541 -268 379 527 -8 -584 -308 297 488 -73 -558 -322
6417 -322 392 489 -73 -566 -308 358 475 -74 -575 -284 388 514 -59 -528 -253 382 467 -95 -469 -274 402
6438 402 417 -88 -566 -258 394 450 -84 -500 -204 405 444 -66 -518 -204 396 464 -79 -528 -243 335 436
6459 436 -69 -521 -243 342 460 -114 -495 -222 336 410 -109 -539 -236 364 432 -151 -482 -248 334 425 -53
6480 -53 -471 -208 337 430 -4 -485 -206 362 439 -111 -518 -156 319 442 -29 -549 -230 366 469 -64 -491
6501 -491 -212 393 490 -97 -516 -260 404 500 -107 -537 -241 414 461 -113 -528 -224 341 476 -169 -583 -243
6522 -243 350 486 -161 -553 -209 466 460 -144 -535 -178 463 450 -97 -462 -195 473 472 -192 -532 -134 458 466
6544 466 -107 -477 -148 469 422 -185 -595 -108 431 381 -164 -512 -124 393 332 -173 -501 -124 411 382 -182
6565 -182 -530 -108 389 341 -137 -474 -133 452 361 -168 -537 -110 356 378 -201 -470 -146 409 381 -176 -440
6586 -440 -81 441 374 -164 -514 -75 430 339 -119 -417 -121 368 327 -175 -445 -136 369 393 -155 -490 -98
6607 -98 351 332 -227 -458 -104 349 384 -186 -451 -95 394 385 -179 -477 -125 423 384 -161 -491 -126 409 334
6629 334 -113 -513 -98 422 407 -199 -485 -154 441 461 -129 -515 -137 451 341 -163 -461 -124 419 376 -153
6650 -153 -581 -100 406 298 -222 -522 -106 396 319 -182 -471 -100 449 311 -228 -500 -60 435 342 -223 -476
6671 -476 -91 492 348 -272 -480 -51 495 346 -216 -474 -33 402 264 -193 -506 -27 441 324 -264 -469
6691 -469 -33 487 279 -201 -407 -56 410 214 -267 -464 -50 405 301 -272 -429 15 408 198 -241 -467
6711 -467 19 355 254 -270 -367 -16 434 290 -240 -360 -46 403 251 -190 -371 -14 461 269 -239 -475
6731 -475 -3 420 291 -248 -416 -8 383 308 -203 -414 -27 403 337 -254 -427 48 391 231 -244 -464 -1
6752 -1 394 279 -315 -469 -53 368 258 -272 -403 -34 365 199 -245 -398 -24 375 259 -264 -441 -7 429
6773 429 197 -248 -398 3 443 253 -217 -400 13 435 308 -239 -386 -58 431 251 -297 -388 -1 381
6793 381 182 -284 -448 20 415 219 -275 -395 14 454 227 -306 -409 89 437 176 -321 -421 48 481
6813 481 156 -335 -393 65 453 190 -255 -321 51 432 203 -242 -310 121 435 159 -329 -349 64 406 191
6834 191 -275 -356 89 431 100 -286 -409 61 367 139 -337 -366 -16 416 94 -378 -383 72 345 115 -303
6855 -303 -358 47 376 197 -325 -347 79 383 152 -247 -336 96 377 184 -313 -309 118 446 165 -276 -276 148
6877 148 332 165 -291 -313 77 371 185 -267 -303 46 354 150 -357 -309 -7 377 160 -353 -340 84 401
6898 401 117 -313 -409 114 371 167 -389 -355 74 339 105 -358 -361 62 379 83 -381 -349 103 412 111 -314
6920 -314 -369 142 412 106 -330 -365 167 371 92 -292 -353 126 399 123 -343 -279 130 410 64 -341 -290 150
6942 150 400 27 -360 -336 161 381 107 -406 -337 176 388 90 -334 -285 210 441 122 -370 -328 156 436
6963 436 73 -303 -247 165 411 64 -353 -209 153 361 42 -316 -290 117 357 40 -296 -268 144 359 80
6984 80 -301 -279 178 353 56 -347 -266 123 337 45 -292 -251 138 331 92 -304 -236 162 336 66 -277 -271
7006 -271 146 302 55 -339 -255 173 321 45 -335 -259 161 374 48 -334 -254 133 347 68 -281 -226 155
7027 155 336 48 -348 -226 198 330 5 -386 -272 184 323 6 -322 -245 154 316 86 -339 -243 216 401
7048 401 -6 -347 -235 224 329 20 -328 -272 209 331 47 -326 -260 144 359 -24 -279 -196 231 346 -2
7069 -2 -284 -223 236 329 30 -380 -295 216 327 6 -273 -244 186 327 -12 -313 -156 162 355 40 -368 -163
7091 -163 148 338 -41 -315 -185 158 280 -38 -302 -192 131 337 13 -324 -132 247 325 14 -299 -196
7111 -196 231 275 -34 -333 -212 260 310 -17 -297 -180 266 262 -18 -323 -190 199 247 8 -360 -174 207 231
7133 231 -26 -318 -233 201 295 -38 -293 -166 102 276 49 -308 -202 202 325 10 -325 -178 269 287 -23
7154 -23 -298 -128 216 277 -13 -343 -159 214 285 -48 -320 -158 252 288 -27 -286 -113 227 247 -36 -250 -156
7176 -156 194 276 -9 -319 -114 260 249 -71 -376 -240 164 254 20 -300 -148 203 273 -69 -285 -140 206
7197 206 210 -45 -314 -104 249 291 -67 -331 -148 217 262 -52 -285 -65 204 246 -108 -330 -129 244 286 -135
7219 -135 -318 -92 183 230 -100 -330 -103 188 218 -93 -267 -148 251 271 -120 -329 -95 182 262 -26 -250
7240 -250 -92 241 244 -154 -234 -74 242 283 -2 -248 -90 204 248 -63 -247 -122 254 278 -42 -197 -73 196
7262 196 226 -76 -251 -74 211 205 -59 -266 -45 198 238 -113 -285 -111 178 231 -72 -307 -103 181 233 -31
7284 -31 -262 -43 181 221 -71 -234 -136 213 239 -76 -299 -73 144 162 -58 -205 -35 195 238 -66 -279 -55
7306 -55 219 213 -70 -234 -72 232 217 -92 -261 -12 241 185 -150 -308 -96 145 177 -97 -243 -92 151 180
7328 180 -155 -275 -91 213 98 -172 -237 -74 269 222 -85 -244 -51 230 235 -172 -225 -10 216 175 -152 -190
7350 -190 -24 196 205 -95 -220 -26 181 126 -111 -232 -9 199 205 -86 -315 -50 165 168 -118 -254 -12 164
7372 164 167 -167 -208 -26 188 136 -147 -242 -51 207 182 -114 -247 -17 252 171 -80 -234 -5 192 102 -105 -209
7395 -209 -28 226 195 -139 -153 -15 227 97 -144 -235 27 188 114 -159 -293 -39 166 123 -155 -187 -3 140
7417 140 115 -104 -251 -22 192 117 -211 -203 -14 208 90 -125 -266 -37 172 110 -121 -199 -20 200 147 -77
7439 -77 -185 17 209 107 -98 -161 10 198 130 -109 -184 -12 164 179 -140 -197 20 181 89 -87 -211 38
7461 38 202 109 -171 -190 34 123 115 -136 -173 -15 120 83 -133 -218 84 191 83 -159 -153 -19 156 126 -140 -129
7485 -129 33 209 96 -56 -140 79 226 84 -109 -200 39 156 98 -128 -151 59 206 125 -139 -159 28 203
7507 203 89 -205 -136 11 112 83 -196 -229 47 175 34 -118 -152 26 154 107 -122 -146 23 170 115 -148
7529 -148 -171 40 192 56 -99 -175 38 213 70 -57 -112 48 143 95 -124 -119 29 154 82 -121 -136 54 222
7552 222 128 -151 -157 52 148 -10 -129 -139 10 89 83 -176 -168 19 124 0 -222 -141 -3 144 63 -127 -139 58
7576 58 205 68 -103 -184 63 177 57 -122 -132 8 194 54 -148 -139 119 162 89 -148 -136 66 132 39 -114
7599 -114 -164 55 196 50 -111 -141 63 142 73 -125 -173 -14 136 -9 -107 -173 26 162 31 -134 -181 97 186
7622 186 21 -148 -109 -32 171 76 -128 -146 47 158 147 -129 -114 45 153 38 -128 -89 52 133 41 -94 -97 58
7646 58 144 58 -112 -128 38 165 57 -55 -162 36 116 -28 -116 -115 85 177 40 -135 -61 69 117 25 -116 -100
7670 -100 34 165 -19 -76 -92 59 143 60 -145 -68 106 204 56 -122 -71 61 202 13 -110 -132 -4 137 3
7693 3 -91 -111 29 120 -26 -135 -86 59 58 5 -142 -50 94 120 -32 -106 -125 44 70 -35 -97 -105 0 94 40 -107
7719 -107 -70 73 104 -31 -161 -49 -17 110 25 -117 -88 89 113 55 -84 -114 33 107 13 -98 -47 90 73 19
7743 19 -115 -124 15 52 -21 -55 -158 30 100 -4 -124 -64 46 80 25 -152 -50 1 87 -2 -54 -87 45 142 20
7768 20 -106 -56 20 104 -13 -95 -122 64 87 -18 -102 -90 52 91 17 -91 -52 57 101 2 -109 -100 104 129 -32 -87
7794 -87 -94 64 104 -48 -87 -81 56 117 -30 -106 -65 17 141 -33 -134 -46 82 70 -5 -58 -81 111 88 -1 -67 -57 32
7821 32 129 23 3 -64 67 77 15 -68 -98 30 61 -15 -70 -5 4 51 -10 -75 -45 39 92 -51 -102 -40 47 99 -10 -74
7849 -74 -23 33 68 -3 -90 -62 16 33 -23 -25 -103 -4 75 -40 -57 3 -36 65 28 -126 -74 46 113 1 -74 -64 28 87
7877 87 2 -104 -98 62 76 -7 -93 -39 82 79 9 -84 -88 98 52 -20 -113 -51 80 18 -30 -76 -88 56 90 7 -92 -54 0
7906 0 34 0 -62 -66 15 67 1 -36 -75 60 75 15 -108 37 90 44 -13 -104 -42 85 55 1 -91 -85 48 72 -56 -77 -85
7935 -85 2 84 -24 -54 -54 32 30 -71 -71 -20 11 123 6 -61 -96 43 121 -27 -67 -32 53 44 -32 -109 -31 13 25 19 -15 -33
7965 -33 53 44 68 -43 -11 73 31 -10 -108 -25 101 17 -53 -46 -83 79 88 -7 -50 -50 24 37 -22 -86 -15 11 54 1 -64 -40 9
7996 9 18 28 -53 -31 -12 45 -12 -60 -3 61 97 22 -49 -51 47 79 26 -74 -22 -6 117 40 -30 -72 4 83 8 -80 -82 73 53
8027 53 20 -59 -34 2 76 17 -104 -116 27 9 -10 -87 -25 37 43 -20 -43 -39 47 52 -3 -71 -15 67 108 21 -61 37 89 76 29
8058 29 -55 -22 63 27 -10 -8 14 -7 40 27 -21 -39 68 62 -35 -29 -33 35 23 -1 -79 -79 68 26 7 -129 -31 11 67 37 -64
8089 -64 -56 15 21 -28 11 -31 24 57 36 -42 -16 36 38 26 -22 -58 11 10 30 2 -11 -18 26 32 -48 -85 41 42 -51 -10 -42 29 13
8122 13 -10 -37 -80 -36 -33 4 -37 -84 37 6 20 -11 -101 14 13 61 -75 -67 -2 20 8 -44 3 23 42 -7 -31 -31 36 38 68
8153 68 -20 -16 29 91 13 -93 -8 30 34 43 -87 -49 -4 40 16 -78 -23 27 79 15 -96 -29 -1 1 27 -51 -98 50 66 -24
8183 -24 -52 -59 13 70 -1 -23 24 19
8191A9
$$ Imaginary data points
##PAGE= N=2
##DATA TABLE= (X++(I..I)), XYDATA
0 0 0 0 0 0 0 0 0 0 0 0 8 -8 8 -8 16 -16 17 -24 32 -33 41 -49 63 -72 85 -97 113 -135 153 -176 201 -230 260
33 260 -296 335 -375 423 -473 528 -591 657 -730 810 -898 993 -1097 1211 -1337 1473 -1622
50 -1622 1786 -1969 2169 -2395 2645 -2926 3246 -3615 4041 -4541 5141 -5873 6790 -7978 9584
65 9584 -11887 15490 -21937 37027 -146447 53989 337557 -11429 -131660 -152022 -8157
76 -8157 202053 120101 -154527 -164084 -996 190878 114301 -132956 -155587 -12433 124765
87 124765 214017 -96198 -336365 60159 314777 5130 -164850 -109531 2564 181731
97 181731 105801 -155494 -146045 35422 153640 92371 -114694 -145837 11354 121276 148450
108 148450 -67644 -275491 23526 290633 26814 -178367 -95460 21825 156192 95739
118 95739 -147166 -138952 54660 133636 68438 -94196 -137363 14320 122676 107962 -58260
129 -58260 -221828 -4079 254778 51112 -176197 -96087 34139 133767 86198 -129262 -136622
140 -136622 56774 123326 50539 -78210 -126871 8308 123161 82895 -58961 -175202 -19243
151 -19243 211761 73241 -161313 -107800 41174 124625 76031 -113976 -136833 53325 127057
162 127057 39494 -76801 -117398 6585 128504 71407 -71942 -145965 -14375 181829 84175
173 84175 -148447 -121355 49827 129020 63952 -107893 -134278 51963 136380 32029 -84915
184 -84915 -106942 12175 130847 62869 -86058 -124506 1829 156066 79287 -132195 -123818
195 -123818 54529 130949 47705 -103893 -120769 50991 135770 23162 -92509 -90661 22270
206 22270 121309 50592 -92133 -105140 19425 131344 62587 -113788 -116060 52965 128526
217 128526 32465 -101848 -103128 48274 127454 19397 -97641 -80777 32213 110718 39558
228 39558 -93114 -94959 31918 117185 43832 -101078 -103218 47066 121917 24642 -99992
239 -99992 -88643 45451 114615 19090 -95539 -75415 38340 100186 29194 -86073 -84073
250 -84073 34614 104814 31013 -88048 -86803 38084 108864 24568 -91852 -78159 41950
261 41950 100892 20249 -85597 -72118 37950 93897 23639 -78152 -75712 32111 98611
272 98611 27048 -82471 -76642 34747 99971 26322 -86396 -75233 41182 96099 21111
283 21111 -80734 -73464 37488 96673 21247 -79690 -72259 33637 98306 25080 -84454
294 -84454 -72387 37861 95494 24766 -83475 -74870 41501 95737 18845 -79997 -72060 37592
306 37592 97308 18028 -82570 -67502 36586 93749 21078 -84713 -68433 41574 90160
317 90160 18181 -81078 -70352 42475 92631 12411 -80353 -65660 38889 93160 13500 -84806
329 -84806 -62446 41768 88987 14366 -85100 -63892 47079 87103 8979 -80717 -62708 45037
341 45037 89346 6305 -81641 -57998 43140 88041 8486 -84829 -56236 47595 83477 6462
353 6462 -81364 -55898 49015 81840 2255 -76930 -52418 44921 81448 2814 -77491 -48856
365 -48856 44606 77618 4048 -76266 -48400 46476 74573 1677 -72188 -46960 44430 73907
377 73907 754 -70993 -44372 42672 72030 1973 -70648 -43772 43338 69762 1450 -68443
389 -68443 -44056 42504 69912 194 -67699 -42087 40192 68680 2498 -68304 -43151 41250
401 41250 67442 2426 -66865 -44863 41621 68505 -805 -65594 -41582 38027 67143 1448
413 1448 -65944 -40339 36558 63856 6136 -64910 -45785 39347 65905 2583 -63510 -45690
425 -45690 38880 68955 -2261 -64910 -37348 35347 63253 3622 -64841 -39477 37383 60311
437 60311 6036 -61737 -46888 39996 67223 -350 -63214 -43556 39453 71483 -4711 -69679
449 -69679 -31943 40289 59888 1602 -65748 -37732 43607 58480 146 -59428 -43828 41465
461 41465 68575 -4841 -64968 -38219 41603 70956 -7956 -73949 -24825 47110 51954 -3322
473 -3322 -61415 -33793 46512 53923 -7407 -53573 -36494 37822 64465 -7263 -63321 -31071
485 -31071 40252 64140 -8811 -72997 -20020 50880 42302 -9001 -53169 -29922 44538 49500
497 49500 -13976 -48411 -27605 32150 57538 -6475 -61223 -26816 39189 57324 -8215 -70811
509 -70811 -19503 54132 37210 -15335 -46159 -26297 40147 47857 -16874 -46108 -20208 26756
521 26756 50685 -1549 -58030 -26927 37539 52326 -5131 -65480 -22774 53450 36920 -18320
533 -18320 -40131 -22949 33241 47413 -14275 -45109 -15465 23378 43902 4448 -53062 -29597
545 -29597 36028 50278 -2505 -60186 -26923 51789 41584 -20700 -40263 -18880 30539 47281
557 47281 -12071 -47888 -12876 26032 39064 5738 -49832 -32760 37082 51901 -4298 -59287
569 -59287 -28570 51212 46873 -23815 -45685 -14199 32188 44984 -11797 -51092 -11956 31131
581 31131 34837 2073 -46480 -32387 36877 51148 -7743 -56931 -26504 48291 47784 -24964 -49146
594 -49146 -9289 34218 39100 -13115 -49906 -10020 34491 29674 -3800 -41074 -27961 34455
606 34455 47494 -10386 -53415 -22510 44968 45936 -24662 -51229 -5321 37909 33193 -16156 -46565
619 -46565 -7347 36659 26169 -9369 -36354 -21782 31782 43195 -11282 -49501 -17981 41525
631 41525 42360 -21954 -49839 -3854 39416 28834 -17397 -40819 -5765 34547 24261 -11250
643 -11250 -31943 -16515 27315 37785 -8848 -43719 -16121 35906 38284 -16759 -45950 -6174
655 -6174 37791 26920 -17198 -36400 -5738 30674 23771 -10681 -30460 -14021 24474 33719 -6486
668 -6486 -40326 -16900 32577 36651 -13700 -44466 -9494 36977 28648 -17890 -36576 -5793 29413
681 29413 24852 -10534 -33004 -13032 25994 31277 -7089 -38722 -17408 31478 36135 -13108 -43345
694 -43345 -11301 35673 30883 -17898 -38593 -5240 29979 24763 -10716 -34581 -12111 28668
706 28668 28845 -9649 -35830 -15769 30239 35419 -13786 -42245 -9569 34899 30522 -17792 -39781
719 -39781 -3239 32584 22696 -12621 -33795 -10009 31653 27243 -14283 -33719 -11046 29963
731 29963 33172 -15637 -41431 -5298 35135 27379 -18017 -39204 -1538 35281 20166 -15968
743 -15968 -31643 -7294 32466 25278 -18476 -31494 -5254 27816 28408 -15483 -38546 -2423 33113
756 33113 22297 -16502 -35357 -2279 33970 17950 -17450 -27735 -5568 28747 23220 -18439
768 -18439 -29386 -1981 24386 23423 -13083 -35177 -2376 30770 18475 -14875 -30828 -4165
780 -4165 31136 18076 -17772 -25740 -4496 25386 22713 -16907 -29827 -781 23942 20294 -11548
793 -11548 -32824 -3544 29793 17472 -14024 -27843 -6008 28608 20427 -17070 -26194 -3745
805 -3745 23646 22907 -14219 -30703 -1213 24823 18832 -10286 -30467 -5311 29019 18373 -13637
818 -13637 -25995 -6603 26324 22495 -15752 -27412 -2833 23345 22264 -12243 -31421 -2144
830 -2144 27100 18330 -11835 -29122 -5125 29412 19006 -15976 -25947 -4255 25776 22104 -16122
843 -16122 -29323 -984 25660 20025 -13831 -31673 -1611 30056 17053 -16411 -27947 -2206
855 -2206 29222 17724 -18662 -26127 -426 25515 18993 -16675 -29109 753 26870 16484 -15697
868 -15697 -28915 -328 29540 15070 -18785 -25587 883 26913 15224 -18817 -24738 2452
880 2452 24458 14626 -16214 -25881 1705 25933 13641 -16514 -25202 1126 27284 13667 -19162
893 -19162 -23577 3661 25156 12411 -17869 -22836 4063 23974 11478 -15825 -22384 1989 24715
906 24715 12786 -16724 -22698 2607 24955 12732 -17729 -22359 4572 23828 10806 -15931
918 -15931 -21213 3241 23261 10731 -15145 -19958 1382 22362 13169 -15456 -21700 2505 22469
931 22469 12453 -15102 -22205 3058 23176 10464 -14779 -20360 1544 22773 11267 -15612
943 -15612 -19567 1373 20962 13513 -15269 -22737 2989 22572 11510 -15013 -22717 2624 24481
956 24481 9944 -16362 -20198 1702 23420 11911 -17924 -20541 3549 21574 12463 -16376 -23557
969 -23557 4799 24108 9410 -16070 -21836 3153 25528 9342 -18478 -19232 3417 23200 11729
982 11729 -19157 -20909 6598 21985 9781 -16451 -22304 6147 24866 7023 -17030 -19110 4228
995 4228 24928 8483 -19807 -17238 6008 21526 10268 -18811 -20543 9036 22478 6363 -16674
1008 -16674 -19777 7263 24857 4755 -18532 -15929 5972 22943 7222 -20239 -15693 8239
1020 8239 19465 8171 -17394 -19887 9641 22689 3542 -17013 -16729 7140 23109 3723 -18872
1033 -18872 -13568 6620 19663 6364 -18582 -15030 8423 17288 6326 -14806 -18877 7531 22197
1046 22197 2955 -16812 -14551 6033 20771 4481 -18249 -13065 7015 17571 5821 -16655
1058 -16655 -14907 7930 16865 5434 -13383 -18076 5828 22669 3834 -17915 -14029 6766 20226
1071 20226 5050 -18583 -13746 8562 17813 4898 -16087 -15047 7996 17960 4987 -13773 -17467
1084 -17467 5468 23394 4855 -19342 -14290 8261 20260 4898 -18697 -14376 9744 18471
1096 18471 3754 -16103 -14566 8262 18824 4252 -14707 -16131 5906 22859 5095 -20100
1108 -20100 -14567 9958 20340 3501 -19386 -14180 11326 19158 1364 -17275 -13020 9435 18571
1121 18571 2343 -16232 -14380 7472 21593 3776 -20812 -14281 11806 20258 964 -20160
1133 -20160 -12811 12759 18828 -1079 -18117 -10866 10444 17194 663 -16650 -12348 8753 19303
1146 19303 2223 -19490 -13085 11862 19314 -367 -19436 -11001 12548 17463 -1844 -17353 -8928
1159 -8928 10624 15369 27 -15278 -10751 8836 17323 1428 -17190 -11856 10745 18580 -398
1172 -398 -18655 -9727 12334 16408 -1783 -16711 -8182 10927 14495 -479 -14440 -9992 8932
1185 8932 16610 912 -16191 -10955 9804 18101 357 -18621 -9697 12434 15892 -1561 -16245
1198 -16245 -8711 10862 14766 -787 -14347 -9784 8584 16414 842 -15926 -10629 8912 17595
1211 17595 1369 -18660 -10614 12466 15992 -1577 -16256 -9457 10836 15536 -1408 -15198 -9448
1224 -9448 8920 16413 286 -16822 -10144 9693 17195 839 -19154 -10998 13701 16470 -3048
1237 -3048 -17023 -9008 11852 16321 -2783 -16791 -8127 10578 16224 -1140 -17773 -8856 11499
1250 11499 16300 -633 -18768 -10115 14572 16571 -4375 -17098 -7649 12462 16166 -3783 -17355
1263 -17355 -6413 11699 14819 -2147 -17130 -7409 12377 14749 -1877 -17210 -8706 14240 15691
1276 15691 -5258 -16454 -5868 12331 14890 -4289 -17017 -4950 12284 13135 -3149 -16384
1288 -16384 -6207 12916 13229 -3520 -15947 -7133 13494 14551 -5838 -15995 -4553 11983 13447
1301 13447 -4499 -16573 -4387 12629 11864 -3924 -15389 -5681 12605 12405 -4457 -14752 -6100
1314 -6100 12017 13532 -5083 -15547 -4418 11273 12512 -3694 -15921 -4983 12109 11568 -3847
1327 -3847 -14533 -5997 11807 12556 -4281 -14583 -5644 11243 13160 -4277 -15442 -4726 11616
1340 11616 12343 -3548 -15530 -5395 12591 12325 -4468 -14995 -5404 12534 13042 -5044 -15351
1353 -15351 -4495 12243 12740 -4627 -15708 -4497 12738 12393 -4517 -15611 -5052 13270 12881
1366 12881 -5394 -15782 -4379 13239 12719 -5677 -15870 -3739 13242 12023 -5508 -15450 -3982
1379 -3982 13201 12109 -5644 -15406 -4052 13179 12363 -6073 -16095 -3216 13801 11512 -6575
1392 -6575 -15629 -2807 13925 10790 -7046 -14715 -2543 13177 10821 -6867 -14919 -2392 13093
1405 13093 10917 -6891 -15826 -1980 14394 9793 -7846 -14631 -1632 13949 9553 -8378 -13730
1418 -13730 -918 12580 9435 -7231 -14048 -1227 12556 9365 -6694 -14601 -1538 13967 8676
1431 8676 -7856 -13043 -1278 12943 9175 -8097 -12761 -86 11616 8507 -6335 -12987 -968
1444 -968 11951 8539 -5897 -13339 -1811 13504 8686 -7823 -12154 -888 12151 9110 -7866
1457 -7866 -12775 539 11564 7692 -6100 -12682 -899 12248 8014 -6279 -12823 -1835 13419
1470 13419 8780 -8500 -12216 -265 11798 8976 -7726 -13510 742 12150 7169 -6397 -12701
1483 -12701 -1053 12721 7899 -6981 -12518 -1724 13058 9114 -8863 -12763 337 11772 8536
1496 8536 -7718 -13975 857 13016 6556 -7262 -12388 -669 13103 7538 -8288 -12186 -536
1509 -536 12948 8633 -9595 -12983 1869 12429 7043 -8276 -13438 1634 13840 5545 -8728
1522 -8728 -11487 723 13343 6681 -9515 -11472 1458 12689 7341 -9771 -12486 3182 12675
1535 12675 5426 -8414 -11982 2095 13731 4898 -9274 -10275 1782 12572 5916 -9523 -10503
1548 -10503 2522 11748 6114 -9004 -11551 3349 12296 4213 -8277 -10331 2007 12615 4466
1561 4466 -9264 -9421 2282 11421 5148 -9210 -9989 2924 11074 4863 -8626 -10735 3338 11853
1575 11853 3276 -8389 -9199 2090 11555 4336 -9142 -9228 2569 10825 4693 -8884 -9877 2998
1589 2998 10827 4106 -8234 -10114 2765 11566 3344 -8327 -8764 1788 10794 4810 -8572 -9524
1603 -9524 2449 10628 4692 -8312 -9966 2583 11113 4286 -8201 -9851 2666 11537 3641 -8608
1617 -8608 -8651 2347 10690 4626 -8529 -9641 2884 11132 4188 -8614 -9687 3187 11732 3735
1631 3735 -9256 -9283 3693 11694 3123 -9321 -8392 3582 10745 3634 -8839 -9134 3646 11407
1645 11407 3345 -9229 -9111 3826 11629 3055 -9873 -8767 4591 11175 2187 -9438 -7906 4219
1659 4219 10470 2478 -8916 -8191 3926 10743 2556 -9312 -8226 4144 10892 2339 -9903 -8013
1673 -8013 5283 10455 1046 -9310 -6963 4728 9818 1266 -8923 -6890 4387 9804 1633 -9192
1687 -9192 -7190 4728 10016 1436 -9654 -7162 5707 9847 77 -8893 -5869 4799 9185 702
1701 702 -8767 -5867 4584 8840 1367 -8488 -6573 4633 9410 1269 -8842 -6753 5351 9471
1715 9471 100 -8372 -5433 4395 8759 1016 -8299 -5566 4464 8310 1494 -7721 -6487 4357
1729 4357 9197 1321 -8430 -6578 5016 9538 157 -8563 -5177 4553 8599 902 -8578 -5566 4932
1744 4932 8173 942 -7875 -6387 4579 9298 774 -8729 -6336 5188 9520 -14 -9106 -5161
1758 -5161 5118 8540 472 -8862 -5545 5489 8130 196 -8015 -6039 4780 9244 334 -8928
1772 -8928 -5893 5248 9297 -157 -9316 -4957 5595 8299 -79 -8823 -5224 5882 8105 -571
1786 -571 -8033 -5211 5102 8763 -351 -8948 -4980 5755 8583 -775 -9188 -4351 6316 7817
1800 7817 -1028 -8574 -4282 6154 7741 -1361 -8025 -3942 5534 7926 -886 -8511 -3937 6008 7700
1815 7700 -1166 -8406 -3733 6193 7341 -1438 -7967 -3493 5904 7047 -1399 -7524 -3378 5359 7016
1830 7016 -942 -7767 -3594 5506 6918 -1188 -7649 -3542 5502 6806 -1407 -7544 -3194 5352 6448
1845 6448 -1353 -7324 -3275 5245 6409 -1227 -7302 -3388 5284 6476 -1411 -7319 -3219 5182 6494
1860 6494 -1330 -7514 -3082 5407 6190 -1472 -7201 -3156 5285 6373 -1506 -7087 -3121 5176 6424
1875 6424 -1342 -7264 -2963 5040 6380 -1062 -7466 -3290 5568 6360 -1402 -7112 -3190 5464 6473
1890 6473 -1673 -7224 -2886 5261 6465 -1520 -7445 -2559 5410 6093 -1281 -7312 -2978 5976 6225
1905 6225 -2055 -7164 -2621 5893 6364 -2347 -7277 -2051 5690 5959 -2160 -7375 -1840 5867 5347 -1905
1921 -1905 -6960 -2511 6137 5851 -2684 -6949 -1986 5827 5798 -2795 -7180 -1406 5745 5217 -2493 -7107
1937 -7107 -1410 5837 4541 -2289 -6266 -2236 5600 5410 -2900 -6598 -1414 5385 5127 -2754 -6854
1952 -6854 -1062 5535 4452 -2537 -6559 -1114 5794 3869 -2603 -5406 -1698 5142 5065 -2894 -6266
1967 -6266 -872 5174 4524 -2509 -6376 -773 5503 3987 -2534 -5897 -951 5626 3793 -2755 -5008
1982 -5008 -1390 4649 4893 -2472 -6054 -719 4934 4236 -2131 -6072 -1096 5450 3991 -2423 -5630
1997 -5630 -1122 5374 3920 -2712 -4877 -1106 4324 4793 -2097 -6106 -915 5052 4130 -2158 -5931
2012 -5931 -1246 5541 4042 -2712 -5575 -966 5308 3986 -3033 -5250 -719 4429 4295 -2275 -6189
2027 -6189 -757 5381 3749 -2583 -5864 -1032 5551 3874 -3230 -5616 -577 5261 3844 -3263 -5397
2042 -5397 -301 4685 3769 -2502 -5919 -634 5463 3538 -2902 -5362 -682 5465 3645 -3372 -5337
2057 -5337 -187 5171 3469 -3238 -5201 207 4816 3108 -2713 -5221 -257 5284 3117 -3095 -4968
2072 -4968 -102 5167 3179 -3397 -4841 353 4882 2864 -3123 -4772 553 4736 2562 -2852 -4624
2087 -4624 56 4931 2786 -3086 -4469 235 4695 2749 -3129 -4468 414 4516 2577 -2880 -4397
2102 -4397 312 4502 2411 -2753 -4181 -31 4384 2694 -2814 -4315 106 4260 2588 -2759 -4259
2117 -4259 83 4196 2438 -2701 -4176 33 4232 2389 -2683 -4161 -72 4165 2645 -2656 -4347
2132 -4347 69 4283 2441 -2799 -4155 130 4147 2376 -2756 -4146 108 4240 2453 -2750 -4163
2147 -4163 191 4262 2475 -2758 -4299 247 4480 2363 -2943 -4037 327 4249 2436 -2806 -4056
2162 -4056 323 4245 2439 -2814 -4196 402 4431 2325 -2891 -4171 420 4591 2262 -3111 -3799
2177 -3799 655 4246 2109 -2988 -3888 705 4211 2113 -2986 -3965 720 4491 1869 -3206 -3776 788
2193 788 4388 1679 -3352 -3471 1118 3998 1646 -3138 -3611 977 4003 1542 -2941 -3644 834 4203
2209 4203 1509 -3184 -3396 926 4030 1499 -3265 -3226 1188 3675 1272 -2923 -3293 896 3683 1378
2225 1378 -2781 -3324 607 3921 1375 -3109 -3122 920 3704 1411 -3090 -3041 1202 3504 1111 -2690
2241 -2690 -2952 868 3532 1228 -2515 -3001 650 3690 1486 -2920 -2964 1062 3544 1369 -2864 -2971
2257 -2971 1175 3555 1117 -2660 -2867 835 3546 1295 -2593 -2884 703 3588 1578 -2852 -3071 952
2273 952 3595 1418 -2763 -3150 1127 3585 1032 -2746 -2888 866 3466 1288 -2677 -2909 792 3574
2289 3574 1489 -2944 -3113 1103 3634 1119 -2974 -3000 1290 3690 794 -2967 -2667 1128 3428 890
2305 890 -2921 -2713 1149 3448 1042 -3014 -2839 1326 3578 777 -3114 -2777 1411 3584 525 -3052
2321 -3052 -2426 1409 3259 647 -2925 -2519 1317 3308 719 -2956 -2526 1458 3363 633 -2974 -2405
2337 -2405 1572 3348 484 -2929 -2129 1539 3101 506 -2679 -2134 1424 3054 554 -2713 -2160 1410
2353 1410 3143 474 -2719 -2132 1567 3035 315 -2728 -1977 1570 2855 293 -2579 -1983 1359 2829
2369 2829 451 -2626 -1968 1303 2755 503 -2606 -2088 1367 2818 335 -2565 -1989 1343 2803 272
2385 272 -2474 -1932 1173 2754 531 -2572 -1957 1234 2710 577 -2536 -2134 1337 2781 393 -2516
2401 -2516 -2092 1118 2887 266 -2629 -1882 1247 2731 430 -2704 -1979 1448 2615 259 -2458 -2018
2417 -2018 1335 3032 451 -2564 -1891 1200 2962 246 -2779 -1814 1537 2701 267 -2670 -1885 1594
2433 1594 2703 185 -2554 -1878 1596 2827 101 -2591 -1859 1442 2900 386 -3011 -1566 1907
2448 1907 2206 -51 -2284 -1677 1808 2652 -219 -2417 -1498 1512 2519 -71 -2413 -1510 1792 2773
2464 2773 206 -2828 -1403 1600 2332 -105 -2600 -1736 1793 2285 -278 -2489 -1296 1519 2045 -288
2480 -288 -2714 -941 1466 2182 -220 -2703 -1447 1801 2136 -81 -2325 -1121 1317 2167 -231 -2628
2496 -2628 -1014 1839 2215 53 -2356 -1075 1733 2253 -248 -2441 -1180 1922 2189 -168 -2287 -1202
2512 -1202 1324 1804 -144 -2091 -847 1416 2330 -62 -2385 -1316 1085 1921 -23 -2096 -1489 1561
2528 1561 2322 115 -1867 -980 1454 2227 -18 -2303 -1000 1550 2115 -241 -2071 -950 1204 2066
2544 2066 -309 -1901 -1050 1310 1981 -347 -2259 -1145 1286 2435 -89 -2546 -1192 1559 1802 -206
2560 -206 -2228 -973 1631 1911 -241 -2053 -1016 1564 2205 -348 -2197 -1016 1293 1706 -349 -2411
2576 -2411 -757 1738 1801 -774 -2395 -1142 1599 1643 -236 -1812 -1227 2001 1933 -437 -2006 -674 1716
2593 1716 1999 -497 -2130 -797 1569 1790 -569 -2402 -509 1483 1818 -395 -2088 -879 1554 1747
2609 1747 -360 -2096 -850 1684 1581 -725 -1892 -805 1640 1618 -559 -1953 -533 1506 1626 -405
2625 -405 -1779 -586 1466 1732 -426 -1795 -660 1504 1612 -511 -1805 -496 1418 1405 -442 -1799
2641 -1799 -629 1459 1426 -506 -1682 -663 1425 1601 -534 -1739 -680 1345 1589 -511 -1827 -557
2657 -557 1321 1447 -430 -1874 -785 1427 1484 -461 -1760 -696 1374 1609 -512 -1861 -668 1403
2673 1403 1533 -436 -1968 -557 1441 1444 -463 -1793 -700 1483 1488 -558 -1819 -660 1330 1562 -642
2690 -642 -1865 -404 1381 1466 -552 -1688 -378 1519 1321 -664 -1802 -591 1522 1674 -646 -1687
2706 -1687 -470 1296 1418 -752 -2057 -77 1355 1218 -585 -1774 -368 1292 1324 -914 -1356 -475
2722 -475 1671 1074 -785 -1655 -314 1378 1170 -621 -1758 -51 1288 1321 -562 -1753 -355 1569
2738 1569 1122 -900 -1599 -163 1223 1086 -685 -1663 -203 1289 928 -840 -1465 -188 1326 879 -655
2755 -655 -1399 -336 1380 741 -669 -1254 -42 1141 849 -676 -1356 -174 1159 1002 -448 -1425 -154
2772 -154 1073 765 -642 -1481 -344 1304 1066 -763 -1356 -291 1301 813 -496 -1299 -359 1191 1173
2789 1173 -646 -1556 -430 1341 1029 -752 -1366 37 1234 1224 -275 -1367 -272 768 694 -462 -1694
2806 -1694 -109 1013 1088 -447 -1263 -232 1703 815 -462 -1585 40 788 982 -956 -1513 208 927
2823 927 873 -681 -1531 -367 1555 768 -686 -1498 -214 1498 785 -796 -1317 -92 1168 920 -855
2840 -855 -1377 -194 1367 835 -789 -1314 -79 1221 725 -983 -1469 -80 1282 678 -856 -1325 56
2857 56 1237 702 -814 -1133 96 1175 595 -771 -1076 47 1020 625 -729 -1093 102 1140 654
2874 654 -670 -1045 111 1173 555 -839 -943 112 1122 531 -736 -927 95 1048 632 -618 -1022
2891 -1022 93 1030 666 -651 -1031 79 1112 523 -662 -917 108 984 535 -659 -878 103 930
2908 930 558 -649 -897 32 924 520 -668 -907 38 1048 591 -685 -867 105 905 517 -687 -909
2926 -909 80 858 525 -590 -897 32 870 427 -683 -923 65 967 447 -736 -924 56 922 491 -645
2945 -645 -946 123 932 501 -650 -895 28 1015 518 -696 -903 157 972 490 -726 -869 164 1003
2963 1003 413 -710 -808 202 979 423 -656 -804 168 1040 425 -689 -774 236 931 390 -714 -815
2981 -815 254 980 344 -663 -764 242 903 273 -677 -699 218 914 299 -653 -675 273 830 314 -729
3000 -729 -742 250 851 289 -669 -632 253 864 243 -599 -637 198 777 307 -664 -660 197 757 261 -537 -621 188
3022 188 756 227 -606 -640 187 724 224 -630 -664 158 727 186 -609 -623 156 683 235 -516 -625 203 690
3043 690 284 -587 -602 123 739 227 -585 -564 153 765 269 -552 -570 150 680 227 -541 -640 132 725 271
3064 271 -547 -599 155 775 298 -525 -617 197 765 297 -587 -599 230 709 224 -512 -577 200 716 246 -520
3085 -520 -602 220 745 216 -647 -550 205 670 195 -640 -529 248 673 178 -580 -520 262 663 199 -577 -547
3106 -547 313 693 151 -594 -429 241 669 126 -630 -523 277 622 93 -625 -477 306 608 80 -537 -461
3126 -461 317 588 106 -625 -476 291 566 82 -602 -450 304 548 16 -509 -348 301 559 47 -535 -349
3146 -349 258 552 28 -556 -343 363 544 34 -443 -276 245 520 59 -368 -337 277 524 72 -466 -267
3166 -267 257 493 108 -445 -338 277 485 79 -414 -331 235 484 55 -448 -421 175 534 31 -508 -375 186
3187 186 505 135 -476 -399 250 502 108 -439 -330 213 526 36 -433 -388 178 536 60 -470 -368 241 471
3208 471 123 -449 -379 262 441 28 -482 -383 243 548 37 -465 -346 204 487 55 -531 -332 253 511 3
3229 3 -496 -310 334 548 -16 -485 -253 300 478 -5 -492 -280 263 495 6 -448 -257 314 508 14 -474
3250 -474 -273 330 515 -45 -432 -202 319 385 -39 -434 -168 336 346 -47 -381 -213 301 345 -32 -476 -190
3271 -190 295 363 -82 -411 -158 211 312 -5 -365 -174 246 233 49 -413 -246 241 345 9 -365 -212 295
3292 295 370 -62 -333 -175 206 327 6 -297 -158 236 350 24 -348 -213 226 321 -13 -315 -179 171 373
3313 373 -22 -322 -209 210 295 8 -375 -189 196 315 -20 -341 -202 166 293 44 -377 -229 249 305 -34
3334 -34 -307 -157 254 369 0 -243 -124 245 352 10 -261 -209 249 417 20 -300 -218 257 344 -62 -360
3355 -360 -130 289 318 -83 -324 -115 219 288 -79 -325 -192 200 244 -70 -363 -152 218 280 -130 -350 -100
3376 -100 196 233 -33 -330 -74 223 180 -86 -319 -105 182 223 -100 -326 -104 242 281 -60 -333 -31 231
3397 231 189 -95 -260 -44 245 196 -100 -234 -37 181 192 -68 -224 -104 203 190 -65 -248 -139 188 213 -77
3419 -77 -229 -102 152 135 -112 -178 -88 183 180 14 -178 -57 102 207 43 -253 -67 206 168 25 -188 -86
3441 -86 220 240 -6 -219 -70 33 242 22 -205 -127 67 264 -19 -189 -201 177 246 23 -213 -197 172 245
3463 245 -29 -225 -164 106 227 -1 -192 -135 151 193 4 -282 -129 207 249 -34 -220 -93 152 192 -2 -266
3485 -266 -113 192 178 -68 -254 -92 177 172 -1 -302 -118 185 230 -68 -286 -96 190 204 -90 -251 -65 147
3507 147 125 -95 -211 -29 172 158 -62 -186 -40 140 170 -78 -216 -23 157 146 -30 -129 -27 201 107 9
3529 9 -90 -35 138 159 -46 -97 -42 153 164 -82 -149 -49 168 122 -14 -110 -10 181 122 -86 -152 -44 93 78 -40
3554 -40 -75 -67 93 71 -39 -168 -62 70 61 -34 -187 -58 95 145 16 -164 -8 119 105 36 -172 -48 91 172
3578 172 -11 -192 -39 62 169 -34 -168 -58 160 198 8 -122 -111 130 150 -37 -180 -53 90 131 -91
3599 -91 -189 -85 115 132 -72 -179 -60 74 152 -98 -184 -40 130 71 -56 -146 -15 165 178 14 -173 35 117
3622 117 164 -46 -144 26 147 154 -42 -203 44 167 112 -34 -158 -28 143 191 -98 -130 -32 155 72 -138 -135 -4
3646 -4 97 63 -134 -145 -24 94 61 -101 -113 -21 119 27 -34 -89 -10 116 56 -76 -44 -4 71 11 -117 -106 46 115
3672 115 41 -29 -48 27 72 30 -12 -88 -9 61 43 -28 -96 -2 56 107 -22 -125 -25 98 73 12 -131 -75 58 57 -15
3699 -15 -49 -21 40 72 7 -131 13 78 75 -24 -64 -5 62 148 -29 -92 -56 94 194 18 -122 -46 98 109 -38 -108
3725 -108 -28 73 131 -49 -121 4 74 95 -57 -134 -63 107 57 -42 -94 -62 52 123 -95 -184 -35 153 75 -96 -192
3750 -192 -22 138 4 -93 -177 31 105 49 -136 -135 -28 107 46 -75 -55 44 107 10 -75 -119 58 97 38 -70 -82
3775 -82 56 97 60 -79 -81 7 89 11 -33 -79 -5 54 29 -117 -37 76 88 -36 -86 -53 8 55 10 -57 -64 -9 73 57 2
3804 2 -24 -42 88 72 -14 -45 33 96 57 23 2 -15 57 57 -83 -31 -38 133 102 11 -45 -5 31 -17 12 -100 -18 65 33 -43
3834 -43 -78 -44 46 122 -23 -136 -52 76 74 -52 -88 -32 84 103 1 -141 -46 80 82 0 -114 -31 71 113 -29 -129
3860 -129 -48 87 64 -18 -137 8 93 70 -27 -120 -19 198 95 -79 -112 28 138 100 -88 -123 -34 129 81 -129
3884 -129 -102 -24 127 97 -86 -85 3 130 99 -86 -135 28 137 29 -58 -132 16 100 39 -125 -98 9 104 38 -97
3909 -97 -88 65 147 143 -76 -114 -10 113 41 -40 -93 9 92 -67 -12 -101 -54 73 59 -51 -50 -35 90 45 -18 -99 -14
3936 -14 74 25 -66 -76 -51 97 90 -41 -50 -71 50 59 -22 -83 10 57 137 12 -90 -75 88 103 -30 -77 7 153 67 -52
3964 -52 -88 -71 121 149 -54 -157 -46 101 161 -53 -139 1 118 90 -24 -151 -38 186 88 -12 -138 -49 144
3987 144 110 -84 -126 -34 160 64 -36 -148 -19 158 104 -137 -132 14 200 54 -161 -151 31 151 106 -187 -151
4010 -151 61 153 70 -134 -168 62 209 44 -107 -151 37 116 20 -150 -143 63 179 34 -122 -134 47 125 42 -146
4034 -146 -92 40 119 -37 -161 -36 46 104 -10 -80 -84 52 78 -31 -63 -61 76 109 31 -12 -102 24 112 36 -117 -95
4060 -95 30 84 39 -95 -21 3 53 30 -106 -34 48 119 26 -70 -49 -29 105 16 -77 -105 24 93 63 -79 -96 33 134
4087 134 25 -107 -68 -25 110 62 -28 -115 9 155 82 -75 -138 -43 108 62 -68 -112 -3 137 92 -72 -134 2
4111 2 161 63 -87 -141 26 140 72 -155 -186 38 123 41 -133 -178 14 174 23 -185 -102 68 157 31 -124 -124
4135 -124 95 222 16 -226 -102 41 174 -10 -148 -71 65 180 -18 -147 -57 72 215 17 -111 -71 111
4156 111 95 -61 -194 -115 125 92 -80 -132 -104 134 136 -14 -154 -42 110 155 -71 -197 -80 74 121 -36 -137
4179 -137 -75 59 56 -58 -106 -55 104 104 -47 -124 -50 91 117 -24 -127 -13 104 53 -33 -138 -33 58 74 -8 -98
4204 -98 -43 59 101 -35 -133 -68 88 63 -45 -79 -90 6 108 -24 -81 -69 11 133 -6 -72 -75 68 118 -31 -83 -104
4230 -104 65 104 45 -139 -130 81 138 5 -125 -120 153 174 33 -115 -116 83 224 -3 -172 -100 170 90 1 -141
4254 -141 -134 125 140 -41 -196 -81 139 114 -32 -223 -92 163 164 -22 -193 -30 133 143 -38 -214 -81 113
4276 113 111 -71 -253 -29 197 175 -56 -141 -35 159 141 -31 -177 -4 182 142 -34 -195 -14 177 110 -117
4298 -117 -185 9 153 113 -130 -161 -7 156 93 -161 -172 -37 189 73 -75 -100 -24 124 48 -69 -171 -22 125
4321 125 42 -107 -97 31 130 138 -90 -150 48 137 82 -10 -118 33 158 71 -31 -56 -15 151 127 -1 -73 -11 158
4346 158 79 -67 -139 -22 118 96 -36 -171 -63 169 174 -46 -157 -65 98 62 -92 -146 -81 160 146 -134 -148 -28
4370 -28 104 102 -96 -162 -21 116 100 -67 -192 -27 168 163 -59 -258 -76 236 152 -151 -217 16 252 135 -171
4393 -171 -255 18 250 88 -153 -272 12 246 52 -123 -303 24 266 99 -225 -201 82 208 62 -193 -221
4414 -221 26 289 111 -203 -231 166 293 15 -246 -142 120 283 64 -222 -159 138 232 43 -172 -125 140
4435 140 257 52 -163 -138 129 260 29 -264 -167 108 210 -14 -224 -129 155 199 47 -218 -113 64 172
4456 172 -21 -198 -153 119 160 -35 -188 -130 109 197 -40 -175 -149 19 189 23 -120 -95 102 190 75 -204
4478 -204 -124 86 159 64 -155 -107 85 150 33 -119 -100 154 168 1 -133 -155 70 215 98 -157 -147 83 194
4501 194 45 -173 -223 111 198 106 -196 -150 96 200 71 -212 -161 107 256 94 -202 -189 144 284 52 -267
4523 -267 -180 133 328 76 -242 -209 153 255 13 -278 -160 180 245 9 -340 -183 237 300 -38 -314 -174
4544 -174 201 339 -53 -304 -120 209 236 -49 -347 -174 216 260 -87 -324 -84 248 224 -143 -336 -75 216
4565 216 253 -112 -332 -55 191 203 -103 -308 26 199 212 -114 -267 -77 255 201 -117 -235 -83 274 165
4586 165 -166 -301 -74 217 182 -80 -284 -52 238 182 -108 -250 -116 257 119 -123 -243 -35 181 139 -80
4607 -80 -265 -139 173 181 -74 -186 -85 195 168 -64 -233 -90 222 176 -62 -292 -91 202 221 -102 -246 -86
4629 -86 217 235 -114 -235 -54 215 223 -70 -332 -103 233 263 -95 -327 -128 230 170 -116 -317 -148 227 278
4651 278 -117 -370 -145 239 246 -83 -379 -157 281 273 -170 -371 -73 266 289 -116 -344 -90 311 283 -150 -374
4673 -374 -62 327 229 -123 -372 -65 370 173 -199 -376 -50 336 239 -254 -371 54 359 223 -210 -371 54
4694 54 341 175 -241 -300 45 385 153 -244 -302 41 343 148 -213 -290 36 374 119 -293 -259 97 276 199
4716 199 -230 -271 33 268 134 -228 -233 44 348 120 -220 -257 23 300 151 -203 -249 48 297 118 -238 -231
4738 -231 7 261 80 -230 -236 -3 249 133 -195 -253 -11 246 134 -200 -278 18 235 95 -150 -251 35
4759 35 323 159 -225 -272 3 251 212 -187 -255 -33 276 221 -227 -277 -15 337 197 -232 -343 15 317 207
4781 207 -238 -275 16 400 205 -244 -297 -5 361 213 -278 -356 1 414 202 -309 -372 26 426 205 -300
4802 -300 -359 49 390 94 -340 -363 118 388 134 -310 -408 142 472 165 -323 -402 117 362 104 -341 -385 142
4824 142 373 97 -380 -342 124 473 114 -363 -286 153 433 65 -437 -299 172 418 28 -331 -270 150 357
4845 357 2 -355 -273 154 365 93 -378 -278 202 387 12 -343 -248 218 355 25 -343 -278 236 359 -21
4866 -21 -308 -209 143 385 98 -319 -211 182 354 55 -328 -196 125 364 19 -300 -240 122 345 45 -322
4887 -322 -267 177 311 57 -293 -268 146 353 68 -301 -262 120 348 57 -376 -289 160 459 73 -365 -291 116
4909 116 443 154 -326 -304 191 400 133 -402 -332 166 441 80 -367 -372 216 436 44 -430 -330 184 434
4930 434 95 -429 -360 252 486 29 -422 -290 226 504 1 -484 -301 246 465 26 -466 -304 275 484
4950 484 13 -419 -281 334 415 -62 -450 -269 287 400 -22 -486 -199 370 440 -80 -438 -147 305 424 -55
4971 -55 -503 -226 357 381 -96 -429 -242 316 386 -132 -451 -207 266 403 -101 -417 -181 297 318 -95 -376
4992 -376 -180 322 372 -38 -429 -178 259 373 -65 -396 -129 302 308 -89 -355 -151 262 351 -27 -339 -146
5013 -146 246 421 -41 -455 -231 269 381 -32 -431 -234 261 355 -40 -406 -209 255 364 -20 -393 -271
5033 -271 345 350 -34 -368 -237 263 368 -35 -415 -210 301 428 -38 -410 -256 332 438 -39 -377 -263 309
5054 309 419 -97 -482 -228 304 418 -50 -509 -188 386 457 -55 -509 -226 376 449 -95 -552 -157 433 449
5075 449 -102 -542 -196 464 430 -110 -523 -215 412 433 -140 -549 -152 418 419 -127 -508 -86 388 416 -218 -500
5097 -500 -149 401 444 -164 -447 -87 409 359 -216 -447 -87 423 353 -203 -475 -87 396 338 -192 -442 -129
5118 -129 358 286 -193 -496 -78 380 311 -248 -476 -73 367 270 -187 -406 -78 328 321 -159 -383 -80 330 311
5140 311 -211 -397 -62 410 320 -125 -420 -70 356 306 -166 -402 -103 350 350 -131 -438 -104 314 388 -85 -463
5162 -463 -110 347 357 -115 -446 -119 295 389 -122 -451 -192 341 351 -111 -545 -148 357 340 -145 -492 -166
5183 -166 372 355 -165 -465 -147 449 373 -135 -470 -95 421 400 -180 -568 -106 427 419 -217 -492 -87 473 408
5205 408 -241 -547 -127 461 371 -228 -527 -47 466 297 -248 -555 -29 483 277 -254 -492 22 485 303
5225 303 -306 -505 -45 523 324 -255 -459 34 460 281 -301 -501 74 485 297 -297 -501 36 483 238
5245 238 -319 -419 6 488 261 -281 -482 10 498 296 -292 -427 20 457 207 -296 -433 -18 403 193
5265 193 -296 -409 36 434 225 -328 -412 43 420 217 -210 -426 -15 381 227 -305 -341 -9 378 253 -266
5286 -266 -406 -19 443 312 -196 -373 24 471 287 -218 -456 21 368 304 -309 -444 -27 380 273 -283
5306 -283 -495 -41 486 316 -268 -494 -81 464 308 -249 -450 -49 513 281 -327 -501 -42 510 264 -284
5326 -284 -433 -12 516 352 -347 -555 90 504 339 -303 -514 77 541 284 -330 -456 43 534 251 -360
5346 -360 -522 36 553 254 -404 -486 86 497 227 -392 -485 104 514 199 -437 -476 105 523 188 -406 -417
5367 -417 169 562 175 -389 -447 135 467 136 -405 -416 118 541 152 -370 -455 154 468 130 -361 -399 121
5388 121 462 181 -376 -381 57 458 161 -344 -378 117 474 127 -345 -382 81 440 182 -349 -411 49 416 228
5410 228 -336 -391 131 467 199 -274 -391 46 491 209 -343 -386 146 482 217 -325 -403 47 496 199 -341
5431 -341 -354 126 473 233 -311 -426 128 493 226 -364 -455 65 491 252 -425 -451 130 510 271 -395 -447
5452 -447 107 528 258 -469 -433 156 543 241 -438 -453 116 583 216 -497 -467 130 524 179 -467 -451 178
5473 178 590 108 -522 -453 241 601 118 -433 -420 273 551 111 -433 -412 202 561 74 -500 -396 225 520
5494 520 87 -473 -360 265 534 67 -524 -371 231 528 18 -476 -332 257 453 48 -415 -327 199 534
5514 534 45 -498 -328 253 511 78 -444 -322 233 472 42 -469 -309 283 501 55 -352 -329 279 456
5534 456 -17 -390 -311 256 496 103 -459 -351 218 470 54 -395 -312 219 459 72 -433 -362 177 456 77
5555 77 -421 -345 161 431 131 -408 -354 215 545 54 -479 -396 207 517 68 -455 -386 209 497 125 -431 -388
5577 -388 234 532 103 -451 -378 252 581 133 -493 -392 307 526 12 -556 -366 242 500 55 -565 -414
5597 -414 309 542 51 -549 -427 276 511 15 -540 -371 325 520 13 -565 -326 267 600 -7 -563 -346
5617 -346 330 582 -19 -506 -276 376 542 -30 -546 -295 383 506 -65 -522 -304 335 522 -70 -560 -318
5637 -318 412 436 -80 -546 -206 371 486 -78 -569 -253 411 414 -88 -562 -222 371 408 -84 -504 -245 345
5658 345 444 -76 -523 -244 333 444 -108 -525 -227 371 494 -75 -450 -227 340 429 -79 -474 -204 304 454
5679 454 -61 -468 -241 348 458 -101 -509 -262 299 467 -36 -518 -284 343 454 -88 -529 -313 351 480
5699 480 -11 -525 -291 378 522 -26 -503 -248 357 510 -32 -577 -251 378 512 -66 -533 -263 427 523
5719 523 -46 -546 -247 393 572 -59 -585 -270 427 478 -139 -563 -276 427 519 -146 -629 -231 442 561 -133
5740 -133 -613 -177 441 496 -162 -575 -211 493 484 -197 -643 -238 523 494 -218 -600 -182 435 463 -192 -543 -125
5762 -125 496 443 -261 -582 -95 493 481 -244 -559 -112 480 415 -198 -503 -116 474 399 -218 -588 -90 430
5783 430 412 -180 -559 -132 491 401 -196 -550 -149 463 398 -129 -530 -148 436 360 -208 -513 -111 436 443 -198
5805 -198 -508 -101 492 409 -223 -545 -155 415 406 -207 -522 -193 455 445 -198 -532 -154 472 419 -209 -565 -147
5827 -147 500 434 -224 -555 -173 455 390 -220 -604 -139 518 425 -185 -602 -112 483 443 -185 -599 -148 545
5848 545 491 -233 -586 -92 607 453 -306 -613 -115 562 466 -267 -633 -76 561 402 -277 -629 -46 631 447
5869 447 -328 -630 -74 609 397 -322 -637 -63 578 424 -355 -611 26 609 361 -324 -658 15 599 372
5889 372 -377 -603 15 523 298 -394 -624 -17 568 342 -403 -570 72 529 390 -367 -542 70 545 299
5909 299 -377 -571 8 612 279 -359 -519 -3 542 275 -319 -565 22 506 279 -395 -538 25 534 305
5929 305 -357 -494 40 532 277 -327 -573 23 541 292 -358 -524 -6 515 282 -339 -517 14 533 349
5949 349 -378 -502 1 551 371 -315 -460 0 496 291 -342 -575 36 551 374 -338 -609 -40 538 312
5969 312 -311 -560 14 522 298 -402 -603 43 573 327 -377 -581 24 576 349 -380 -578 39 675 322
5989 322 -392 -568 80 602 319 -465 -588 117 570 288 -441 -602 148 625 273 -426 -554 153 615 270
6009 270 -470 -536 86 627 196 -458 -567 135 611 216 -504 -535 185 601 217 -560 -469 174 594 187 -519
6030 -519 -521 161 613 165 -503 -493 177 583 191 -473 -479 170 598 137 -487 -455 214 563 184 -456 -462 180 539
6053 539 161 -420 -460 184 569 196 -414 -430 209 529 197 -507 -503 132 492 208 -470 -469 165 532 143 -458
6075 -458 -472 166 532 117 -456 -406 187 622 230 -447 -472 149 525 192 -464 -466 144 557 171 -434 -516 161
6097 161 562 174 -462 -489 210 580 218 -511 -473 160 589 149 -451 -490 154 588 236 -501 -469 204 637
6118 637 132 -565 -486 225 636 136 -565 -495 215 599 146 -549 -499 248 574 139 -575 -467 254 587 133
6139 133 -559 -408 296 655 35 -577 -475 298 595 111 -553 -404 354 599 33 -581 -381 236 574 25
6159 25 -577 -348 335 593 29 -562 -409 295 516 27 -522 -339 319 536 16 -526 -353 336 567 -23
6179 -23 -554 -362 301 531 8 -499 -354 313 503 64 -486 -263 314 499 54 -507 -343 260 539 79
6199 79 -554 -325 290 475 -11 -561 -358 277 487 32 -516 -370 288 531 16 -542 -402 290 548 13
6219 13 -525 -369 245 488 51 -581 -356 273 552 34 -491 -405 275 539 27 -547 -370 344 548 62 -525
6240 -525 -311 326 575 27 -561 -384 281 602 3 -530 -360 349 525 33 -602 -377 386 586 -51 -587
6260 -587 -394 405 587 -27 -626 -340 367 559 -34 -596 -343 370 524 -127 -513 -310 415 573 -75 -600
6280 -600 -273 379 571 -78 -623 -256 445 544 -106 -583 -250 480 503 -99 -526 -224 410 471 -131 -599 -227
6301 -227 469 523 -89 -590 -271 432 501 -103 -569 -254 402 442 -156 -523 -239 391 462 -112 -521 -222 401
6322 401 466 -120 -492 -233 410 473 -101 -533 -157 433 476 -99 -517 -178 386 429 -140 -490 -237 453 403 -80
6344 -80 -532 -233 339 450 -109 -524 -224 335 486 -107 -522 -179 347 460 -140 -598 -244 394 499 -131
6364 -131 -528 -266 428 486 -176 -595 -217 452 456 -105 -608 -191 448 478 -150 -549 -185 406 464 -185 -574 -245
6386 -245 432 483 -171 -559 -206 486 478 -132 -545 -193 488 486 -218 -620 -184 471 461 -186 -590 -170 490 448
6408 448 -217 -535 -150 471 408 -198 -550 -172 447 424 -256 -558 -146 485 441 -249 -546 -176 517 405 -266
6429 -266 -584 -77 428 354 -255 -570 -112 449 391 -199 -539 -111 454 360 -260 -523 -74 467 398 -264 -560
6450 -560 -154 470 344 -260 -540 -84 431 401 -256 -475 -93 417 340 -245 -488 -98 433 386 -210 -478 -74
6471 -74 438 378 -187 -453 -48 442 334 -179 -541 -90 462 372 -202 -529 -65 436 356 -239 -530 -128 462
6492 462 343 -247 -552 -64 411 351 -249 -562 -88 469 393 -261 -564 -91 492 373 -253 -573 -97 459 335
6513 335 -255 -515 -80 492 365 -305 -511 -26 508 362 -280 -549 -37 561 390 -260 -529 -68 493 309
6533 309 -265 -520 4 537 350 -290 -533 -58 497 285 -335 -510 7 444 343 -326 -511 40 473 327
6553 327 -365 -525 15 523 250 -345 -521 -4 472 258 -322 -477 45 504 281 -320 -476 -2 533 253
6573 253 -325 -510 23 500 274 -313 -467 14 499 265 -316 -442 21 470 220 -311 -411 54 406 315
6593 315 -339 -434 49 444 244 -320 -402 52 444 272 -320 -414 14 427 227 -340 -474 4 453 307 -326
6614 -326 -455 4 430 283 -322 -455 54 435 311 -323 -486 -23 448 263 -341 -462 16 460 257 -337
6634 -337 -496 -17 460 271 -365 -417 11 468 262 -286 -424 49 456 264 -331 -429 42 476 261 -323 -445
6655 -445 35 494 215 -317 -503 105 457 224 -366 -402 89 472 273 -378 -388 67 494 215 -379 -421 108
6676 108 490 183 -396 -438 12 485 139 -419 -377 105 494 189 -383 -407 88 458 190 -366 -440 94 455
6697 455 140 -377 -390 127 443 133 -349 -304 153 424 105 -362 -370 116 409 195 -349 -349 116 445 136 -389
6719 -389 -381 140 425 176 -357 -415 154 413 153 -382 -330 149 439 114 -350 -420 112 476 167 -401 -392 83
6741 83 405 134 -373 -393 135 402 137 -312 -330 100 426 118 -340 -357 136 427 188 -367 -392 183 466 146
6763 146 -313 -337 73 413 139 -344 -377 173 388 115 -390 -373 166 453 152 -367 -366 146 440 119 -417 -406
6785 -406 150 461 131 -452 -423 148 399 105 -373 -359 156 402 100 -406 -384 148 459 30 -361 -224 133
6806 133 482 45 -351 -316 177 408 75 -431 -351 137 442 17 -414 -282 175 493 75 -416 -288 240 393
6827 393 -17 -385 -277 206 420 16 -401 -307 163 372 59 -376 -256 181 377 43 -376 -256 185 325
6847 325 89 -348 -265 200 413 20 -337 -279 244 392 24 -356 -264 261 401 -16 -348 -256 179 368 83
6868 83 -357 -277 220 377 -20 -376 -236 177 360 55 -381 -252 169 353 2 -360 -228 180 372 80 -391
6889 -391 -250 210 357 3 -320 -220 211 384 8 -306 -269 195 425 36 -377 -263 157 379 11 -421
6909 -421 -258 182 378 53 -405 -252 187 344 -23 -386 -276 226 398 -25 -418 -217 232 369 -2 -384
6929 -384 -283 247 386 -10 -405 -266 310 400 -21 -382 -165 295 330 -62 -436 -221 240 325 -7 -415 -197
6950 -197 241 387 -14 -394 -95 243 382 -50 -389 -227 176 367 0 -328 -210 257 357 -15 -382 -188
6970 -188 249 274 -119 -358 -161 313 305 -23 -357 -163 262 352 -33 -340 -178 241 321 -104 -316 -150 308 304
6992 304 -43 -335 -104 249 363 -17 -339 -140 287 366 -24 -322 -127 250 348 -35 -374 -138 176 365 -76
7013 -76 -337 -151 244 374 -62 -342 -172 219 300 -53 -396 -151 253 350 -35 -366 -141 196 302 -117 -378
7034 -378 -189 253 339 -144 -340 -122 316 301 -60 -328 -194 343 321 -35 -365 -160 267 313 -95 -354 -133
7055 -133 284 292 -95 -382 -151 234 277 -88 -380 -136 262 270 -115 -361 -131 224 299 -135 -357 -72 273 323
7077 323 -168 -339 -158 316 214 -86 -355 -140 307 239 -119 -318 -100 242 256 -87 -262 -95 234 304 -124
7098 -124 -304 -69 290 244 -110 -350 -76 235 289 -147 -318 -70 249 206 -105 -326 -104 265 274 -120 -321 -122
7120 -122 254 229 -115 -302 -63 201 259 -101 -357 -83 235 304 -108 -289 -102 289 258 -114 -323 -94 233
7141 233 264 -154 -315 -116 292 204 -92 -372 -97 265 293 -117 -294 -80 273 253 -100 -266 -88 258 255 -113
7163 -113 -294 -79 297 209 -144 -302 -75 257 265 -107 -310 -72 292 290 -133 -299 -90 292 203 -140 -288 -60
7185 -60 325 229 -146 -315 -84 266 275 -104 -288 -65 313 181 -105 -298 -23 296 204 -159 -306 -59 291 231
7207 231 -154 -350 -36 266 227 -135 -279 28 289 168 -161 -319 10 300 170 -152 -352 -17 237 166 -201
7228 -201 -273 -55 243 195 -164 -280 24 257 171 -175 -252 -33 295 192 -205 -293 -41 251 148 -122 -274 -55
7250 -55 248 110 -197 -275 8 187 134 -181 -333 -35 210 130 -164 -267 14 215 128 -159 -226 0 212 117
7272 117 -175 -289 52 247 130 -128 -264 -10 262 154 -176 -210 3 288 115 -156 -258 -17 253 176 -167
7293 -167 -246 -17 258 114 -169 -287 21 280 141 -146 -263 -45 239 131 -125 -235 -15 254 168 -190 -198
7314 -198 -70 241 189 -173 -261 -23 244 89 -178 -231 -27 238 116 -157 -189 5 240 172 -135 -151 5 228
7336 228 61 -177 -235 27 235 137 -164 -198 39 305 92 -201 -254 50 168 116 -260 -248 50 207 110 -174
7358 -174 -211 14 234 92 -207 -243 -7 216 111 -176 -234 65 235 82 -120 -251 41 195 127 -182 -214 55
7380 55 206 56 -137 -211 67 201 129 -160 -164 22 221 99 -198 -185 53 218 110 -126 -231 81 171 100 -133
7403 -133 -188 28 137 89 -126 -169 58 177 58 -213 -224 87 220 33 -171 -216 75 240 15 -212 -227 45
7425 45 255 76 -186 -183 78 238 76 -104 -192 79 223 31 -195 -227 -12 187 46 -164 -146 33 232 65
7447 65 -184 -183 30 155 29 -165 -230 38 198 54 -145 -145 64 199 103 -183 -167 70 195 93 -183 -186 98
7470 98 200 64 -123 -136 106 162 16 -173 -180 109 167 5 -125 -143 80 177 52 -160 -156 64 191 89 -201
7493 -201 -140 119 171 57 -171 -153 78 179 19 -122 -106 60 153 43 -225 -166 65 159 -7 -211 -97 -5 141
7516 141 8 -159 -168 122 258 37 -150 -122 70 202 -14 -162 -170 55 192 27 -200 -151 24 148 43 -166
7538 -166 -138 51 185 14 -141 -94 49 158 31 -170 -167 119 91 16 -190 -114 64 175 -25 -111 -112 135 214 -7
7562 -7 -201 -79 45 139 -68 -129 -91 96 196 45 -153 -94 43 180 54 -160 -103 79 139 12 -123 -140 105
7585 105 189 6 -149 -155 36 108 46 -133 -136 68 145 6 -168 -61 111 172 5 -99 -141 93 189 42 -207 -140
7609 -140 98 146 13 -143 -84 125 119 -8 -155 -71 53 175 -22 -121 -39 128 168 -24 -138 -111 122 163 -5
7632 -5 -158 -140 77 155 -10 -183 -95 92 55 -55 -144 -98 133 157 -22 -193 -42 33 164 -5 -142 -139 52 110
7656 110 -8 -113 -80 35 102 15 -139 -86 61 43 -15 -146 -103 74 104 -60 -129 -107 98 158 13 -122 -118 89
7680 89 142 -29 -162 -120 91 71 -8 -139 -41 71 76 -2 -116 -62 37 166 -57 -160 -54 60 129 -30 -207 45
7704 45 58 134 7 -108 -86 106 139 -1 -108 -62 81 80 -6 -102 -8 100 109 -19 -98 -69 61 101 -31 -88 -91 55
7730 55 56 -22 -126 -99 68 118 -73 -108 -72 87 57 -80 -147 -5 64 89 36 -161 -76 71 155 -87 -84 -55 62 85
7756 85 -5 -118 -79 111 80 -62 -93 -10 61 133 14 -93 -33 77 33 -59 -94 -98 93 77 12 -138 -33 93 70 -25
7782 -25 -53 -54 32 62 -15 -136 -21 120 91 -54 -129 -51 -4 113 -3 -119 -29 66 116 -38 -79 -47 55 113 -65 -98
7808 -98 -20 11 79 20 -82 -36 52 146 -45 -92 -38 62 57 -51 -69 -52 59 78 -10 -99 -49 29 71 -25 -121 -50 23 80
7836 80 -23 -26 -12 88 68 -62 -113 -27 74 66 -51 -106 -69 45 70 4 -87 -23 85 52 -37 -31 -11 27 71 -43 -31 -35
7864 -35 34 79 -27 -109 -12 62 39 -70 -120 -51 56 42 -1 -118 -57 66 75 -48 -58 -15 9 53 -40 -131 -16 48 50 1
7892 1 -46 -47 49 76 -7 -36 4 94 30 -42 -86 2 46 116 -65 -117 -18 41 50 -69 -131 -15 52 60 6 -117 25 56 75 -14
7922 -14 -128 -17 45 104 18 -81 -10 66 47 -44 -77 18 106 80 -41 -63 -8 114 71 -72 -22 3 120 47 -96 -68 -7
7949 -7 53 75 -18 -71 33 59 -6 -50 -41 -11 45 37 -39 -45 -41 22 37 -35 -82 -20 -5 43 0 -74 -112 5 37 -10 -124 41 29
7980 29 20 15 -42 -19 73 52 -8 -30 5 56 66 10 -9 -46 83 79 -26 -60 -93 21 3 -45 -54 -7 29 22 -22 -77 -61 52 39
8011 39 -32 -91 -45 -4 52 -50 -118 23 9 70 25 1 -14 15 89 -3 -78 18 89 22 1 -55 -3 51 54 -9 -70 -25 36 77
8041 77 -35 -14 9 72 76 -28 -107 -15 47 36 -4 -74 36 87 0 -42 -28 -2 82 19 -30 -21 -12 53 38 -64 -1 -1 34 -18
8071 -18 -56 -166 -44 48 35 0 -50 -40 84 17 -13 -46 26 71 51 -29 -57 -32 84 53 -24 -41 -6 -22 12 4 -69 27 25
8100 25 65 -54 -27 -22 -26 35 -1 -33 -1 44 10 -68 -35 -28 25 42 49 -66 -48 3 49 28 -60 -27 -19 35 -8 -34 -11 55 51 -16
8132 -16 -39 -21 -4 51 -15 -35 -15 30 75 18 -17 3 -1 78 -15 -69 -35 11 3 25 -3 -29 86 36 12 -22 -33 7 100 -15
8162 -15 -22 -34 87 18 36 -42 -16 57 47 0 -31 -17 40 14 41 -35 -26 0 14 -16 -44 -56 43 49 29 -26 -56 31 47
8191D7
##END NTUPLES=NMR FID
##END=
