##TITLE=1H_AM BP 3.1
 CDCl3, 8 sc, 
 4.7.2019
##JCAMPDX= 6.0         $$ Bruker NMR JCAMP-DX V2.0
##DATA TYPE= NMR FID
##DATA CLASS= NTUPLES
##ORIGIN= UXNMR, Bruker Analytische Messtechnik GmbH
##OWNER= root
$$ XWIN-NMR		Version 3.5
$$ Thu Jul  4 14:00:29 2019 Russian Standard Time (UT+4h)  she@DPX200
##.OBSERVE FREQUENCY= 200.13155
##.OBSERVE NUCLEUS= ^1H
##.DELAY= (6, 6)
##.ACQUISITION MODE= SIMULTANEOUS
##.ACQUISITION SCHEME= undefined
##.AVERAGES= 8
##.DIGITISER RES= 18
##SPECTROMETER/DATA SYSTEM= spect
##.PULSE SEQUENCE= zg30
##.SOLVENT NAME= Pyr
##.SHIFT REFERENCE= (INTERNAL, Pyr, 0, 15.7039)
##AUDIT TRAIL= $$ (NUMBER, WHEN, WHO, WHERE, WHAT)
$$ ##TITLE= Audit trail, XWIN-NMR		Version 3.5
$$ ##JCAMPDX= 5.01
$$ ##ORIGIN= Bruker BioSpin GmbH
$$ ##OWNER= she
$$ F:/spectra/data/she/nmr/H-F/1/audita.txt
$$ ##AUDIT TRAIL=  $$ (NUMBER, WHEN, WHO, WHERE, WHAT)
(   1,<2019-07-04 13:59:19.18 +0400>,<she>,<DPX200>,
      <created by zg, POWCHK disabled, PULCHK disabled
       configuration hash MD5:
       00 E9 B6 7A A2 85 ED C7 34 08 36 98 17 FE 4E 26
       data hash MD5: 16K
       0C C4 75 00 40 69 CC 9F AB 0F 3F 8E 11 01 66 BE>)
$$ ##END=
$$ 
$$ hash MD5
$$ FB EC C1 7B D1 57 95 3A 67 D5 C4 25 AB 8A E0 6C
##$RELAX= 
##$RELAX= 
##$RELAX= 
##$RELAX= 
##$RELAX= 
##$RELAX= 
$$ Bruker specific parameters
$$ --------------------------
##$DU= <F:/spectra>
##$EXPNO= 1
##$NAME= <H-F>
##$PROCNO= 1
##$TYPE= <nmr>
##$USER= <she>
##$AMP= (0..31)
100 100 100 100 100 100 100 100 100 100 100 100 100 100 100 100 100 100 
100 100 100 100 100 100 100 100 100 100 100 100 100 100 
##$AQSEQ= 0
##$AQ_mod= 1
##$AUNM= <au_zg>
##$AUTOPOS= <>
##$BF1= 200.13
##$BF2= 200.13
##$BF3= 200.13
##$BF4= 200.13
##$BF5= 200.13
##$BF6= 200.13
##$BF7= 200.13
##$BF8= 200.13
##$BYTORDA= 1
##$CFDGTYP= 0
##$CFRGTYP= 5
##$CHEMSTR= <none>
##$CNST= (0..31)
1 1 145 1 1 1 1 1 1 1 1 1 1 1 1 1 1 1 1 1 1 1 1 1 1 1 1 1 1 1 1 1 
##$CPDPRG= <>
##$CPDPRG1= <>
##$CPDPRG2= <>
##$CPDPRG3= <>
##$CPDPRG4= <mlev>
##$CPDPRG5= <mlev>
##$CPDPRG6= <mlev>
##$CPDPRG7= <mlev>
##$CPDPRG8= <mlev>
##$CPDPRGB= <>
##$CPDPRGT= <>
##$D= (0..31)
0 1.2 0 0 0 0 0 0 0 0 0 0.03 0 0 0 0 0 0 0 0 0 0 0 0 0 0 0 0 0 0 0 0 
##$DATE= 1562234358
##$DBL= (0..7)
120 120 120 120 120 120 120 120 
##$DBP= (0..7)
150 150 150 150 150 150 150 150 
##$DBP07= 0
##$DBPNAM0= <>
##$DBPNAM1= <>
##$DBPNAM2= <>
##$DBPNAM3= <>
##$DBPNAM4= <>
##$DBPNAM5= <>
##$DBPNAM6= <>
##$DBPNAM7= <>
##$DBPOAL= (0..7)
0.5 0.5 0.5 0.5 0.5 0.5 0.5 0.5 
##$DBPOFFS= (0..7)
0 0 0 0 0 0 0 0 
##$DE= 6
##$DECBNUC= <off>
##$DECIM= 24
##$DECNUC= <off>
##$DECSTAT= 4
##$DIGMOD= 1
##$DIGTYP= 9
##$DL= (0..7)
0 120 120 120 120 120 120 120 
##$DP= (0..7)
150 150 150 150 150 150 150 150 
##$DP07= 0
##$DPNAME0= <>
##$DPNAME1= <>
##$DPNAME2= <>
##$DPNAME3= <>
##$DPNAME4= <>
##$DPNAME5= <>
##$DPNAME6= <>
##$DPNAME7= <>
##$DPOAL= (0..7)
0.5 0.5 0.5 0.5 0.5 0.5 0.5 0.5 
##$DPOFFS= (0..7)
0 0 0 0 0 0 0 0 
##$DQDMODE= 0
##$DR= 18
##$DS= 0
##$DSLIST= <SSSSSSSSSSSSSSS>
##$DSPFIRM= 0
$$ [...]
##$SUBNAM2= <"">
##$SUBNAM3= <"">
##$SUBNAM4= <"">
##$SUBNAM5= <"">
##$SUBNAM6= <"">
##$SUBNAM7= <"">
##$SUBNAM8= <"">
##$SUBNAM9= <"">
##$SW= 24.9336996594482
##$SWIBOX= (0..15)
0 0 2 0 0 0 0 0 0 0 0 0 0 0 0 0 
##$SW_h= 4990.01996007984
##$TD= 16384
##$TD0= 1
##$TE= 0
##$TE2= 300
##$TE3= 300
##$TEG= 300
##$TL= (0..7)
0 120 120 120 120 120 120 120 
##$TP= (0..7)
150 150 150 150 150 150 150 150 
##$TP07= 0
##$TPNAME0= <>
##$TPNAME1= <>
##$TPNAME2= <>
##$TPNAME3= <>
##$TPNAME4= <>
##$TPNAME5= <>
##$TPNAME6= <>
##$TPNAME7= <>
##$TPOAL= (0..7)
0.5 0.5 0.5 0.5 0.5 0.5 0.5 0.5 
##$TPOFFS= (0..7)
0 0 0 0 0 0 0 0 
##$TUNHIN= 0
##$TUNHOUT= 0
##$TUNXOUT= 0
##$USERA1= <user>
##$USERA2= <user>
##$USERA3= <user>
##$USERA4= <user>
##$USERA5= <user>
##$V9= 5
##$VALIST= <valist>
##$VCLIST= <CCCCCCCCCCCCCCC>
##$VD= 0
##$VDLIST= <DDDDDDDDDDDDDDD>
##$VPLIST= <PPPPPPPPPPPPPPP>
##$VTLIST= <TTTTTTTTTTTTTTT>
##$WBST= 1024
##$WBSW= 4
##$XGAIN= (0..3)
0 0 0 0 
##$XL= 0
##$YL= 0
##$YMAX_a= 12827
##$YMIN_a= -35214
##$ZGOPTNS= <>
##$ZL1= 120
##$ZL2= 120
##$ZL3= 120
##$ZL4= 120
##$ABSF1= 10
##$ABSF2= 0
##$ABSG= 5
##$ABSL= 3
##$ALPHA= 0
##$AQORDER= 0
##$ASSFAC= 0
##$ASSFACI= 0
##$ASSFACX= 0
##$ASSWID= 0
##$AUNMP= <proc_1d>
##$AZFE= 0.1
##$AZFW= 0.1
##$BCFW= 1
##$BC_mod= 2
##$BYTORDP= 1
##$COROFFS= 0
##$CY= 11.3945322036743
##$DATMOD= 1
##$DC= 2
##$DFILT= <>
##$DTYPP= 0
##$F1P= 18.9103706918063
##$F2P= -1.10871071338519
##$FCOR= 0.5
##$FTSIZE= 0
##$FT_mod= 4
##$GAMMA= 1
##$GB= 0.15
##$INTBC= 1
##$INTSCL= 1
##$ISEN= 128
##$LB= 0.24
##$LEV0= 0
##$LPBIN= 0
##$MAXI= 10000
##$MC2= 0
##$MEAN= 0
##$ME_mod= 0
##$MI= 1.114404
##$NCOEF= 0
##$NC_proc= 0
##$NLEV= 6
##$NOISF1= 3.799351
##$NOISF2= 2.8
##$NSP= 1
##$NTH_PI= 0
##$NZP= 0
##$OFFSET= 15.70392
##$PC= 1
##$PHC0= -8664.615
##$PHC1= 32.00097
##$PH_mod= 1
##$PKNL= yes
##$PPARMOD= 0
##$PSCAL= 0
##$PSIGN= 0
##$REVERSE= no
##$SF= 200.130013532006
##$SI= 16384
##$SIGF1= 3
##$SIGF2= 2
##$SINO= 400
##$SIOLD= 16384
##$SREGLST= <1H.CDCl3>
##$SSB= 0
##$STSI= 0
##$STSR= 0
##$SW_p= 3612.71676300578
##$SYMM= 0
##$S_DEV= 0
##$TDeff= 0
##$TDoff= 0
##$TI= <>
##$TILT= no
##$TM1= 0
##$TM2= 0
##$TOPLEV= 0
##$USERP1= <user>
##$USERP2= <user>
##$USERP3= <user>
##$USERP4= <user>
##$USERP5= <user>
##$WDW= 1
##$XDIM= 8192
##$YMAX_p= 0
##$YMIN_p= 0
$$ End of Bruker specific parameters
$$ ---------------------------------
##NTUPLES= NMR FID
##VAR_NAME=  TIME,          FID/REAL,        FID/IMAG
##SYMBOL=    X,             R,               I
##VAR_TYPE=  INDEPENDENT,   DEPENDENT,       DEPENDENT
##VAR_FORM=  AFFN,          ASDF,            ASDF
##VAR_DIM=   8192,          8192,            8192
##UNITS=     SECONDS,       ARBITRARY UNITS, ARBITRARY UNITS
##FACTOR=    0.0002004,     1,               1
##FIRST=     0,             0,               0
##LAST=      1.6414764,     0,               0
##MIN=       0,             -35214,          0
##MAX=       1.6414764,     12827,           0
$$ Real data points
##PAGE= N=1
##DATA TABLE= (X++(R..R)), XYDATA
$$ plain form
0 0 0 0 0 0 0 0 0 0 0 0 0 0 0 0 -3 8 -8 8 -8 8 -8 16 -16 16 -18 24 -24 31 -32 37 -41 48 -51 58 -65 73 -81 90
38 90 -99 110 -123 136 -148 164 -185 204 -227 253 -282 318 -359 407 -466 543 -642 777 -978 1302
58 1302 -1913 3499 -17699 -35214 -25113 -30726 -31399 -30955 -26588 -28940 -29355 -28346 -25684 -26655 -26128 -25261
74 -25261 -23739 -23840 -22261 -21404 -21118 -20923 -18590 -17348 -17507 -17330 -14926 -13590 -13659 -13446 -11268 -9813 -9830 -9692
92 -9692 -7848 -6201 -5925 -5934 -4418 -3040 -2679 -2568 -1262 27 296 536 1819 2878 2824 3300 4713 5255
110 5255 5017 5665 7210 7365 6860 7779 9307 9117 8476 9654 10922 10398 9857 11053 11960 11148 10879 12181
128 12181 12645 11602 11571 12688 12799 11845 11910 12827 12439 11572 11851 12484 11866 11055 11385 11714 10932 10309 10598 10679
148 10679 9887 9250 9518 9519 8683 8199 8346 8148 7373 6881 7101 6932 6169 5738 6014 5812 5011 4737 5101 4898
$$ packed form
0@%%%%%%%%%%%%%%lJ1j6J6j6J6j6K4l2L2l4M2m8N5o3O9p8Q9r9J09j23J38j54J71
38I0j89K09k33K59k84L12l49L89m31M80n35O00o77P66q73J009j185J419j755K280
58A302l215N412k1198j7515J0101n613o73M44M367k352m15J009K662r71N27Q67
74b5261J522j01J579Q57K86J95K333J242j59J77K404J336o9K13K178J455j7J38
92i692J844J647K76rJ516J378L61J11J306J289K69K40J283J059n4M76J413N42
110E255k38O48J545J55n05R19J528j90o41J178J268n24n41J196R07q12k69J302
128A2181M64j043l1J117J11r54O5R17l88q67K79O33o18q11L30L29p82o23K89Q1
148A0679p92o37K68Jq36m84J47j98p75m92K20j69p63m31K76k02q01k74L64k03
$$ plain form
168 4898 4130 4014 4513 4314 3512 3596 4173 3948 3248 3564 4177 3787 3213 3871 4369 3846 3476 4267 4658 4053
188 4053 4057 4884 5088 4445 4620 5424 5496 4898 5238 5950 5811 5304 5744 6378 6035 5534 6107 6523 6097 5781 6306
209 6306 6495 5935 5687 6097 6331 5782 5606 5977 5957 5400 5241 5650 5517 4971 4822 5153 4953 4338 4333 4651 4331
230 4331 3710 3779 4023 3664 3072 3168 3388 2932 2380 2641 2707 2098 1667 1966 1986 1267 888 1152 1113 266 97 364
252 364 149 -592 -832 -454 -921 -1563 -1597 -1404 -1891 -2552 -2486 -2345 -2920 -3514 -3241 -3308 -3821 -4243 -3947 -4015 -4673 -4957
274 -4957 -4656 -4657 -5298 -5453 -5173 -5278 -5719 -5842 -5519 -5688 -6142 -6020 -5618 -5822 -6207 -5954 -5565 -5732 -5987 -5684 -5317
295 -5317 -5512 -5619 -5227 -4911 -5122 -5246 -4773 -4463 -4657 -4653 -4081 -3950 -4226 -4109 -3480 -3437 -3738 -3491 -2916 -2969 -3193
316 -3193 -2955 -2464 -2571 -2721 -2432 -2048 -2270 -2461 -2107 -1777 -1997 -2163 -1744 -1529 -1763 -1836 -1425 -1247 -1585 -1562 -1062
$$ packed form
168D898p68j16M99j99q02Q4N77k25p00L16O13l90n74O58M98n23l70P91L91o05
188D053MQ27K04o43J75Q04P2n98L40P12j39n07M40O34l43n01N73M16m26l16N25
209F306J89n60k48M10K34n49j76L71k0n57j59M09j33n46j49L31k00o15nL18l20
230D331o21O9K44l59n92R6K20m56n52K61O6o09m31K99K0p19l79K64l9q47j69K67
252C64k15p41k40L78m67o42l4J93m87o61O6J41n75n94K73o7n13m22K96o8o58k84
274d957L01jo41j55K80j05m41j23L23j69m54J22M02k04l85K53L89j67k55L03L67
295e317j95j07L92L16k11j24M73L10j94MN72J31k76J17O29M3l01K47N75n3k24
316c193K38M91j07j50K89L84k22j91L54L30k20j66M19K15k34p3M11J78l38K3N00
$$ plain form
337 -1062 -1106 -1341 -1251 -804 -791 -1080 -870 -446 -551 -794 -531 -153 -202 -509 -124 216 93 -79 289 532 313
358 313 211 647 834 607 451 879 980 652 640 943 1004 680 694 1046 961 626 752 1028 831 442 584 786
380 786 580 279 482 584 211 -60 222 350 -106 -249 30 38 -291 -446 -139 -189 -489 -552 -324 -370 -621 -605
402 -605 -285 -448 -746 -585 -286 -457 -664 -475 -208 -432 -655 -352 -118 -313 -584 -218 -49 -344 -420 -108 24
423 24 -331 -326 -36 9 -348 -296 -21 -97 -412 -346 -16 -287 -536 -334 -106 -330 -577 -401 -243 -461 -678 -486 -290
446 -290 -495 -684 -410 -372 -551 -609 -306 -252 -532 -451 -162 -199 -412 -300 46 -40 -254 -82 256 248 3 240 585
469 585 436 330 622 913 664 601 896 1056 842 805 1021 1218 985 956 1277 1284 1067 1135 1418 1297 1040 1146
491 1146 1449 1264 1016 1175 1388 1135 969 1096 1340 1071 922 1120 1291 1082 920 1117 1238 1063 956 1251
$$ packed form
337a062m4k35R0M47J3k89K10M24j05k43K63L78m9l07L85L40j23j72L68K43k19
358C13j02M36J87k27j56M28J01l28j2L03O1l24J4L52q5l35J26K76j97l89J42K02
380G86k06l01K03J02l73k71K82J28m56j43K79Ql29j55L07n0l00o3K28m6k51J6
402f05L20j63k98J61K99j71k07J89K67k24k23L03K34j95k71L66J69k95p6L12J32
423B4l55NK90M5l57N2K75p6l15O6L30k71k49K02K28k24k47J76J58k18k17J92J96
446b90k05j89K74L8j79n8L03N4k80Q1K89l7k13J12L46q6k14J72L38qk45K37L45
469E85j49j06K92K91k49o3K95J60k14l7K16J97k33k9L21Pk17O8K83j21k57J06
491A146L03j85k48J59K13k53j66J27K44k69j49J98J71k09j62J97J21j75j07K95
$$ plain form
511 1251 1305 1051 1104 1407 1408 1254 1371 1719 1647 1408 1540 1924 1872 1708 1914 2184 2045 1970 2248 2516 2390 2258
533 2258 2549 2762 2590 2578 2818 2825 2731 2701 2952 3045 2770 2831 3065 2958 2774 2780 2966 2863 2630 2725 2945 2727 2447
556 2447 2594 2626 2411 2224 2328 2419 2098 1940 2094 2029 1759 1672 1776 1678 1432 1371 1405 1324 982 909 1015 842 549
579 549 580 581 436 144 55 129 -165 -420 -391 -442 -711 -991 -925 -984 -1380 -1598 -1550 -1659 -2005 -2206 -2158 -2313 -2819 -2926
603 -2926 -2839 -3102 -3494 -3620 -3556 -3785 -4129 -4194 -4123 -4429 -4692 -4733 -4729 -4976 -5115 -5086 -5115 -5328 -5472 -5364 -5298 -5519 -5601 -5373
627 -5373 -5339 -5524 -5417 -5239 -5176 -5222 -5089 -4852 -4783 -4854 -4687 -4361 -4266 -4330 -4035 -3694 -3681 -3661 -3339 -3012 -2997 -2831 -2592
650 -2592 -2225 -2277 -2128 -1801 -1519 -1584 -1347 -947 -746 -811 -609 -252 -35 -57 130 550 612 557 825 1189 1255 1254 1544
673 1544 1777 1713 1818 1993 2301 2268 2307 2558 2698 2667 2730 3003 3064 2994 3003 3283 3322 3268 3334 3479 3459 3289 3372 3559 3485
$$ packed form
511A251N4k54N3L03Jj54J17L48p2k39J32L84n2j64K06K70j39p5K78K68j26j32
533B258K91K13j72j2K40Pr4l0K51R3k75O1K34j07j84OJ86j03k33R5K20k18k80
556B447J47L2k15j87J04R1l21j58J54o5k70q7J04r8k46o1L4q1l42p3J06j73k93
579E49L1Jj45k92q9P4k94k55K9n1k69k80O6n9l96k18M8j09l46k01M8j55n06j07
603b926Q7k63l92j26O4k29l44o5P1l06k63m1Mk47j39K9k9k13j44J08O6k21q2K28
627e373L4j85J07J78O3m6J33K37O9p1J67L26R5o4K95L41J3K0L22L27J5J66K39
650b592L67n2J49L27K82o5K37M00K01o5K02L57K17k2J87M20O2n5K68L64O6jK90
673A544K33o4J05J75L08l3L9K51J40l1O3K73O1p0RK80L9n4O6J45k0j70Q3J87p4
$$ plain form
698 3485 3243 3357 3479 3333 3146 3196 3225 3069 2852 2894 2901 2628 2446 2484 2450 2181 1923 1829 1821 1527 1326 1312 1229 869
722 869 733 801 559 263 203 280 -73 -259 -274 -331 -542 -686 -717 -696 -859 -994 -924 -951 -1162 -1194 -1050 -1019 -1170 -1224
746 -1224 -1017 -981 -1220 -995 -815 -878 -956 -861 -622 -573 -692 -499 -304 -407 -374 -127 29 8 -51 201 354 277 270 548
770 548 666 570 624 891 933 955 909 1113 1189 1122 1142 1339 1379 1307 1394 1577 1583 1487 1632 1790 1752 1666 1812 1914 1926 1779
796 1779 1981 1975 1926 1898 2086 2097 1951 1923 2156 2069 1861 1930 1981 2000 1735 1798 1866 1693 1569 1560 1625 1341 1252 1218 1229 969
822 969 766 765 738 485 315 297 173 -57 -163 -177 -394 -645 -749 -734 -931 -1195 -1234 -1221 -1446 -1617 -1634 -1660 -1812 -2004
846 -2004 -2008 -1940 -2164 -2344 -2258 -2207 -2358 -2517 -2404 -2380 -2502 -2536 -2397 -2377 -2509 -2445 -2341 -2316 -2389 -2256 -2122 -2218 -2224 -2028 -1954
871 -1954 -1979 -2002 -1824 -1631 -1671 -1783 -1598 -1392 -1562 -1473 -1325 -1251 -1252 -1274 -1119 -990 -1048 -1057 -878 -808 -847 -825 -623 -641 -681
$$ packed form
698C485k42J14J22j46j87N0K9j56k17M2Pk73j82L8l4k69k58r4qk94k01j4q3l60
722H69j36O8k42k96o0P7l53j86j5n7k11j44l1K1j63j35P0k7k11l2J44L1j51n4
746a224K07L6k39K25J80o3p8R5K39M9j19J93J95j03L3K47J56k1n9K52J53p7pK78
770E48J18r6N4K67M2K2m6K04P6o7K0J97M0p2Q7J83Or6J45J58l8q6J46J02J2j47
796A779K02om9k8J88J1j46k8K33q7k08O9N1J9k65O3O8j73j24rO5k84q9l4J1k60
822I69k03jk7k53j70j8j24k30j06j4k17k51j04J5j97k64l9J3k25j71j7k6j52j92
846b004mO8k24j80Q6N1j51j59J13K4j22l4J39K0j32O4J04K5p3J33J34r6oJ96P4
871a954k5k3J78J93m0j12J85K06j70Q9J48P4jk2J55J29n8rJ79P0l9K2K02j8m0
$$ plain form
896 -681 -616 -413 -383 -478 -372 -264 -207 -285 -114 -17 -53 -35 111 267 177 222 345 441 472 455 652 719 682 646 838 896
922 896 786 882 960 972 826 971 1124 1069 949 1072 1183 1065 973 1095 1093 975 894 937 967 805 835 817 719 572 572
947 572 683 568 333 371 512 365 220 203 235 198 71 -14 94 41 -75 -121 -35 -106 -225 -242 -175 -243 -314 -250 -154
972 -154 -232 -234 -142 -145 -226 -245 -137 -78 -259 -210 -128 -177 -181 -170 -10 -122 -212 -164 -59 -185 -262 -147 -83 -213 -288 -211 -165 -337
1000 -337 -365 -210 -223 -361 -349 -304 -270 -424 -485 -316 -349 -554 -454 -388 -440 -476 -389 -359 -408 -494 -434 -287 -315 -423 -350 -209
1026 -209 -299 -321 -186 -154 -144 -122 -56 11 -26 -21 130 219 98 116 231 275 201 250 418 312 252 311 421 398 313 394 444
1053 444 347 308 399 465 335 279 326 348 302 183 322 290 138 165 290 264 146 146 260 302 130 250 329 202 241
1078 241 234 331 312 312 372 444 413 375 495 534 478 493 557 646 571 647 681 748 612 687 796 746 632 753 737 711 661 698
$$ packed form
896f81O5K03L0r5J06J08N7p8J71R7l6J8J46J56r0M5J23R6L1j7J97O7l7l6J92N8
922H96j10R6P8J2j46J45J53n5j20J23J11j18r2J22kj18q1M3L0j62L0j8r8j47%
947E72J11j15k35L8J41j47j45j7L2l7j27q5J08n3j16m6Q6p1j19j7O7o8p1O4R6
972a54p8kR2lq1j9J08N9j81M9Q2m9mJ1J60j12r0M8J05j26p7J15O4j30p5P7M6j72
1000c37k8J55j3j38J2M5L4j54o1J69l3k05J00O6n2l6Q7L0m9q6O0J47k8j08P3J41
1026b09r0k2J35L2J0K2O6O7l7NJ51Q9j21J8J15M4p4M9J68j06o0N9J10k3q5Q1N0
1053D44r7l9R1O6j30n6M7K2m6j19J39l2j52K7J25k6j18%J14M2j72J20P9j27L9
1078B41pR7j9%O0P2l1l8J20L9n6J5O4Q9p5P6L4O7j36P5J09n0j14J21j6k6n0L7
$$ plain form
1106 698 777 712 699 694 739 611 588 596 693 525 513 497 552 423 381 533 440 352 258 398 317 207 235 291 295 162 208 241
1134 241 225 170 208 263 148 122 217 256 162 118 221 289 227 206 243 251 188 237 215 285 126 173 205 210 101 74 196 91
1162 91 19 38 74 -45 -180 -145 -96 -147 -258 -224 -221 -297 -423 -445 -433 -457 -573 -508 -512 -604 -721 -653 -662 -704 -706 -632 -672 -762 -713
1191 -713 -723 -629 -683 -694 -569 -606 -634 -599 -525 -563 -563 -485 -382 -407 -493 -450 -346 -348 -369 -285 -277 -342 -254 -179 -175 -251 -173 -177 -225 -217 -171
1222 -171 -144 -169 -264 -184 -161 -257 -249 -225 -210 -231 -253 -264 -187 -255 -313 -253 -250 -284 -323 -283 -295 -265 -302 -194 -187 -306 -276 -222 -269 -240
1252 -240 -249 -148 -225 -223 -188 -82 -80 -144 -90 -89 -195 -171 -44 -53 -148 -168 -137 -153 -173 -209 -122 -134 -289 -155 -166 -209 -364 -319 -303
1281 -303 -393 -404 -464 -403 -568 -579 -491 -574 -630 -686 -581 -663 -698 -701 -638 -678 -793 -716 -654 -692 -818 -733 -660 -639 -709 -637 -517 -526
1309 -526 -583 -466 -376 -383 -360 -308 -232 -237 -231 -102 -86 -13 -15 43 158 86 144 292 301 224 335 514 475 372 510 565 527 510
$$ packed form
1106F98P9o5j3nM5j28k3QR7j68j2j6N5j29m2J52r3q8r4J40q1j10K8N6Mj33M6L3
1134B41j6n5L8N5j15k6R5L9r4m4J03O8o2k1L7Qo3M9k2P0j59M7L2Nj09k7J22j05
1162I1p2J9L6j19j35L5M9n1j11L4Lp6j26k2J2k4j16O5mr2j17O8rm2kP4m0r0M9
1191g13j0R4n4j1J25l7k8L5P4l8%P8J03k5q6M3J04kk1Q4Qo5Q8P5Mp6P8mm8QM6
1222a71K7k5r5Q0K3r6QK4J5k1k2j1P7o8n8O0Ll4l9M0j2L0l7J08Pj19L0N4m7K9
1252b40rJ01p7KL5J06Ko4N4Jj06K4J27rr5k0L1j6k0l6Q7j2j55J34j1m3j55M5J6
1281c03r0j1o0O1j65j1Q8q3n6n6J05q2l5lO3m0j15P7O2l8j26Q5P3K1p0P2J20r
1309e26n7J17R0pK3N2P6nOJ29J6P3kN8J15p2N8J48Rp7J11J79l9j03J38N5l8j7
$$ plain form
1337 510 587 686 622 529 652 726 681 602 682 715 687 721 834 777 732 855 874 846 828 844 929 876 892 875 971 986 892 987
1365 987 1025 1087 986 1108 1062 991 993 1072 1043 1028 982 1058 1056 993 944 1006 1028 898 838 908 891 862 816 799 728 652 605 596 577 451
1395 451 472 434 305 193 225 202 59 -50 35 -14 -128 -177 -236 -264 -284 -354 -352 -357 -469 -515 -508 -452 -547 -527 -485 -524 -546 -618
1423 -618 -571 -560 -626 -561 -465 -554 -584 -556 -496 -546 -536 -521 -490 -502 -497 -412 -347 -480 -433 -325 -379 -401 -342 -295 -310 -381 -388 -343 -304 -295
1453 -295 -305 -264 -320 -267 -298 -226 -257 -279 -264 -223 -269 -273 -207 -181 -222 -200 -124 -208 -157 -172 -27 -88 -81 -34 31 58 -94 86 108
1482 108 66 60 132 170 214 227 194 258 234 244 298 257 215 241 354 270 207 177 287 149 166 123 213 141 34 101 134 20
1510 20 -2 -88 -11 -23 -89 -174 -172 -127 -240 -285 -183 -313 -332 -271 -278 -373 -403 -369 -319 -368 -403 -286 -378 -361 -365 -330 -354 -406 -351 -276
1540 -276 -330 -289 -299 -300 -305 -336 -199 -203 -238 -211 -156 -161 -256 -197 -154 -69 -227 -197 -105 -116 -173 -213 -169 -193 -79 -235 -88 -191 -110
$$ packed form
1337E10P7R9o4r3J23P4m5p9Q0L3k8L4J13n7m5J23J9k8j8J6Q5n3J6j7R6J5r4R5
1365I87L8O2j01J22m6p1KP9k9j5m6P6ko3m9O2K2j30o0P0j7k9m6j7p1p6m7rj9j26
1395D51K1l8j29j12L2k3j43j09Q5m9j14m9n9k8k0p0Knj12m6PN6r5K0M2l9k2p2
1423f18M7J1o6O5R6q9l0K8O0n0J0J5L1j2NQ5O5j33M7J08n4k2N9M7j5p1pM5L9R
1453b95j0M1n6N3l1P2l1k2J5M1m6mO6K6m1K2P6q4N1j5J45o1PM7O5K7j52J80K2
1482A08m2oP2L8M4J3l3O4k4J0N4m1m2K6J13q4o3l0J10j38J7m3R0p2j07O7L3j14
1510B0k2q6P7j2o6q5KM5j13m5J02j30j9O1pr5l0L4N0m9l5J17r2J7mL5k4n2N5P5
1540b76n4M1j0jnl1J37ml5K7N5nr5N9M3Q5j58L0R2j1n7m0M4k4J14j56J47j03Q1
$$ plain form
1569 -110 -156 -81 -135 -194 -130 -183 -162 -170 -55 -125 -178 -204 -124 15 -97 -99 -26 -32 4 -66 74 32 47 31 128 133 104 169 202 230
1599 230 253 260 291 293 234 199 352 317 273 336 371 314 293 321 307 260 298 306 291 261 292 320 223 254 265 193 206 147 192 142 147
1630 147 18 167 123 68 96 41 52 71 1 48 53 74 84 75 117 88 113 97 152 98 112 208 185 133 206 288 198 222 153 240
1660 240 220 239 299 315 240 258 268 304 237 235 272 266 279 217 230 250 218 209 179 105 63 135 150 135 26 69 35 28 25 14 61 -16
1692 -16 -48 48 -5 -141 -61 -78 -39 -108 -119 -101 -78 -68 -68 -103 -75 -121 -86 -66 -58 -126 -103 -73 -74 -127 -25 -76 -120 -212 -100 -47
1722 -47 -116 -150 -162 -157 -186 -268 -230 -153 -289 -294 -243 -261 -374 -388 -316 -313 -392 -395 -330 -412 -432 -468 -448 -473 -478 -420 -389 -540 -447 -395 -413
1753 -413 -427 -410 -369 -391 -332 -293 -299 -319 -297 -247 -162 -149 -139 -154 -152 -35 -132 -94 58 19 34 14 48 82 80 185 121 144 197 231
1783 231 171 253 217 264 289 147 225 227 245 237 213 259 205 170 199 162 174 117 219 193 184 176 174 166 159 151 205 146 145 182 198 151 159 146
$$ packed form
1569a10m6P5n4n9O4n3K1qJ15p0n3k6Q0J39j12kP3oL6p0J40m2J5j6R7Nk9O5L3K8
1599B30K3PL1Kn9l5J53l5m4O3L5n7k1K8j4m7L8Qj5l0L1K8r7L1J1p2J3n9M5n0N
1630A47j29J49m4n5K8n5J1J9p0M7NK1J0rM2k9K5j6N5n4J4R6k3n2P3Q2r0K4o9Q7
1660B40k0J9O0J6p5J8J0L6o7kL7oJ3o2J3K0l2rl0p4m2P2J5j5j09M3l4plj1M7p7
1692a6l2R6n3j36Q0j7L9o9j1J8K3J0%l5K8m6L5K0Qo8K3L0jn3J02n1m4r2J12N3
1722d7o9l4j2Nk9q2L8P7j36nN1j8j13j4P2Lp9lO5q2k0l6K0k5nN8L1j51R3N2j8
1753d13j4J7M1k2N9L9ok0K2N0Q5J3J0j5KJ17r7L8J52l9J5k0L4L4kJ05o4K3N3L4
1783B31o0Q2l6M7K5j42P8KJ8qk4M6n4l5K9l7J2n7J02k6rqkqpqN4n9jL7J6m7Qj3
$$ plain form
1817 146 168 211 119 149 234 201 181 205 265 212 206 183 193 198 136 250 211 159 148 182 128 154 133 108 128 98 49 80 -6 60
1847 60 8 39 -49 -44 -14 -75 -73 -202 -134 -82 -128 -118 -181 -177 -189 -161 -77 -76 -154 -120 -118 -86 -145 -25 -111 -24 -5 -72 44 111 7
1878 7 47 116 170 130 158 259 245 201 319 314 311 337 328 354 350 320 348 405 329 355 429 369 369 236 377 380 345 275 336 268 242 258
1910 258 319 280 210 172 235 176 229 224 154 204 221 135 133 73 155 93 170 49 115 91 74 66 0 9 24 23 -12 33 13 -57 -7 3
1942 3 -17 -158 -100 -133 -170 -177 -195 -185 -249 -325 -270 -273 -354 -399 -343 -415 -486 -500 -413 -504 -586 -594 -602 -625 -706 -647 -677 -742 -719 -745 -722 -772
1974 -772 -795 -811 -851 -824 -795 -790 -801 -824 -761 -743 -756 -798 -778 -663 -680 -700 -732 -645 -652 -600 -541 -569 -516 -570 -503 -407 -459 -350 -401 -376
2004 -376 -402 -333 -283 -245 -288 -280 -194 -193 -239 -232 -102 -79 -114 -96 -125 -49 -66 -65 -67 -8 -75 -24 18 59 57 7 68 44 136 215 206 125 168
2037 168 226 347 299 279 379 433 409 343 436 485 539 465 499 528 586 588 594 620 564 608 640 651 520 600 667 628 622 662 634 608
$$ packed form
1817A46K2M3r2L0Q5l3k0K4O0n3ok3J0No2J14l9n2j1L4n4K6k1k5K0l0m9L1q6O6
1847F0n2L1q8NL0o1Kj29O8N2m6J0o3Mj2K8Q4Jp8L4KL2n9J20q6Q7J9o7J16O7j04
1878GM0O9N4m0K8J01j4m4J18nlK6rK6ml0K8N7p6K6P4o0%j33J41Ll5p0O1o8k6J6
1910B58O1l9p0l8O3n9N3np0N0J7q6ko0Q2o2P7j21O6k4j7qo6RJ5jl5M5k0p0N0J0
1942Ck0j41N8l3l7pj8J0o4p6N5lq1m5N6p2p1j4Q7r1q2qqk3q1N9l0o5K3k6K3n0
1974g72k3j6m0K7K9Nj1k3O3J8j3m2K0J15j7k0l2Q7pN2N9k8N3n4O7R6n2J09n1K5
2004c76k6O9N0L8m3QQ6Jm6PJ30K3l5J8k9P6j7JkN9o7N1M2M1kn0O1k4R2P9rq1M3
2037A68N8J21m8k0J00N4k4o6R3M9N4p4L4K9N8KOK6n6M4L2J1j31Q0O7l9oM0k8k6
$$ plain form
2067 608 607 574 544 533 495 527 499 506 435 450 457 347 406 395 382 355 334 370 257 339 314 324 226 251 260 277 238 272 240 232 243
2098 243 163 267 313 224 219 221 237 299 250 244 285 252 264 348 282 270 338 272 316 309 236 346 326 263 295 290 170 282 247 244 240
2129 240 193 217 223 197 189 197 213 146 200 148 109 196 145 190 136 135 165 140 114 129 117 203 153 107 173 188 157 141 173 203 179 139
2161 139 163 145 151 127 174 116 105 68 119 63 57 92 77 97 -13 -52 -55 -96 -97 -121 -142 -199 -191 -236 -243 -302 -364 -303 -315 -360 -499 -471
2193 -471 -479 -541 -517 -510 -593 -616 -592 -685 -674 -702 -693 -705 -709 -770 -718 -763 -725 -688 -751 -646 -712 -740 -680 -667 -625 -701 -631 -668 -641 -559 -670
2224 -670 -538 -597 -603 -522 -532 -529 -539 -453 -534 -499 -453 -491 -486 -462 -525 -398 -471 -429 -437 -447 -377 -404 -429 -337 -391 -370 -369 -333 -351 -320 -266
2255 -266 -350 -270 -287 -247 -204 -209 -226 -134 -194 -134 -79 -84 -130 -56 -60 -19 47 -25 38 91 22 22 77 140 131 133 149 131 189 163 168 241 235 174
2289 174 230 207 167 215 251 134 238 190 253 129 164 142 89 169 70 76 97 124 30 112 79 82 102 121 65 90 86 160 96 65
$$ packed form
2067F08jl3l0j1l8L2k8Pp1J5Pj10N9j1j3k7k1L6j13Q2k5J0r8K5RJ7l9L4l2qJ1
2098B43q0J04M6q9nKJ6O2m9oM1l3J2Q4o6j2O8o6M4pp3J10k0o3L2nj20J12l5lm
2129B40m7K4Ok6qQJ6o7N4n2l9Q7n1M5n4jL0k5k6J5j2Q6n0m6O6J5l1j6L2L0k4m0
2161A39K4j8Ok4M7n8j1l7N1n6oL5j5K0j10l9lm1jk4k1n7Qm5pn9o2O1j2m5j39K8
2193d71qo2K4Pq3k3K4r3J1k8Rj2mo1N2m5L8L7o3J05o6k8O0J3M2p6P0l7K7Q2j11
2224f70J32n9oQ1j0Lj0Q6q1L5M6l8NK4o3J27p3M2qj0P0k7k5R2n4K1JL6j8L1N4
2255b66q4Q0j7M0M3nj7R2o0O0N5nm6P4mM1O6p2O3N3o9%N5O3rKJ6j8N8k6NP3oo1
2289A74N6k3m0M8L6j17J04m8O3j24L5k2n3Q0r9OK1K7r4Q2l3LK0J9n6K5mP4o4l1
$$ plain form
2319 65 67 152 258 157 200 241 246 207 255 246 360 331 341 372 439 391 429 439 510 460 540 527 558 548 626 587 607 635 524 616
2349 616 611 651 654 650 597 589 694 645 580 696 650 629 595 627 629 618 542 637 626 565 558 569 558 485 511 549 582 512 472 448 471 468
2381 468 464 481 382 398 385 361 325 345 299 367 254 345 221 261 178 197 169 151 54 59 151 23 17 -70 0 9 -139 -190 -198 -156
2411 -156 -148 -236 -248 -265 -287 -386 -351 -413 -401 -441 -504 -464 -491 -528 -492 -538 -582 -561 -565 -569 -570 -514 -565 -502 -529 -456 -484 -532 -525 -482 -472 -443
2443 -443 -399 -397 -438 -341 -336 -381 -232 -288 -221 -297 -172 -134 -205 -143 -141 -164 -111 -134 -149 -115 -87 -92 -187 -135 10 -30 -120 -25 -21 -69 -51
2474 -51 -103 -73 -32 23 -69 -98 -77 -79 -48 -109 -121 -107 7 -52 -57 -19 -63 -119 -89 -42 -67 -122 -58 -62 -89 -122 -188 -73 -63 -69 -133
2505 -133 -121 -106 -171 -183 -102 -149 -156 -174 -188 -275 -255 -296 -290 -280 -247 -361 -303 -382 -376 -398 -343 -406 -397 -395 -412 -456 -427 -425 -488 -489 -446 -448 -389
2538 -389 -477 -453 -413 -380 -471 -517 -441 -393 -352 -377 -372 -340 -321 -289 -286 -327 -202 -217 -139 -132 -139 -58 -66 -38 -30 -6 57 82 173 103 88 122
$$ packed form
2319F5KQ5J06j01M3M1Nl9M8rJ14k9J0L1O7m8L8J0P1n0Q0j3L1j0P8l9K0K8j11R2
2349F16nM0Lmn3qJ05m9o5J16m6k1l4L2Kj1p6R5j1o1pJ1j1p3K6L8L3p0m0k4K3l
2381D68mJ7r9J6j3k4l6K0m6O8j13R1j24M0q3J9k8j8r7NR2j28oq7P0Rj48n1qM2
2411a56Qq8j2j7k2r9L5o2J2m0o3M0k7l7L6m6m4K1mmjN6n1O3k7P3k8m8PM3J0K9
2443d43M4Km1R7Nm5J49n6O7p6J25L8p1O2Kk3N3k3j5L4K8nr5N2J45m0r0R5Mm8J8
2474e1n2L0M1N5r2k9K1kL1o1j2J4J14n9nL8m4n6L0M7k5n5O4mk7l3o6J15J0oo4
2505a33J2J5o5j2Q1m7pj8j4q7K0m1OJ0L3j14N8p9Ok2N5o3RKj7m4K9Ko3jM3kN9
2538c89q8K4M0L3r1m6P6M8M1k5NL2J9L2Lm1J25j5P8PpQ1qK8QK4O3K5R1p0j5L4
$$ plain form
2570 122 170 232 228 194 267 257 300 278 280 315 290 287 414 391 367 392 391 425 472 373 428 441 448 467 434 438 455 485 496 457 504 486
2602 486 529 503 522 528 546 599 516 485 569 584 556 550 603 510 507 538 574 545 500 515 497 488 490 474 453 485 463 464 433 428 366 400 335
2635 335 330 271 312 289 261 253 218 136 140 128 183 135 102 113 52 57 -5 94 32 -5 -45 4 -57 -50 -53 -47 -38 -61 -39 -71 -61 -54 -81 -30
2669 -30 -91 -91 -33 -59 -46 -148 -116 -54 -47 -116 -19 -54 -52 -77 -80 -56 -115 -114 -135 -159 -168 -86 -124 -113 -219 -109 -170 -178 -135 -116 -129 -122 -171
2702 -171 -172 -172 -228 -233 -164 -160 -189 -181 -124 -75 -171 -162 -160 -163 -150 -141 -132 -41 -133 -71 -41 -48 -7 -73 23 -34 -22 -9 -50 33 47 -5 62 -8 54
2737 54 22 0 -27 47 15 -7 -14 22 -21 -25 -54 -126 -60 -112 -106 -140 -154 -181 -185 -194 -155 -244 -224 -223 -218 -252 -278 -243 -293 -303 -332 -348 -346 -329
2771 -329 -338 -361 -349 -361 -334 -346 -321 -350 -381 -373 -329 -344 -354 -314 -308 -370 -368 -359 -338 -288 -319 -345 -336 -331 -334 -392 -339 -328 -277 -309 -273 -211 -291 -278
2805 -278 -267 -247 -261 -285 -222 -188 -188 -184 -201 -166 -160 -160 -131 -170 -110 -74 -82 -69 -25 -65 -55 26 17 81 26 92 92 33 60 170 175 212 247
$$ packed form
2570A22M8O2ml4P3j0M3k2KL5k5lJ27k3k4K5jL4M7r9N5J3PJ9l3MJ7L0J1l9M7j8
2602D86M3k6J9OJ8N3q3l1Q4J5k8oN3r3lL1L6k9m5J5j8rKj6k1L2k2Jl1no2L4o5
2635C35nn9M1k3k8ql5q2Mj2N5m8l3J1o1No2R9o2l7m0M9o1PlORk3K2l2J0Pk7N1
2669c0o1%N8k6J3j02L2O2Po9R7l5Kk5lK4n9Jk1k4rQ2l8J1j06J10o1qM3J9j3Pm9
2702a71j%n6nO9Mk9QN7M9r6RKlJ3RRR1r2O2L0pM1o6R6n7J2J3m1Q3J4n2O7p0O2
2737E4l2k2k7P4l2k2pL6m3mk9p2O6n2Ol4j4k7mrL9q9K0JNl4k6L5n0j0k9j6KJ7
2771c29rk3J2j2K7j2K5k9l1QM4j5j0M0Oo2KRK1N0l1k6RNln8N3J1N1l2L6O2q0J3
2805b78J1K0j4k4O3L4%Mj7L5O%K9l9O0L6qJ3M4m0J0Q1rO4n5O6%n9K7J10NL7L5
$$ plain form
2838 247 169 214 176 256 304 330 324 320 258 336 338 333 342 345 368 408 400 397 346 367 393 291 309 344 307 324 227 269 262 250 216 264 203 172
2872 172 178 161 112 137 87 122 110 119 62 77 27 47 38 -10 18 50 0 29 36 -37 7 -31 20 -26 2 2 6 -38 35 21 -21 3 8
2905 8 43 27 65 -4 6 12 75 -3 2 28 31 42 6 65 16 89 21 18 33 58 5 74 112 105 108 159 145 92 112 129 203 135 173 183
2939 183 212 175 199 229 309 279 286 287 272 277 317 286 319 300 308 293 317 337 362 326 361 270 350 409 305 292 277 311 293 295 261 249
2971 249 226 219 282 242 232 171 164 179 42 85 46 91 103 17 -64 -1 -35 -67 -29 -79 -131 -80 -73 -156 -88 -104 -165 -136 -150 -158 -144
3002 -144 -213 -130 -211 -162 -162 -180 -162 -130 -145 -185 -110 -161 -170 -188 -140 -178 -199 -158 -72 -126 -196 -109 -120 -192 -110 -96 -72 -184 -239 -104
3032 -104 -171 -134 -192 -197 -201 -177 -130 -160 -200 -135 -209 -143 -98 -244 -240 -185 -139 -127 -249 -173 -182 -176 -171 -135 -207 -138 -107 -155 -194 -178 -117 -168
3064 -168 -168 -113 -124 -165 -159 -136 -97 -83 -130 -147 -125 -170 -223 -233 -167 -212 -275 -235 -272 -256 -286 -231 -310 -280 -313 -318 -350 -373 -303 -326 -363
$$ packed form
2838B47p8M5l8Q0M8K6omo2P8KnRLK3M0qln1K1K6j02J8L5l7J7r7M2pj2l4M8o1l1
2872A72Oj7m9K5n0L5j2Rn7J5n0K0rm8K8L2n0K9Pp3M4l8N1m6K8%Mm4P3j4m2K4N
2905HL5j6L8o9J0OO3p8NK6LJ1l6N9m9P3o8lJ5K5n3O9L8pLN1j4n3K0J7P4o8L8J0
2939A83K9l7K4L0Q0l0PJj5NM0l1L3j9Qj5K4K0K5l6L5r1Q0N9j04j3j5L4j8Kl4j2
2971B49k3pO3m0j0o1pJ5j37M3l9M5J2q6q1O3l4l2L8n0n2N1Pq3O8j6o1K9j4qJ4
3002a44o9Q3q1M9%j8J8L2j5m0P5n1rj8M8l8k1M1Q6n4p0Q7j1p2Q2J4K4j12n5J35
3032a04o7L7n8nmK4M7l0m0O5p4O6M5j46MN5M6J2j22P6rONL6p2O9L1m8l9J6O1n1
3064a68%N5j1m1OK3L9J4m7j7K2m5n3j0O6m5o3M0l7J6l0N5p9L0l3nl2k3P0k3l7
$$ plain form
3095 -363 -366 -399 -323 -422 -418 -304 -336 -427 -346 -350 -363 -385 -325 -331 -314 -382 -322 -330 -291 -293 -260 -264 -286 -165 -234 -175 -251 -103 -88 -65 -51 -51
3127 -51 -32 -3 50 1 30 49 63 90 52 107 149 98 133 235 203 224 139 204 221 262 285 271 235 338 320 317 239 259 293 353
3157 353 283 313 354 317 357 404 378 349 364 355 407 391 372 379 426 399 390 394 437 397 467 432 447 374 431 386 430 355 385 368 317 350
3189 350 362 298 402 314 300 286 332 308 255 271 206 149 207 152 172 136 126 91 51 145 87 64 85 -6 47 24 19 -45 29 -32
3219 -32 -10 12 -53 -14 -29 -38 -81 -67 -95 44 -42 7 -74 -62 -34 -74 75 -59 -44 -31 -56 -35 -7 -51 -93 -58 -19 -119 -86
3248 -86 -22 -35 -44 -57 -34 -92 -83 -62 -82 -61 -128 -53 -77 -64 -73 -136 -81 -144 -99 -84 -131 -139 -101 -27 -128 -127 -139 -104 -175 -141 -69 -68 -96
3281 -96 -182 -118 -58 -110 -102 -118 -54 -166 -53 -84 -60 -51 -117 -42 -114 -65 -71 -86 -140 -66 -62 2 -89 -35 -63 -50 -115 -50 -51 -15 -74 -79
3313 -79 -24 -68 -83 -72 -115 -81 -66 -87 -58 -59 -89 -139 -129 -113 -22 -12 -90 -103 -95 -32 -50 -20 20 -64 -54 17 -16 -47 15 -29 -16
$$ packed form
3095c63ll3P6r9MJ14l2r1Q1mj3k2O0oJ7o8O0qL9kL3mk2J21o9N9p6J48J5K3J4%
3127e1J9K9N3m9K9J9J4K7l8N5M2n1L5J02l2K1q5O5J7M1K3j4l6J03j8lp8K0L4O0
3157C53p0L0M1l7M0M7k6k9J5rN2j6j9PM7k7rMM3m0P0l5J5p3N7m5M4p5L0j7n1L3
3189C50J2o4J04q8j4j4M6k4n3J6o5n7N8n5K0l6j0l5m0R4n8k3K1r1N3k3no4P4o1
3219c2K2K2o5L9j5rm3J4k8J39q6M9q1J2K8m0J49j34J5J3k5K1K8m4m2L5L9j00L3
3248h6O4j3rj3K3n8RK1k0K1o7P5k4J3ro3N5o3M5J5m7qL8P4j01Jj2L5p1L4P2Jk8
3281i6q6O4O0n2Qj6O4j12J13l1K4Ro6P5p2M9oj5n4P4MO4r1N4k8J3o5O5jL6n9n
3313g9N5m4j5J1m3L4J5k1K9jl0n0J0J6R1J0p8j3QO3j8L0M0q4J0P1l3l1O2m4J3
$$ plain form
3344 -16 -39 31 -18 42 54 47 30 16 13 83 23 11 30 122 61 65 54 94 66 3 -4 103 82 66 28 84 52 8 10 19 61 80 8
3377 8 32 46 -44 59 8 24 54 8 7 47 -25 91 21 81 77 13 -22 29 4 96 3 -12 19 90 48 22 45 76 68 71 11 75
3409 75 33 92 41 13 107 94 69 16 8 22 43 84 92 -14 -1 -40 14 26 23 -15 -6 11 -17 -93 -76 -9 -13 -62 -99 -80 -111 -85
3441 -85 -36 -138 -112 -155 -80 -134 -128 -145 -94 -101 -86 -184 -182 -86 -141 -171 -107 -162 -147 -164 -122 -119 -105 -174 -201 -130 -153 -154 -110 -147 -179 -168
3473 -168 -120 -150 -170 -217 -167 -183 -131 -185 -208 -175 -175 -188 -198 -175 -179 -103 -166 -191 -93 -141 -159 -155 -135 -149 -163 -80 -102 -128 -65 -90 16
3504 16 11 -2 -12 68 10 72 17 99 136 102 100 102 158 148 249 104 184 224 245 242 227 257 314 246 339 240 341 333 300 302 266 291
3536 291 349 296 350 287 288 291 288 309 317 253 279 286 281 242 323 240 243 256 237 284 189 243 169 222 157 164 225 150 250 203 166 139 145 148
3570 148 178 105 100 134 87 92 120 84 74 112 89 65 68 77 35 61 72 47 -41 -42 -50 -20 -14 -22 -116 -79 -130 -120 -122 -69 -55 -107 -137 -143 -156
$$ packed form
3344a6k3P0m9O0J2pj7j4lP0o0j2J9R2o1Mj1M0k8o3pJ07k1j6l8N6l2m4KRM2J9p2
3377HK4J4r0J03n1J6L0m6jM0p2J16p0O0mo4l5N1k5R2r3j5L1P1m2k6K3L1qLo0O4
3409G5m2N9n1k8R4j3k5n3qJ4K1M1Qj06J3l9N4J2ll8RJ7k8p6J7O7mm9l7J9l1K6
3441h5M9j02K6m3P5n4Oj7N1pJ5r8KR6n5l0O4n5J5j7M2LJ4o9k7P1k3jM4l7l2J1
3473a68M8l0k0m7N0j6N2n4k3L3%j3j0K3mP6o3k5R8m8j8MK0j4j4Q3k2k6O3k5J06
3504A6nj3j0Q0n8O2n5Q2L7l4kKN6j0J01j45Q0M0K1lj5L0N7o8R3r9J01ql3Kl6K5
3536B91N8n3N4o3JLlK1Qo4K6Pnl9Q1q3LJ3j9M7r5N4p4N3o5PO1p5J00m7l7k7OL
3570A48L0p3nL4m7NK8l6j0L8k3k4LRm2K6J1k5q8jqL0Oqr4L7n1J0kN3J4n2l0oj3
$$ plain form
3605 -156 -190 -167 -184 -203 -218 -114 -117 -200 -167 -238 -151 -143 -182 -176 -240 -197 -187 -218 -162 -162 -138 -191 -111 -123 -130 -129 -182 -152 -108 -43 -136 -89
3637 -89 -84 -128 -54 -111 -86 -105 -156 -76 -88 -83 -109 -45 0 -68 -88 -108 -62 -153 -90 -93 -89 -67 -72 -104 -92 -133 -128 -76 -62 -44 -119 -138 -55
3670 -55 -168 -155 -124 -135 -111 -81 -161 -50 -117 -105 -105 -102 -87 -94 -94 -106 -34 -43 -74 -56 -75 -55 -66 -38 11 -39 -49 -73 -40 -18 6 -52
3702 -52 -21 -62 -4 -42 -27 -3 -15 -21 -28 -4 -13 -1 -5 -33 31 -19 19 13 -17 26 -16 23 42 65 69 51 63 24 33 74 62 58 78 152
3736 152 57 138 104 56 95 113 162 115 96 165 158 177 136 147 228 152 205 195 144 96 144 218 215 227 185 173 136 237 187 221
3766 221 176 159 147 159 158 162 183 126 146 104 68 119 160 149 74 117 97 35 66 107 94 108 141 101 73 127 65 -8 84 102 106
3797 106 -24 65 93 38 96 45 82 62 142 123 -17 45 89 -15 107 82 41 41 23 32 25 -12 -26 -36 18 38 -15 -60 -59 -19
3827 -19 -50 -61 -64 -27 -45 -66 -68 -88 -98 -100 -124 -114 -108 -171 -134 -105 -97 -151 -28 -148 -155 -54 -90 -89 -93 -74 -84 -49 -123 -85 -95 -102 -107 -143
$$ packed form
3605a56l4K3j7j9j5J04lq3L3p1Q7Ql9Oo4M3J0l1N6%K4n3Q0j2pJn3L0M4O5r3M7
3637h9Nm4P4n7K5j9n1Q0j2Nk6O4M5o8k0k0M6r1O3lMK2nl2J2m1NN2J4J8p5j9Q3
3670e5j13J3L1j1K4L0q0J11o7J2%LJ5p%j2P2rl1J8j9K0j1K8M9n0j0k4L3K2K4n8
3702e2L1m1N8l8J5K4j2opK4rJ2mk8O4n0L8ol0M3m2L9J9K3Mj8J2l9RM1j2mK0P4
3736A52r5Q1l4m8L9J8M9m7j9O9pJ9m1J1Q1p6N3j0n1m8M8P4lJ2m2j2l7J01n0L4
3766B21m5j7j2J2jMK1n7K0m2l6N1M1j1p5M3k0o2L1M1j3J4L3m0k8N4o2p3R2J8M
3797A06j30Q9K8n5N8n1L7k0Q0j9j40O2M4j04J22k5m1%j8Rpl7j4j0N4K0n3m5JM0
3827a9l1j1lL7j8k1kk0j0kk4J0Oo3L7K9Qn4J23j20pJ01l6JmJ9j0L5p4L8j0pnl6
$$ plain form
3861 -143 -113 -106 -92 -89 -72 -140 -104 -119 -88 -56 -110 -6 -82 -119 -128 -125 -131 -101 -109 -162 -163 -158 -144 -139 -166 -171 -172 -63 -111 -55 -94 -105 -111 -86 -88
3896 -88 -57 -15 -25 8 -55 -88 6 -14 -26 -22 29 38 -24 20 44 18 57 73 -1 13 83 35 65 53 118 94 56 85 94 43 77 78
3928 78 37 64 47 95 115 -3 80 97 72 75 55 64 30 37 43 25 15 13 27 8 88 32 7 40 65 -27 30 27 47 49 23 28 22 48
3962 48 -50 -29 -22 29 -14 -28 -10 71 51 -11 -53 4 2 -49 -16 -17 -11 -33 -47 -59 -29 -32 -71 -7 -16 15 -43 -24 -26 -28 -117 -63 -75 -60
3996 -60 20 -28 -31 -104 -19 -89 -33 -19 -55 -39 -55 -12 -20 -81 -69 -12 -35 -23 -56 -25 -21 18 -27 -78 -18 7 77 -25 -74 36 33
4027 33 -50 -11 70 32 46 -3 8 39 35 24 -5 76 24 -25 3 17 110 84 74 7 15 58 3 30 34 29 97 -56 18 88 -10 41
4059 41 87 59 3 2 31 17 7 71 8 62 37 54 19 25 28 100 23 44 80 39 93 65 61 101 25 63 74 116 108 78 112 66 88
4092 88 28 90 121 71 68 10 61 71 115 63 68 56 62 15 7 96 10 107 55 27 9 35 66 1 29 20 26 57 -7 11 31 18 22 45
$$ packed form
3861a43L0PJ4LJ7o8L6j5L1L2n4J04p6l7rLoL0qn3jNJ4Nk7njJ09m8N6l9j1oK5k
3896h8L1M2j0L3o3l3R4k0j2MN1Ro2M4K4k6L9J6p4J4P0m8L0j2O5k4l8K9Rn1L4J
3928G8m1K7j7M8K0j18Q3J7k5Lk0Rl4POj8j0kJ4j9Q0n6k5L3K5r2N7lK0Kk6NoK6
3962D8r8K1PN1m3j4J8Q1k0o2m2N7kn1L3jOk2j4j2L0ll9O4rL1n8J9kkq9N4j2J5
3996f0Q0m8lp3Q5p0N6J4l6J6j6M3qo1J2N7k3J2l3L1ML9m5n1O0K5P0j02m9J10l
4027C3q3L9Q1l8J4m9J1L1mj1k9Q1n2m9K8J4R3k6j0o7QM3n5K7MnO8j53P4P0r8N1
4059D1M6k8n6jK9j4j0O4o3N4k5J7l5OLP2p7K1L6m1N4k8mM0p6L8J1M2ql0L4m6K2
4092H8o0O2L1n0ln8N1J0M4n2Nj2Om7qQ9q6R7n2k8j8K6L1o5K8rOL1o4J8K0j3MK3
$$ plain form
4126 45 -28 35 -34 -31 -37 9 42 11 50 19 -9 32 -12 -14 -9 43 12 42 -15 26 -26 -44 16 -18 -65 -39 -72 21 -68 -86 -28 -101
4158 -101 -98 -89 -57 -15 -57 -24 -70 -19 -189 -69 -159 -69 -104 -115 -103 -133 -113 -110 -156 -152 -149 -120 -105 -138 -37 -107 -32 -70 -116 -97 -40
4189 -40 -136 -18 -72 7 -36 -46 -66 -90 -25 -60 -62 -50 -7 -54 -29 -54 -13 13 -62 -5 -12 -15 -84 -29 -20 23 -6 -11 -41 5 18 -14
4221 -14 -74 33 -12 8 -15 -24 -1 13 -3 -22 -23 15 -2 -9 13 11 -20 16 -6 12 -9 16 -38 -78 23 5 69 50 54 39 38 -9
4253 -9 15 4 -52 58 11 10 -30 75 45 27 -15 49 -8 17 -76 -36 67 -11 -56 -2 -17 71 16 21 7 23 -27 -72 3 29
4283 29 -31 -46 -3 -110 -49 -65 -36 -30 -39 -87 -52 -18 -49 -72 -11 -25 -36 -4 38 37 40 39 8 -23 58 41 -17 -8 45 -11 42 83 4
4316 4 14 115 24 31 27 53 84 56 62 108 155 64 97 29 38 87 61 107 78 92 70 65 82 10 94 57 108 101 32 68 75 71 102 65
4350 65 44 12 5 91 57 54 70 158 106 59 48 92 89 45 49 95 36 21 22 21 -4 7 -20 72 10 52 82 -12 85 -1 -17 -20 51 20
$$ packed form
4126D5p3O3o9LoM6L3l1L9l1k8M1m4kNN2l1L0n7M1n2j8O0l4m7K6l3R3q9j8N8p3
4158a01LRL2M2m2L3m6N1j70J20r0R0l5j1J2l0K0Lm6MLK9J5l3J01p0P5l8m6J9N7
4189d0r6J18n4P9m3j0k0k4O5l5kJ2M3m7K5k5M1K6p5N7plo9N5RM3k9nl0M6J3l2
4221a4o0J07m5K0k3rK3J4j6j9jL8j7pK2kl1L6k2J8k1K5n4m0J01j8O4j9Mj5jm7
4253iK4j1n6J10m7jm0J05l0j8m2O4n7K5r3M0J03p8m5N4j5Q8n5Nj4J6n0m5P5K6
4283B9o0j5M3j07O1j6K9Orm8L5L4l1k3O1j4j1L2M2jLjl1l1Q1j7n8RN3n6N3M1p9
4316DJ0J01r1PmK6L1k8OM6M7r1L3o8RM9k6M6k9J4k2nJ7p2Q4l7N1po9L6PmL1l7
4350F5k1l2pQ6l4lJ6Q8n2m7j1M4lm4MM6n9j5Jjk5J1k7R2o2M2L0r4R7q6j6lP1l1
$$ plain form
4384 20 -10 20 -27 38 -42 -68 -69 -69 -97 -15 -49 -13 -68 -119 -97 -60 -55 -119 -106 -43 -112 -87 -127 -64 -83 -72 -147 -133 -36 -75 -140 -65
4416 -65 -86 -79 -88 -91 -110 -73 -45 -102 -35 -83 -82 -111 -23 -44 -58 -136 -45 -105 -119 -38 19 -83 -66 -41 7 2 -4 14 -8 -44 -28 -30 -68
4449 -68 -30 18 -26 -2 -13 15 40 -13 -16 -23 1 19 46 14 40 -35 31 21 29 -4 20 82 35 37 16 25 55 103 39 95 102 31 155
4482 155 109 33 138 45 21 134 36 131 68 134 76 108 83 65 98 97 29 118 13 1 78 9 58 67 8 28 71 9 66
4511 66 93 23 20 18 -36 24 11 59 43 36 21 -9 -26 28 25 73 -45 22 -27 53 -18 -63 2 -62 -7 -6 3 12 27 -33 -33 -4 -2 -49
4545 -49 16 -41 -55 4 -35 -50 -7 4 3 -93 -18 -99 -11 -58 8 -51 -12 -33 -64 -8 -46 -41 -18 -11 -116 -102 -71 -90 -15 -59 -40
4576 -40 6 -39 -61 -46 -57 -21 -6 -3 9 -8 -73 44 5 3 21 21 39 18 84 45 94 -16 40 76 60 -43 7 93 84 13 39
4607 39 33 -34 31 17 38 -4 4 -19 70 41 71 35 51 28 45 33 4 43 -9 16 -20 63 -5 13 41 46 62 49 24 0 25 -69
$$ packed form
4384B0l0L0m7O5q0k6j%k8Q2l4L6n5n1K2L7No4J3O3o9K5m0O3j9J1p5J4R7l9o5P5
4416f5k1Prlj9L7K8n7O7m8Jk9Q8k1j4p8R1o0j4Q1N7j02J7K5M8noJ8k2l6J6kl8
4449f8L8M8m4K4j1K8K5n3lpK4J8K7l2K6p5O6j0Ql3K4O2m7Kk1RL0M8o4N6Pp1J24
4482A55m6p6J05r3k4J13r8R5o3O6n8L2k5j8L3jo8Q9j05j2P7o9M9Rn9K0M3o2N7
4511F6K7p0lkn4O0j3M8j6pj5l0j7N4lM8j18O7m9Q0p1m5O5o4N5JRRJ5o0%K9Km7
4545d9O5n7j4N9l9j5M3J1jr6P5q1Q8m7O6n9L9k1l1N6l8NK3Pj05J4L1j9P5m4J9
4576d0M6m5k2J5j1L6J5LJ2j7o5J17l9kJ8%J8k1O6l9M9j10N6L6j6j03N0Q6rp1K6
4607C9oo7O5j4K1m2Qk3Q9k9L0l6J6k3J7j2k9L9n2K5l6Q3o8J8K8NJ6j3k5k4K5r4
$$ plain form
4639 -69 -7 4 31 -31 12 58 -23 12 -32 62 -15 40 72 -6 15 20 28 38 0 -27 8 -21 46 -14 23 -2 -5 -41 -12 -17 -62 -27
4671 -27 -24 -26 -7 -5 -2 -14 -57 -4 -9 -30 -70 -64 -24 -20 -45 -49 -30 -12 46 53 -55 4 -15 -9 -25 8 6 44 -9 38 21 -2 -21 -33 -23
4706 -23 94 37 -1 49 6 -17 -28 1 0 2 76 7 -58 40 47 0 27 5 -9 46 35 8 -13 21 -16 -15 1 -21 50 -18 -10 -14 -16
4739 -16 -3 -10 -45 0 -26 -17 19 20 58 -81 39 29 -41 8 12 8 -24 41 -51 29 35 31 -19 64 2 4 16 -8 73 51 32 -1 7 -23
4773 -23 30 16 7 99 45 -12 16 48 32 2 -1 -61 2 -58 -8 -40 1 -16 -89 -18 4 -41 -60 -41 -1 -22 -43 -20 -33 35 24
4804 24 -36 30 58 8 -19 -3 -22 5 -1 -38 12 4 43 -26 -31 -5 13 24 9 1 0 -30 73 -11 58 26 32 -59 -66 -23 35 -42 -11
4837 -11 -24 -52 -13 -88 -16 60 31 3 -24 8 -11 -20 -28 -44 28 -43 -54 -82 -24 36 -4 -49 1 -27 6 -14 -4 -52 -31 15 2
4868 2 44 61 40 -34 49 49 55 49 -59 16 31 -10 10 74 14 6 -22 68 -4 42 12 112 18 77 61 -7 36 -30 58 32 55 19
$$ packed form
4639f9O2J1K7o2M3M6q1L5m4R4p7N5L2p8K1NQJ0l8k7L5k9O7o0L7k5ll6K9nm5L5
4671b7LkJ9KLj2m3N3nk1m0OM0Mk5mJ9J8N8Pj08N9j9Oj6L3kL8n3M7j7k3j9j2J0
4706b3J17n7l8N0m3k3j1K9jKP4o9o5R8Pm7K7k2j4N5j1k7k1L4l7JJ6k2P1o8Qmk
4739a6J3pl5M5k6RL6JL8j39J20j0p0M9Mml2O5r2Q0Omn0Q3o2KJ2k4Q1k2j9l3Ql0
4773b3N3j4rR2n4n7K8L2j6l0lo0O3o0N0l2M1j7p3P1K2m5j9J9M0k1k1K3j3O8j1
4804B4o0O6K8n0k7J6j9K7ol7N0qL9o9nK6J8J1j5qjl0J03q4O9l2Or1pM3N8p7L1
4837a1j3k8L9p5P2P6k9k8k7L2j9rqj6P2p1j1k8N8O0m0m5N0k8L3k0J0m8K1M6j3
4868BM2J7k1p4Q3%Ooj08P5J5m1K0O4o0qk8R0p2M6l0J00r4N9j6o8M3o6Q8k6K3l6
$$ plain form
4900 19 78 -29 -45 6 -23 22 14 26 71 48 31 25 110 55 -27 37 18 -32 33 4 -7 9 52 16 -47 -38 -34 19 -1 14 -14 4
4932 4 53 -44 -10 -31 -31 9 -12 -38 6 15 60 -63 -49 4 -27 -20 -87 -36 -36 -59 -12 -74 -70 -49 -14 5 -36 -10 -17 -93 -89 -63 -99 -49
4966 -49 -53 -64 -42 8 -87 -53 -16 -80 -90 -92 -23 -65 -1 -69 -17 -51 -65 -63 17 -29 10 -31 14 -40 -43 -33 44 25 -14 85 -43 -31
4998 -31 -59 -56 1 -25 -61 -30 -30 -37 -66 -75 -55 -10 5 -91 -20 -13 41 19 42 -44 -23 -39 6 28 9 72 26 -21 47 44 -24 54 13
5031 13 -1 38 56 9 27 85 11 20 57 46 60 34 6 52 74 129 20 93 35 38 31 88 2 112 101 52 63 60 54 43 59 67
5063 67 42 51 36 55 50 56 47 67 67 53 -25 22 41 -7 5 -33 -32 -3 -21 35 11 -10 12 -23 -1 -24 8 -6 -3 -1 12 26 -6 -15 1
5098 1 -16 17 -2 70 -39 -28 -10 -3 -26 2 0 -26 -20 -59 10 68 -25 29 -19 -27 39 -29 36 -64 -31 -3 -6 -13 -17 -16 27 5 -55 -7
5132 -7 -28 -46 -54 -41 -27 -1 5 -26 -48 -39 14 -56 15 -59 -31 -1 -56 55 -43 8 35 13 33 40 69 3 43 -17 -35 24 30 -25 12
$$ packed form
4900A9N9j07j6N1k9M5qJ2M5k3j7oQ5n5q2O4j9n0O5k9j1J6M3l6o3RMN3k0J5k8J8
4932DM9r7L4k1%M0k1k6M4RM5j23J4N3l1Po7N1%k3M7o2MK1L5J9m1K6pp6MK6l6N0
4966d9mj1K2N0r5L4L7o4j0kO9m2O4o8N2l4j4KQ0m6L9m1M5n4lJ0P7j9l9R9j28J2
4998c1k8LN7k6l6L1%pk9rK0M5J5r6P1PN4k2K3q6K1j6M5K2j9O3m6m7O8lo8P8m1
5031A3j4L9J8m7J8N8p4RL7j1J4k6k8M6K2N5j09P3n8LpN7q6J10j1m9J1loj1J6Q
5063F7k5Rj5J9nOrK0%j4p8M7J9m8J2l8JK9j8N6k4k1K2l5K2k3L2j4LKJ3J4l2rJ6
5098Aj7L3j9P2j09J1J8Pk3K8kk6Ol9O9N8r3N4m8qO6o8O5j00L3K8lpmJM3k2o0M8
5132gk1j8qJ3J4K6Ol1k2RN3p0P1p4K8L0n5J11r8N1K7k2K0PK9o6M0o0j8N9On5L7
$$ plain form
5165 12 6 58 46 -12 8 -42 12 27 46 -58 40 13 36 -35 -36 -22 -36 24 7 35 -11 43 -19 -67 70 -73 13 -6 9 34
5195 34 -30 70 -102 -27 55 -48 -71 -28 -46 -12 -34 -29 5 -17 -36 -6 -12 17 -10 -50 14 39 28 -67 -13 -21 -15 -37 -35 52 -11
5226 -11 85 20 -25 -51 -38 -39 -51 -54 39 -67 -69 40 -37 17 -57 -78 -31 -61 3 -19 -27 -81 -3 -32 -42 -62 -89 -31 9 -63 -18
5257 -18 -35 -1 55 -10 -24 20 -15 -68 -28 -7 4 21 5 5 4 11 11 -25 74 47 78 29 -14 -43 5 -14 -36 68 41 42 -19 85
5289 85 113 2 65 28 30 -4 -17 38 -2 48 8 -3 -21 21 70 45 64 58 -9 53 93 4 8 17 50 44 -29 4 31 29 15 77 96
5322 96 -5 3 49 95 34 7 61 71 44 88 34 43 3 10 2 -11 36 27 -8 -14 -1 57 44 63 29 -12 55 23 13 -22 -42 14 -18
5355 -18 43 19 -11 10 14 -53 16 -16 7 8 -74 -47 6 -57 -66 3 18 40 30 -60 -22 -35 15 22 17 -55 23 17 -68 14 53 -23 71
5388 71 -14 12 -11 21 -25 0 -8 -39 8 -19 5 -26 -62 -64 -14 41 -19 21 -9 12 -52 -62 2 6 29 -72 -60 19 -16 -13 -17 -27
$$ packed form
5165A2oN2j2n8K0n0N4J5J9j04R8k7K3p1jJ4j4O0j7K8m6N4o2m8J37j43Q6j9J5K5
5195C4o4J00j72P5Q2j03k3M3j8L4k2NL4k2j9L0oK9k7m0O4K5j1r5N4qOk2KQ7o3
5226a1R6o5m5k6J3jj2lR3j06kJ09p7N4p4k1M7l0O4k2qn4P8k9j0k0k7N8M0p2M5
5257a8j7L4N6o5j4M4l5n3M0K1J1J7j6%jP%l6R9k7L1m9m3k9M8j9k2J04k7Jo1J04
5289H5K8j11O3l7Kl4j3N5m0N0m0j1j8M2M9k5J9oo7O2M0q9MRL3op3L3K7kj4O2J9
5322I6j01QM6M6o1k7N4J0k7M4n4Rm0Pqj3M7rl5oJ3N8j3J9l4m1O7l2j0l5k0N6l2
5355a8O1k4l0K1Mo7O9l2K3Jq2K7N3o3rO9J5K2j0r0L8j3N0Pnp2P8oq5Q2L9p6R4
5388G1q5K6k3L2m6K5ql1M7k7K4l1l6kN0N5o0M0l0K1o4j0O4MK3j01J2P9l5Lmj0
$$ plain form
5420 -27 -23 -48 -58 9 21 -49 -28 -23 51 -19 -19 32 5 20 -31 12 -46 39 -35 7 24 -16 -17 20 26 18 15 -31 -26 41 -59 30 3 3
5454 3 34 -37 19 -31 -5 -45 10 -6 -85 28 3 18 49 -20 1 22 -9 -23 70 21 -13 -37 -21 -33 -17 -11 17 21 -63 35 -28
5485 -28 -39 47 35 14 31 -16 19 -39 -21 10 -18 25 -18 -12 51 45 -30 39 -43 -46 1 11 -21 -19 14 2 -31 -25 22 29 22 35 -25 -33
5519 -33 -20 -34 -39 46 36 -29 -55 1 -23 23 8 -10 -34 4 -55 5 -26 -40 -14 -30 12 -12 -34 -32 -29 37 46 18 51 -15 12 -12
5551 -12 -22 30 3 -29 56 -25 4 7 65 44 12 40 -16 36 13 1 -30 54 -52 -32 52 -35 70 -32 15 43 -42 31 32 13
5581 13 9 0 20 22 -2 -4 1 1 44 21 82 77 13 44 49 18 21 -31 47 38 16 -21 -23 29 51 39 32 -24 45 87 25 48 53 15 -16 -11 -20 3
5619 3 33 48 -13 -30 -18 80 65 0 98 10 -88 -19 -22 53 10 15 43 -10 -29 -44 -26 -8 28 -29 -84 -14 30 -16 -31 -42 5 58
5651 58 -17 -14 4 -14 22 -21 -45 -35 -36 43 -76 -19 27 26 10 -12 26 8 32 -23 8 -73 13 13 15 -30 6 -8 24 24 6 -41 -14
$$ packed form
5420b7Mk5j0O7J2p0K1NP4p0%N1k7J5n1M3n8Q5p4M2J7m0jL7Oqlm6NO7j00Q9k7%
5454CL1p1N6n0K6m0N5j6p9J13k5J5L1o9K1K1l1j4R3m9l4k4J6j2J6OK8Mq4R8o3
5485b8j1Q6j2k1J7m7L5n8J8L1k8M3m3OO3op5O9q2lM7J0l2KL3j2l3OM7PpJ3o0q
5519c3J3j4nQ5j0o5k6N6k4M6j5j8k4L8n9O0l1j4K6j6M2k4k2KLO6Rk8L3o6K7k4
5551a2j0N2k7l2Q5q1K9LN8k1l2K8n6N2k3j2l1Q4j06K0Q4q7J05j02M7K8q5P3Jj9
5581A3mrK0Kk4kN%M3k3O1no4L1Nl1Ln2P8rk2l7kN2K2j2pn6O9M2o2K3Nl8l1NrK3
5619CL0J5o1j7J2R8j5o5R8q8r8O9lP5m3NK8n3j9j5J8J8L6n7n5P0M4m6j5j1M7N3
5651E8p5LJ8j8L6m3k4J0jP9j19N7M6jj6k2L8j8K4n5L1q1Q6%Km5L6j4L2%j8m7K7
$$ plain form
5684 -14 10 32 56 -46 -4 -43 78 22 3 -22 26 -63 -51 -6 87 15 19 12 66 -9 21 1 33 72 45 3 12 48 -16 24 51
5715 51 81 19 49 -14 32 76 -5 46 19 -8 -12 59 48 88 -5 -4 -12 22 44 81 -7 3 -34 -10 -31 -6 31 -38 -110 -41 -49 -60
5747 -60 -3 20 -51 -19 -16 -46 36 -8 6 -71 -25 -27 28 -47 -44 10 -24 -21 -33 -58 -29 34 35 13 51 31 -11 68 -44 -1 -54 -16
5779 -16 -11 -72 16 2 -24 -47 -36 9 -49 58 -10 -27 -13 -32 -3 27 -56 -54 -12 -83 12 -4 -62 23 -52 -50 -19 18 -87 -47 -28
5810 -28 -27 -51 -14 -37 -20 -10 2 10 -28 -37 -60 -6 -18 -36 -54 -13 -58 -7 -48 -32 25 29 -12 20 -4 -29 43 -20 -16 -29 -11 -22 -38
5843 -38 50 77 79 -2 44 28 26 -18 3 -62 48 56 55 31 -83 61 8 11 23 18 -35 -47 -3 -29 -1 -40 -13 3 7 23 30 -4 10
5876 10 -42 43 -27 -13 11 23 -20 -12 56 3 5 22 -13 41 -30 -16 19 62 9 78 -23 29 59 59 75 109 38 7 68 -48 -62
5907 -62 -20 26 -34 10 76 41 -25 83 -7 26 -46 21 23 -2 -15 65 39 20 20 6 -1 25 18 -2 -35 33 11 -19 -33 -68 17 -36
$$ packed form
5684a4K4K2K4j02M2l9J21n6j9k5M8q9J2M5R3p2MpN4p5L0k0L2L9k7m2RL6o4M0K7
5715E1L0o2L0o3M6M4q1N1k7k7mP1j1M0r3JqL4K2L7q8J0l7K4k1K5L7o9p2O9qj1
5747f0N7K3p1L2Ll0Q2m4J4p7M6kN5p5LN4l4Lj2k5K9O3Jk2L8k0m2P9j12M3n3L8
5779a6No1Q8j4k6k3J1M5n8J07o8j7J4j9K9L0q3KM2p1R5j6n8Q5p5KL1L7j05M0J9
5810b8Jk4L7k3J7J0J2Ql8rk3N4j2j8j8M1m5N1m1J6N7Mm1L2k4k5P2o3Mj3J8j1j6
5843c8Q8K7Kq1M6j6km4K1o5J10Qjk4j14J44n3LJ2nn3j2M4k6K8l9K7J6MJ6Pl4J4
5876A0n2Q5p0J4K4J2m3QO8n3KJ7l5N4p1J4L5M3n3O9j01N2L0%J6L4p1l1O1j16j4
5907f2M2M6o0M4O6l5o6J08r0L3p2O7Kk5j3Q0k6j9%j4pK6pk0l3O8k2l0j4l5Q5n3
$$ plain form
5939 -36 37 -51 37 -62 29 66 36 55 -21 -5 -12 -25 15 -4 -29 70 21 -17 -43 42 11 2 -9 67 23 -10 20 -23 -22 -48 4 16
5971 16 41 -31 -26 10 -4 -27 -45 -44 5 13 -50 -16 -72 -31 -74 27 14 -44 -42 12 -10 -95 15 -43 -34 -9 -16 56 -67 -7 0 -59
6003 -59 -4 -32 22 20 -17 5 -3 13 58 32 20 27 55 -54 -7 39 -51 -33 13 -32 -9 42 -64 -4 18 71 -34 11 -16 -33
6033 -33 53 3 -16 39 42 12 -2 10 5 3 -16 -9 19 34 -85 -16 -5 -19 -57 -35 21 23 4 -52 -53 16 25 -4 -1 14 -69 -8 -52 19
6067 19 30 -61 4 21 9 36 -10 -8 -63 3 -8 -13 -19 -28 58 -64 -27 13 55 63 34 -27 33 -7 57 -31 -21 50 -2 2 32 43 -16
6100 -16 -46 12 46 17 19 -71 -23 34 52 -61 -22 -23 -75 -17 -18 22 25 38 43 -31 3 -9 -9 67 -24 -22 -20 -1 48 -24 3 -8 38 -15
6134 -15 41 -1 13 3 -6 20 17 3 -1 37 49 16 48 -25 -48 -6 37 -12 44 5 42 31 -1 105 22 9 2 2 25 40 16 -9
6166 -9 18 69 -11 -54 4 81 -39 -23 -21 -15 36 -6 -4 34 15 20 28 13 -19 -9 -12 0 25 -15 -5 -32 29 76 -69 3 -34 -3 38
$$ packed form
5939c6P3q8Q8r9R1L7l0J9p6J6pj3M0j9k5R9m9l8k6Q5l1rj1P6m4l3L0m3Jk6N2J2
5971A6K5p2NL6j4k3j8JM9Qo3L4n6M1m3J01j3n8KN4k2q5J10n8RK5pP2j23O0Pn9
6003e9N5k8N4kl7K2qJ6M5k6j2PK8j09M7M6r0J8M6m5K3N1j06O0K2N3j05M5k7j7
6033c3Q6n0j9N5Ll0j4J2nkj9PK8J5j19O9J1j4l8K2N6Kj9n6jO9Rk9LJ5q3O1m4P1
6067A9J1r1O5J7j2K7m6Kn5O6j1norQ6j22L7M0M2Qk9o1O0m0O4q8J0P1n2ML0J1n9
6100a6l0N8L4k9Kr0M8N7J8j13L9jn2N8jM0LJ3Np4L4j2%P6r1KKJ9M9p2K7j1M6n3
6134a5N6m2J4j0rK6lj4mL8J2l3L2p3k3M2M3m9N6l9L7j1l2J06q3j3p%K3J5k4k5
6166iK7N1q0m3N8P7j20J6KON1m2KL8j9NQj5l2J0lJ2K5m0J0k7O1M7j45P2l7L1M1
$$ plain form
6199 38 27 40 12 -16 23 -45 -31 -23 -29 2 -21 5 46 26 -21 -60 -115 -22 -6 17 1 33 -67 -21 15 -1 29 5 46 49 -68
6230 -68 -40 -5 -48 -11 -39 -13 -48 -27 -43 -84 27 48 18 -25 -4 -83 6 -13 -61 -66 52 -25 -38 40 -13 -66 43 0 -8 -8
6260 -8 52 14 -33 37 -12 25 16 -23 -5 11 -41 -15 -56 18 -7 -33 -29 -20 7 12 13 24 5 43 99 31 84 16 -32 24 -83 49
6292 49 24 -8 -36 17 16 5 -30 69 22 -26 34 -5 55 -16 -20 -21 -18 -7 37 21 -37 -2 39 22 13 -6 48 -27 -35 44 -4 -11 51 -13
6326 -13 17 18 -14 21 -27 29 -7 -12 -31 -53 -30 -18 10 -22 -7 -25 -43 -27 11 -16 17 -59 -7 17 -1 -29 -20 -70 -49 -15 -26 -9
6358 -9 48 -29 -3 -53 -43 -71 -17 -29 22 60 -76 25 -33 -25 15 -14 -30 32 -31 -27 -56 -5 10 -80 -40 -51 55 -46 33 35
6388 35 2 50 4 -18 -22 18 25 27 2 38 24 15 4 77 15 -25 3 31 36 60 65 33 35 62 54 93 -4 18 -34 8 60 44 25 53
6422 53 -68 58 41 47 57 62 31 4 -3 -33 63 -37 52 13 3 -43 -17 -30 11 -23 -14 12 9 64 -37 -26 45 51 -24 -26 2 50
$$ packed form
6199C8j1J3k8k8L9o8J4QoL1k3K6M1k0m7l9n5R3J6K3j6L2j00M6L6j6L0k4M1Lj17
6230f8K8L5m3L7k8K6l5K1j6m1J11K1l0m3K1p9Q9j9m8nJ18p7j3P8n3n3J09m3q%
6260hO0l8m7P0m9L7rl9J8J6n2K6m1P4k5k6MRK7NJJ1j9L8N6o8N3o8m8N6j07J32
6292D9k5l2k8N3jj1l5R9m7m8O0l9O0p1mjLJ1M4j6n8L5M1j7rj9N4p5qP9m8pO2o4
6326a3L0Jl2L5m8N6l6nj9k2K3J2K8l2J5j8j8J6L8k7L3p6N2K4j8k8Rn0K1L4j1J7
6358iN7p7K6n0J0k8N4j2N1L8j36J01n8QM0k9j6O2o3Mk9N1J5r0M0j1J06j01P9K
6388C5l3M8m6k2mM0PKk5L6j4rj1P3o2m0K8K8NK4Nl2KK7qL9r7K2n2M2N2j6j9K8
6422E3j21J26j7OJ0Nl1k7pl0R6j00Q9l9j0m6K6j3M1l4RK6lN5j01J1P1Op5kK8M8
$$ plain form
6454 50 25 3 -55 -18 -5 -9 -2 35 30 61 -31 3 10 11 38 2 -23 -27 20 -2 11 59 -34 -38 -14 27 19 41 -18 27 9 14 -14 41 -29
6489 -29 -20 24 50 21 -54 13 -60 63 -3 -45 -19 -65 -18 -36 -27 44 54 36 -16 19 2 -17 67 28 38 44 -62 -20 -19 -5 23
6520 23 15 38 75 26 22 42 33 2 21 -12 58 59 52 19 -26 30 37 -79 15 -4 -9 -30 20 33 -3 47 -3 -47 -15 14 -14 -39 14
6553 14 4 -73 -6 -3 -12 53 -22 -50 -53 45 -31 -35 76 61 -20 -40 -34 -40 -25 38 -34 31 61 -23 -19 3 -18 -14 -10 14 -2 8 4 43 1
6588 1 28 4 -46 6 -9 -7 -63 -4 -13 -29 -36 -10 -59 -7 37 8 -125 -3 29 14 -28 -17 -27 18 -62 -31 -34 -9 -5 -19 2 -25
6620 -25 -37 -2 -15 -42 -18 -9 13 -6 -57 -58 4 9 50 -2 15 -54 0 -30 -21 23 -20 -1 -4 -25 -3 21 2 69 -2 -13 -68 13 -31
6653 -31 -19 38 -33 -8 15 8 -21 -22 -33 -11 5 -32 -25 -31 13 18 29 -3 -16 -58 -2 -27 -40 34 5 -47 56 -8 -21 25 -106 -14
6685 -14 56 -8 -41 -22 -38 -42 -6 19 -29 11 28 39 0 89 -35 5 55 72 -15 -34 14 28 71 -69 15 -12 43 -24 60 100
$$ packed form
6454E0k5k2n8L7J3mPL7nL1r2L4PJK7l6k5mM7k2J3M8r3mK4M1qK2n9M5j8Nk8N5p0
6489b9RM4K6k9p5O7p3J23o6m2K6m6M7j8RP1J0j8n2L5j7j9Q4l9J0Oj06M2JJ4K8
6520B3qK3L7m9mK0rl1J9l3P0Jpl3m5N6Pj16R4j9nk1N0J3l6N0n0m4L2K9k8k5N3
6553A4j0p7O7LrO5p5k8lR8p6mJ11j5q1k0OoJ5O3p2O5L0q4MK2k1MMK4j6J0mL9m2
6588AK7k4n0N2j5Kn6N9rj6pK6m9N2M4k9j33J22L2j5m2J1j0M5q0L1lK5Mj4K1k7
6620b5j2L5j3k7K4RK2j9n1jO2NM1n2J7o9N4l0RM4m3J9lk1K2K4j9O7p1j1n5Q1m4
6653c1J2N7p1K5K3pk9jj1K2J6l7PoM4NJ1l2j3m2N6k5j3P4k9n2J03o4j3M6j31R2
6685a4P0o4l3J9j6mL6K5m8M0J7J1l9Q9j24M0N0J7q7j9M8J4M3j40Q4k7N5o7Q4M0
$$ plain form
6715 100 -71 44 37 -42 10 44 -15 69 52 5 -6 30 5 26 62 8 61 68 34 26 24 35 33 -16 20 6 19 19 -18 50 15 -5
6747 -5 43 71 -20 53 -26 -15 1 -36 -55 55 63 -18 6 -106 8 32 -61 -7 47 -28 17 39 0 30 -31 9 4 9 -31 3 40
6778 40 1 25 -59 -26 25 -37 -21 9 -4 8 -33 -16 -72 12 -15 31 -8 23 8 -41 -19 16 22 8 1 -21 36 -30 65 -48 -7
6809 -7 -6 42 -55 -24 42 -9 -11 -24 -11 -42 14 -47 -23 -48 34 -37 -54 -14 0 -36 -6 -28 32 -16 -1 0 0 51 -30 58 -89 -17
6841 -17 23 -5 -37 -20 -35 -58 25 -49 3 22 -30 18 -51 -49 10 -35 41 35 -2 13 -28 -6 -34 -44 -20 -51 -12 -24 -2 -23 0
6872 0 -45 -18 31 -15 -11 -81 -60 -11 -39 -62 5 54 20 -12 -11 35 -70 5 -5 -26 -9 0 -30 45 -28 24 -17 14 41 -35 -7 -15
6904 -15 -120 18 -30 4 -41 -69 -31 -26 22 -40 -13 20 50 8 47 4 -75 45 20 -45 -2 2 -8 -59 -49 -11 27 -34 -23 -3
6934 -3 10 22 -10 15 -18 -37 -17 4 37 -3 -3 -4 -31 22 -8 17 108 -10 8 -9 123 15 47 7 30 0 37 55 -30 61
$$ packed form
6715A00j71J15pp9N2L4n9Q4j7m7j1L6k5K1L6n4N3Pl4qkJ1km9L6j4J3%l7O8l5k0
6747eM8K8r1P3p9J1J6l7j9J10Qq1K4j12J14K4r3N4N4p5M5K2l9L0o1M0nNm0L4L7
6778D0l9K4q4L3N1o2J6L0j3J2m1J7n6Q4k7M6l9L1j5m9K2L5Oj4pk2N7o6R5j13M1
6809gJM8r7L1O6n1kj3J3l1N6o1K4k5Q2p1j7M0J4l6L0k2O0m8J5J%N1q1Q8j47P2
6841a7M0k8l2J7j5k3Q3p4N2J9n2M8o9KN9m5P6ol7J5m1K2k8j0K4l1L9j2K2k1K3
6872@m5K7M9m6Mp0K1M9k8k3O7M9l4l2JM6j05P5j0k1J7Rl0P5p3N2m1L1K7p6K8q
6904a5j05J38m8L4m5k8L8NM8o2K7L3L0m2L9m3p9J20k5o5M3Mj0n1J0L8L8o1J1K0
6934cJ3J2l2K5l3j9K0K1L3m0%jk7N3l0K5R1j18J8j7J32j08L2m0K3l0L7J8q5R1
$$ plain form
6964 61 30 73 10 41 6 -36 19 34 -14 39 71 58 39 29 25 83 14 -57 1 42 23 48 12 39 57 86 3 21 -48 -16 60
6995 60 74 67 31 16 -5 -29 -18 18 14 -33 -3 2 65 -4 43 37 3 -59 -53 8 51 -14 -14 12 4 -15 24 55 9 3 -16 -3 21 23 -62
7030 -62 3 33 18 -30 4 20 37 3 -16 0 -54 -84 26 35 -56 -29 61 -12 -60 -89 -46 -44 12 -21 0 -32 8 22 -10 59 -59
7061 -59 26 -40 -30 -31 -20 -25 -22 19 -20 -3 -35 19 34 -10 -88 -7 -15 -18 63 -52 16 59 -5 9 5 -1 7 -20 -42 48 56 41 27 -61
7095 -61 56 26 41 13 36 -22 8 12 -23 8 44 -8 2 -32 19 21 -28 16 -55 2 -83 -69 10 7 -7 -24 16 29 48 -5 -57
7126 -57 42 1 15 18 -45 42 -25 48 -30 -23 27 -16 -10 83 92 13 -20 -13 35 16 -5 45 -61 20 -35 15 16 88 -21 -35 -3 18
7158 18 4 17 33 -66 -3 -14 45 6 -13 -3 29 6 -22 2 -47 13 9 -71 13 -10 -9 -3 6 34 0 -19 3 14 -67 28 45 22
7190 22 -26 -24 -62 18 -29 25 -80 -27 -33 42 -12 -15 -19 -25 24 -15 0 -65 -54 -13 -24 4 -6 23 -10 28 5 -4 35 14 -9 4 -12
$$ packed form
6964F1l1M3o3L1l5m2N5J5m8N3L2j3j9j0mN8o9p1N8M1j9K5l6K7J8K9q3J8o9L2P6
6995F0J4pl6j5k1k4J1L6mm7L0NO3o9M7ol4o2OO1M3o5%K6qj9L9L1m6oj9J3K4Kq5
7030f2O5L0j5m8L4J6J7l4j9J6n4l0J10Rr1K7R0p3m8k9M3KN6l3K1l2M0J4l2O9j18
7061e9Q5o6J0jJ1nLM1l9J7l2N4J5m4p8Q1qlQ1j15O8M3o4J4moQk7k2R0Qj5j4q8
7095f1J17l0J5k8K3n8L0Ml5L1L6n2J0l4N1Km9M4p1N7q5J4P9lj4j7M0J3J9n3n2
7126e7R9m1J4Lo3Q7o7P3p8PN0m3OR3Rp9l3PM8j9k1N0j06Q1n5N0JP2j09j4L2K1
7158A8j4J3J6r9O3j1N9l9j9J0L2k3k8K4m9O0mq0Q4k3JORK8l4j9K2J1q1R5J7k3
7190B2m8Kl8Q0m7N4j05N3oP5n4lmoM9l9J5o5J1M1j1K8j0K9l3L8k3rL9k1k3J3j6
$$ plain form
7223 -12 27 -67 3 46 13 1 26 -9 -18 -29 -27 -37 -20 37 -20 16 25 7 33 21 44 22 32 9 19 44 -8 -16 -56 -9 27 24 -7
7256 -7 9 55 -22 -16 12 7 -5 -26 48 -29 36 0 67 4 38 11 4 -6 -41 8 19 -15 -7 2 -31 -23 36 -21 -28 -3 12 25 -19 17
7290 17 57 -37 -9 58 -26 -37 16 41 28 43 -15 2 5 -13 -58 89 -8 17 -51 21 40 -3 8 22 -13 31 58 -43 38 31
7320 31 -41 7 -5 -21 53 50 46 8 -32 44 -3 -7 20 8 56 -58 -50 4 74 -69 7 -30 -17 32 66 -19 27 10 87 43 30
7351 30 -19 3 -2 -15 -24 8 9 -9 -22 46 -30 34 11 1 -11 -53 -19 26 68 -50 -10 13 -3 -19 12 40 -26 -14 9 43 57
7382 57 16 47 13 20 -3 -16 -12 -7 -14 14 -22 -61 -37 18 33 -32 -58 -40 -7 -62 -13 -28 10 14 -15 22 -24 -14 -24 10 -48 -17 3
7415 3 -23 5 25 73 29 -47 -4 10 9 14 8 -7 -50 -2 -8 -32 -18 -14 11 32 18 -33 8 16 -35 16 -28 -27 -19 -24 -45 -52 53 5 -44
7450 -44 -49 -7 -23 -59 -6 1 -81 -19 25 -1 -5 -80 77 0 -75 -13 -50 1 -45 55 26 -60 32 -11 23 16 17 3 11 32 -9 55
$$ packed form
7223a2L9r4P0M3l3j2K5l5rj1Kj0J7N7n7L6Rj8K6j2K3k2J0k3J0K5n2qm0M7L6ll1
7256gJ6M6p7OK8nj2k1P4p7O5l6O7o3L4k7pj0l5M9J1l4QRl3QN9n7pK5J5J3m4L6
7290A7M0r4K8O7q4j1N3K5j3J5n8J7Lj8m5J47r7K5o8P2J9m3J1J4l5M4K7j01Q1p
7320C1p2M8j2j6P4lml8m0P6m7mK7j2M8j14QN4P0j43P6l7J3M9L4q5M6j7P7m4j3
7351C0m9K2nj3rL2Jj8j3O8p6O4k3j0j2m2L4M5M2j18M0K3j6j6L1K8o6J2K3L4J4
7382E7m1L1l4Pk3j3MNpK8l6l9K4N5J5o5k6J8L3n5M9j5L8Mk9L7m6J0j0L4n8L1K0
7415Ck6K8K0M8m4p6M3J4jNoj5m3M8ok4J4MK5K1j4n1M1Qn1N1m4JQnk1pJ05m8m9
7450d4nM2j6l6N3Pq2O2M4k6mp5J57p7p5O2l7N1m6J00k9q6R2m3L4pJj4QK1m1O4
$$ plain form
7482 55 38 39 -10 -32 -36 -14 45 -16 12 22 -21 18 23 -9 4 15 7 11 36 30 -4 -13 1 32 65 -39 50 43 8 -2 11 -20 -11 11
7516 11 19 16 10 24 43 29 4 -18 -62 -10 108 53 -36 62 -8 48 64 13 11 25 39 -32 57 -4 -18 2 -13 65 13 32 63 41
7548 41 -57 7 9 44 23 33 101 72 8 28 -9 6 19 -48 -31 39 57 39 34 6 7 -46 -38 -19 -25 -5 11 -30 -2 -4 13 32 -30
7581 -30 -9 47 -8 49 -40 24 -6 -1 11 11 -46 7 24 -26 -2 14 45 11 55 -15 -37 -17 -16 12 -11 41 11 -19 -27 -18 -27 -36 41 -33
7615 -33 -31 8 -39 -28 -21 24 -18 46 -77 -33 -27 -43 -48 -30 -10 -4 4 -3 -19 13 -16 -60 56 -47 54 -29 -64 0 -58 16 -50 -44
7647 -44 42 35 38 15 59 -16 -25 -25 -42 -66 12 45 6 9 -22 -52 -48 -33 -7 26 43 13 15 18 -18 38 13 -6 -50 62 -8 -46 1 -62
7681 -62 -10 -12 27 -31 -13 -31 14 -25 -39 15 -32 35 3 22 -11 -85 22 -36 33 34 22 -34 18 58 -22 35 -43 34 -22 -32 11
7712 11 41 21 22 5 5 -12 10 -32 3 12 53 -56 15 17 92 -50 -25 35 11 47 -4 63 -27 -17 -19 -3 -18 21 24 24 58 53 63
$$ packed form
7482E5j7Jm9k2mK2N9o1K8J0m3L9Nl2J3J1qMK5ol4rJ4L1L3j04Q9pl5j0J3l1RK2
7516A1QloJ4J9j4k5k2m4N2J18n5q9R8p0N6J6n1kJ4J4p1Q9o1j4K0j5P8n2J9L1k2
7548D1r8O4KL5k1J0O8k9o4K0l7J5J3o7J7P0J8j8nk8Jn3QJ9oK0J6m1K8kJ7J9o2
7581c0K1N6n5N7q9O4l0NJ2%n7N3J7n0K4J6L1l4M4p0k2K0JK8k3N2l0l0qRrrP7p4
7615c3KL9m7J1PM5m2O4j23M4Oj6nJ8K0OQpj6L2k9m4J16j03J01q3l5O4n8P4o6O
7647d4Q6pLk3M4p5r%j7k4P8L3l9Ll1l0MJ5K6L3J7l0KLl6N6k5j9m4J12p0l8M7o3
7681f2N2kL9n8J8j8M5l9j4N4m7O7l2J9l3p4J07n8O9Jj2n6N2M0q0N7p8P7n6j0M3
7712A1L0k0Jj7%j7K2m2L5RM1j09P1KP5j42K5O0k4L6n1O7r0J0kJ6j5L9L%L4nJ0
$$ plain form
7745 63 14 1 25 47 10 -53 -2 31 -10 -7 -79 25 -5 -26 6 -8 1 21 -17 11 -25 28 13 -6 -1 -15 -24 9 -20 -14 -44 -3
7777 -3 -1 -5 5 -4 30 13 -46 5 32 -16 -56 -23 -15 49 18 -36 -44 -3 16 24 -44 -6 3 11 -16 -30 -8 -59 -42 -35 -10 12 -17 14 62
7812 62 -7 28 -3 -4 32 3 -43 17 0 59 38 -22 -36 -13 16 -79 -28 -15 16 -47 6 -43 34 16 7 5 32 11 -1 -17 -49 4
7844 4 22 -43 60 37 15 5 8 93 -7 -25 -27 19 -24 57 -3 21 -15 3 34 0 29 -28 -26 25 5 8 -25 -44 42 -10 22 34
7876 34 31 15 -50 -17 -28 88 65 -36 17 -3 4 -57 38 -19 -10 6 -1 27 17 -19 -18 -60 0 -1 -22 -22 28 24 57 -14 43 61 32
7909 32 44 -36 12 26 -31 -25 -7 -39 -2 -20 61 7 48 21 88 59 70 21 17 40 -31 14 -5 34 20 18 -28 2 69 15 -44 47
7941 47 -3 -3 13 8 35 23 60 114 4 19 -9 31 8 19 -27 37 13 47 46 -12 63 -41 -2 12 1 -27 -16 0 -1 -8 26 -21
7973 -21 -23 -16 -54 -4 -12 11 22 37 -24 3 5 42 47 38 -49 -56 6 0 33 16 25 20 -2 -28 -40 17 1 -5 -36 -40 -23 -45 26 -23 2 31
$$ packed form
7745F3m9j3K4K2l7o3N1L3m1Lp2J04l0k1L2j4RK0l8K8l6N3j5j9Nj4rL3k9Ol0M1
7777cKmJ0rL4j7n9N1K7m8m0L3QO4l1n4qM1J9Qo8L8RQk7j4K2n1J7PK5K2k9L1M8
7812F2o9L5l1jL6k9m6O0j7N9k1o0j4K3K9r5N1J3L1o3N3m9P7j8rkK7k1j2j6l2N3
7844DJ8o5J03k3k2j0LQ5j00j8kM6m3Q1o0K4l6J8L1l4K9n7KN1k0Ll3j9Q6n2L2J2
7876C4lj6o5L3j1J16k3j01N3k0Po1R5n7RJ6pK8j0l6Jm2O0jk1%N0mL3p1N7J8k9
7909C2J2q0M8J4n7OJ8l2L7j8Q1n4M1k7O7k9J1m9mK3p1M5j9L9j4km6L0O7n4n9R1
7941D7n0%J6nK7j2L7N4j10J5k8M0k3J1m6O4k4L4jn8P5j04L9J4j1k8J1J6jpL4m7
7973b1kPl8N0qK3J1J5o1K7KL7Nrq7pO2oL3j7Rnk2k6j2N7j6ol1mJ7k2P1m9K5K9
$$ plain form
8009 31 -33 -54 0 -28 -6 -32 30 15 -25 -21 -64 7 -10 31 52 11 26 -31 -9 13 62 10 -103 1 74 -10 -34 0 -39 50
8039 50 36 -3 -11 -18 41 22 96 23 19 -19 -5 -11 -55 -15 21 5 -38 16 11 19 16 -13 -75 46 -15 17 -9 -30 -19 -15 -20 -50 15 -9
8073 -9 -53 -26 -22 -8 27 14 42 28 1 7 -22 1 -23 16 6 33 -36 70 1 -90 -27 51 64 -29 48 22 31 18 -58 -1 31 9
8105 9 23 -5 -58 -10 4 -41 -8 -30 -27 16 9 2 26 -5 25 0 -36 39 -1 -16 -29 24 -36 31 62 -44 30 -26 -32 -1 57 38
8137 38 50 -25 -44 3 -27 25 14 7 12 -7 -29 -35 1 -18 28 19 -23 18 -26 -1 -13 25 -8 14 58 -18 31 -11 19 46 -7 24
8169 24 7 102 32 -1 -12 18 -12 2 -15 16 -10 28 -40 -6 38 12 -11 16 -9 -34 18 18
$$ packed form
8009C1o4k1N4k8K2k6O2j5m0Mm3P1j7M1K1m1J5n7K2K2M9n2j13J04P3q4k4L4l9Q9
8039E0j4l9qpN9j9P4p3ml8J4om4M0L6j6m3N4nQlk9o2J21o1L2k6k1J1Mnl0O5k4
8073im4K7MJ4L5j3K8j4k7Ok9K3k4L9j0K7o9J06o9r1O3P8J3r3P7k6Rj3p6N7L2k2
8105IJ4k8n3M8J4m5L3k2LM3ppK4l1L0k5l6P5m0j5j3N3o0O7L1j06P4n6oL1N8j9
8137C8J2p5j9M7l0N2j1pNj9k2oL6j9M6rm2M1m4K5j2L8l3K2M4p6M9m2L0K7n3L1
8169B4j7R5p0l3j1L0l0J4j7L1k6L8o8L4M4k6k3K7k5k5N2%
8191A8
$$ Imaginary data points
##PAGE= N=2
##DATA TABLE= (X++(I..I)), XYDATA
$$ plain form
0 0 0 0 0 0 0 0 0 0 0 0 0 0 0 0 0 0 0 0 0 0 0 0 0 0 0 0 0 0 0 0 2 -3 4 -5 6 -6 6 -6 6 -6 9 -10 11 -12 13 -16 17 -17 20
49 20 -23 25 -30 33 -39 48 -60 77 -106 166 -332 1212 7325 4192 1239 3727 7204 5946 4246 5993
69 5993 8108 7365 6655 7686 8592 8316 8634 9156 8703 8452 9562 10098 8924 8338 9531 10009 8718 7973
87 7973 8960 9368 8129 7220 7842 8297 7202 6079 6267 6683 5742 4695 4705 4901 3873 2903 3062 2851 1765
106 1765 1053 1227 778 -672 -1040 -679 -1417 -3007 -3133 -2625 -3720 -5286 -5026 -4621 -5981 -7426 -6999 -6656
124 -6656 -8213 -9255 -8635 -8584 -10164 -10895 -10195 -10451 -11762 -12107 -11489 -12013 -13094 -12938 -12483 -13073 -13952 -13540 -13028
143 -13028 -13732 -14240 -13713 -13323 -13931 -14152 -13503 -13084 -13491 -13598 -12891 -12411 -12591 -12521 -11717 -11204 -11432 -11149 -10215 -9608
163 -9608 -9714 -9362 -8359 -7708 -7789 -7312 -6168 -5642 -5819 -5090 -3920 -3507 -3594 -2809 -1602 -1529 -1489 -509 503 441
$$ packed form
0@%%%%%%%%%%%%%%%%%%%%%%%%%%%%%%KnPrJ1j2J2j2J2j2J5j9K1k3K5k9L3l4L7
49B0m3M8n5O3p2Q7j08J37j83K72m98J544O113l133k953K488L477j258j700J747
69E993K115p43p10J031R06k76L18N22m53k51J110N36j174n86J193M78j291p45
87G973R87M08j239r09O22M55j095j123J88M16r41j047J0J96j028r70J59k11j086
106A765p12J74m49j450l68L61p38j590j26N08j095j566K60M05j360j445M27L43
124f656j557j042O20N1j580p31P00k56j311l45O18n24j081J56M55n90q79M12N12
143a3028p04n08N27L90o08k21O49M19m07j07P07M80j80P0Q04N13k28K83R34O07
163i608j06L52J003O51q1M77J144N26j77P29J170M13q7P85J207P3M0R80J012o2
$$ plain form
183 441 460 1556 2304 2034 2249 3350 3781 3368 3641 4763 4914 4375 4773 5645 5622 5103 5646 6333 6065 5662
203 5662 6162 6611 6294 5954 6417 6737 6250 6064 6543 6723 6214 6060 6535 6602 6061 5979 6443 6373 5821 5846 6249
224 6249 6148 5597 5571 5976 5727 5162 5284 5585 5346 4711 4851 5121 4732 4177 4470 4637 4132 3706 3878 4001
244 4001 3371 3026 3346 3316 2579 2321 2780 2574 1891 1695 2120 1922 1161 1262 1608 1189 628 804 1054 704
264 704 202 518 784 270 29 425 547 125 -26 373 506 139 47 543 556 129 314 793 752 430 542
285 542 1070 1025 648 933 1283 1148 847 1160 1543 1296 1018 1452 1614 1329 1111 1468 1612 1212 1026 1338 1520
306 1520 1024 871 1238 1122 692 716 930 902 393 371 777 495 37 188 442 68 -337 -17 142 -220 -553
327 -553 -178 -156 -417 -632 -318 -203 -579 -696 -286 -244 -599 -637 -278 -269 -693 -572 -203 -322 -654 -449 -188 -369
$$ packed form
183D41J9J096P48k70K15J101M31m13K73J122J51n39L98Q72k3n19N43O87k68m03
203E662N00M49l17l40M63L20m87j86M79J80n09j54M75O7n41q2M64p0n52K5M03
224F249j01n51k6M05k49n65J22L01k39o35J40K70l89n55K93J67n05m26J72J23
244D001o30l45L20l0p37k58M59k06o83j96M25j98p61J01L46m19n61J76K50l50
264G04n02L16K66n14k41L96J22m22j51L99J33l67r2M96J3m27J85M79m1l22J12
285E42N28m5l77K85L50j35l01L13L83k47k78M34J62k85k18L57J44m00j86L12J82
306A520m96j53L67j16m30K4K14k8n09k2M06k82m58J51K54l74m05L20J59l62l33
327e53L75K2k61k15L14J15l76j17M10M2l55l8L59Rm24J21L69j19l32K05K61j81
$$ plain form
349 -369 -653 -398 -134 -404 -669 -403 -243 -556 -775 -491 -358 -736 -842 -565 -517 -953 -1065 -762 -786 -1124 -1137
370 -1137 -878 -982 -1337 -1312 -1038 -1228 -1579 -1427 -1168 -1436 -1661 -1473 -1164 -1433 -1712 -1399 -1222 -1461 -1584 -1249
390 -1249 -1109 -1432 -1433 -1117 -996 -1259 -1215 -840 -828 -1161 -975 -650 -714 -947 -780 -525 -641 -885 -643 -359 -593 -788
412 -788 -585 -374 -664 -894 -595 -476 -759 -955 -668 -617 -925 -1010 -824 -849 -1174 -1172 -905 -1113 -1368 -1374 -1112 -1281 -1609
435 -1609 -1425 -1242 -1478 -1636 -1537 -1335 -1605 -1723 -1546 -1338 -1617 -1818 -1491 -1370 -1664 -1647 -1337 -1319 -1557 -1578 -1332
456 -1332 -1295 -1532 -1466 -1233 -1302 -1573 -1416 -1187 -1289 -1520 -1438 -1199 -1385 -1604 -1435 -1242 -1506 -1715 -1438 -1358 -1637 -1792
478 -1792 -1566 -1466 -1803 -1879 -1665 -1660 -1931 -1892 -1657 -1719 -1984 -1905 -1622 -1719 -1874 -1730 -1485 -1621 -1775 -1493 -1235 -1353
500 -1353 -1518 -1115 -880 -1046 -1081 -708 -466 -645 -559 -225 -54 -136 -12 383 466 309 469 798 902 751 888
$$ packed form
349c69k84K55K64k70k65K66J60l13k19K84J33l78j06K77M8m36j12L03k4l38j3
370a137K59j04l55K5K74j90l51J52K59k68k25J88L09k69k79L13J77k39j23L35
390a249J40l23jL16J21k63M4L75J2l33J86L25o4k33J67K55j16k44K42K84k34j95
412g88K03K11k90k30K99J19k83j96K87N1l08q5J86k5l25KK67k08k55oK62j69l28
435a609J84J83k36j58R9K02k70j18J77K08k79k01L27J21k94J7L10J8k38k1K46
456a332L7k37O6K33o9k71J57K29j02k31Q2K39j86k19J69J93k64k09K77Q0k79j55
478a792K26J00l37p6K14Nk71L9K35o2k65P9K83r7j55J44K45j36j54K82K58j18
500a353j65M03K35j66l5L73K42j79Q6L34J71q2J24L95Q3j57J60L29J04j51J37
$$ plain form
521 888 1316 1273 1120 1375 1674 1533 1431 1652 1890 1740 1655 1956 2082 1905 1748 2089 2195 1941 1935 2249 2251 1958
543 1958 1995 2240 2206 1999 2047 2294 2246 2032 2124 2298 2135 1967 2124 2329 2157 1976 2098 2255 2060 1991 2145 2267
565 2267 1990 1998 2092 2130 1949 1952 2148 2056 1804 1768 1986 1886 1629 1607 1838 1677 1404 1539 1639 1443 1186 1357 1416
588 1416 1180 1005 1090 1164 899 747 926 903 705 523 756 784 482 471 725 721 437 481 776 741 560 663 886
611 886 845 711 887 1169 1109 1000 1325 1544 1425 1389 1756 1889 1769 1829 2124 2292 2202 2293 2521 2598 2573 2620 2860
634 2860 2867 2782 2930 3080 3080 2884 2977 3186 3106 2903 2970 3041 2939 2753 2871 2897 2657 2411 2591 2488 2199 2034 2103 2043
658 2043 1690 1520 1566 1425 1116 1005 1044 799 507 340 423 86 -184 -322 -328 -666 -943 -972 -1031 -1392 -1662 -1586 -1752
681 -1752 -2011 -2315 -2353 -2415 -2835 -3076 -3001 -3200 -3522 -3679 -3729 -3942 -4241 -4355 -4304 -4555 -4868 -4920 -4898 -5137 -5363 -5509
$$ packed form
521H88M28m3j53K55K99j41j02K21K38j50q5L01J26j77j57L41J06k54oL14Kk93
543A958L7K45l4k07M8K47m8k14R2J74j63j68J57K05j72j81J22J57j95o9J54J22
565B267k77QR4L8j81LJ96r2k52l6K18j00k57k2K31j61k73J35J00j96k57J71N9
588A416k36j75Q5P4k65j52J79k3j98j82K33K8l02j1K54mk84M4K95l5j81J03K23
611H86m1j34J76K82o0j09L25K19j19l6L67J33j20O0K95J68r0R1K28P7k5M7K40
634B860Pq5J48J50%j96R3K09q0k03O7P1j02j86J18K6k40k46J80j03k89j65O9o0
658B043l53j70M6j41l09j11L9k45k92j67Q3l37k70j38ol38k77k9n9l61k70P6j66
681a752k59l04l8o2m20k41P5j99l22j57n0k13k99j14N1k51l13n2K2k39k26j46
$$ plain form
703 -5509 -5431 -5698 -5918 -5918 -5920 -6102 -6326 -6235 -6245 -6438 -6510 -6355 -6364 -6548 -6545 -6364 -6276 -6409 -6330 -6054 -6058 -6109 -5902 -5628 -5622 -5572 -5279
730 -5279 -4960 -4919 -4845 -4519 -4211 -4175 -3999 -3614 -3308 -3247 -3010 -2603 -2241 -2222 -2003 -1565 -1325 -1267 -1020 -586 -464 -329
752 -329 -44 376 489 451 856 1152 1156 1218 1452 1810 1800 1820 2053 2350 2268 2296 2491 2716 2640 2708 2866 2945 2931 2991 3092
777 3092 3205 3097 3166 3333 3355 3236 3278 3484 3437 3294 3330 3555 3408 3244 3428 3482 3296 3200 3279 3367 3273 3097 3155 3205
801 3205 2944 2866 2959 2936 2650 2639 2689 2540 2351 2282 2389 2130 1859 1876 1851 1698 1484 1513 1468 1270 1084 1099 1168 884
825 884 725 809 790 583 483 513 519 360 273 322 308 167 174 308 244 142 154 304 313 179 284 465 363 344 391 582
851 582 456 489 633 772 663 631 886 935 769 885 1046 1029 894 909 1146 1146 996 1076 1142 1125 1014 1021 1122 1062 906
876 906 1002 1088 968 816 927 911 810 753 827 773 587 558 656 619 426 453 522 514 331 312 419 303 124 153 245 126
$$ packed form
703e509P8k67k20%kj82k24R1j0j93p2J55rj84LJ81Q8j33P9K76mn1K07K74ON0K93
730e279L19M1P4L26L08L6J76L85L06O1K37M07L62J9K19M38K40N8K47M34J22J35
752c29K85M20J13l8M05K96MO2K34L58j0K0K33K97q2K8J95K25p6O8J58P9j4O0J01
777C092J13j08O9J67K2j19M2K06m7j43L6K25j47j64J84N4j86r6P9Q8r4j76N8N0
801C205k61p8R3k3k86j1N0j49j89o9J07k59k71J7k5j53k14K9m5j98j86J5O9k84
825H84j59Q4j9k07j00L0Oj59q7M9j4j41PJ34o4j02J2J50Rj34J05J81j02j9M7J91
851E82j26L3J44J39j09l2K55M9j66J16J61j7j35J5K37%j50Q0O6j7j11PJ01o0j56
876I06R6Q6j20j52J11j6j01n7P4n4j86k9R8l7j93K7O9qj83j9J07j16j79K9R2j19
$$ plain form
902 126 15 94 104 17 -162 -124 -27 -159 -223 -199 -207 -313 -387 -440 -377 -599 -676 -583 -616 -787 -848 -773 -814 -1027 -1037 -953 -1114
929 -1114 -1241 -1277 -1232 -1296 -1534 -1428 -1429 -1557 -1699 -1579 -1533 -1706 -1810 -1727 -1646 -1826 -1866 -1726 -1817 -1900 -1832 -1678 -1747 -1826 -1786
954 -1786 -1634 -1601 -1723 -1571 -1493 -1416 -1497 -1417 -1239 -1238 -1233 -1134 -1015 -1099 -1071 -959 -810 -841 -855 -774 -627 -676 -685 -515 -482 -566 -602
981 -602 -456 -342 -507 -412 -267 -340 -393 -323 -161 -228 -339 -210 -167 -226 -342 -191 -55 -165 -223 -36 13 -109 -94 56
1005 56 94 -37 -20 185 166 111 119 260 294 247 337 459 346 379 342 527 470 447 538 709 614 598 678 676 663 650 676 649
1033 649 597 577 692 658 611 489 599 573 447 405 522 420 340 349 444 321 227 251 276 174 92 138 185 92 44 106
1059 106 42 12 -32 40 5 -35 -14 25 -7 -47 -38 102 21 -22 24 130 88 13 50 218 69 83 128 252 121 109 156
1086 156 189 184 121 159 214 180 124 191 140 43 26 98 62 -5 -72 23 -79 -147 -141 -33 -154 -179 -146 -70 -178 -279 -179 -118
$$ packed form
902A26j11P9J0q7j79L8R7j32o4K4qj06p4n3O3k22p7R3l3j71o1P5m1k13j0Q4j61
929a114j27l6M5o4k38J06jj28j42J20M6j73j04Q3Q1j80m0J40r1q3O8J54o9p9M0
954a786J52L3j22J52P8P7q1Q0J78JNR9J19q4K8J12J49l1j4Q1J47m9rJ70L3q4l6
981f02J46J14j65R5J45p3n3P0J62o7j11J29M3n9j16J51J36j10n8J87M9j22J5J50
1005E6L8j31J7K05j9n5QJ41L4m7R0J22j13L3l7J85n7k3R1J71r5j6Q0kj3j3K6k7
1033F49n2k0J15l4m7j22J10k6j26m2J17j02q0RR5j23r4K4K5j02q2M6M7r3m8O2
1059A06o4l0m4P2l5m0K1L9l2m0RJ40q1m3M6J06m2p5L7J68j49J4M5J24j31j2M7
1086A56L3no3L8N5l4n6O7n1r7j7P2l6o7o7R5j02o8OJ08j21k5L3P6j08j01J00O1
$$ plain form
1114 -118 -262 -315 -269 -205 -295 -259 -141 -131 -297 -269 -89 -162 -195 -157 13 52 -46 28 52 57 44 78 190 151 148 245 326 202
1142 202 207 303 384 272 246 296 337 252 327 378 371 292 221 280 260 233 253 229 239 131 136 201 133 81 163 164 72 123 158 199 164
1173 164 107 227 232 149 138 269 330 209 297 311 303 352 347 417 483 475 450 590 594 569 561 668 586 585 683 653 648 672 694 666 620
1204 620 678 661 669 624 562 611 613 526 464 448 407 238 296 349 300 207 209 179 54 6 8 24 -139 -107 -97 -56 -116 -251 -289 -240
1234 -240 -329 -400 -269 -351 -420 -392 -336 -367 -464 -448 -413 -450 -567 -489 -481 -575 -596 -623 -524 -653 -722 -640 -581 -696 -779 -719 -708 -795
1262 -795 -880 -790 -852 -877 -963 -896 -905 -1015 -1008 -909 -1042 -1020 -1020 -1007 -1053 -1115 -1023 -1075 -1016 -1115 -1079 -1038 -1027 -1115 -997 -966 -1021 -993 -872
1291 -872 -793 -838 -800 -744 -647 -625 -540 -446 -384 -423 -294 -269 -204 -104 -130 54 70 42 125 269 329 266 292 535 432 445 487
1318 487 550 552 558 645 741 605 661 686 782 706 702 815 739 725 764 837 759 703 671 838 771 698 798 828 756 767 819 786 741
$$ packed form
1114a18j44n3M6O4r0L6J18J0j66K8J80p3l3L8J70L9r8P4K4Nj3L4J12l9lR7Q1j24
1142B02NR6Q1j12k6N0M1q5P5N1pp9p1N9k0k7K0k4J0j08NO5o8n2Q2Jr2N1L5M1l5
1173A64n7J20Nq3j1J31O1j21Q8J4qM9nP0O6qk5J40Mk5qJ07q2jR8l0nK4K2k8m6
1204F20N8j7Qm5o2M9Kq7o2j6m1j69N8N3m9r3Kl0j25m8KJ6j63L2J0M1o0j35l8M9
1234b40q9p1J31q2o9K8N6l1r7J6L5l7j17P8Qr4k1k7R9j29o9Q2N9j15q3O0J1q7
1262g95q5R0o2k5q6O7rj10PR9j33K2%J3m6o2R2n2N9r9L6M1J1q8J18L1n5K8J21
1291h72P9m5L8N6R7K2Q5R4O2l9J29K5O5J00k6J84J6k8Q3J44O0o3K6K43j03J3M2
1318D87O3KOQ7R6j36N6K5R6p6mJ13p6j4L9P3p8n6l2J67o7p3J00L0p2J1N2l3m5
$$ plain form
1347 741 728 790 807 744 735 811 792 753 731 798 774 684 739 736 629 622 604 630 671 541 514 607 496 449 411 445 372 295 327 291
1377 291 238 193 165 104 18 -1 19 -71 -177 -156 -102 -136 -256 -341 -299 -332 -429 -405 -310 -437 -487 -478 -439 -454 -534 -500 -494 -422 -488
1406 -488 -425 -384 -465 -465 -362 -337 -316 -342 -336 -197 -310 -253 -186 -114 -225 -160 -43 -140 -116 -97 -22 -74 -2 -55 10 16 -41 18 25
1435 25 10 12 34 105 45 -52 -19 -2 -45 -65 14 -20 -62 -23 3 -39 -100 -95 -30 -44 -163 -64 -4 -66 -102 -67 -70 -120 -85 -30 -95
1466 -95 -124 -73 13 -107 -121 -54 -30 -58 -93 -79 -58 -54 -105 -146 -104 -93 -160 -160 -122 -180 -194 -180 -204 -225 -274 -280 -251 -323 -389 -327 -398
1497 -398 -439 -447 -453 -439 -444 -534 -406 -481 -526 -516 -543 -500 -632 -531 -489 -527 -563 -546 -496 -459 -476 -451 -348 -432 -392 -322 -294 -263 -254 -143
1527 -143 -131 -150 -74 -98 -60 -8 -4 104 94 112 109 161 143 131 287 262 221 216 343 284 346 296 343 357 314 341 334 408 376 368 403
1558 403 418 374 417 454 415 372 367 495 409 400 442 473 478 446 473 523 527 458 507 610 563 534 566 603 574 583 681 708 557 594 686
$$ packed form
1347G41j3O2J7o3rP6j9l9k2O7k4r0N5lj07pj8K6M1j30k7R3j11m7l8L4p3p7L2l6
1377B91n3m5k8o1q6j9K0r0j06K1N4l4j20q5M2l3r7K4R5j27n0RL9j5q0L4OP2o6
1406d88O3M1q1%J03K5K1k6OJ39j13N7O7P2j11O5J17r7K4J9P5n2P2n3O5On7N9P
1435B5j5KK2P1o0r7L3J7m3k0P9l4m2L9K6m2o1NO5j4j19R9O0o2l6L5ln0L5N5o5
1466i5k9N1Q6j20j4O7K4k8l5J4K1Mn1m1M2J1o7%L8n8j4J4k4k1m9oK9p2o6O2p1
1497c98m1qoJ4nr0J28p5m5J0k7M3j32J01M2l8l6J7N0L7j7K5J03q4M0P0K8L1RJ11
1527a43J2j9P6k4L8N2MJ08j0J8lN2j8j2J56k5m1nJ27n9O2n0M7J4m3K7pP4l2qL5
1558D03J5m4M3L7l9m3nJ28q6rM2L1Nl2K7N0Mo9M9J03m7k9L2L7k9RR8K7j51L7R2
$$ plain form
1589 686 651 637 654 668 658 626 618 683 583 563 598 582 492 461 446 491 441 300 408 360 290 192 226 209 163 120 91 114 33
1618 33 10 48 15 -81 -37 -53 -118 -100 -97 -114 -142 -157 -79 -75 -115 -153 -98 -102 -103 -146 -99 -75 -80 -115 -32 -92 -109 -28 -56 -54 -145 -150 -64 -45
1652 -45 -121 -173 -111 -147 -149 -154 -162 -195 -213 -231 -242 -260 -322 -250 -336 -379 -404 -393 -398 -474 -488 -457 -413 -567 -455 -502 -524 -527 -522 -500 -559 -621
1684 -621 -566 -505 -541 -573 -532 -517 -556 -486 -488 -494 -491 -477 -423 -486 -453 -427 -335 -401 -420 -363 -350 -382 -333 -341 -365 -308 -319 -386 -359 -335 -421 -305
1716 -305 -249 -362 -383 -367 -335 -331 -353 -364 -363 -433 -415 -265 -369 -361 -371 -299 -354 -361 -245 -290 -266 -238 -199 -207 -126 -191 -116 -49 -186 -78
1746 -78 -67 8 97 22 31 174 148 127 209 245 277 266 303 350 393 358 355 415 357 413 479 412 407 379 493 464 342 388 445 370
1776 370 398 305 421 365 291 328 323 278 265 251 240 221 130 247 170 108 127 141 133 96 59 151 30 -6 40 75 -11 67 124
1805 124 61 32 26 19 78 92 92 111 129 79 51 130 63 68 136 108 93 86 58 100 75 41 25 5 -26 -50 16 31 -27 4 63 -13
$$ packed form
1589F86l5j4J7J4j0l2qO5j00k0L5j6r0l1j5M5n0j41J08m8p0r8L4j7m6m3k9K3q1
1618C3k3L8l3r6M4j6o5J8Lj7k8j5P8Mm0l8N5mjm3M7K4nl5Q3o0j7Q1k8Kr1nQ6J9
1652d5p6n2O2l6knql3j8j8j1j8o2P2q6m3k5J1np6j4L1M4j54J12m7k2lNK2n9o2
1684f21N5O1l6l2M1J5l9P0koLJ4N4o3L3K6R2o6j9N7J3l2M9qk4N7j1o7K7K4q6J16
1716c05N6j13k1J6L2Mk2j1Jp0J8J50j04Qj0P2n5pJ16m5K4K8L9qQ1o5P5O7j37J08
1746g8J1P5Q9p5RJ43k6k1Q2L6L2j1L7M7M3l5lO0n8N6O6o7nk8J14k9j22M6N7p5
1776C70K8r3J16n6p4L7nm5j3j4j1j9r1J17p7o2J9J4ql7l7R2j21l6M6L5q6P8N7
1805A24o3k9opN9J4%J9J8n0k8P9o7NO8k8j5pk8M2k5l4j6k0l1k4O6J5n8L1N9p6
$$ plain form
1837 -13 -1 0 -49 -12 -60 -35 -9 -13 -43 37 3 69 -27 80 24 43 34 66 154 117 160 193 214 216 257 323 350 352 362 335 436 399
1869 399 407 504 492 446 468 525 506 570 587 599 548 545 539 537 585 533 551 505 486 463 474 506 430 474 407 347 388 355 302 363 276 287
1901 287 151 233 256 113 164 98 106 116 53 22 17 58 60 -5 -46 -13 -49 -63 -65 -70 -108 -182 -115 -196 -98 -189 -266 -215 -132 -253 -250
1932 -250 -221 -242 -244 -327 -310 -343 -403 -428 -383 -399 -451 -416 -461 -400 -584 -504 -513 -559 -598 -572 -578 -627 -603 -599 -630 -700 -618 -632 -613 -712 -675
1963 -675 -629 -602 -638 -618 -598 -589 -590 -511 -497 -493 -544 -444 -420 -417 -361 -332 -399 -317 -278 -276 -261 -208 -209 -140 -119 -121 -176 -139 -126 -98 -112 -51 -60
1996 -60 19 -6 -18 -32 -66 -71 28 -3 -31 27 -31 -26 22 60 -77 -109 -29 -17 -9 34 -45 -5 20 26 33 15 -35 -16 -53 40 68 -13
2028 -13 81 -10 70 23 132 73 25 84 132 97 45 80 55 57 63 79 133 94 96 67 43 32 52 31 31 7 -53 -13 -64 -103 -69 -90
2060 -90 -156 -66 -100 -124 -129 -190 -183 -147 -161 -193 -200 -224 -136 -249 -287 -170 -160 -212 -128 -115 -118 -69 -185 -45 -144 -129 -28 -6 -21 53
$$ packed form
1837a3J2Jm9L7m8K5K6ml0Q0l4O6r6J07n6J9rL2Q8l7M3L3K1KM1O6K7KJ0k7J01l7
1869C99QR7j2m6K2N7j9O4J7J2n1lokM8n2J8m6j9k3J1L2p6M4o7o0M1l3n3O1q7J1
1901B87j36Q2K3j43N1o6QJ0o3l1nM1Ko5m1L3l6j4knl8p4O7q1R8r1p7N1Q3j21L
1932b50K9k1kq3J7l3o0k5M5j6n2L5m5O1j84Q0rm6l9K6om9K4Ml1p0Q2j4J9r9L7
1963f75M6K7l6K0K0RjP9J4Mn1J00K4LN6K9o7Q2L9KJ5N3jO9K1kn5L7J3K8j4O1r
1996f0P9k5j2j4l4nR9l1k8N8n8NM8L8j37l2Q0J2QM3p9M0K5OPj8n0J9l7R3K8q1
2028a3R4r1Q0m7J09n9m8N9M8l5n2L5k5KOJ6N4l9Kk9k4j1K0k1%k4o0M0n1l9L4k1
2060i0o6R0l4k4no1PL6j4l2pk4Q8j13l8J17J0n2Q4J3lM9j16J40r9J5J01K2j5P4
$$ plain form
2090 53 66 64 68 115 116 148 128 202 253 300 229 241 379 305 277 289 389 336 348 455 390 393 400 387 353 373 327 379 383 398 315 429
2122 429 397 404 405 373 404 373 394 389 379 314 357 425 402 360 332 387 321 459 379 347 410 425 374 401 384 338 423 368 429 388 419
2153 419 372 390 347 338 353 301 357 302 257 247 190 226 156 126 113 130 65 59 35 8 16 -107 -64 -51 -90 -137 -139 -120 -183 -203 -218
2184 -218 -225 -205 -210 -296 -220 -242 -282 -282 -282 -256 -298 -236 -258 -232 -161 -150 -258 -168 -197 -194 -138 -183 -74 -71 -66 -159 -95 -33 -11 -25 33 -30
2216 -30 -49 -44 -20 46 41 27 60 29 39 68 -4 22 80 82 -21 -80 -59 40 -5 -22 1 -26 -65 -64 -99 -49 -48 -71 -47 -79 13 -99
2248 -99 -99 -67 -38 -146 -81 -121 -31 -132 -32 -65 -67 -121 -117 -31 -84 -135 -108 -135 -130 -159 -148 -103 -138 -216 -218 -183 -149 -269 -218 -301 -254
2279 -254 -292 -286 -287 -351 -377 -360 -349 -418 -415 -412 -417 -441 -469 -493 -512 -519 -429 -518 -463 -497 -471 -444 -484 -433 -476 -397 -433 -378 -360 -358 -327 -327 -336 -239
2313 -239 -272 -264 -265 -184 -258 -177 -211 -117 -95 -86 -70 -56 -61 -34 -16 16 54 62 20 68 51 47 53 58 106 79 134 122 114 122 181 30 85 77 92
$$ packed form
2090E3J3kMM7JL2k0P4N1M7p1J2J38p4k8J2J00n3J2J07o5LPj3l4K0m6N2MJ5q3J14
2122D29l2PJl2L1l1K1nj0o5M3O8k3m2k8N5o6J38q0l2O3J5n1K7j7m6Q5n5O1m1L1
2153D19m7J8m3rJ5n2N6n5m5j0n7L6p0l0j3J7o5ok4k7Qj23M3J3l9m7kJ9o3k0j5
2184b18pK0nq6P6k2m0%%K6m2O2k2K6P1J1j08R0k9LN6m5J09LNr3O4O2K2j4N8o3
2216c0j9NK4O6nj4L3l1J0K9p2K6N8Kj03n9K1R9m5j7K3k7l9Jl5N0Jk3K4l2R2j12
2248i9%L2K9j08O5m0R0j01J00l3kn4MQ6n3n1K7k7Nk9J1M5l5p8kL5L4j20N1q3M7
2279b54l8Ojo4k6J7J1o9LLnk4k8k4j9pR0q9N5l4K6K7m0N1m3P9l6N5J8KL1%rR7
2313b39l3QjQ1p4Q1l4R4K2RJ6J4nK7J8L2L8Qm2M8j7mONM8k7N5j2qQN9j51N5qJ5
$$ plain form
2348 92 33 40 48 75 -7 36 -16 48 55 58 16 21 27 -24 -33 -58 -2 -43 6 -33 -7 47 67 97 67 52 35 -36 124 27 56 6 -4
2381 -4 27 -9 -20 -8 56 23 34 48 68 66 -46 7 82 15 73 -19 46 20 -10 44 8 -23 47 25 16 17 6 46 60 79 123 118
2413 118 142 186 94 127 265 244 246 290 314 267 364 399 430 433 416 526 539 507 493 539 619 540 668 663 665 686 712 682 720 769
2443 769 766 773 789 807 734 751 733 772 729 688 699 697 633 678 611 605 599 612 506 532 515 439 425 398 386 336 303 386 284 209 256
2474 256 202 177 155 159 110 107 17 188 79 -30 10 -30 -80 -81 -38 -183 -110 -211 -193 -141 -242 -236 -318 -239 -305 -355 -351 -366 -367 -427
2504 -427 -478 -450 -479 -470 -543 -600 -609 -576 -608 -587 -654 -594 -591 -630 -615 -661 -626 -697 -652 -665 -665 -617 -638 -635 -642 -617 -686 -650 -545 -544 -564 -558 -508
2537 -508 -465 -446 -442 -436 -457 -329 -326 -327 -231 -268 -281 -202 -189 -180 -199 -159 -155 -84 -151 -116 -58 -33 -31 -72 -63 -93 -55 -87 -88 -69 -41 -33 -15 -51
2571 -51 -66 -26 28 17 -51 36 0 -8 0 18 6 -2 -25 -65 -18 -25 -7 -13 42 39 -68 11 -20 20 -30 -15 -53 24 33 -16 6 9 -1 36
$$ packed form
2348I2n9PQK7q2M3n2O4PLm2NOn1rk5N6m1M9l9K6N4K0L0l0j5j7p1J60r7K9n0j0
2381dL1l6j1J2O4l3J1J4K0kj12N3P5o7N8r2O5k6l0N4l6l1P0k2rJj1M0J4J9M4n
2413A18K4M4r2L3J38k1KM4K4m7R7L5L1Lj7J10J3l2j4M6Q0p9J28nKK1K6l0L8M9
2443G69lPJ6J8p3J7j8L9m3m1J1ko4M5o7ooJ3j06K6j7p6j4k7j2n0l3Q3j02p5M7
2474B56n4k5k2Mm9lr0J71j09j09M0m0n0jM3j45P3j01J8N2j01Oq2P9o6n0Mj5jo0
2504d27n1K8k9Rp3n7rL3l2K1o7O0Ll9J5m6L5p1M5j3%M8k1LpK5o9L6J05Jk0ON0
2537e08M3J9MOk1J28LjR6l7j3P9J3Rj9M0MP1o7L5N8K5Km1Rl0L8l2jJ9K8QJ8l6
2571e1j5M0N4j1o8Q7l6qQJ8j2qk3m0M7pJ8oN5lj07P9l1M0n0J5l8P7Rm9K2Lj0L7
$$ plain form
2605 36 19 5 -11 -18 75 7 3 -7 -77 -18 -71 -95 -90 -108 -63 -117 -115 -91 -116 -130 -115 -186 -141 -197 -43 -92 -138 -218 -147 -169 -140 -160
2637 -160 -112 -132 -188 -141 -171 -150 -145 -106 -96 -96 -94 -38 -112 -114 9 -18 -22 2 5 20 47 -6 32 128 65 85 153 159 57 105 139 153
2669 153 176 140 143 149 153 205 152 146 188 153 139 232 184 183 174 201 205 235 245 239 194 165 219 171 192 232 213 242 275 233 289 199 298 304
2703 304 288 234 284 288 321 290 267 295 315 299 287 382 368 310 374 295 295 321 292 331 249 285 281 279 271 264 250 248 208 193 163 126 158
2736 158 128 138 57 73 48 119 25 57 -20 26 -7 -95 -37 -49 -25 -33 -45 -70 -71 -9 -61 -73 -168 -79 -61 -90 -25 -27 -48 -59 -29
2767 -29 -28 31 -13 -67 10 72 13 94 60 68 30 43 142 70 46 104 117 110 72 69 114 127 134 114 93 114 77 107 110 110 105 136 150 108
2801 108 139 161 67 109 174 181 171 15 102 162 71 156 117 116 176 176 162 148 191 141 180 196 154 166 214 114 115 127 188 165 105
2832 105 104 118 77 56 53 78 43 -27 -44 -67 -8 -69 -132 -86 -106 -200 -183 -231 -214 -331 -352 -330 -371 -362 -432 -467 -451 -435 -449 -574
$$ packed form
2605C6j7j4j6pR3o8mj0p0N9n3k4Nj8M5n4KK4k5j4J5p1M5n6J54m9m6q0P1k2K9k0
2637a60M8k0n6M7l0K1NL9J0%KN6p4kJ23k7mK4LJ5K7n3L8R6o3K0O8Oj02M8L4J4
2669A53K3l6LOMN2n3oM2l5j4R3m8jrK7ML0J0om5k9N4m8K1M0j9K9L3m2N6r0R9O
2703C04j6n4N0ML3l1k3K8K0j6j2R5j4n8O4p9%K6k9L9q2L6mkqpj4km0j5l0l7L2
2736A58l0J0q1J6k5P1r4L2p7M6l3q8N8j2K4qj2k5jO2n2j2r5Q9J8k9O5kk1j1L0
2767b9JN9m4n4P7O2n9Q1l4Ql8J3R9p2k4N8J3pl8lM5J3Pk0k1K1l7L0L%nL1J4m2
2801A08L1K2r4M2O5Pj0j56Q7O0r1Q5l9jO0%j4j4M3n0L9J6m2J2M8j00JJ2O1k3o0
2832A05jJ4m1k1lK5l5p0j7k3N9o1o3M6k0r4J7m8J7j17k1K2m1Rp0l5J6J6j4j25
$$ plain form
2862 -574 -495 -515 -545 -603 -645 -605 -630 -599 -651 -605 -659 -614 -667 -632 -614 -633 -592 -664 -612 -622 -658 -547 -574 -532 -546 -584 -537 -477 -467
2891 -467 -492 -452 -448 -428 -350 -371 -349 -334 -374 -329 -279 -309 -241 -304 -258 -277 -183 -260 -239 -207 -156 -201 -162 -127 -140 -61 -109 -92 -138 -13
2921 -13 -87 -30 3 -4 11 50 -11 34 124 146 62 87 124 201 111 144 217 253 234 197 237 273 269 256 320 295 322 308 375 277 378
2952 378 333 337 273 391 343 387 381 293 334 354 228 218 246 282 218 266 330 302 230 304 187 279 244 202 224 227 224 139 261 231
2982 231 183 190 252 277 201 291 260 287 250 339 297 298 311 298 295 303 376 334 336 341 375 362 440 398 409 434 460 391 426 369 462 441 430
3015 430 405 394 427 401 384 375 387 327 369 359 362 348 290 297 249 283 224 236 227 162 279 180 209 160 61 129 52 114 51 36 29 49
3047 49 63 -17 -25 13 9 -62 -60 -135 -61 -99 -80 -143 -164 -186 -208 -245 -218 -199 -272 -302 -270 -295 -282 -331 -309 -362 -412 -454 -390 -397 -450 -439
3079 -439 -444 -483 -509 -474 -519 -510 -483 -519 -484 -528 -492 -555 -487 -484 -494 -477 -458 -492 -466 -426 -444 -401 -367 -443 -361 -340 -312 -330 -295 -230 -277
$$ packed form
2862e74P9k0l0n8m2M0k5L1n2M6n4M5n3L5J8j9M1p2N2j0l6J11k7M2j4l8M7O0J0
2891d67k5M0MK0P8k1K2J5m0M5N0l0O8o3M6j9R4p7K1L2N1m5L9L5j3P9m8J7m6J25
2921a3p4N7L3pJ5L9o1M5R0K2q4K5L7P7r0L3P3L6j9l7M0L6mj3O4k5K7j4O7r8J01
2952C78m5Mo4J18m8M4oq8M1K0j26j0K8L6o4M8O4k8p2P4j17R2l5m2K2Llq5J22l0
2982B31m8PO2K5p6R0l1K7l7Q9m2JJ3j3lQP3m2KNL4j3P8m2J1K5K6o9L5n7R3k1j1
3015D30k5j1L3k6j7rJ2o0M2j0Lj4n8Pm8L4n9J2ro5J17r9K9m9r9O8p7O2o3j5pK0
3047D9J4q0qL8mp1Kp5P4l8J9o3k1k2k2l7K7J9p3l0L2k5J3m9K2n3n0m2O4pn3J1
3079d39nl9k6L5m5RK7l6L5m4L6o3O8Lj0J7J9l4K6M0j8M3L4p6Q2K1K8j8L5O5m7
$$ plain form
3110 -277 -215 -286 -287 -259 -214 -148 -183 -194 -113 -125 -115 -118 -114 -139 -70 -83 -65 -88 -13 -4 -24 -77 -13 -43 7 -42 -18 -41 -22 0 -9 70
3142 70 46 72 12 -25 -6 58 45 39 32 84 39 38 82 68 22 64 99 85 15 53 32 63 88 86 84 66 84 32 84 42 82 94 61
3175 61 0 49 43 56 -26 -3 26 32 37 13 -27 6 -67 17 -6 -9 -75 -55 -38 -111 -24 -51 39 -34 -17 -41 -31 36 25 12 30 96
3207 96 99 31 17 34 78 80 66 99 113 156 130 93 139 206 131 145 204 148 214 175 183 212 216 161 231 214 176 233 203 236 224 146
3239 146 157 192 167 129 116 185 142 160 133 127 76 138 122 156 127 97 87 151 41 111 105 70 57 34 116 30 123 36 91 91 89
3270 89 138 60 83 79 136 36 64 58 81 60 22 75 79 52 86 85 54 83 42 57 29 65 32 52 -39 8 -2 20 26 -45 -12 -11 26
3303 26 -50 1 -77 -13 -16 -80 -48 -24 -98 -113 -39 -75 -34 -102 -68 -74 -50 -71 -41 -71 9 -86 -28 -40 11 -55 -13 -58 -61 11 56 26
3335 26 41 55 5 -41 11 -27 6 40 7 55 64 37 111 23 6 36 -34 57 51 11 -5 -3 -1 -49 -9 -19 -41 -47 -19 -70 -58 -60 -30
$$ packed form
3110b77O2p1jK8M5O6l5j1Q1j2J0lMk5O9j3J8k3P5Rk0n3O4l0N0m9K4k3J9K2rP9
3142G0k4K6o0l7J9O4j3opN2m5jM4j4m6M2L5j4p0L8k1L1K5kkj8J8n2N2m2M0J2l3
3175F1o1M9oJ3q2K3K9ONk4m0L3p3Q4k3lo6K0J7p3Q7k7R0p3J7k4J0O7j1j3J8O6
3207I6Lo8j4J7M4Kj4L3J4M3k6l7M6O7p5J4N9n6O6l9QK9Mn5P0j7l8N7l0L3j2p8
3239A46J1L5k5l8j3O9m3J8k7on1O2j6L4k9l0j0O4j10P0ol5j3k3Q2q6R3q7N5%k
3270H9M9p8K3mN7j00K8oK3k1l8N3Mk7L4jl1K9m1J5k8L6l3K0r1M7j0K2Op1L3JL7
3303B6p6N1p8O4lo4L2K4p4j5P4l6M1o8L4oK4k1L0l0Q0r5N8j2N1o6M2m5lP2M5l0
3335B6J5J4n0m6N2l8L3L4l3M8Rk7P4q8j7L0p0R1om0j6KKm8M0j0k2oK8n1J2kL0
$$ plain form
3368 -30 -63 -103 -52 -23 -28 -74 -84 -49 7 -17 -63 -5 -41 -32 -30 -47 -42 13 -24 -19 -74 9 -27 -8 -1 -55 -27 17 56 1 -58 -6 -22
3401 -22 6 20 -38 -34 -64 12 -30 17 -73 -116 -84 -23 -79 -90 -109 -148 -128 -133 -137 -125 -140 -198 -144 -183 -191 -177 -184 -249 -177 -173 -205 -264 -231
3434 -231 -191 -214 -242 -251 -321 -297 -218 -218 -245 -242 -223 -190 -248 -218 -172 -250 -196 -182 -182 -201 -178 -140 -150 -141 -140 -135 -182 -164 -84 -111 -167 -145 -98
3467 -98 -136 -159 -113 -61 -104 -89 -64 -107 -62 -101 -70 -75 -40 -36 -58 -121 -70 50 -81 -1 29 -38 26 22 86 17 41 96 79 106 47
3498 47 119 76 106 141 199 141 213 180 228 157 229 199 188 215 235 252 261 275 156 280 241 222 217 202 211 261 228 265 185 235 179
3529 179 192 194 201 216 136 145 103 139 113 97 118 101 137 149 73 152 80 90 -23 41 117 89 64 124 22 82 103 114 60 14
3559 14 41 96 4 3 100 16 31 55 61 7 28 51 -1 35 13 48 21 39 27 71 18 -33 -10 15 -3 -1 -9 18 18 85 42 -30 -6
3592 -6 -37 61 66 51 -8 84 116 93 59 29 24 55 75 79 137 80 26 122 25 85 95 96 108 60 105 77 107 104 138 63 138 112 141
$$ packed form
3368c0l3m0N1K9nm6j0L5N6k4m6N8l6RKj7NN5l7Nn5Q3l6J9Pn4K8M4L9n5n9N2j6
3401b2K8J4n8Ml0P6m2M7r0m3L2O1n6j1j9l9K0nmJ2j5n8N4l9qJ4po5P2Ml2n9L3
3434b31M0k3k8rp0K4P9%k7LJ9L3n8L0M6p8N4J4%j9K3L8j0RJNm7J8Q0k7n6K2M7
3467i8l8k3M6N2m3J5K5m3M5l9L1nL5Mk2o3N1J20j31Q0L0o7O4mO4o9K4N5j7K7n9
3498D7P2m3L0L5N8n8P2l3M8p1P2l0j1K7K0J7RJ4j19J24l9j9nj5RN0l3L7q0N0n6
3529A79J3KPJ5q0Rm2L6k6j6K1j7L6J2p6P9p2J0j13O4P6k8k5O0j02O0K1J1n4m6
3559A4K7N5r2jR7q4J5K4On4K1K3n2L6k2L5k7J8j2M4n3n1K3K5j8KqK7%O7m3p2K4
3592fl1R8Nj5n9R2L2k3l4l0nL1K0MN8n7n4R6r7O0J0JJ2m8M5k8L0lL4p5P5k6K9
$$ plain form
3625 141 30 138 93 125 134 128 149 62 106 59 74 63 81 62 16 51 51 3 -18 38 42 31 -33 -43 -55 -66 -39 -96 -60 -58 -145
3656 -145 -109 -21 -149 -148 -90 -129 -82 -130 -132 -109 -137 -151 -135 -123 -165 -182 -125 -230 -87 -112 -153 -125 -146 -183 -129 -145 -203 -94 -145
3685 -145 -168 -185 -226 -186 -181 -128 -219 -136 -175 -206 -163 -134 -135 -217 -235 -231 -176 -206 -185 -180 -169 -146 -154 -200 -113 -118 -125 -116 -190 -67 -155 -189 -111
3718 -111 -153 -89 -95 -88 -38 -77 -113 -112 -121 -88 -67 -81 -4 -48 5 -35 -1 -68 -52 -12 -53 -32 -9 -30 -41 15 -35 -20 -34 -44 2 15
3750 15 26 -49 -49 -67 -49 -60 -8 -27 2 -18 -34 -23 39 -12 -24 -7 -26 42 24 -13 -32 10 40 22 19 134 12 40 27 86
3780 86 7 77 72 76 82 47 101 73 34 68 93 73 125 -17 24 67 94 102 123 91 54 158 53 82 12 86 58 74 45 64 56
3811 56 3 -19 54 -32 20 -33 78 68 24 58 23 77 36 24 6 30 -30 36 60 19 60 56 59 3 1 98 123 75 73 79 85 72 24
3844 24 26 84 36 50 125 5 48 51 47 76 67 81 75 93 95 41 48 73 46 37 24 -19 47 32 20 -1 37 -17 -39 16 48 0 55 -22
$$ packed form
3625A41j11J08m5L2RoK1q7M4m7J5j1J8j9m6L5%m8k1N6Mj1o4j0j2j1K7n7L6Kq7
3656a45L6Q8j28JN8l9M7m8kK3k8j4J6J2m2j7N7j05J43k5m1K8k1l7N4j6n8J09n1
3685a45k3j7m1M0NN3r1Q3l9l1M3K9jq2j8MN5l0K1NJ1K3qm6Q7npRp4J23q8l4P8
3718a11m2O4oPN0l9l6JrL3K1j4P7m4N3m0L4o7J6M0m1K1K3k1j1N6n0J5j4j0M6J3
3750A5J1p5%j8J8j1N2j9K9k0j6J1O2n1j2J7j9O8j8l7j9M2L0j8lJ15j22K8j3N9
3780H6p9P0nMOl5N4k8l9L4K5k0N2j42M1M3K7QK1l2l7J04j05K9p0P4k8J6k9J9q
3811E6n3k2P3q6N2n3J11j0m4L4l5N4m1j2j8K4o0O6K4m1M1mLn6kR7K5m8kOOj3m8
3844B4KN8m8J4P5j20M3LmK9rJ4oJ8Kn4PK5k7rj3m3O6j5j2k1L8n4k2N5L2m8N5p7
$$ plain form
3878 -22 13 35 -44 -22 15 59 46 33 2 39 32 83 45 61 29 6 -49 42 4 51 40 33 87 90 74 93 69 90 85 43 37 85 -3
3911 -3 74 20 -10 1 -1 20 80 -3 68 -29 -9 -41 19 -46 -48 -27 -51 -54 -37 -45 -84 -99 -99 -74 -79 -84 -127 -89 -52 -111 -151 -119 -122 -30 -80
3946 -80 -120 -76 -50 -108 -83 -31 -82 -65 -103 -78 -37 -64 -80 -88 -56 -96 -8 26 20 -43 -41 -94 -91 -87 -36 -28 -123 -92 -90 -43 -93 -83 -73 -59
3980 -59 -108 -70 -85 2 -50 -70 -94 -123 -34 -71 -45 11 -30 -33 -30 3 0 -47 -41 -6 -44 42 -6 13 -17 25 72 -26 24 24 62 -33 -34
4013 -34 62 54 11 55 15 64 44 78 15 52 76 77 44 114 128 32 -1 35 133 15 52 58 17 -32 15 3 33 -10 6 47 -56
4044 -56 -41 20 -56 34 -59 -17 -68 -31 35 -72 11 -35 -14 -33 -24 17 -92 -40 -51 -49 9 33 -37 -10 12 -10 98 14 12 25
4074 25 -17 -40 -12 -13 37 49 15 14 43 -15 -34 -19 -5 15 70 -30 46 -26 -26 -40 13 -41 14 -4 -8 -20 -50 20 -18 -46 -42 -3
4106 -3 -34 -19 -51 -23 15 26 1 -19 -6 -62 -48 43 -11 4 -40 -12 -42 -94 -57 -85 -59 -26 10 -69 -15 -58 -69 6 -21 3 -41
$$ packed form
3878b2L5K2p9K2L7M4j3j3l1L7pN1l8J6l2k3n5R1l8M7j1pN4Lj6J9k4K1nm2oM8q8
3911cP7n4l0J1kK1O0q3P1r7K0l2O0o5kK1k4lJ7ql9j5%K5nnm3L8L7n9m0L2lR2n0
3946h0m0M4K6n8K5N2n1J7l8K5M1k7j6qL2m0Q8L4oo3Kn3LMN1Qr5L1KM7n0J0J0J4
3980e9m9L8j5Q7n2k0k4k9Q9l7K6N6m1lLL3lm7OL5l8Q6m8J9l0M2M7r8N0%L8r5j
4013c4R6qm3M4m0M9k0L4o3L7K4Jl3P0J4r6l3L6R8j18L7Om1m9M7j2L0m3J6M1j03
4044e6J5O1p6R0r3M2n1L7O6j07Q3m6K1j9RM1j09N2j1KN8K4p0K7K2k2J08q4kJ3
4074B5m2k3K8jN0J2l4jK9n8j9J5J4K0N5j00P6p2%j4N3n4N5j8mj2l0P0l8k8ML9
4106cl1J5l2K8L8J1k5k0J3n6J4R1n4J5m4K8l0n2L7k8K6L3L6p9N4m3j1P5k7K4m4
$$ plain form
4137 -41 -102 22 -28 -2 -14 -44 -5 -6 -4 -3 -57 1 -52 12 -57 -30 -53 -13 0 18 23 -14 33 -50 88 25 1 -6 -19 -37 44 -12
4169 -12 62 72 54 39 59 22 40 63 -29 57 86 57 55 83 56 101 66 48 36 103 102 140 42 96 83 19 104 64 111 152 102
4200 102 117 41 138 -2 40 55 74 69 -18 96 34 1 33 83 52 19 29 29 30 -44 41 13 -12 58 -6 71 19 11 12 24 16 42
4232 42 -39 89 -10 -16 -115 8 -60 -30 -67 -89 -34 -94 -9 -29 -78 -87 15 -29 -73 -62 -11 -76 -70 -136 -110 -76 -77 -116 -140 -83 -109
4263 -109 -126 -65 -70 -133 -146 -123 -165 -75 -145 -79 -53 -84 -127 -103 -122 -121 -33 -71 -152 -79 -26 -69 -31 -34 -9 -35 -20 -82 -25 -12 -19 15
4295 15 11 31 71 -51 1 33 10 113 -38 33 31 42 28 -12 11 -6 -36 -11 45 46 -13 65 35 10 2 7 41 63 40 1 68
4326 68 79 30 58 47 28 17 38 57 -1 101 64 28 17 49 53 -6 51 34 6 18 49 53 53 14 22 11 10 27 42 72 62 112
4358 112 9 -7 91 22 64 -6 -32 -15 4 -50 -13 16 -27 33 -19 -4 -16 -66 -48 -86 25 -37 -110 -51 15 -18 -35 -56 -37
$$ packed form
4137d1o1J24n0K6j2l0L9jKJn4N8n3O4o9K7k3M0J3J8Nl7M7q3J38o3k4pj3j8Q1n6
4169a2P4J0j8j5K0l7J8K3r2Q6K9k9kK8k7M5l5j8j2O7jL8r8N4j3o4Q5m0M7M1n0
4200A02J5p6R7j40M2J5J9nq7J14o2l3L2N0l1l3J0%Jp4Q5k8k5P0o4P7n2qJJ2qK6
4232D2q1J28r9or9J23o8L0l7k2N5o0Q5k0m9rJ02m4m4J1N1o5Oo6K6L4jl9k4N7k6
4263a09j7O1no3j3K3m2R0p0O6K6l1m3K4j9JQ8l8q1P3N3m3L8lK5k6J5o2N7J3pL4
4295A5mK0M0j22N2L2k3J03j51P1kJ1j4m0K3j7l0K5N6Jn9P8l0k5qNL4K2k3l9O7
4326F8J1m9K8j1j9j1K1J9n8J02l7l6j1L2Mn9N7j7k8J2L1M%l9Qj1jJ7J5L0j0N0
4358A12j03j6R8o9M2p0k6J7J9n4L7K9m3O0n2J5j2n0J8l8J11o2p3N9O6l3j7k1J9
$$ plain form
4387 -37 -46 -69 -65 -69 -65 -15 -32 -25 28 8 7 -29 20 -3 -33 36 20 51 31 42 64 -18 2 48 35 -60 61 76 51 30 37 116 -19
4420 -19 27 88 8 35 5 36 -7 26 12 32 18 39 -6 18 52 -24 34 41 -5 59 29 36 -26 -7 44 9 43 -9 7 51 30
4451 30 -12 23 67 39 35 56 63 125 84 93 81 94 13 31 -2 16 58 61 27 35 29 69 36 8 -23 -18 21 -6 -46 -68 32 0 23
4484 23 -37 -12 -10 -65 -19 -94 -46 -70 21 -34 -52 -63 -108 -78 -12 -55 -113 -86 -86 -92 -79 -126 -82 -106 -62 -91 -103 -124 -28 -90 -75 -56
4516 -56 -114 -39 -92 -97 -3 1 -6 7 -93 6 -13 -10 -64 -16 2 -13 -49 -1 23 -2 -109 -13 -36 -47 35 0 21 -19 -7 28 -46
4547 -46 1 -8 11 43 -40 14 -11 -11 19 -23 52 23 -9 -36 -25 8 19 -57 109 3 23 2 63 28 30 4 49 30 74 45 7
4578 7 80 66 48 86 152 67 43 37 -21 119 66 60 80 42 27 83 65 67 30 55 143 45 83 73 18 -17 6 11 8 30 -18 -26 -14
4611 -14 -36 43 15 9 17 -43 -10 -43 -4 -10 41 6 -40 24 -22 13 -1 -34 -45 -48 37 -30 -28 -84 -52 -32 -5 43 -71 -52 -32 -93
$$ packed form
4387c7rk3MmMN0j7PN3k0jl6M9k3l0O9j6L1k0J1K2q2K0M6j3r5J21J5k5k1PP9j35
4420a9M6O1q0K7l0L1m3L3j4K0j4K1m5K4L4p6N8Pm6O4l0Po2J9N1l5L4n2J6M4k1
4451C0m2L5M4k8mK1PO2m1Rj2J3q1J8l3J8M2Ll4QoM0l3k8l1NL9k7m0k2J00l2K3
4484B3o0K5Kn5M6p5M8k4R1n5j8j1m5L0O6m3n8K7%oJ3m7M4k4M4k9j2k1R6o2J5J9
4516e6n8P5n3nR4MpJ3j00R9j9Ln4M8J8j5l6M8K4k5j07R6k3j1Q2l5K1m0J2L5p4
4547d6M7rJ9L2q3N4k5%L0m2P5k9l2k7J1L3J1p6J66j06K0k1O1l5Kk6M5j9M4k9l8
4578GP3j4j8L8O6q5k4on8J40n3oK0l8j5N6j8Kl7K5Q8r8L8j0n5l5K3NlK2m8qJ2
4611a4k2P9k8oQo0L3l3L9oN1l5m6O4m6L5j4l3j1lQ5o7Kn6L2K0K7M8j14J9K0o1
$$ plain form
4643 -93 -17 -52 -17 -46 10 -25 -43 9 -61 -1 -6 -14 7 -36 -4 -23 -90 11 -3 -108 -38 -76 -93 -8 -20 -18 -65 -11 -33 -68 -78
4674 -78 4 -45 63 12 63 -32 -18 -33 -12 -81 11 -15 -39 70 16 -47 15 34 -47 98 18 58 55 33 -47 50 26 -22 18
4703 18 -4 -36 -2 54 85 6 66 37 19 21 14 85 1 48 28 36 38 22 -29 28 -25 -5 4 72 24 14 4 41 57 -36 -1 38 -33
4736 -33 5 -45 72 6 38 21 -3 -15 -20 -12 -42 24 -7 4 -46 6 -61 30 -68 34 -32 30 -14 39 38 -46 -5 -10 -61 -11 -49
4767 -49 -7 -62 -64 -36 32 -10 10 38 -42 45 -24 -3 22 -47 -15 8 39 -2 -44 6 32 -39 -66 64 -11 -44 -106 -12 -17 8 -5
4798 -5 -39 -60 -11 -61 -13 -43 24 15 24 -83 -11 -31 -37 -12 -23 12 -61 -71 -29 1 -24 -53 -74 -49 33 -36 -32 -26 16 -14 -8 -37 -42 -38
4832 -38 -79 -51 -10 -53 -11 -5 -27 -26 -2 30 14 23 -15 4 44 -9 26 51 5 14 48 53 18 6 96 16 17 31 56 -11 -11 -4 20 54
4866 54 46 59 -41 52 -9 33 -11 71 113 11 -15 13 -5 10 9 -3 31 -6 24 9 12 45 6 8 26 9 41 -47 67 17 -5
$$ packed form
4643i3P6l5L5k9N6l5j8N2p0O0nqK1m3L2j9o7J01j4j05P0l8j7Q5j2Km7N4k2l5j0
4674g8Q2m9J08n1N1r5J4j5K1o9R2k6k4J09n4o3O2J9q1J45q0M0lk2q0R7k4m8M0
4703A8k2l2L4N6L1p9O0k9j8KpP1q4M7k0QKj6n1N7n3K0RO8m8j0j0L7J6r3L5L9p1
4736c3L8n0J17o6L2j7k4j2nQl0O6l1J1n0N2o7R1r8J02o6O2m4N3jq4M1nn1N0l8
4767d9M2n5kK8O8m2K0K8q0Q7o9K1K5o9L2K3L1m1m2N0K6p1k7J30p5l3o2R4nK5j3
4798el4k1M9n0M8l0O7rRj07P2k0oK5j1L5p3j0M2L0k5k9k1K5Q2o9MOM2l0Ok9nM
4832c8m1K8M1m3M2Ok2JK4L2j6Rl8J9M0n3L5K5m6RL4Nl5j2R0q0JJ4K5o7%PK4L4
4866E4qJ3j00R3o1M2m4Q2M2j02k6K8j8J5jj2L4l7L0j5LL3l9KJ8j7L2q8J14n0k2
$$ plain form
4897 -5 19 28 39 74 69 48 38 16 3 -2 -4 -8 9 17 53 14 40 9 36 62 15 12 45 7 55 66 25 21 -23 -20 -50 -35 57 -10 -16 -60
4933 -60 11 -1 22 -18 -33 -30 -69 1 -87 -33 -5 -15 -56 -41 -83 -63 -51 -17 -34 -9 -13 -43 0 -8 -2 -70 -57 -9 2 18 -15 -30
4965 -30 19 -16 1 -14 -7 0 -8 -28 -9 5 18 40 -29 41 64 -62 -21 22 0 23 2 20 -34 -3 7 -30 -38 -61 21 -8 10 -19
4997 -19 -75 -27 16 -55 -12 8 -47 37 -42 -38 -32 33 -37 -9 11 -52 -11 -70 -22 -25 -30 -31 -77 -60 26 26 17 -27 13 19 42 17 46 56
5031 56 46 22 -27 24 -6 -12 -51 -6 21 -20 -34 23 7 -11 23 -49 -37 17 -28 -13 -48 -65 -17 -89 -41 -4 -53 -56 -13 -69 -30
5062 -30 -74 3 -46 -12 -73 -84 -38 0 -63 -2 -45 10 -38 -89 -46 -35 7 -39 -8 -39 15 37 -9 12 -61 -46 42 59 19 -51
5092 -51 96 -14 13 -9 25 34 2 -13 -14 1 21 -10 43 77 31 23 8 29 21 19 56 33 19 38 54 19 10 13 1 65 -27 33 28
5125 28 65 -7 -20 2 65 -9 35 28 22 45 77 15 45 14 30 -46 78 49 45 22 31 76 63 48 93 69 32 38 110 45 33 31 1
$$ packed form
4897eK4RJ1L5nk1j0k2j3nkmJ7QL6l9K6l1K7K6m7lL3l8M8J1m1mm4Ll0J5R2o7om4
4933f0P1j2K3m0j5Ll9P0q8N4K8j0m1J5m2K0J2L4j7K5ml0M3qOo8J3M8J1J6l3j5
4965c0M9l5J7j5PPqk0J9J4J3K2o9P0K3j26M1M3k2K3k1J8n4L1J0l7qk3Q2k9J8k9
4997a9n6M8M3p1M3K0n5Q4p9MOO5p0K8K0o3M1n9M8lnjm6J7Q6%rm4M0OK3k5K9J0
5031E6j0k4m9N1l0ol9M5K7m1j4N7j6j8L4p2J2N4m5J5l5j7M8p2M8L7m9lM3n6L9
5062c0m4P7m9L4o1j1M6L8o3O1m3N5m8n1M3J1M2m6L1l1N4K2m6K1p3J5Q8J7m0p0
5092e1J47j10K7k2L4Rl2j5jJ5K0l1N3L4m6qj5K1qkL7k3j4J9J6l5rLj2O4r2O0n
5125B8L7p2j3K2O3p4M4poK3L2o2L0l1J6p6J24k9mk3RM5j3j5M5k4l7OP2o5j2kl0
$$ plain form
5158 1 87 57 -11 -25 35 -52 46 39 -26 31 41 33 16 -34 37 70 14 -6 6 22 -22 12 12 -65 -30 8 -18 32 -57 -15 -23 6 -37
5191 -37 -52 59 41 -40 3 -62 -11 -140 -31 -11 -36 -5 -23 -28 -40 -8 47 25 -68 -8 36 -56 -3 -42 -5 10 20 -24 -50
5220 -50 -72 -41 -98 -42 -50 3 -82 -30 -40 -2 4 9 -67 -43 -30 -11 -25 -70 -11 45 -65 33 -14 47 -29 -59 18 -1 12 -56 -17
5251 -17 -43 4 -40 24 -48 -34 13 -22 -34 -16 72 20 -38 -77 21 -22 10 0 -30 26 12 -10 -53 -4 40 74 22 38 -1 -32
5281 -32 8 -38 -14 -39 20 30 33 -13 -27 54 -6 22 47 7 35 -85 -58 27 36 -11 -45 -10 51 -12 20 -5 -26 -32 -28 27 32 19
5313 19 -9 -29 -56 -54 -89 28 -44 24 -24 -47 -15 6 -61 -28 -22 -12 -38 21 -25 -62 -64 15 12 8 21 -48 27 -28 32 -59 -34 -5
5345 -5 -32 24 28 -14 -6 -90 -3 14 -17 -25 -32 15 -30 -6 -45 -6 -34 -73 -37 -29 -18 16 2 -21 12 -31 -18 -40 17 -6 20 -27 60
5378 60 83 2 5 -12 -68 12 0 -31 29 -16 -27 9 -24 -52 -10 -12 -17 -3 -28 -12 -26 -5 18 -3 -39 -7 -22 28 18 -16 85
$$ packed form
5158AQ6l0o8j4O0q7R8po5N7J0qj7n0P1L3n6k0J2J6m4L4%p7L5L8k6N0q9M2qK9m3
5191c7j5J11j8q1M3o5N1j29J09K0k5L1j8nj2L2N5k2r3O0M4r2N3l9L7J5J0m4k6
5220e0k2L1n7N6qN3q5N2j0L8ONp6K4J3J9j4m5N9N6j10R8m7O1p6l0P7j9J3o8L9
5251a7k6M7m4O4p2J4M7l5j2J8Q8n2n8l9R8m3L2j0l0N6j4k2m3M9M4L4n2J6l9l1
5281c2M0m6K4k5N9J0Lm6j4Q1o0K8K5m0K8j20K7Q5Rm7l4L5O1o3L2k5k1oMN5Nj3
5313A9k8k0k7Kl5J17p2O8m8k3L2K1o7L3OJ0k6N9m6l7kP9lmJ3o9P5n5O0r1K5K9
5345ek7N6Mm2Qq4Q7J7l1qpM7m5K4l9L9k8l9L6QJ1L4j4k3L3m3J3k2N7k3K6m7Q7
5378F0K3q1Lj7n6Q0j2l1O0m5j1L6l3k8M2knJ4k5J6j4K1K3k1l6L2j5N0j0l4J01
$$ plain form
5409 85 -19 -24 28 -9 18 26 19 -28 5 7 -27 81 -8 -9 36 18 6 63 -41 8 16 19 9 9 -2 21 -16 25 -36 27 4 -49 43
5442 43 -10 -61 -35 1 -55 46 -29 11 -12 -65 43 -32 -60 -8 -27 -34 -1 52 35 45 -10 14 39 0 10 -12 8 -53 43 -54
5472 -54 30 -35 -24 -7 43 -23 36 -45 8 -37 -54 9 38 75 74 5 -39 34 -30 5 -57 76 -63 19 -22 -45 10 38 -4 -12
5502 -12 10 -25 -10 -15 -39 -7 -2 -16 -13 -34 -6 -65 -13 3 -95 -6 14 48 -81 -9 -22 -40 27 22 -11 19 31 17 -31 -16 2 -26
5534 -26 -16 3 5 1 37 73 20 17 19 -14 0 -16 -26 -42 12 -8 -48 27 -27 40 4 -50 24 29 -32 10 -42 -27 26 -34 12 -37 -46
5567 -46 -16 12 -28 -6 -49 -69 -27 -39 4 -21 -27 16 -26 -15 0 -4 -38 -45 46 -23 -63 -49 20 -31 -26 -79 76 -39 54 -20 51
5598 51 4 12 36 38 20 19 27 -31 38 9 -57 3 -1 -47 -30 22 21 1 45 -48 -43 -29 -24 -14 -11 -85 -25 -16 -39 -62 -57 -81 -18 -55 -56 -38
5634 -38 4 -12 -24 -92 15 -40 -10 30 2 -81 -62 -28 -53 -15 -47 -55 43 34 13 21 -6 -13 -33 -2 -22 6 13 -46 42 -14 -31 78
$$ packed form
5409H5j04nN2l7K7Qpm7L3Kl4J08q9jM5j8j2N7j04M9QLj0%j1K3l7M1o1O3k3n3R2
5442D3n3n1K6L6n6J01p5M0k3n3J08p5k8N2j9pL3N3j7J0n5K4K5l9J0k2K0o1R6r7
5472e4Q4o5J1J7N0o6N9q1N3m5j7O3K9L7jo9m4P3o4L5o2J33j39Q2m1k3N5K8m2q
5502a2K2l5J5nk4L2Nj4Lk1K8n9N2J6r8Q9K0L4j29P2j3j8O7nl3L0J2j4m8J5J8k8
5534b6J0J9KmL6L6n3lKl3J4j6j0j6N4k0m0P5n4O7l6n4P4No1M2n2J5N3o0M6m9r
5567d6L0K8m0K2m3k0M2j2M3k5oM3m2J1J5ml4pR1o9m0J4O9n1Nn3J55j15R3p4P1
5598E1m7QK4Kj8jQn8O9k9o6O0mm6J7N2jk0M4r3NJ4NJ0Lp4O0Rk3k3Nk4O3l7jJ8
5634c8M2j6j2o8J07n5L0M0k8q3J9L4k5L8l2qR8rk1Qk7pk0L1k0K8Pn9Q8n6j7J09
$$ plain form
5666 78 36 18 -19 68 -19 34 -15 -56 40 15 11 69 -22 5 32 -30 40 -18 71 53 90 -16 18 -12 17 -37 16 -11 59 47
5696 47 1 30 45 19 -4 50 -15 -26 20 19 60 18 29 40 -14 29 43 58 55 7 6 54 -31 -8 35 13 -19 40 67 -45 -28
5727 -28 19 -20 41 -34 -17 -30 34 -50 -79 6 -53 1 -31 -4 -5 -35 -38 -57 37 26 -32 -24 -9 9 -49 -8 -75 17 32 -50 -7 -52
5759 -52 -6 11 -33 -88 -14 -18 21 -40 5 -47 -20 21 -34 -89 -58 -22 -30 48 20 14 -7 9 -60 3 -55 -18 2 -4 -28 15 2 16
5791 16 -19 -18 54 -26 19 11 -38 -80 -9 24 27 5 -22 27 -15 -44 26 21 -35 -41 -59 5 41 18 -28 20 -21 -34 -32 20 11 -85 -10 -26
5825 -26 16 -21 -19 -1 -17 14 -34 -17 -52 13 -16 -40 15 3 -70 -30 -9 36 5 8 -34 -69 -19 35 35 -38 -56 -21 12 14 32 24 -28
5858 -28 -29 20 -35 8 -18 20 -78 -2 -32 -24 29 -24 18 -37 2 -9 -12 -68 10 -13 3 -10 -4 -6 20 -13 -11 -34 64 1 -38 -13 37
5891 37 -27 19 -12 -51 23 -62 -11 57 -43 -28 16 27 80 -7 56 -22 32 17 -51 -40 41 26 -40 3 -5 -85 12 5 29 -26 18
$$ packed form
5666G8m2j8l7Q7q7N3m9m1R6k5mN8r1K7K7o2P0n8Q9j8L7j06L4l0K9n4N3k7P0j2
5696D7m6K9J5k6k3N4o5j1M6jM1m2J1J1n4M3J4J5lm8jM8q5K3M3k2l2N9K7j12J7
5727b8M7l9O1p5J7j3O4q4k9Q5n9N4l2K7jl0lj9R4j1n8QJ5J8n8M1o7R2J5q2M3m5
5759e2M6J7m4n5P4mL9o1M5n2K7M1n5n5L1L6qP8k8ok1J6o9O3n8L7K0ok4M3j3J4
5791A6l5JP2q0M5qm9m2P1L3Lk2k7M9m2k9P0nn6oj8O4L6k3m6M8m1j3KN2rr6P5j6
5825b6M2l7KJ8j6L1m8J7l5O5k9k4N5j2p3M0K1M5l1Lm2l5N0N4%p3j8L5L3KJ8qn2
5858b8jM9n5M3k6L8r8P6l0QN3n3M2n5L9j1ln6P8k3J6j3OkK6l3Kk3R8o3l9K5N0
5891C7o4M6l1l9P4q5N1O8j00J5M4J1N3q7O3p8N4j5o8J1Q1j5o6M3qq0R7pK4n5M4
$$ plain form
5922 18 21 -29 38 8 1 -47 32 -14 30 39 32 17 -25 -65 -21 29 0 25 -13 17 24 0 27 13 -22 9 14 21 -21 -2 -7 19 14 27 13
5957 13 -37 6 -9 92 -74 -35 -30 58 32 -15 7 54 32 -8 34 -4 7 26 40 18 45 51 104 7 26 -9 -39 2 63 -1
5987 -1 35 -6 89 -5 91 34 21 26 -24 22 36 -12 43 23 5 41 36 -31 -10 41 25 -10 12 5 -52 54 54 26 -23 -6 46 20
6019 20 22 -22 12 -16 0 28 25 -4 -65 -24 67 -11 17 -48 -7 -40 -30 -5 12 33 -6 1 -53 4 -23 -42 -2 7 -9 15 -12 41
6051 41 -13 -5 -12 17 9 -83 -50 -8 50 -4 14 -12 -18 32 -88 -57 -43 -14 -48 -34 -5 -42 -52 -6 -13 -32 -24 -80 -11 -39 -62 2 -48
6084 -48 -37 -15 -77 -86 -16 19 -23 -66 -54 16 -32 -49 16 -29 44 3 16 -34 0 -34 -69 77 -54 14 22 -53 -39 3 -12 -36
6114 -36 14 11 -45 21 -6 -1 28 -2 -30 4 -49 -52 -19 19 -23 8 -30 -54 -48 20 -106 2 18 -5 -30 23 -29 -42 16 -9 -19
6145 -19 2 -19 15 16 30 -54 -25 37 -48 4 3 19 -48 42 -6 -20 -20 31 -16 24 31 43 73 74 3 30 16 16 35 14 13 36 24 3
$$ packed form
5922A8Ln0O7l0pm8P9m6M4Rpj5m2m0M4N0k9K5l8L0Pk4K7j4l5L1NPm2J9nK6nJ3j4
5957A3n0M3j5J01j66L9NQ8k6m7K2M7k2m0M2l8J1J9J4k2K7ON3r7J9l5l0M1O1o4
5987aL6m1R5r4R6n7j3Nn0M6J4m8N5k0j8L6no7K1N1j6l5K2pn7J06%k8m9J7N2k6
6019B0Km4L4k8J6K8lk9o1M1R1p8K8o5M1l3J0K5J7K1l9Pn4N7k7j9M0Rj6K4k7N3
6051D1n4QpK9qr2L3M2N8n4J8k6oN0j20L1J4K9l4J4K9l7j0M6pj9Qn6O9k8k3O4n0
6084d8J1K2o2rP0L5m2m3J2P0m8j7O5m5P3m1J3n0L4l4l5J46j31O8Qp5J4M2j5k4
6114c6N0ln6O6k7NK9l0k8L4n3lL3L8m2L1l8k4OO8j26J08J6k3k5N3n2j3N8k5j0
6145a9K1k1L4JJ4q4K9O2q5N2jJ6o7R0m8j4%N1m7M0PJ2L0Jp1K7j4%J9k1jK3j2k1
$$ plain form
6179 3 11 11 -15 48 -4 7 1 42 61 42 4 -8 -10 -14 51 19 13 21 38 -6 -58 20 -39 -19 -18 -21 28 -12 -24 -8 1 -5 14 -5 11 22
6215 22 -62 57 -3 44 6 31 -20 -17 51 5 39 111 27 -18 38 -38 -5 36 31 -34 92 30 -35 53 29 96 59 39 -28 -1
6245 -1 45 10 28 -90 -22 53 3 -15 34 4 4 0 -21 -14 -42 -6 -32 11 47 7 11 -21 23 20 29 -31 10 0 6 21 45 -69 -1
6278 -1 15 52 -16 62 24 4 -7 0 -5 -8 -6 -61 -2 -102 -34 29 22 -18 22 -50 2 -16 -7 -61 -69 -17 -7 -14 14 -35 13 -64 -24 4
6312 4 39 -99 -78 -4 -6 -12 -2 -53 -62 54 -60 -42 -37 8 -23 9 24 -56 -17 -82 -4 -46 7 -50 -39 -13 1 -19 -60 -19 -13 -10
6344 -10 24 -19 -53 -38 13 3 46 -15 -40 0 -15 59 -10 6 -14 1 -36 -11 21 25 8 -13 -24 -4 -1 11 9 42 11 43 39 58
6376 58 39 11 -2 11 -2 -15 3 12 51 26 -10 -9 3 -12 5 -46 75 29 68 18 67 61 -15 10 50 1 -4 63 -16 24 -31 -69
6408 -69 34 49 -6 -30 2 -44 -28 -85 9 -48 53 28 15 13 6 34 -55 -1 10 -17 0 5 47 -47 -35 -30 21 19 -20 3 20 -40
$$ packed form
6179CQ%k6O3n2J1oM1J9j9l8j2kmO5l2oQJ7m4n2P8n9K0JlM9m0j2J6RoJ9j9J6J1
6215B2q4J19o0M7l8K5n1LO8m6L4P2q4m5N6p6L3M1no5J26o2o5Q8k4O7l7k0o7K7
6245aM6l5J8j18O8P5n0j8M9l0%mk1Pk8L6k6M3L6m0Ml2M4lRo0M1j0OJ5K4j14O8
6278aJ6L7o8P8l8k0j1PnlKn5N9j00O8O3pm0M0p2N2j8Rn4qN2J0pK8m9M8p7M0K8
6312DL5j38K1P4koJ0n1rJ16j14J8NM5l1L2J5q0L9o5P8m2N3n7J1K6J4k0m1M1OL
6344a0L4m3l4J5N1j0M3o1k5M0j5P4o9J6k0J5l7K5L2Mj7k1j1K0LJ2kL3l1L2mJ9
6376E8j9k8j3J3j3j3J8RL9k5l6JJ2j5J7n1J21m6L9n0M9op6K5M0m9nO7p9M0n5l8
6408f9J03J5n5k4L2m6J6n7R4n7J01k5j3kpK8q9N4J1k7J7NM2r4J2NN1kl9K3J7o0
$$ plain form
6440 -40 13 -56 -101 -26 -29 -19 -71 -49 -12 -61 -12 -33 -35 10 45 -47 -46 -40 66 1 -46 -62 -6 60 21 43 -52 24 36 17 -58 9
$$ packed form
6440d0N3o9m5P5lJ0n2K2L7m9M9k1kM5L5r2JOJ06o5m7j6N6O6l9K2r5P6J2j9p5O7
$$ [...]
8191c
##END NTUPLES=NMR FID
##END=
